lucene-dev mailing list archives

Site index · List index
Message view « Date » · « Thread »
Top « Date » · « Thread »
From Apache Jenkins Server <jenk...@builds.apache.org>
Subject [JENKINS] Lucene-Solr-Tests-4.x-Java6 - Build # 655 - Failure
Date Sun, 16 Sep 2012 22:38:51 GMT
Build: https://builds.apache.org/job/Lucene-Solr-Tests-4.x-Java6/655/

1 tests failed.
REGRESSION:  org.apache.solr.cloud.SyncSliceTest.testDistribSearch

Error Message:
No live SolrServers available to handle this request

Stack Trace:
org.apache.solr.client.solrj.SolrServerException: No live SolrServers available to handle this request
	at __randomizedtesting.SeedInfo.seed([903E17273C1EBB78:11D8993F4B41DB44]:0)
	at org.apache.solr.client.solrj.impl.LBHttpSolrServer.request(LBHttpSolrServer.java:323)
	at org.apache.solr.client.solrj.impl.CloudSolrServer.request(CloudSolrServer.java:257)
	at org.apache.solr.client.solrj.request.QueryRequest.process(QueryRequest.java:90)
	at org.apache.solr.client.solrj.SolrServer.query(SolrServer.java:324)
	at org.apache.solr.cloud.AbstractFullDistribZkTestBase.checkShardConsistency(AbstractFullDistribZkTestBase.java:909)
	at org.apache.solr.cloud.SyncSliceTest.doTest(SyncSliceTest.java:226)
	at org.apache.solr.BaseDistributedSearchTestCase.testDistribSearch(BaseDistributedSearchTestCase.java:695)
	at sun.reflect.NativeMethodAccessorImpl.invoke0(Native Method)
	at sun.reflect.NativeMethodAccessorImpl.invoke(NativeMethodAccessorImpl.java:57)
	at sun.reflect.DelegatingMethodAccessorImpl.invoke(DelegatingMethodAccessorImpl.java:43)
	at java.lang.reflect.Method.invoke(Method.java:616)
	at com.carrotsearch.randomizedtesting.RandomizedRunner.invoke(RandomizedRunner.java:1559)
	at com.carrotsearch.randomizedtesting.RandomizedRunner.access$600(RandomizedRunner.java:79)
	at com.carrotsearch.randomizedtesting.RandomizedRunner$6.evaluate(RandomizedRunner.java:737)
	at com.carrotsearch.randomizedtesting.RandomizedRunner$7.evaluate(RandomizedRunner.java:773)
	at com.carrotsearch.randomizedtesting.RandomizedRunner$8.evaluate(RandomizedRunner.java:787)
	at com.carrotsearch.randomizedtesting.rules.SystemPropertiesRestoreRule$1.evaluate(SystemPropertiesRestoreRule.java:53)
	at org.apache.lucene.util.TestRuleSetupTeardownChained$1.evaluate(TestRuleSetupTeardownChained.java:50)
	at org.apache.lucene.util.TestRuleFieldCacheSanity$1.evaluate(TestRuleFieldCacheSanity.java:51)
	at org.apache.lucene.util.AbstractBeforeAfterRule$1.evaluate(AbstractBeforeAfterRule.java:45)
	at com.carrotsearch.randomizedtesting.rules.SystemPropertiesInvariantRule$1.evaluate(SystemPropertiesInvariantRule.java:55)
	at org.apache.lucene.util.TestRuleThreadAndTestName$1.evaluate(TestRuleThreadAndTestName.java:48)
	at org.apache.lucene.util.TestRuleIgnoreAfterMaxFailures$1.evaluate(TestRuleIgnoreAfterMaxFailures.java:70)
	at org.apache.lucene.util.TestRuleMarkFailure$1.evaluate(TestRuleMarkFailure.java:48)
	at com.carrotsearch.randomizedtesting.rules.StatementAdapter.evaluate(StatementAdapter.java:36)
	at com.carrotsearch.randomizedtesting.ThreadLeakControl$StatementRunner.run(ThreadLeakControl.java:358)
	at com.carrotsearch.randomizedtesting.ThreadLeakControl.forkTimeoutingTask(ThreadLeakControl.java:782)
	at com.carrotsearch.randomizedtesting.ThreadLeakControl$3.evaluate(ThreadLeakControl.java:442)
	at com.carrotsearch.randomizedtesting.RandomizedRunner.runSingleTest(RandomizedRunner.java:746)
	at com.carrotsearch.randomizedtesting.RandomizedRunner$3.evaluate(RandomizedRunner.java:648)
	at com.carrotsearch.randomizedtesting.RandomizedRunner$4.evaluate(RandomizedRunner.java:682)
	at com.carrotsearch.randomizedtesting.RandomizedRunner$5.evaluate(RandomizedRunner.java:693)
	at com.carrotsearch.randomizedtesting.rules.StatementAdapter.evaluate(StatementAdapter.java:36)
	at com.carrotsearch.randomizedtesting.rules.SystemPropertiesRestoreRule$1.evaluate(SystemPropertiesRestoreRule.java:53)
	at org.apache.lucene.util.AbstractBeforeAfterRule$1.evaluate(AbstractBeforeAfterRule.java:45)
	at org.apache.lucene.util.TestRuleStoreClassName$1.evaluate(TestRuleStoreClassName.java:42)
	at com.carrotsearch.randomizedtesting.rules.SystemPropertiesInvariantRule$1.evaluate(SystemPropertiesInvariantRule.java:55)
	at com.carrotsearch.randomizedtesting.rules.NoShadowingOrOverridesOnMethodsRule$1.evaluate(NoShadowingOrOverridesOnMethodsRule.java:39)
	at com.carrotsearch.randomizedtesting.rules.NoShadowingOrOverridesOnMethodsRule$1.evaluate(NoShadowingOrOverridesOnMethodsRule.java:39)
	at com.carrotsearch.randomizedtesting.rules.StatementAdapter.evaluate(StatementAdapter.java:36)
	at org.apache.lucene.util.TestRuleAssertionsRequired$1.evaluate(TestRuleAssertionsRequired.java:43)
	at org.apache.lucene.util.TestRuleMarkFailure$1.evaluate(TestRuleMarkFailure.java:48)
	at org.apache.lucene.util.TestRuleIgnoreAfterMaxFailures$1.evaluate(TestRuleIgnoreAfterMaxFailures.java:70)
	at org.apache.lucene.util.TestRuleIgnoreTestSuites$1.evaluate(TestRuleIgnoreTestSuites.java:55)
	at com.carrotsearch.randomizedtesting.rules.StatementAdapter.evaluate(StatementAdapter.java:36)
	at com.carrotsearch.randomizedtesting.ThreadLeakControl$StatementRunner.run(ThreadLeakControl.java:358)
	at java.lang.Thread.run(Thread.java:679)




Build Log:
[...truncated 7068 lines...]
[junit4:junit4] Suite: org.apache.solr.cloud.SyncSliceTest
[junit4:junit4]   2> 9 T24 oas.SolrTestCaseJ4.setUp ###Starting testDistribSearch
[junit4:junit4]   2> Creating dataDir: /usr/home/hudson/hudson-slave/workspace/Lucene-Solr-Tests-4.x-Java6/solr/build/solr-core/test/J1/./solrtest-SyncSliceTest-1347834296412
[junit4:junit4]   2> 18 T24 oasc.ZkTestServer.run STARTING ZK TEST SERVER
[junit4:junit4]   2> 111 T25 oaz.Environment.logEnv Server environment:zookeeper.version=3.3.6-1366786, built on 07/29/2012 06:22 GMT
[junit4:junit4]   2> 112 T25 oaz.Environment.logEnv Server environment:host.name=lucene.zones.apache.org
[junit4:junit4]   2> 112 T25 oaz.Environment.logEnv Server environment:java.version=1.6.0_32
[junit4:junit4]   2> 112 T25 oaz.Environment.logEnv Server environment:java.vendor=Sun Microsystems Inc.
[junit4:junit4]   2> 112 T25 oaz.Environment.logEnv Server environment:java.home=/usr/local/openjdk6/jre
[junit4:junit4]   2> 112 T25 oaz.Environment.logEnv Server environment:java.class.path=/usr/home/hudson/hudson-slave/workspace/Lucene-Solr-Tests-4.x-Java6/solr/build/solr-core/classes/test:/usr/home/hudson/hudson-slave/workspace/Lucene-Solr-Tests-4.x-Java6/solr/build/solr-test-framework/classes/java:/usr/home/hudson/hudson-slave/workspace/Lucene-Solr-Tests-4.x-Java6/solr/build/solr-core/test-files:/usr/home/hudson/hudson-slave/workspace/Lucene-Solr-Tests-4.x-Java6/lucene/build/codecs/classes/java:/usr/home/hudson/hudson-slave/workspace/Lucene-Solr-Tests-4.x-Java6/lucene/build/test-framework/classes/java:/usr/home/hudson/hudson-slave/workspace/Lucene-Solr-Tests-4.x-Java6/solr/build/solr-solrj/classes/java:/usr/home/hudson/hudson-slave/workspace/Lucene-Solr-Tests-4.x-Java6/solr/build/solr-core/classes/java:/usr/home/hudson/hudson-slave/workspace/Lucene-Solr-Tests-4.x-Java6/lucene/build/analysis/common/lucene-analyzers-common-4.0-SNAPSHOT.jar:/usr/home/hudson/hudson-slave/workspace/Lucene-Solr-Tests-4.x-Java6/lucene/build/analysis/kuromoji/lucene-analyzers-kuromoji-4.0-SNAPSHOT.jar:/usr/home/hudson/hudson-slave/workspace/Lucene-Solr-Tests-4.x-Java6/lucene/build/analysis/phonetic/lucene-analyzers-phonetic-4.0-SNAPSHOT.jar:/usr/home/hudson/hudson-slave/workspace/Lucene-Solr-Tests-4.x-Java6/lucene/build/highlighter/lucene-highlighter-4.0-SNAPSHOT.jar:/usr/home/hudson/hudson-slave/workspace/Lucene-Solr-Tests-4.x-Java6/lucene/build/memory/lucene-memory-4.0-SNAPSHOT.jar:/usr/home/hudson/hudson-slave/workspace/Lucene-Solr-Tests-4.x-Java6/lucene/build/misc/lucene-misc-4.0-SNAPSHOT.jar:/usr/home/hudson/hudson-slave/workspace/Lucene-Solr-Tests-4.x-Java6/lucene/build/spatial/lucene-spatial-4.0-SNAPSHOT.jar:/usr/home/hudson/hudson-slave/workspace/Lucene-Solr-Tests-4.x-Java6/lucene/build/suggest/lucene-suggest-4.0-SNAPSHOT.jar:/usr/home/hudson/hudson-slave/workspace/Lucene-Solr-Tests-4.x-Java6/lucene/build/grouping/lucene-grouping-4.0-SNAPSHOT.jar:/usr/home/hudson/hudson-slave/workspace/Lucene-Solr-Tests-4.x-Java6/lucene/build/queries/lucene-queries-4.0-SNAPSHOT.jar:/usr/home/hudson/hudson-slave/workspace/Lucene-Solr-Tests-4.x-Java6/lucene/build/queryparser/lucene-queryparser-4.0-SNAPSHOT.jar:/usr/home/hudson/hudson-slave/workspace/Lucene-Solr-Tests-4.x-Java6/solr/core/lib/commons-cli-1.2.jar:/usr/home/hudson/hudson-slave/workspace/Lucene-Solr-Tests-4.x-Java6/solr/core/lib/commons-codec-1.6.jar:/usr/home/hudson/hudson-slave/workspace/Lucene-Solr-Tests-4.x-Java6/solr/core/lib/commons-fileupload-1.2.1.jar:/usr/home/hudson/hudson-slave/workspace/Lucene-Solr-Tests-4.x-Java6/solr/core/lib/commons-lang-2.6.jar:/usr/home/hudson/hudson-slave/workspace/Lucene-Solr-Tests-4.x-Java6/solr/core/lib/easymock-2.2.jar:/usr/home/hudson/hudson-slave/workspace/Lucene-Solr-Tests-4.x-Java6/solr/core/lib/guava-r05.jar:/usr/home/hudson/hudson-slave/workspace/Lucene-Solr-Tests-4.x-Java6/solr/core/lib/javax.servlet-api-3.0.1.jar:/usr/home/hudson/hudson-slave/workspace/Lucene-Solr-Tests-4.x-Java6/solr/core/lib/spatial4j-0.3.jar:/usr/home/hudson/hudson-slave/workspace/Lucene-Solr-Tests-4.x-Java6/solr/solrj/lib/commons-io-2.1.jar:/usr/home/hudson/hudson-slave/workspace/Lucene-Solr-Tests-4.x-Java6/solr/solrj/lib/httpclient-4.1.3.jar:/usr/home/hudson/hudson-slave/workspace/Lucene-Solr-Tests-4.x-Java6/solr/solrj/lib/httpcore-4.1.4.jar:/usr/home/hudson/hudson-slave/workspace/Lucene-Solr-Tests-4.x-Java6/solr/solrj/lib/httpmime-4.1.3.jar:/usr/home/hudson/hudson-slave/workspace/Lucene-Solr-Tests-4.x-Java6/solr/solrj/lib/jcl-over-slf4j-1.6.4.jar:/usr/home/hudson/hudson-slave/workspace/Lucene-Solr-Tests-4.x-Java6/solr/solrj/lib/log4j-over-slf4j-1.6.4.jar:/usr/home/hudson/hudson-slave/workspace/Lucene-Solr-Tests-4.x-Java6/solr/solrj/lib/slf4j-api-1.6.4.jar:/usr/home/hudson/hudson-slave/workspace/Lucene-Solr-Tests-4.x-Java6/solr/solrj/lib/slf4j-jdk14-1.6.4.jar:/usr/home/hudson/hudson-slave/workspace/Lucene-Solr-Tests-4.x-Java6/solr/solrj/lib/wstx-asl-3.2.7.jar:/usr/home/hudson/hudson-slave/workspace/Lucene-Solr-Tests-4.x-Java6/solr/solrj/lib/zookeeper-3.3.6.jar:/usr/home/hudson/hudson-slave/workspace/Lucene-Solr-Tests-4.x-Java6/solr/example/lib/jetty-continuation-8.1.2.v20120308.jar:/usr/home/hudson/hudson-slave/workspace/Lucene-Solr-Tests-4.x-Java6/solr/example/lib/jetty-deploy-8.1.2.v20120308.jar:/usr/home/hudson/hudson-slave/workspace/Lucene-Solr-Tests-4.x-Java6/solr/example/lib/jetty-http-8.1.2.v20120308.jar:/usr/home/hudson/hudson-slave/workspace/Lucene-Solr-Tests-4.x-Java6/solr/example/lib/jetty-io-8.1.2.v20120308.jar:/usr/home/hudson/hudson-slave/workspace/Lucene-Solr-Tests-4.x-Java6/solr/example/lib/jetty-jmx-8.1.2.v20120308.jar:/usr/home/hudson/hudson-slave/workspace/Lucene-Solr-Tests-4.x-Java6/solr/example/lib/jetty-security-8.1.2.v20120308.jar:/usr/home/hudson/hudson-slave/workspace/Lucene-Solr-Tests-4.x-Java6/solr/example/lib/jetty-server-8.1.2.v20120308.jar:/usr/home/hudson/hudson-slave/workspace/Lucene-Solr-Tests-4.x-Java6/solr/example/lib/jetty-servlet-8.1.2.v20120308.jar:/usr/home/hudson/hudson-slave/workspace/Lucene-Solr-Tests-4.x-Java6/solr/example/lib/jetty-util-8.1.2.v20120308.jar:/usr/home/hudson/hudson-slave/workspace/Lucene-Solr-Tests-4.x-Java6/solr/example/lib/jetty-webapp-8.1.2.v20120308.jar:/usr/home/hudson/hudson-slave/workspace/Lucene-Solr-Tests-4.x-Java6/solr/example/lib/jetty-xml-8.1.2.v20120308.jar:/usr/home/hudson/hudson-slave/workspace/Lucene-Solr-Tests-4.x-Java6/solr/example/lib/servlet-api-3.0.jar:/usr/home/hudson/hudson-slave/workspace/Lucene-Solr-Tests-4.x-Java6/solr/example/example-DIH/solr/db/lib/hsqldb-1.8.0.10.jar:/usr/home/hudson/hudson-slave/workspace/Lucene-Solr-Tests-4.x-Java6/lucene/build/core/classes/java:/usr/home/hudson/hudson-slave/workspace/Lucene-Solr-Tests-4.x-Java6/lucene/test-framework/lib/junit-4.10.jar:/usr/home/hudson/hudson-slave/workspace/Lucene-Solr-Tests-4.x-Java6/lucene/test-framework/lib/randomizedtesting-runner-2.0.0.jar:/home/hudson/hudson-slave/tools/Ant/ant-1.8.2/lib/ant-launcher.jar:/home/hudson/.ant/lib/ivy-2.2.0.jar:/home/hudson/hudson-slave/tools/Ant/ant-1.8.2/lib/ant-apache-regexp.jar:/home/hudson/hudson-slave/tools/Ant/ant-1.8.2/lib/ant-junit.jar:/home/hudson/hudson-slave/tools/Ant/ant-1.8.2/lib/ant-apache-bsf.jar:/home/hudson/hudson-slave/tools/Ant/ant-1.8.2/lib/ant-commons-net.jar:/home/hudson/hudson-slave/tools/Ant/ant-1.8.2/lib/ant-antlr.jar:/home/hudson/hudson-slave/tools/Ant/ant-1.8.2/lib/ant-apache-log4j.jar:/home/hudson/hudson-slave/tools/Ant/ant-1.8.2/lib/ant-commons-logging.jar:/home/hudson/hudson-slave/tools/Ant/ant-1.8.2/lib/ant-apache-xalan2.jar:/home/hudson/hudson-slave/tools/Ant/ant-1.8.2/lib/ant-apache-oro.jar:/home/hudson/hudson-slave/tools/Ant/ant-1.8.2/lib/ant-junit4.jar:/home/hudson/hudson-slave/tools/Ant/ant-1.8.2/lib/ant-netrexx.jar:/home/hudson/hudson-slave/tools/Ant/ant-1.8.2/lib/ant-swing.jar:/home/hudson/hudson-slave/tools/Ant/ant-1.8.2/lib/ant-javamail.jar:/home/hudson/hudson-slave/tools/Ant/ant-1.8.2/lib/ant-jsch.jar:/home/hudson/hudson-slave/tools/Ant/ant-1.8.2/lib/ant-jmf.jar:/home/hudson/hudson-slave/tools/Ant/ant-1.8.2/lib/ant.jar:/home/hudson/hudson-slave/tools/Ant/ant-1.8.2/lib/ant-apache-bcel.jar:/home/hudson/hudson-slave/tools/Ant/ant-1.8.2/lib/ant-jai.jar:/home/hudson/hudson-slave/tools/Ant/ant-1.8.2/lib/ant-testutil.jar:/home/hudson/hudson-slave/tools/Ant/ant-1.8.2/lib/ant-apache-resolver.jar:/home/hudson/hudson-slave/tools/Ant/ant-1.8.2/lib/ant-jdepend.jar:/usr/local/openjdk6/lib/tools.jar:/home/hudson/.ivy2/cache/com.carrotsearch.randomizedtesting/junit4-ant/jars/junit4-ant-2.0.0.jar
[junit4:junit4]   2> 113 T25 oaz.Environment.logEnv Server environment:java.library.path=/usr/local/openjdk6/jre/lib/amd64/server:/usr/local/openjdk6/jre/lib/amd64:/usr/local/openjdk6/jre/../lib/amd64:/usr/java/packages/lib/amd64:/lib:/usr/lib:/usr/local/lib
[junit4:junit4]   2> 113 T25 oaz.Environment.logEnv Server environment:java.io.tmpdir=.
[junit4:junit4]   2> 114 T25 oaz.Environment.logEnv Server environment:java.compiler=<NA>
[junit4:junit4]   2> 114 T25 oaz.Environment.logEnv Server environment:os.name=FreeBSD
[junit4:junit4]   2> 114 T25 oaz.Environment.logEnv Server environment:os.arch=amd64
[junit4:junit4]   2> 114 T25 oaz.Environment.logEnv Server environment:os.version=9.0-RELEASE
[junit4:junit4]   2> 114 T25 oaz.Environment.logEnv Server environment:user.name=hudson
[junit4:junit4]   2> 115 T25 oaz.Environment.logEnv Server environment:user.home=/home/hudson
[junit4:junit4]   2> 115 T25 oaz.Environment.logEnv Server environment:user.dir=/usr/home/hudson/hudson-slave/workspace/Lucene-Solr-Tests-4.x-Java6/solr/build/solr-core/test/J1
[junit4:junit4]   2> 153 T25 oazs.ZooKeeperServer.setTickTime tickTime set to 1000
[junit4:junit4]   2> 184 T25 oazs.NIOServerCnxn$Factory.<init> binding to port 0.0.0.0/0.0.0.0:0
[junit4:junit4]   2> 227 T24 oasc.ZkTestServer.run start zk server on port:49333
[junit4:junit4]   2> 256 T25 oazsp.FileTxnSnapLog.save Snapshotting: 0
[junit4:junit4]   2> 367 T24 oaz.Environment.logEnv Client environment:zookeeper.version=3.3.6-1366786, built on 07/29/2012 06:22 GMT
[junit4:junit4]   2> 367 T24 oaz.Environment.logEnv Client environment:host.name=lucene.zones.apache.org
[junit4:junit4]   2> 368 T24 oaz.Environment.logEnv Client environment:java.version=1.6.0_32
[junit4:junit4]   2> 368 T24 oaz.Environment.logEnv Client environment:java.vendor=Sun Microsystems Inc.
[junit4:junit4]   2> 368 T24 oaz.Environment.logEnv Client environment:java.home=/usr/local/openjdk6/jre
[junit4:junit4]   2> 368 T24 oaz.Environment.logEnv Client environment:java.class.path=/usr/home/hudson/hudson-slave/workspace/Lucene-Solr-Tests-4.x-Java6/solr/build/solr-core/classes/test:/usr/home/hudson/hudson-slave/workspace/Lucene-Solr-Tests-4.x-Java6/solr/build/solr-test-framework/classes/java:/usr/home/hudson/hudson-slave/workspace/Lucene-Solr-Tests-4.x-Java6/solr/build/solr-core/test-files:/usr/home/hudson/hudson-slave/workspace/Lucene-Solr-Tests-4.x-Java6/lucene/build/codecs/classes/java:/usr/home/hudson/hudson-slave/workspace/Lucene-Solr-Tests-4.x-Java6/lucene/build/test-framework/classes/java:/usr/home/hudson/hudson-slave/workspace/Lucene-Solr-Tests-4.x-Java6/solr/build/solr-solrj/classes/java:/usr/home/hudson/hudson-slave/workspace/Lucene-Solr-Tests-4.x-Java6/solr/build/solr-core/classes/java:/usr/home/hudson/hudson-slave/workspace/Lucene-Solr-Tests-4.x-Java6/lucene/build/analysis/common/lucene-analyzers-common-4.0-SNAPSHOT.jar:/usr/home/hudson/hudson-slave/workspace/Lucene-Solr-Tests-4.x-Java6/lucene/build/analysis/kuromoji/lucene-analyzers-kuromoji-4.0-SNAPSHOT.jar:/usr/home/hudson/hudson-slave/workspace/Lucene-Solr-Tests-4.x-Java6/lucene/build/analysis/phonetic/lucene-analyzers-phonetic-4.0-SNAPSHOT.jar:/usr/home/hudson/hudson-slave/workspace/Lucene-Solr-Tests-4.x-Java6/lucene/build/highlighter/lucene-highlighter-4.0-SNAPSHOT.jar:/usr/home/hudson/hudson-slave/workspace/Lucene-Solr-Tests-4.x-Java6/lucene/build/memory/lucene-memory-4.0-SNAPSHOT.jar:/usr/home/hudson/hudson-slave/workspace/Lucene-Solr-Tests-4.x-Java6/lucene/build/misc/lucene-misc-4.0-SNAPSHOT.jar:/usr/home/hudson/hudson-slave/workspace/Lucene-Solr-Tests-4.x-Java6/lucene/build/spatial/lucene-spatial-4.0-SNAPSHOT.jar:/usr/home/hudson/hudson-slave/workspace/Lucene-Solr-Tests-4.x-Java6/lucene/build/suggest/lucene-suggest-4.0-SNAPSHOT.jar:/usr/home/hudson/hudson-slave/workspace/Lucene-Solr-Tests-4.x-Java6/lucene/build/grouping/lucene-grouping-4.0-SNAPSHOT.jar:/usr/home/hudson/hudson-slave/workspace/Lucene-Solr-Tests-4.x-Java6/lucene/build/queries/lucene-queries-4.0-SNAPSHOT.jar:/usr/home/hudson/hudson-slave/workspace/Lucene-Solr-Tests-4.x-Java6/lucene/build/queryparser/lucene-queryparser-4.0-SNAPSHOT.jar:/usr/home/hudson/hudson-slave/workspace/Lucene-Solr-Tests-4.x-Java6/solr/core/lib/commons-cli-1.2.jar:/usr/home/hudson/hudson-slave/workspace/Lucene-Solr-Tests-4.x-Java6/solr/core/lib/commons-codec-1.6.jar:/usr/home/hudson/hudson-slave/workspace/Lucene-Solr-Tests-4.x-Java6/solr/core/lib/commons-fileupload-1.2.1.jar:/usr/home/hudson/hudson-slave/workspace/Lucene-Solr-Tests-4.x-Java6/solr/core/lib/commons-lang-2.6.jar:/usr/home/hudson/hudson-slave/workspace/Lucene-Solr-Tests-4.x-Java6/solr/core/lib/easymock-2.2.jar:/usr/home/hudson/hudson-slave/workspace/Lucene-Solr-Tests-4.x-Java6/solr/core/lib/guava-r05.jar:/usr/home/hudson/hudson-slave/workspace/Lucene-Solr-Tests-4.x-Java6/solr/core/lib/javax.servlet-api-3.0.1.jar:/usr/home/hudson/hudson-slave/workspace/Lucene-Solr-Tests-4.x-Java6/solr/core/lib/spatial4j-0.3.jar:/usr/home/hudson/hudson-slave/workspace/Lucene-Solr-Tests-4.x-Java6/solr/solrj/lib/commons-io-2.1.jar:/usr/home/hudson/hudson-slave/workspace/Lucene-Solr-Tests-4.x-Java6/solr/solrj/lib/httpclient-4.1.3.jar:/usr/home/hudson/hudson-slave/workspace/Lucene-Solr-Tests-4.x-Java6/solr/solrj/lib/httpcore-4.1.4.jar:/usr/home/hudson/hudson-slave/workspace/Lucene-Solr-Tests-4.x-Java6/solr/solrj/lib/httpmime-4.1.3.jar:/usr/home/hudson/hudson-slave/workspace/Lucene-Solr-Tests-4.x-Java6/solr/solrj/lib/jcl-over-slf4j-1.6.4.jar:/usr/home/hudson/hudson-slave/workspace/Lucene-Solr-Tests-4.x-Java6/solr/solrj/lib/log4j-over-slf4j-1.6.4.jar:/usr/home/hudson/hudson-slave/workspace/Lucene-Solr-Tests-4.x-Java6/solr/solrj/lib/slf4j-api-1.6.4.jar:/usr/home/hudson/hudson-slave/workspace/Lucene-Solr-Tests-4.x-Java6/solr/solrj/lib/slf4j-jdk14-1.6.4.jar:/usr/home/hudson/hudson-slave/workspace/Lucene-Solr-Tests-4.x-Java6/solr/solrj/lib/wstx-asl-3.2.7.jar:/usr/home/hudson/hudson-slave/workspace/Lucene-Solr-Tests-4.x-Java6/solr/solrj/lib/zookeeper-3.3.6.jar:/usr/home/hudson/hudson-slave/workspace/Lucene-Solr-Tests-4.x-Java6/solr/example/lib/jetty-continuation-8.1.2.v20120308.jar:/usr/home/hudson/hudson-slave/workspace/Lucene-Solr-Tests-4.x-Java6/solr/example/lib/jetty-deploy-8.1.2.v20120308.jar:/usr/home/hudson/hudson-slave/workspace/Lucene-Solr-Tests-4.x-Java6/solr/example/lib/jetty-http-8.1.2.v20120308.jar:/usr/home/hudson/hudson-slave/workspace/Lucene-Solr-Tests-4.x-Java6/solr/example/lib/jetty-io-8.1.2.v20120308.jar:/usr/home/hudson/hudson-slave/workspace/Lucene-Solr-Tests-4.x-Java6/solr/example/lib/jetty-jmx-8.1.2.v20120308.jar:/usr/home/hudson/hudson-slave/workspace/Lucene-Solr-Tests-4.x-Java6/solr/example/lib/jetty-security-8.1.2.v20120308.jar:/usr/home/hudson/hudson-slave/workspace/Lucene-Solr-Tests-4.x-Java6/solr/example/lib/jetty-server-8.1.2.v20120308.jar:/usr/home/hudson/hudson-slave/workspace/Lucene-Solr-Tests-4.x-Java6/solr/example/lib/jetty-servlet-8.1.2.v20120308.jar:/usr/home/hudson/hudson-slave/workspace/Lucene-Solr-Tests-4.x-Java6/solr/example/lib/jetty-util-8.1.2.v20120308.jar:/usr/home/hudson/hudson-slave/workspace/Lucene-Solr-Tests-4.x-Java6/solr/example/lib/jetty-webapp-8.1.2.v20120308.jar:/usr/home/hudson/hudson-slave/workspace/Lucene-Solr-Tests-4.x-Java6/solr/example/lib/jetty-xml-8.1.2.v20120308.jar:/usr/home/hudson/hudson-slave/workspace/Lucene-Solr-Tests-4.x-Java6/solr/example/lib/servlet-api-3.0.jar:/usr/home/hudson/hudson-slave/workspace/Lucene-Solr-Tests-4.x-Java6/solr/example/example-DIH/solr/db/lib/hsqldb-1.8.0.10.jar:/usr/home/hudson/hudson-slave/workspace/Lucene-Solr-Tests-4.x-Java6/lucene/build/core/classes/java:/usr/home/hudson/hudson-slave/workspace/Lucene-Solr-Tests-4.x-Java6/lucene/test-framework/lib/junit-4.10.jar:/usr/home/hudson/hudson-slave/workspace/Lucene-Solr-Tests-4.x-Java6/lucene/test-framework/lib/randomizedtesting-runner-2.0.0.jar:/home/hudson/hudson-slave/tools/Ant/ant-1.8.2/lib/ant-launcher.jar:/home/hudson/.ant/lib/ivy-2.2.0.jar:/home/hudson/hudson-slave/tools/Ant/ant-1.8.2/lib/ant-apache-regexp.jar:/home/hudson/hudson-slave/tools/Ant/ant-1.8.2/lib/ant-junit.jar:/home/hudson/hudson-slave/tools/Ant/ant-1.8.2/lib/ant-apache-bsf.jar:/home/hudson/hudson-slave/tools/Ant/ant-1.8.2/lib/ant-commons-net.jar:/home/hudson/hudson-slave/tools/Ant/ant-1.8.2/lib/ant-antlr.jar:/home/hudson/hudson-slave/tools/Ant/ant-1.8.2/lib/ant-apache-log4j.jar:/home/hudson/hudson-slave/tools/Ant/ant-1.8.2/lib/ant-commons-logging.jar:/home/hudson/hudson-slave/tools/Ant/ant-1.8.2/lib/ant-apache-xalan2.jar:/home/hudson/hudson-slave/tools/Ant/ant-1.8.2/lib/ant-apache-oro.jar:/home/hudson/hudson-slave/tools/Ant/ant-1.8.2/lib/ant-junit4.jar:/home/hudson/hudson-slave/tools/Ant/ant-1.8.2/lib/ant-netrexx.jar:/home/hudson/hudson-slave/tools/Ant/ant-1.8.2/lib/ant-swing.jar:/home/hudson/hudson-slave/tools/Ant/ant-1.8.2/lib/ant-javamail.jar:/home/hudson/hudson-slave/tools/Ant/ant-1.8.2/lib/ant-jsch.jar:/home/hudson/hudson-slave/tools/Ant/ant-1.8.2/lib/ant-jmf.jar:/home/hudson/hudson-slave/tools/Ant/ant-1.8.2/lib/ant.jar:/home/hudson/hudson-slave/tools/Ant/ant-1.8.2/lib/ant-apache-bcel.jar:/home/hudson/hudson-slave/tools/Ant/ant-1.8.2/lib/ant-jai.jar:/home/hudson/hudson-slave/tools/Ant/ant-1.8.2/lib/ant-testutil.jar:/home/hudson/hudson-slave/tools/Ant/ant-1.8.2/lib/ant-apache-resolver.jar:/home/hudson/hudson-slave/tools/Ant/ant-1.8.2/lib/ant-jdepend.jar:/usr/local/openjdk6/lib/tools.jar:/home/hudson/.ivy2/cache/com.carrotsearch.randomizedtesting/junit4-ant/jars/junit4-ant-2.0.0.jar
[junit4:junit4]   2> 369 T24 oaz.Environment.logEnv Client environment:java.library.path=/usr/local/openjdk6/jre/lib/amd64/server:/usr/local/openjdk6/jre/lib/amd64:/usr/local/openjdk6/jre/../lib/amd64:/usr/java/packages/lib/amd64:/lib:/usr/lib:/usr/local/lib
[junit4:junit4]   2> 370 T24 oaz.Environment.logEnv Client environment:java.io.tmpdir=.
[junit4:junit4]   2> 370 T24 oaz.Environment.logEnv Client environment:java.compiler=<NA>
[junit4:junit4]   2> 370 T24 oaz.Environment.logEnv Client environment:os.name=FreeBSD
[junit4:junit4]   2> 371 T24 oaz.Environment.logEnv Client environment:os.arch=amd64
[junit4:junit4]   2> 371 T24 oaz.Environment.logEnv Client environment:os.version=9.0-RELEASE
[junit4:junit4]   2> 371 T24 oaz.Environment.logEnv Client environment:user.name=hudson
[junit4:junit4]   2> 372 T24 oaz.Environment.logEnv Client environment:user.home=/home/hudson
[junit4:junit4]   2> 372 T24 oaz.Environment.logEnv Client environment:user.dir=/usr/home/hudson/hudson-slave/workspace/Lucene-Solr-Tests-4.x-Java6/solr/build/solr-core/test/J1
[junit4:junit4]   2> 379 T24 oaz.ZooKeeper.<init> Initiating client connection, connectString=127.0.0.1:49333 sessionTimeout=10000 watcher=org.apache.solr.common.cloud.ConnectionManager@1fda2b6d
[junit4:junit4]   2> 481 T30 oaz.ClientCnxn$SendThread.startConnect Opening socket connection to server /127.0.0.1:49333
[junit4:junit4]   2> 481 T24 oascc.ConnectionManager.waitForConnected Waiting for client to connect to ZooKeeper
[junit4:junit4]   2> 484 T30 oaz.ClientCnxn$SendThread.primeConnection Socket connection established to localhost/127.0.0.1:49333, initiating session
[junit4:junit4]   2> 485 T26 oazs.NIOServerCnxn$Factory.run Accepted socket connection from /140.211.11.196:58843
[junit4:junit4]   2> 500 T26 oazs.NIOServerCnxn.readConnectRequest Client attempting to establish new session at /140.211.11.196:58843
[junit4:junit4]   2> 516 T28 oazsp.FileTxnLog.append Creating new log file: log.1
[junit4:junit4]   2> 588 T28 oazs.NIOServerCnxn.finishSessionInit Established session 0x139d12f39a30000 with negotiated timeout 10000 for client /140.211.11.196:58843
[junit4:junit4]   2> 588 T30 oaz.ClientCnxn$SendThread.readConnectResult Session establishment complete on server localhost/127.0.0.1:49333, sessionid = 0x139d12f39a30000, negotiated timeout = 10000
[junit4:junit4]   2> 594 T31 oascc.ConnectionManager.process Watcher org.apache.solr.common.cloud.ConnectionManager@1fda2b6d name:ZooKeeperConnection Watcher:127.0.0.1:49333 got event WatchedEvent state:SyncConnected type:None path:null path:null type:None
[junit4:junit4]   2> 594 T24 oascc.ConnectionManager.waitForConnected Client is connected to ZooKeeper
[junit4:junit4]   2> 599 T24 oascc.SolrZkClient.makePath makePath: /solr
[junit4:junit4]   2> 700 T29 oazs.PrepRequestProcessor.pRequest Processed session termination for sessionid: 0x139d12f39a30000
[junit4:junit4]   2> 701 T31 oaz.ClientCnxn$EventThread.run EventThread shut down
[junit4:junit4]   2> 701 T24 oaz.ZooKeeper.close Session: 0x139d12f39a30000 closed
[junit4:junit4]   2> 703 T26 oazs.NIOServerCnxn.closeSock Closed socket connection for client /140.211.11.196:58843 which had sessionid 0x139d12f39a30000
[junit4:junit4]   2> 703 T24 oaz.ZooKeeper.<init> Initiating client connection, connectString=127.0.0.1:49333/solr sessionTimeout=10000 watcher=org.apache.solr.common.cloud.ConnectionManager@51274873
[junit4:junit4]   2> 704 T32 oaz.ClientCnxn$SendThread.startConnect Opening socket connection to server /127.0.0.1:49333
[junit4:junit4]   2> 704 T24 oascc.ConnectionManager.waitForConnected Waiting for client to connect to ZooKeeper
[junit4:junit4]   2> 705 T32 oaz.ClientCnxn$SendThread.primeConnection Socket connection established to localhost/127.0.0.1:49333, initiating session
[junit4:junit4]   2> 706 T26 oazs.NIOServerCnxn$Factory.run Accepted socket connection from /140.211.11.196:40551
[junit4:junit4]   2> 706 T26 oazs.NIOServerCnxn.readConnectRequest Client attempting to establish new session at /140.211.11.196:40551
[junit4:junit4]   2> 708 T28 oazs.NIOServerCnxn.finishSessionInit Established session 0x139d12f39a30001 with negotiated timeout 10000 for client /140.211.11.196:40551
[junit4:junit4]   2> 709 T32 oaz.ClientCnxn$SendThread.readConnectResult Session establishment complete on server localhost/127.0.0.1:49333, sessionid = 0x139d12f39a30001, negotiated timeout = 10000
[junit4:junit4]   2> 710 T33 oascc.ConnectionManager.process Watcher org.apache.solr.common.cloud.ConnectionManager@51274873 name:ZooKeeperConnection Watcher:127.0.0.1:49333/solr got event WatchedEvent state:SyncConnected type:None path:null path:null type:None
[junit4:junit4]   2> 710 T24 oascc.ConnectionManager.waitForConnected Client is connected to ZooKeeper
[junit4:junit4]   2> 733 T24 oascc.SolrZkClient.makePath makePath: /collections/collection1
[junit4:junit4]   2> 740 T24 oascc.SolrZkClient.makePath makePath: /collections/collection1/shards
[junit4:junit4]   2> 745 T24 oascc.SolrZkClient.makePath makePath: /collections/control_collection
[junit4:junit4]   2> 767 T24 oascc.SolrZkClient.makePath makePath: /collections/control_collection/shards
[junit4:junit4]   2> 773 T24 oasc.AbstractZkTestCase.putConfig put /usr/home/hudson/hudson-slave/workspace/Lucene-Solr-Tests-4.x-Java6/solr/build/solr-core/test-files/solr/collection1/conf/solrconfig.xml to /configs/conf1/solrconfig.xml
[junit4:junit4]   2> 811 T24 oascc.SolrZkClient.makePath makePath: /configs/conf1/solrconfig.xml
[junit4:junit4]   2> 827 T24 oasc.AbstractZkTestCase.putConfig put /usr/home/hudson/hudson-slave/workspace/Lucene-Solr-Tests-4.x-Java6/solr/build/solr-core/test-files/solr/collection1/conf/schema.xml to /configs/conf1/schema.xml
[junit4:junit4]   2> 828 T24 oascc.SolrZkClient.makePath makePath: /configs/conf1/schema.xml
[junit4:junit4]   2> 951 T24 oasc.AbstractZkTestCase.putConfig put /usr/home/hudson/hudson-slave/workspace/Lucene-Solr-Tests-4.x-Java6/solr/build/solr-core/test-files/solr/collection1/conf/solrconfig.xml to /configs/conf1/solrconfig.xml
[junit4:junit4]   2> 952 T24 oascc.SolrZkClient.makePath makePath: /configs/conf1/solrconfig.xml
[junit4:junit4]   2> 970 T24 oasc.AbstractZkTestCase.putConfig put /usr/home/hudson/hudson-slave/workspace/Lucene-Solr-Tests-4.x-Java6/solr/build/solr-core/test-files/solr/collection1/conf/stopwords.txt to /configs/conf1/stopwords.txt
[junit4:junit4]   2> 972 T24 oascc.SolrZkClient.makePath makePath: /configs/conf1/stopwords.txt
[junit4:junit4]   2> 977 T24 oasc.AbstractZkTestCase.putConfig put /usr/home/hudson/hudson-slave/workspace/Lucene-Solr-Tests-4.x-Java6/solr/build/solr-core/test-files/solr/collection1/conf/protwords.txt to /configs/conf1/protwords.txt
[junit4:junit4]   2> 978 T24 oascc.SolrZkClient.makePath makePath: /configs/conf1/protwords.txt
[junit4:junit4]   2> 986 T24 oasc.AbstractZkTestCase.putConfig put /usr/home/hudson/hudson-slave/workspace/Lucene-Solr-Tests-4.x-Java6/solr/build/solr-core/test-files/solr/collection1/conf/currency.xml to /configs/conf1/currency.xml
[junit4:junit4]   2> 987 T24 oascc.SolrZkClient.makePath makePath: /configs/conf1/currency.xml
[junit4:junit4]   2> 992 T24 oasc.AbstractZkTestCase.putConfig put /usr/home/hudson/hudson-slave/workspace/Lucene-Solr-Tests-4.x-Java6/solr/build/solr-core/test-files/solr/collection1/conf/open-exchange-rates.json to /configs/conf1/open-exchange-rates.json
[junit4:junit4]   2> 993 T24 oascc.SolrZkClient.makePath makePath: /configs/conf1/open-exchange-rates.json
[junit4:junit4]   2> 999 T24 oasc.AbstractZkTestCase.putConfig put /usr/home/hudson/hudson-slave/workspace/Lucene-Solr-Tests-4.x-Java6/solr/build/solr-core/test-files/solr/collection1/conf/mapping-ISOLatin1Accent.txt to /configs/conf1/mapping-ISOLatin1Accent.txt
[junit4:junit4]   2> 1000 T24 oascc.SolrZkClient.makePath makePath: /configs/conf1/mapping-ISOLatin1Accent.txt
[junit4:junit4]   2> 1005 T24 oasc.AbstractZkTestCase.putConfig put /usr/home/hudson/hudson-slave/workspace/Lucene-Solr-Tests-4.x-Java6/solr/build/solr-core/test-files/solr/collection1/conf/old_synonyms.txt to /configs/conf1/old_synonyms.txt
[junit4:junit4]   2> 1006 T24 oascc.SolrZkClient.makePath makePath: /configs/conf1/old_synonyms.txt
[junit4:junit4]   2> 1011 T24 oasc.AbstractZkTestCase.putConfig put /usr/home/hudson/hudson-slave/workspace/Lucene-Solr-Tests-4.x-Java6/solr/build/solr-core/test-files/solr/collection1/conf/synonyms.txt to /configs/conf1/synonyms.txt
[junit4:junit4]   2> 1013 T24 oascc.SolrZkClient.makePath makePath: /configs/conf1/synonyms.txt
[junit4:junit4]   2> 1017 T29 oazs.PrepRequestProcessor.pRequest Processed session termination for sessionid: 0x139d12f39a30001
[junit4:junit4]   2> 1019 T33 oaz.ClientCnxn$EventThread.run EventThread shut down
[junit4:junit4]   2> 1019 T24 oaz.ZooKeeper.close Session: 0x139d12f39a30001 closed
[junit4:junit4]   2> 1019 T26 oazs.NIOServerCnxn.closeSock Closed socket connection for client /140.211.11.196:40551 which had sessionid 0x139d12f39a30001
[junit4:junit4]   2> 1586 T24 oejs.Server.doStart jetty-8.1.2.v20120308
[junit4:junit4]   2> 1857 T24 oejs.AbstractConnector.doStart Started SocketConnector@0.0.0.0:38069
[junit4:junit4]   2> 1884 T24 oasc.SolrResourceLoader.locateSolrHome JNDI not configured for solr (NoInitialContextEx)
[junit4:junit4]   2> 1885 T24 oasc.SolrResourceLoader.locateSolrHome using system property solr.solr.home: /usr/home/hudson/hudson-slave/workspace/Lucene-Solr-Tests-4.x-Java6/solr/build/solr-core/test-files/solr
[junit4:junit4]   2> 1886 T24 oasc.SolrResourceLoader.<init> new SolrResourceLoader for deduced Solr Home: '/usr/home/hudson/hudson-slave/workspace/Lucene-Solr-Tests-4.x-Java6/solr/build/solr-core/test-files/solr/'
[junit4:junit4]   2> 1924 T24 oass.SolrDispatchFilter.init SolrDispatchFilter.init()
[junit4:junit4]   2> 1925 T24 oasc.SolrResourceLoader.locateSolrHome JNDI not configured for solr (NoInitialContextEx)
[junit4:junit4]   2> 1926 T24 oasc.SolrResourceLoader.locateSolrHome using system property solr.solr.home: /usr/home/hudson/hudson-slave/workspace/Lucene-Solr-Tests-4.x-Java6/solr/build/solr-core/test-files/solr
[junit4:junit4]   2> 1927 T24 oasc.CoreContainer$Initializer.initialize looking for solr.xml: /usr/home/hudson/hudson-slave/workspace/Lucene-Solr-Tests-4.x-Java6/solr/build/solr-core/test-files/solr/solr.xml
[junit4:junit4]   2> 1928 T24 oasc.CoreContainer.<init> New CoreContainer 967831570
[junit4:junit4]   2> 1929 T24 oasc.CoreContainer.load Loading CoreContainer using Solr Home: '/usr/home/hudson/hudson-slave/workspace/Lucene-Solr-Tests-4.x-Java6/solr/build/solr-core/test-files/solr/'
[junit4:junit4]   2> 1931 T24 oasc.SolrResourceLoader.<init> new SolrResourceLoader for directory: '/usr/home/hudson/hudson-slave/workspace/Lucene-Solr-Tests-4.x-Java6/solr/build/solr-core/test-files/solr/'
[junit4:junit4]   2> 1971 T24 oasc.CoreContainer.load Registering Log Listener
[junit4:junit4]   2> 1990 T24 oasc.CoreContainer.initZooKeeper Zookeeper client=127.0.0.1:49333/solr
[junit4:junit4]   2> 2015 T24 oaz.ZooKeeper.<init> Initiating client connection, connectString=127.0.0.1:49333/solr sessionTimeout=5000 watcher=org.apache.solr.common.cloud.ConnectionManager@5147164d
[junit4:junit4]   2> 2017 T44 oaz.ClientCnxn$SendThread.startConnect Opening socket connection to server /127.0.0.1:49333
[junit4:junit4]   2> 2017 T24 oascc.ConnectionManager.waitForConnected Waiting for client to connect to ZooKeeper
[junit4:junit4]   2> 2019 T44 oaz.ClientCnxn$SendThread.primeConnection Socket connection established to localhost/127.0.0.1:49333, initiating session
[junit4:junit4]   2> 2019 T26 oazs.NIOServerCnxn$Factory.run Accepted socket connection from /140.211.11.196:22713
[junit4:junit4]   2> 2020 T26 oazs.NIOServerCnxn.readConnectRequest Client attempting to establish new session at /140.211.11.196:22713
[junit4:junit4]   2> 2023 T28 oazs.NIOServerCnxn.finishSessionInit Established session 0x139d12f39a30002 with negotiated timeout 5000 for client /140.211.11.196:22713
[junit4:junit4]   2> 2023 T44 oaz.ClientCnxn$SendThread.readConnectResult Session establishment complete on server localhost/127.0.0.1:49333, sessionid = 0x139d12f39a30002, negotiated timeout = 5000
[junit4:junit4]   2> 2024 T45 oascc.ConnectionManager.process Watcher org.apache.solr.common.cloud.ConnectionManager@5147164d name:ZooKeeperConnection Watcher:127.0.0.1:49333/solr got event WatchedEvent state:SyncConnected type:None path:null path:null type:None
[junit4:junit4]   2> 2024 T24 oascc.ConnectionManager.waitForConnected Client is connected to ZooKeeper
[junit4:junit4]   2> 2046 T29 oazs.PrepRequestProcessor.pRequest Got user-level KeeperException when processing sessionid:0x139d12f39a30002 type:create cxid:0x2 zxid:0xfffffffffffffffe txntype:unknown reqpath:n/a Error Path:/solr/overseer Error:KeeperErrorCode = NodeExists for /solr/overseer
[junit4:junit4]   2> 2054 T24 oascc.SolrZkClient.makePath makePath: /live_nodes
[junit4:junit4]   2> 2057 T24 oasc.ZkController.createEphemeralLiveNode Register node as live in ZooKeeper:/live_nodes/127.0.0.1:38069_solr
[junit4:junit4]   2> 2061 T29 oazs.PrepRequestProcessor.pRequest Got user-level KeeperException when processing sessionid:0x139d12f39a30002 type:delete cxid:0x7 zxid:0xfffffffffffffffe txntype:unknown reqpath:n/a Error Path:/solr/live_nodes/127.0.0.1:38069_solr Error:KeeperErrorCode = NoNode for /solr/live_nodes/127.0.0.1:38069_solr
[junit4:junit4]   2> 2063 T24 oascc.SolrZkClient.makePath makePath: /live_nodes/127.0.0.1:38069_solr
[junit4:junit4]   2> 2067 T24 oashc.HttpShardHandlerFactory.getParameter Setting socketTimeout to: 0
[junit4:junit4]   2> 2068 T24 oashc.HttpShardHandlerFactory.getParameter Setting urlScheme to: http://
[junit4:junit4]   2> 2068 T24 oashc.HttpShardHandlerFactory.getParameter Setting connTimeout to: 0
[junit4:junit4]   2> 2069 T24 oashc.HttpShardHandlerFactory.getParameter Setting maxConnectionsPerHost to: 20
[junit4:junit4]   2> 2069 T24 oashc.HttpShardHandlerFactory.getParameter Setting corePoolSize to: 0
[junit4:junit4]   2> 2069 T24 oashc.HttpShardHandlerFactory.getParameter Setting maximumPoolSize to: 2147483647
[junit4:junit4]   2> 2070 T24 oashc.HttpShardHandlerFactory.getParameter Setting maxThreadIdleTime to: 5
[junit4:junit4]   2> 2070 T24 oashc.HttpShardHandlerFactory.getParameter Setting sizeOfQueue to: -1
[junit4:junit4]   2> 2070 T24 oashc.HttpShardHandlerFactory.getParameter Setting fairnessPolicy to: false
[junit4:junit4]   2> 2071 T24 oascsi.HttpClientUtil.createClient Creating new http client, config:maxConnectionsPerHost=20&maxConnections=10000&socketTimeout=0&connTimeout=0&retry=false
[junit4:junit4]   2> 2082 T24 oascc.SolrZkClient.makePath makePath: /overseer_elect/election
[junit4:junit4]   2> 2107 T29 oazs.PrepRequestProcessor.pRequest Got user-level KeeperException when processing sessionid:0x139d12f39a30002 type:delete cxid:0x15 zxid:0xfffffffffffffffe txntype:unknown reqpath:n/a Error Path:/solr/overseer_elect/leader Error:KeeperErrorCode = NoNode for /solr/overseer_elect/leader
[junit4:junit4]   2> 2108 T24 oascc.SolrZkClient.makePath makePath: /overseer_elect/leader
[junit4:junit4]   2> 2128 T24 oasc.Overseer.start Overseer (id=88331668471087106-127.0.0.1:38069_solr-n_0000000000) starting
[junit4:junit4]   2> 2129 T29 oazs.PrepRequestProcessor.pRequest Got user-level KeeperException when processing sessionid:0x139d12f39a30002 type:create cxid:0x1a zxid:0xfffffffffffffffe txntype:unknown reqpath:n/a Error Path:/solr/overseer Error:KeeperErrorCode = NodeExists for /solr/overseer
[junit4:junit4]   2> 2140 T29 oazs.PrepRequestProcessor.pRequest Got user-level KeeperException when processing sessionid:0x139d12f39a30002 type:create cxid:0x1b zxid:0xfffffffffffffffe txntype:unknown reqpath:n/a Error Path:/solr/overseer Error:KeeperErrorCode = NodeExists for /solr/overseer
[junit4:junit4]   2> 2142 T29 oazs.PrepRequestProcessor.pRequest Got user-level KeeperException when processing sessionid:0x139d12f39a30002 type:create cxid:0x1c zxid:0xfffffffffffffffe txntype:unknown reqpath:n/a Error Path:/solr/overseer Error:KeeperErrorCode = NodeExists for /solr/overseer
[junit4:junit4]   2> 2147 T29 oazs.PrepRequestProcessor.pRequest Got user-level KeeperException when processing sessionid:0x139d12f39a30002 type:create cxid:0x1d zxid:0xfffffffffffffffe txntype:unknown reqpath:n/a Error Path:/solr/overseer Error:KeeperErrorCode = NodeExists for /solr/overseer
[junit4:junit4]   2> 2148 T47 oasc.OverseerCollectionProcessor.run Process current queue of collection creations
[junit4:junit4]   2> 2149 T24 oascc.SolrZkClient.makePath makePath: /clusterstate.json
[junit4:junit4]   2> 2157 T24 oascc.ZkStateReader.createClusterStateWatchersAndUpdate Updating cluster state from ZooKeeper... 
[junit4:junit4]   2> 2189 T46 oasc.Overseer$ClusterStateUpdater.run Starting to work on the main queue
[junit4:junit4]   2> 2223 T24 oasc.CoreContainer.create Creating SolrCore 'collection1' using instanceDir: /usr/home/hudson/hudson-slave/workspace/Lucene-Solr-Tests-4.x-Java6/solr/build/solr-core/test-files/solr/collection1
[junit4:junit4]   2> 2223 T24 oasc.ZkController.createCollectionZkNode Check for collection zkNode:control_collection
[junit4:junit4]   2> 2225 T24 oasc.ZkController.createCollectionZkNode Collection zkNode exists
[junit4:junit4]   2> 2225 T24 oasc.ZkController.readConfigName Load collection config from:/collections/control_collection
[junit4:junit4]   2> 2227 T24 oasc.SolrResourceLoader.<init> new SolrResourceLoader for directory: '/usr/home/hudson/hudson-slave/workspace/Lucene-Solr-Tests-4.x-Java6/solr/build/solr-core/test-files/solr/collection1/'
[junit4:junit4]   2> 2228 T24 oasc.SolrResourceLoader.replaceClassLoader Adding 'file:/usr/home/hudson/hudson-slave/workspace/Lucene-Solr-Tests-4.x-Java6/solr/build/solr-core/test-files/solr/collection1/lib/README' to classloader
[junit4:junit4]   2> 2229 T24 oasc.SolrResourceLoader.replaceClassLoader Adding 'file:/usr/home/hudson/hudson-slave/workspace/Lucene-Solr-Tests-4.x-Java6/solr/build/solr-core/test-files/solr/collection1/lib/classes/' to classloader
[junit4:junit4]   2> 2300 T24 oasc.SolrConfig.<init> Using Lucene MatchVersion: LUCENE_40
[junit4:junit4]   2> 2368 T24 oasc.SolrConfig.<init> Loaded SolrConfig: solrconfig.xml
[junit4:junit4]   2> 2469 T24 oass.IndexSchema.readSchema Reading Solr Schema
[junit4:junit4]   2> 2485 T24 oass.IndexSchema.readSchema Schema name=test
[junit4:junit4]   2> 3178 T24 oass.OpenExchangeRatesOrgProvider.init Initialized with rates=open-exchange-rates.json, refreshInterval=1440.
[junit4:junit4]   2> 3196 T24 oass.IndexSchema.readSchema default search field in schema is text
[junit4:junit4]   2> 3200 T24 oass.IndexSchema.readSchema unique key field: id
[junit4:junit4]   2> 3233 T24 oass.FileExchangeRateProvider.reload Reloading exchange rates from file currency.xml
[junit4:junit4]   2> 3244 T24 oass.FileExchangeRateProvider.reload Reloading exchange rates from file currency.xml
[junit4:junit4]   2> 3254 T24 oass.OpenExchangeRatesOrgProvider.reload Reloading exchange rates from open-exchange-rates.json
[junit4:junit4]   2> 3259 T24 oass.OpenExchangeRatesOrgProvider.reload Reloading exchange rates from open-exchange-rates.json
[junit4:junit4]   2> 3264 T24 oasc.SolrCore.<init> [collection1] Opening new SolrCore at /usr/home/hudson/hudson-slave/workspace/Lucene-Solr-Tests-4.x-Java6/solr/build/solr-core/test-files/solr/collection1/, dataDir=./org.apache.solr.cloud.SyncSliceTest-1347834296411/control/data/
[junit4:junit4]   2> 3273 T24 oasc.JmxMonitoredMap.<init> JMX monitoring is enabled. Adding Solr mbeans to JMX Server: com.sun.jmx.mbeanserver.JmxMBeanServer@5c09624
[junit4:junit4]   2> 3330 T24 oasc.SolrCore.getNewIndexDir WARNING New index directory detected: old=null new=./org.apache.solr.cloud.SyncSliceTest-1347834296411/control/data/index/
[junit4:junit4]   2> 3332 T24 oasc.SolrCore.initIndex WARNING [collection1] Solr index directory './org.apache.solr.cloud.SyncSliceTest-1347834296411/control/data/index' doesn't exist. Creating new index...
[junit4:junit4]   2> 3334 T24 oasc.CachingDirectoryFactory.get return new directory for /usr/home/hudson/hudson-slave/workspace/Lucene-Solr-Tests-4.x-Java6/solr/build/solr-core/test/J1/./org.apache.solr.cloud.SyncSliceTest-1347834296411/control/data/index forceNew:false
[junit4:junit4]   2> 3385 T24 oasc.SolrDeletionPolicy.onCommit SolrDeletionPolicy.onCommit: commits:num=1
[junit4:junit4]   2> 		commit{dir=NRTCachingDirectory(org.apache.lucene.store.NIOFSDirectory@/usr/home/hudson/hudson-slave/workspace/Lucene-Solr-Tests-4.x-Java6/solr/build/solr-core/test/J1/org.apache.solr.cloud.SyncSliceTest-1347834296411/control/data/index lockFactory=org.apache.lucene.store.NativeFSLockFactory@1c49094; maxCacheMB=48.0 maxMergeSizeMB=4.0),segFN=segments_1,generation=1,filenames=[segments_1]
[junit4:junit4]   2> 3385 T24 oasc.SolrDeletionPolicy.updateCommits newest commit = 1
[junit4:junit4]   2> 3387 T24 oasc.SolrCore.initWriters created xml: solr.XMLResponseWriter
[junit4:junit4]   2> 3390 T24 oasup.UpdateRequestProcessorChain.init inserting DistributedUpdateProcessorFactory into updateRequestProcessorChain "dedupe"
[junit4:junit4]   2> 3390 T24 oasup.UpdateRequestProcessorChain.init inserting DistributedUpdateProcessorFactory into updateRequestProcessorChain "dedupe-allfields"
[junit4:junit4]   2> 3391 T24 oasup.UpdateRequestProcessorChain.init inserting DistributedUpdateProcessorFactory into updateRequestProcessorChain "stored_sig"
[junit4:junit4]   2> 3392 T24 oasup.UpdateRequestProcessorChain.init inserting DistributedUpdateProcessorFactory into updateRequestProcessorChain "uniq-fields"
[junit4:junit4]   2> 3393 T24 oasup.UpdateRequestProcessorChain.init inserting DistributedUpdateProcessorFactory into updateRequestProcessorChain "distrib-dup-test-chain-implicit"
[junit4:junit4]   2> 3393 T24 oasc.RequestHandlers.initHandlersFromConfig adding lazy requestHandler: solr.ReplicationHandler
[junit4:junit4]   2> 3394 T24 oasc.RequestHandlers.initHandlersFromConfig created /replication: solr.ReplicationHandler
[junit4:junit4]   2> 3395 T24 oasc.RequestHandlers.initHandlersFromConfig created standard: solr.StandardRequestHandler
[junit4:junit4]   2> 3396 T24 oasc.RequestHandlers.initHandlersFromConfig created /get: solr.RealTimeGetHandler
[junit4:junit4]   2> 3397 T24 oasc.RequestHandlers.initHandlersFromConfig created dismax: solr.SearchHandler
[junit4:junit4]   2> 3398 T24 oasc.RequestHandlers.initHandlersFromConfig created mock: org.apache.solr.core.MockQuerySenderListenerReqHandler
[junit4:junit4]   2> 3399 T24 oasc.RequestHandlers.initHandlersFromConfig created /admin/: org.apache.solr.handler.admin.AdminHandlers
[junit4:junit4]   2> 3400 T24 oasc.RequestHandlers.initHandlersFromConfig created defaults: solr.StandardRequestHandler
[junit4:junit4]   2> 3400 T24 oasc.RequestHandlers.initHandlersFromConfig adding lazy requestHandler: solr.StandardRequestHandler
[junit4:junit4]   2> 3401 T24 oasc.RequestHandlers.initHandlersFromConfig created lazy: solr.StandardRequestHandler
[junit4:junit4]   2> 3402 T24 oasc.RequestHandlers.initHandlersFromConfig created /update: solr.UpdateRequestHandler
[junit4:junit4]   2> 3403 T24 oasc.RequestHandlers.initHandlersFromConfig created /terms: org.apache.solr.handler.component.SearchHandler
[junit4:junit4]   2> 3403 T24 oasc.RequestHandlers.initHandlersFromConfig created spellCheckCompRH: org.apache.solr.handler.component.SearchHandler
[junit4:junit4]   2> 3404 T24 oasc.RequestHandlers.initHandlersFromConfig created spellCheckCompRH_Direct: org.apache.solr.handler.component.SearchHandler
[junit4:junit4]   2> 3405 T24 oasc.RequestHandlers.initHandlersFromConfig created spellCheckWithWordbreak: org.apache.solr.handler.component.SearchHandler
[junit4:junit4]   2> 3406 T24 oasc.RequestHandlers.initHandlersFromConfig created spellCheckWithWordbreak_Direct: org.apache.solr.handler.component.SearchHandler
[junit4:junit4]   2> 3407 T24 oasc.RequestHandlers.initHandlersFromConfig created spellCheckCompRH1: org.apache.solr.handler.component.SearchHandler
[junit4:junit4]   2> 3408 T24 oasc.RequestHandlers.initHandlersFromConfig created tvrh: org.apache.solr.handler.component.SearchHandler
[junit4:junit4]   2> 3409 T24 oasc.RequestHandlers.initHandlersFromConfig created /mlt: solr.MoreLikeThisHandler
[junit4:junit4]   2> 3410 T24 oasc.RequestHandlers.initHandlersFromConfig created /debug/dump: solr.DumpRequestHandler
[junit4:junit4]   2> 3416 T24 oashl.XMLLoader.init xsltCacheLifetimeSeconds=60
[junit4:junit4]   2> 3422 T24 oasc.SolrCore.initDeprecatedSupport WARNING solrconfig.xml uses deprecated <admin/gettableFiles>, Please update your config to use the ShowFileRequestHandler.
[junit4:junit4]   2> 3424 T24 oasc.SolrCore.initDeprecatedSupport WARNING adding ShowFileRequestHandler with hidden files: [SCHEMA.XML, OLD_SYNONYMS.TXT, STOPWORDS.TXT, PROTWORDS.TXT, OPEN-EXCHANGE-RATES.JSON, SYNONYMS.TXT, CURRENCY.XML, MAPPING-ISOLATIN1ACCENT.TXT]
[junit4:junit4]   2> 3430 T24 oass.SolrIndexSearcher.<init> Opening Searcher@6810a098 main
[junit4:junit4]   2> 3465 T24 oasu.CommitTracker.<init> Hard AutoCommit: disabled
[junit4:junit4]   2> 3466 T24 oasu.CommitTracker.<init> Soft AutoCommit: disabled
[junit4:junit4]   2> 3467 T24 oashc.SpellCheckComponent.inform Initializing spell checkers
[junit4:junit4]   2> 3477 T24 oass.DirectSolrSpellChecker.init init: {name=direct,classname=DirectSolrSpellChecker,field=lowerfilt,minQueryLength=3}
[junit4:junit4]   2> 3540 T48 oasc.SolrCore.registerSearcher [collection1] Registered new searcher Searcher@6810a098 main{StandardDirectoryReader(segments_1:1)}
[junit4:junit4]   2> 3550 T29 oazs.PrepRequestProcessor.pRequest Got user-level KeeperException when processing sessionid:0x139d12f39a30002 type:create cxid:0x56 zxid:0xfffffffffffffffe txntype:unknown reqpath:n/a Error Path:/solr/overseer/queue Error:KeeperErrorCode = NoNode for /solr/overseer/queue
[junit4:junit4]   2> 3561 T24 oasc.CoreContainer.register registering core: collection1
[junit4:junit4]   2> 3562 T24 oasc.ZkController.register Register shard - core:collection1 address:http://127.0.0.1:38069/solr shardId:control_shard
[junit4:junit4]   2> 3586 T24 oascsi.HttpClientUtil.createClient Creating new http client, config:maxConnections=10000&maxConnectionsPerHost=20&connTimeout=30000&socketTimeout=30000&retry=false
[junit4:junit4]   2> 3603 T24 oascc.SolrZkClient.makePath makePath: /collections/control_collection/leader_elect/control_shard/election
[junit4:junit4]   2> 3619 T29 oazs.PrepRequestProcessor.pRequest Got user-level KeeperException when processing sessionid:0x139d12f39a30002 type:delete cxid:0x65 zxid:0xfffffffffffffffe txntype:unknown reqpath:n/a Error Path:/solr/collections/control_collection/leaders Error:KeeperErrorCode = NoNode for /solr/collections/control_collection/leaders
[junit4:junit4]   2> 3621 T24 oasc.ShardLeaderElectionContext.runLeaderProcess Running the leader process.
[junit4:junit4]   2> 3622 T29 oazs.PrepRequestProcessor.pRequest Got user-level KeeperException when processing sessionid:0x139d12f39a30002 type:create cxid:0x66 zxid:0xfffffffffffffffe txntype:unknown reqpath:n/a Error Path:/solr/overseer Error:KeeperErrorCode = NodeExists for /solr/overseer
[junit4:junit4]   2> 3704 T46 oascc.ZkStateReader.updateClusterState Updating cloud state from ZooKeeper... 
[junit4:junit4]   2> 3721 T29 oazs.PrepRequestProcessor.pRequest Got user-level KeeperException when processing sessionid:0x139d12f39a30002 type:create cxid:0x6d zxid:0xfffffffffffffffe txntype:unknown reqpath:n/a Error Path:/solr/overseer/queue-work Error:KeeperErrorCode = NoNode for /solr/overseer/queue-work
[junit4:junit4]   2> 3761 T45 oascc.ZkStateReader$2.process A cluster state change has occurred - updating...
[junit4:junit4]   2> 4132 T24 oasc.ShardLeaderElectionContext.waitForReplicasToComeUp Enough replicas found to continue.
[junit4:junit4]   2> 4133 T24 oasc.ShardLeaderElectionContext.runLeaderProcess I may be the new leader - try and sync
[junit4:junit4]   2> 4133 T24 oasc.SyncStrategy.sync Sync replicas to http://127.0.0.1:38069/solr/collection1/
[junit4:junit4]   2> 4134 T24 oasc.SyncStrategy.syncReplicas Sync Success - now sync replicas to me
[junit4:junit4]   2> 4134 T24 oasc.SyncStrategy.syncToMe http://127.0.0.1:38069/solr/collection1/ has no replicas
[junit4:junit4]   2> 4135 T24 oasc.ShardLeaderElectionContext.runLeaderProcess I am the new leader: http://127.0.0.1:38069/solr/collection1/
[junit4:junit4]   2> 4136 T24 oascc.SolrZkClient.makePath makePath: /collections/control_collection/leaders/control_shard
[junit4:junit4]   2> 4145 T29 oazs.PrepRequestProcessor.pRequest Got user-level KeeperException when processing sessionid:0x139d12f39a30002 type:create cxid:0x8b zxid:0xfffffffffffffffe txntype:unknown reqpath:n/a Error Path:/solr/overseer Error:KeeperErrorCode = NodeExists for /solr/overseer
[junit4:junit4]   2> 4269 T46 oascc.ZkStateReader.updateClusterState Updating cloud state from ZooKeeper... 
[junit4:junit4]   2> 4285 T45 oascc.ZkStateReader$2.process A cluster state change has occurred - updating...
[junit4:junit4]   2> 4309 T24 oasc.ZkController.register We are http://127.0.0.1:38069/solr/collection1/ and leader is http://127.0.0.1:38069/solr/collection1/
[junit4:junit4]   2> 4312 T24 oasc.ZkController.register No LogReplay needed for core=collection1 baseURL=http://127.0.0.1:38069/solr
[junit4:junit4]   2> 4313 T24 oasc.ZkController.checkRecovery I am the leader, no recovery necessary
[junit4:junit4]   2> 4316 T24 oascc.ZkStateReader.updateClusterState Updating cloud state from ZooKeeper... 
[junit4:junit4]   2> 4317 T24 oass.SolrDispatchFilter.init user.dir=/usr/home/hudson/hudson-slave/workspace/Lucene-Solr-Tests-4.x-Java6/solr/build/solr-core/test/J1
[junit4:junit4]   2> 4318 T24 oass.SolrDispatchFilter.init SolrDispatchFilter.init() done
[junit4:junit4]   2> 4367 T24 oascsi.HttpClientUtil.createClient Creating new http client, config:maxConnections=128&maxConnectionsPerHost=32&followRedirects=false
[junit4:junit4]   2> 4490 T24 oejs.Server.doStart jetty-8.1.2.v20120308
[junit4:junit4]   2> 4492 T24 oejs.AbstractConnector.doStart Started SocketConnector@0.0.0.0:32069
[junit4:junit4]   2> 4493 T24 oasc.SolrResourceLoader.locateSolrHome JNDI not configured for solr (NoInitialContextEx)
[junit4:junit4]   2> 4493 T24 oasc.SolrResourceLoader.locateSolrHome using system property solr.solr.home: /usr/home/hudson/hudson-slave/workspace/Lucene-Solr-Tests-4.x-Java6/solr/build/solr-core/test/J1/./solrtest-jetty1-1347834300784
[junit4:junit4]   2> 4494 T24 oasc.SolrResourceLoader.<init> new SolrResourceLoader for deduced Solr Home: '/usr/home/hudson/hudson-slave/workspace/Lucene-Solr-Tests-4.x-Java6/solr/build/solr-core/test/J1/./solrtest-jetty1-1347834300784/'
[junit4:junit4]   2> 4520 T24 oass.SolrDispatchFilter.init SolrDispatchFilter.init()
[junit4:junit4]   2> 4521 T24 oasc.SolrResourceLoader.locateSolrHome JNDI not configured for solr (NoInitialContextEx)
[junit4:junit4]   2> 4521 T24 oasc.SolrResourceLoader.locateSolrHome using system property solr.solr.home: /usr/home/hudson/hudson-slave/workspace/Lucene-Solr-Tests-4.x-Java6/solr/build/solr-core/test/J1/./solrtest-jetty1-1347834300784
[junit4:junit4]   2> 4522 T24 oasc.CoreContainer$Initializer.initialize looking for solr.xml: /usr/home/hudson/hudson-slave/workspace/Lucene-Solr-Tests-4.x-Java6/solr/build/solr-core/test/J1/./solrtest-jetty1-1347834300784/solr.xml
[junit4:junit4]   2> 4522 T24 oasc.CoreContainer.<init> New CoreContainer 1288836437
[junit4:junit4]   2> 4523 T24 oasc.CoreContainer.load Loading CoreContainer using Solr Home: '/usr/home/hudson/hudson-slave/workspace/Lucene-Solr-Tests-4.x-Java6/solr/build/solr-core/test/J1/./solrtest-jetty1-1347834300784/'
[junit4:junit4]   2> 4523 T24 oasc.SolrResourceLoader.<init> new SolrResourceLoader for directory: '/usr/home/hudson/hudson-slave/workspace/Lucene-Solr-Tests-4.x-Java6/solr/build/solr-core/test/J1/./solrtest-jetty1-1347834300784/'
[junit4:junit4]   2> 4542 T24 oasc.CoreContainer.load Registering Log Listener
[junit4:junit4]   2> 4554 T24 oasc.CoreContainer.initZooKeeper Zookeeper client=127.0.0.1:49333/solr
[junit4:junit4]   2> 4555 T24 oaz.ZooKeeper.<init> Initiating client connection, connectString=127.0.0.1:49333/solr sessionTimeout=5000 watcher=org.apache.solr.common.cloud.ConnectionManager@19c42c4b
[junit4:junit4]   2> 4556 T58 oaz.ClientCnxn$SendThread.startConnect Opening socket connection to server /127.0.0.1:49333
[junit4:junit4]   2> 4556 T24 oascc.ConnectionManager.waitForConnected Waiting for client to connect to ZooKeeper
[junit4:junit4]   2> 4558 T58 oaz.ClientCnxn$SendThread.primeConnection Socket connection established to localhost/127.0.0.1:49333, initiating session
[junit4:junit4]   2> 4558 T26 oazs.NIOServerCnxn$Factory.run Accepted socket connection from /140.211.11.196:31501
[junit4:junit4]   2> 4559 T26 oazs.NIOServerCnxn.readConnectRequest Client attempting to establish new session at /140.211.11.196:31501
[junit4:junit4]   2> 4565 T28 oazs.NIOServerCnxn.finishSessionInit Established session 0x139d12f39a30003 with negotiated timeout 5000 for client /140.211.11.196:31501
[junit4:junit4]   2> 4565 T58 oaz.ClientCnxn$SendThread.readConnectResult Session establishment complete on server localhost/127.0.0.1:49333, sessionid = 0x139d12f39a30003, negotiated timeout = 5000
[junit4:junit4]   2> 4566 T59 oascc.ConnectionManager.process Watcher org.apache.solr.common.cloud.ConnectionManager@19c42c4b name:ZooKeeperConnection Watcher:127.0.0.1:49333/solr got event WatchedEvent state:SyncConnected type:None path:null path:null type:None
[junit4:junit4]   2> 4566 T24 oascc.ConnectionManager.waitForConnected Client is connected to ZooKeeper
[junit4:junit4]   2> 4568 T29 oazs.PrepRequestProcessor.pRequest Got user-level KeeperException when processing sessionid:0x139d12f39a30003 type:create cxid:0x1 zxid:0xfffffffffffffffe txntype:unknown reqpath:n/a Error Path:/solr/overseer Error:KeeperErrorCode = NodeExists for /solr/overseer
[junit4:junit4]   2> 4575 T29 oazs.PrepRequestProcessor.pRequest Got user-level KeeperException when processing sessionid:0x139d12f39a30003 type:create cxid:0x2 zxid:0xfffffffffffffffe txntype:unknown reqpath:n/a Error Path:/solr/overseer Error:KeeperErrorCode = NodeExists for /solr/overseer
[junit4:junit4]   2> 4583 T24 oasc.ZkController.createEphemeralLiveNode Register node as live in ZooKeeper:/live_nodes/127.0.0.1:32069_solr
[junit4:junit4]   2> 4584 T29 oazs.PrepRequestProcessor.pRequest Got user-level KeeperException when processing sessionid:0x139d12f39a30003 type:delete cxid:0x4 zxid:0xfffffffffffffffe txntype:unknown reqpath:n/a Error Path:/solr/live_nodes/127.0.0.1:32069_solr Error:KeeperErrorCode = NoNode for /solr/live_nodes/127.0.0.1:32069_solr
[junit4:junit4]   2> 4585 T24 oascc.SolrZkClient.makePath makePath: /live_nodes/127.0.0.1:32069_solr
[junit4:junit4]   2> 4588 T45 oascc.ZkStateReader$3.process Updating live nodes
[junit4:junit4]   2> 4590 T24 oashc.HttpShardHandlerFactory.getParameter Setting socketTimeout to: 0
[junit4:junit4]   2> 4590 T24 oashc.HttpShardHandlerFactory.getParameter Setting urlScheme to: http://
[junit4:junit4]   2> 4591 T24 oashc.HttpShardHandlerFactory.getParameter Setting connTimeout to: 0
[junit4:junit4]   2> 4591 T24 oashc.HttpShardHandlerFactory.getParameter Setting maxConnectionsPerHost to: 20
[junit4:junit4]   2> 4592 T24 oashc.HttpShardHandlerFactory.getParameter Setting corePoolSize to: 0
[junit4:junit4]   2> 4592 T24 oashc.HttpShardHandlerFactory.getParameter Setting maximumPoolSize to: 2147483647
[junit4:junit4]   2> 4593 T24 oashc.HttpShardHandlerFactory.getParameter Setting maxThreadIdleTime to: 5
[junit4:junit4]   2> 4593 T24 oashc.HttpShardHandlerFactory.getParameter Setting sizeOfQueue to: -1
[junit4:junit4]   2> 4594 T24 oashc.HttpShardHandlerFactory.getParameter Setting fairnessPolicy to: false
[junit4:junit4]   2> 4594 T24 oascsi.HttpClientUtil.createClient Creating new http client, config:maxConnectionsPerHost=20&maxConnections=10000&socketTimeout=0&connTimeout=0&retry=false
[junit4:junit4]   2> 4618 T24 oascc.ZkStateReader.createClusterStateWatchersAndUpdate Updating cluster state from ZooKeeper... 
[junit4:junit4]   2> 4626 T24 oasc.CoreContainer.create Creating SolrCore 'collection1' using instanceDir: /usr/home/hudson/hudson-slave/workspace/Lucene-Solr-Tests-4.x-Java6/solr/build/solr-core/test/J1/./solrtest-jetty1-1347834300784/collection1
[junit4:junit4]   2> 4626 T24 oasc.ZkController.createCollectionZkNode Check for collection zkNode:collection1
[junit4:junit4]   2> 4627 T24 oasc.ZkController.createCollectionZkNode Collection zkNode exists
[junit4:junit4]   2> 4628 T24 oasc.ZkController.readConfigName Load collection config from:/collections/collection1
[junit4:junit4]   2> 4630 T24 oasc.SolrResourceLoader.<init> new SolrResourceLoader for directory: '/usr/home/hudson/hudson-slave/workspace/Lucene-Solr-Tests-4.x-Java6/solr/build/solr-core/test/J1/./solrtest-jetty1-1347834300784/collection1/'
[junit4:junit4]   2> 4631 T24 oasc.SolrResourceLoader.replaceClassLoader Adding 'file:/usr/home/hudson/hudson-slave/workspace/Lucene-Solr-Tests-4.x-Java6/solr/build/solr-core/test/J1/solrtest-jetty1-1347834300784/collection1/lib/README' to classloader
[junit4:junit4]   2> 4633 T24 oasc.SolrResourceLoader.replaceClassLoader Adding 'file:/usr/home/hudson/hudson-slave/workspace/Lucene-Solr-Tests-4.x-Java6/solr/build/solr-core/test/J1/solrtest-jetty1-1347834300784/collection1/lib/classes/' to classloader
[junit4:junit4]   2> 4699 T24 oasc.SolrConfig.<init> Using Lucene MatchVersion: LUCENE_40
[junit4:junit4]   2> 4781 T24 oasc.SolrConfig.<init> Loaded SolrConfig: solrconfig.xml
[junit4:junit4]   2> 4793 T46 oascc.ZkStateReader.updateClusterState Updating cloud state from ZooKeeper... 
[junit4:junit4]   2> 4810 T45 oascc.ZkStateReader$2.process A cluster state change has occurred - updating...
[junit4:junit4]   2> 4882 T59 oascc.ZkStateReader$2.process A cluster state change has occurred - updating...
[junit4:junit4]   2> 4882 T24 oass.IndexSchema.readSchema Reading Solr Schema
[junit4:junit4]   2> 4904 T24 oass.IndexSchema.readSchema Schema name=test
[junit4:junit4]   2> 5626 T24 oass.OpenExchangeRatesOrgProvider.init Initialized with rates=open-exchange-rates.json, refreshInterval=1440.
[junit4:junit4]   2> 5644 T24 oass.IndexSchema.readSchema default search field in schema is text
[junit4:junit4]   2> 5648 T24 oass.IndexSchema.readSchema unique key field: id
[junit4:junit4]   2> 5676 T24 oass.FileExchangeRateProvider.reload Reloading exchange rates from file currency.xml
[junit4:junit4]   2> 5684 T24 oass.FileExchangeRateProvider.reload Reloading exchange rates from file currency.xml
[junit4:junit4]   2> 5690 T24 oass.OpenExchangeRatesOrgProvider.reload Reloading exchange rates from open-exchange-rates.json
[junit4:junit4]   2> 5693 T24 oass.OpenExchangeRatesOrgProvider.reload Reloading exchange rates from open-exchange-rates.json
[junit4:junit4]   2> 5697 T24 oasc.SolrCore.<init> [collection1] Opening new SolrCore at /usr/home/hudson/hudson-slave/workspace/Lucene-Solr-Tests-4.x-Java6/solr/build/solr-core/test/J1/./solrtest-jetty1-1347834300784/collection1/, dataDir=./org.apache.solr.cloud.SyncSliceTest-1347834296411/jetty1/
[junit4:junit4]   2> 5697 T24 oasc.JmxMonitoredMap.<init> JMX monitoring is enabled. Adding Solr mbeans to JMX Server: com.sun.jmx.mbeanserver.JmxMBeanServer@5c09624
[junit4:junit4]   2> 5699 T24 oasc.SolrCore.getNewIndexDir WARNING New index directory detected: old=null new=./org.apache.solr.cloud.SyncSliceTest-1347834296411/jetty1/index/
[junit4:junit4]   2> 5700 T24 oasc.SolrCore.initIndex WARNING [collection1] Solr index directory './org.apache.solr.cloud.SyncSliceTest-1347834296411/jetty1/index' doesn't exist. Creating new index...
[junit4:junit4]   2> 5702 T24 oasc.CachingDirectoryFactory.get return new directory for /usr/home/hudson/hudson-slave/workspace/Lucene-Solr-Tests-4.x-Java6/solr/build/solr-core/test/J1/./org.apache.solr.cloud.SyncSliceTest-1347834296411/jetty1/index forceNew:false
[junit4:junit4]   2> 5748 T24 oasc.SolrDeletionPolicy.onCommit SolrDeletionPolicy.onCommit: commits:num=1
[junit4:junit4]   2> 		commit{dir=NRTCachingDirectory(org.apache.lucene.store.NIOFSDirectory@/usr/home/hudson/hudson-slave/workspace/Lucene-Solr-Tests-4.x-Java6/solr/build/solr-core/test/J1/org.apache.solr.cloud.SyncSliceTest-1347834296411/jetty1/index lockFactory=org.apache.lucene.store.NativeFSLockFactory@71f5ba55; maxCacheMB=48.0 maxMergeSizeMB=4.0),segFN=segments_1,generation=1,filenames=[segments_1]
[junit4:junit4]   2> 5748 T24 oasc.SolrDeletionPolicy.updateCommits newest commit = 1
[junit4:junit4]   2> 5749 T24 oasc.SolrCore.initWriters created xml: solr.XMLResponseWriter
[junit4:junit4]   2> 5752 T24 oasup.UpdateRequestProcessorChain.init inserting DistributedUpdateProcessorFactory into updateRequestProcessorChain "dedupe"
[junit4:junit4]   2> 5752 T24 oasup.UpdateRequestProcessorChain.init inserting DistributedUpdateProcessorFactory into updateRequestProcessorChain "dedupe-allfields"
[junit4:junit4]   2> 5753 T24 oasup.UpdateRequestProcessorChain.init inserting DistributedUpdateProcessorFactory into updateRequestProcessorChain "stored_sig"
[junit4:junit4]   2> 5754 T24 oasup.UpdateRequestProcessorChain.init inserting DistributedUpdateProcessorFactory into updateRequestProcessorChain "uniq-fields"
[junit4:junit4]   2> 5754 T24 oasup.UpdateRequestProcessorChain.init inserting DistributedUpdateProcessorFactory into updateRequestProcessorChain "distrib-dup-test-chain-implicit"
[junit4:junit4]   2> 5755 T24 oasc.RequestHandlers.initHandlersFromConfig adding lazy requestHandler: solr.ReplicationHandler
[junit4:junit4]   2> 5755 T24 oasc.RequestHandlers.initHandlersFromConfig created /replication: solr.ReplicationHandler
[junit4:junit4]   2> 5756 T24 oasc.RequestHandlers.initHandlersFromConfig created standard: solr.StandardRequestHandler
[junit4:junit4]   2> 5757 T24 oasc.RequestHandlers.initHandlersFromConfig created /get: solr.RealTimeGetHandler
[junit4:junit4]   2> 5758 T24 oasc.RequestHandlers.initHandlersFromConfig created dismax: solr.SearchHandler
[junit4:junit4]   2> 5758 T24 oasc.RequestHandlers.initHandlersFromConfig created mock: org.apache.solr.core.MockQuerySenderListenerReqHandler
[junit4:junit4]   2> 5759 T24 oasc.RequestHandlers.initHandlersFromConfig created /admin/: org.apache.solr.handler.admin.AdminHandlers
[junit4:junit4]   2> 5760 T24 oasc.RequestHandlers.initHandlersFromConfig created defaults: solr.StandardRequestHandler
[junit4:junit4]   2> 5760 T24 oasc.RequestHandlers.initHandlersFromConfig adding lazy requestHandler: solr.StandardRequestHandler
[junit4:junit4]   2> 5761 T24 oasc.RequestHandlers.initHandlersFromConfig created lazy: solr.StandardRequestHandler
[junit4:junit4]   2> 5761 T24 oasc.RequestHandlers.initHandlersFromConfig created /update: solr.UpdateRequestHandler
[junit4:junit4]   2> 5762 T24 oasc.RequestHandlers.initHandlersFromConfig created /terms: org.apache.solr.handler.component.SearchHandler
[junit4:junit4]   2> 5763 T24 oasc.RequestHandlers.initHandlersFromConfig created spellCheckCompRH: org.apache.solr.handler.component.SearchHandler
[junit4:junit4]   2> 5764 T24 oasc.RequestHandlers.initHandlersFromConfig created spellCheckCompRH_Direct: org.apache.solr.handler.component.SearchHandler
[junit4:junit4]   2> 5764 T24 oasc.RequestHandlers.initHandlersFromConfig created spellCheckWithWordbreak: org.apache.solr.handler.component.SearchHandler
[junit4:junit4]   2> 5765 T24 oasc.RequestHandlers.initHandlersFromConfig created spellCheckWithWordbreak_Direct: org.apache.solr.handler.component.SearchHandler
[junit4:junit4]   2> 5766 T24 oasc.RequestHandlers.initHandlersFromConfig created spellCheckCompRH1: org.apache.solr.handler.component.SearchHandler
[junit4:junit4]   2> 5766 T24 oasc.RequestHandlers.initHandlersFromConfig created tvrh: org.apache.solr.handler.component.SearchHandler
[junit4:junit4]   2> 5767 T24 oasc.RequestHandlers.initHandlersFromConfig created /mlt: solr.MoreLikeThisHandler
[junit4:junit4]   2> 5768 T24 oasc.RequestHandlers.initHandlersFromConfig created /debug/dump: solr.DumpRequestHandler
[junit4:junit4]   2> 5771 T24 oashl.XMLLoader.init xsltCacheLifetimeSeconds=60
[junit4:junit4]   2> 5774 T24 oasc.SolrCore.initDeprecatedSupport WARNING solrconfig.xml uses deprecated <admin/gettableFiles>, Please update your config to use the ShowFileRequestHandler.
[junit4:junit4]   2> 5776 T24 oasc.SolrCore.initDeprecatedSupport WARNING adding ShowFileRequestHandler with hidden files: [SCHEMA.XML, OLD_SYNONYMS.TXT, STOPWORDS.TXT, PROTWORDS.TXT, OPEN-EXCHANGE-RATES.JSON, SYNONYMS.TXT, CURRENCY.XML, MAPPING-ISOLATIN1ACCENT.TXT]
[junit4:junit4]   2> 5781 T24 oass.SolrIndexSearcher.<init> Opening Searcher@571cac41 main
[junit4:junit4]   2> 5782 T24 oasu.CommitTracker.<init> Hard AutoCommit: disabled
[junit4:junit4]   2> 5783 T24 oasu.CommitTracker.<init> Soft AutoCommit: disabled
[junit4:junit4]   2> 5784 T24 oashc.SpellCheckComponent.inform Initializing spell checkers
[junit4:junit4]   2> 5790 T24 oass.DirectSolrSpellChecker.init init: {name=direct,classname=DirectSolrSpellChecker,field=lowerfilt,minQueryLength=3}
[junit4:junit4]   2> 5837 T60 oasc.SolrCore.registerSearcher [collection1] Registered new searcher Searcher@571cac41 main{StandardDirectoryReader(segments_1:1)}
[junit4:junit4]   2> 6322 T46 oascc.ZkStateReader.updateClusterState Updating cloud state from ZooKeeper... 
[junit4:junit4]   2> 6350 T45 oascc.ZkStateReader$2.process A cluster state change has occurred - updating...
[junit4:junit4]   2> 6350 T59 oascc.ZkStateReader$2.process A cluster state change has occurred - updating...
[junit4:junit4]   2> 6847 T24 oasc.CoreContainer.register registering core: collection1
[junit4:junit4]   2> 6847 T24 oasc.ZkController.register Register shard - core:collection1 address:http://127.0.0.1:32069/solr shardId:shard1
[junit4:junit4]   2> 6849 T24 oascc.SolrZkClient.makePath makePath: /collections/collection1/leader_elect/shard1/election
[junit4:junit4]   2> 6866 T29 oazs.PrepRequestProcessor.pRequest Got user-level KeeperException when processing sessionid:0x139d12f39a30003 type:delete cxid:0x43 zxid:0xfffffffffffffffe txntype:unknown reqpath:n/a Error Path:/solr/collections/collection1/leaders Error:KeeperErrorCode = NoNode for /solr/collections/collection1/leaders
[junit4:junit4]   2> 6868 T24 oasc.ShardLeaderElectionContext.runLeaderProcess Running the leader process.
[junit4:junit4]   2> 6869 T29 oazs.PrepRequestProcessor.pRequest Got user-level KeeperException when processing sessionid:0x139d12f39a30003 type:create cxid:0x44 zxid:0xfffffffffffffffe txntype:unknown reqpath:n/a Error Path:/solr/overseer Error:KeeperErrorCode = NodeExists for /solr/overseer
[junit4:junit4]   2> 6877 T24 oasc.ShardLeaderElectionContext.waitForReplicasToComeUp Enough replicas found to continue.
[junit4:junit4]   2> 6878 T24 oasc.ShardLeaderElectionContext.runLeaderProcess I may be the new leader - try and sync
[junit4:junit4]   2> 6878 T24 oasc.SyncStrategy.sync Sync replicas to http://127.0.0.1:32069/solr/collection1/
[junit4:junit4]   2> 6879 T24 oasc.SyncStrategy.syncReplicas Sync Success - now sync replicas to me
[junit4:junit4]   2> 6879 T24 oasc.SyncStrategy.syncToMe http://127.0.0.1:32069/solr/collection1/ has no replicas
[junit4:junit4]   2> 6880 T24 oasc.ShardLeaderElectionContext.runLeaderProcess I am the new leader: http://127.0.0.1:32069/solr/collection1/
[junit4:junit4]   2> 6881 T24 oascc.SolrZkClient.makePath makePath: /collections/collection1/leaders/shard1
[junit4:junit4]   2> 6887 T29 oazs.PrepRequestProcessor.pRequest Got user-level KeeperException when processing sessionid:0x139d12f39a30003 type:create cxid:0x4e zxid:0xfffffffffffffffe txntype:unknown reqpath:n/a Error Path:/solr/overseer Error:KeeperErrorCode = NodeExists for /solr/overseer
[junit4:junit4]   2> 7366 T46 oascc.ZkStateReader.updateClusterState Updating cloud state from ZooKeeper... 
[junit4:junit4]   2> 7394 T45 oascc.ZkStateReader$2.process A cluster state change has occurred - updating...
[junit4:junit4]   2> 7394 T59 oascc.ZkStateReader$2.process A cluster state change has occurred - updating...
[junit4:junit4]   2> 7406 T24 oasc.ZkController.register We are http://127.0.0.1:32069/solr/collection1/ and leader is http://127.0.0.1:32069/solr/collection1/
[junit4:junit4]   2> 7406 T24 oasc.ZkController.register No LogReplay needed for core=collection1 baseURL=http://127.0.0.1:32069/solr
[junit4:junit4]   2> 7407 T24 oasc.ZkController.checkRecovery I am the leader, no recovery necessary
[junit4:junit4]   2> 7410 T24 oascc.ZkStateReader.updateClusterState Updating cloud state from ZooKeeper... 
[junit4:junit4]   2> 7411 T24 oass.SolrDispatchFilter.init user.dir=/usr/home/hudson/hudson-slave/workspace/Lucene-Solr-Tests-4.x-Java6/solr/build/solr-core/test/J1
[junit4:junit4]   2> 7412 T24 oass.SolrDispatchFilter.init SolrDispatchFilter.init() done
[junit4:junit4]   2> 7412 T24 oascsi.HttpClientUtil.createClient Creating new http client, config:maxConnections=128&maxConnectionsPerHost=32&followRedirects=false
[junit4:junit4]   2> 7588 T24 oejs.Server.doStart jetty-8.1.2.v20120308
[junit4:junit4]   2> 7591 T24 oejs.AbstractConnector.doStart Started SocketConnector@0.0.0.0:32323
[junit4:junit4]   2> 7592 T24 oasc.SolrResourceLoader.locateSolrHome JNDI not configured for solr (NoInitialContextEx)
[junit4:junit4]   2> 7593 T24 oasc.SolrResourceLoader.locateSolrHome using system property solr.solr.home: /usr/home/hudson/hudson-slave/workspace/Lucene-Solr-Tests-4.x-Java6/solr/build/solr-core/test/J1/./solrtest-jetty2-1347834303830
[junit4:junit4]   2> 7593 T24 oasc.SolrResourceLoader.<init> new SolrResourceLoader for deduced Solr Home: '/usr/home/hudson/hudson-slave/workspace/Lucene-Solr-Tests-4.x-Java6/solr/build/solr-core/test/J1/./solrtest-jetty2-1347834303830/'
[junit4:junit4]   2> 7641 T24 oass.SolrDispatchFilter.init SolrDispatchFilter.init()
[junit4:junit4]   2> 7642 T24 oasc.SolrResourceLoader.locateSolrHome JNDI not configured for solr (NoInitialContextEx)
[junit4:junit4]   2> 7642 T24 oasc.SolrResourceLoader.locateSolrHome using system property solr.solr.home: /usr/home/hudson/hudson-slave/workspace/Lucene-Solr-Tests-4.x-Java6/solr/build/solr-core/test/J1/./solrtest-jetty2-1347834303830
[junit4:junit4]   2> 7643 T24 oasc.CoreContainer$Initializer.initialize looking for solr.xml: /usr/home/hudson/hudson-slave/workspace/Lucene-Solr-Tests-4.x-Java6/solr/build/solr-core/test/J1/./solrtest-jetty2-1347834303830/solr.xml
[junit4:junit4]   2> 7643 T24 oasc.CoreContainer.<init> New CoreContainer 1719972320
[junit4:junit4]   2> 7644 T24 oasc.CoreContainer.load Loading CoreContainer using Solr Home: '/usr/home/hudson/hudson-slave/workspace/Lucene-Solr-Tests-4.x-Java6/solr/build/solr-core/test/J1/./solrtest-jetty2-1347834303830/'
[junit4:junit4]   2> 7645 T24 oasc.SolrResourceLoader.<init> new SolrResourceLoader for directory: '/usr/home/hudson/hudson-slave/workspace/Lucene-Solr-Tests-4.x-Java6/solr/build/solr-core/test/J1/./solrtest-jetty2-1347834303830/'
[junit4:junit4]   2> 7674 T24 oasc.CoreContainer.load Registering Log Listener
[junit4:junit4]   2> 7693 T24 oasc.CoreContainer.initZooKeeper Zookeeper client=127.0.0.1:49333/solr
[junit4:junit4]   2> 7694 T24 oaz.ZooKeeper.<init> Initiating client connection, connectString=127.0.0.1:49333/solr sessionTimeout=5000 watcher=org.apache.solr.common.cloud.ConnectionManager@51f45f2a
[junit4:junit4]   2> 7695 T70 oaz.ClientCnxn$SendThread.startConnect Opening socket connection to server /127.0.0.1:49333
[junit4:junit4]   2> 7695 T24 oascc.ConnectionManager.waitForConnected Waiting for client to connect to ZooKeeper
[junit4:junit4]   2> 7696 T70 oaz.ClientCnxn$SendThread.primeConnection Socket connection established to localhost/127.0.0.1:49333, initiating session
[junit4:junit4]   2> 7697 T26 oazs.NIOServerCnxn$Factory.run Accepted socket connection from /140.211.11.196:21723
[junit4:junit4]   2> 7698 T26 oazs.NIOServerCnxn.readConnectRequest Client attempting to establish new session at /140.211.11.196:21723
[junit4:junit4]   2> 7700 T28 oazs.NIOServerCnxn.finishSessionInit Established session 0x139d12f39a30004 with negotiated timeout 5000 for client /140.211.11.196:21723
[junit4:junit4]   2> 7700 T70 oaz.ClientCnxn$SendThread.readConnectResult Session establishment complete on server localhost/127.0.0.1:49333, sessionid = 0x139d12f39a30004, negotiated timeout = 5000
[junit4:junit4]   2> 7701 T71 oascc.ConnectionManager.process Watcher org.apache.solr.common.cloud.ConnectionManager@51f45f2a name:ZooKeeperConnection Watcher:127.0.0.1:49333/solr got event WatchedEvent state:SyncConnected type:None path:null path:null type:None
[junit4:junit4]   2> 7701 T24 oascc.ConnectionManager.waitForConnected Client is connected to ZooKeeper
[junit4:junit4]   2> 7702 T29 oazs.PrepRequestProcessor.pRequest Got user-level KeeperException when processing sessionid:0x139d12f39a30004 type:create cxid:0x1 zxid:0xfffffffffffffffe txntype:unknown reqpath:n/a Error Path:/solr/overseer Error:KeeperErrorCode = NodeExists for /solr/overseer
[junit4:junit4]   2> 7715 T29 oazs.PrepRequestProcessor.pRequest Got user-level KeeperException when processing sessionid:0x139d12f39a30004 type:create cxid:0x2 zxid:0xfffffffffffffffe txntype:unknown reqpath:n/a Error Path:/solr/overseer Error:KeeperErrorCode = NodeExists for /solr/overseer
[junit4:junit4]   2> 7717 T24 oasc.ZkController.createEphemeralLiveNode Register node as live in ZooKeeper:/live_nodes/127.0.0.1:32323_solr
[junit4:junit4]   2> 7718 T29 oazs.PrepRequestProcessor.pRequest Got user-level KeeperException when processing sessionid:0x139d12f39a30004 type:delete cxid:0x4 zxid:0xfffffffffffffffe txntype:unknown reqpath:n/a Error Path:/solr/live_nodes/127.0.0.1:32323_solr Error:KeeperErrorCode = NoNode for /solr/live_nodes/127.0.0.1:32323_solr
[junit4:junit4]   2> 7724 T24 oascc.SolrZkClient.makePath makePath: /live_nodes/127.0.0.1:32323_solr
[junit4:junit4]   2> 7726 T59 oascc.ZkStateReader$3.process Updating live nodes
[junit4:junit4]   2> 7726 T45 oascc.ZkStateReader$3.process Updating live nodes
[junit4:junit4]   2> 7727 T24 oashc.HttpShardHandlerFactory.getParameter Setting socketTimeout to: 0
[junit4:junit4]   2> 7728 T24 oashc.HttpShardHandlerFactory.getParameter Setting urlScheme to: http://
[junit4:junit4]   2> 7728 T24 oashc.HttpShardHandlerFactory.getParameter Setting connTimeout to: 0
[junit4:junit4]   2> 7728 T24 oashc.HttpShardHandlerFactory.getParameter Setting maxConnectionsPerHost to: 20
[junit4:junit4]   2> 7729 T24 oashc.HttpShardHandlerFactory.getParameter Setting corePoolSize to: 0
[junit4:junit4]   2> 7729 T24 oashc.HttpShardHandlerFactory.getParameter Setting maximumPoolSize to: 2147483647
[junit4:junit4]   2> 7729 T24 oashc.HttpShardHandlerFactory.getParameter Setting maxThreadIdleTime to: 5
[junit4:junit4]   2> 7730 T24 oashc.HttpShardHandlerFactory.getParameter Setting sizeOfQueue to: -1
[junit4:junit4]   2> 7730 T24 oashc.HttpShardHandlerFactory.getParameter Setting fairnessPolicy to: false
[junit4:junit4]   2> 7731 T24 oascsi.HttpClientUtil.createClient Creating new http client, config:maxConnectionsPerHost=20&maxConnections=10000&socketTimeout=0&connTimeout=0&retry=false
[junit4:junit4]   2> 7747 T24 oascc.ZkStateReader.createClusterStateWatchersAndUpdate Updating cluster state from ZooKeeper... 
[junit4:junit4]   2> 7755 T24 oasc.CoreContainer.create Creating SolrCore 'collection1' using instanceDir: /usr/home/hudson/hudson-slave/workspace/Lucene-Solr-Tests-4.x-Java6/solr/build/solr-core/test/J1/./solrtest-jetty2-1347834303830/collection1
[junit4:junit4]   2> 7755 T24 oasc.ZkController.createCollectionZkNode Check for collection zkNode:collection1
[junit4:junit4]   2> 7756 T24 oasc.ZkController.createCollectionZkNode Collection zkNode exists
[junit4:junit4]   2> 7756 T24 oasc.ZkController.readConfigName Load collection config from:/collections/collection1
[junit4:junit4]   2> 7758 T24 oasc.SolrResourceLoader.<init> new SolrResourceLoader for directory: '/usr/home/hudson/hudson-slave/workspace/Lucene-Solr-Tests-4.x-Java6/solr/build/solr-core/test/J1/./solrtest-jetty2-1347834303830/collection1/'
[junit4:junit4]   2> 7759 T24 oasc.SolrResourceLoader.replaceClassLoader Adding 'file:/usr/home/hudson/hudson-slave/workspace/Lucene-Solr-Tests-4.x-Java6/solr/build/solr-core/test/J1/solrtest-jetty2-1347834303830/collection1/lib/README' to classloader
[junit4:junit4]   2> 7760 T24 oasc.SolrResourceLoader.replaceClassLoader Adding 'file:/usr/home/hudson/hudson-slave/workspace/Lucene-Solr-Tests-4.x-Java6/solr/build/solr-core/test/J1/solrtest-jetty2-1347834303830/collection1/lib/classes/' to classloader
[junit4:junit4]   2> 7800 T24 oasc.SolrConfig.<init> Using Lucene MatchVersion: LUCENE_40
[junit4:junit4]   2> 7855 T24 oasc.SolrConfig.<init> Loaded SolrConfig: solrconfig.xml
[junit4:junit4]   2> 7903 T46 oascc.ZkStateReader.updateClusterState Updating cloud state from ZooKeeper... 
[junit4:junit4]   2> 7909 T45 oascc.ZkStateReader$2.process A cluster state change has occurred - updating...
[junit4:junit4]   2> 7909 T59 oascc.ZkStateReader$2.process A cluster state change has occurred - updating...
[junit4:junit4]   2> 7956 T71 oascc.ZkStateReader$2.process A cluster state change has occurred - updating...
[junit4:junit4]   2> 7956 T24 oass.IndexSchema.readSchema Reading Solr Schema
[junit4:junit4]   2> 7968 T24 oass.IndexSchema.readSchema Schema name=test
[junit4:junit4]   2> 8596 T24 oass.OpenExchangeRatesOrgProvider.init Initialized with rates=open-exchange-rates.json, refreshInterval=1440.
[junit4:junit4]   2> 8607 T24 oass.IndexSchema.readSchema default search field in schema is text
[junit4:junit4]   2> 8611 T24 oass.IndexSchema.readSchema unique key field: id
[junit4:junit4]   2> 8631 T24 oass.FileExchangeRateProvider.reload Reloading exchange rates from file currency.xml
[junit4:junit4]   2> 8636 T24 oass.FileExchangeRateProvider.reload Reloading exchange rates from file currency.xml
[junit4:junit4]   2> 8640 T24 oass.OpenExchangeRatesOrgProvider.reload Reloading exchange rates from open-exchange-rates.json
[junit4:junit4]   2> 8642 T24 oass.OpenExchangeRatesOrgProvider.reload Reloading exchange rates from open-exchange-rates.json
[junit4:junit4]   2> 8644 T24 oasc.SolrCore.<init> [collection1] Opening new SolrCore at /usr/home/hudson/hudson-slave/workspace/Lucene-Solr-Tests-4.x-Java6/solr/build/solr-core/test/J1/./solrtest-jetty2-1347834303830/collection1/, dataDir=./org.apache.solr.cloud.SyncSliceTest-1347834296411/jetty2/
[junit4:junit4]   2> 8645 T24 oasc.JmxMonitoredMap.<init> JMX monitoring is enabled. Adding Solr mbeans to JMX Server: com.sun.jmx.mbeanserver.JmxMBeanServer@5c09624
[junit4:junit4]   2> 8646 T24 oasc.SolrCore.getNewIndexDir WARNING New index directory detected: old=null new=./org.apache.solr.cloud.SyncSliceTest-1347834296411/jetty2/index/
[junit4:junit4]   2> 8647 T24 oasc.SolrCore.initIndex WARNING [collection1] Solr index directory './org.apache.solr.cloud.SyncSliceTest-1347834296411/jetty2/index' doesn't exist. Creating new index...
[junit4:junit4]   2> 8648 T24 oasc.CachingDirectoryFactory.get return new directory for /usr/home/hudson/hudson-slave/workspace/Lucene-Solr-Tests-4.x-Java6/solr/build/solr-core/test/J1/./org.apache.solr.cloud.SyncSliceTest-1347834296411/jetty2/index forceNew:false
[junit4:junit4]   2> 8654 T24 oasc.SolrDeletionPolicy.onCommit SolrDeletionPolicy.onCommit: commits:num=1
[junit4:junit4]   2> 		commit{dir=NRTCachingDirectory(org.apache.lucene.store.NIOFSDirectory@/usr/home/hudson/hudson-slave/workspace/Lucene-Solr-Tests-4.x-Java6/solr/build/solr-core/test/J1/org.apache.solr.cloud.SyncSliceTest-1347834296411/jetty2/index lockFactory=org.apache.lucene.store.NativeFSLockFactory@6f866002; maxCacheMB=48.0 maxMergeSizeMB=4.0),segFN=segments_1,generation=1,filenames=[segments_1]
[junit4:junit4]   2> 8655 T24 oasc.SolrDeletionPolicy.updateCommits newest commit = 1
[junit4:junit4]   2> 8656 T24 oasc.SolrCore.initWriters created xml: solr.XMLResponseWriter
[junit4:junit4]   2> 8658 T24 oasup.UpdateRequestProcessorChain.init inserting DistributedUpdateProcessorFactory into updateRequestProcessorChain "dedupe"
[junit4:junit4]   2> 8659 T24 oasup.UpdateRequestProcessorChain.init inserting DistributedUpdateProcessorFactory into updateRequestProcessorChain "dedupe-allfields"
[junit4:junit4]   2> 8659 T24 oasup.UpdateRequestProcessorChain.init inserting DistributedUpdateProcessorFactory into updateRequestProcessorChain "stored_sig"
[junit4:junit4]   2> 8660 T24 oasup.UpdateRequestProcessorChain.init inserting DistributedUpdateProcessorFactory into updateRequestProcessorChain "uniq-fields"
[junit4:junit4]   2> 8661 T24 oasup.UpdateRequestProcessorChain.init inserting DistributedUpdateProcessorFactory into updateRequestProcessorChain "distrib-dup-test-chain-implicit"
[junit4:junit4]   2> 8661 T24 oasc.RequestHandlers.initHandlersFromConfig adding lazy requestHandler: solr.ReplicationHandler
[junit4:junit4]   2> 8662 T24 oasc.RequestHandlers.initHandlersFromConfig created /replication: solr.ReplicationHandler
[junit4:junit4]   2> 8663 T24 oasc.RequestHandlers.initHandlersFromConfig created standard: solr.StandardRequestHandler
[junit4:junit4]   2> 8663 T24 oasc.RequestHandlers.initHandlersFromConfig created /get: solr.RealTimeGetHandler
[junit4:junit4]   2> 8664 T24 oasc.RequestHandlers.initHandlersFromConfig created dismax: solr.SearchHandler
[junit4:junit4]   2> 8665 T24 oasc.RequestHandlers.initHandlersFromConfig created mock: org.apache.solr.core.MockQuerySenderListenerReqHandler
[junit4:junit4]   2> 8666 T24 oasc.RequestHandlers.initHandlersFromConfig created /admin/: org.apache.solr.handler.admin.AdminHandlers
[junit4:junit4]   2> 8666 T24 oasc.RequestHandlers.initHandlersFromConfig created defaults: solr.StandardRequestHandler
[junit4:junit4]   2> 8667 T24 oasc.RequestHandlers.initHandlersFromConfig adding lazy requestHandler: solr.StandardRequestHandler
[junit4:junit4]   2> 8667 T24 oasc.RequestHandlers.initHandlersFromConfig created lazy: solr.StandardRequestHandler
[junit4:junit4]   2> 8668 T24 oasc.RequestHandlers.initHandlersFromConfig created /update: solr.UpdateRequestHandler
[junit4:junit4]   2> 8669 T24 oasc.RequestHandlers.initHandlersFromConfig created /terms: org.apache.solr.handler.component.SearchHandler
[junit4:junit4]   2> 8669 T24 oasc.RequestHandlers.initHandlersFromConfig created spellCheckCompRH: org.apache.solr.handler.component.SearchHandler
[junit4:junit4]   2> 8670 T24 oasc.RequestHandlers.initHandlersFromConfig created spellCheckCompRH_Direct: org.apache.solr.handler.component.SearchHandler
[junit4:junit4]   2> 8671 T24 oasc.RequestHandlers.initHandlersFromConfig created spellCheckWithWordbreak: org.apache.solr.handler.component.SearchHandler
[junit4:junit4]   2> 8672 T24 oasc.RequestHandlers.initHandlersFromConfig created spellCheckWithWordbreak_Direct: org.apache.solr.handler.component.SearchHandler
[junit4:junit4]   2> 8672 T24 oasc.RequestHandlers.initHandlersFromConfig created spellCheckCompRH1: org.apache.solr.handler.component.SearchHandler
[junit4:junit4]   2> 8673 T24 oasc.RequestHandlers.initHandlersFromConfig created tvrh: org.apache.solr.handler.component.SearchHandler
[junit4:junit4]   2> 8674 T24 oasc.RequestHandlers.initHandlersFromConfig created /mlt: solr.MoreLikeThisHandler
[junit4:junit4]   2> 8674 T24 oasc.RequestHandlers.initHandlersFromConfig created /debug/dump: solr.DumpRequestHandler
[junit4:junit4]   2> 8677 T24 oashl.XMLLoader.init xsltCacheLifetimeSeconds=60
[junit4:junit4]   2> 8682 T24 oasc.SolrCore.initDeprecatedSupport WARNING solrconfig.xml uses deprecated <admin/gettableFiles>, Please update your config to use the ShowFileRequestHandler.
[junit4:junit4]   2> 8683 T24 oasc.SolrCore.initDeprecatedSupport WARNING adding ShowFileRequestHandler with hidden files: [SCHEMA.XML, OLD_SYNONYMS.TXT, STOPWORDS.TXT, PROTWORDS.TXT, OPEN-EXCHANGE-RATES.JSON, SYNONYMS.TXT, CURRENCY.XML, MAPPING-ISOLATIN1ACCENT.TXT]
[junit4:junit4]   2> 8687 T24 oass.SolrIndexSearcher.<init> Opening Searcher@4782b18d main
[junit4:junit4]   2> 8688 T24 oasu.CommitTracker.<init> Hard AutoCommit: disabled
[junit4:junit4]   2> 8688 T24 oasu.CommitTracker.<init> Soft AutoCommit: disabled
[junit4:junit4]   2> 8689 T24 oashc.SpellCheckComponent.inform Initializing spell checkers
[junit4:junit4]   2> 8697 T24 oass.DirectSolrSpellChecker.init init: {name=direct,classname=DirectSolrSpellChecker,field=lowerfilt,minQueryLength=3}
[junit4:junit4]   2> 8753 T72 oasc.SolrCore.registerSearcher [collection1] Registered new searcher Searcher@4782b18d main{StandardDirectoryReader(segments_1:1)}
[junit4:junit4]   2> 8922 T46 oascc.ZkStateReader.updateClusterState Updating cloud state from ZooKeeper... 
[junit4:junit4]   2> 8937 T71 oascc.ZkStateReader$2.process A cluster state change has occurred - updating...
[junit4:junit4]   2> 8937 T59 oascc.ZkStateReader$2.process A cluster state change has occurred - updating...
[junit4:junit4]   2> 8937 T45 oascc.ZkStateReader$2.process A cluster state change has occurred - updating...
[junit4:junit4]   2> 9265 T24 oasc.CoreContainer.register registering core: collection1
[junit4:junit4]   2> 9265 T24 oasc.ZkController.register Register shard - core:collection1 address:http://127.0.0.1:32323/solr shardId:shard1
[junit4:junit4]   2> 9269 T24 oasc.ZkController.register We are http://127.0.0.1:32323/solr/collection1/ and leader is http://127.0.0.1:32069/solr/collection1/
[junit4:junit4]   2> 9270 T24 oasc.ZkController.register No LogReplay needed for core=collection1 baseURL=http://127.0.0.1:32323/solr
[junit4:junit4]   2> 9270 T24 oasc.ZkController.checkRecovery Core needs to recover:collection1
[junit4:junit4]   2> 9270 T24 oasu.DefaultSolrCoreState.doRecovery Running recovery - first canceling any ongoing recovery
[junit4:junit4]   2> ASYNC  NEW_CORE C3 name=collection1 org.apache.solr.core.SolrCore@68833813 url=http://127.0.0.1:32323/solr/collection1 node=127.0.0.1:32323_solr
[junit4:junit4]   2> 9276 T73 C3 P32323 oasc.RecoveryStrategy.run Starting recovery process.  core=collection1 recoveringAfterStartup=true
[junit4:junit4]   2> 9276 T73 C3 P32323 oasc.RecoveryStrategy.doRecovery ###### startupVersions=[]
[junit4:junit4]   2> 9277 T24 oascc.ZkStateReader.updateClusterState Updating cloud state from ZooKeeper... 
[junit4:junit4]   2> 9278 T73 C3 P32323 oasc.RecoveryStrategy.doRecovery Attempting to PeerSync from http://127.0.0.1:32069/solr/collection1/ core=collection1 - recoveringAfterStartup=true
[junit4:junit4]   2> 9279 T24 oass.SolrDispatchFilter.init user.dir=/usr/home/hudson/hudson-slave/workspace/Lucene-Solr-Tests-4.x-Java6/solr/build/solr-core/test/J1
[junit4:junit4]   2> 9279 T24 oass.SolrDispatchFilter.init SolrDispatchFilter.init() done
[junit4:junit4]   2> 9279 T24 oascsi.HttpClientUtil.createClient Creating new http client, config:maxConnections=128&maxConnectionsPerHost=32&followRedirects=false
[junit4:junit4]   2> 9285 T73 C3 P32323 oascsi.HttpClientUtil.createClient Creating new http client, config:maxConnectionsPerHost=20&maxConnections=10000&connTimeout=30000&socketTimeout=30000&retry=false
[junit4:junit4]   2> 9301 T73 C3 P32323 oasu.PeerSync.sync PeerSync: core=collection1 url=http://127.0.0.1:32323/solr START replicas=[http://127.0.0.1:32069/solr/collection1/] nUpdates=100
[junit4:junit4]   2> 9310 T73 C3 P32323 oasu.PeerSync.sync WARNING no frame of reference to tell of we've missed updates
[junit4:junit4]   2> 9310 T73 C3 P32323 oasc.RecoveryStrategy.doRecovery PeerSync Recovery was not successful - trying replication. core=collection1
[junit4:junit4]   2> 9310 T73 C3 P32323 oasc.RecoveryStrategy.doRecovery Starting Replication Recovery. core=collection1
[junit4:junit4]   2> 9311 T73 C3 P32323 oascsi.HttpClientUtil.createClient Creating new http client, config:maxConnections=128&maxConnectionsPerHost=32&followRedirects=false
[junit4:junit4]   2> 9429 T24 oejs.Server.doStart jetty-8.1.2.v20120308
[junit4:junit4]   2> 9432 T24 oejs.AbstractConnector.doStart Started SocketConnector@0.0.0.0:56610
[junit4:junit4]   2> 9433 T24 oasc.SolrResourceLoader.locateSolrHome JNDI not configured for solr (NoInitialContextEx)
[junit4:junit4]   2> 9433 T24 oasc.SolrResourceLoader.locateSolrHome using system property solr.solr.home: /usr/home/hudson/hudson-slave/workspace/Lucene-Solr-Tests-4.x-Java6/solr/build/solr-core/test/J1/./solrtest-jetty3-1347834305693
[junit4:junit4]   2> 9434 T24 oasc.SolrResourceLoader.<init> new SolrResourceLoader for deduced Solr Home: '/usr/home/hudson/hudson-slave/workspace/Lucene-Solr-Tests-4.x-Java6/solr/build/solr-core/test/J1/./solrtest-jetty3-1347834305693/'
[junit4:junit4]   2> 9443 T46 oascc.ZkStateReader.updateClusterState Updating cloud state from ZooKeeper... 
[junit4:junit4]   2> 9463 T45 oascc.ZkStateReader$2.process A cluster state change has occurred - updating...
[junit4:junit4]   2> 9463 T71 oascc.ZkStateReader$2.process A cluster state change has occurred - updating...
[junit4:junit4]   2> 9463 T59 oascc.ZkStateReader$2.process A cluster state change has occurred - updating...
[junit4:junit4]   2> 9653 T24 oass.SolrDispatchFilter.init SolrDispatchFilter.init()
[junit4:junit4]   2> 9654 T24 oasc.SolrResourceLoader.locateSolrHome JNDI not configured for solr (NoInitialContextEx)
[junit4:junit4]   2> 9655 T24 oasc.SolrResourceLoader.locateSolrHome using system property solr.solr.home: /usr/home/hudson/hudson-slave/workspace/Lucene-Solr-Tests-4.x-Java6/solr/build/solr-core/test/J1/./solrtest-jetty3-1347834305693
[junit4:junit4]   2> 9655 T24 oasc.CoreContainer$Initializer.initialize looking for solr.xml: /usr/home/hudson/hudson-slave/workspace/Lucene-Solr-Tests-4.x-Java6/solr/build/solr-core/test/J1/./solrtest-jetty3-1347834305693/solr.xml
[junit4:junit4]   2> 9656 T24 oasc.CoreContainer.<init> New CoreContainer 633831424
[junit4:junit4]   2> 9657 T24 oasc.CoreContainer.load Loading CoreContainer using Solr Home: '/usr/home/hudson/hudson-slave/workspace/Lucene-Solr-Tests-4.x-Java6/solr/build/solr-core/test/J1/./solrtest-jetty3-1347834305693/'
[junit4:junit4]   2> 9657 T24 oasc.SolrResourceLoader.<init> new SolrResourceLoader for directory: '/usr/home/hudson/hudson-slave/workspace/Lucene-Solr-Tests-4.x-Java6/solr/build/solr-core/test/J1/./solrtest-jetty3-1347834305693/'
[junit4:junit4]   2> 9885 T24 oasc.CoreContainer.load Registering Log Listener
[junit4:junit4]   2> 9975 T24 oasc.CoreContainer.initZooKeeper Zookeeper client=127.0.0.1:49333/solr
[junit4:junit4]   2> 9975 T24 oaz.ZooKeeper.<init> Initiating client connection, connectString=127.0.0.1:49333/solr sessionTimeout=5000 watcher=org.apache.solr.common.cloud.ConnectionManager@4ceb706d
[junit4:junit4]   2> 9976 T84 oaz.ClientCnxn$SendThread.startConnect Opening socket connection to server /127.0.0.1:49333
[junit4:junit4]   2> 9976 T24 oascc.ConnectionManager.waitForConnected Waiting for client to connect to ZooKeeper
[junit4:junit4]   2> 9978 T84 oaz.ClientCnxn$SendThread.primeConnection Socket connection established to localhost/127.0.0.1:49333, initiating session
[junit4:junit4]   2> 9978 T26 oazs.NIOServerCnxn$Factory.run Accepted socket connection from /140.211.11.196:26788
[junit4:junit4]   2> 9978 T26 oazs.NIOServerCnxn.readConnectRequest Client attempting to establish new session at /140.211.11.196:26788
[junit4:junit4]   2> 9980 T28 oazs.NIOServerCnxn.finishSessionInit Established session 0x139d12f39a30005 with negotiated timeout 5000 for client /140.211.11.196:26788
[junit4:junit4]   2> 9980 T84 oaz.ClientCnxn$SendThread.readConnectResult Session establishment complete on server localhost/127.0.0.1:49333, sessionid = 0x139d12f39a30005, negotiated timeout = 5000
[junit4:junit4]   2> 9981 T85 oascc.ConnectionManager.process Watcher org.apache.solr.common.cloud.ConnectionManager@4ceb706d name:ZooKeeperConnection Watcher:127.0.0.1:49333/solr got event WatchedEvent state:SyncConnected type:None path:null path:null type:None
[junit4:junit4]   2> 9981 T24 oascc.ConnectionManager.waitForConnected Client is connected to ZooKeeper
[junit4:junit4]   2> 9982 T29 oazs.PrepRequestProcessor.pRequest Got user-level KeeperException when processing sessionid:0x139d12f39a30005 type:create cxid:0x1 zxid:0xfffffffffffffffe txntype:unknown reqpath:n/a Error Path:/solr/overseer Error:KeeperErrorCode = NodeExists for /solr/overseer
[junit4:junit4]   2> 9983 T29 oazs.PrepRequestProcessor.pRequest Got user-level KeeperException when processing sessionid:0x139d12f39a30005 type:create cxid:0x2 zxid:0xfffffffffffffffe txntype:unknown reqpath:n/a Error Path:/solr/overseer Error:KeeperErrorCode = NodeExists for /solr/overseer
[junit4:junit4]   2> 9994 T24 oasc.ZkController.createEphemeralLiveNode Register node as live in ZooKeeper:/live_nodes/127.0.0.1:56610_solr
[junit4:junit4]   2> 9995 T29 oazs.PrepRequestProcessor.pRequest Got user-level KeeperException when processing sessionid:0x139d12f39a30005 type:delete cxid:0x4 zxid:0xfffffffffffffffe txntype:unknown reqpath:n/a Error Path:/solr/live_nodes/127.0.0.1:56610_solr Error:KeeperErrorCode = NoNode for /solr/live_nodes/127.0.0.1:56610_solr
[junit4:junit4]   2> 9996 T24 oascc.SolrZkClient.makePath makePath: /live_nodes/127.0.0.1:56610_solr
[junit4:junit4]   2> 10000 T71 oascc.ZkStateReader$3.process Updating live nodes
[junit4:junit4]   2> 10000 T45 oascc.ZkStateReader$3.process Updating live nodes
[junit4:junit4]   2> 10000 T59 oascc.ZkStateReader$3.process Updating live nodes
[junit4:junit4]   2> 10001 T24 oashc.HttpShardHandlerFactory.getParameter Setting socketTimeout to: 0
[junit4:junit4]   2> 10002 T24 oashc.HttpShardHandlerFactory.getParameter Setting urlScheme to: http://
[junit4:junit4]   2> 10002 T24 oashc.HttpShardHandlerFactory.getParameter Setting connTimeout to: 0
[junit4:junit4]   2> 10003 T24 oashc.HttpShardHandlerFactory.getParameter Setting maxConnectionsPerHost to: 20
[junit4:junit4]   2> 10003 T24 oashc.HttpShardHandlerFactory.getParameter Setting corePoolSize to: 0
[junit4:junit4]   2> 10003 T24 oashc.HttpShardHandlerFactory.getParameter Setting maximumPoolSize to: 2147483647
[junit4:junit4]   2> 10004 T24 oashc.HttpShardHandlerFactory.getParameter Setting maxThreadIdleTime to: 5
[junit4:junit4]   2> 10004 T24 oashc.HttpShardHandlerFactory.getParameter Setting sizeOfQueue to: -1
[junit4:junit4]   2> 10005 T24 oashc.HttpShardHandlerFactory.getParameter Setting fairnessPolicy to: false
[junit4:junit4]   2> 10005 T24 oascsi.HttpClientUtil.createClient Creating new http client, config:maxConnectionsPerHost=20&maxConnections=10000&socketTimeout=0&connTimeout=0&retry=false
[junit4:junit4]   2> 10027 T24 oascc.ZkStateReader.createClusterStateWatchersAndUpdate Updating cluster state from ZooKeeper... 
[junit4:junit4]   2> 10059 T24 oasc.CoreContainer.create Creating SolrCore 'collection1' using instanceDir: /usr/home/hudson/hudson-slave/workspace/Lucene-Solr-Tests-4.x-Java6/solr/build/solr-core/test/J1/./solrtest-jetty3-1347834305693/collection1
[junit4:junit4]   2> 10059 T24 oasc.ZkController.createCollectionZkNode Check for collection zkNode:collection1
[junit4:junit4]   2> 10060 T24 oasc.ZkController.createCollectionZkNode Collection zkNode exists
[junit4:junit4]   2> 10061 T24 oasc.ZkController.readConfigName Load collection config from:/collections/collection1
[junit4:junit4]   2> 10062 T24 oasc.SolrResourceLoader.<init> new SolrResourceLoader for directory: '/usr/home/hudson/hudson-slave/workspace/Lucene-Solr-Tests-4.x-Java6/solr/build/solr-core/test/J1/./solrtest-jetty3-1347834305693/collection1/'
[junit4:junit4]   2> 10063 T24 oasc.SolrResourceLoader.replaceClassLoader Adding 'file:/usr/home/hudson/hudson-slave/workspace/Lucene-Solr-Tests-4.x-Java6/solr/build/solr-core/test/J1/solrtest-jetty3-1347834305693/collection1/lib/classes/' to classloader
[junit4:junit4]   2> 10064 T24 oasc.SolrResourceLoader.replaceClassLoader Adding 'file:/usr/home/hudson/hudson-slave/workspace/Lucene-Solr-Tests-4.x-Java6/solr/build/solr-core/test/J1/solrtest-jetty3-1347834305693/collection1/lib/README' to classloader
[junit4:junit4]   2> ASYNC  NEW_CORE C4 name=collection1 org.apache.solr.core.SolrCore@401419d0 url=http://127.0.0.1:32069/solr/collection1 node=127.0.0.1:32069_solr
[junit4:junit4]   2> 10431 T51 C4 P32069 REQ /get {distrib=false&qt=/get&wt=javabin&version=2&getVersions=100} status=0 QTime=10 
[junit4:junit4]   2> 10450 T24 oasc.SolrConfig.<init> Using Lucene MatchVersion: LUCENE_40
[junit4:junit4]   2> 10599 T24 oasc.SolrConfig.<init> Loaded SolrConfig: solrconfig.xml
[junit4:junit4]   2> 10700 T24 oass.IndexSchema.readSchema Reading Solr Schema
[junit4:junit4]   2> 10715 T24 oass.IndexSchema.readSchema Schema name=test
[junit4:junit4]   2> 11228 T24 oass.OpenExchangeRatesOrgProvider.init Initialized with rates=open-exchange-rates.json, refreshInterval=1440.
[junit4:junit4]   2> 11239 T24 oass.IndexSchema.readSchema default search field in schema is text
[junit4:junit4]   2> 11242 T24 oass.IndexSchema.readSchema unique key field: id
[junit4:junit4]   2> 11263 T24 oass.FileExchangeRateProvider.reload Reloading exchange rates from file currency.xml
[junit4:junit4]   2> 11270 T24 oass.FileExchangeRateProvider.reload Reloading exchange rates from file currency.xml
[junit4:junit4]   2> 11276 T24 oass.OpenExchangeRatesOrgProvider.reload Reloading exchange rates from open-exchange-rates.json
[junit4:junit4]   2> 11278 T24 oass.OpenExchangeRatesOrgProvider.reload Reloading exchange rates from open-exchange-rates.json
[junit4:junit4]   2> 11281 T24 oasc.SolrCore.<init> [collection1] Opening new SolrCore at /usr/home/hudson/hudson-slave/workspace/Lucene-Solr-Tests-4.x-Java6/solr/build/solr-core/test/J1/./solrtest-jetty3-1347834305693/collection1/, dataDir=./org.apache.solr.cloud.SyncSliceTest-1347834296411/jetty3/
[junit4:junit4]   2> 11281 T24 oasc.JmxMonitoredMap.<init> JMX monitoring is enabled. Adding Solr mbeans to JMX Server: com.sun.jmx.mbeanserver.JmxMBeanServer@5c09624
[junit4:junit4]   2> 11283 T24 oasc.SolrCore.getNewIndexDir WARNING New index directory detected: old=null new=./org.apache.solr.cloud.SyncSliceTest-1347834296411/jetty3/index/
[junit4:junit4]   2> 11284 T24 oasc.SolrCore.initIndex WARNING [collection1] Solr index directory './org.apache.solr.cloud.SyncSliceTest-1347834296411/jetty3/index' doesn't exist. Creating new index...
[junit4:junit4]   2> 11285 T24 oasc.CachingDirectoryFactory.get return new directory for /usr/home/hudson/hudson-slave/workspace/Lucene-Solr-Tests-4.x-Java6/solr/build/solr-core/test/J1/./org.apache.solr.cloud.SyncSliceTest-1347834296411/jetty3/index forceNew:false
[junit4:junit4]   2> 11318 T24 oasc.SolrDeletionPolicy.onCommit SolrDeletionPolicy.onCommit: commits:num=1
[junit4:junit4]   2> 		commit{dir=NRTCachingDirectory(org.apache.lucene.store.NIOFSDirectory@/usr/home/hudson/hudson-slave/workspace/Lucene-Solr-Tests-4.x-Java6/solr/build/solr-core/test/J1/org.apache.solr.cloud.SyncSliceTest-1347834296411/jetty3/index lockFactory=org.apache.lucene.store.NativeFSLockFactory@3eb2aa1c; maxCacheMB=48.0 maxMergeSizeMB=4.0),segFN=segments_1,generation=1,filenames=[segments_1]
[junit4:junit4]   2> 11319 T24 oasc.SolrDeletionPolicy.updateCommits newest commit = 1
[junit4:junit4]   2> 11320 T24 oasc.SolrCore.initWriters created xml: solr.XMLResponseWriter
[junit4:junit4]   2> 11323 T24 oasup.UpdateRequestProcessorChain.init inserting DistributedUpdateProcessorFactory into updateRequestProcessorChain "dedupe"
[junit4:junit4]   2> 11324 T24 oasup.UpdateRequestProcessorChain.init inserting DistributedUpdateProcessorFactory into updateRequestProcessorChain "dedupe-allfields"
[junit4:junit4]   2> 11325 T24 oasup.UpdateRequestProcessorChain.init inserting DistributedUpdateProcessorFactory into updateRequestProcessorChain "stored_sig"
[junit4:junit4]   2> 11325 T24 oasup.UpdateRequestProcessorChain.init inserting DistributedUpdateProcessorFactory into updateRequestProcessorChain "uniq-fields"
[junit4:junit4]   2> 11326 T24 oasup.UpdateRequestProcessorChain.init inserting DistributedUpdateProcessorFactory into updateRequestProcessorChain "distrib-dup-test-chain-implicit"
[junit4:junit4]   2> 11327 T24 oasc.RequestHandlers.initHandlersFromConfig adding lazy requestHandler: solr.ReplicationHandler
[junit4:junit4]   2> 11328 T24 oasc.RequestHandlers.initHandlersFromConfig created /replication: solr.ReplicationHandler
[junit4:junit4]   2> 11329 T24 oasc.RequestHandlers.initHandlersFromConfig created standard: solr.StandardRequestHandler
[junit4:junit4]   2> 11330 T24 oasc.RequestHandlers.initHandlersFromConfig created /get: solr.RealTimeGetHandler
[junit4:junit4]   2> 11331 T24 oasc.RequestHandlers.initHandlersFromConfig created dismax: solr.SearchHandler
[junit4:junit4]   2> 11332 T24 oasc.RequestHandlers.initHandlersFromConfig created mock: org.apache.solr.core.MockQuerySenderListenerReqHandler
[junit4:junit4]   2> 11333 T24 oasc.RequestHandlers.initHandlersFromConfig created /admin/: org.apache.solr.handler.admin.AdminHandlers
[junit4:junit4]   2> 11334 T24 oasc.RequestHandlers.initHandlersFromConfig created defaults: solr.StandardRequestHandler
[junit4:junit4]   2> 11334 T24 oasc.RequestHandlers.initHandlersFromConfig adding lazy requestHandler: solr.StandardRequestHandler
[junit4:junit4]   2> 11335 T24 oasc.RequestHandlers.initHandlersFromConfig created lazy: solr.StandardRequestHandler
[junit4:junit4]   2> 11336 T24 oasc.RequestHandlers.initHandlersFromConfig created /update: solr.UpdateRequestHandler
[junit4:junit4]   2> 11337 T24 oasc.RequestHandlers.initHandlersFromConfig created /terms: org.apache.solr.handler.component.SearchHandler
[junit4:junit4]   2> 11338 T24 oasc.RequestHandlers.initHandlersFromConfig created spellCheckCompRH: org.apache.solr.handler.component.SearchHandler
[junit4:junit4]   2> 11339 T24 oasc.RequestHandlers.initHandlersFromConfig created spellCheckCompRH_Direct: org.apache.solr.handler.component.SearchHandler
[junit4:junit4]   2> 11340 T24 oasc.RequestHandlers.initHandlersFromConfig created spellCheckWithWordbreak: org.apache.solr.handler.component.SearchHandler
[junit4:junit4]   2> 11341 T24 oasc.RequestHandlers.initHandlersFromConfig created spellCheckWithWordbreak_Direct: org.apache.solr.handler.component.SearchHandler
[junit4:junit4]   2> 11342 T24 oasc.RequestHandlers.initHandlersFromConfig created spellCheckCompRH1: org.apache.solr.handler.component.SearchHandler
[junit4:junit4]   2> 11343 T24 oasc.RequestHandlers.initHandlersFromConfig created tvrh: org.apache.solr.handler.component.SearchHandler
[junit4:junit4]   2> 11344 T24 oasc.RequestHandlers.initHandlersFromConfig created /mlt: solr.MoreLikeThisHandler
[junit4:junit4]   2> 11346 T24 oasc.RequestHandlers.initHandlersFromConfig created /debug/dump: solr.DumpRequestHandler
[junit4:junit4]   2> 11350 T24 oashl.XMLLoader.init xsltCacheLifetimeSeconds=60
[junit4:junit4]   2> 11355 T24 oasc.SolrCore.initDeprecatedSupport WARNING solrconfig.xml uses deprecated <admin/gettableFiles>, Please update your config to use the ShowFileRequestHandler.
[junit4:junit4]   2> 11356 T24 oasc.SolrCore.initDeprecatedSupport WARNING adding ShowFileRequestHandler with hidden files: [SCHEMA.XML, OLD_SYNONYMS.TXT, STOPWORDS.TXT, PROTWORDS.TXT, OPEN-EXCHANGE-RATES.JSON, SYNONYMS.TXT, CURRENCY.XML, MAPPING-ISOLATIN1ACCENT.TXT]
[junit4:junit4]   2> 11360 T24 oass.SolrIndexSearcher.<init> Opening Searcher@6cd0a64a main
[junit4:junit4]   2> 11361 T24 oasu.CommitTracker.<init> Hard AutoCommit: disabled
[junit4:junit4]   2> 11361 T24 oasu.CommitTracker.<init> Soft AutoCommit: disabled
[junit4:junit4]   2> 11362 T24 oashc.SpellCheckComponent.inform Initializing spell checkers
[junit4:junit4]   2> 11369 T24 oass.DirectSolrSpellChecker.init init: {name=direct,classname=DirectSolrSpellChecker,field=lowerfilt,minQueryLength=3}
[junit4:junit4]   2> 11428 T86 oasc.SolrCore.registerSearcher [collection1] Registered new searcher Searcher@6cd0a64a main{StandardDirectoryReader(segments_1:1)}
[junit4:junit4]   2> 11475 T46 oascc.ZkStateReader.updateClusterState Updating cloud state from ZooKeeper... 
[junit4:junit4]   2> 11488 T85 oascc.ZkStateReader$2.process A cluster state change has occurred - updating...
[junit4:junit4]   2> 11488 T59 oascc.ZkStateReader$2.process A cluster state change has occurred - updating...
[junit4:junit4]   2> 11488 T45 oascc.ZkStateReader$2.process A cluster state change has occurred - updating...
[junit4:junit4]   2> 11488 T71 oascc.ZkStateReader$2.process A cluster state change has occurred - updating...
[junit4:junit4]   2> 11937 T24 oasc.CoreContainer.register registering core: collection1
[junit4:junit4]   2> 11937 T24 oasc.ZkController.register Register shard - core:collection1 address:http://127.0.0.1:56610/solr shardId:shard1
[junit4:junit4]   2> 11943 T24 oasc.ZkController.register We are http://127.0.0.1:56610/solr/collection1/ and leader is http://127.0.0.1:32069/solr/collection1/
[junit4:junit4]   2> 11944 T24 oasc.ZkController.register No LogReplay needed for core=collection1 baseURL=http://127.0.0.1:56610/solr
[junit4:junit4]   2> 11944 T24 oasc.ZkController.checkRecovery Core needs to recover:collection1
[junit4:junit4]   2> 11945 T24 oasu.DefaultSolrCoreState.doRecovery Running recovery - first canceling any ongoing recovery
[junit4:junit4]   2> ASYNC  NEW_CORE C5 name=collection1 org.apache.solr.core.SolrCore@47fb4a7b url=http://127.0.0.1:56610/solr/collection1 node=127.0.0.1:56610_solr
[junit4:junit4]   2> 11946 T87 C5 P56610 oasc.RecoveryStrategy.run Starting recovery process.  core=collection1 recoveringAfterStartup=true
[junit4:junit4]   2> 11946 T87 C5 P56610 oasc.RecoveryStrategy.doRecovery ###### startupVersions=[]
[junit4:junit4]   2> 11946 T24 oascc.ZkStateReader.updateClusterState Updating cloud state from ZooKeeper... 
[junit4:junit4]   2> 11948 T87 C5 P56610 oasc.RecoveryStrategy.doRecovery Attempting to PeerSync from http://127.0.0.1:32069/solr/collection1/ core=collection1 - recoveringAfterStartup=true
[junit4:junit4]   2> 11948 T24 oass.SolrDispatchFilter.init user.dir=/usr/home/hudson/hudson-slave/workspace/Lucene-Solr-Tests-4.x-Java6/solr/build/solr-core/test/J1
[junit4:junit4]   2> 11949 T87 C5 P56610 oasu.PeerSync.sync PeerSync: core=collection1 url=http://127.0.0.1:56610/solr START replicas=[http://127.0.0.1:32069/solr/collection1/] nUpdates=100
[junit4:junit4]   2> 11949 T24 oass.SolrDispatchFilter.init SolrDispatchFilter.init() done
[junit4:junit4]   2> 11950 T87 C5 P56610 oasu.PeerSync.sync WARNING no frame of reference to tell of we've missed updates
[junit4:junit4]   2> 11950 T24 oascsi.HttpClientUtil.createClient Creating new http client, config:maxConnections=128&maxConnectionsPerHost=32&followRedirects=false
[junit4:junit4]   2> 11950 T87 C5 P56610 oasc.RecoveryStrategy.doRecovery PeerSync Recovery was not successful - trying replication. core=collection1
[junit4:junit4]   2> 11951 T87 C5 P56610 oasc.RecoveryStrategy.doRecovery Starting Replication Recovery. core=collection1
[junit4:junit4]   2> 11951 T87 C5 P56610 oascsi.HttpClientUtil.createClient Creating new http client, config:maxConnections=128&maxConnectionsPerHost=32&followRedirects=false
[junit4:junit4]   2> 11953 T51 C4 P32069 REQ /get {distrib=false&qt=/get&wt=javabin&version=2&getVersions=100} status=0 QTime=0 
[junit4:junit4]   2> 11994 T46 oascc.ZkStateReader.updateClusterState Updating cloud state from ZooKeeper... 
[junit4:junit4]   2> 12007 T71 oascc.ZkStateReader$2.process A cluster state change has occurred - updating...
[junit4:junit4]   2> 12007 T85 oascc.ZkStateReader$2.process A cluster state change has occurred - updating...
[junit4:junit4]   2> 12007 T59 oascc.ZkStateReader$2.process A cluster state change has occurred - updating...
[junit4:junit4]   2> 12007 T45 oascc.ZkStateReader$2.process A cluster state change has occurred - updating...
[junit4:junit4]   2> 12069 T24 oejs.Server.doStart jetty-8.1.2.v20120308
[junit4:junit4]   2> 12071 T24 oejs.AbstractConnector.doStart Started SocketConnector@0.0.0.0:20775
[junit4:junit4]   2> 12072 T24 oasc.SolrResourceLoader.locateSolrHome JNDI not configured for solr (NoInitialContextEx)
[junit4:junit4]   2> 12072 T24 oasc.SolrResourceLoader.locateSolrHome using system property solr.solr.home: /usr/home/hudson/hudson-slave/workspace/Lucene-Solr-Tests-4.x-Java6/solr/build/solr-core/test/J1/./solrtest-jetty4-1347834308365
[junit4:junit4]   2> 12073 T24 oasc.SolrResourceLoader.<init> new SolrResourceLoader for deduced Solr Home: '/usr/home/hudson/hudson-slave/workspace/Lucene-Solr-Tests-4.x-Java6/solr/build/solr-core/test/J1/./solrtest-jetty4-1347834308365/'
[junit4:junit4]   2> 12112 T24 oass.SolrDispatchFilter.init SolrDispatchFilter.init()
[junit4:junit4]   2> 12113 T24 oasc.SolrResourceLoader.locateSolrHome JNDI not configured for solr (NoInitialContextEx)
[junit4:junit4]   2> 12114 T24 oasc.SolrResourceLoader.locateSolrHome using system property solr.solr.home: /usr/home/hudson/hudson-slave/workspace/Lucene-Solr-Tests-4.x-Java6/solr/build/solr-core/test/J1/./solrtest-jetty4-1347834308365
[junit4:junit4]   2> 12114 T24 oasc.CoreContainer$Initializer.initialize looking for solr.xml: /usr/home/hudson/hudson-slave/workspace/Lucene-Solr-Tests-4.x-Java6/solr/build/solr-core/test/J1/./solrtest-jetty4-1347834308365/solr.xml
[junit4:junit4]   2> 12115 T24 oasc.CoreContainer.<init> New CoreContainer 1913847424
[junit4:junit4]   2> 12116 T24 oasc.CoreContainer.load Loading CoreContainer using Solr Home: '/usr/home/hudson/hudson-slave/workspace/Lucene-Solr-Tests-4.x-Java6/solr/build/solr-core/test/J1/./solrtest-jetty4-1347834308365/'
[junit4:junit4]   2> 12117 T24 oasc.SolrResourceLoader.<init> new SolrResourceLoader for directory: '/usr/home/hudson/hudson-slave/workspace/Lucene-Solr-Tests-4.x-Java6/solr/build/solr-core/test/J1/./solrtest-jetty4-1347834308365/'
[junit4:junit4]   2> 12150 T24 oasc.CoreContainer.load Registering Log Listener
[junit4:junit4]   2> 12174 T24 oasc.CoreContainer.initZooKeeper Zookeeper client=127.0.0.1:49333/solr
[junit4:junit4]   2> 12175 T24 oaz.ZooKeeper.<init> Initiating client connection, connectString=127.0.0.1:49333/solr sessionTimeout=5000 watcher=org.apache.solr.common.cloud.ConnectionManager@4bdb0f40
[junit4:junit4]   2> 12176 T98 oaz.ClientCnxn$SendThread.startConnect Opening socket connection to server /127.0.0.1:49333
[junit4:junit4]   2> 12176 T24 oascc.ConnectionManager.waitForConnected Waiting for client to connect to ZooKeeper
[junit4:junit4]   2> 12178 T98 oaz.ClientCnxn$SendThread.primeConnection Socket connection established to localhost/127.0.0.1:49333, initiating session
[junit4:junit4]   2> 12178 T26 oazs.NIOServerCnxn$Factory.run Accepted socket connection from /140.211.11.196:63831
[junit4:junit4]   2> 12179 T26 oazs.NIOServerCnxn.readConnectRequest Client attempting to establish new session at /140.211.11.196:63831
[junit4:junit4]   2> 12180 T28 oazs.NIOServerCnxn.finishSessionInit Established session 0x139d12f39a30006 with negotiated timeout 5000 for client /140.211.11.196:63831
[junit4:junit4]   2> 12180 T98 oaz.ClientCnxn$SendThread.readConnectResult Session establishment complete on server localhost/127.0.0.1:49333, sessionid = 0x139d12f39a30006, negotiated timeout = 5000
[junit4:junit4]   2> 12181 T99 oascc.ConnectionManager.process Watcher org.apache.solr.common.cloud.ConnectionManager@4bdb0f40 name:ZooKeeperConnection Watcher:127.0.0.1:49333/solr got event WatchedEvent state:SyncConnected type:None path:null path:null type:None
[junit4:junit4]   2> 12181 T24 oascc.ConnectionManager.waitForConnected Client is connected to ZooKeeper
[junit4:junit4]   2> 12183 T29 oazs.PrepRequestProcessor.pRequest Got user-level KeeperException when processing sessionid:0x139d12f39a30006 type:create cxid:0x1 zxid:0xfffffffffffffffe txntype:unknown reqpath:n/a Error Path:/solr/overseer Error:KeeperErrorCode = NodeExists for /solr/overseer
[junit4:junit4]   2> 12184 T29 oazs.PrepRequestProcessor.pRequest Got user-level KeeperException when processing sessionid:0x139d12f39a30006 type:create cxid:0x2 zxid:0xfffffffffffffffe txntype:unknown reqpath:n/a Error Path:/solr/overseer Error:KeeperErrorCode = NodeExists for /solr/overseer
[junit4:junit4]   2> 12192 T24 oasc.ZkController.createEphemeralLiveNode Register node as live in ZooKeeper:/live_nodes/127.0.0.1:20775_solr
[junit4:junit4]   2> 12194 T29 oazs.PrepRequestProcessor.pRequest Got user-level KeeperException when processing sessionid:0x139d12f39a30006 type:delete cxid:0x4 zxid:0xfffffffffffffffe txntype:unknown reqpath:n/a Error Path:/solr/live_nodes/127.0.0.1:20775_solr Error:KeeperErrorCode = NoNode for /solr/live_nodes/127.0.0.1:20775_solr
[junit4:junit4]   2> 12194 T24 oascc.SolrZkClient.makePath makePath: /live_nodes/127.0.0.1:20775_solr
[junit4:junit4]   2> 12197 T85 oascc.ZkStateReader$3.process Updating live nodes
[junit4:junit4]   2> 12197 T45 oascc.ZkStateReader$3.process Updating live nodes
[junit4:junit4]   2> 12197 T59 oascc.ZkStateReader$3.process Updating live nodes
[junit4:junit4]   2> 12197 T71 oascc.ZkStateReader$3.process Updating live nodes
[junit4:junit4]   2> 12199 T24 oashc.HttpShardHandlerFactory.getParameter Setting socketTimeout to: 0
[junit4:junit4]   2> 12200 T24 oashc.HttpShardHandlerFactory.getParameter Setting urlScheme to: http://
[junit4:junit4]   2> 12200 T24 oashc.HttpShardHandlerFactory.getParameter Setting connTimeout to: 0
[junit4:junit4]   2> 12201 T24 oashc.HttpShardHandlerFactory.getParameter Setting maxConnectionsPerHost to: 20
[junit4:junit4]   2> 12201 T24 oashc.HttpShardHandlerFactory.getParameter Setting corePoolSize to: 0
[junit4:junit4]   2> 12202 T24 oashc.HttpShardHandlerFactory.getParameter Setting maximumPoolSize to: 2147483647
[junit4:junit4]   2> 12203 T24 oashc.HttpShardHandlerFactory.getParameter Setting maxThreadIdleTime to: 5
[junit4:junit4]   2> 12203 T24 oashc.HttpShardHandlerFactory.getParameter Setting sizeOfQueue to: -1
[junit4:junit4]   2> 12204 T24 oashc.HttpShardHandlerFactory.getParameter Setting fairnessPolicy to: false
[junit4:junit4]   2> 12205 T24 oascsi.HttpClientUtil.createClient Creating new http client, config:maxConnectionsPerHost=20&maxConnections=10000&socketTimeout=0&connTimeout=0&retry=false
[junit4:junit4]   2> 12230 T24 oascc.ZkStateReader.createClusterStateWatchersAndUpdate Updating cluster state from ZooKeeper... 
[junit4:junit4]   2> 12239 T24 oasc.CoreContainer.create Creating SolrCore 'collection1' using instanceDir: /usr/home/hudson/hudson-slave/workspace/Lucene-Solr-Tests-4.x-Java6/solr/build/solr-core/test/J1/./solrtest-jetty4-1347834308365/collection1
[junit4:junit4]   2> 12239 T24 oasc.ZkController.createCollectionZkNode Check for collection zkNode:collection1
[junit4:junit4]   2> 12240 T24 oasc.ZkController.createCollectionZkNode Collection zkNode exists
[junit4:junit4]   2> 12241 T24 oasc.ZkController.readConfigName Load collection config from:/collections/collection1
[junit4:junit4]   2> 12243 T24 oasc.SolrResourceLoader.<init> new SolrResourceLoader for directory: '/usr/home/hudson/hudson-slave/workspace/Lucene-Solr-Tests-4.x-Java6/solr/build/solr-core/test/J1/./solrtest-jetty4-1347834308365/collection1/'
[junit4:junit4]   2> 12244 T24 oasc.SolrResourceLoader.replaceClassLoader Adding 'file:/usr/home/hudson/hudson-slave/workspace/Lucene-Solr-Tests-4.x-Java6/solr/build/solr-core/test/J1/solrtest-jetty4-1347834308365/collection1/lib/README' to classloader
[junit4:junit4]   2> 12245 T24 oasc.SolrResourceLoader.replaceClassLoader Adding 'file:/usr/home/hudson/hudson-slave/workspace/Lucene-Solr-Tests-4.x-Java6/solr/build/solr-core/test/J1/solrtest-jetty4-1347834308365/collection1/lib/classes/' to classloader
[junit4:junit4]   2> 12301 T24 oasc.SolrConfig.<init> Using Lucene MatchVersion: LUCENE_40
[junit4:junit4]   2> 12375 T24 oasc.SolrConfig.<init> Loaded SolrConfig: solrconfig.xml
[junit4:junit4]   2> 12477 T24 oass.IndexSchema.readSchema Reading Solr Schema
[junit4:junit4]   2> 12485 T24 oass.IndexSchema.readSchema Schema name=test
[junit4:junit4]   2>  C3_STATE=coll:collection1 core:collection1 props:{shard=shard1, roles=null, state=recovering, core=collection1, collection=collection1, node_name=127.0.0.1:32323_solr, base_url=http://127.0.0.1:32323/solr}
[junit4:junit4]   2> 12570 T73 C3 P32323 oasc.RecoveryStrategy.doRecovery Begin buffering updates. core=collection1
[junit4:junit4]   2> 12570 T73 C3 P32323 oasu.UpdateLog.bufferUpdates Starting to buffer updates. FSUpdateLog{state=ACTIVE, tlog=null}
[junit4:junit4]   2> 12570 T73 C3 P32323 oasc.RecoveryStrategy.replicate Attempting to replicate from http://127.0.0.1:32069/solr/collection1/. core=collection1
[junit4:junit4]   2> 12571 T73 C3 P32323 oascsi.HttpClientUtil.createClient Creating new http client, config:maxConnections=128&maxConnectionsPerHost=32&followRedirects=false
[junit4:junit4]   2> 12598 T54 C4 P32069 oascsi.HttpClientUtil.createClient Creating new http client, config:maxConnections=500&maxConnectionsPerHost=16
[junit4:junit4]   2> 12614 T54 C4 P32069 oasu.DirectUpdateHandler2.commit start commit{flags=0,_version_=0,optimize=false,openSearcher=true,waitSearcher=true,expungeDeletes=false,softCommit=false}
[junit4:junit4]   2> 12620 T54 C4 P32069 oasc.SolrDeletionPolicy.onInit SolrDeletionPolicy.onInit: commits:num=1
[junit4:junit4]   2> 		commit{dir=NRTCachingDirectory(org.apache.lucene.store.NIOFSDirectory@/usr/home/hudson/hudson-slave/workspace/Lucene-Solr-Tests-4.x-Java6/solr/build/solr-core/test/J1/org.apache.solr.cloud.SyncSliceTest-1347834296411/jetty1/index lockFactory=org.apache.lucene.store.NativeFSLockFactory@71f5ba55; maxCacheMB=48.0 maxMergeSizeMB=4.0),segFN=segments_1,generation=1,filenames=[segments_1]
[junit4:junit4]   2> 12621 T54 C4 P32069 oasc.SolrDeletionPolicy.updateCommits newest commit = 1
[junit4:junit4]   2> 12623 T54 C4 P32069 oass.SolrIndexSearcher.<init> Opening Searcher@45d13f05 main
[junit4:junit4]   2> 12623 T54 C4 P32069 oasu.DirectUpdateHandler2.commit end_commit_flush
[junit4:junit4]   2> 12626 T60 oasc.SolrCore.registerSearcher [collection1] Registered new searcher Searcher@45d13f05 main{StandardDirectoryReader(segments_1:1)}
[junit4:junit4]   2> 12630 T54 C4 P32069 /update {waitSearcher=true&commit=true&commit_end_point=true&wt=javabin&softCommit=false&version=2} {commit=} 0 46
[junit4:junit4]   2> 12690 T73 C3 P32323 oash.ReplicationHandler.inform Commits will be reserved for  10000
[junit4:junit4]   2> 12691 T73 C3 P32323 oascsi.HttpClientUtil.createClient Creating new http client, config:connTimeout=5000&socketTimeout=20000&allowCompression=false&maxConnections=10000&maxConnectionsPerHost=10000
[junit4:junit4]   2> 12714 T73 C3 P32323 oash.SnapPuller.<init>  No value set for 'pollInterval'. Timer Task not started.
[junit4:junit4]   2> 12755 T55 C4 P32069 oash.ReplicationHandler.inform Commits will be reserved for  10000
[junit4:junit4]   2> 12755 T55 C4 P32069 REQ /replication {command=indexversion&wt=javabin&qt=/replication&version=2} status=0 QTime=39 
[junit4:junit4]   2> 12762 T73 C3 P32323 oasc.SolrDeletionPolicy.onInit SolrDeletionPolicy.onInit: commits:num=1
[junit4:junit4]   2> 		commit{dir=NRTCachingDirectory(org.apache.lucene.store.NIOFSDirectory@/usr/home/hudson/hudson-slave/workspace/Lucene-Solr-Tests-4.x-Java6/solr/build/solr-core/test/J1/org.apache.solr.cloud.SyncSliceTest-1347834296411/jetty2/index lockFactory=org.apache.lucene.store.NativeFSLockFactory@6f866002; maxCacheMB=48.0 maxMergeSizeMB=4.0),segFN=segments_1,generation=1,filenames=[segments_1]
[junit4:junit4]   2> 12762 T73 C3 P32323 oasc.SolrDeletionPolicy.updateCommits newest commit = 1
[junit4:junit4]   2> 12763 T73 C3 P32323 oasu.DirectUpdateHandler2.commit start commit{flags=0,_version_=0,optimize=false,openSearcher=true,waitSearcher=true,expungeDeletes=false,softCommit=false}
[junit4:junit4]   2> 12787 T73 C3 P32323 oasc.SolrDeletionPolicy.onCommit SolrDeletionPolicy.onCommit: commits:num=2
[junit4:junit4]   2> 		commit{dir=NRTCachingDirectory(org.apache.lucene.store.NIOFSDirectory@/usr/home/hudson/hudson-slave/workspace/Lucene-Solr-Tests-4.x-Java6/solr/build/solr-core/test/J1/org.apache.solr.cloud.SyncSliceTest-1347834296411/jetty2/index lockFactory=org.apache.lucene.store.NativeFSLockFactory@6f866002; maxCacheMB=48.0 maxMergeSizeMB=4.0),segFN=segments_1,generation=1,filenames=[segments_1]
[junit4:junit4]   2> 		commit{dir=NRTCachingDirectory(org.apache.lucene.store.NIOFSDirectory@/usr/home/hudson/hudson-slave/workspace/Lucene-Solr-Tests-4.x-Java6/solr/build/solr-core/test/J1/org.apache.solr.cloud.SyncSliceTest-1347834296411/jetty2/index lockFactory=org.apache.lucene.store.NativeFSLockFactory@6f866002; maxCacheMB=48.0 maxMergeSizeMB=4.0),segFN=segments_2,generation=2,filenames=[segments_2]
[junit4:junit4]   2> 12787 T73 C3 P32323 oasc.SolrDeletionPolicy.updateCommits newest commit = 2
[junit4:junit4]   2> 12792 T73 C3 P32323 oass.SolrIndexSearcher.<init> Opening Searcher@e75a11 main
[junit4:junit4]   2> 12792 T73 C3 P32323 oasu.DirectUpdateHandler2.commit end_commit_flush
[junit4:junit4]   2> 12794 T72 oasc.SolrCore.registerSearcher [collection1] Registered new searcher Searcher@e75a11 main{StandardDirectoryReader(segments_2:2)}
[junit4:junit4]   2> 12795 T73 C3 P32323 oasc.RecoveryStrategy.replay No replay needed. core=collection1
[junit4:junit4]   2> 12795 T73 C3 P32323 oasc.RecoveryStrategy.doRecovery Replication Recovery was successful - registering as Active. core=collection1
[junit4:junit4]   2> 12797 T73 C3 P32323 oasc.RecoveryStrategy.doRecovery Finished recovery process. core=collection1
[junit4:junit4]   2> 13020 T46 oascc.ZkStateReader.updateClusterState Updating cloud state from ZooKeeper... 
[junit4:junit4]   2> 13073 T85 oascc.ZkStateReader$2.process A cluster state change has occurred - updating...
[junit4:junit4]   2> 13073 T45 oascc.ZkStateReader$2.process A cluster state change has occurred - updating...
[junit4:junit4]   2> 13073 T59 oascc.ZkStateReader$2.process A cluster state change has occurred - updating...
[junit4:junit4]   2> 13073 T99 oascc.ZkStateReader$2.process A cluster state change has occurred - updating...
[junit4:junit4]   2> 13073 T71 oascc.ZkStateReader$2.process A cluster state change has occurred - updating...
[junit4:junit4]   2> 13259 T24 oass.OpenExchangeRatesOrgProvider.init Initialized with rates=open-exchange-rates.json, refreshInterval=1440.
[junit4:junit4]   2> 13274 T24 oass.IndexSchema.readSchema default search field in schema is text
[junit4:junit4]   2> 13279 T24 oass.IndexSchema.readSchema unique key field: id
[junit4:junit4]   2> 13305 T24 oass.FileExchangeRateProvider.reload Reloading exchange rates from file currency.xml
[junit4:junit4]   2> 13318 T24 oass.FileExchangeRateProvider.reload Reloading exchange rates from file currency.xml
[junit4:junit4]   2> 13327 T24 oass.OpenExchangeRatesOrgProvider.reload Reloading exchange rates from open-exchange-rates.json
[junit4:junit4]   2> 13330 T24 oass.OpenExchangeRatesOrgProvider.reload Reloading exchange rates from open-exchange-rates.json
[junit4:junit4]   2> 13333 T24 oasc.SolrCore.<init> [collection1] Opening new SolrCore at /usr/home/hudson/hudson-slave/workspace/Lucene-Solr-Tests-4.x-Java6/solr/build/solr-core/test/J1/./solrtest-jetty4-1347834308365/collection1/, dataDir=./org.apache.solr.cloud.SyncSliceTest-1347834296411/jetty4/
[junit4:junit4]   2> 13334 T24 oasc.JmxMonitoredMap.<init> JMX monitoring is enabled. Adding Solr mbeans to JMX Server: com.sun.jmx.mbeanserver.JmxMBeanServer@5c09624
[junit4:junit4]   2> 13336 T24 oasc.SolrCore.getNewIndexDir WARNING New index directory detected: old=null new=./org.apache.solr.cloud.SyncSliceTest-1347834296411/jetty4/index/
[junit4:junit4]   2> 13337 T24 oasc.SolrCore.initIndex WARNING [collection1] Solr index directory './org.apache.solr.cloud.SyncSliceTest-1347834296411/jetty4/index' doesn't exist. Creating new index...
[junit4:junit4]   2> 13338 T24 oasc.CachingDirectoryFactory.get return new directory for /usr/home/hudson/hudson-slave/workspace/Lucene-Solr-Tests-4.x-Java6/solr/build/solr-core/test/J1/./org.apache.solr.cloud.SyncSliceTest-1347834296411/jetty4/index forceNew:false
[junit4:junit4]   2> 13348 T24 oasc.SolrDeletionPolicy.onCommit SolrDeletionPolicy.onCommit: commits:num=1
[junit4:junit4]   2> 		commit{dir=NRTCachingDirectory(org.apache.lucene.store.NIOFSDirectory@/usr/home/hudson/hudson-slave/workspace/Lucene-Solr-Tests-4.x-Java6/solr/build/solr-core/test/J1/org.apache.solr.cloud.SyncSliceTest-1347834296411/jetty4/index lockFactory=org.apache.lucene.store.NativeFSLockFactory@17827d26; maxCacheMB=48.0 maxMergeSizeMB=4.0),segFN=segments_1,generation=1,filenames=[segments_1]
[junit4:junit4]   2> 13349 T24 oasc.SolrDeletionPolicy.updateCommits newest commit = 1
[junit4:junit4]   2> 13350 T24 oasc.SolrCore.initWriters created xml: solr.XMLResponseWriter
[junit4:junit4]   2> 13352 T24 oasup.UpdateRequestProcessorChain.init inserting DistributedUpdateProcessorFactory into updateRequestProcessorChain "dedupe"
[junit4:junit4]   2> 13353 T24 oasup.UpdateRequestProcessorChain.init inserting DistributedUpdateProcessorFactory into updateRequestProcessorChain "dedupe-allfields"
[junit4:junit4]   2> 13353 T24 oasup.UpdateRequestProcessorChain.init inserting DistributedUpdateProcessorFactory into updateRequestProcessorChain "stored_sig"
[junit4:junit4]   2> 13354 T24 oasup.UpdateRequestProcessorChain.init inserting DistributedUpdateProcessorFactory into updateRequestProcessorChain "uniq-fields"
[junit4:junit4]   2> 13354 T24 oasup.UpdateRequestProcessorChain.init inserting DistributedUpdateProcessorFactory into updateRequestProcessorChain "distrib-dup-test-chain-implicit"
[junit4:junit4]   2> 13355 T24 oasc.RequestHandlers.initHandlersFromConfig adding lazy requestHandler: solr.ReplicationHandler
[junit4:junit4]   2> 13355 T24 oasc.RequestHandlers.initHandlersFromConfig created /replication: solr.ReplicationHandler
[junit4:junit4]   2> 13356 T24 oasc.RequestHandlers.initHandlersFromConfig created standard: solr.StandardRequestHandler
[junit4:junit4]   2> 13357 T24 oasc.RequestHandlers.initHandlersFromConfig created /get: solr.RealTimeGetHandler
[junit4:junit4]   2> 13357 T24 oasc.RequestHandlers.initHandlersFromConfig created dismax: solr.SearchHandler
[junit4:junit4]   2> 13358 T24 oasc.RequestHandlers.initHandlersFromConfig created mock: org.apache.solr.core.MockQuerySenderListenerReqHandler
[junit4:junit4]   2> 13359 T24 oasc.RequestHandlers.initHandlersFromConfig created /admin/: org.apache.solr.handler.admin.AdminHandlers
[junit4:junit4]   2> 13359 T24 oasc.RequestHandlers.initHandlersFromConfig created defaults: solr.StandardRequestHandler
[junit4:junit4]   2> 13360 T24 oasc.RequestHandlers.initHandlersFromConfig adding lazy requestHandler: solr.StandardRequestHandler
[junit4:junit4]   2> 13360 T24 oasc.RequestHandlers.initHandlersFromConfig created lazy: solr.StandardRequestHandler
[junit4:junit4]   2> 13361 T24 oasc.RequestHandlers.initHandlersFromConfig created /update: solr.UpdateRequestHandler
[junit4:junit4]   2> 13361 T24 oasc.RequestHandlers.initHandlersFromConfig created /terms: org.apache.solr.handler.component.SearchHandler
[junit4:junit4]   2> 13362 T24 oasc.RequestHandlers.initHandlersFromConfig created spellCheckCompRH: org.apache.solr.handler.component.SearchHandler
[junit4:junit4]   2> 13363 T24 oasc.RequestHandlers.initHandlersFromConfig created spellCheckCompRH_Direct: org.apache.solr.handler.component.SearchHandler
[junit4:junit4]   2> 13363 T24 oasc.RequestHandlers.initHandlersFromConfig created spellCheckWithWordbreak: org.apache.solr.handler.component.SearchHandler
[junit4:junit4]   2> 13364 T24 oasc.RequestHandlers.initHandlersFromConfig created spellCheckWithWordbreak_Direct: org.apache.solr.handler.component.SearchHandler
[junit4:junit4]   2> 13365 T24 oasc.RequestHandlers.initHandlersFromConfig created spellCheckCompRH1: org.apache.solr.handler.component.SearchHandler
[junit4:junit4]   2> 13365 T24 oasc.RequestHandlers.initHandlersFromConfig created tvrh: org.apache.solr.handler.component.SearchHandler
[junit4:junit4]   2> 13366 T24 oasc.RequestHandlers.initHandlersFromConfig created /mlt: solr.MoreLikeThisHandler
[junit4:junit4]   2> 13367 T24 oasc.RequestHandlers.initHandlersFromConfig created /debug/dump: solr.DumpRequestHandler
[junit4:junit4]   2> 13370 T24 oashl.XMLLoader.init xsltCacheLifetimeSeconds=60
[junit4:junit4]   2> 13373 T24 oasc.SolrCore.initDeprecatedSupport WARNING solrconfig.xml uses deprecated <admin/gettableFiles>, Please update your config to use the ShowFileRequestHandler.
[junit4:junit4]   2> 13375 T24 oasc.SolrCore.initDeprecatedSupport WARNING adding ShowFileRequestHandler with hidden files: [SCHEMA.XML, OLD_SYNONYMS.TXT, STOPWORDS.TXT, PROTWORDS.TXT, OPEN-EXCHANGE-RATES.JSON, SYNONYMS.TXT, CURRENCY.XML, MAPPING-ISOLATIN1ACCENT.TXT]
[junit4:junit4]   2> 13379 T24 oass.SolrIndexSearcher.<init> Opening Searcher@10c68663 main
[junit4:junit4]   2> 13380 T24 oasu.CommitTracker.<init> Hard AutoCommit: disabled
[junit4:junit4]   2> 13380 T24 oasu.CommitTracker.<init> Soft AutoCommit: disabled
[junit4:junit4]   2> 13381 T24 oashc.SpellCheckComponent.inform Initializing spell checkers
[junit4:junit4]   2> 13387 T24 oass.DirectSolrSpellChecker.init init: {name=direct,classname=DirectSolrSpellChecker,field=lowerfilt,minQueryLength=3}
[junit4:junit4]   2> 13438 T100 oasc.SolrCore.registerSearcher [collection1] Registered new searcher Searcher@10c68663 main{StandardDirectoryReader(segments_1:1)}
[junit4:junit4]   2> 13579 T46 oascc.ZkStateReader.updateClusterState Updating cloud state from ZooKeeper... 
[junit4:junit4]   2> 13596 T85 oascc.ZkStateReader$2.process A cluster state change has occurred - updating...
[junit4:junit4]   2> 13596 T45 oascc.ZkStateReader$2.process A cluster state change has occurred - updating...
[junit4:junit4]   2> 13596 T99 oascc.ZkStateReader$2.process A cluster state change has occurred - updating...
[junit4:junit4]   2> 13596 T59 oascc.ZkStateReader$2.process A cluster state change has occurred - updating...
[junit4:junit4]   2> 13596 T71 oascc.ZkStateReader$2.process A cluster state change has occurred - updating...
[junit4:junit4]   2> 13946 T24 oasc.CoreContainer.register registering core: collection1
[junit4:junit4]   2> 13946 T24 oasc.ZkController.register Register shard - core:collection1 address:http://127.0.0.1:20775/solr shardId:shard1
[junit4:junit4]   2> 13956 T24 oasc.ZkController.register We are http://127.0.0.1:20775/solr/collection1/ and leader is http://127.0.0.1:32069/solr/collection1/
[junit4:junit4]   2> 13956 T24 oasc.ZkController.register No LogReplay needed for core=collection1 baseURL=http://127.0.0.1:20775/solr
[junit4:junit4]   2> 13957 T24 oasc.ZkController.checkRecovery Core needs to recover:collection1
[junit4:junit4]   2> 13958 T24 oasu.DefaultSolrCoreState.doRecovery Running recovery - first canceling any ongoing recovery
[junit4:junit4]   2> ASYNC  NEW_CORE C6 name=collection1 org.apache.solr.core.SolrCore@6243d0cb url=http://127.0.0.1:20775/solr/collection1 node=127.0.0.1:20775_solr
[junit4:junit4]   2> 13959 T101 C6 P20775 oasc.RecoveryStrategy.run Starting recovery process.  core=collection1 recoveringAfterStartup=true
[junit4:junit4]   2> 13959 T101 C6 P20775 oasc.RecoveryStrategy.doRecovery ###### startupVersions=[]
[junit4:junit4]   2> 13960 T24 oascc.ZkStateReader.updateClusterState Updating cloud state from ZooKeeper... 
[junit4:junit4]   2> 13961 T101 C6 P20775 oasc.RecoveryStrategy.doRecovery Attempting to PeerSync from http://127.0.0.1:32069/solr/collection1/ core=collection1 - recoveringAfterStartup=true
[junit4:junit4]   2> 13962 T101 C6 P20775 oasu.PeerSync.sync PeerSync: core=collection1 url=http://127.0.0.1:20775/solr START replicas=[http://127.0.0.1:32069/solr/collection1/] nUpdates=100
[junit4:junit4]   2> 13962 T24 oass.SolrDispatchFilter.init user.dir=/usr/home/hudson/hudson-slave/workspace/Lucene-Solr-Tests-4.x-Java6/solr/build/solr-core/test/J1
[junit4:junit4]   2> 13962 T101 C6 P20775 oasu.PeerSync.sync WARNING no frame of reference to tell of we've missed updates
[junit4:junit4]   2> 13962 T24 oass.SolrDispatchFilter.init SolrDispatchFilter.init() done
[junit4:junit4]   2> 13963 T101 C6 P20775 oasc.RecoveryStrategy.doRecovery PeerSync Recovery was not successful - trying replication. core=collection1
[junit4:junit4]   2> 13963 T101 C6 P20775 oasc.RecoveryStrategy.doRecovery Starting Replication Recovery. core=collection1
[junit4:junit4]   2> 13963 T24 oascsi.HttpClientUtil.createClient Creating new http client, config:maxConnections=128&maxConnectionsPerHost=32&followRedirects=false
[junit4:junit4]   2> 13964 T101 C6 P20775 oascsi.HttpClientUtil.createClient Creating new http client, config:maxConnections=128&maxConnectionsPerHost=32&followRedirects=false
[junit4:junit4]   2> 13966 T51 C4 P32069 REQ /get {distrib=false&qt=/get&wt=javabin&version=2&getVersions=100} status=0 QTime=0 
[junit4:junit4]   2> 13986 T24 oaz.ZooKeeper.<init> Initiating client connection, connectString=127.0.0.1:49333/solr sessionTimeout=10000 watcher=org.apache.solr.common.cloud.ConnectionManager@13a1d5cb
[junit4:junit4]   2> 13988 T103 oaz.ClientCnxn$SendThread.startConnect Opening socket connection to server /127.0.0.1:49333
[junit4:junit4]   2> 13988 T24 oascc.ConnectionManager.waitForConnected Waiting for client to connect to ZooKeeper
[junit4:junit4]   2> 13989 T103 oaz.ClientCnxn$SendThread.primeConnection Socket connection established to localhost/127.0.0.1:49333, initiating session
[junit4:junit4]   2> 13989 T26 oazs.NIOServerCnxn$Factory.run Accepted socket connection from /140.211.11.196:58770
[junit4:junit4]   2> 13990 T26 oazs.NIOServerCnxn.readConnectRequest Client attempting to establish new session at /140.211.11.196:58770
[junit4:junit4]   2> 13991 T28 oazs.NIOServerCnxn.finishSessionInit Established session 0x139d12f39a30007 with negotiated timeout 10000 for client /140.211.11.196:58770
[junit4:junit4]   2> 13991 T103 oaz.ClientCnxn$SendThread.readConnectResult Session establishment complete on server localhost/127.0.0.1:49333, sessionid = 0x139d12f39a30007, negotiated timeout = 10000
[junit4:junit4]   2> 13992 T104 oascc.ConnectionManager.process Watcher org.apache.solr.common.cloud.ConnectionManager@13a1d5cb name:ZooKeeperConnection Watcher:127.0.0.1:49333/solr got event WatchedEvent state:SyncConnected type:None path:null path:null type:None
[junit4:junit4]   2> 13992 T24 oascc.ConnectionManager.waitForConnected Client is connected to ZooKeeper
[junit4:junit4]   2> 13993 T24 oascc.ZkStateReader.createClusterStateWatchersAndUpdate Updating cluster state from ZooKeeper... 
[junit4:junit4]   2> 13997 T24 oasc.ChaosMonkey.monkeyLog monkey: init - expire sessions:true cause connection loss:true
[junit4:junit4]   2> 13998 T24 oascsi.HttpClientUtil.createClient Creating new http client, config:
[junit4:junit4]   2> 14009 T24 oascc.ZkStateReader.updateClusterState Updating cloud state from ZooKeeper... 
[junit4:junit4]   2> 14012 T24 oasc.AbstractFullDistribZkTestBase.waitForThingsToLevelOut Wait for recoveries to finish - wait 15 for each attempt
[junit4:junit4]   2> 14012 T24 oasc.AbstractDistribZkTestBase.waitForRecoveriesToFinish Wait for recoveries to finish - collection: collection1 failOnTimeout:true timeout (sec):15
[junit4:junit4]   2> 14013 T24 oascc.ZkStateReader.updateClusterState Updating cloud state from ZooKeeper... 
[junit4:junit4]   2> 14101 T46 oascc.ZkStateReader.updateClusterState Updating cloud state from ZooKeeper... 
[junit4:junit4]   2> 14116 T45 oascc.ZkStateReader$2.process A cluster state change has occurred - updating...
[junit4:junit4]   2> 14116 T85 oascc.ZkStateReader$2.process A cluster state change has occurred - updating...
[junit4:junit4]   2> 14116 T99 oascc.ZkStateReader$2.process A cluster state change has occurred - updating...
[junit4:junit4]   2> 14116 T104 oascc.ZkStateReader$2.process A cluster state change has occurred - updating...
[junit4:junit4]   2> 14116 T59 oascc.ZkStateReader$2.process A cluster state change has occurred - updating...
[junit4:junit4]   2> 14116 T71 oascc.ZkStateReader$2.process A cluster state change has occurred - updating...
[junit4:junit4]   2>  C5_STATE=coll:collection1 core:collection1 props:{shard=shard1, roles=null, state=recovering, core=collection1, collection=collection1, node_name=127.0.0.1:56610_solr, base_url=http://127.0.0.1:56610/solr}
[junit4:junit4]   2> 14968 T87 C5 P56610 oasc.RecoveryStrategy.doRecovery Begin buffering updates. core=collection1
[junit4:junit4]   2> 14968 T87 C5 P56610 oasu.UpdateLog.bufferUpdates Starting to buffer updates. FSUpdateLog{state=ACTIVE, tlog=null}
[junit4:junit4]   2> 14969 T87 C5 P56610 oasc.RecoveryStrategy.replicate Attempting to replicate from http://127.0.0.1:32069/solr/collection1/. core=collection1
[junit4:junit4]   2> 14969 T87 C5 P56610 oascsi.HttpClientUtil.createClient Creating new http client, config:maxConnections=128&maxConnectionsPerHost=32&followRedirects=false
[junit4:junit4]   2> 14978 T57 C4 P32069 oasu.DirectUpdateHandler2.commit start commit{flags=0,_version_=0,optimize=false,openSearcher=true,waitSearcher=true,expungeDeletes=false,softCommit=false}
[junit4:junit4]   2> 14981 T57 C4 P32069 oass.SolrIndexSearcher.<init> Opening Searcher@a1e5879 main
[junit4:junit4]   2> 14981 T57 C4 P32069 oasu.DirectUpdateHandler2.commit end_commit_flush
[junit4:junit4]   2> 14983 T60 oasc.SolrCore.registerSearcher [collection1] Registered new searcher Searcher@a1e5879 main{StandardDirectoryReader(segments_1:1)}
[junit4:junit4]   2> 14983 T57 C4 P32069 /update {waitSearcher=true&commit=true&commit_end_point=true&wt=javabin&softCommit=false&version=2} {commit=} 0 5
[junit4:junit4]   2> 14985 T87 C5 P56610 oash.ReplicationHandler.inform Commits will be reserved for  10000
[junit4:junit4]   2> 14985 T87 C5 P56610 oash.SnapPuller.<init>  No value set for 'pollInterval'. Timer Task not started.
[junit4:junit4]   2> 14989 T55 C4 P32069 REQ /replication {command=indexversion&wt=javabin&qt=/replication&version=2} status=0 QTime=1 
[junit4:junit4]   2> 14994 T87 C5 P56610 oasc.SolrDeletionPolicy.onInit SolrDeletionPolicy.onInit: commits:num=1
[junit4:junit4]   2> 		commit{dir=NRTCachingDirectory(org.apache.lucene.store.NIOFSDirectory@/usr/home/hudson/hudson-slave/workspace/Lucene-Solr-Tests-4.x-Java6/solr/build/solr-core/test/J1/org.apache.solr.cloud.SyncSliceTest-1347834296411/jetty3/index lockFactory=org.apache.lucene.store.NativeFSLockFactory@3eb2aa1c; maxCacheMB=48.0 maxMergeSizeMB=4.0),segFN=segments_1,generation=1,filenames=[segments_1]
[junit4:junit4]   2> 14995 T87 C5 P56610 oasc.SolrDeletionPolicy.updateCommits newest commit = 1
[junit4:junit4]   2> 14996 T87 C5 P56610 oasu.DirectUpdateHandler2.commit start commit{flags=0,_version_=0,optimize=false,openSearcher=true,waitSearcher=true,expungeDeletes=false,softCommit=false}
[junit4:junit4]   2> 15015 T24 oascc.ZkStateReader.updateClusterState Updating cloud state from ZooKeeper... 
[junit4:junit4]   2> 15031 T87 C5 P56610 oasc.SolrDeletionPolicy.onCommit SolrDeletionPolicy.onCommit: commits:num=2
[junit4:junit4]   2> 		commit{dir=NRTCachingDirectory(org.apache.lucene.store.NIOFSDirectory@/usr/home/hudson/hudson-slave/workspace/Lucene-Solr-Tests-4.x-Java6/solr/build/solr-core/test/J1/org.apache.solr.cloud.SyncSliceTest-1347834296411/jetty3/index lockFactory=org.apache.lucene.store.NativeFSLockFactory@3eb2aa1c; maxCacheMB=48.0 maxMergeSizeMB=4.0),segFN=segments_1,generation=1,filenames=[segments_1]
[junit4:junit4]   2> 		commit{dir=NRTCachingDirectory(org.apache.lucene.store.NIOFSDirectory@/usr/home/hudson/hudson-slave/workspace/Lucene-Solr-Tests-4.x-Java6/solr/build/solr-core/test/J1/org.apache.solr.cloud.SyncSliceTest-1347834296411/jetty3/index lockFactory=org.apache.lucene.store.NativeFSLockFactory@3eb2aa1c; maxCacheMB=48.0 maxMergeSizeMB=4.0),segFN=segments_2,generation=2,filenames=[segments_2]
[junit4:junit4]   2> 15031 T87 C5 P56610 oasc.SolrDeletionPolicy.updateCommits newest commit = 2
[junit4:junit4]   2> 15036 T87 C5 P56610 oass.SolrIndexSearcher.<init> Opening Searcher@bdf6623 main
[junit4:junit4]   2> 15036 T87 C5 P56610 oasu.DirectUpdateHandler2.commit end_commit_flush
[junit4:junit4]   2> 15039 T86 oasc.SolrCore.registerSearcher [collection1] Registered new searcher Searcher@bdf6623 main{StandardDirectoryReader(segments_2:2)}
[junit4:junit4]   2> 15039 T87 C5 P56610 oasc.RecoveryStrategy.replay No replay needed. core=collection1
[junit4:junit4]   2> 15040 T87 C5 P56610 oasc.RecoveryStrategy.doRecovery Replication Recovery was successful - registering as Active. core=collection1
[junit4:junit4]   2> 15042 T87 C5 P56610 oasc.RecoveryStrategy.doRecovery Finished recovery process. core=collection1
[junit4:junit4]   2> 15124 T46 oascc.ZkStateReader.updateClusterState Updating cloud state from ZooKeeper... 
[junit4:junit4]   2> 15143 T45 oascc.ZkStateReader$2.process A cluster state change has occurred - updating...
[junit4:junit4]   2> 15143 T85 oascc.ZkStateReader$2.process A cluster state change has occurred - updating...
[junit4:junit4]   2> 15143 T99 oascc.ZkStateReader$2.process A cluster state change has occurred - updating...
[junit4:junit4]   2> 15143 T71 oascc.ZkStateReader$2.process A cluster state change has occurred - updating...
[junit4:junit4]   2> 15143 T104 oascc.ZkStateReader$2.process A cluster state change has occurred - updating...
[junit4:junit4]   2> 15143 T59 oascc.ZkStateReader$2.process A cluster state change has occurred - updating...
[junit4:junit4]   2> 16019 T24 oascc.ZkStateReader.updateClusterState Updating cloud state from ZooKeeper... 
[junit4:junit4]   2>  C6_STATE=coll:collection1 core:collection1 props:{shard=shard1, roles=null, state=recovering, core=collection1, collection=collection1, node_name=127.0.0.1:20775_solr, base_url=http://127.0.0.1:20775/solr}
[junit4:junit4]   2> 16985 T101 C6 P20775 oasc.RecoveryStrategy.doRecovery Begin buffering updates. core=collection1
[junit4:junit4]   2> 16985 T101 C6 P20775 oasu.UpdateLog.bufferUpdates Starting to buffer updates. FSUpdateLog{state=ACTIVE, tlog=null}
[junit4:junit4]   2> 16985 T101 C6 P20775 oasc.RecoveryStrategy.replicate Attempting to replicate from http://127.0.0.1:32069/solr/collection1/. core=collection1
[junit4:junit4]   2> 16986 T101 C6 P20775 oascsi.HttpClientUtil.createClient Creating new http client, config:maxConnections=128&maxConnectionsPerHost=32&followRedirects=false
[junit4:junit4]   2> 16998 T52 C4 P32069 oasu.DirectUpdateHandler2.commit start commit{flags=0,_version_=0,optimize=false,openSearcher=true,waitSearcher=true,expungeDeletes=false,softCommit=false}
[junit4:junit4]   2> 17000 T52 C4 P32069 oass.SolrIndexSearcher.<init> Opening Searcher@4e4f2c1c main
[junit4:junit4]   2> 17001 T52 C4 P32069 oasu.DirectUpdateHandler2.commit end_commit_flush
[junit4:junit4]   2> 17002 T60 oasc.SolrCore.registerSearcher [collection1] Registered new searcher Searcher@4e4f2c1c main{StandardDirectoryReader(segments_1:1)}
[junit4:junit4]   2> 17003 T52 C4 P32069 /update {waitSearcher=true&commit=true&commit_end_point=true&wt=javabin&softCommit=false&version=2} {commit=} 0 5
[junit4:junit4]   2> 17004 T101 C6 P20775 oash.ReplicationHandler.inform Commits will be reserved for  10000
[junit4:junit4]   2> 17004 T101 C6 P20775 oash.SnapPuller.<init>  No value set for 'pollInterval'. Timer Task not started.
[junit4:junit4]   2> 17006 T55 C4 P32069 REQ /replication {command=indexversion&wt=javabin&qt=/replication&version=2} status=0 QTime=0 
[junit4:junit4]   2> 17010 T101 C6 P20775 oasc.SolrDeletionPolicy.onInit SolrDeletionPolicy.onInit: commits:num=1
[junit4:junit4]   2> 		commit{dir=NRTCachingDirectory(org.apache.lucene.store.NIOFSDirectory@/usr/home/hudson/hudson-slave/workspace/Lucene-Solr-Tests-4.x-Java6/solr/build/solr-core/test/J1/org.apache.solr.cloud.SyncSliceTest-1347834296411/jetty4/index lockFactory=org.apache.lucene.store.NativeFSLockFactory@17827d26; maxCacheMB=48.0 maxMergeSizeMB=4.0),segFN=segments_1,generation=1,filenames=[segments_1]
[junit4:junit4]   2> 17011 T101 C6 P20775 oasc.SolrDeletionPolicy.updateCommits newest commit = 1
[junit4:junit4]   2> 17011 T101 C6 P20775 oasu.DirectUpdateHandler2.commit start commit{flags=0,_version_=0,optimize=false,openSearcher=true,waitSearcher=true,expungeDeletes=false,softCommit=false}
[junit4:junit4]   2> 17014 T101 C6 P20775 oasc.SolrDeletionPolicy.onCommit SolrDeletionPolicy.onCommit: commits:num=2
[junit4:junit4]   2> 		commit{dir=NRTCachingDirectory(org.apache.lucene.store.NIOFSDirectory@/usr/home/hudson/hudson-slave/workspace/Lucene-Solr-Tests-4.x-Java6/solr/build/solr-core/test/J1/org.apache.solr.cloud.SyncSliceTest-1347834296411/jetty4/index lockFactory=org.apache.lucene.store.NativeFSLockFactory@17827d26; maxCacheMB=48.0 maxMergeSizeMB=4.0),segFN=segments_1,generation=1,filenames=[segments_1]
[junit4:junit4]   2> 		commit{dir=NRTCachingDirectory(org.apache.lucene.store.NIOFSDirectory@/usr/home/hudson/hudson-slave/workspace/Lucene-Solr-Tests-4.x-Java6/solr/build/solr-core/test/J1/org.apache.solr.cloud.SyncSliceTest-1347834296411/jetty4/index lockFactory=org.apache.lucene.store.NativeFSLockFactory@17827d26; maxCacheMB=48.0 maxMergeSizeMB=4.0),segFN=segments_2,generation=2,filenames=[segments_2]
[junit4:junit4]   2> 17015 T101 C6 P20775 oasc.SolrDeletionPolicy.updateCommits newest commit = 2
[junit4:junit4]   2> 17017 T101 C6 P20775 oass.SolrIndexSearcher.<init> Opening Searcher@397a82f main
[junit4:junit4]   2> 17018 T101 C6 P20775 oasu.DirectUpdateHandler2.commit end_commit_flush
[junit4:junit4]   2> 17019 T100 oasc.SolrCore.registerSearcher [collection1] Registered new searcher Searcher@397a82f main{StandardDirectoryReader(segments_2:2)}
[junit4:junit4]   2> 17020 T101 C6 P20775 oasc.RecoveryStrategy.replay No replay needed. core=collection1
[junit4:junit4]   2> 17020 T101 C6 P20775 oasc.RecoveryStrategy.doRecovery Replication Recovery was successful - registering as Active. core=collection1
[junit4:junit4]   2> 17036 T101 C6 P20775 oasc.RecoveryStrategy.doRecovery Finished recovery process. core=collection1
[junit4:junit4]   2> 17036 T24 oascc.ZkStateReader.updateClusterState Updating cloud state from ZooKeeper... 
[junit4:junit4]   2> 17155 T46 oascc.ZkStateReader.updateClusterState Updating cloud state from ZooKeeper... 
[junit4:junit4]   2> 17180 T45 oascc.ZkStateReader$2.process A cluster state change has occurred - updating...
[junit4:junit4]   2> 17180 T104 oascc.ZkStateReader$2.process A cluster state change has occurred - updating...
[junit4:junit4]   2> 17180 T71 oascc.ZkStateReader$2.process A cluster state change has occurred - updating...
[junit4:junit4]   2> 17180 T99 oascc.ZkStateReader$2.process A cluster state change has occurred - updating...
[junit4:junit4]   2> 17180 T85 oascc.ZkStateReader$2.process A cluster state change has occurred - updating...
[junit4:junit4]   2> 17180 T59 oascc.ZkStateReader$2.process A cluster state change has occurred - updating...
[junit4:junit4]   2> 18038 T24 oascc.ZkStateReader.updateClusterState Updating cloud state from ZooKeeper... 
[junit4:junit4]   2> ASYNC  NEW_CORE C7 name=collection1 org.apache.solr.core.SolrCore@27299442 url=http://127.0.0.1:38069/solr/collection1 node=127.0.0.1:38069_solr
[junit4:junit4]   2> 18048 T38 C7 P38069 oasu.DirectUpdateHandler2.commit start commit{flags=0,_version_=0,optimize=false,openSearcher=true,waitSearcher=true,expungeDeletes=false,softCommit=false}
[junit4:junit4]   2> 18051 T38 C7 P38069 oasc.SolrDeletionPolicy.onInit SolrDeletionPolicy.onInit: commits:num=1
[junit4:junit4]   2> 		commit{dir=NRTCachingDirectory(org.apache.lucene.store.NIOFSDirectory@/usr/home/hudson/hudson-slave/workspace/Lucene-Solr-Tests-4.x-Java6/solr/build/solr-core/test/J1/org.apache.solr.cloud.SyncSliceTest-1347834296411/control/data/index lockFactory=org.apache.lucene.store.NativeFSLockFactory@1c49094; maxCacheMB=48.0 maxMergeSizeMB=4.0),segFN=segments_1,generation=1,filenames=[segments_1]
[junit4:junit4]   2> 18052 T38 C7 P38069 oasc.SolrDeletionPolicy.updateCommits newest commit = 1
[junit4:junit4]   2> 18053 T38 C7 P38069 oass.SolrIndexSearcher.<init> Opening Searcher@73fbaf73 main
[junit4:junit4]   2> 18054 T38 C7 P38069 oasu.DirectUpdateHandler2.commit end_commit_flush
[junit4:junit4]   2> 18055 T48 oasc.SolrCore.registerSearcher [collection1] Registered new searcher Searcher@73fbaf73 main{StandardDirectoryReader(segments_1:1)}
[junit4:junit4]   2> 18056 T38 C7 P38069 /update {waitSearcher=true&wt=javabin&commit=true&softCommit=false&version=2} {commit=} 0 8
[junit4:junit4]   2> 18056 T24 oaz.ZooKeeper.<init> Initiating client connection, connectString=127.0.0.1:49333/solr sessionTimeout=10000 watcher=org.apache.solr.common.cloud.ConnectionManager@10bbe282
[junit4:junit4]   2> 18057 T105 oaz.ClientCnxn$SendThread.startConnect Opening socket connection to server /127.0.0.1:49333
[junit4:junit4]   2> 18057 T24 oascc.ConnectionManager.waitForConnected Waiting for client to connect to ZooKeeper
[junit4:junit4]   2> 18058 T105 oaz.ClientCnxn$SendThread.primeConnection Socket connection established to localhost/127.0.0.1:49333, initiating session
[junit4:junit4]   2> 18058 T26 oazs.NIOServerCnxn$Factory.run Accepted socket connection from /140.211.11.196:51211
[junit4:junit4]   2> 18059 T26 oazs.NIOServerCnxn.readConnectRequest Client attempting to establish new session at /140.211.11.196:51211
[junit4:junit4]   2> 18060 T28 oazs.NIOServerCnxn.finishSessionInit Established session 0x139d12f39a30008 with negotiated timeout 10000 for client /140.211.11.196:51211
[junit4:junit4]   2> 18060 T105 oaz.ClientCnxn$SendThread.readConnectResult Session establishment complete on server localhost/127.0.0.1:49333, sessionid = 0x139d12f39a30008, negotiated timeout = 10000
[junit4:junit4]   2> 18061 T106 oascc.ConnectionManager.process Watcher org.apache.solr.common.cloud.ConnectionManager@10bbe282 name:ZooKeeperConnection Watcher:127.0.0.1:49333/solr got event WatchedEvent state:SyncConnected type:None path:null path:null type:None
[junit4:junit4]   2> 18061 T24 oascc.ConnectionManager.waitForConnected Client is connected to ZooKeeper
[junit4:junit4]   2> 18062 T24 oascc.ZkStateReader.createClusterStateWatchersAndUpdate Updating cluster state from ZooKeeper... 
[junit4:junit4]   2> 18075 T54 C4 P32069 oasu.DirectUpdateHandler2.commit start commit{flags=0,_version_=0,optimize=false,openSearcher=true,waitSearcher=true,expungeDeletes=false,softCommit=false}
[junit4:junit4]   2> 18078 T54 C4 P32069 oass.SolrIndexSearcher.<init> Opening Searcher@2ad3eec2 main
[junit4:junit4]   2> 18078 T54 C4 P32069 oasu.DirectUpdateHandler2.commit end_commit_flush
[junit4:junit4]   2> 18079 T60 oasc.SolrCore.registerSearcher [collection1] Registered new searcher Searcher@2ad3eec2 main{StandardDirectoryReader(segments_1:1)}
[junit4:junit4]   2> 18091 T54 C4 P32069 oasu.SolrCmdDistributor.distribCommit Distrib commit to:[StdNode: http://127.0.0.1:32323/solr/collection1/, StdNode: http://127.0.0.1:56610/solr/collection1/, StdNode: http://127.0.0.1:20775/solr/collection1/]
[junit4:junit4]   2>  C3_STATE=coll:collection1 core:collection1 props:{shard=shard1, roles=null, state=active, core=collection1, collection=collection1, node_name=127.0.0.1:32323_solr, base_url=http://127.0.0.1:32323/solr}
[junit4:junit4]   2> 18110 T63 C3 P32323 oasu.DirectUpdateHandler2.commit start commit{flags=0,_version_=0,optimize=false,openSearcher=true,waitSearcher=true,expungeDeletes=false,softCommit=false}
[junit4:junit4]   2>  C5_STATE=coll:collection1 core:collection1 props:{shard=shard1, roles=null, state=active, core=collection1, collection=collection1, node_name=127.0.0.1:56610_solr, base_url=http://127.0.0.1:56610/solr}
[junit4:junit4]   2> 18110 T77 C5 P56610 oasu.DirectUpdateHandler2.commit start commit{flags=0,_version_=0,optimize=false,openSearcher=true,waitSearcher=true,expungeDeletes=false,softCommit=false}
[junit4:junit4]   2>  C6_STATE=coll:collection1 core:collection1 props:{shard=shard1, roles=null, state=active, core=collection1, collection=collection1, node_name=127.0.0.1:20775_solr, base_url=http://127.0.0.1:20775/solr}
[junit4:junit4]   2> 18110 T91 C6 P20775 oasu.DirectUpdateHandler2.commit start commit{flags=0,_version_=0,optimize=false,openSearcher=true,waitSearcher=true,expungeDeletes=false,softCommit=false}
[junit4:junit4]   2> 18113 T91 C6 P20775 oass.SolrIndexSearcher.<init> Opening Searcher@54014944 main
[junit4:junit4]   2> 18114 T63 C3 P32323 oass.SolrIndexSearcher.<init> Opening Searcher@69b42301 main
[junit4:junit4]   2> 18114 T91 C6 P20775 oasu.DirectUpdateHandler2.commit end_commit_flush
[junit4:junit4]   2> 18114 T63 C3 P32323 oasu.DirectUpdateHandler2.commit end_commit_flush
[junit4:junit4]   2> 18114 T77 C5 P56610 oass.SolrIndexSearcher.<init> Opening Searcher@33409c28 main
[junit4:junit4]   2> 18115 T77 C5 P56610 oasu.DirectUpdateHandler2.commit end_commit_flush
[junit4:junit4]   2> 18115 T100 oasc.SolrCore.registerSearcher [collection1] Registered new searcher Searcher@54014944 main{StandardDirectoryReader(segments_2:2)}
[junit4:junit4]   2> 18116 T72 oasc.SolrCore.registerSearcher [collection1] Registered new searcher Searcher@69b42301 main{StandardDirectoryReader(segments_2:2)}
[junit4:junit4]   2> 18116 T91 C6 P20775 /update {waitSearcher=true&commit=true&wt=javabin&commit_end_point=true&expungeDeletes=false&softCommit=false&version=2} {commit=} 0 6
[junit4:junit4]   2> 18116 T86 oasc.SolrCore.registerSearcher [collection1] Registered new searcher Searcher@33409c28 main{StandardDirectoryReader(segments_2:2)}
[junit4:junit4]   2> 18116 T63 C3 P32323 /update {waitSearcher=true&commit=true&wt=javabin&commit_end_point=true&expungeDeletes=false&softCommit=false&version=2} {commit=} 0 6
[junit4:junit4]   2> 18117 T77 C5 P56610 /update {waitSearcher=true&commit=true&wt=javabin&commit_end_point=true&expungeDeletes=false&softCommit=false&version=2} {commit=} 0 7
[junit4:junit4]   2> 18118 T54 C4 P32069 /update {waitSearcher=true&wt=javabin&commit=true&softCommit=false&version=2} {commit=} 0 42
[junit4:junit4]   2> 18119 T24 oascc.ZkStateReader.updateClusterState Updating cloud state from ZooKeeper... 
[junit4:junit4]   2> 18137 T53 C4 P32069 REQ /select {distrib=false&wt=javabin&q=*:*&version=2} hits=0 status=0 QTime=4 
[junit4:junit4]   2> 18140 T64 C3 P32323 REQ /select {distrib=false&wt=javabin&q=*:*&version=2} hits=0 status=0 QTime=1 
[junit4:junit4]   2> 18142 T78 C5 P56610 REQ /select {distrib=false&wt=javabin&q=*:*&version=2} hits=0 status=0 QTime=0 
[junit4:junit4]   2> 18144 T92 C6 P20775 REQ /select {distrib=false&wt=javabin&q=*:*&version=2} hits=0 status=0 QTime=0 
[junit4:junit4]   2> 20307 T38 C7 P38069 oass.SolrIndexSearcher.<init> Opening Searcher@71aefd7b realtime
[junit4:junit4]   2> 20314 T38 C7 P38069 /update {wt=javabin&version=2} {deleteByQuery=*:* (-1413306716419784704)} 0 93
[junit4:junit4]   2> 20321 T54 C4 P32069 oass.SolrIndexSearcher.<init> Opening Searcher@1c507aaf realtime
[junit4:junit4]   2> 20333 T63 C3 P32323 oass.SolrIndexSearcher.<init> Opening Searcher@2d868e75 realtime
[junit4:junit4]   2> 20333 T91 C6 P20775 oass.SolrIndexSearcher.<init> Opening Searcher@43bda1e0 realtime
[junit4:junit4]   2> 20333 T77 C5 P56610 oass.SolrIndexSearcher.<init> Opening Searcher@165b3858 realtime
[junit4:junit4]   2> 20334 T63 C3 P32323 REQ /update {update.distrib=FROMLEADER&_version_=-1413306716490039296&update.from=http://127.0.0.1:32069/solr/collection1/&wt=javabin&version=2} status=0 QTime=3 
[junit4:junit4]   2> 20335 T91 C6 P20775 REQ /update {update.distrib=FROMLEADER&_version_=-1413306716490039296&update.from=http://127.0.0.1:32069/solr/collection1/&wt=javabin&version=2} status=0 QTime=4 
[junit4:junit4]   2> 20335 T77 C5 P56610 REQ /update {update.distrib=FROMLEADER&_version_=-1413306716490039296&update.from=http://127.0.0.1:32069/solr/collection1/&wt=javabin&version=2} status=0 QTime=4 
[junit4:junit4]   2> 20336 T54 C4 P32069 /update {wt=javabin&version=2} {deleteByQuery=*:* (-1413306716490039296)} 0 17
[junit4:junit4]   2> 20355 T38 C7 P38069 /update {wt=javabin&version=2} {add=[0 (1413306716520448000)]} 0 15
[junit4:junit4]   2> 20385 T91 C6 P20775 REQ /update {distrib.from=http://127.0.0.1:32069/solr/collection1/&update.distrib=FROMLEADER&wt=javabin&version=2} status=0 QTime=6 
[junit4:junit4]   2> 20386 T63 C3 P32323 REQ /update {distrib.from=http://127.0.0.1:32069/solr/collection1/&update.distrib=FROMLEADER&wt=javabin&version=2} status=0 QTime=7 
[junit4:junit4]   2> 20386 T77 C5 P56610 REQ /update {distrib.from=http://127.0.0.1:32069/solr/collection1/&update.distrib=FROMLEADER&wt=javabin&version=2} status=0 QTime=7 
[junit4:junit4]   2> 20388 T54 C4 P32069 /update {wt=javabin&version=2} {add=[0 (1413306716533030912)]} 0 29
[junit4:junit4]   2> 20394 T38 C7 P38069 /update {wt=javabin&version=2} {add=[1 (1413306716566585344)]} 0 2
[junit4:junit4]   2> 20406 T63 C3 P32323 REQ /update {distrib.from=http://127.0.0.1:32069/solr/collection1/&update.distrib=FROMLEADER&wt=javabin&version=2} status=0 QTime=2 
[junit4:junit4]   2> 20406 T91 C6 P20775 REQ /update {distrib.from=http://127.0.0.1:32069/solr/collection1/&update.distrib=FROMLEADER&wt=javabin&version=2} status=0 QTime=2 
[junit4:junit4]   2> 20408 T77 C5 P56610 REQ /update {distrib.from=http://127.0.0.1:32069/solr/collection1/&update.distrib=FROMLEADER&wt=javabin&version=2} status=0 QTime=4 
[junit4:junit4]   2> 20409 T54 C4 P32069 /update {wt=javabin&version=2} {add=[1 (1413306716572876800)]} 0 11
[junit4:junit4]   2> 20415 T38 C7 P38069 /update {wt=javabin&version=2} {add=[2 (1413306716588605440)]} 0 2
[junit4:junit4]   2> 20428 T91 C6 P20775 REQ /update {distrib.from=http://127.0.0.1:32069/solr/collection1/&update.distrib=FROMLEADER&test.distrib.skip.servers=http://127.0.0.1:32323/solr/collection1/&wt=javabin&version=2} status=0 QTime=3 
[junit4:junit4]   2> 20430 T77 C5 P56610 REQ /update {distrib.from=http://127.0.0.1:32069/solr/collection1/&update.distrib=FROMLEADER&test.distrib.skip.servers=http://127.0.0.1:32323/solr/collection1/&wt=javabin&version=2} status=0 QTime=5 
[junit4:junit4]   2> 20431 T54 C4 P32069 /update {test.distrib.skip.servers=http://127.0.0.1:32323/solr/collection1/&wt=javabin&version=2} {add=[2 (1413306716594896896)]} 0 12
[junit4:junit4]   2> 20439 T38 C7 P38069 /update {wt=javabin&version=2} {add=[3 (1413306716611674112)]} 0 4
[junit4:junit4]   2> 20452 T91 C6 P20775 REQ /update {distrib.from=http://127.0.0.1:32069/solr/collection1/&update.distrib=FROMLEADER&test.distrib.skip.servers=http://127.0.0.1:32323/solr/collection1/&test.distrib.skip.servers=http://127.0.0.1:56610/solr/collection1/&wt=javabin&version=2} status=0 QTime=2 
[junit4:junit4]   2> 20453 T54 C4 P32069 /update {test.distrib.skip.servers=http://127.0.0.1:32323/solr/collection1/&test.distrib.skip.servers=http://127.0.0.1:56610/solr/collection1/&wt=javabin&version=2} {add=[3 (1413306716621111296)]} 0 9
[junit4:junit4]   2> 20457 T38 C7 P38069 oasu.DirectUpdateHandler2.commit start commit{flags=0,_version_=0,optimize=false,openSearcher=true,waitSearcher=true,expungeDeletes=false,softCommit=false}
[junit4:junit4]   2> 20603 T38 C7 P38069 oasc.SolrDeletionPolicy.onCommit SolrDeletionPolicy.onCommit: commits:num=2
[junit4:junit4]   2> 		commit{dir=NRTCachingDirectory(org.apache.lucene.store.NIOFSDirectory@/usr/home/hudson/hudson-slave/workspace/Lucene-Solr-Tests-4.x-Java6/solr/build/solr-core/test/J1/org.apache.solr.cloud.SyncSliceTest-1347834296411/control/data/index lockFactory=org.apache.lucene.store.NativeFSLockFactory@1c49094; maxCacheMB=48.0 maxMergeSizeMB=4.0),segFN=segments_1,generation=1,filenames=[segments_1]
[junit4:junit4]   2> 		commit{dir=NRTCachingDirectory(org.apache.lucene.store.NIOFSDirectory@/usr/home/hudson/hudson-slave/workspace/Lucene-Solr-Tests-4.x-Java6/solr/build/solr-core/test/J1/org.apache.solr.cloud.SyncSliceTest-1347834296411/control/data/index lockFactory=org.apache.lucene.store.NativeFSLockFactory@1c49094; maxCacheMB=48.0 maxMergeSizeMB=4.0),segFN=segments_2,generation=2,filenames=[_0_MockSep_0.pos, _0_MockRandom_0.prx, _0_TestBloomFilteredLucene40Postings_0.prx, _0_MockSep_0.skp, _0_SimpleText_0.pst, _0_TestBloomFilteredLucene40Postings_0.frq, _0.si, _0_MockSep_0.doc, _0_TestBloomFilteredLucene40Postings_0.tim, _0_TestBloomFilteredLucene40Postings_0.tip, _0_TestBloomFilteredLucene40Postings_0.blm, _0.fnm, _0_nrm.cfs, _0_MockSep_0.tib, _0_MockRandom_0.sd, _0_MockRandom_0.frq, _0_MockRandom_0.tip, _0_nrm.cfe, segments_2, _0_MockSep_0.frq, _0.fdx, _0_MockSep_0.tii, _0_MockSep_0.pyl, _0_MockRandom_0.tim, _0.fdt]
[junit4:junit4]   2> 20605 T38 C7 P38069 oasc.SolrDeletionPolicy.updateCommits newest commit = 2
[junit4:junit4]   2> 20624 T38 C7 P38069 oass.SolrIndexSearcher.<init> Opening Searcher@6815a68d main
[junit4:junit4]   2> 20626 T38 C7 P38069 oasu.DirectUpdateHandler2.commit end_commit_flush
[junit4:junit4]   2> 20628 T48 oasc.SolrCore.registerSearcher [collection1] Registered new searcher Searcher@6815a68d main{StandardDirectoryReader(segments_2:3:nrt _0(4.0.0.2):C4)}
[junit4:junit4]   2> 20628 T38 C7 P38069 /update {waitSearcher=true&wt=javabin&commit=true&softCommit=false&version=2} {commit=} 0 171
[junit4:junit4]   2> 20633 T54 C4 P32069 oasu.DirectUpdateHandler2.commit start commit{flags=0,_version_=0,optimize=false,openSearcher=true,waitSearcher=true,expungeDeletes=false,softCommit=false}
[junit4:junit4]   2> 20688 T54 C4 P32069 oasc.SolrDeletionPolicy.onCommit SolrDeletionPolicy.onCommit: commits:num=2
[junit4:junit4]   2> 		commit{dir=NRTCachingDirectory(org.apache.lucene.store.NIOFSDirectory@/usr/home/hudson/hudson-slave/workspace/Lucene-Solr-Tests-4.x-Java6/solr/build/solr-core/test/J1/org.apache.solr.cloud.SyncSliceTest-1347834296411/jetty1/index lockFactory=org.apache.lucene.store.NativeFSLockFactory@71f5ba55; maxCacheMB=48.0 maxMergeSizeMB=4.0),segFN=segments_1,generation=1,filenames=[segments_1]
[junit4:junit4]   2> 		commit{dir=NRTCachingDirectory(org.apache.lucene.store.NIOFSDirectory@/usr/home/hudson/hudson-slave/workspace/Lucene-Solr-Tests-4.x-Java6/solr/build/solr-core/test/J1/org.apache.solr.cloud.SyncSliceTest-1347834296411/jetty1/index lockFactory=org.apache.lucene.store.NativeFSLockFactory@71f5ba55; maxCacheMB=48.0 maxMergeSizeMB=4.0),segFN=segments_2,generation=2,filenames=[_0_MockSep_0.pos, _0_MockRandom_0.prx, _0_TestBloomFilteredLucene40Postings_0.prx, _0_MockSep_0.skp, _0_SimpleText_0.pst, _0_TestBloomFilteredLucene40Postings_0.frq, _0.si, _0_MockSep_0.doc, _0_MockRandom_0.tib, _0_TestBloomFilteredLucene40Postings_0.tim, _0_TestBloomFilteredLucene40Postings_0.tip, _0_TestBloomFilteredLucene40Postings_0.blm, _0.fnm, _0_nrm.cfs, _0_MockSep_0.tib, _0_MockRandom_0.sd, _0_MockRandom_0.frq, _0_nrm.cfe, segments_2, _0_MockRandom_0.tii, _0_MockSep_0.frq, _0.fdx, _0_MockSep_0.tii, _0_MockSep_0.pyl, _0.fdt]
[junit4:junit4]   2> 20689 T54 C4 P32069 oasc.SolrDeletionPolicy.updateCommits newest commit = 2
[junit4:junit4]   2> 20724 T54 C4 P32069 oass.SolrIndexSearcher.<init> Opening Searcher@318a04cb main
[junit4:junit4]   2> 20725 T54 C4 P32069 oasu.DirectUpdateHandler2.commit end_commit_flush
[junit4:junit4]   2> 20727 T60 oasc.SolrCore.registerSearcher [collection1] Registered new searcher Searcher@318a04cb main{StandardDirectoryReader(segments_2:3:nrt _0(4.0.0.2):C4)}
[junit4:junit4]   2> 20728 T54 C4 P32069 oasu.SolrCmdDistributor.distribCommit Distrib commit to:[StdNode: http://127.0.0.1:32323/solr/collection1/, StdNode: http://127.0.0.1:56610/solr/collection1/, StdNode: http://127.0.0.1:20775/solr/collection1/]
[junit4:junit4]   2> 20732 T77 C5 P56610 oasu.DirectUpdateHandler2.commit start commit{flags=0,_version_=0,optimize=false,openSearcher=true,waitSearcher=true,expungeDeletes=false,softCommit=false}
[junit4:junit4]   2> 20732 T63 C3 P32323 oasu.DirectUpdateHandler2.commit start commit{flags=0,_version_=0,optimize=false,openSearcher=true,waitSearcher=true,expungeDeletes=false,softCommit=false}
[junit4:junit4]   2> 20732 T91 C6 P20775 oasu.DirectUpdateHandler2.commit start commit{flags=0,_version_=0,optimize=false,openSearcher=true,waitSearcher=true,expungeDeletes=false,softCommit=false}
[junit4:junit4]   2> 20872 T77 C5 P56610 oasc.SolrDeletionPolicy.onCommit SolrDeletionPolicy.onCommit: commits:num=2
[junit4:junit4]   2> 		commit{dir=NRTCachingDirectory(org.apache.lucene.store.NIOFSDirectory@/usr/home/hudson/hudson-slave/workspace/Lucene-Solr-Tests-4.x-Java6/solr/build/solr-core/test/J1/org.apache.solr.cloud.SyncSliceTest-1347834296411/jetty3/index lockFactory=org.apache.lucene.store.NativeFSLockFactory@3eb2aa1c; maxCacheMB=48.0 maxMergeSizeMB=4.0),segFN=segments_2,generation=2,filenames=[segments_2]
[junit4:junit4]   2> 		commit{dir=NRTCachingDirectory(org.apache.lucene.store.NIOFSDirectory@/usr/home/hudson/hudson-slave/workspace/Lucene-Solr-Tests-4.x-Java6/solr/build/solr-core/test/J1/org.apache.solr.cloud.SyncSliceTest-1347834296411/jetty3/index lockFactory=org.apache.lucene.store.NativeFSLockFactory@3eb2aa1c; maxCacheMB=48.0 maxMergeSizeMB=4.0),segFN=segments_3,generation=3,filenames=[_0_MockSep_0.pos, _0_MockRandom_0.prx, _0_TestBloomFilteredLucene40Postings_0.prx, _0_MockSep_0.skp, _0_SimpleText_0.pst, _0_TestBloomFilteredLucene40Postings_0.frq, _0.si, _0_MockSep_0.doc, _0_TestBloomFilteredLucene40Postings_0.tim, _0_TestBloomFilteredLucene40Postings_0.tip, _0_TestBloomFilteredLucene40Postings_0.blm, _0.fnm, _0_nrm.cfs, _0_MockSep_0.tib, _0_MockRandom_0.sd, _0_MockRandom_0.frq, _0_MockRandom_0.tip, _0_nrm.cfe, _0_MockSep_0.frq, _0.fdx, _0_MockSep_0.tii, _0_MockSep_0.pyl, _0_MockRandom_0.tim, segments_3, _0.fdt]
[junit4:junit4]   2> 20872 T77 C5 P56610 oasc.SolrDeletionPolicy.updateCommits newest commit = 3
[junit4:junit4]   2> 20878 T63 C3 P32323 oasc.SolrDeletionPolicy.onCommit SolrDeletionPolicy.onCommit: commits:num=2
[junit4:junit4]   2> 		commit{dir=NRTCachingDirectory(org.apache.lucene.store.NIOFSDirectory@/usr/home/hudson/hudson-slave/workspace/Lucene-Solr-Tests-4.x-Java6/solr/build/solr-core/test/J1/org.apache.solr.cloud.SyncSliceTest-1347834296411/jetty2/index lockFactory=org.apache.lucene.store.NativeFSLockFactory@6f866002; maxCacheMB=48.0 maxMergeSizeMB=4.0),segFN=segments_2,generation=2,filenames=[segments_2]
[junit4:junit4]   2> 		commit{dir=NRTCachingDirectory(org.apache.lucene.store.NIOFSDirectory@/usr/home/hudson/hudson-slave/workspace/Lucene-Solr-Tests-4.x-Java6/solr/build/solr-core/test/J1/org.apache.solr.cloud.SyncSliceTest-1347834296411/jetty2/index lockFactory=org.apache.lucene.store.NativeFSLockFactory@6f866002; maxCacheMB=48.0 maxMergeSizeMB=4.0),segFN=segments_3,generation=3,filenames=[_0_MockSep_0.pos, _0_TestBloomFilteredLucene40Postings_0.prx, _0_MockSep_0.skp, _0_SimpleText_0.pst, _0_TestBloomFilteredLucene40Postings_0.frq, _0.si, _0_MockSep_0.doc, _0_TestBloomFilteredLucene40Postings_0.tim, _0_TestBloomFilteredLucene40Postings_0.blm, _0_TestBloomFilteredLucene40Postings_0.tip, _0.fnm, _0_nrm.cfs, _0_MockRandom_0.skp, _0_MockSep_0.tib, _0_MockRandom_0.tip, _0_MockRandom_0.frq, _0_MockRandom_0.sd, _0_MockRandom_0.doc, _0_MockRandom_0.pos, _0_nrm.cfe, _0_MockSep_0.frq, _0.fdx, _0_MockSep_0.tii, _0_MockSep_0.pyl, _0_MockRandom_0.pyl, _0_MockRandom_0.tim, _0.fdt, segments_3]
[junit4:junit4]   2> 20878 T63 C3 P32323 oasc.SolrDeletionPolicy.updateCommits newest commit = 3
[junit4:junit4]   2> 20880 T91 C6 P20775 oasc.SolrDeletionPolicy.onCommit SolrDeletionPolicy.onCommit: commits:num=2
[junit4:junit4]   2> 		commit{dir=NRTCachingDirectory(org.apache.lucene.store.NIOFSDirectory@/usr/home/hudson/hudson-slave/workspace/Lucene-Solr-Tests-4.x-Java6/solr/build/solr-core/test/J1/org.apache.solr.cloud.SyncSliceTest-1347834296411/jetty4/index lockFactory=org.apache.lucene.store.NativeFSLockFactory@17827d26; maxCacheMB=48.0 maxMergeSizeMB=4.0),segFN=segments_2,generation=2,filenames=[segments_2]
[junit4:junit4]   2> 		commit{dir=NRTCachingDirectory(org.apache.lucene.store.NIOFSDirectory@/usr/home/hudson/hudson-slave/workspace/Lucene-Solr-Tests-4.x-Java6/solr/build/solr-core/test/J1/org.apache.solr.cloud.SyncSliceTest-1347834296411/jetty4/index lockFactory=org.apache.lucene.store.NativeFSLockFactory@17827d26; maxCacheMB=48.0 maxMergeSizeMB=4.0),segFN=segments_3,generation=3,filenames=[_0_MockSep_0.pos, _0_TestBloomFilteredLucene40Postings_0.prx, _0_MockSep_0.skp, _0_SimpleText_0.pst, _0_TestBloomFilteredLucene40Postings_0.frq, _0.si, _0_MockSep_0.doc, _0_TestBloomFilteredLucene40Postings_0.tim, _0_MockRandom_0.tib, _0_TestBloomFilteredLucene40Postings_0.blm, _0_TestBloomFilteredLucene40Postings_0.tip, _0.fnm, _0_nrm.cfs, _0_MockRandom_0.skp, _0_MockSep_0.tib, _0_MockRandom_0.frq, _0_MockRandom_0.sd, _0_MockRandom_0.doc, _0_MockRandom_0.pos, _0_nrm.cfe, _0_MockSep_0.frq, _0_MockRandom_0.tii, _0.fdx, _0_MockSep_0.tii, _0_MockSep_0.pyl, _0_MockRandom_0.pyl, _0.fdt, segments_3]
[junit4:junit4]   2> 20880 T91 C6 P20775 oasc.SolrDeletionPolicy.updateCommits newest commit = 3
[junit4:junit4]   2> 20882 T77 C5 P56610 oass.SolrIndexSearcher.<init> Opening Searcher@2cc5c76c main
[junit4:junit4]   2> 20882 T77 C5 P56610 oasu.DirectUpdateHandler2.commit end_commit_flush
[junit4:junit4]   2> 20885 T86 oasc.SolrCore.registerSearcher [collection1] Registered new searcher Searcher@2cc5c76c main{StandardDirectoryReader(segments_3:4:nrt _0(4.0.0.2):C3)}
[junit4:junit4]   2> 20886 T77 C5 P56610 /update {waitSearcher=true&commit=true&wt=javabin&commit_end_point=true&expungeDeletes=false&softCommit=false&version=2} {commit=} 0 154
[junit4:junit4]   2> 20896 T63 C3 P32323 oass.SolrIndexSearcher.<init> Opening Searcher@46844c3d main
[junit4:junit4]   2> 20896 T63 C3 P32323 oasu.DirectUpdateHandler2.commit end_commit_flush
[junit4:junit4]   2> 20898 T72 oasc.SolrCore.registerSearcher [collection1] Registered new searcher Searcher@46844c3d main{StandardDirectoryReader(segments_3:4:nrt _0(4.0.0.2):C2)}
[junit4:junit4]   2> 20899 T63 C3 P32323 /update {waitSearcher=true&commit=true&wt=javabin&commit_end_point=true&expungeDeletes=false&softCommit=false&version=2} {commit=} 0 167
[junit4:junit4]   2> 20899 T91 C6 P20775 oass.SolrIndexSearcher.<init> Opening Searcher@3e410541 main
[junit4:junit4]   2> 20900 T91 C6 P20775 oasu.DirectUpdateHandler2.commit end_commit_flush
[junit4:junit4]   2> 20903 T100 oasc.SolrCore.registerSearcher [collection1] Registered new searcher Searcher@3e410541 main{StandardDirectoryReader(segments_3:4:nrt _0(4.0.0.2):C4)}
[junit4:junit4]   2> 20904 T91 C6 P20775 /update {waitSearcher=true&commit=true&wt=javabin&commit_end_point=true&expungeDeletes=false&softCommit=false&version=2} {commit=} 0 172
[junit4:junit4]   2> 20904 T54 C4 P32069 /update {waitSearcher=true&wt=javabin&commit=true&softCommit=false&version=2} {commit=} 0 271
[junit4:junit4]   2> 20905 T24 oasc.AbstractDistribZkTestBase.waitForRecoveriesToFinish Wait for recoveries to finish - collection: collection1 failOnTimeout:true timeout (sec):1800
[junit4:junit4]   2> 20907 T24 oascc.ZkStateReader.updateClusterState Updating cloud state from ZooKeeper... 
[junit4:junit4]   2> check const of shard1
[junit4:junit4]   2> client0
[junit4:junit4]   2> PROPS:shard=shard1
[junit4:junit4]   2> roles=null
[junit4:junit4]   2> leader=true
[junit4:junit4]   2> state=active
[junit4:junit4]   2> core=collection1
[junit4:junit4]   2> collection=collection1
[junit4:junit4]   2> node_name=127.0.0.1:32069_solr
[junit4:junit4]   2> base_url=http://127.0.0.1:32069/solr
[junit4:junit4]   2> 
[junit4:junit4]   2> 20912 T53 C4 P32069 REQ /select {distrib=false&wt=javabin&q=*:*&version=2} hits=4 status=0 QTime=1 
[junit4:junit4]   2>  live:true
[junit4:junit4]   2>  num:4
[junit4:junit4]   2> 
[junit4:junit4]   2> client1
[junit4:junit4]   2> PROPS:shard=shard1
[junit4:junit4]   2> roles=null
[junit4:junit4]   2> state=active
[junit4:junit4]   2> core=collection1
[junit4:junit4]   2> collection=collection1
[junit4:junit4]   2> node_name=127.0.0.1:32323_solr
[junit4:junit4]   2> base_url=http://127.0.0.1:32323/solr
[junit4:junit4]   2> 
[junit4:junit4]   2> 20917 T64 C3 P32323 REQ /select {distrib=false&wt=javabin&q=*:*&version=2} hits=2 status=0 QTime=0 
[junit4:junit4]   2>  live:true
[junit4:junit4]   2>  num:2
[junit4:junit4]   2> 
[junit4:junit4]   2> ######shard1 is not consistent.  Got 4 from http://127.0.0.1:32069/solr/collection1lastClient and got 2 from http://127.0.0.1:32323/solr/collection1
[junit4:junit4]   2> 20922 T53 C4 P32069 REQ /select {fl=id,_version_&sort=id+asc&q=*:*&distrib=false&wt=javabin&rows=1000&version=2} hits=4 status=0 QTime=1 
[junit4:junit4]   2> 20925 T64 C3 P32323 REQ /select {fl=id,_version_&sort=id+asc&q=*:*&distrib=false&wt=javabin&rows=1000&version=2} hits=2 status=0 QTime=0 
[junit4:junit4]   2> ######http://127.0.0.1:32069/solr/collection1: {numFound=4,start=0,docs=[SolrDocument{id=0, _version_=1413306716533030912}, SolrDocument{id=1, _version_=1413306716572876800}, SolrDocument{id=2, _version_=1413306716594896896}, SolrDocument{id=3, _version_=1413306716621111296}]}
[junit4:junit4]   2> ######http://127.0.0.1:32323/solr/collection1: {numFound=2,start=0,docs=[SolrDocument{id=0, _version_=1413306716533030912}, SolrDocument{id=1, _version_=1413306716572876800}]}
[junit4:junit4]   2> ###### sizes=4,2
[junit4:junit4]   2> ###### Only in http://127.0.0.1:32069/solr/collection1: [{id=3, _version_=1413306716621111296}, {id=2, _version_=1413306716594896896}]
[junit4:junit4]   2> client2
[junit4:junit4]   2> PROPS:shard=shard1
[junit4:junit4]   2> roles=null
[junit4:junit4]   2> state=active
[junit4:junit4]   2> core=collection1
[junit4:junit4]   2> collection=collection1
[junit4:junit4]   2> node_name=127.0.0.1:56610_solr
[junit4:junit4]   2> base_url=http://127.0.0.1:56610/solr
[junit4:junit4]   2> 
[junit4:junit4]   2> 20929 T78 C5 P56610 REQ /select {distrib=false&wt=javabin&q=*:*&version=2} hits=3 status=0 QTime=0 
[junit4:junit4]   2>  live:true
[junit4:junit4]   2>  num:3
[junit4:junit4]   2> 
[junit4:junit4]   2> client3
[junit4:junit4]   2> PROPS:shard=shard1
[junit4:junit4]   2> roles=null
[junit4:junit4]   2> state=active
[junit4:junit4]   2> core=collection1
[junit4:junit4]   2> collection=collection1
[junit4:junit4]   2> node_name=127.0.0.1:20775_solr
[junit4:junit4]   2> base_url=http://127.0.0.1:20775/solr
[junit4:junit4]   2> 
[junit4:junit4]   2> 20933 T92 C6 P20775 REQ /select {distrib=false&wt=javabin&q=*:*&version=2} hits=4 status=0 QTime=0 
[junit4:junit4]   2>  live:true
[junit4:junit4]   2>  num:4
[junit4:junit4]   2> 
[junit4:junit4]   2> 20940 T24 oascsi.HttpClientUtil.createClient Creating new http client, config:maxConnections=128&maxConnectionsPerHost=32&followRedirects=false
[junit4:junit4]   2> 20963 T79 oasha.CollectionsHandler.handleSyncShardAction Syncing shard : action=SYNCSHARD&collection=collection1&shard=shard1&wt=javabin&version=2
[junit4:junit4]   2> 20963 T79 oascsi.HttpClientUtil.createClient Creating new http client, config:maxConnections=128&maxConnectionsPerHost=32&followRedirects=false
[junit4:junit4]   2> 20973 T57 oasha.CoreAdminHandler.handleRequestSyncAction I have been requested to sync up my shard
[junit4:junit4]   2> 20974 T57 oasc.SyncStrategy.sync Sync replicas to http://127.0.0.1:32069/solr/collection1/
[junit4:junit4]   2> 20974 T57 oasu.PeerSync.sync PeerSync: core=collection1 url=http://127.0.0.1:32069/solr START replicas=[http://127.0.0.1:32323/solr/collection1/, http://127.0.0.1:56610/solr/collection1/, http://127.0.0.1:20775/solr/collection1/] nUpdates=100
[junit4:junit4]   2> 20988 T80 C5 P56610 REQ /get {distrib=false&qt=/get&wt=javabin&version=2&getVersions=100} status=0 QTime=10 
[junit4:junit4]   2> 20988 T93 C6 P20775 REQ /get {distrib=false&qt=/get&wt=javabin&version=2&getVersions=100} status=0 QTime=9 
[junit4:junit4]   2> 20988 T65 C3 P32323 REQ /get {distrib=false&qt=/get&wt=javabin&version=2&getVersions=100} status=0 QTime=9 
[junit4:junit4]   2> 20988 T57 oasu.PeerSync.handleVersions PeerSync: core=collection1 url=http://127.0.0.1:32069/solr  Received 4 versions from 127.0.0.1:56610/solr/collection1/
[junit4:junit4]   2> 20989 T57 oasu.PeerSync.handleVersions PeerSync: core=collection1 url=http://127.0.0.1:32069/solr  Our versions are newer. ourLowThreshold=1413306716490039296 otherHigh=1413306716594896896
[junit4:junit4]   2> 20989 T57 oasu.PeerSync.handleVersions PeerSync: core=collection1 url=http://127.0.0.1:32069/solr  Received 5 versions from 127.0.0.1:20775/solr/collection1/
[junit4:junit4]   2> 20990 T57 oasu.PeerSync.handleVersions PeerSync: core=collection1 url=http://127.0.0.1:32069/solr  Our versions are newer. ourLowThreshold=1413306716490039296 otherHigh=1413306716594896896
[junit4:junit4]   2> 20990 T57 oasu.PeerSync.handleVersions PeerSync: core=collection1 url=http://127.0.0.1:32069/solr  Received 3 versions from 127.0.0.1:32323/solr/collection1/
[junit4:junit4]   2> 20990 T57 oasu.PeerSync.handleVersions PeerSync: core=collection1 url=http://127.0.0.1:32069/solr  Our versions are newer. ourLowThreshold=1413306716490039296 otherHigh=1413306716572876800
[junit4:junit4]   2> 20990 T57 oasu.PeerSync.sync PeerSync: core=collection1 url=http://127.0.0.1:32069/solr DONE. sync succeeded
[junit4:junit4]   2> 20991 T57 oasc.SyncStrategy.syncReplicas Sync Success - now sync replicas to me
[junit4:junit4]   2> 20991 T57 oasc.SyncStrategy.syncToMe http://127.0.0.1:32069/solr/collection1/: try and ask http://127.0.0.1:32323/solr/collection1/ to sync
[junit4:junit4]   2> 20991 T57 oasc.SyncStrategy.syncToMe http://127.0.0.1:32069/solr/collection1/: try and ask http://127.0.0.1:56610/solr/collection1/ to sync
[junit4:junit4]   2> 20992 T57 oasc.SyncStrategy.syncToMe http://127.0.0.1:32069/solr/collection1/: try and ask http://127.0.0.1:20775/solr/collection1/ to sync
[junit4:junit4]   2> 20994 T66 C3 P32323 oasu.PeerSync.sync PeerSync: core=collection1 url=http://127.0.0.1:32323/solr START replicas=[http://127.0.0.1:32069/solr/collection1/] nUpdates=100
[junit4:junit4]   2> 20995 T81 C5 P56610 oasu.PeerSync.sync PeerSync: core=collection1 url=http://127.0.0.1:56610/solr START replicas=[http://127.0.0.1:32069/solr/collection1/] nUpdates=100
[junit4:junit4]   2> 20996 T94 C6 P20775 oasu.PeerSync.sync PeerSync: core=collection1 url=http://127.0.0.1:20775/solr START replicas=[http://127.0.0.1:32069/solr/collection1/] nUpdates=100
[junit4:junit4]   2> 20998 T56 C4 P32069 REQ /get {distrib=false&qt=/get&wt=javabin&version=2&getVersions=100} status=0 QTime=0 
[junit4:junit4]   2> 20998 T51 C4 P32069 REQ /get {distrib=false&qt=/get&wt=javabin&version=2&getVersions=100} status=0 QTime=0 
[junit4:junit4]   2> 20999 T66 C3 P32323 oasu.PeerSync.handleVersions PeerSync: core=collection1 url=http://127.0.0.1:32323/solr  Received 5 versions from 127.0.0.1:32069/solr/collection1/
[junit4:junit4]   2> 20999 T81 C5 P56610 oasu.PeerSync.handleVersions PeerSync: core=collection1 url=http://127.0.0.1:56610/solr  Received 5 versions from 127.0.0.1:32069/solr/collection1/
[junit4:junit4]   2> 20999 T66 C3 P32323 oasu.PeerSync.requestUpdates PeerSync: core=collection1 url=http://127.0.0.1:32323/solr Requesting updates from 127.0.0.1:32069/solr/collection1/n=2 versions=[1413306716621111296, 1413306716594896896]
[junit4:junit4]   2> 21000 T52 C4 P32069 REQ /get {distrib=false&qt=/get&wt=javabin&version=2&getVersions=100} status=0 QTime=1 
[junit4:junit4]   2> 21000 T81 C5 P56610 oasu.PeerSync.requestUpdates PeerSync: core=collection1 url=http://127.0.0.1:56610/solr Requesting updates from 127.0.0.1:32069/solr/collection1/n=1 versions=[1413306716621111296]
[junit4:junit4]   2> 21001 T94 C6 P20775 oasu.PeerSync.handleVersions PeerSync: core=collection1 url=http://127.0.0.1:20775/solr  Received 5 versions from 127.0.0.1:32069/solr/collection1/
[junit4:junit4]   2> 21001 T94 C6 P20775 oasu.PeerSync.handleVersions PeerSync: core=collection1 url=http://127.0.0.1:20775/solr  Our versions are newer. ourLowThreshold=1413306716490039296 otherHigh=1413306716594896896
[junit4:junit4]   2> 21002 T94 C6 P20775 oasu.PeerSync.sync PeerSync: core=collection1 url=http://127.0.0.1:20775/solr DONE. sync succeeded
[junit4:junit4]   2> 21002 T94 C6 P20775 REQ /get {sync=http://127.0.0.1:32069/solr/collection1/&getVersions=100&distrib=false&qt=/get&wt=javabin&version=2} status=0 QTime=6 
[junit4:junit4]   2> 21003 T57 oasc.SyncStrategy.syncToMe http://127.0.0.1:32069/solr/collection1/:  sync completed with http://127.0.0.1:20775/solr/collection1/
[junit4:junit4]   2> 21003 T56 C4 P32069 REQ /get {distrib=false&getUpdates=1413306716621111296,1413306716594896896&qt=/get&wt=javabin&version=2} status=0 QTime=0 
[junit4:junit4]   2> 21004 T52 C4 P32069 REQ /get {distrib=false&getUpdates=1413306716621111296&qt=/get&wt=javabin&version=2} status=0 QTime=1 
[junit4:junit4]   2> 21012 T81 C5 P56610 oasu.PeerSync.sync PeerSync: core=collection1 url=http://127.0.0.1:56610/solr DONE. sync succeeded
[junit4:junit4]   2> 21013 T81 C5 P56610 REQ /get {sync=http://127.0.0.1:32069/solr/collection1/&getVersions=100&distrib=false&qt=/get&wt=javabin&version=2} status=0 QTime=18 
[junit4:junit4]   2> 21014 T57 oasc.SyncStrategy.syncToMe http://127.0.0.1:32069/solr/collection1/:  sync completed with http://127.0.0.1:56610/solr/collection1/
[junit4:junit4]   2> 21014 T66 C3 P32323 oasu.PeerSync.sync PeerSync: core=collection1 url=http://127.0.0.1:32323/solr DONE. sync succeeded
[junit4:junit4]   2> 21015 T66 C3 P32323 REQ /get {sync=http://127.0.0.1:32069/solr/collection1/&getVersions=100&distrib=false&qt=/get&wt=javabin&version=2} status=0 QTime=21 
[junit4:junit4]   2> 21016 T57 oasc.SyncStrategy.syncToMe http://127.0.0.1:32069/solr/collection1/:  sync completed with http://127.0.0.1:32323/solr/collection1/
[junit4:junit4]   2> 21017 T24 oasc.AbstractFullDistribZkTestBase.waitForThingsToLevelOut Wait for recoveries to finish - wait 15 for each attempt
[junit4:junit4]   2> 21017 T24 oasc.AbstractDistribZkTestBase.waitForRecoveriesToFinish Wait for recoveries to finish - collection: collection1 failOnTimeout:true timeout (sec):15
[junit4:junit4]   2> 21018 T24 oascc.ZkStateReader.updateClusterState Updating cloud state from ZooKeeper... 
[junit4:junit4]   2> 21022 T38 C7 P38069 oasu.DirectUpdateHandler2.commit start commit{flags=0,_version_=0,optimize=false,openSearcher=true,waitSearcher=true,expungeDeletes=false,softCommit=false}
[junit4:junit4]   2> 21024 T38 C7 P38069 oass.SolrIndexSearcher.<init> Opening Searcher@6318994d main
[junit4:junit4]   2> 21024 T38 C7 P38069 oasu.DirectUpdateHandler2.commit end_commit_flush
[junit4:junit4]   2> 21027 T48 oasc.SolrCore.registerSearcher [collection1] Registered new searcher Searcher@6318994d main{StandardDirectoryReader(segments_2:3:nrt _0(4.0.0.2):C4)}
[junit4:junit4]   2> 21028 T38 C7 P38069 /update {waitSearcher=true&wt=javabin&commit=true&softCommit=false&version=2} {commit=} 0 6
[junit4:junit4]   2> 21031 T54 C4 P32069 oasu.DirectUpdateHandler2.commit start commit{flags=0,_version_=0,optimize=false,openSearcher=true,waitSearcher=true,expungeDeletes=false,softCommit=false}
[junit4:junit4]   2> 21033 T54 C4 P32069 oass.SolrIndexSearcher.<init> Opening Searcher@604ab168 main
[junit4:junit4]   2> 21033 T54 C4 P32069 oasu.DirectUpdateHandler2.commit end_commit_flush
[junit4:junit4]   2> 21034 T60 oasc.SolrCore.registerSearcher [collection1] Registered new searcher Searcher@604ab168 main{StandardDirectoryReader(segments_2:3:nrt _0(4.0.0.2):C4)}
[junit4:junit4]   2> 21035 T54 C4 P32069 oasu.SolrCmdDistributor.distribCommit Distrib commit to:[StdNode: http://127.0.0.1:32323/solr/collection1/, StdNode: http://127.0.0.1:56610/solr/collection1/, StdNode: http://127.0.0.1:20775/solr/collection1/]
[junit4:junit4]   2> 21037 T63 C3 P32323 oasu.DirectUpdateHandler2.commit start commit{flags=0,_version_=0,optimize=false,openSearcher=true,waitSearcher=true,expungeDeletes=false,softCommit=false}
[junit4:junit4]   2> 21039 T77 C5 P56610 oasu.DirectUpdateHandler2.commit start commit{flags=0,_version_=0,optimize=false,openSearcher=true,waitSearcher=true,expungeDeletes=false,softCommit=false}
[junit4:junit4]   2> 21039 T91 C6 P20775 oasu.DirectUpdateHandler2.commit start commit{flags=0,_version_=0,optimize=false,openSearcher=true,waitSearcher=true,expungeDeletes=false,softCommit=false}
[junit4:junit4]   2> 21041 T91 C6 P20775 oass.SolrIndexSearcher.<init> Opening Searcher@14562534 main
[junit4:junit4]   2> 21042 T91 C6 P20775 oasu.DirectUpdateHandler2.commit end_commit_flush
[junit4:junit4]   2> 21046 T100 oasc.SolrCore.registerSearcher [collection1] Registered new searcher Searcher@14562534 main{StandardDirectoryReader(segments_3:4:nrt _0(4.0.0.2):C4)}
[junit4:junit4]   2> 21047 T91 C6 P20775 /update {waitSearcher=true&commit=true&wt=javabin&commit_end_point=true&expungeDeletes=false&softCommit=false&version=2} {commit=} 0 8
[junit4:junit4]   2> 21171 T77 C5 P56610 oasc.SolrDeletionPolicy.onCommit SolrDeletionPolicy.onCommit: commits:num=2
[junit4:junit4]   2> 		commit{dir=NRTCachingDirectory(org.apache.lucene.store.NIOFSDirectory@/usr/home/hudson/hudson-slave/workspace/Lucene-Solr-Tests-4.x-Java6/solr/build/solr-core/test/J1/org.apache.solr.cloud.SyncSliceTest-1347834296411/jetty3/index lockFactory=org.apache.lucene.store.NativeFSLockFactory@3eb2aa1c; maxCacheMB=48.0 maxMergeSizeMB=4.0),segFN=segments_3,generation=3,filenames=[_0_MockSep_0.pos, _0_MockRandom_0.prx, _0_TestBloomFilteredLucene40Postings_0.prx, _0_MockSep_0.skp, _0_SimpleText_0.pst, _0_TestBloomFilteredLucene40Postings_0.frq, _0.si, _0_MockSep_0.doc, _0_TestBloomFilteredLucene40Postings_0.tim, _0_TestBloomFilteredLucene40Postings_0.tip, _0_TestBloomFilteredLucene40Postings_0.blm, _0.fnm, _0_nrm.cfs, _0_MockSep_0.tib, _0_MockRandom_0.sd, _0_MockRandom_0.frq, _0_MockRandom_0.tip, _0_nrm.cfe, _0_MockSep_0.frq, _0.fdx, _0_MockSep_0.tii, _0_MockSep_0.pyl, _0_MockRandom_0.tim, segments_3, _0.fdt]
[junit4:junit4]   2> 		commit{dir=NRTCachingDirectory(org.apache.lucene.store.NIOFSDirectory@/usr/home/hudson/hudson-slave/workspace/Lucene-Solr-Tests-4.x-Java6/solr/build/solr-core/test/J1/org.apache.solr.cloud.SyncSliceTest-1347834296411/jetty3/index lockFactory=org.apache.lucene.store.NativeFSLockFactory@3eb2aa1c; maxCacheMB=48.0 maxMergeSizeMB=4.0),segFN=segments_4,generation=4,filenames=[_0_MockSep_0.pos, _0_MockRandom_0.prx, _1.fnm, _1_MockRandom_0.pos, _0_MockSep_0.skp, _0_SimpleText_0.pst, _0_TestBloomFilteredLucene40Postings_0.frq, _1_MockSep_0.doc, _1_MockSep_0.pyl, _0_TestBloomFilteredLucene40Postings_0.tim, _0_TestBloomFilteredLucene40Postings_0.blm, _0_TestBloomFi

[...truncated too long message...]

nit4]   2> 		at org.apache.solr.cloud.RecoveryStrategy.recoveryFailed(RecoveryStrategy.java:112)
[junit4:junit4]   2> 		at org.apache.solr.cloud.RecoveryStrategy.doRecovery(RecoveryStrategy.java:466)
[junit4:junit4]   2> 		at org.apache.solr.cloud.RecoveryStrategy.run(RecoveryStrategy.java:220)
[junit4:junit4]   2> 	
[junit4:junit4]   2> 204362 T182 C6 P20775 oasc.RecoveryStrategy.doRecovery Finished recovery process. core=collection1
[junit4:junit4]   2> 204362 T24 oasc.SolrCore.close [collection1]  CLOSING SolrCore org.apache.solr.core.SolrCore@6243d0cb
[junit4:junit4]   2> 204367 T24 oasc.SolrCore.closeSearcher [collection1] Closing main searcher on request.
[junit4:junit4]   2> 204367 T24 oasu.DirectUpdateHandler2.close closing DirectUpdateHandler2{commits=7,autocommits=0,soft autocommits=0,optimizes=0,rollbacks=0,expungeDeletes=0,docsPending=0,adds=0,deletesById=0,deletesByQuery=0,errors=0,cumulative_adds=305,cumulative_deletesById=0,cumulative_deletesByQuery=1,cumulative_errors=0}
[junit4:junit4]   2> 204368 T24 oasu.DefaultSolrCoreState.decref SolrCoreState ref count has reached 0 - closing IndexWriter
[junit4:junit4]   2> 204370 T24 oasu.DefaultSolrCoreState.decref Closing SolrCoreState - canceling any ongoing recovery
[junit4:junit4]   2> 205642 T98 oaz.ClientCnxn$SendThread.startConnect Opening socket connection to server localhost/127.0.0.1:49333
[junit4:junit4]   2> 209463 T99 oaz.ClientCnxn$EventThread.run EventThread shut down
[junit4:junit4]   2> 209463 T24 oaz.ZooKeeper.close Session: 0x139d12f39a30006 closed
[junit4:junit4]   2> 209465 T24 oejsh.ContextHandler.doStop stopped o.e.j.s.ServletContextHandler{/solr,null}
[junit4:junit4]   2> 209776 T24 oas.SolrTestCaseJ4.tearDown ###Ending testDistribSearch
[junit4:junit4]   2> NOTE: reproduce with: ant test  -Dtestcase=SyncSliceTest -Dtests.method=testDistribSearch -Dtests.seed=903E17273C1EBB78 -Dtests.multiplier=3 -Dtests.slow=true -Dtests.locale=ar_AE -Dtests.timezone=America/Creston -Dtests.file.encoding=UTF-8
[junit4:junit4] ERROR    210s J1 | SyncSliceTest.testDistribSearch <<<
[junit4:junit4]    > Throwable #1: org.apache.solr.client.solrj.SolrServerException: No live SolrServers available to handle this request
[junit4:junit4]    > 	at __randomizedtesting.SeedInfo.seed([903E17273C1EBB78:11D8993F4B41DB44]:0)
[junit4:junit4]    > 	at org.apache.solr.client.solrj.impl.LBHttpSolrServer.request(LBHttpSolrServer.java:323)
[junit4:junit4]    > 	at org.apache.solr.client.solrj.impl.CloudSolrServer.request(CloudSolrServer.java:257)
[junit4:junit4]    > 	at org.apache.solr.client.solrj.request.QueryRequest.process(QueryRequest.java:90)
[junit4:junit4]    > 	at org.apache.solr.client.solrj.SolrServer.query(SolrServer.java:324)
[junit4:junit4]    > 	at org.apache.solr.cloud.AbstractFullDistribZkTestBase.checkShardConsistency(AbstractFullDistribZkTestBase.java:909)
[junit4:junit4]    > 	at org.apache.solr.cloud.SyncSliceTest.doTest(SyncSliceTest.java:226)
[junit4:junit4]    > 	at org.apache.solr.BaseDistributedSearchTestCase.testDistribSearch(BaseDistributedSearchTestCase.java:695)
[junit4:junit4]    > 	at sun.reflect.NativeMethodAccessorImpl.invoke0(Native Method)
[junit4:junit4]    > 	at sun.reflect.NativeMethodAccessorImpl.invoke(NativeMethodAccessorImpl.java:57)
[junit4:junit4]    > 	at sun.reflect.DelegatingMethodAccessorImpl.invoke(DelegatingMethodAccessorImpl.java:43)
[junit4:junit4]    > 	at java.lang.reflect.Method.invoke(Method.java:616)
[junit4:junit4]    > 	at com.carrotsearch.randomizedtesting.RandomizedRunner.invoke(RandomizedRunner.java:1559)
[junit4:junit4]    > 	at com.carrotsearch.randomizedtesting.RandomizedRunner.access$600(RandomizedRunner.java:79)
[junit4:junit4]    > 	at com.carrotsearch.randomizedtesting.RandomizedRunner$6.evaluate(RandomizedRunner.java:737)
[junit4:junit4]    > 	at com.carrotsearch.randomizedtesting.RandomizedRunner$7.evaluate(RandomizedRunner.java:773)
[junit4:junit4]    > 	at com.carrotsearch.randomizedtesting.RandomizedRunner$8.evaluate(RandomizedRunner.java:787)
[junit4:junit4]    > 	at com.carrotsearch.randomizedtesting.rules.SystemPropertiesRestoreRule$1.evaluate(SystemPropertiesRestoreRule.java:53)
[junit4:junit4]    > 	at org.apache.lucene.util.TestRuleSetupTeardownChained$1.evaluate(TestRuleSetupTeardownChained.java:50)
[junit4:junit4]    > 	at org.apache.lucene.util.TestRuleFieldCacheSanity$1.evaluate(TestRuleFieldCacheSanity.java:51)
[junit4:junit4]    > 	at org.apache.lucene.util.AbstractBeforeAfterRule$1.evaluate(AbstractBeforeAfterRule.java:45)
[junit4:junit4]    > 	at com.carrotsearch.randomizedtesting.rules.SystemPropertiesInvariantRule$1.evaluate(SystemPropertiesInvariantRule.java:55)
[junit4:junit4]    > 	at org.apache.lucene.util.TestRuleThreadAndTestName$1.evaluate(TestRuleThreadAndTestName.java:48)
[junit4:junit4]    > 	at org.apache.lucene.util.TestRuleIgnoreAfterMaxFailures$1.evaluate(TestRuleIgnoreAfterMaxFailures.java:70)
[junit4:junit4]    > 	at org.apache.lucene.util.TestRuleMarkFailure$1.evaluate(TestRuleMarkFailure.java:48)
[junit4:junit4]    > 	at com.carrotsearch.randomizedtesting.rules.StatementAdapter.evaluate(StatementAdapter.java:36)
[junit4:junit4]    > 	at com.carrotsearch.randomizedtesting.ThreadLeakControl$StatementRunner.run(ThreadLeakControl.java:358)
[junit4:junit4]    > 	at com.carrotsearch.randomizedtesting.ThreadLeakControl.forkTimeoutingTask(ThreadLeakControl.java:782)
[junit4:junit4]    > 	at com.carrotsearch.randomizedtesting.ThreadLeakControl$3.evaluate(ThreadLeakControl.java:442)
[junit4:junit4]    > 	at com.carrotsearch.randomizedtesting.RandomizedRunner.runSingleTest(RandomizedRunner.java:746)
[junit4:junit4]    > 	at com.carrotsearch.randomizedtesting.RandomizedRunner$3.evaluate(RandomizedRunner.java:648)
[junit4:junit4]    > 	at com.carrotsearch.randomizedtesting.RandomizedRunner$4.evaluate(RandomizedRunner.java:682)
[junit4:junit4]    > 	at com.carrotsearch.randomizedtesting.RandomizedRunner$5.evaluate(RandomizedRunner.java:693)
[junit4:junit4]    > 	at com.carrotsearch.randomizedtesting.rules.StatementAdapter.evaluate(StatementAdapter.java:36)
[junit4:junit4]    > 	at com.carrotsearch.randomizedtesting.rules.SystemPropertiesRestoreRule$1.evaluate(SystemPropertiesRestoreRule.java:53)
[junit4:junit4]    > 	at org.apache.lucene.util.AbstractBeforeAfterRule$1.evaluate(AbstractBeforeAfterRule.java:45)
[junit4:junit4]    > 	at org.apache.lucene.util.TestRuleStoreClassName$1.evaluate(TestRuleStoreClassName.java:42)
[junit4:junit4]    > 	at com.carrotsearch.randomizedtesting.rules.SystemPropertiesInvariantRule$1.evaluate(SystemPropertiesInvariantRule.java:55)
[junit4:junit4]    > 	at com.carrotsearch.randomizedtesting.rules.NoShadowingOrOverridesOnMethodsRule$1.evaluate(NoShadowingOrOverridesOnMethodsRule.java:39)
[junit4:junit4]    > 	at com.carrotsearch.randomizedtesting.rules.NoShadowingOrOverridesOnMethodsRule$1.evaluate(NoShadowingOrOverridesOnMethodsRule.java:39)
[junit4:junit4]    > 	at com.carrotsearch.randomizedtesting.rules.StatementAdapter.evaluate(StatementAdapter.java:36)
[junit4:junit4]    > 	at org.apache.lucene.util.TestRuleAssertionsRequired$1.evaluate(TestRuleAssertionsRequired.java:43)
[junit4:junit4]    > 	at org.apache.lucene.util.TestRuleMarkFailure$1.evaluate(TestRuleMarkFailure.java:48)
[junit4:junit4]    > 	at org.apache.lucene.util.TestRuleIgnoreAfterMaxFailures$1.evaluate(TestRuleIgnoreAfterMaxFailures.java:70)
[junit4:junit4]    > 	at org.apache.lucene.util.TestRuleIgnoreTestSuites$1.evaluate(TestRuleIgnoreTestSuites.java:55)
[junit4:junit4]    > 	at com.carrotsearch.randomizedtesting.rules.StatementAdapter.evaluate(StatementAdapter.java:36)
[junit4:junit4]    > 	at com.carrotsearch.randomizedtesting.ThreadLeakControl$StatementRunner.run(ThreadLeakControl.java:358)
[junit4:junit4]    > 	at java.lang.Thread.run(Thread.java:679)
[junit4:junit4]   2> 209938 T24 oas.SolrTestCaseJ4.deleteCore ###deleteCore
[junit4:junit4]   2> NOTE: test params are: codec=Lucene40: {range_facet_l=PostingsFormat(name=MockRandom), text=PostingsFormat(name=TestBloomFilteredLucene40Postings), _version_=PostingsFormat(name=MockRandom), rnd_b=PostingsFormat(name=MockSep), intDefault=PostingsFormat(name=MockRandom), id=PostingsFormat(name=MockSep), timestamp=PostingsFormat(name=MockRandom), a_t=PostingsFormat(name=SimpleText), range_facet_sl=PostingsFormat(name=MockSep), range_facet_si=PostingsFormat(name=SimpleText), other_tl1=PostingsFormat(name=MockRandom), multiDefault=PostingsFormat(name=MockRandom), a_si=PostingsFormat(name=MockRandom)}, sim=DefaultSimilarity, locale=ar_AE, timezone=America/Creston
[junit4:junit4]   2> NOTE: FreeBSD 9.0-RELEASE amd64/Sun Microsystems Inc. 1.6.0_32 (64-bit)/cpus=16,threads=1,free=107471976,total=157089792
[junit4:junit4]   2> NOTE: All tests run in this JVM: [TestMergePolicyConfig, TestDocumentBuilder, TestQuerySenderListener, TestSolrDeletionPolicy2, ConvertedLegacyTest, SyncSliceTest]
[junit4:junit4] Completed on J1 in 210.00s, 1 test, 1 error <<< FAILURES!

[...truncated 511 lines...]
BUILD FAILED
/usr/home/hudson/hudson-slave/workspace/Lucene-Solr-Tests-4.x-Java6/build.xml:32: The following error occurred while executing this line:
/usr/home/hudson/hudson-slave/workspace/Lucene-Solr-Tests-4.x-Java6/solr/build.xml:146: The following error occurred while executing this line:
/usr/home/hudson/hudson-slave/workspace/Lucene-Solr-Tests-4.x-Java6/lucene/module-build.xml:63: The following error occurred while executing this line:
/usr/home/hudson/hudson-slave/workspace/Lucene-Solr-Tests-4.x-Java6/lucene/common-build.xml:1133: The following error occurred while executing this line:
/usr/home/hudson/hudson-slave/workspace/Lucene-Solr-Tests-4.x-Java6/lucene/common-build.xml:810: There were test failures: 229 suites, 927 tests, 1 error, 7 ignored (2 assumptions)

Total time: 28 minutes 20 seconds
Build step 'Invoke Ant' marked build as failure
Recording test results
Email was triggered for: Failure
Sending email for trigger: Failure



Mime
View raw message