lucene-dev mailing list archives

Site index · List index
Message view « Date » · « Thread »
Top « Date » · « Thread »
From Policeman Jenkins Server <jenk...@sd-datasolutions.de>
Subject [JENKINS] Lucene-Solr-4.x-Windows (32bit/jdk1.7.0_07) - Build # 926 - Failure!
Date Tue, 25 Sep 2012 22:05:21 GMT
Build: http://jenkins.sd-datasolutions.de/job/Lucene-Solr-4.x-Windows/926/
Java: 32bit/jdk1.7.0_07 -server -XX:+UseG1GC

1 tests failed.
REGRESSION:  org.apache.solr.cloud.FullSolrCloudDistribCmdsTest.testDistribSearch

Error Message:
No registered leader was found, collection:collection1 slice:shard2

Stack Trace:
org.apache.solr.common.SolrException: No registered leader was found, collection:collection1 slice:shard2
	at __randomizedtesting.SeedInfo.seed([501F48191C20334D:D1F9C6016B7F5371]:0)
	at org.apache.solr.common.cloud.ZkStateReader.getLeaderProps(ZkStateReader.java:413)
	at org.apache.solr.cloud.AbstractFullDistribZkTestBase.createJettys(AbstractFullDistribZkTestBase.java:324)
	at org.apache.solr.cloud.AbstractFullDistribZkTestBase.createServers(AbstractFullDistribZkTestBase.java:268)
	at org.apache.solr.BaseDistributedSearchTestCase.testDistribSearch(BaseDistributedSearchTestCase.java:693)
	at sun.reflect.NativeMethodAccessorImpl.invoke0(Native Method)
	at sun.reflect.NativeMethodAccessorImpl.invoke(NativeMethodAccessorImpl.java:57)
	at sun.reflect.DelegatingMethodAccessorImpl.invoke(DelegatingMethodAccessorImpl.java:43)
	at java.lang.reflect.Method.invoke(Method.java:601)
	at com.carrotsearch.randomizedtesting.RandomizedRunner.invoke(RandomizedRunner.java:1559)
	at com.carrotsearch.randomizedtesting.RandomizedRunner.access$600(RandomizedRunner.java:79)
	at com.carrotsearch.randomizedtesting.RandomizedRunner$6.evaluate(RandomizedRunner.java:737)
	at com.carrotsearch.randomizedtesting.RandomizedRunner$7.evaluate(RandomizedRunner.java:773)
	at com.carrotsearch.randomizedtesting.RandomizedRunner$8.evaluate(RandomizedRunner.java:787)
	at com.carrotsearch.randomizedtesting.rules.SystemPropertiesRestoreRule$1.evaluate(SystemPropertiesRestoreRule.java:53)
	at org.apache.lucene.util.TestRuleSetupTeardownChained$1.evaluate(TestRuleSetupTeardownChained.java:50)
	at org.apache.lucene.util.TestRuleFieldCacheSanity$1.evaluate(TestRuleFieldCacheSanity.java:51)
	at org.apache.lucene.util.AbstractBeforeAfterRule$1.evaluate(AbstractBeforeAfterRule.java:45)
	at com.carrotsearch.randomizedtesting.rules.SystemPropertiesInvariantRule$1.evaluate(SystemPropertiesInvariantRule.java:55)
	at org.apache.lucene.util.TestRuleThreadAndTestName$1.evaluate(TestRuleThreadAndTestName.java:48)
	at org.apache.lucene.util.TestRuleIgnoreAfterMaxFailures$1.evaluate(TestRuleIgnoreAfterMaxFailures.java:70)
	at org.apache.lucene.util.TestRuleMarkFailure$1.evaluate(TestRuleMarkFailure.java:48)
	at com.carrotsearch.randomizedtesting.rules.StatementAdapter.evaluate(StatementAdapter.java:36)
	at com.carrotsearch.randomizedtesting.ThreadLeakControl$StatementRunner.run(ThreadLeakControl.java:358)
	at com.carrotsearch.randomizedtesting.ThreadLeakControl.forkTimeoutingTask(ThreadLeakControl.java:782)
	at com.carrotsearch.randomizedtesting.ThreadLeakControl$3.evaluate(ThreadLeakControl.java:442)
	at com.carrotsearch.randomizedtesting.RandomizedRunner.runSingleTest(RandomizedRunner.java:746)
	at com.carrotsearch.randomizedtesting.RandomizedRunner$3.evaluate(RandomizedRunner.java:648)
	at com.carrotsearch.randomizedtesting.RandomizedRunner$4.evaluate(RandomizedRunner.java:682)
	at com.carrotsearch.randomizedtesting.RandomizedRunner$5.evaluate(RandomizedRunner.java:693)
	at com.carrotsearch.randomizedtesting.rules.StatementAdapter.evaluate(StatementAdapter.java:36)
	at com.carrotsearch.randomizedtesting.rules.SystemPropertiesRestoreRule$1.evaluate(SystemPropertiesRestoreRule.java:53)
	at org.apache.lucene.util.AbstractBeforeAfterRule$1.evaluate(AbstractBeforeAfterRule.java:45)
	at org.apache.lucene.util.TestRuleStoreClassName$1.evaluate(TestRuleStoreClassName.java:42)
	at com.carrotsearch.randomizedtesting.rules.SystemPropertiesInvariantRule$1.evaluate(SystemPropertiesInvariantRule.java:55)
	at com.carrotsearch.randomizedtesting.rules.NoShadowingOrOverridesOnMethodsRule$1.evaluate(NoShadowingOrOverridesOnMethodsRule.java:39)
	at com.carrotsearch.randomizedtesting.rules.NoShadowingOrOverridesOnMethodsRule$1.evaluate(NoShadowingOrOverridesOnMethodsRule.java:39)
	at com.carrotsearch.randomizedtesting.rules.StatementAdapter.evaluate(StatementAdapter.java:36)
	at org.apache.lucene.util.TestRuleAssertionsRequired$1.evaluate(TestRuleAssertionsRequired.java:43)
	at org.apache.lucene.util.TestRuleMarkFailure$1.evaluate(TestRuleMarkFailure.java:48)
	at org.apache.lucene.util.TestRuleIgnoreAfterMaxFailures$1.evaluate(TestRuleIgnoreAfterMaxFailures.java:70)
	at org.apache.lucene.util.TestRuleIgnoreTestSuites$1.evaluate(TestRuleIgnoreTestSuites.java:55)
	at com.carrotsearch.randomizedtesting.rules.StatementAdapter.evaluate(StatementAdapter.java:36)
	at com.carrotsearch.randomizedtesting.ThreadLeakControl$StatementRunner.run(ThreadLeakControl.java:358)
	at java.lang.Thread.run(Thread.java:722)




Build Log:
[...truncated 7943 lines...]
[junit4:junit4] Suite: org.apache.solr.cloud.FullSolrCloudDistribCmdsTest
[junit4:junit4]   2> 16 T2539 oas.SolrTestCaseJ4.setUp ###Starting testDistribSearch
[junit4:junit4]   2> Creating dataDir: C:\Users\JenkinsSlave\workspace\Lucene-Solr-4.x-Windows\solr\build\solr-core\test\J0\.\solrtest-FullSolrCloudDistribCmdsTest-1348610217783
[junit4:junit4]   2> 16 T2539 oasc.ZkTestServer.run STARTING ZK TEST SERVER
[junit4:junit4]   2> 16 T2540 oazs.ZooKeeperServer.setTickTime tickTime set to 1000
[junit4:junit4]   2> 16 T2540 oazs.NIOServerCnxn$Factory.<init> binding to port 0.0.0.0/0.0.0.0:0
[junit4:junit4]   2> 16 T2540 oazsp.FileTxnSnapLog.save Snapshotting: 0
[junit4:junit4]   2> 124 T2539 oasc.ZkTestServer.run start zk server on port:51389
[junit4:junit4]   2> 124 T2539 oaz.ZooKeeper.<init> Initiating client connection, connectString=127.0.0.1:51389 sessionTimeout=10000 watcher=org.apache.solr.common.cloud.ConnectionManager@a8d899
[junit4:junit4]   2> 124 T2545 oaz.ClientCnxn$SendThread.startConnect Opening socket connection to server /127.0.0.1:51389
[junit4:junit4]   2> 124 T2539 oascc.ConnectionManager.waitForConnected Waiting for client to connect to ZooKeeper
[junit4:junit4]   2> 124 T2545 oaz.ClientCnxn$SendThread.primeConnection Socket connection established to 127.0.0.1/127.0.0.1:51389, initiating session
[junit4:junit4]   2> 124 T2541 oazs.NIOServerCnxn$Factory.run Accepted socket connection from /127.0.0.1:51392
[junit4:junit4]   2> 124 T2541 oazs.NIOServerCnxn.readConnectRequest Client attempting to establish new session at /127.0.0.1:51392
[junit4:junit4]   2> 124 T2543 oazsp.FileTxnLog.append Creating new log file: log.1
[junit4:junit4]   2> 140 T2543 oazs.NIOServerCnxn.finishSessionInit Established session 0x139ff6ed7370000 with negotiated timeout 10000 for client /127.0.0.1:51392
[junit4:junit4]   2> 140 T2545 oaz.ClientCnxn$SendThread.readConnectResult Session establishment complete on server 127.0.0.1/127.0.0.1:51389, sessionid = 0x139ff6ed7370000, negotiated timeout = 10000
[junit4:junit4]   2> 140 T2546 oascc.ConnectionManager.process Watcher org.apache.solr.common.cloud.ConnectionManager@a8d899 name:ZooKeeperConnection Watcher:127.0.0.1:51389 got event WatchedEvent state:SyncConnected type:None path:null path:null type:None
[junit4:junit4]   2> 140 T2539 oascc.ConnectionManager.waitForConnected Client is connected to ZooKeeper
[junit4:junit4]   2> 140 T2539 oascc.SolrZkClient.makePath makePath: /solr
[junit4:junit4]   2> 155 T2544 oazs.PrepRequestProcessor.pRequest Processed session termination for sessionid: 0x139ff6ed7370000
[junit4:junit4]   2> 155 T2546 oaz.ClientCnxn$EventThread.run EventThread shut down
[junit4:junit4]   2> 155 T2539 oaz.ZooKeeper.close Session: 0x139ff6ed7370000 closed
[junit4:junit4]   2> 155 T2539 oaz.ZooKeeper.<init> Initiating client connection, connectString=127.0.0.1:51389/solr sessionTimeout=10000 watcher=org.apache.solr.common.cloud.ConnectionManager@1df1104
[junit4:junit4]   2> 155 T2541 oazs.NIOServerCnxn.closeSock Closed socket connection for client /127.0.0.1:51392 which had sessionid 0x139ff6ed7370000
[junit4:junit4]   2> 171 T2547 oaz.ClientCnxn$SendThread.startConnect Opening socket connection to server /127.0.0.1:51389
[junit4:junit4]   2> 171 T2539 oascc.ConnectionManager.waitForConnected Waiting for client to connect to ZooKeeper
[junit4:junit4]   2> 171 T2547 oaz.ClientCnxn$SendThread.primeConnection Socket connection established to 127.0.0.1/127.0.0.1:51389, initiating session
[junit4:junit4]   2> 171 T2541 oazs.NIOServerCnxn$Factory.run Accepted socket connection from /127.0.0.1:51395
[junit4:junit4]   2> 171 T2541 oazs.NIOServerCnxn.readConnectRequest Client attempting to establish new session at /127.0.0.1:51395
[junit4:junit4]   2> 186 T2543 oazs.NIOServerCnxn.finishSessionInit Established session 0x139ff6ed7370001 with negotiated timeout 10000 for client /127.0.0.1:51395
[junit4:junit4]   2> 186 T2547 oaz.ClientCnxn$SendThread.readConnectResult Session establishment complete on server 127.0.0.1/127.0.0.1:51389, sessionid = 0x139ff6ed7370001, negotiated timeout = 10000
[junit4:junit4]   2> 186 T2548 oascc.ConnectionManager.process Watcher org.apache.solr.common.cloud.ConnectionManager@1df1104 name:ZooKeeperConnection Watcher:127.0.0.1:51389/solr got event WatchedEvent state:SyncConnected type:None path:null path:null type:None
[junit4:junit4]   2> 186 T2539 oascc.ConnectionManager.waitForConnected Client is connected to ZooKeeper
[junit4:junit4]   2> 186 T2539 oascc.SolrZkClient.makePath makePath: /collections/collection1
[junit4:junit4]   2> 217 T2539 oascc.SolrZkClient.makePath makePath: /collections/collection1/shards
[junit4:junit4]   2> 232 T2539 oascc.SolrZkClient.makePath makePath: /collections/control_collection
[junit4:junit4]   2> 263 T2539 oascc.SolrZkClient.makePath makePath: /collections/control_collection/shards
[junit4:junit4]   2> 279 T2539 oasc.AbstractZkTestCase.putConfig put C:\Users\JenkinsSlave\workspace\Lucene-Solr-4.x-Windows\solr\build\solr-core\test-files\solr\collection1\conf\solrconfig.xml to /configs/conf1/solrconfig.xml
[junit4:junit4]   2> 279 T2539 oascc.SolrZkClient.makePath makePath: /configs/conf1/solrconfig.xml
[junit4:junit4]   2> 325 T2539 oasc.AbstractZkTestCase.putConfig put C:\Users\JenkinsSlave\workspace\Lucene-Solr-4.x-Windows\solr\build\solr-core\test-files\solr\collection1\conf\schema.xml to /configs/conf1/schema.xml
[junit4:junit4]   2> 325 T2539 oascc.SolrZkClient.makePath makePath: /configs/conf1/schema.xml
[junit4:junit4]   2> 341 T2539 oasc.AbstractZkTestCase.putConfig put C:\Users\JenkinsSlave\workspace\Lucene-Solr-4.x-Windows\solr\build\solr-core\test-files\solr\collection1\conf\solrconfig.xml to /configs/conf1/solrconfig.xml
[junit4:junit4]   2> 341 T2539 oascc.SolrZkClient.makePath makePath: /configs/conf1/solrconfig.xml
[junit4:junit4]   2> 341 T2539 oasc.AbstractZkTestCase.putConfig put C:\Users\JenkinsSlave\workspace\Lucene-Solr-4.x-Windows\solr\build\solr-core\test-files\solr\collection1\conf\stopwords.txt to /configs/conf1/stopwords.txt
[junit4:junit4]   2> 341 T2539 oascc.SolrZkClient.makePath makePath: /configs/conf1/stopwords.txt
[junit4:junit4]   2> 356 T2539 oasc.AbstractZkTestCase.putConfig put C:\Users\JenkinsSlave\workspace\Lucene-Solr-4.x-Windows\solr\build\solr-core\test-files\solr\collection1\conf\protwords.txt to /configs/conf1/protwords.txt
[junit4:junit4]   2> 356 T2539 oascc.SolrZkClient.makePath makePath: /configs/conf1/protwords.txt
[junit4:junit4]   2> 372 T2539 oasc.AbstractZkTestCase.putConfig put C:\Users\JenkinsSlave\workspace\Lucene-Solr-4.x-Windows\solr\build\solr-core\test-files\solr\collection1\conf\currency.xml to /configs/conf1/currency.xml
[junit4:junit4]   2> 372 T2539 oascc.SolrZkClient.makePath makePath: /configs/conf1/currency.xml
[junit4:junit4]   2> 387 T2539 oasc.AbstractZkTestCase.putConfig put C:\Users\JenkinsSlave\workspace\Lucene-Solr-4.x-Windows\solr\build\solr-core\test-files\solr\collection1\conf\open-exchange-rates.json to /configs/conf1/open-exchange-rates.json
[junit4:junit4]   2> 387 T2539 oascc.SolrZkClient.makePath makePath: /configs/conf1/open-exchange-rates.json
[junit4:junit4]   2> 403 T2539 oasc.AbstractZkTestCase.putConfig put C:\Users\JenkinsSlave\workspace\Lucene-Solr-4.x-Windows\solr\build\solr-core\test-files\solr\collection1\conf\mapping-ISOLatin1Accent.txt to /configs/conf1/mapping-ISOLatin1Accent.txt
[junit4:junit4]   2> 403 T2539 oascc.SolrZkClient.makePath makePath: /configs/conf1/mapping-ISOLatin1Accent.txt
[junit4:junit4]   2> 403 T2539 oasc.AbstractZkTestCase.putConfig put C:\Users\JenkinsSlave\workspace\Lucene-Solr-4.x-Windows\solr\build\solr-core\test-files\solr\collection1\conf\old_synonyms.txt to /configs/conf1/old_synonyms.txt
[junit4:junit4]   2> 403 T2539 oascc.SolrZkClient.makePath makePath: /configs/conf1/old_synonyms.txt
[junit4:junit4]   2> 418 T2539 oasc.AbstractZkTestCase.putConfig put C:\Users\JenkinsSlave\workspace\Lucene-Solr-4.x-Windows\solr\build\solr-core\test-files\solr\collection1\conf\synonyms.txt to /configs/conf1/synonyms.txt
[junit4:junit4]   2> 418 T2539 oascc.SolrZkClient.makePath makePath: /configs/conf1/synonyms.txt
[junit4:junit4]   2> 434 T2544 oazs.PrepRequestProcessor.pRequest Processed session termination for sessionid: 0x139ff6ed7370001
[junit4:junit4]   2> 464 T2541 oazs.NIOServerCnxn.doIO WARNING EndOfStreamException: Unable to read additional data from client sessionid 0x139ff6ed7370001, likely client has closed socket
[junit4:junit4]   2> 464 T2541 oazs.NIOServerCnxn.closeSock Closed socket connection for client /127.0.0.1:51395 which had sessionid 0x139ff6ed7370001
[junit4:junit4]   2> 464 T2548 oaz.ClientCnxn$EventThread.run EventThread shut down
[junit4:junit4]   2> 464 T2539 oaz.ZooKeeper.close Session: 0x139ff6ed7370001 closed
[junit4:junit4]   2> 464 T2539 oejs.Server.doStart jetty-8.1.2.v20120308
[junit4:junit4]   2> 464 T2539 oejs.AbstractConnector.doStart Started SocketConnector@0.0.0.0:51396
[junit4:junit4]   2> 464 T2539 oasc.SolrResourceLoader.locateSolrHome JNDI not configured for solr (NoInitialContextEx)
[junit4:junit4]   2> 464 T2539 oasc.SolrResourceLoader.locateSolrHome using system property solr.solr.home: C:\Users\JenkinsSlave\workspace\Lucene-Solr-4.x-Windows\solr\build\solr-core\test-files\solr
[junit4:junit4]   2> 464 T2539 oasc.SolrResourceLoader.<init> new SolrResourceLoader for deduced Solr Home: 'C:\Users\JenkinsSlave\workspace\Lucene-Solr-4.x-Windows\solr\build\solr-core\test-files\solr\'
[junit4:junit4]   2> 495 T2539 oass.SolrDispatchFilter.init SolrDispatchFilter.init()
[junit4:junit4]   2> 495 T2539 oasc.SolrResourceLoader.locateSolrHome JNDI not configured for solr (NoInitialContextEx)
[junit4:junit4]   2> 495 T2539 oasc.SolrResourceLoader.locateSolrHome using system property solr.solr.home: C:\Users\JenkinsSlave\workspace\Lucene-Solr-4.x-Windows\solr\build\solr-core\test-files\solr
[junit4:junit4]   2> 495 T2539 oasc.CoreContainer$Initializer.initialize looking for solr.xml: C:\Users\JenkinsSlave\workspace\Lucene-Solr-4.x-Windows\solr\build\solr-core\test-files\solr\solr.xml
[junit4:junit4]   2> 495 T2539 oasc.CoreContainer.<init> New CoreContainer 1545936
[junit4:junit4]   2> 511 T2539 oasc.CoreContainer.load Loading CoreContainer using Solr Home: 'C:\Users\JenkinsSlave\workspace\Lucene-Solr-4.x-Windows\solr\build\solr-core\test-files\solr\'
[junit4:junit4]   2> 511 T2539 oasc.SolrResourceLoader.<init> new SolrResourceLoader for directory: 'C:\Users\JenkinsSlave\workspace\Lucene-Solr-4.x-Windows\solr\build\solr-core\test-files\solr\'
[junit4:junit4]   2> 526 T2539 oasc.CoreContainer.load Registering Log Listener
[junit4:junit4]   2> 542 T2539 oasc.CoreContainer.initZooKeeper Zookeeper client=127.0.0.1:51389/solr
[junit4:junit4]   2> 542 T2539 oaz.ZooKeeper.<init> Initiating client connection, connectString=127.0.0.1:51389/solr sessionTimeout=5000 watcher=org.apache.solr.common.cloud.ConnectionManager@f0c7ae
[junit4:junit4]   2> 542 T2539 oascc.ConnectionManager.waitForConnected Waiting for client to connect to ZooKeeper
[junit4:junit4]   2> 542 T2558 oaz.ClientCnxn$SendThread.startConnect Opening socket connection to server /127.0.0.1:51389
[junit4:junit4]   2> 542 T2558 oaz.ClientCnxn$SendThread.primeConnection Socket connection established to 127.0.0.1/127.0.0.1:51389, initiating session
[junit4:junit4]   2> 542 T2541 oazs.NIOServerCnxn$Factory.run Accepted socket connection from /127.0.0.1:51399
[junit4:junit4]   2> 542 T2541 oazs.NIOServerCnxn.readConnectRequest Client attempting to establish new session at /127.0.0.1:51399
[junit4:junit4]   2> 573 T2558 oaz.ClientCnxn$SendThread.readConnectResult Session establishment complete on server 127.0.0.1/127.0.0.1:51389, sessionid = 0x139ff6ed7370002, negotiated timeout = 5000
[junit4:junit4]   2> 573 T2543 oazs.NIOServerCnxn.finishSessionInit Established session 0x139ff6ed7370002 with negotiated timeout 5000 for client /127.0.0.1:51399
[junit4:junit4]   2> 588 T2559 oascc.ConnectionManager.process Watcher org.apache.solr.common.cloud.ConnectionManager@f0c7ae name:ZooKeeperConnection Watcher:127.0.0.1:51389/solr got event WatchedEvent state:SyncConnected type:None path:null path:null type:None
[junit4:junit4]   2> 588 T2539 oascc.ConnectionManager.waitForConnected Client is connected to ZooKeeper
[junit4:junit4]   2> 604 T2544 oazs.PrepRequestProcessor.pRequest Got user-level KeeperException when processing sessionid:0x139ff6ed7370002 type:create cxid:0x2 zxid:0xfffffffffffffffe txntype:unknown reqpath:n/a Error Path:/solr/overseer Error:KeeperErrorCode = NodeExists for /solr/overseer
[junit4:junit4]   2> 619 T2539 oascc.SolrZkClient.makePath makePath: /live_nodes
[junit4:junit4]   2> 650 T2539 oasc.ZkController.createEphemeralLiveNode Register node as live in ZooKeeper:/live_nodes/127.0.0.1:51396_solr
[junit4:junit4]   2> 650 T2544 oazs.PrepRequestProcessor.pRequest Got user-level KeeperException when processing sessionid:0x139ff6ed7370002 type:delete cxid:0x7 zxid:0xfffffffffffffffe txntype:unknown reqpath:n/a Error Path:/solr/live_nodes/127.0.0.1:51396_solr Error:KeeperErrorCode = NoNode for /solr/live_nodes/127.0.0.1:51396_solr
[junit4:junit4]   2> 666 T2539 oascc.SolrZkClient.makePath makePath: /live_nodes/127.0.0.1:51396_solr
[junit4:junit4]   2> 681 T2539 oashc.HttpShardHandlerFactory.getParameter Setting socketTimeout to: 0
[junit4:junit4]   2> 681 T2539 oashc.HttpShardHandlerFactory.getParameter Setting urlScheme to: http://
[junit4:junit4]   2> 681 T2539 oashc.HttpShardHandlerFactory.getParameter Setting connTimeout to: 0
[junit4:junit4]   2> 681 T2539 oashc.HttpShardHandlerFactory.getParameter Setting maxConnectionsPerHost to: 20
[junit4:junit4]   2> 681 T2539 oashc.HttpShardHandlerFactory.getParameter Setting corePoolSize to: 0
[junit4:junit4]   2> 681 T2539 oashc.HttpShardHandlerFactory.getParameter Setting maximumPoolSize to: 2147483647
[junit4:junit4]   2> 681 T2539 oashc.HttpShardHandlerFactory.getParameter Setting maxThreadIdleTime to: 5
[junit4:junit4]   2> 681 T2539 oashc.HttpShardHandlerFactory.getParameter Setting sizeOfQueue to: -1
[junit4:junit4]   2> 681 T2539 oashc.HttpShardHandlerFactory.getParameter Setting fairnessPolicy to: false
[junit4:junit4]   2> 681 T2539 oascsi.HttpClientUtil.createClient Creating new http client, config:maxConnectionsPerHost=20&maxConnections=10000&socketTimeout=0&connTimeout=0&retry=false
[junit4:junit4]   2> 697 T2539 oascc.SolrZkClient.makePath makePath: /overseer_elect/election
[junit4:junit4]   2> 774 T2544 oazs.PrepRequestProcessor.pRequest Got user-level KeeperException when processing sessionid:0x139ff6ed7370002 type:delete cxid:0x15 zxid:0xfffffffffffffffe txntype:unknown reqpath:n/a Error Path:/solr/overseer_elect/leader Error:KeeperErrorCode = NoNode for /solr/overseer_elect/leader
[junit4:junit4]   2> 789 T2539 oascc.SolrZkClient.makePath makePath: /overseer_elect/leader
[junit4:junit4]   2> 805 T2539 oasc.Overseer.start Overseer (id=88382519232626690-127.0.0.1:51396_solr-n_0000000000) starting
[junit4:junit4]   2> 805 T2544 oazs.PrepRequestProcessor.pRequest Got user-level KeeperException when processing sessionid:0x139ff6ed7370002 type:create cxid:0x1a zxid:0xfffffffffffffffe txntype:unknown reqpath:n/a Error Path:/solr/overseer Error:KeeperErrorCode = NodeExists for /solr/overseer
[junit4:junit4]   2> 820 T2544 oazs.PrepRequestProcessor.pRequest Got user-level KeeperException when processing sessionid:0x139ff6ed7370002 type:create cxid:0x1b zxid:0xfffffffffffffffe txntype:unknown reqpath:n/a Error Path:/solr/overseer Error:KeeperErrorCode = NodeExists for /solr/overseer
[junit4:junit4]   2> 836 T2544 oazs.PrepRequestProcessor.pRequest Got user-level KeeperException when processing sessionid:0x139ff6ed7370002 type:create cxid:0x1c zxid:0xfffffffffffffffe txntype:unknown reqpath:n/a Error Path:/solr/overseer Error:KeeperErrorCode = NodeExists for /solr/overseer
[junit4:junit4]   2> 867 T2544 oazs.PrepRequestProcessor.pRequest Got user-level KeeperException when processing sessionid:0x139ff6ed7370002 type:create cxid:0x1d zxid:0xfffffffffffffffe txntype:unknown reqpath:n/a Error Path:/solr/overseer Error:KeeperErrorCode = NodeExists for /solr/overseer
[junit4:junit4]   2> 882 T2561 oasc.OverseerCollectionProcessor.run Process current queue of collection creations
[junit4:junit4]   2> 882 T2539 oascc.SolrZkClient.makePath makePath: /clusterstate.json
[junit4:junit4]   2> 898 T2539 oascc.ZkStateReader.createClusterStateWatchersAndUpdate Updating cluster state from ZooKeeper... 
[junit4:junit4]   2> 898 T2560 oasc.Overseer$ClusterStateUpdater.run Starting to work on the main queue
[junit4:junit4]   2> 913 T2539 oasc.CoreContainer.create Creating SolrCore 'collection1' using instanceDir: C:\Users\JenkinsSlave\workspace\Lucene-Solr-4.x-Windows\solr\build\solr-core\test-files\solr\collection1
[junit4:junit4]   2> 913 T2539 oasc.ZkController.createCollectionZkNode Check for collection zkNode:control_collection
[junit4:junit4]   2> 913 T2539 oasc.ZkController.createCollectionZkNode Collection zkNode exists
[junit4:junit4]   2> 913 T2539 oasc.ZkController.readConfigName Load collection config from:/collections/control_collection
[junit4:junit4]   2> 913 T2539 oasc.SolrResourceLoader.<init> new SolrResourceLoader for directory: 'C:\Users\JenkinsSlave\workspace\Lucene-Solr-4.x-Windows\solr\build\solr-core\test-files\solr\collection1\'
[junit4:junit4]   2> 913 T2539 oasc.SolrResourceLoader.replaceClassLoader Adding 'file:/C:/Users/JenkinsSlave/workspace/Lucene-Solr-4.x-Windows/solr/build/solr-core/test-files/solr/collection1/lib/classes/' to classloader
[junit4:junit4]   2> 913 T2539 oasc.SolrResourceLoader.replaceClassLoader Adding 'file:/C:/Users/JenkinsSlave/workspace/Lucene-Solr-4.x-Windows/solr/build/solr-core/test-files/solr/collection1/lib/README' to classloader
[junit4:junit4]   2> 975 T2539 oasc.SolrConfig.<init> Using Lucene MatchVersion: LUCENE_41
[junit4:junit4]   2> 1052 T2539 oasc.SolrConfig.<init> Loaded SolrConfig: solrconfig.xml
[junit4:junit4]   2> 1052 T2539 oass.IndexSchema.readSchema Reading Solr Schema
[junit4:junit4]   2> 1068 T2539 oass.IndexSchema.readSchema Schema name=test
[junit4:junit4]   2> 1609 T2539 oass.OpenExchangeRatesOrgProvider.init Initialized with rates=open-exchange-rates.json, refreshInterval=1440.
[junit4:junit4]   2> 1625 T2539 oass.IndexSchema.readSchema default search field in schema is text
[junit4:junit4]   2> 1625 T2539 oass.IndexSchema.readSchema unique key field: id
[junit4:junit4]   2> 1640 T2539 oass.FileExchangeRateProvider.reload Reloading exchange rates from file currency.xml
[junit4:junit4]   2> 1640 T2539 oass.FileExchangeRateProvider.reload Reloading exchange rates from file currency.xml
[junit4:junit4]   2> 1640 T2539 oass.OpenExchangeRatesOrgProvider.reload Reloading exchange rates from open-exchange-rates.json
[junit4:junit4]   2> 1640 T2539 oass.OpenExchangeRatesOrgProvider.reload Reloading exchange rates from open-exchange-rates.json
[junit4:junit4]   2> 1640 T2539 oasc.SolrCore.<init> [collection1] Opening new SolrCore at C:\Users\JenkinsSlave\workspace\Lucene-Solr-4.x-Windows\solr\build\solr-core\test-files\solr\collection1\, dataDir=.\org.apache.solr.cloud.FullSolrCloudDistribCmdsTest-1348610217783/control/data\
[junit4:junit4]   2> 1656 T2539 oasc.JmxMonitoredMap.<init> JMX monitoring is enabled. Adding Solr mbeans to JMX Server: com.sun.jmx.mbeanserver.JmxMBeanServer@45e380
[junit4:junit4]   2> 1656 T2539 oasc.SolrCore.getNewIndexDir WARNING New index directory detected: old=null new=.\org.apache.solr.cloud.FullSolrCloudDistribCmdsTest-1348610217783/control/data\index/
[junit4:junit4]   2> 1656 T2539 oasc.SolrCore.initIndex WARNING [collection1] Solr index directory '.\org.apache.solr.cloud.FullSolrCloudDistribCmdsTest-1348610217783\control\data\index' doesn't exist. Creating new index...
[junit4:junit4]   2> 1656 T2539 oasc.CachingDirectoryFactory.get return new directory for C:\Users\JenkinsSlave\workspace\Lucene-Solr-4.x-Windows\solr\build\solr-core\test\J0\.\org.apache.solr.cloud.FullSolrCloudDistribCmdsTest-1348610217783\control\data\index forceNew:false
[junit4:junit4]   2> 1717 T2539 oasc.SolrDeletionPolicy.onCommit SolrDeletionPolicy.onCommit: commits:num=1
[junit4:junit4]   2> 		commit{dir=NRTCachingDirectory(org.apache.lucene.store.SimpleFSDirectory@C:\Users\JenkinsSlave\workspace\Lucene-Solr-4.x-Windows\solr\build\solr-core\test\J0\org.apache.solr.cloud.FullSolrCloudDistribCmdsTest-1348610217783\control\data\index lockFactory=org.apache.lucene.store.NativeFSLockFactory@1dd334; maxCacheMB=48.0 maxMergeSizeMB=4.0),segFN=segments_1,generation=1,filenames=[segments_1]
[junit4:junit4]   2> 1717 T2539 oasc.SolrDeletionPolicy.updateCommits newest commit = 1
[junit4:junit4]   2> 1717 T2539 oasc.SolrCore.initWriters created xml: solr.XMLResponseWriter
[junit4:junit4]   2> 1717 T2539 oasup.UpdateRequestProcessorChain.init inserting DistributedUpdateProcessorFactory into updateRequestProcessorChain "dedupe"
[junit4:junit4]   2> 1717 T2539 oasup.UpdateRequestProcessorChain.init inserting DistributedUpdateProcessorFactory into updateRequestProcessorChain "dedupe-allfields"
[junit4:junit4]   2> 1717 T2539 oasup.UpdateRequestProcessorChain.init inserting DistributedUpdateProcessorFactory into updateRequestProcessorChain "stored_sig"
[junit4:junit4]   2> 1717 T2539 oasup.UpdateRequestProcessorChain.init inserting DistributedUpdateProcessorFactory into updateRequestProcessorChain "uniq-fields"
[junit4:junit4]   2> 1717 T2539 oasup.UpdateRequestProcessorChain.init inserting DistributedUpdateProcessorFactory into updateRequestProcessorChain "distrib-dup-test-chain-implicit"
[junit4:junit4]   2> 1717 T2539 oasc.RequestHandlers.initHandlersFromConfig adding lazy requestHandler: solr.ReplicationHandler
[junit4:junit4]   2> 1733 T2539 oasc.RequestHandlers.initHandlersFromConfig created /replication: solr.ReplicationHandler
[junit4:junit4]   2> 1733 T2539 oasc.RequestHandlers.initHandlersFromConfig created standard: solr.StandardRequestHandler
[junit4:junit4]   2> 1733 T2539 oasc.RequestHandlers.initHandlersFromConfig created /get: solr.RealTimeGetHandler
[junit4:junit4]   2> 1733 T2539 oasc.RequestHandlers.initHandlersFromConfig created dismax: solr.SearchHandler
[junit4:junit4]   2> 1733 T2539 oasc.RequestHandlers.initHandlersFromConfig created mock: org.apache.solr.core.MockQuerySenderListenerReqHandler
[junit4:junit4]   2> 1733 T2539 oasc.RequestHandlers.initHandlersFromConfig created /admin/: org.apache.solr.handler.admin.AdminHandlers
[junit4:junit4]   2> 1733 T2539 oasc.RequestHandlers.initHandlersFromConfig created defaults: solr.StandardRequestHandler
[junit4:junit4]   2> 1733 T2539 oasc.RequestHandlers.initHandlersFromConfig adding lazy requestHandler: solr.StandardRequestHandler
[junit4:junit4]   2> 1733 T2539 oasc.RequestHandlers.initHandlersFromConfig created lazy: solr.StandardRequestHandler
[junit4:junit4]   2> 1733 T2539 oasc.RequestHandlers.initHandlersFromConfig created /update: solr.UpdateRequestHandler
[junit4:junit4]   2> 1733 T2539 oasc.RequestHandlers.initHandlersFromConfig created /terms: org.apache.solr.handler.component.SearchHandler
[junit4:junit4]   2> 1733 T2539 oasc.RequestHandlers.initHandlersFromConfig created spellCheckCompRH: org.apache.solr.handler.component.SearchHandler
[junit4:junit4]   2> 1733 T2539 oasc.RequestHandlers.initHandlersFromConfig created spellCheckCompRH_Direct: org.apache.solr.handler.component.SearchHandler
[junit4:junit4]   2> 1733 T2539 oasc.RequestHandlers.initHandlersFromConfig created spellCheckWithWordbreak: org.apache.solr.handler.component.SearchHandler
[junit4:junit4]   2> 1733 T2539 oasc.RequestHandlers.initHandlersFromConfig created spellCheckWithWordbreak_Direct: org.apache.solr.handler.component.SearchHandler
[junit4:junit4]   2> 1733 T2539 oasc.RequestHandlers.initHandlersFromConfig created spellCheckCompRH1: org.apache.solr.handler.component.SearchHandler
[junit4:junit4]   2> 1733 T2539 oasc.RequestHandlers.initHandlersFromConfig created tvrh: org.apache.solr.handler.component.SearchHandler
[junit4:junit4]   2> 1733 T2539 oasc.RequestHandlers.initHandlersFromConfig created /mlt: solr.MoreLikeThisHandler
[junit4:junit4]   2> 1733 T2539 oasc.RequestHandlers.initHandlersFromConfig created /debug/dump: solr.DumpRequestHandler
[junit4:junit4]   2> 1733 T2539 oashl.XMLLoader.init xsltCacheLifetimeSeconds=60
[junit4:junit4]   2> 1733 T2539 oasc.SolrCore.initDeprecatedSupport WARNING solrconfig.xml uses deprecated <admin/gettableFiles>, Please update your config to use the ShowFileRequestHandler.
[junit4:junit4]   2> 1748 T2539 oasc.SolrCore.initDeprecatedSupport WARNING adding ShowFileRequestHandler with hidden files: [SCHEMA.XML, OLD_SYNONYMS.TXT, STOPWORDS.TXT, PROTWORDS.TXT, OPEN-EXCHANGE-RATES.JSON, SYNONYMS.TXT, CURRENCY.XML, MAPPING-ISOLATIN1ACCENT.TXT]
[junit4:junit4]   2> 1748 T2539 oass.SolrIndexSearcher.<init> Opening Searcher@1a2c374 main
[junit4:junit4]   2> 1748 T2539 oasu.CommitTracker.<init> Hard AutoCommit: disabled
[junit4:junit4]   2> 1748 T2539 oasu.CommitTracker.<init> Soft AutoCommit: disabled
[junit4:junit4]   2> 1748 T2539 oashc.SpellCheckComponent.inform Initializing spell checkers
[junit4:junit4]   2> 1795 T2539 oass.DirectSolrSpellChecker.init init: {name=direct,classname=DirectSolrSpellChecker,field=lowerfilt,minQueryLength=3}
[junit4:junit4]   2> 2011 T2562 oasc.SolrCore.registerSearcher [collection1] Registered new searcher Searcher@1a2c374 main{StandardDirectoryReader(segments_1:1)}
[junit4:junit4]   2> 2011 T2544 oazs.PrepRequestProcessor.pRequest Got user-level KeeperException when processing sessionid:0x139ff6ed7370002 type:create cxid:0x56 zxid:0xfffffffffffffffe txntype:unknown reqpath:n/a Error Path:/solr/overseer/queue Error:KeeperErrorCode = NoNode for /solr/overseer/queue
[junit4:junit4]   2> 2058 T2539 oasc.CoreContainer.register registering core: collection1
[junit4:junit4]   2> 2058 T2539 oasc.ZkController.register Register shard - core:collection1 address:http://127.0.0.1:51396/solr shardId:control_shard
[junit4:junit4]   2> 2058 T2539 oascc.SolrZkClient.makePath makePath: /collections/control_collection/leader_elect/control_shard/election
[junit4:junit4]   2> 2135 T2544 oazs.PrepRequestProcessor.pRequest Got user-level KeeperException when processing sessionid:0x139ff6ed7370002 type:delete cxid:0x65 zxid:0xfffffffffffffffe txntype:unknown reqpath:n/a Error Path:/solr/collections/control_collection/leaders Error:KeeperErrorCode = NoNode for /solr/collections/control_collection/leaders
[junit4:junit4]   2> 2151 T2539 oasc.ShardLeaderElectionContext.runLeaderProcess Running the leader process.
[junit4:junit4]   2> 2151 T2544 oazs.PrepRequestProcessor.pRequest Got user-level KeeperException when processing sessionid:0x139ff6ed7370002 type:create cxid:0x66 zxid:0xfffffffffffffffe txntype:unknown reqpath:n/a Error Path:/solr/overseer Error:KeeperErrorCode = NodeExists for /solr/overseer
[junit4:junit4]   2> 2398 T2560 oascc.ZkStateReader.updateClusterState Updating cloud state from ZooKeeper... 
[junit4:junit4]   2> 2398 T2544 oazs.PrepRequestProcessor.pRequest Got user-level KeeperException when processing sessionid:0x139ff6ed7370002 type:create cxid:0x6d zxid:0xfffffffffffffffe txntype:unknown reqpath:n/a Error Path:/solr/overseer/queue-work Error:KeeperErrorCode = NoNode for /solr/overseer/queue-work
[junit4:junit4]   2> 2522 T2559 oascc.ZkStateReader$2.process A cluster state change has occurred - updating...
[junit4:junit4]   2> 2676 T2539 oasc.ShardLeaderElectionContext.waitForReplicasToComeUp Enough replicas found to continue.
[junit4:junit4]   2> 2676 T2539 oasc.ShardLeaderElectionContext.runLeaderProcess I may be the new leader - try and sync
[junit4:junit4]   2> 2676 T2539 oasc.SyncStrategy.sync Sync replicas to http://127.0.0.1:51396/solr/collection1/
[junit4:junit4]   2> 2676 T2539 oasc.SyncStrategy.syncReplicas Sync Success - now sync replicas to me
[junit4:junit4]   2> 2676 T2539 oasc.SyncStrategy.syncToMe http://127.0.0.1:51396/solr/collection1/ has no replicas
[junit4:junit4]   2> 2676 T2539 oasc.ShardLeaderElectionContext.runLeaderProcess I am the new leader: http://127.0.0.1:51396/solr/collection1/
[junit4:junit4]   2> 2676 T2539 oascc.SolrZkClient.makePath makePath: /collections/control_collection/leaders/control_shard
[junit4:junit4]   2> 2692 T2544 oazs.PrepRequestProcessor.pRequest Got user-level KeeperException when processing sessionid:0x139ff6ed7370002 type:create cxid:0x8b zxid:0xfffffffffffffffe txntype:unknown reqpath:n/a Error Path:/solr/overseer Error:KeeperErrorCode = NodeExists for /solr/overseer
[junit4:junit4]   2> 3032 T2560 oascc.ZkStateReader.updateClusterState Updating cloud state from ZooKeeper... 
[junit4:junit4]   2> 3079 T2559 oascc.ZkStateReader$2.process A cluster state change has occurred - updating...
[junit4:junit4]   2> 3110 T2539 oasc.ZkController.register We are http://127.0.0.1:51396/solr/collection1/ and leader is http://127.0.0.1:51396/solr/collection1/
[junit4:junit4]   2> 3110 T2539 oasc.ZkController.register No LogReplay needed for core=collection1 baseURL=http://127.0.0.1:51396/solr
[junit4:junit4]   2> 3110 T2539 oasc.ZkController.checkRecovery I am the leader, no recovery necessary
[junit4:junit4]   2> 3110 T2539 oascc.ZkStateReader.updateClusterState Updating cloud state from ZooKeeper... 
[junit4:junit4]   2> 3110 T2539 oass.SolrDispatchFilter.init user.dir=C:\Users\JenkinsSlave\workspace\Lucene-Solr-4.x-Windows\solr\build\solr-core\test\J0
[junit4:junit4]   2> 3110 T2539 oass.SolrDispatchFilter.init SolrDispatchFilter.init() done
[junit4:junit4]   2> 3110 T2539 oascsi.HttpClientUtil.createClient Creating new http client, config:maxConnections=128&maxConnectionsPerHost=32&followRedirects=false
[junit4:junit4]   2> 3589 T2560 oascc.ZkStateReader.updateClusterState Updating cloud state from ZooKeeper... 
[junit4:junit4]   2> 3651 T2559 oascc.ZkStateReader$2.process A cluster state change has occurred - updating...
[junit4:junit4]   2> 3651 T2539 oejs.Server.doStart jetty-8.1.2.v20120308
[junit4:junit4]   2> 3651 T2539 oejs.AbstractConnector.doStart Started SocketConnector@0.0.0.0:51400
[junit4:junit4]   2> 3651 T2539 oasc.SolrResourceLoader.locateSolrHome JNDI not configured for solr (NoInitialContextEx)
[junit4:junit4]   2> 3651 T2539 oasc.SolrResourceLoader.locateSolrHome using system property solr.solr.home: C:\Users\JenkinsSlave\workspace\Lucene-Solr-4.x-Windows\solr\build\solr-core\test\J0\.\solrtest-jetty1-1348610220892
[junit4:junit4]   2> 3651 T2539 oasc.SolrResourceLoader.<init> new SolrResourceLoader for deduced Solr Home: 'C:\Users\JenkinsSlave\workspace\Lucene-Solr-4.x-Windows\solr\build\solr-core\test\J0\.\solrtest-jetty1-1348610220892\'
[junit4:junit4]   2> 3697 T2539 oass.SolrDispatchFilter.init SolrDispatchFilter.init()
[junit4:junit4]   2> 3697 T2539 oasc.SolrResourceLoader.locateSolrHome JNDI not configured for solr (NoInitialContextEx)
[junit4:junit4]   2> 3697 T2539 oasc.SolrResourceLoader.locateSolrHome using system property solr.solr.home: C:\Users\JenkinsSlave\workspace\Lucene-Solr-4.x-Windows\solr\build\solr-core\test\J0\.\solrtest-jetty1-1348610220892
[junit4:junit4]   2> 3697 T2539 oasc.CoreContainer$Initializer.initialize looking for solr.xml: C:\Users\JenkinsSlave\workspace\Lucene-Solr-4.x-Windows\solr\build\solr-core\test\J0\.\solrtest-jetty1-1348610220892\solr.xml
[junit4:junit4]   2> 3697 T2539 oasc.CoreContainer.<init> New CoreContainer 17450938
[junit4:junit4]   2> 3697 T2539 oasc.CoreContainer.load Loading CoreContainer using Solr Home: 'C:\Users\JenkinsSlave\workspace\Lucene-Solr-4.x-Windows\solr\build\solr-core\test\J0\.\solrtest-jetty1-1348610220892\'
[junit4:junit4]   2> 3697 T2539 oasc.SolrResourceLoader.<init> new SolrResourceLoader for directory: 'C:\Users\JenkinsSlave\workspace\Lucene-Solr-4.x-Windows\solr\build\solr-core\test\J0\.\solrtest-jetty1-1348610220892\'
[junit4:junit4]   2> 3713 T2539 oasc.CoreContainer.load Registering Log Listener
[junit4:junit4]   2> 3728 T2539 oasc.CoreContainer.initZooKeeper Zookeeper client=127.0.0.1:51389/solr
[junit4:junit4]   2> 3728 T2539 oaz.ZooKeeper.<init> Initiating client connection, connectString=127.0.0.1:51389/solr sessionTimeout=5000 watcher=org.apache.solr.common.cloud.ConnectionManager@14fc82f
[junit4:junit4]   2> 3728 T2572 oaz.ClientCnxn$SendThread.startConnect Opening socket connection to server /127.0.0.1:51389
[junit4:junit4]   2> 3728 T2539 oascc.ConnectionManager.waitForConnected Waiting for client to connect to ZooKeeper
[junit4:junit4]   2> 3728 T2572 oaz.ClientCnxn$SendThread.primeConnection Socket connection established to 127.0.0.1/127.0.0.1:51389, initiating session
[junit4:junit4]   2> 3728 T2541 oazs.NIOServerCnxn$Factory.run Accepted socket connection from /127.0.0.1:51403
[junit4:junit4]   2> 3728 T2541 oazs.NIOServerCnxn.readConnectRequest Client attempting to establish new session at /127.0.0.1:51403
[junit4:junit4]   2> 3759 T2543 oazs.NIOServerCnxn.finishSessionInit Established session 0x139ff6ed7370003 with negotiated timeout 5000 for client /127.0.0.1:51403
[junit4:junit4]   2> 3759 T2572 oaz.ClientCnxn$SendThread.readConnectResult Session establishment complete on server 127.0.0.1/127.0.0.1:51389, sessionid = 0x139ff6ed7370003, negotiated timeout = 5000
[junit4:junit4]   2> 3759 T2573 oascc.ConnectionManager.process Watcher org.apache.solr.common.cloud.ConnectionManager@14fc82f name:ZooKeeperConnection Watcher:127.0.0.1:51389/solr got event WatchedEvent state:SyncConnected type:None path:null path:null type:None
[junit4:junit4]   2> 3759 T2539 oascc.ConnectionManager.waitForConnected Client is connected to ZooKeeper
[junit4:junit4]   2> 3759 T2544 oazs.PrepRequestProcessor.pRequest Got user-level KeeperException when processing sessionid:0x139ff6ed7370003 type:create cxid:0x1 zxid:0xfffffffffffffffe txntype:unknown reqpath:n/a Error Path:/solr/overseer Error:KeeperErrorCode = NodeExists for /solr/overseer
[junit4:junit4]   2> 3775 T2544 oazs.PrepRequestProcessor.pRequest Got user-level KeeperException when processing sessionid:0x139ff6ed7370003 type:create cxid:0x2 zxid:0xfffffffffffffffe txntype:unknown reqpath:n/a Error Path:/solr/overseer Error:KeeperErrorCode = NodeExists for /solr/overseer
[junit4:junit4]   2> 3790 T2539 oasc.ZkController.createEphemeralLiveNode Register node as live in ZooKeeper:/live_nodes/127.0.0.1:51400_solr
[junit4:junit4]   2> 3790 T2544 oazs.PrepRequestProcessor.pRequest Got user-level KeeperException when processing sessionid:0x139ff6ed7370003 type:delete cxid:0x4 zxid:0xfffffffffffffffe txntype:unknown reqpath:n/a Error Path:/solr/live_nodes/127.0.0.1:51400_solr Error:KeeperErrorCode = NoNode for /solr/live_nodes/127.0.0.1:51400_solr
[junit4:junit4]   2> 3806 T2539 oascc.SolrZkClient.makePath makePath: /live_nodes/127.0.0.1:51400_solr
[junit4:junit4]   2> 3821 T2559 oascc.ZkStateReader$3.process Updating live nodes
[junit4:junit4]   2> 3821 T2539 oashc.HttpShardHandlerFactory.getParameter Setting socketTimeout to: 0
[junit4:junit4]   2> 3821 T2539 oashc.HttpShardHandlerFactory.getParameter Setting urlScheme to: http://
[junit4:junit4]   2> 3821 T2539 oashc.HttpShardHandlerFactory.getParameter Setting connTimeout to: 0
[junit4:junit4]   2> 3821 T2539 oashc.HttpShardHandlerFactory.getParameter Setting maxConnectionsPerHost to: 20
[junit4:junit4]   2> 3821 T2539 oashc.HttpShardHandlerFactory.getParameter Setting corePoolSize to: 0
[junit4:junit4]   2> 3821 T2539 oashc.HttpShardHandlerFactory.getParameter Setting maximumPoolSize to: 2147483647
[junit4:junit4]   2> 3821 T2539 oashc.HttpShardHandlerFactory.getParameter Setting maxThreadIdleTime to: 5
[junit4:junit4]   2> 3821 T2539 oashc.HttpShardHandlerFactory.getParameter Setting sizeOfQueue to: -1
[junit4:junit4]   2> 3821 T2539 oashc.HttpShardHandlerFactory.getParameter Setting fairnessPolicy to: false
[junit4:junit4]   2> 3821 T2539 oascsi.HttpClientUtil.createClient Creating new http client, config:maxConnectionsPerHost=20&maxConnections=10000&socketTimeout=0&connTimeout=0&retry=false
[junit4:junit4]   2> 3852 T2539 oascc.ZkStateReader.createClusterStateWatchersAndUpdate Updating cluster state from ZooKeeper... 
[junit4:junit4]   2> 3868 T2539 oasc.CoreContainer.create Creating SolrCore 'collection1' using instanceDir: C:\Users\JenkinsSlave\workspace\Lucene-Solr-4.x-Windows\solr\build\solr-core\test\J0\.\solrtest-jetty1-1348610220892\collection1
[junit4:junit4]   2> 3868 T2539 oasc.ZkController.createCollectionZkNode Check for collection zkNode:collection1
[junit4:junit4]   2> 3868 T2539 oasc.ZkController.createCollectionZkNode Collection zkNode exists
[junit4:junit4]   2> 3868 T2539 oasc.ZkController.readConfigName Load collection config from:/collections/collection1
[junit4:junit4]   2> 3868 T2539 oasc.SolrResourceLoader.<init> new SolrResourceLoader for directory: 'C:\Users\JenkinsSlave\workspace\Lucene-Solr-4.x-Windows\solr\build\solr-core\test\J0\.\solrtest-jetty1-1348610220892\collection1\'
[junit4:junit4]   2> 3868 T2539 oasc.SolrResourceLoader.replaceClassLoader Adding 'file:/C:/Users/JenkinsSlave/workspace/Lucene-Solr-4.x-Windows/solr/build/solr-core/test/J0/solrtest-jetty1-1348610220892/collection1/lib/classes/' to classloader
[junit4:junit4]   2> 3868 T2539 oasc.SolrResourceLoader.replaceClassLoader Adding 'file:/C:/Users/JenkinsSlave/workspace/Lucene-Solr-4.x-Windows/solr/build/solr-core/test/J0/solrtest-jetty1-1348610220892/collection1/lib/README' to classloader
[junit4:junit4]   2> 3914 T2539 oasc.SolrConfig.<init> Using Lucene MatchVersion: LUCENE_41
[junit4:junit4]   2> 4007 T2539 oasc.SolrConfig.<init> Loaded SolrConfig: solrconfig.xml
[junit4:junit4]   2> 4007 T2539 oass.IndexSchema.readSchema Reading Solr Schema
[junit4:junit4]   2> 4022 T2539 oass.IndexSchema.readSchema Schema name=test
[junit4:junit4]   2> 4564 T2539 oass.OpenExchangeRatesOrgProvider.init Initialized with rates=open-exchange-rates.json, refreshInterval=1440.
[junit4:junit4]   2> 4564 T2539 oass.IndexSchema.readSchema default search field in schema is text
[junit4:junit4]   2> 4579 T2539 oass.IndexSchema.readSchema unique key field: id
[junit4:junit4]   2> 4595 T2539 oass.FileExchangeRateProvider.reload Reloading exchange rates from file currency.xml
[junit4:junit4]   2> 4595 T2539 oass.FileExchangeRateProvider.reload Reloading exchange rates from file currency.xml
[junit4:junit4]   2> 4595 T2539 oass.OpenExchangeRatesOrgProvider.reload Reloading exchange rates from open-exchange-rates.json
[junit4:junit4]   2> 4595 T2539 oass.OpenExchangeRatesOrgProvider.reload Reloading exchange rates from open-exchange-rates.json
[junit4:junit4]   2> 4610 T2539 oasc.SolrCore.<init> [collection1] Opening new SolrCore at C:\Users\JenkinsSlave\workspace\Lucene-Solr-4.x-Windows\solr\build\solr-core\test\J0\.\solrtest-jetty1-1348610220892\collection1\, dataDir=.\org.apache.solr.cloud.FullSolrCloudDistribCmdsTest-1348610217783/jetty1\
[junit4:junit4]   2> 4610 T2539 oasc.JmxMonitoredMap.<init> JMX monitoring is enabled. Adding Solr mbeans to JMX Server: com.sun.jmx.mbeanserver.JmxMBeanServer@45e380
[junit4:junit4]   2> 4610 T2539 oasc.SolrCore.getNewIndexDir WARNING New index directory detected: old=null new=.\org.apache.solr.cloud.FullSolrCloudDistribCmdsTest-1348610217783/jetty1\index/
[junit4:junit4]   2> 4610 T2539 oasc.SolrCore.initIndex WARNING [collection1] Solr index directory '.\org.apache.solr.cloud.FullSolrCloudDistribCmdsTest-1348610217783\jetty1\index' doesn't exist. Creating new index...
[junit4:junit4]   2> 4610 T2539 oasc.CachingDirectoryFactory.get return new directory for C:\Users\JenkinsSlave\workspace\Lucene-Solr-4.x-Windows\solr\build\solr-core\test\J0\.\org.apache.solr.cloud.FullSolrCloudDistribCmdsTest-1348610217783\jetty1\index forceNew:false
[junit4:junit4]   2> 4641 T2539 oasc.SolrDeletionPolicy.onCommit SolrDeletionPolicy.onCommit: commits:num=1
[junit4:junit4]   2> 		commit{dir=NRTCachingDirectory(org.apache.lucene.store.SimpleFSDirectory@C:\Users\JenkinsSlave\workspace\Lucene-Solr-4.x-Windows\solr\build\solr-core\test\J0\org.apache.solr.cloud.FullSolrCloudDistribCmdsTest-1348610217783\jetty1\index lockFactory=org.apache.lucene.store.NativeFSLockFactory@8efcce; maxCacheMB=48.0 maxMergeSizeMB=4.0),segFN=segments_1,generation=1,filenames=[segments_1]
[junit4:junit4]   2> 4641 T2539 oasc.SolrDeletionPolicy.updateCommits newest commit = 1
[junit4:junit4]   2> 4641 T2539 oasc.SolrCore.initWriters created xml: solr.XMLResponseWriter
[junit4:junit4]   2> 4656 T2539 oasup.UpdateRequestProcessorChain.init inserting DistributedUpdateProcessorFactory into updateRequestProcessorChain "dedupe"
[junit4:junit4]   2> 4656 T2539 oasup.UpdateRequestProcessorChain.init inserting DistributedUpdateProcessorFactory into updateRequestProcessorChain "dedupe-allfields"
[junit4:junit4]   2> 4656 T2539 oasup.UpdateRequestProcessorChain.init inserting DistributedUpdateProcessorFactory into updateRequestProcessorChain "stored_sig"
[junit4:junit4]   2> 4656 T2539 oasup.UpdateRequestProcessorChain.init inserting DistributedUpdateProcessorFactory into updateRequestProcessorChain "uniq-fields"
[junit4:junit4]   2> 4656 T2539 oasup.UpdateRequestProcessorChain.init inserting DistributedUpdateProcessorFactory into updateRequestProcessorChain "distrib-dup-test-chain-implicit"
[junit4:junit4]   2> 4656 T2539 oasc.RequestHandlers.initHandlersFromConfig adding lazy requestHandler: solr.ReplicationHandler
[junit4:junit4]   2> 4656 T2539 oasc.RequestHandlers.initHandlersFromConfig created /replication: solr.ReplicationHandler
[junit4:junit4]   2> 4656 T2539 oasc.RequestHandlers.initHandlersFromConfig created standard: solr.StandardRequestHandler
[junit4:junit4]   2> 4656 T2539 oasc.RequestHandlers.initHandlersFromConfig created /get: solr.RealTimeGetHandler
[junit4:junit4]   2> 4656 T2539 oasc.RequestHandlers.initHandlersFromConfig created dismax: solr.SearchHandler
[junit4:junit4]   2> 4656 T2539 oasc.RequestHandlers.initHandlersFromConfig created mock: org.apache.solr.core.MockQuerySenderListenerReqHandler
[junit4:junit4]   2> 4656 T2539 oasc.RequestHandlers.initHandlersFromConfig created /admin/: org.apache.solr.handler.admin.AdminHandlers
[junit4:junit4]   2> 4656 T2539 oasc.RequestHandlers.initHandlersFromConfig created defaults: solr.StandardRequestHandler
[junit4:junit4]   2> 4656 T2539 oasc.RequestHandlers.initHandlersFromConfig adding lazy requestHandler: solr.StandardRequestHandler
[junit4:junit4]   2> 4656 T2539 oasc.RequestHandlers.initHandlersFromConfig created lazy: solr.StandardRequestHandler
[junit4:junit4]   2> 4656 T2539 oasc.RequestHandlers.initHandlersFromConfig created /update: solr.UpdateRequestHandler
[junit4:junit4]   2> 4656 T2539 oasc.RequestHandlers.initHandlersFromConfig created /terms: org.apache.solr.handler.component.SearchHandler
[junit4:junit4]   2> 4656 T2539 oasc.RequestHandlers.initHandlersFromConfig created spellCheckCompRH: org.apache.solr.handler.component.SearchHandler
[junit4:junit4]   2> 4656 T2539 oasc.RequestHandlers.initHandlersFromConfig created spellCheckCompRH_Direct: org.apache.solr.handler.component.SearchHandler
[junit4:junit4]   2> 4656 T2539 oasc.RequestHandlers.initHandlersFromConfig created spellCheckWithWordbreak: org.apache.solr.handler.component.SearchHandler
[junit4:junit4]   2> 4656 T2539 oasc.RequestHandlers.initHandlersFromConfig created spellCheckWithWordbreak_Direct: org.apache.solr.handler.component.SearchHandler
[junit4:junit4]   2> 4656 T2539 oasc.RequestHandlers.initHandlersFromConfig created spellCheckCompRH1: org.apache.solr.handler.component.SearchHandler
[junit4:junit4]   2> 4656 T2539 oasc.RequestHandlers.initHandlersFromConfig created tvrh: org.apache.solr.handler.component.SearchHandler
[junit4:junit4]   2> 4656 T2539 oasc.RequestHandlers.initHandlersFromConfig created /mlt: solr.MoreLikeThisHandler
[junit4:junit4]   2> 4656 T2539 oasc.RequestHandlers.initHandlersFromConfig created /debug/dump: solr.DumpRequestHandler
[junit4:junit4]   2> 4672 T2539 oashl.XMLLoader.init xsltCacheLifetimeSeconds=60
[junit4:junit4]   2> 4672 T2539 oasc.SolrCore.initDeprecatedSupport WARNING solrconfig.xml uses deprecated <admin/gettableFiles>, Please update your config to use the ShowFileRequestHandler.
[junit4:junit4]   2> 4672 T2539 oasc.SolrCore.initDeprecatedSupport WARNING adding ShowFileRequestHandler with hidden files: [SCHEMA.XML, OLD_SYNONYMS.TXT, STOPWORDS.TXT, PROTWORDS.TXT, OPEN-EXCHANGE-RATES.JSON, SYNONYMS.TXT, CURRENCY.XML, MAPPING-ISOLATIN1ACCENT.TXT]
[junit4:junit4]   2> 4687 T2539 oass.SolrIndexSearcher.<init> Opening Searcher@1b4f07d main
[junit4:junit4]   2> 4687 T2539 oasu.CommitTracker.<init> Hard AutoCommit: disabled
[junit4:junit4]   2> 4687 T2539 oasu.CommitTracker.<init> Soft AutoCommit: disabled
[junit4:junit4]   2> 4687 T2539 oashc.SpellCheckComponent.inform Initializing spell checkers
[junit4:junit4]   2> 4734 T2539 oass.DirectSolrSpellChecker.init init: {name=direct,classname=DirectSolrSpellChecker,field=lowerfilt,minQueryLength=3}
[junit4:junit4]   2> 4984 T2574 oasc.SolrCore.registerSearcher [collection1] Registered new searcher Searcher@1b4f07d main{StandardDirectoryReader(segments_1:1)}
[junit4:junit4]   2> 5189 T2560 oascc.ZkStateReader.updateClusterState Updating cloud state from ZooKeeper... 
[junit4:junit4]   2> 5223 T2573 oascc.ZkStateReader$2.process A cluster state change has occurred - updating...
[junit4:junit4]   2> 5223 T2559 oascc.ZkStateReader$2.process A cluster state change has occurred - updating...
[junit4:junit4]   2> 5546 T2539 oasc.CoreContainer.register registering core: collection1
[junit4:junit4]   2> 5546 T2539 oasc.ZkController.register Register shard - core:collection1 address:http://127.0.0.1:51400/solr shardId:shard1
[junit4:junit4]   2> 5546 T2539 oascc.SolrZkClient.makePath makePath: /collections/collection1/leader_elect/shard1/election
[junit4:junit4]   2> 8524 T2543 oazsp.FileTxnLog.commit WARNING fsync-ing the write ahead log in SyncThread:0 took 2739ms which will adversely effect operation latency. See the ZooKeeper troubleshooting guide
[junit4:junit4]   2> 8575 T2544 oazs.PrepRequestProcessor.pRequest Got user-level KeeperException when processing sessionid:0x139ff6ed7370003 type:delete cxid:0x42 zxid:0xfffffffffffffffe txntype:unknown reqpath:n/a Error Path:/solr/collections/collection1/leaders Error:KeeperErrorCode = NoNode for /solr/collections/collection1/leaders
[junit4:junit4]   2> 8592 T2539 oasc.ShardLeaderElectionContext.runLeaderProcess Running the leader process.
[junit4:junit4]   2> 8592 T2544 oazs.PrepRequestProcessor.pRequest Got user-level KeeperException when processing sessionid:0x139ff6ed7370003 type:create cxid:0x43 zxid:0xfffffffffffffffe txntype:unknown reqpath:n/a Error Path:/solr/overseer Error:KeeperErrorCode = NodeExists for /solr/overseer
[junit4:junit4]   2> 8626 T2539 oasc.ShardLeaderElectionContext.waitForReplicasToComeUp Enough replicas found to continue.
[junit4:junit4]   2> 8626 T2539 oasc.ShardLeaderElectionContext.runLeaderProcess I may be the new leader - try and sync
[junit4:junit4]   2> 8626 T2539 oasc.SyncStrategy.sync Sync replicas to http://127.0.0.1:51400/solr/collection1/
[junit4:junit4]   2> 8626 T2539 oasc.SyncStrategy.syncReplicas Sync Success - now sync replicas to me
[junit4:junit4]   2> 8626 T2539 oasc.SyncStrategy.syncToMe http://127.0.0.1:51400/solr/collection1/ has no replicas
[junit4:junit4]   2> 8626 T2539 oasc.ShardLeaderElectionContext.runLeaderProcess I am the new leader: http://127.0.0.1:51400/solr/collection1/
[junit4:junit4]   2> 8626 T2539 oascc.SolrZkClient.makePath makePath: /collections/collection1/leaders/shard1
[junit4:junit4]   2> 8677 T2544 oazs.PrepRequestProcessor.pRequest Got user-level KeeperException when processing sessionid:0x139ff6ed7370003 type:create cxid:0x4d zxid:0xfffffffffffffffe txntype:unknown reqpath:n/a Error Path:/solr/overseer Error:KeeperErrorCode = NodeExists for /solr/overseer
[junit4:junit4]   2> 9085 T2560 oascc.ZkStateReader.updateClusterState Updating cloud state from ZooKeeper... 
[junit4:junit4]   2> 9153 T2559 oascc.ZkStateReader$2.process A cluster state change has occurred - updating...
[junit4:junit4]   2> 9153 T2573 oascc.ZkStateReader$2.process A cluster state change has occurred - updating...
[junit4:junit4]   2> 9187 T2539 oasc.ZkController.register We are http://127.0.0.1:51400/solr/collection1/ and leader is http://127.0.0.1:51400/solr/collection1/
[junit4:junit4]   2> 9187 T2539 oasc.ZkController.register No LogReplay needed for core=collection1 baseURL=http://127.0.0.1:51400/solr
[junit4:junit4]   2> 9187 T2539 oasc.ZkController.checkRecovery I am the leader, no recovery necessary
[junit4:junit4]   2> 9204 T2539 oascc.ZkStateReader.updateClusterState Updating cloud state from ZooKeeper... 
[junit4:junit4]   2> 9204 T2539 oass.SolrDispatchFilter.init user.dir=C:\Users\JenkinsSlave\workspace\Lucene-Solr-4.x-Windows\solr\build\solr-core\test\J0
[junit4:junit4]   2> 9204 T2539 oass.SolrDispatchFilter.init SolrDispatchFilter.init() done
[junit4:junit4]   2> 9204 T2539 oascsi.HttpClientUtil.createClient Creating new http client, config:maxConnections=128&maxConnectionsPerHost=32&followRedirects=false
[junit4:junit4]   2> 9766 T2560 oascc.ZkStateReader.updateClusterState Updating cloud state from ZooKeeper... 
[junit4:junit4]   2> 9783 T2539 oejs.Server.doStart jetty-8.1.2.v20120308
[junit4:junit4]   2> 9783 T2539 oejs.AbstractConnector.doStart Started SocketConnector@0.0.0.0:51404
[junit4:junit4]   2> 9800 T2539 oasc.SolrResourceLoader.locateSolrHome JNDI not configured for solr (NoInitialContextEx)
[junit4:junit4]   2> 9800 T2539 oasc.SolrResourceLoader.locateSolrHome using system property solr.solr.home: C:\Users\JenkinsSlave\workspace\Lucene-Solr-4.x-Windows\solr\build\solr-core\test\J0\.\solrtest-jetty2-1348610226988
[junit4:junit4]   2> 9800 T2539 oasc.SolrResourceLoader.<init> new SolrResourceLoader for deduced Solr Home: 'C:\Users\JenkinsSlave\workspace\Lucene-Solr-4.x-Windows\solr\build\solr-core\test\J0\.\solrtest-jetty2-1348610226988\'
[junit4:junit4]   2> 9817 T2539 oass.SolrDispatchFilter.init SolrDispatchFilter.init()
[junit4:junit4]   2> 9834 T2539 oasc.SolrResourceLoader.locateSolrHome JNDI not configured for solr (NoInitialContextEx)
[junit4:junit4]   2> 9834 T2539 oasc.SolrResourceLoader.locateSolrHome using system property solr.solr.home: C:\Users\JenkinsSlave\workspace\Lucene-Solr-4.x-Windows\solr\build\solr-core\test\J0\.\solrtest-jetty2-1348610226988
[junit4:junit4]   2> 9834 T2539 oasc.CoreContainer$Initializer.initialize looking for solr.xml: C:\Users\JenkinsSlave\workspace\Lucene-Solr-4.x-Windows\solr\build\solr-core\test\J0\.\solrtest-jetty2-1348610226988\solr.xml
[junit4:junit4]   2> 9834 T2539 oasc.CoreContainer.<init> New CoreContainer 30679351
[junit4:junit4]   2> 9834 T2539 oasc.CoreContainer.load Loading CoreContainer using Solr Home: 'C:\Users\JenkinsSlave\workspace\Lucene-Solr-4.x-Windows\solr\build\solr-core\test\J0\.\solrtest-jetty2-1348610226988\'
[junit4:junit4]   2> 9834 T2539 oasc.SolrResourceLoader.<init> new SolrResourceLoader for directory: 'C:\Users\JenkinsSlave\workspace\Lucene-Solr-4.x-Windows\solr\build\solr-core\test\J0\.\solrtest-jetty2-1348610226988\'
[junit4:junit4]   2> 9851 T2539 oasc.CoreContainer.load Registering Log Listener
[junit4:junit4]   2> 9868 T2539 oasc.CoreContainer.initZooKeeper Zookeeper client=127.0.0.1:51389/solr
[junit4:junit4]   2> 9868 T2539 oaz.ZooKeeper.<init> Initiating client connection, connectString=127.0.0.1:51389/solr sessionTimeout=5000 watcher=org.apache.solr.common.cloud.ConnectionManager@1c5b3c3
[junit4:junit4]   2> 9868 T2539 oascc.ConnectionManager.waitForConnected Waiting for client to connect to ZooKeeper
[junit4:junit4]   2> 9868 T2584 oaz.ClientCnxn$SendThread.startConnect Opening socket connection to server /127.0.0.1:51389
[junit4:junit4]   2> 9868 T2584 oaz.ClientCnxn$SendThread.primeConnection Socket connection established to 127.0.0.1/127.0.0.1:51389, initiating session
[junit4:junit4]   2> 9868 T2541 oazs.NIOServerCnxn$Factory.run Accepted socket connection from /127.0.0.1:51407
[junit4:junit4]   2> 9868 T2541 oazs.NIOServerCnxn.readConnectRequest Client attempting to establish new session at /127.0.0.1:51407
[junit4:junit4]   2> 10344 T2543 oazs.NIOServerCnxn.finishSessionInit Established session 0x139ff6ed7370004 with negotiated timeout 5000 for client /127.0.0.1:51407
[junit4:junit4]   2> 10344 T2584 oaz.ClientCnxn$SendThread.readConnectResult Session establishment complete on server 127.0.0.1/127.0.0.1:51389, sessionid = 0x139ff6ed7370004, negotiated timeout = 5000
[junit4:junit4]   2> 10344 T2585 oascc.ConnectionManager.process Watcher org.apache.solr.common.cloud.ConnectionManager@1c5b3c3 name:ZooKeeperConnection Watcher:127.0.0.1:51389/solr got event WatchedEvent state:SyncConnected type:None path:null path:null type:None
[junit4:junit4]   2> 10344 T2539 oascc.ConnectionManager.waitForConnected Client is connected to ZooKeeper
[junit4:junit4]   2> 10344 T2544 oazs.PrepRequestProcessor.pRequest Got user-level KeeperException when processing sessionid:0x139ff6ed7370004 type:create cxid:0x1 zxid:0xfffffffffffffffe txntype:unknown reqpath:n/a Error Path:/solr/overseer Error:KeeperErrorCode = NodeExists for /solr/overseer
[junit4:junit4]   2> 10344 T2544 oazs.PrepRequestProcessor.pRequest Got user-level KeeperException when processing sessionid:0x139ff6ed7370004 type:create cxid:0x2 zxid:0xfffffffffffffffe txntype:unknown reqpath:n/a Error Path:/solr/overseer Error:KeeperErrorCode = NodeExists for /solr/overseer
[junit4:junit4]   2> 10395 T2539 oasc.ZkController.createEphemeralLiveNode Register node as live in ZooKeeper:/live_nodes/127.0.0.1:51404_solr
[junit4:junit4]   2> 10395 T2544 oazs.PrepRequestProcessor.pRequest Got user-level KeeperException when processing sessionid:0x139ff6ed7370004 type:delete cxid:0x4 zxid:0xfffffffffffffffe txntype:unknown reqpath:n/a Error Path:/solr/live_nodes/127.0.0.1:51404_solr Error:KeeperErrorCode = NoNode for /solr/live_nodes/127.0.0.1:51404_solr
[junit4:junit4]   2> 10412 T2559 oascc.ZkStateReader$2.process A cluster state change has occurred - updating...
[junit4:junit4]   2> 10412 T2573 oascc.ZkStateReader$2.process A cluster state change has occurred - updating...
[junit4:junit4]   2> 10429 T2539 oascc.SolrZkClient.makePath makePath: /live_nodes/127.0.0.1:51404_solr
[junit4:junit4]   2> 10480 T2573 oascc.ZkStateReader$3.process Updating live nodes
[junit4:junit4]   2> 10480 T2559 oascc.ZkStateReader$3.process Updating live nodes
[junit4:junit4]   2> 10480 T2539 oashc.HttpShardHandlerFactory.getParameter Setting socketTimeout to: 0
[junit4:junit4]   2> 10480 T2539 oashc.HttpShardHandlerFactory.getParameter Setting urlScheme to: http://
[junit4:junit4]   2> 10480 T2539 oashc.HttpShardHandlerFactory.getParameter Setting connTimeout to: 0
[junit4:junit4]   2> 10480 T2539 oashc.HttpShardHandlerFactory.getParameter Setting maxConnectionsPerHost to: 20
[junit4:junit4]   2> 10480 T2539 oashc.HttpShardHandlerFactory.getParameter Setting corePoolSize to: 0
[junit4:junit4]   2> 10480 T2539 oashc.HttpShardHandlerFactory.getParameter Setting maximumPoolSize to: 2147483647
[junit4:junit4]   2> 10480 T2539 oashc.HttpShardHandlerFactory.getParameter Setting maxThreadIdleTime to: 5
[junit4:junit4]   2> 10480 T2539 oashc.HttpShardHandlerFactory.getParameter Setting sizeOfQueue to: -1
[junit4:junit4]   2> 10480 T2539 oashc.HttpShardHandlerFactory.getParameter Setting fairnessPolicy to: false
[junit4:junit4]   2> 10480 T2539 oascsi.HttpClientUtil.createClient Creating new http client, config:maxConnectionsPerHost=20&maxConnections=10000&socketTimeout=0&connTimeout=0&retry=false
[junit4:junit4]   2> 10514 T2539 oascc.ZkStateReader.createClusterStateWatchersAndUpdate Updating cluster state from ZooKeeper... 
[junit4:junit4]   2> 10531 T2539 oasc.CoreContainer.create Creating SolrCore 'collection1' using instanceDir: C:\Users\JenkinsSlave\workspace\Lucene-Solr-4.x-Windows\solr\build\solr-core\test\J0\.\solrtest-jetty2-1348610226988\collection1
[junit4:junit4]   2> 10531 T2539 oasc.ZkController.createCollectionZkNode Check for collection zkNode:collection1
[junit4:junit4]   2> 10531 T2539 oasc.ZkController.createCollectionZkNode Collection zkNode exists
[junit4:junit4]   2> 10531 T2539 oasc.ZkController.readConfigName Load collection config from:/collections/collection1
[junit4:junit4]   2> 10531 T2539 oasc.SolrResourceLoader.<init> new SolrResourceLoader for directory: 'C:\Users\JenkinsSlave\workspace\Lucene-Solr-4.x-Windows\solr\build\solr-core\test\J0\.\solrtest-jetty2-1348610226988\collection1\'
[junit4:junit4]   2> 10531 T2539 oasc.SolrResourceLoader.replaceClassLoader Adding 'file:/C:/Users/JenkinsSlave/workspace/Lucene-Solr-4.x-Windows/solr/build/solr-core/test/J0/solrtest-jetty2-1348610226988/collection1/lib/classes/' to classloader
[junit4:junit4]   2> 10531 T2539 oasc.SolrResourceLoader.replaceClassLoader Adding 'file:/C:/Users/JenkinsSlave/workspace/Lucene-Solr-4.x-Windows/solr/build/solr-core/test/J0/solrtest-jetty2-1348610226988/collection1/lib/README' to classloader
[junit4:junit4]   2> 10583 T2539 oasc.SolrConfig.<init> Using Lucene MatchVersion: LUCENE_41
[junit4:junit4]   2> 10668 T2539 oasc.SolrConfig.<init> Loaded SolrConfig: solrconfig.xml
[junit4:junit4]   2> 10668 T2539 oass.IndexSchema.readSchema Reading Solr Schema
[junit4:junit4]   2> 10685 T2539 oass.IndexSchema.readSchema Schema name=test
[junit4:junit4]   2> 11280 T2539 oass.OpenExchangeRatesOrgProvider.init Initialized with rates=open-exchange-rates.json, refreshInterval=1440.
[junit4:junit4]   2> 11297 T2539 oass.IndexSchema.readSchema default search field in schema is text
[junit4:junit4]   2> 11297 T2539 oass.IndexSchema.readSchema unique key field: id
[junit4:junit4]   2> 11314 T2539 oass.FileExchangeRateProvider.reload Reloading exchange rates from file currency.xml
[junit4:junit4]   2> 11314 T2539 oass.FileExchangeRateProvider.reload Reloading exchange rates from file currency.xml
[junit4:junit4]   2> 11331 T2539 oass.OpenExchangeRatesOrgProvider.reload Reloading exchange rates from open-exchange-rates.json
[junit4:junit4]   2> 11331 T2539 oass.OpenExchangeRatesOrgProvider.reload Reloading exchange rates from open-exchange-rates.json
[junit4:junit4]   2> 11331 T2539 oasc.SolrCore.<init> [collection1] Opening new SolrCore at C:\Users\JenkinsSlave\workspace\Lucene-Solr-4.x-Windows\solr\build\solr-core\test\J0\.\solrtest-jetty2-1348610226988\collection1\, dataDir=.\org.apache.solr.cloud.FullSolrCloudDistribCmdsTest-1348610217783/jetty2\
[junit4:junit4]   2> 11331 T2539 oasc.JmxMonitoredMap.<init> JMX monitoring is enabled. Adding Solr mbeans to JMX Server: com.sun.jmx.mbeanserver.JmxMBeanServer@45e380
[junit4:junit4]   2> 11331 T2539 oasc.SolrCore.getNewIndexDir WARNING New index directory detected: old=null new=.\org.apache.solr.cloud.FullSolrCloudDistribCmdsTest-1348610217783/jetty2\index/
[junit4:junit4]   2> 11331 T2539 oasc.SolrCore.initIndex WARNING [collection1] Solr index directory '.\org.apache.solr.cloud.FullSolrCloudDistribCmdsTest-1348610217783\jetty2\index' doesn't exist. Creating new index...
[junit4:junit4]   2> 11331 T2539 oasc.CachingDirectoryFactory.get return new directory for C:\Users\JenkinsSlave\workspace\Lucene-Solr-4.x-Windows\solr\build\solr-core\test\J0\.\org.apache.solr.cloud.FullSolrCloudDistribCmdsTest-1348610217783\jetty2\index forceNew:false
[junit4:junit4]   2> 11382 T2539 oasc.SolrDeletionPolicy.onCommit SolrDeletionPolicy.onCommit: commits:num=1
[junit4:junit4]   2> 		commit{dir=NRTCachingDirectory(org.apache.lucene.store.SimpleFSDirectory@C:\Users\JenkinsSlave\workspace\Lucene-Solr-4.x-Windows\solr\build\solr-core\test\J0\org.apache.solr.cloud.FullSolrCloudDistribCmdsTest-1348610217783\jetty2\index lockFactory=org.apache.lucene.store.NativeFSLockFactory@ecdf66; maxCacheMB=48.0 maxMergeSizeMB=4.0),segFN=segments_1,generation=1,filenames=[segments_1]
[junit4:junit4]   2> 11382 T2539 oasc.SolrDeletionPolicy.updateCommits newest commit = 1
[junit4:junit4]   2> 11382 T2539 oasc.SolrCore.initWriters created xml: solr.XMLResponseWriter
[junit4:junit4]   2> 11382 T2539 oasup.UpdateRequestProcessorChain.init inserting DistributedUpdateProcessorFactory into updateRequestProcessorChain "dedupe"
[junit4:junit4]   2> 11382 T2539 oasup.UpdateRequestProcessorChain.init inserting DistributedUpdateProcessorFactory into updateRequestProcessorChain "dedupe-allfields"
[junit4:junit4]   2> 11382 T2539 oasup.UpdateRequestProcessorChain.init inserting DistributedUpdateProcessorFactory into updateRequestProcessorChain "stored_sig"
[junit4:junit4]   2> 11382 T2539 oasup.UpdateRequestProcessorChain.init inserting DistributedUpdateProcessorFactory into updateRequestProcessorChain "uniq-fields"
[junit4:junit4]   2> 11382 T2539 oasup.UpdateRequestProcessorChain.init inserting DistributedUpdateProcessorFactory into updateRequestProcessorChain "distrib-dup-test-chain-implicit"
[junit4:junit4]   2> 11382 T2539 oasc.RequestHandlers.initHandlersFromConfig adding lazy requestHandler: solr.ReplicationHandler
[junit4:junit4]   2> 11382 T2539 oasc.RequestHandlers.initHandlersFromConfig created /replication: solr.ReplicationHandler
[junit4:junit4]   2> 11382 T2539 oasc.RequestHandlers.initHandlersFromConfig created standard: solr.StandardRequestHandler
[junit4:junit4]   2> 11382 T2539 oasc.RequestHandlers.initHandlersFromConfig created /get: solr.RealTimeGetHandler
[junit4:junit4]   2> 11382 T2539 oasc.RequestHandlers.initHandlersFromConfig created dismax: solr.SearchHandler
[junit4:junit4]   2> 11399 T2539 oasc.RequestHandlers.initHandlersFromConfig created mock: org.apache.solr.core.MockQuerySenderListenerReqHandler
[junit4:junit4]   2> 11399 T2539 oasc.RequestHandlers.initHandlersFromConfig created /admin/: org.apache.solr.handler.admin.AdminHandlers
[junit4:junit4]   2> 11399 T2539 oasc.RequestHandlers.initHandlersFromConfig created defaults: solr.StandardRequestHandler
[junit4:junit4]   2> 11399 T2539 oasc.RequestHandlers.initHandlersFromConfig adding lazy requestHandler: solr.StandardRequestHandler
[junit4:junit4]   2> 11399 T2539 oasc.RequestHandlers.initHandlersFromConfig created lazy: solr.StandardRequestHandler
[junit4:junit4]   2> 11399 T2539 oasc.RequestHandlers.initHandlersFromConfig created /update: solr.UpdateRequestHandler
[junit4:junit4]   2> 11399 T2539 oasc.RequestHandlers.initHandlersFromConfig created /terms: org.apache.solr.handler.component.SearchHandler
[junit4:junit4]   2> 11399 T2539 oasc.RequestHandlers.initHandlersFromConfig created spellCheckCompRH: org.apache.solr.handler.component.SearchHandler
[junit4:junit4]   2> 11399 T2539 oasc.RequestHandlers.initHandlersFromConfig created spellCheckCompRH_Direct: org.apache.solr.handler.component.SearchHandler
[junit4:junit4]   2> 11399 T2539 oasc.RequestHandlers.initHandlersFromConfig created spellCheckWithWordbreak: org.apache.solr.handler.component.SearchHandler
[junit4:junit4]   2> 11399 T2539 oasc.RequestHandlers.initHandlersFromConfig created spellCheckWithWordbreak_Direct: org.apache.solr.handler.component.SearchHandler
[junit4:junit4]   2> 11399 T2539 oasc.RequestHandlers.initHandlersFromConfig created spellCheckCompRH1: org.apache.solr.handler.component.SearchHandler
[junit4:junit4]   2> 11399 T2539 oasc.RequestHandlers.initHandlersFromConfig created tvrh: org.apache.solr.handler.component.SearchHandler
[junit4:junit4]   2> 11399 T2539 oasc.RequestHandlers.initHandlersFromConfig created /mlt: solr.MoreLikeThisHandler
[junit4:junit4]   2> 11399 T2539 oasc.RequestHandlers.initHandlersFromConfig created /debug/dump: solr.DumpRequestHandler
[junit4:junit4]   2> 11399 T2539 oashl.XMLLoader.init xsltCacheLifetimeSeconds=60
[junit4:junit4]   2> 11399 T2539 oasc.SolrCore.initDeprecatedSupport WARNING solrconfig.xml uses deprecated <admin/gettableFiles>, Please update your config to use the ShowFileRequestHandler.
[junit4:junit4]   2> 11416 T2539 oasc.SolrCore.initDeprecatedSupport WARNING adding ShowFileRequestHandler with hidden files: [SCHEMA.XML, OLD_SYNONYMS.TXT, STOPWORDS.TXT, PROTWORDS.TXT, OPEN-EXCHANGE-RATES.JSON, SYNONYMS.TXT, CURRENCY.XML, MAPPING-ISOLATIN1ACCENT.TXT]
[junit4:junit4]   2> 11416 T2539 oass.SolrIndexSearcher.<init> Opening Searcher@140d816 main
[junit4:junit4]   2> 11416 T2539 oasu.CommitTracker.<init> Hard AutoCommit: disabled
[junit4:junit4]   2> 11416 T2539 oasu.CommitTracker.<init> Soft AutoCommit: disabled
[junit4:junit4]   2> 11416 T2539 oashc.SpellCheckComponent.inform Initializing spell checkers
[junit4:junit4]   2> 11433 T2539 oass.DirectSolrSpellChecker.init init: {name=direct,classname=DirectSolrSpellChecker,field=lowerfilt,minQueryLength=3}
[junit4:junit4]   2> 11672 T2586 oasc.SolrCore.registerSearcher [collection1] Registered new searcher Searcher@140d816 main{StandardDirectoryReader(segments_1:1)}
[junit4:junit4]   2> 12114 T2560 oascc.ZkStateReader.updateClusterState Updating cloud state from ZooKeeper... 
[junit4:junit4]   2> 12165 T2559 oascc.ZkStateReader$2.process A cluster state change has occurred - updating...
[junit4:junit4]   2> 12165 T2573 oascc.ZkStateReader$2.process A cluster state change has occurred - updating...
[junit4:junit4]   2> 12165 T2585 oascc.ZkStateReader$2.process A cluster state change has occurred - updating...
[junit4:junit4]   2> 12250 T2539 oasc.CoreContainer.register registering core: collection1
[junit4:junit4]   2> 12250 T2539 oasc.ZkController.register Register shard - core:collection1 address:http://127.0.0.1:51404/solr shardId:shard2
[junit4:junit4]   2> 12250 T2539 oascc.SolrZkClient.makePath makePath: /collections/collection1/leader_elect/shard2/election
[junit4:junit4]   2> 12301 T2544 oazs.PrepRequestProcessor.pRequest Got user-level KeeperException when processing sessionid:0x139ff6ed7370004 type:delete cxid:0x41 zxid:0xfffffffffffffffe txntype:unknown reqpath:n/a Error Path:/solr/collections/collection1/leaders/shard2 Error:KeeperErrorCode = NoNode for /solr/collections/collection1/leaders/shard2
[junit4:junit4]   2> 12318 T2539 oasc.ShardLeaderElectionContext.runLeaderProcess Running the leader process.
[junit4:junit4]   2> 12318 T2544 oazs.PrepRequestProcessor.pRequest Got user-level KeeperException when processing sessionid:0x139ff6ed7370004 type:create cxid:0x42 zxid:0xfffffffffffffffe txntype:unknown reqpath:n/a Error Path:/solr/overseer Error:KeeperErrorCode = NodeExists for /solr/overseer
[junit4:junit4]   2> 12369 T2539 oasc.ShardLeaderElectionContext.waitForReplicasToComeUp Enough replicas found to continue.
[junit4:junit4]   2> 12369 T2539 oasc.ShardLeaderElectionContext.runLeaderProcess I may be the new leader - try and sync
[junit4:junit4]   2> 12369 T2539 oasc.SyncStrategy.sync Sync replicas to http://127.0.0.1:51404/solr/collection1/
[junit4:junit4]   2> 12369 T2539 oasc.SyncStrategy.syncReplicas Sync Success - now sync replicas to me
[junit4:junit4]   2> 12369 T2539 oasc.SyncStrategy.syncToMe http://127.0.0.1:51404/solr/collection1/ has no replicas
[junit4:junit4]   2> 12369 T2539 oasc.ShardLeaderElectionContext.runLeaderProcess I am the new leader: http://127.0.0.1:51404/solr/collection1/
[junit4:junit4]   2> 12369 T2539 oascc.SolrZkClient.makePath makePath: /collections/collection1/leaders/shard2
[junit4:junit4]   2> 12403 T2544 oazs.PrepRequestProcessor.pRequest Got user-level KeeperException when processing sessionid:0x139ff6ed7370004 type:create cxid:0x4b zxid:0xfffffffffffffffe txntype:unknown reqpath:n/a Error Path:/solr/overseer Error:KeeperErrorCode = NodeExists for /solr/overseer
[junit4:junit4]   2> 12726 T2560 oascc.ZkStateReader.updateClusterState Updating cloud state from ZooKeeper... 
[junit4:junit4]   2> 15636 T2572 oaz.ClientCnxn$SendThread.run Client session timed out, have not heard from server in 3471ms for sessionid 0x139ff6ed7370003, closing socket connection and attempting reconnect
[junit4:junit4]   2> 16217 T2543 oazsp.FileTxnLog.commit WARNING fsync-ing the write ahead log in SyncThread:0 took 3232ms which will adversely effect operation latency. See the ZooKeeper troubleshooting guide
[junit4:junit4]   2> 16170 T2558 oaz.ClientCnxn$SendThread.run Client session timed out, have not heard from server in 3427ms for sessionid 0x139ff6ed7370002, closing socket connection and attempting reconnect
[junit4:junit4]   2> 15873 T2584 oaz.ClientCnxn$SendThread.run Client session timed out, have not heard from server in 3453ms for sessionid 0x139ff6ed7370004, closing socket connection and attempting reconnect
[junit4:junit4]   2> 16233 T2541 oazs.NIOServerCnxn.doIO WARNING EndOfStreamException: Unable to read additional data from client sessionid 0x139ff6ed7370003, likely client has closed socket
[junit4:junit4]   2> 16233 T2541 oazs.NIOServerCnxn.closeSock Closed socket connection for client /127.0.0.1:51403 which had sessionid 0x139ff6ed7370003
[junit4:junit4]   2> 16233 T2541 oazs.NIOServerCnxn.doIO WARNING Exception causing close of session 0x139ff6ed7370004 due to java.io.IOException: An existing connection was forcibly closed by the remote host
[junit4:junit4]   2> 16233 T2541 oazs.NIOServerCnxn.closeSock Closed socket connection for client /127.0.0.1:51407 which had sessionid 0x139ff6ed7370004
[junit4:junit4]   2> 16233 T2541 oazs.NIOServerCnxn.doIO WARNING Exception causing close of session 0x139ff6ed7370002 due to java.io.IOException: An existing connection was forcibly closed by the remote host
[junit4:junit4]   2> 16233 T2541 oazs.NIOServerCnxn.closeSock Closed socket connection for client /127.0.0.1:51399 which had sessionid 0x139ff6ed7370002
[junit4:junit4]   2> 16326 T2573 oascc.ConnectionManager.process Watcher org.apache.solr.common.cloud.ConnectionManager@14fc82f name:ZooKeeperConnection Watcher:127.0.0.1:51389/solr got event WatchedEvent state:Disconnected type:None path:null path:null type:None
[junit4:junit4]   2> 16326 T2573 oascc.ConnectionManager.process zkClient has disconnected
[junit4:junit4]   2> 16342 T2585 oascc.ConnectionManager.process Watcher org.apache.solr.common.cloud.ConnectionManager@1c5b3c3 name:ZooKeeperConnection Watcher:127.0.0.1:51389/solr got event WatchedEvent state:Disconnected type:None path:null path:null type:None
[junit4:junit4]   2> 16342 T2559 oascc.ConnectionManager.process Watcher org.apache.solr.common.cloud.ConnectionManager@f0c7ae name:ZooKeeperConnection Watcher:127.0.0.1:51389/solr got event WatchedEvent state:Disconnected type:None path:null path:null type:None
[junit4:junit4]   2> 16342 T2585 oascc.ConnectionManager.process zkClient has disconnected
[junit4:junit4]   2> 16343 T2559 oascc.ConnectionManager.process zkClient has disconnected
[junit4:junit4]   2> 17376 T2572 oaz.ClientCnxn$SendThread.startConnect Opening socket connection to server 127.0.0.1/127.0.0.1:51389
[junit4:junit4]   2> 17376 T2572 oaz.ClientCnxn$SendThread.primeConnection Socket connection established to 127.0.0.1/127.0.0.1:51389, initiating session
[junit4:junit4]   2> 17376 T2541 oazs.NIOServerCnxn$Factory.run Accepted socket connection from /127.0.0.1:51408
[junit4:junit4]   2> 17376 T2541 oazs.NIOServerCnxn.readConnectRequest Client attempting to renew session 0x139ff6ed7370003 at /127.0.0.1:51408
[junit4:junit4]   2> 17376 T2541 oazs.NIOServerCnxn.finishSessionInit Established session 0x139ff6ed7370003 with negotiated timeout 5000 for client /127.0.0.1:51408
[junit4:junit4]   2> 17376 T2572 oaz.ClientCnxn$SendThread.readConnectResult Session establishment complete on server 127.0.0.1/127.0.0.1:51389, sessionid = 0x139ff6ed7370003, negotiated timeout = 5000
[junit4:junit4]   2> 17376 T2573 oascc.ConnectionManager.process Watcher org.apache.solr.common.cloud.ConnectionManager@14fc82f name:ZooKeeperConnection Watcher:127.0.0.1:51389/solr got event WatchedEvent state:SyncConnected type:None path:null path:null type:None
[junit4:junit4]   2> 17798 T2558 oaz.ClientCnxn$SendThread.startConnect Opening socket connection to server 127.0.0.1/127.0.0.1:51389
[junit4:junit4]   2> 17798 T2558 oaz.ClientCnxn$SendThread.primeConnection Socket connection established to 127.0.0.1/127.0.0.1:51389, initiating session
[junit4:junit4]   2> 17798 T2541 oazs.NIOServerCnxn$Factory.run Accepted socket connection from /127.0.0.1:51409
[junit4:junit4]   2> 17798 T2541 oazs.NIOServerCnxn.readConnectRequest Client attempting to renew session 0x139ff6ed7370002 at /127.0.0.1:51409
[junit4:junit4]   2> 17798 T2541 oazs.NIOServerCnxn.finishSessionInit Established session 0x139ff6ed7370002 with negotiated timeout 5000 for client /127.0.0.1:51409
[junit4:junit4]   2> 17798 T2558 oaz.ClientCnxn$SendThread.readConnectResult Session establishment complete on server 127.0.0.1/127.0.0.1:51389, sessionid = 0x139ff6ed7370002, negotiated timeout = 5000
[junit4:junit4]   2> 17798 T2544 oazs.PrepRequestProcessor.pRequest Got user-level KeeperException when processing sessionid:0x139ff6ed7370002 type:delete cxid:0x116 zxid:0xfffffffffffffffe txntype:unknown reqpath:n/a Error Path:/solr/overseer/queue/qn-0000000018 Error:KeeperErrorCode = NoNode for /solr/overseer/queue/qn-0000000018
[junit4:junit4]   2> 17798 T2559 oascc.ConnectionManager.process Watcher org.apache.solr.common.cloud.ConnectionManager@f0c7ae name:ZooKeeperConnection Watcher:127.0.0.1:51389/solr got event WatchedEvent state:SyncConnected type:None path:null path:null type:None
[junit4:junit4]   2> 17829 T2559 oascc.ZkStateReader$2.process A cluster state change has occurred - updating...
[junit4:junit4]   2> 17829 T2573 oascc.ZkStateReader$2.process A cluster state change has occurred - updating...
[junit4:junit4]   2> 18032 T2584 oaz.ClientCnxn$SendThread.startConnect Opening socket connection to server 127.0.0.1/127.0.0.1:51389
[junit4:junit4]   2> 18032 T2584 oaz.ClientCnxn$SendThread.primeConnection Socket connection established to 127.0.0.1/127.0.0.1:51389, initiating session
[junit4:junit4]   2> 18032 T2541 oazs.NIOServerCnxn$Factory.run Accepted socket connection from /127.0.0.1:51410
[junit4:junit4]   2> 18032 T2541 oazs.NIOServerCnxn.readConnectRequest Client attempting to renew session 0x139ff6ed7370004 at /127.0.0.1:51410
[junit4:junit4]   2> 18032 T2541 oazs.NIOServerCnxn.finishSessionInit Established session 0x139ff6ed7370004 with negotiated timeout 5000 for client /127.0.0.1:51410
[junit4:junit4]   2> 18032 T2584 oaz.ClientCnxn$SendThread.readConnectResult Session establishment complete on server 127.0.0.1/127.0.0.1:51389, sessionid = 0x139ff6ed7370004, negotiated timeout = 5000
[junit4:junit4]   2> 18032 T2585 oascc.ConnectionManager.process Watcher org.apache.solr.common.cloud.ConnectionManager@1c5b3c3 name:ZooKeeperConnection Watcher:127.0.0.1:51389/solr got event WatchedEvent state:SyncConnected type:None path:null path:null type:None
[junit4:junit4]   2> 18032 T2585 oascc.ZkStateReader$2.process A cluster state change has occurred - updating...
[junit4:junit4]   2> 42454 T2539 oasc.ZkController.getLeader SEVERE Error getting leader from zk org.apache.solr.common.SolrException: No registered leader was found, collection:collection1 slice:shard2
[junit4:junit4]   2> 	at org.apache.solr.common.cloud.ZkStateReader.getLeaderProps(ZkStateReader.java:413)
[junit4:junit4]   2> 	at org.apache.solr.common.cloud.ZkStateReader.getLeaderUrl(ZkStateReader.java:390)
[junit4:junit4]   2> 	at org.apache.solr.cloud.ZkController.getLeader(ZkController.java:642)
[junit4:junit4]   2> 	at org.apache.solr.cloud.ZkController.register(ZkController.java:577)
[junit4:junit4]   2> 	at org.apache.solr.cloud.ZkController.register(ZkController.java:532)
[junit4:junit4]   2> 	at org.apache.solr.core.CoreContainer.registerInZk(CoreContainer.java:709)
[junit4:junit4]   2> 	at org.apache.solr.core.CoreContainer.register(CoreContainer.java:693)
[junit4:junit4]   2> 	at org.apache.solr.core.CoreContainer.load(CoreContainer.java:535)
[junit4:junit4]   2> 	at org.apache.solr.core.CoreContainer.load(CoreContainer.java:356)
[junit4:junit4]   2> 	at org.apache.solr.core.CoreContainer$Initializer.initialize(CoreContainer.java:308)
[junit4:junit4]   2> 	at org.apache.solr.servlet.SolrDispatchFilter.init(SolrDispatchFilter.java:107)
[junit4:junit4]   2> 	at org.eclipse.jetty.servlet.FilterHolder.doStart(FilterHolder.java:114)
[junit4:junit4]   2> 	at org.eclipse.jetty.util.component.AbstractLifeCycle.start(AbstractLifeCycle.java:59)
[junit4:junit4]   2> 	at org.eclipse.jetty.servlet.ServletHandler.initialize(ServletHandler.java:754)
[junit4:junit4]   2> 	at org.eclipse.jetty.servlet.ServletHandler.updateMappings(ServletHandler.java:1227)
[junit4:junit4]   2> 	at org.eclipse.jetty.servlet.ServletHandler.setFilterMappings(ServletHandler.java:1263)
[junit4:junit4]   2> 	at org.eclipse.jetty.servlet.ServletHandler.addFilterWithMapping(ServletHandler.java:965)
[junit4:junit4]   2> 	at org.eclipse.jetty.servlet.ServletHandler.addFilterWithMapping(ServletHandler.java:923)
[junit4:junit4]   2> 	at org.eclipse.jetty.servlet.ServletContextHandler.addFilter(ServletContextHandler.java:333)
[junit4:junit4]   2> 	at org.apache.solr.client.solrj.embedded.JettySolrRunner$1.lifeCycleStarted(JettySolrRunner.java:158)
[junit4:junit4]   2> 	at org.eclipse.jetty.util.component.AbstractLifeCycle.setStarted(AbstractLifeCycle.java:169)
[junit4:junit4]   2> 	at org.eclipse.jetty.util.component.AbstractLifeCycle.start(AbstractLifeCycle.java:60)
[junit4:junit4]   2> 	at org.apache.solr.client.solrj.embedded.JettySolrRunner.start(JettySolrRunner.java:210)
[junit4:junit4]   2> 	at org.apache.solr.client.solrj.embedded.JettySolrRunner.start(JettySolrRunner.java:190)
[junit4:junit4]   2> 	at org.apache.solr.BaseDistributedSearchTestCase.createJetty(BaseDistributedSearchTestCase.java:262)
[junit4:junit4]   2> 	at org.apache.solr.cloud.AbstractFullDistribZkTestBase.createJettys(AbstractFullDistribZkTestBase.java:294)
[junit4:junit4]   2> 	at org.apache.solr.cloud.AbstractFullDistribZkTestBase.createServers(AbstractFullDistribZkTestBase.java:268)
[junit4:junit4]   2> 	at org.apache.solr.BaseDistributedSearchTestCase.testDistribSearch(BaseDistributedSearchTestCase.java:693)
[junit4:junit4]   2> 	at sun.reflect.NativeMethodAccessorImpl.invoke0(Native Method)
[junit4:junit4]   2> 	at sun.reflect.NativeMethodAccessorImpl.invoke(NativeMethodAccessorImpl.java:57)
[junit4:junit4]   2> 	at sun.reflect.DelegatingMethodAccessorImpl.invoke(DelegatingMethodAccessorImpl.java:43)
[junit4:junit4]   2> 	at java.lang.reflect.Method.invoke(Method.java:601)
[junit4:junit4]   2> 	at com.carrotsearch.randomizedtesting.RandomizedRunner.invoke(RandomizedRunner.java:1559)
[junit4:junit4]   2> 	at com.carrotsearch.randomizedtesting.RandomizedRunner.access$600(RandomizedRunner.java:79)
[junit4:junit4]   2> 	at com.carrotsearch.randomizedtesting.RandomizedRunner$6.evaluate(RandomizedRunner.java:737)
[junit4:junit4]   2> 	at com.carrotsearch.randomizedtesting.RandomizedRunner$7.evaluate(RandomizedRunner.java:773)
[junit4:junit4]   2> 	at com.carrotsearch.randomizedtesting.RandomizedRunner$8.evaluate(RandomizedRunner.java:787)
[junit4:junit4]   2> 	at com.carrotsearch.randomizedtesting.rules.SystemPropertiesRestoreRule$1.evaluate(SystemPropertiesRestoreRule.java:53)
[junit4:junit4]   2> 	at org.apache.lucene.util.TestRuleSetupTeardownChained$1.evaluate(TestRuleSetupTeardownChained.java:50)
[junit4:junit4]   2> 	at org.apache.lucene.util.TestRuleFieldCacheSanity$1.evaluate(TestRuleFieldCacheSanity.java:51)
[junit4:junit4]   2> 	at org.apache.lucene.util.AbstractBeforeAfterRule$1.evaluate(AbstractBeforeAfterRule.java:45)
[junit4:junit4]   2> 	at com.carrotsearch.randomizedtesting.rules.SystemPropertiesInvariantRule$1.evaluate(SystemPropertiesInvariantRule.java:55)
[junit4:junit4]   2> 	at org.apache.lucene.util.TestRuleThreadAndTestName$1.evaluate(TestRuleThreadAndTestName.java:48)
[junit4:junit4]   2> 	at org.apache.lucene.util.TestRuleIgnoreAfterMaxFailures$1.evaluate(TestRuleIgnoreAfterMaxFailures.java:70)
[junit4:junit4]   2> 	at org.apache.lucene.util.TestRuleMarkFailure$1.evaluate(TestRuleMarkFailure.java:48)
[junit4:junit4]   2> 	at com.carrotsearch.randomizedtesting.rules.StatementAdapter.evaluate(StatementAdapter.java:36)
[junit4:junit4]   2> 	at com.carrotsearch.randomizedtesting.ThreadLeakControl$StatementRunner.run(ThreadLeakControl.java:358)
[junit4:junit4]   2> 	at com.carrotsearch.randomizedtesting.ThreadLeakControl.forkTimeoutingTask(ThreadLeakControl.java:782)
[junit4:junit4]   2> 	at com.carrotsearch.randomizedtesting.ThreadLeakControl$3.evaluate(ThreadLeakControl.java:442)
[junit4:junit4]   2> 	at com.carrotsearch.randomizedtesting.RandomizedRunner.runSingleTest(RandomizedRunner.java:746)
[junit4:junit4]   2> 	at com.carrotsearch.randomizedtesting.RandomizedRunner$3.evaluate(RandomizedRunner.java:648)
[junit4:junit4]   2> 	at com.carrotsearch.randomizedtesting.RandomizedRunner$4.evaluate(RandomizedRunner.java:682)
[junit4:junit4]   2> 	at com.carrotsearch.randomizedtesting.RandomizedRunner$5.evaluate(RandomizedRunner.java:693)
[junit4:junit4]   2> 	at com.carrotsearch.randomizedtesting.rules.StatementAdapter.evaluate(StatementAdapter.java:36)
[junit4:junit4]   2> 	at com.carrotsearch.randomizedtesting.rules.SystemPropertiesRestoreRule$1.evaluate(SystemPropertiesRestoreRule.java:53)
[junit4:junit4]   2> 	at org.apache.lucene.util.AbstractBeforeAfterRule$1.evaluate(AbstractBeforeAfterRule.java:45)
[junit4:junit4]   2> 	at org.apache.lucene.util.TestRuleStoreClassName$1.evaluate(TestRuleStoreClassName.java:42)
[junit4:junit4]   2> 	at com.carrotsearch.randomizedtesting.rules.SystemPropertiesInvariantRule$1.evaluate(SystemPropertiesInvariantRule.java:55)
[junit4:junit4]   2> 	at com.carrotsearch.randomizedtesting.rules.NoShadowingOrOverridesOnMethodsRule$1.evaluate(NoShadowingOrOverridesOnMethodsRule.java:39)
[junit4:junit4]   2> 	at com.carrotsearch.randomizedtesting.rules.NoShadowingOrOverridesOnMethodsRule$1.evaluate(NoShadowingOrOverridesOnMethodsRule.java:39)
[junit4:junit4]   2> 	at com.carrotsearch.randomizedtesting.rules.StatementAdapter.evaluate(StatementAdapter.java:36)
[junit4:junit4]   2> 	at org.apache.lucene.util.TestRuleAssertionsRequired$1.evaluate(TestRuleAssertionsRequired.java:43)
[junit4:junit4]   2> 	at org.apache.lucene.util.TestRuleMarkFailure$1.evaluate(TestRuleMarkFailure.java:48)
[junit4:junit4]   2> 	at org.apache.lucene.util.TestRuleIgnoreAfterMaxFailures$1.evaluate(TestRuleIgnoreAfterMaxFailures.java:70)
[junit4:junit4]   2> 	at org.apache.lucene.util.TestRuleIgnoreTestSuites$1.evaluate(TestRuleIgnoreTestSuites.java:55)
[junit4:junit4]   2> 	at com.carrotsearch.randomizedtesting.rules.StatementAdapter.evaluate(StatementAdapter.java:36)
[junit4:junit4]   2> 	at com.carrotsearch.randomizedtesting.ThreadLeakControl$StatementRunner.run(ThreadLeakControl.java:358)
[junit4:junit4]   2> 	at java.lang.Thread.run(Thread.java:722)
[junit4:junit4]   2> 
[junit4:junit4]   2> 42470 T2539 oasc.SolrException.log SEVERE :org.apache.solr.common.SolrException: Error getting leader from zk
[junit4:junit4]   2> 		at org.apache.solr.cloud.ZkController.getLeader(ZkController.java:662)
[junit4:junit4]   2> 		at org.apache.solr.cloud.ZkController.register(ZkController.java:577)
[junit4:junit4]   2> 		at org.apache.solr.cloud.ZkController.register(ZkController.java:532)
[junit4:junit4]   2> 		at org.apache.solr.core.CoreContainer.registerInZk(CoreContainer.java:709)
[junit4:junit4]   2> 		at org.apache.solr.core.CoreContainer.register(CoreContainer.java:693)
[junit4:junit4]   2> 		at org.apache.solr.core.CoreContainer.load(CoreContainer.java:535)
[junit4:junit4]   2> 		at org.apache.solr.core.CoreContainer.load(CoreContainer.java:356)
[junit4:junit4]   2> 		at org.apache.solr.core.CoreContainer$Initializer.initialize(CoreContainer.java:308)
[junit4:junit4]   2> 		at org.apache.solr.servlet.SolrDispatchFilter.init(SolrDispatchFilter.java:107)
[junit4:junit4]   2> 		at org.eclipse.jetty.servlet.FilterHolder.doStart(FilterHolder.java:114)
[junit4:junit4]   2> 		at org.eclipse.jetty.util.component.AbstractLifeCycle.start(AbstractLifeCycle.java:59)
[junit4:junit4]   2> 		at org.eclipse.jetty.servlet.ServletHandler.initialize(ServletHandler.java:754)
[junit4:junit4]   2> 		at org.eclipse.jetty.servlet.ServletHandler.updateMappings(ServletHandler.java:1227)
[junit4:junit4]   2> 		at org.eclipse.jetty.servlet.ServletHandler.setFilterMappings(ServletHandler.java:1263)
[junit4:junit4]   2> 		at org.eclipse.jetty.servlet.ServletHandler.addFilterWithMapping(ServletHandler.java:965)
[junit4:junit4]   2> 		at org.eclipse.jetty.servlet.ServletHandler.addFilterWithMapping(ServletHandler.java:923)
[junit4:junit4]   2> 		at org.eclipse.jetty.servlet.ServletContextHandler.addFilter(ServletContextHandler.java:333)
[junit4:junit4]   2> 		at org.apache.solr.client.solrj.embedded.JettySolrRunner$1.lifeCycleStarted(JettySolrRunner.java:158)
[junit4:junit4]   2> 		at org.eclipse.jetty.util.component.AbstractLifeCycle.setStarted(AbstractLifeCycle.java:169)
[junit4:junit4]   2> 		at org.eclipse.jetty.util.component.AbstractLifeCycle.start(AbstractLifeCycle.java:60)
[junit4:junit4]   2> 		at org.apache.solr.client.solrj.embedded.JettySolrRunner.start(JettySolrRunner.java:210)
[junit4:junit4]   2> 		at org.apache.solr.client.solrj.embedded.JettySolrRunner.start(JettySolrRunner.java:190)
[junit4:junit4]   2> 		at org.apache.solr.BaseDistributedSearchTestCase.createJetty(BaseDistributedSearchTestCase.java:262)
[junit4:junit4]   2> 		at org.apache.solr.cloud.AbstractFullDistribZkTestBase.createJettys(AbstractFullDistribZkTestBase.java:294)
[junit4:junit4]   2> 		at org.apache.solr.cloud.AbstractFullDistribZkTestBase.createServers(AbstractFullDistribZkTestBase.java:268)
[junit4:junit4]   2> 		at org.apache.solr.BaseDistributedSearchTestCase.testDistribSearch(BaseDistributedSearchTestCase.java:693)
[junit4:junit4]   2> 		at sun.reflect.NativeMethodAccessorImpl.invoke0(Native Method)
[junit4:junit4]   2> 		at sun.reflect.NativeMethodAccessorImpl.invoke(NativeMethodAccessorImpl.java:57)
[junit4:junit4]   2> 		at sun.reflect.DelegatingMethodAccessorImpl.invoke(DelegatingMethodAccessorImpl.java:43)
[junit4:junit4]   2> 		at java.lang.reflect.Method.invoke(Method.java:601)
[junit4:junit4]   2> 		at com.carrotsearch.randomizedtesting.RandomizedRunner.invoke(RandomizedRunner.java:1559)
[junit4:junit4]   2> 		at com.carrotsearch.randomizedtesting.RandomizedRunner.access$600(RandomizedRunner.java:79)
[junit4:junit4]   2> 		at com.carrotsearch.randomizedtesting.RandomizedRunner$6.evaluate(RandomizedRunner.java:737)
[junit4:junit4]   2> 		at com.carrotsearch.randomizedtesting.RandomizedRunner$7.evaluate(RandomizedRunner.java:773)
[junit4:junit4]   2> 		at com.carrotsearch.randomizedtesting.RandomizedRunner$8.evaluate(RandomizedRunner.java:787)
[junit4:junit4]   2> 		at com.carrotsearch.randomizedtesting.rules.SystemPropertiesRestoreRule$1.evaluate(SystemPropertiesRestoreRule.java:53)
[junit4:junit4]   2> 		at org.apache.lucene.util.TestRuleSetupTeardownChained$1.evaluate(TestRuleSetupTeardownChained.java:50)
[junit4:junit4]   2> 		at org.apache.lucene.util.TestRuleFieldCacheSanity$1.evaluate(TestRuleFieldCacheSanity.java:51)
[junit4:junit4]   2> 		at org.apache.lucene.util.AbstractBeforeAfterRule$1.evaluate(AbstractBeforeAfterRule.java:45)
[junit4:junit4]   2> 		at com.carrotsearch.randomizedtesting.rules.SystemPropertiesInvariantRule$1.evaluate(SystemPropertiesInvariantRule.java:55)
[junit4:junit4]   2> 		at org.apache.lucene.util.TestRuleThreadAndTestName$1.evaluate(TestRuleThreadAndTestName.java:48)
[junit4:junit4]   2> 		at org.apache.lucene.util.TestRuleIgnoreAfterMaxFailures$1.evaluate(TestRuleIgnoreAfterMaxFailures.java:70)
[junit4:junit4]   2> 		at org.apache.lucene.util.TestRuleMarkFailure$1.evaluate(TestRuleMarkFailure.java:48)
[junit4:junit4]   2> 		at com.carrotsearch.randomizedtesting.rules.StatementAdapter.evaluate(StatementAdapter.java:36)
[junit4:junit4]   2> 		at com.carrotsearch.randomizedtesting.ThreadLeakControl$StatementRunner.run(ThreadLeakControl.java:358)
[junit4:junit4]   2> 		at com.carrotsearch.randomizedtesting.ThreadLeakControl.forkTimeoutingTask(ThreadLeakControl.java:782)
[junit4:junit4]   2> 		at com.carrotsearch.randomizedtesting.ThreadLeakControl$3.evaluate(ThreadLeakControl.java:442)
[junit4:junit4]   2> 		at com.carrotsearch.randomizedtesting.RandomizedRunner.runSingleTest(RandomizedRunner.java:746)
[junit4:junit4]   2> 		at com.carrotsearch.randomizedtesting.RandomizedRunner$3.evaluate(RandomizedRunner.java:648)
[junit4:junit4]   2> 		at com.carrotsearch.randomizedtesting.RandomizedRunner$4.evaluate(RandomizedRunner.java:682)
[junit4:junit4]   2> 		at com.carrotsearch.randomizedtesting.RandomizedRunner$5.evaluate(RandomizedRunner.java:693)
[junit4:junit4]   2> 		at com.carrotsearch.randomizedtesting.rules.StatementAdapter.evaluate(StatementAdapter.java:36)
[junit4:junit4]   2> 		at com.carrotsearch.randomizedtesting.rules.SystemPropertiesRestoreRule$1.evaluate(SystemPropertiesRestoreRule.java:53)
[junit4:junit4]   2> 		at org.apache.lucene.util.AbstractBeforeAfterRule$1.evaluate(AbstractBeforeAfterRule.java:45)
[junit4:junit4]   2> 		at org.apache.lucene.util.TestRuleStoreClassName$1.evaluate(TestRuleStoreClassName.java:42)
[junit4:junit4]   2> 		at com.carrotsearch.randomizedtesting.rules.SystemPropertiesInvariantRule$1.evaluate(SystemPropertiesInvariantRule.java:55)
[junit4:junit4]   2> 		at com.carrotsearch.randomizedtesting.rules.NoShadowingOrOverridesOnMethodsRule$1.evaluate(NoShadowingOrOverridesOnMethodsRule.java:39)
[junit4:junit4]   2> 		at com.carrotsearch.randomizedtesting.rules.NoShadowingOrOverridesOnMethodsRule$1.evaluate(NoShadowingOrOverridesOnMethodsRule.java:39)
[junit4:junit4]   2> 		at com.carrotsearch.randomizedtesting.rules.StatementAdapter.evaluate(StatementAdapter.java:36)
[junit4:junit4]   2> 		at org.apache.lucene.util.TestRuleAssertionsRequired$1.evaluate(TestRuleAssertionsRequired.java:43)
[junit4:junit4]   2> 		at org.apache.lucene.util.TestRuleMarkFailure$1.evaluate(TestRuleMarkFailure.java:48)
[junit4:junit4]   2> 		at org.apache.lucene.util.TestRuleIgnoreAfterMaxFailures$1.evaluate(TestRuleIgnoreAfterMaxFailures.java:70)
[junit4:junit4]   2> 		at org.apache.lucene.util.TestRuleIgnoreTestSuites$1.evaluate(TestRuleIgnoreTestSuites.java:55)
[junit4:junit4]   2> 		at com.carrotsearch.randomizedtesting.rules.StatementAdapter.evaluate(StatementAdapter.java:36)
[junit4:junit4]   2> 		at com.carrotsearch.randomizedtesting.ThreadLeakControl$StatementRunner.run(ThreadLeakControl.java:358)
[junit4:junit4]   2> 		at java.lang.Thread.run(Thread.java:722)
[junit4:junit4]   2> 	Caused by: org.apache.solr.common.SolrException: No registered leader was found, collection:collection1 slice:shard2
[junit4:junit4]   2> 		at org.apache.solr.common.cloud.ZkStateReader.getLeaderProps(ZkStateReader.java:413)
[junit4:junit4]   2> 		at org.apache.solr.common.cloud.ZkStateReader.getLeaderUrl(ZkStateReader.java:390)
[junit4:junit4]   2> 		at org.apache.solr.cloud.ZkController.getLeader(ZkController.java:642)
[junit4:junit4]   2> 		... 65 more
[junit4:junit4]   2> 	
[junit4:junit4]   2> 42470 T2539 oasc.SolrException.log SEVERE null:org.apache.solr.common.cloud.ZooKeeperException: 
[junit4:junit4]   2> 		at org.apache.solr.core.CoreContainer.registerInZk(CoreContainer.java:732)
[junit4:junit4]   2> 		at org.apache.solr.core.CoreContainer.register(CoreContainer.java:693)
[junit4:junit4]   2> 		at org.apache.solr.core.CoreContainer.load(CoreContainer.java:535)
[junit4:junit4]   2> 		at org.apache.solr.core.CoreContainer.load(CoreContainer.java:356)
[junit4:junit4]   2> 		at org.apache.solr.core.CoreContainer$Initializer.initialize(CoreContainer.java:308)
[junit4:junit4]   2> 		at org.apache.solr.servlet.SolrDispatchFilter.init(SolrDispatchFilter.java:107)
[junit4:junit4]   2> 		at org.eclipse.jetty.servlet.FilterHolder.doStart(FilterHolder.java:114)
[junit4:junit4]   2> 		at org.eclipse.jetty.util.component.AbstractLifeCycle.start(AbstractLifeCycle.java:59)
[junit4:junit4]   2> 		at org.eclipse.jetty.servlet.ServletHandler.initialize(ServletHandler.java:754)
[junit4:junit4]   2> 		at org.eclipse.jetty.servlet.ServletHandler.updateMappings(ServletHandler.java:1227)
[junit4:junit4]   2> 		at org.eclipse.jetty.servlet.ServletHandler.setFilterMappings(ServletHandler.java:1263)
[junit4:junit4]   2> 		at org.eclipse.jetty.servlet.ServletHandler.addFilterWithMapping(ServletHandler.java:965)
[junit4:junit4]   2> 		at org.eclipse.jetty.servlet.ServletHandler.addFilterWithMapping(ServletHandler.java:923)
[junit4:junit4]   2> 		at org.eclipse.jetty.servlet.ServletContextHandler.addFilter(ServletContextHandler.java:333)
[junit4:junit4]   2> 		at org.apache.solr.client.solrj.embedded.JettySolrRunner$1.lifeCycleStarted(JettySolrRunner.java:158)
[junit4:junit4]   2> 		at org.eclipse.jetty.util.component.AbstractLifeCycle.setStarted(AbstractLifeCycle.java:169)
[junit4:junit4]   2> 		at org.eclipse.jetty.util.component.AbstractLifeCycle.start(AbstractLifeCycle.java:60)
[junit4:junit4]   2> 		at org.apache.solr.client.solrj.embedded.JettySolrRunner.start(JettySolrRunner.java:210)
[junit4:junit4]   2> 		at org.apache.solr.client.solrj.embedded.JettySolrRunner.start(JettySolrRunner.java:190)
[junit4:junit4]   2> 		at org.apache.solr.BaseDistributedSearchTestCase.createJetty(BaseDistributedSearchTestCase.java:262)
[junit4:junit4]   2> 		at org.apache.solr.cloud.AbstractFullDistribZkTestBase.createJettys(AbstractFullDistribZkTestBase.java:294)
[junit4:junit4]   2> 		at org.apache.solr.cloud.AbstractFullDistribZkTestBase.createServers(AbstractFullDistribZkTestBase.java:268)
[junit4:junit4]   2> 		at org.apache.solr.BaseDistributedSearchTestCase.testDistribSearch(BaseDistributedSearchTestCase.java:693)
[junit4:junit4]   2> 		at sun.reflect.NativeMethodAccessorImpl.invoke0(Native Method)
[junit4:junit4]   2> 		at sun.reflect.NativeMethodAccessorImpl.invoke(NativeMethodAccessorImpl.java:57)
[junit4:junit4]   2> 		at sun.reflect.DelegatingMethodAccessorImpl.invoke(DelegatingMethodAccessorImpl.java:43)
[junit4:junit4]   2> 		at java.lang.reflect.Method.invoke(Method.java:601)
[junit4:junit4]   2> 		at com.carrotsearch.randomizedtesting.RandomizedRunner.invoke(RandomizedRunner.java:1559)
[junit4:junit4]   2> 		at com.carrotsearch.randomizedtesting.RandomizedRunner.access$600(RandomizedRunner.java:79)
[junit4:junit4]   2> 		at com.carrotsearch.randomizedtesting.RandomizedRunner$6.evaluate(RandomizedRunner.java:737)
[junit4:junit4]   2> 		at com.carrotsearch.randomizedtesting.RandomizedRunner$7.evaluate(RandomizedRunner.java:773)
[junit4:junit4]   2> 		at com.carrotsearch.randomizedtesting.RandomizedRunner$8.evaluate(RandomizedRunner.java:787)
[junit4:junit4]   2> 		at com.carrotsearch.randomizedtesting.rules.SystemPropertiesRestoreRule$1.evaluate(SystemPropertiesRestoreRule.java:53)
[junit4:junit4]   2> 		at org.apache.lucene.util.TestRuleSetupTeardownChained$1.evaluate(TestRuleSetupTeardownChained.java:50)
[junit4:junit4]   2> 		at org.apache.lucene.util.TestRuleFieldCacheSanity$1.evaluate(TestRuleFieldCacheSanity.java:51)
[junit4:junit4]   2> 		at org.apache.lucene.util.AbstractBeforeAfterRule$1.evaluate(AbstractBeforeAfterRule.java:45)
[junit4:junit4]   2> 		at com.carrotsearch.randomizedtesting.rules.SystemPropertiesInvariantRule$1.evaluate(SystemPropertiesInvariantRule.java:55)
[junit4:junit4]   2> 		at org.apache.lucene.util.TestRuleThreadAndTestName$1.evaluate(TestRuleThreadAndTestName.java:48)
[junit4:junit4]   2> 		at org.apache.lucene.util.TestRuleIgnoreAfterMaxFailures$1.evaluate(TestRuleIgnoreAfterMaxFailures.java:70)
[junit4:junit4]   2> 		at org.apache.lucene.util.TestRuleMarkFailure$1.evaluate(TestRuleMarkFailure.java:48)
[junit4:junit4]   2> 		at com.carrotsearch.randomizedtesting.rules.StatementAdapter.evaluate(StatementAdapter.java:36)
[junit4:junit4]   2> 		at com.carrotsearch.randomizedtesting.ThreadLeakControl$StatementRunner.run(ThreadLeakControl.java:358)
[junit4:junit4]   2> 		at com.carrotsearch.randomizedtesting.ThreadLeakControl.forkTimeoutingTask(ThreadLeakControl.java:782)
[junit4:junit4]   2> 		at com.carrotsearch.randomizedtesting.ThreadLeakControl$3.evaluate(ThreadLeakControl.java:442)
[junit4:junit4]   2> 		at com.carrotsearch.randomizedtesting.RandomizedRunner.runSingleTest(RandomizedRunner.java:746)
[junit4:junit4]   2> 		at com.carrotsearch.randomizedtesting.RandomizedRunner$3.evaluate(RandomizedRunner.java:648)
[junit4:junit4]   2> 		at com.carrotsearch.randomizedtesting.RandomizedRunner$4.evaluate(RandomizedRunner.java:682)
[junit4:junit4]   2> 		at com.carrotsearch.randomizedtesting.RandomizedRunner$5.evaluate(RandomizedRunner.java:693)
[junit4:junit4]   2> 		at com.carrotsearch.randomizedtesting.rules.StatementAdapter.evaluate(StatementAdapter.java:36)
[junit4:junit4]   2> 		at com.carrotsearch.randomizedtesting.rules.SystemPropertiesRestoreRule$1.evaluate(SystemPropertiesRestoreRule.java:53)
[junit4:junit4]   2> 		at org.apache.lucene.util.AbstractBeforeAfterRule$1.evaluate(AbstractBeforeAfterRule.java:45)
[junit4:junit4]   2> 		at org.apache.lucene.util.TestRuleStoreClassName$1.evaluate(TestRuleStoreClassName.java:42)
[junit4:junit4]   2> 		at com.carrotsearch.randomizedtesting.rules.SystemPropertiesInvariantRule$1.evaluate(SystemPropertiesInvariantRule.java:55)
[junit4:junit4]   2> 		at com.carrotsearch.randomizedtesting.rules.NoShadowingOrOverridesOnMethodsRule$1.evaluate(NoShadowingOrOverridesOnMethodsRule.java:39)
[junit4:junit4]   2> 		at com.carrotsearch.randomizedtesting.rules.NoShadowingOrOverridesOnMethodsRule$1.evaluate(NoShadowingOrOverridesOnMethodsRule.java:39)
[junit4:junit4]   2> 		at com.carrotsearch.randomizedtesting.rules.StatementAdapter.evaluate(StatementAdapter.java:36)
[junit4:junit4]   2> 		at org.apache.lucene.util.TestRuleAssertionsRequired$1.evaluate(TestRuleAssertionsRequired.java:43)
[junit4:junit4]   2> 		at org.apache.lucene.util.TestRuleMarkFailure$1.evaluate(TestRuleMarkFailure.java:48)
[junit4:junit4]   2> 		at org.apache.lucene.util.TestRuleIgnoreAfterMaxFailures$1.evaluate(TestRuleIgnoreAfterMaxFailures.java:70)
[junit4:junit4]   2> 		at org.apache.lucene.util.TestRuleIgnoreTestSuites$1.evaluate(TestRuleIgnoreTestSuites.java:55)
[junit4:junit4]   2> 		at com.carrotsearch.randomizedtesting.rules.StatementAdapter.evaluate(StatementAdapter.java:36)
[junit4:junit4]   2> 		at com.carrotsearch.randomizedtesting.ThreadLeakControl$StatementRunner.run(ThreadLeakControl.java:358)
[junit4:junit4]   2> 		at java.lang.Thread.run(Thread.java:722)
[junit4:junit4]   2> 	Caused by: org.apache.solr.common.SolrException: Error getting leader from zk
[junit4:junit4]   2> 		at org.apache.solr.cloud.ZkController.getLeader(ZkController.java:662)
[junit4:junit4]   2> 		at org.apache.solr.cloud.ZkController.register(ZkController.java:577)
[junit4:junit4]   2> 		at org.apache.solr.cloud.ZkController.register(ZkController.java:532)
[junit4:junit4]   2> 		at org.apache.solr.core.CoreContainer.registerInZk(CoreContainer.java:709)
[junit4:junit4]   2> 		... 62 more
[junit4:junit4]   2> 	Caused by: org.apache.solr.common.SolrException: No registered leader was found, collection:collection1 slice:shard2
[junit4:junit4]   2> 		at org.apache.solr.common.cloud.ZkStateReader.getLeaderProps(ZkStateReader.java:413)
[junit4:junit4]   2> 		at org.apache.solr.common.cloud.ZkStateReader.getLeaderUrl(ZkStateReader.java:390)
[junit4:junit4]   2> 		at org.apache.solr.cloud.ZkController.getLeader(ZkController.java:642)
[junit4:junit4]   2> 		... 65 more
[junit4:junit4]   2> 	
[junit4:junit4]   2> 42470 T2539 oass.SolrDispatchFilter.init user.dir=C:\Users\JenkinsSlave\workspace\Lucene-Solr-4.x-Windows\solr\build\solr-core\test\J0
[junit4:junit4]   2> 42470 T2539 oass.SolrDispatchFilter.init SolrDispatchFilter.init() done
[junit4:junit4]   2> 42470 T2539 oascsi.HttpClientUtil.createClient Creating new http client, config:maxConnections=128&maxConnectionsPerHost=32&followRedirects=false
[junit4:junit4]   2> 42861 T2560 oascc.ZkStateReader.updateClusterState Updating cloud state from ZooKeeper... 
[junit4:junit4]   2> 42907 T2559 oascc.ZkStateReader$2.process A cluster state change has occurred - updating...
[junit4:junit4]   2> 42907 T2573 oascc.ZkStateReader$2.process A cluster state change has occurred - updating...
[junit4:junit4]   2> 42907 T2585 oascc.ZkStateReader$2.process A cluster state change has occurred - updating...
[junit4:junit4]   2> 42907 T2539 oejs.Server.doStart jetty-8.1.2.v20120308
[junit4:junit4]   2> 42923 T2539 oejs.AbstractConnector.doStart Started SocketConnector@0.0.0.0:51411
[junit4:junit4]   2> 42923 T2539 oasc.SolrResourceLoader.locateSolrHome JNDI not configured for solr (NoInitialContextEx)
[junit4:junit4]   2> 42923 T2539 oasc.SolrResourceLoader.locateSolrHome using system property solr.solr.home: C:\Users\JenkinsSlave\workspace\Lucene-Solr-4.x-Windows\solr\build\solr-core\test\J0\.\solrtest-jetty3-1348610260253
[junit4:junit4]   2> 42923 T2539 oasc.SolrResourceLoader.<init> new SolrResourceLoader for deduced Solr Home: 'C:\Users\JenkinsSlave\workspace\Lucene-Solr-4.x-Windows\solr\build\solr-core\test\J0\.\solrtest-jetty3-1348610260253\'
[junit4:junit4]   2> 42954 T2539 oass.SolrDispatchFilter.init SolrDispatchFilter.init()
[junit4:junit4]   2> 42954 T2539 oasc.SolrResourceLoader.locateSolrHome JNDI not configured for solr (NoInitialContextEx)
[junit4:junit4]   2> 42954 T2539 oasc.SolrResourceLoader.locateSolrHome using system property solr.solr.home: C:\Users\JenkinsSlave\workspace\Lucene-Solr-4.x-Windows\solr\build\solr-core\test\J0\.\solrtest-jetty3-1348610260253
[junit4:junit4]   2> 42954 T2539 oasc.CoreContainer$Initializer.initialize looking for solr.xml: C:\Users\JenkinsSlave\workspace\Lucene-Solr-4.x-Windows\solr\build\solr-core\test\J0\.\solrtest-jetty3-1348610260253\solr.xml
[junit4:junit4]   2> 42954 T2539 oasc.CoreContainer.<init> New CoreContainer 31778919
[junit4:junit4]   2> 42954 T2539 oasc.CoreContainer.load Loading CoreContainer using Solr Home: 'C:\Users\JenkinsSlave\workspace\Lucene-Solr-4.x-Windows\solr\build\solr-core\test\J0\.\solrtest-jetty3-1348610260253\'
[junit4:junit4]   2> 42954 T2539 oasc.SolrResourceLoader.<init> new SolrResourceLoader for directory: 'C:\Users\JenkinsSlave\workspace\Lucene-Solr-4.x-Windows\solr\build\solr-core\test\J0\.\solrtest-jetty3-1348610260253\'
[junit4:junit4]   2> 42970 T2539 oasc.CoreContainer.load Registering Log Listener
[junit4:junit4]   2> 42986 T2539 oasc.CoreContainer.initZooKeeper Zookeeper client=127.0.0.1:51389/solr
[junit4:junit4]   2> 42986 T2539 oaz.ZooKeeper.<init> Initiating client connection, connectString=127.0.0.1:51389/solr sessionTimeout=5000 watcher=org.apache.solr.common.cloud.ConnectionManager@9038d3
[junit4:junit4]   2> 42986 T2596 oaz.ClientCnxn$SendThread.startConnect Opening socket connection to server /127.0.0.1:51389
[junit4:junit4]   2> 42986 T2539 oascc.ConnectionManager.waitForConnected Waiting for client to connect to ZooKeeper
[junit4:junit4]   2> 42986 T2596 oaz.ClientCnxn$SendThread.primeConnection Socket connection established to 127.0.0.1/127.0.0.1:51389, initiating session
[junit4:junit4]   2> 42986 T2541 oazs.NIOServerCnxn$Factory.run Accepted socket connection from /127.0.0.1:51414
[junit4:junit4]   2> 42986 T2541 oazs.NIOServerCnxn.readConnectRequest Client attempting to establish new session at /127.0.0.1:51414
[junit4:junit4]   2> 43048 T2543 oazs.NIOServerCnxn.finishSessionInit Established session 0x139ff6ed7370005 with negotiated timeout 5000 for client /127.0.0.1:51414
[junit4:junit4]   2> 43048 T2596 oaz.ClientCnxn$SendThread.readConnectResult Session establishment complete on server 127.0.0.1/127.0.0.1:51389, sessionid = 0x139ff6ed7370005, negotiated timeout = 5000
[junit4:junit4]   2> 43064 T2597 oascc.ConnectionManager.process Watcher org.apache.solr.common.cloud.ConnectionManager@9038d3 name:ZooKeeperConnection Watcher:127.0.0.1:51389/solr got event WatchedEvent state:SyncConnected type:None path:null path:null type:None
[junit4:junit4]   2> 43064 T2539 oascc.ConnectionManager.waitForConnected Client is connected to ZooKeeper
[junit4:junit4]   2> 43064 T2544 oazs.PrepRequestProcessor.pRequest Got user-level KeeperException when processing sessionid:0x139ff6ed7370005 type:create cxid:0x1 zxid:0xfffffffffffffffe txntype:unknown reqpath:n/a Error Path:/solr/overseer Error:KeeperErrorCode = NodeExists for /solr/overseer
[junit4:junit4]   2> 43079 T2544 oazs.PrepRequestProcessor.pRequest Got user-level KeeperException when processing sessionid:0x139ff6ed7370005 type:create cxid:0x2 zxid:0xfffffffffffffffe txntype:unknown reqpath:n/a Error Path:/solr/overseer Error:KeeperErrorCode = NodeExists for /solr/overseer
[junit4:junit4]   2> 43095 T2539 oasc.ZkController.createEphemeralLiveNode Register node as live in ZooKeeper:/live_nodes/127.0.0.1:51411_solr
[junit4:junit4]   2> 43095 T2544 oazs.PrepRequestProcessor.pRequest Got user-level KeeperException when processing sessionid:0x139ff6ed7370005 type:delete cxid:0x4 zxid:0xfffffffffffffffe txntype:unknown reqpath:n/a Error Path:/solr/live_nodes/127.0.0.1:51411_solr Error:KeeperErrorCode = NoNode for /solr/live_nodes/127.0.0.1:51411_solr
[junit4:junit4]   2> 43111 T2539 oascc.SolrZkClient.makePath makePath: /live_nodes/127.0.0.1:51411_solr
[junit4:junit4]   2> 43142 T2559 oascc.ZkStateReader$3.process Updating live nodes
[junit4:junit4]   2> 43142 T2573 oascc.ZkStateReader$3.process Updating live nodes
[junit4:junit4]   2> 43142 T2585 oascc.ZkStateReader$3.process Updating live nodes
[junit4:junit4]   2> 43142 T2539 oashc.HttpShardHandlerFactory.getParameter Setting socketTimeout to: 0
[junit4:junit4]   2> 43142 T2539 oashc.HttpShardHandlerFactory.getParameter Setting urlScheme to: http://
[junit4:junit4]   2> 43142 T2539 oashc.HttpShardHandlerFactory.getParameter Setting connTimeout to: 0
[junit4:junit4]   2> 43142 T2539 oashc.HttpShardHandlerFactory.getParameter Setting maxConnectionsPerHost to: 20
[junit4:junit4]   2> 43142 T2539 oashc.HttpShardHandlerFactory.getParameter Setting corePoolSize to: 0
[junit4:junit4]   2> 43142 T2539 oashc.HttpShardHandlerFactory.getParameter Setting maximumPoolSize to: 2147483647
[junit4:junit4]   2> 43142 T2539 oashc.HttpShardHandlerFactory.getParameter Setting maxThreadIdleTime to: 5
[junit4:junit4]   2> 43142 T2539 oashc.HttpShardHandlerFactory.getParameter Setting sizeOfQueue to: -1
[junit4:junit4]   2> 43142 T2539 oashc.HttpShardHandlerFactory.getParameter Setting fairnessPolicy to: false
[junit4:junit4]   2> 43142 T2539 oascsi.HttpClientUtil.createClient Creating new http client, config:maxConnectionsPerHost=20&maxConnections=10000&socketTimeout=0&connTimeout=0&retry=false
[junit4:junit4]   2> 43173 T2539 oascc.ZkStateReader.createClusterStateWatchersAndUpdate Updating cluster state from ZooKeeper... 
[junit4:junit4]   2> 43204 T2539 oasc.CoreContainer.create Creating SolrCore 'collection1' using instanceDir: C:\Users\JenkinsSlave\workspace\Lucene-Solr-4.x-Windows\solr\build\solr-core\test\J0\.\solrtest-jetty3-1348610260253\collection1
[junit4:junit4]   2> 43204 T2539 oasc.ZkController.createCollectionZkNode Check for collection zkNode:collection1
[junit4:junit4]   2> 43204 T2539 oasc.ZkController.createCollectionZkNode Collection zkNode exists
[junit4:junit4]   2> 43204 T2539 oasc.ZkController.readConfigName Load collection config from:/collections/collection1
[junit4:junit4]   2> 43204 T2539 oasc.SolrResourceLoader.<init> new SolrResourceLoader for directory: 'C:\Users\JenkinsSlave\workspace\Lucene-Solr-4.x-Windows\solr\build\solr-core\test\J0\.\solrtest-jetty3-1348610260253\collection1\'
[junit4:junit4]   2> 43204 T2539 oasc.SolrResourceLoader.replaceClassLoader Adding 'file:/C:/Users/JenkinsSlave/workspace/Lucene-Solr-4.x-Windows/solr/build/solr-core/test/J0/solrtest-jetty3-1348610260253/collection1/lib/classes/' to classloader
[junit4:junit4]   2> 43204 T2539 oasc.SolrResourceLoader.replaceClassLoader Adding 'file:/C:/Users/JenkinsSlave/workspace/Lucene-Solr-4.x-Windows/solr/build/solr-core/test/J0/solrtest-jetty3-1348610260253/collection1/lib/README' to classloader
[junit4:junit4]   2> 43251 T2539 oasc.SolrConfig.<init> Using Lucene MatchVersion: LUCENE_41
[junit4:junit4]   2> 43314 T2539 oasc.SolrConfig.<init> Loaded SolrConfig: solrconfig.xml
[junit4:junit4]   2> 43314 T2539 oass.IndexSchema.readSchema Reading Solr Schema
[junit4:junit4]   2> 43314 T2539 oass.IndexSchema.readSchema Schema name=test
[junit4:junit4]   2> 43892 T2539 oass.OpenExchangeRatesOrgProvider.init Initialized with rates=open-exchange-rates.json, refreshInterval=1440.
[junit4:junit4]   2> 43892 T2539 oass.IndexSchema.readSchema default search field in schema is text
[junit4:junit4]   2> 43907 T2539 oass.IndexSchema.readSchema unique key field: id
[junit4:junit4]   2> 43923 T2539 oass.FileExchangeRateProvider.reload Reloading exchange rates from file currency.xml
[junit4:junit4]   2> 43923 T2539 oass.FileExchangeRateProvider.reload Reloading exchange rates from file currency.xml
[junit4:junit4]   2> 43923 T2539 oass.OpenExchangeRatesOrgProvider.reload Reloading exchange rates from open-exchange-rates.json
[junit4:junit4]   2> 43923 T2539 oass.OpenExchangeRatesOrgProvider.reload Reloading exchange rates from open-exchange-rates.json
[junit4:junit4]   2> 43923 T2539 oasc.SolrCore.<init> [collection1] Opening new SolrCore at C:\Users\JenkinsSlave\workspace\Lucene-Solr-4.x-Windows\solr\build\solr-core\test\J0\.\solrtest-jetty3-1348610260253\collection1\, dataDir=.\org.apache.solr.cloud.FullSolrCloudDistribCmdsTest-1348610217783/jetty3\
[junit4:junit4]   2> 43923 T2539 oasc.JmxMonitoredMap.<init> JMX monitoring is enabled. Adding Solr mbeans to JMX Server: com.sun.jmx.mbeanserver.JmxMBeanServer@45e380
[junit4:junit4]   2> 43923 T2539 oasc.SolrCore.getNewIndexDir WARNING New index directory detected: old=null new=.\org.apache.solr.cloud.FullSolrCloudDistribCmdsTest-1348610217783/jetty3\index/
[junit4:junit4]   2> 43939 T2539 oasc.SolrCore.initIndex WARNING [collection1] Solr index directory '.\org.apache.solr.cloud.FullSolrCloudDistribCmdsTest-1348610217783\jetty3\index' doesn't exist. Creating new index...
[junit4:junit4]   2> 43939 T2539 oasc.CachingDirectoryFactory.get return new directory for C:\Users\JenkinsSlave\workspace\Lucene-Solr-4.x-Windows\solr\build\solr-core\test\J0\.\org.apache.solr.cloud.FullSolrCloudDistribCmdsTest-1348610217783\jetty3\index forceNew:false
[junit4:junit4]   2> 43970 T2539 oasc.SolrDeletionPolicy.onCommit SolrDeletionPolicy.onCommit: commits:num=1
[junit4:junit4]   2> 		commit{dir=NRTCachingDirectory(org.apache.lucene.store.SimpleFSDirectory@C:\Users\JenkinsSlave\workspace\Lucene-Solr-4.x-Windows\solr\build\solr-core\test\J0\org.apache.solr.cloud.FullSolrCloudDistribCmdsTest-1348610217783\jetty3\index lockFactory=org.apache.lucene.store.NativeFSLockFactory@1cf64ef; maxCacheMB=48.0 maxMergeSizeMB=4.0),segFN=segments_1,generation=1,filenames=[segments_1]
[junit4:junit4]   2> 43970 T2539 oasc.SolrDeletionPolicy.updateCommits newest commit = 1
[junit4:junit4]   2> 43970 T2539 oasc.SolrCore.initWriters created xml: solr.XMLResponseWriter
[junit4:junit4]   2> 43970 T2539 oasup.UpdateRequestProcessorChain.init inserting DistributedUpdateProcessorFactory into updateRequestProcessorChain "dedupe"
[junit4:junit4]   2> 43970 T2539 oasup.UpdateRequestProcessorChain.init inserting DistributedUpdateProcessorFactory into updateRequestProcessorChain "dedupe-allfields"
[junit4:junit4]   2> 43970 T2539 oasup.UpdateRequestProcessorChain.init inserting DistributedUpdateProcessorFactory into updateRequestProcessorChain "stored_sig"
[junit4:junit4]   2> 43970 T2539 oasup.UpdateRequestProcessorChain.init inserting DistributedUpdateProcessorFactory into updateRequestProcessorChain "uniq-fields"
[junit4:junit4]   2> 43970 T2539 oasup.UpdateRequestProcessorChain.init inserting DistributedUpdateProcessorFactory into updateRequestProcessorChain "distrib-dup-test-chain-implicit"
[junit4:junit4]   2> 43970 T2539 oasc.RequestHandlers.initHandlersFromConfig adding lazy requestHandler: solr.ReplicationHandler
[junit4:junit4]   2> 43970 T2539 oasc.RequestHandlers.initHandlersFromConfig created /replication: solr.ReplicationHandler
[junit4:junit4]   2> 43970 T2539 oasc.RequestHandlers.initHandlersFromConfig created standard: solr.StandardRequestHandler
[junit4:junit4]   2> 43970 T2539 oasc.RequestHandlers.initHandlersFromConfig created /get: solr.RealTimeGetHandler
[junit4:junit4]   2> 43970 T2539 oasc.RequestHandlers.initHandlersFromConfig created dismax: solr.SearchHandler
[junit4:junit4]   2> 43970 T2539 oasc.RequestHandlers.initHandlersFromConfig created mock: org.apache.solr.core.MockQuerySenderListenerReqHandler
[junit4:junit4]   2> 43970 T2539 oasc.RequestHandlers.initHandlersFromConfig created /admin/: org.apache.solr.handler.admin.AdminHandlers
[junit4:junit4]   2> 43970 T2539 oasc.RequestHandlers.initHandlersFromConfig created defaults: solr.StandardRequestHandler
[junit4:junit4]   2> 43970 T2539 oasc.RequestHandlers.initHandlersFromConfig adding lazy requestHandler: solr.StandardRequestHandler
[junit4:junit4]   2> 43970 T2539 oasc.RequestHandlers.initHandlersFromConfig created lazy: solr.StandardRequestHandler
[junit4:junit4]   2> 43970 T2539 oasc.RequestHandlers.initHandlersFromConfig created /update: solr.UpdateRequestHandler
[junit4:junit4]   2> 43970 T2539 oasc.RequestHandlers.initHandlersFromConfig created /terms: org.apache.solr.handler.component.SearchHandler
[junit4:junit4]   2> 43970 T2539 oasc.RequestHandlers.initHandlersFromConfig created spellCheckCompRH: org.apache.solr.handler.component.SearchHandler
[junit4:junit4]   2> 43970 T2539 oasc.RequestHandlers.initHandlersFromConfig created spellCheckCompRH_Direct: org.apache.solr.handler.component.SearchHandler
[junit4:junit4]   2> 43970 T2539 oasc.RequestHandlers.initHandlersFromConfig created spellCheckWithWordbreak: org.apache.solr.handler.component.SearchHandler
[junit4:junit4]   2> 43970 T2539 oasc.RequestHandlers.initHandlersFromConfig created spellCheckWithWordbreak_Direct: org.apache.solr.handler.component.SearchHandler
[junit4:junit4]   2> 43970 T2539 oasc.RequestHandlers.initHandlersFromConfig created spellCheckCompRH1: org.apache.solr.handler.component.SearchHandler
[junit4:junit4]   2> 43986 T2539 oasc.RequestHandlers.initHandlersFromConfig created tvrh: org.apache.solr.handler.component.SearchHandler
[junit4:junit4]   2> 43986 T2539 oasc.RequestHandlers.initHandlersFromConfig created /mlt: solr.MoreLikeThisHandler
[junit4:junit4]   2> 43986 T2539 oasc.RequestHandlers.initHandlersFromConfig created /debug/dump: solr.DumpRequestHandler
[junit4:junit4]   2> 43986 T2539 oashl.XMLLoader.init xsltCacheLifetimeSeconds=60
[junit4:junit4]   2> 43986 T2539 oasc.SolrCore.initDeprecatedSupport WARNING solrconfig.xml uses deprecated <admin/gettableFiles>, Please update your config to use the ShowFileRequestHandler.
[junit4:junit4]   2> 43986 T2539 oasc.SolrCore.initDeprecatedSupport WARNING adding ShowFileRequestHandler with hidden files: [SCHEMA.XML, OLD_SYNONYMS.TXT, STOPWORDS.TXT, PROTWORDS.TXT, OPEN-EXCHANGE-RATES.JSON, SYNONYMS.TXT, CURRENCY.XML, MAPPING-ISOLATIN1ACCENT.TXT]
[junit4:junit4]   2> 44001 T2539 oass.SolrIndexSearcher.<init> Opening Searcher@8f39bb main
[junit4:junit4]   2> 44001 T2539 oasu.CommitTracker.<init> Hard AutoCommit: disabled
[junit4:junit4]   2> 44001 T2539 oasu.CommitTracker.<init> Soft AutoCommit: disabled
[junit4:junit4]   2> 44001 T2539 oashc.SpellCheckComponent.inform Initializing spell checkers
[junit4:junit4]   2> 44048 T2539 oass.DirectSolrSpellChecker.init init: {name=direct,classname=DirectSolrSpellChecker,field=lowerfilt,minQueryLength=3}
[junit4:junit4]   2> 44282 T2598 oasc.SolrCore.registerSearcher [collection1] Registered new searcher Searcher@8f39bb main{StandardDirectoryReader(segments_1:1)}
[junit4:junit4]   2> 44423 T2560 oascc.ZkStateReader.updateClusterState Updating cloud state from ZooKeeper... 
[junit4:junit4]   2> 44486 T2559 oascc.ZkStateReader$2.process A cluster state change has occurred - updating...
[junit4:junit4]   2> 44486 T2573 oascc.ZkStateReader$2.process A cluster state change has occurred - updating...
[junit4:junit4]   2> 44486 T2597 oascc.ZkStateReader$2.process A cluster state change has occurred - updating...
[junit4:junit4]   2> 44486 T2585 oascc.ZkStateReader$2.process A cluster state change has occurred - updating...
[junit4:junit4]   2> 44814 T2539 oasc.CoreContainer.register registering core: collection1
[junit4:junit4]   2> 44814 T2539 oasc.ZkController.register Register shard - core:collection1 address:http://127.0.0.1:51411/solr shardId:shard1
[junit4:junit4]   2> 44829 T2539 oasc.ZkController.register We are http://127.0.0.1:51411/solr/collection1/ and leader is http://127.0.0.1:51400/solr/collection1/
[junit4:junit4]   2> 44829 T2539 oasc.ZkController.register No LogReplay needed for core=collection1 baseURL=http://127.0.0.1:51411/solr
[junit4:junit4]   2> 44829 T2539 oasc.ZkController.checkRecovery Core needs to recover:collection1
[junit4:junit4]   2> 44829 T2539 oasu.DefaultSolrCoreState.doRecovery Running recovery - first canceling any ongoing recovery
[junit4:junit4]   2> ASYNC  NEW_CORE C183 name=collection1 org.apache.solr.core.SolrCore@1052336 url=http://127.0.0.1:51411/solr/collection1 node=127.0.0.1:51411_solr
[junit4:junit4]   2> 44829 T2599 C183 P51411 oasc.RecoveryStrategy.run Starting recovery process.  core=collection1 recoveringAfterStartup=true
[junit4:junit4]   2> 44829 T2539 oascc.ZkStateReader.updateClusterState Updating cloud state from ZooKeeper... 
[junit4:junit4]   2> 44829 T2599 C183 P51411 oasc.RecoveryStrategy.doRecovery ###### startupVersions=[]
[junit4:junit4]   2> 44829 T2539 oass.SolrDispatchFilter.init user.dir=C:\Users\JenkinsSlave\workspace\Lucene-Solr-4.x-Windows\solr\build\solr-core\test\J0
[junit4:junit4]   2> 44829 T2539 oass.SolrDispatchFilter.init SolrDispatchFilter.init() done
[junit4:junit4]   2> 44829 T2539 oascsi.HttpClientUtil.createClient Creating new http client, config:maxConnections=128&maxConnectionsPerHost=32&followRedirects=false
[junit4:junit4]   2> 44861 T2599 C183 P51411 oasc.RecoveryStrategy.doRecovery Attempting to PeerSync from http://127.0.0.1:51400/solr/collection1/ core=collection1 - recoveringAfterStartup=true
[junit4:junit4]   2> 44861 T2599 C183 P51411 oasu.PeerSync.sync PeerSync: core=collection1 url=http://127.0.0.1:51411/solr START replicas=[http://127.0.0.1:51400/solr/collection1/] nUpdates=100
[junit4:junit4]   2> 44861 T2599 C183 P51411 oasu.PeerSync.sync WARNING no frame of reference to tell of we've missed updates
[junit4:junit4]   2> 44861 T2599 C183 P51411 oasc.RecoveryStrategy.doRecovery PeerSync Recovery was not successful - trying replication. core=collection1
[junit4:junit4]   2> 44861 T2599 C183 P51411 oasc.RecoveryStrategy.doRecovery Starting Replication Recovery. core=collection1
[junit4:junit4]   2> 44861 T2599 C183 P51411 oascsi.HttpClientUtil.createClient Creating new http client, config:maxConnections=128&maxConnectionsPerHost=32&followRedirects=false
[junit4:junit4]   2> ASYNC  NEW_CORE C184 name=collection1 org.apache.solr.core.SolrCore@7e1f42 url=http://127.0.0.1:51400/solr/collection1 node=127.0.0.1:51400_solr
[junit4:junit4]   2> 44892 T2565 C184 P51400 REQ /get {distrib=false&qt=/get&wt=javabin&version=2&getVersions=100} status=0 QTime=0 
[junit4:junit4]   2> 45001 T2560 oascc.ZkStateReader.updateClusterState Updating cloud state from ZooKeeper... 
[junit4:junit4]   2> 45032 T2559 oascc.ZkStateReader$2.process A cluster state change has occurred - updating...
[junit4:junit4]   2> 45032 T2573 oascc.ZkStateReader$2.process A cluster state change has occurred - updating...
[junit4:junit4]   2> 45032 T2585 oascc.ZkStateReader$2.process A cluster state change has occurred - updating...
[junit4:junit4]   2> 45032 T2597 oascc.ZkStateReader$2.process A cluster state change has occurred - updating...
[junit4:junit4]   2> 45392 T2539 oejs.Server.doStart jetty-8.1.2.v20120308
[junit4:junit4]   2> 45392 T2539 oejs.AbstractConnector.doStart Started SocketConnector@0.0.0.0:51417
[junit4:junit4]   2> 45392 T2539 oasc.SolrResourceLoader.locateSolrHome JNDI not configured for solr (NoInitialContextEx)
[junit4:junit4]   2> 45392 T2539 oasc.SolrResourceLoader.locateSolrHome using system property solr.solr.home: C:\Users\JenkinsSlave\workspace\Lucene-Solr-4.x-Windows\solr\build\solr-core\test\J0\.\solrtest-jetty4-1348610262612
[junit4:junit4]   2> 45392 T2539 oasc.SolrResourceLoader.<init> new SolrResourceLoader for deduced Solr Home: 'C:\Users\JenkinsSlave\workspace\Lucene-Solr-4.x-Windows\solr\build\solr-core\test\J0\.\solrtest-jetty4-1348610262612\'
[junit4:junit4]   2> 45439 T2539 oass.SolrDispatchFilter.init SolrDispatchFilter.init()
[junit4:junit4]   2> 45439 T2539 oasc.SolrResourceLoader.locateSolrHome JNDI not configured for solr (NoInitialContextEx)
[junit4:junit4]   2> 45439 T2539 oasc.SolrResourceLoader.locateSolrHome using system property solr.solr.home: C:\Users\JenkinsSlave\workspace\Lucene-Solr-4.x-Windows\solr\build\solr-core\test\J0\.\solrtest-jetty4-1348610262612
[junit4:junit4]   2> 45439 T2539 oasc.CoreContainer$Initializer.initialize looking for solr.xml: C:\Users\JenkinsSlave\workspace\Lucene-Solr-4.x-Windows\solr\build\solr-core\test\J0\.\solrtest-jetty4-1348610262612\solr.xml
[junit4:junit4]   2> 45439 T2539 oasc.CoreContainer.<init> New CoreContainer 24014275
[junit4:junit4]   2> 45439 T2539 oasc.CoreContainer.load Loading CoreContainer using Solr Home: 'C:\Users\JenkinsSlave\workspace\Lucene-Solr-4.x-Windows\solr\build\solr-core\test\J0\.\solrtest-jetty4-1348610262612\'
[junit4:junit4]   2> 45439 T2539 oasc.SolrResourceLoader.<init> new SolrResourceLoader for directory: 'C:\Users\JenkinsSlave\workspace\Lucene-Solr-4.x-Windows\solr\build\solr-core\test\J0\.\solrtest-jetty4-1348610262612\'
[junit4:junit4]   2> 45454 T2539 oasc.CoreContainer.load Registering Log Listener
[junit4:junit4]   2> 45470 T2539 oasc.CoreContainer.initZooKeeper Zookeeper client=127.0.0.1:51389/solr
[junit4:junit4]   2> 45470 T2539 oaz.ZooKeeper.<init> Initiating client connection, connectString=127.0.0.1:51389/solr sessionTimeout=5000 watcher=org.apache.solr.common.cloud.ConnectionManager@1352bed
[junit4:junit4]   2> 45470 T2610 oaz.ClientCnxn$SendThread.startConnect Opening socket connection to server /127.0.0.1:51389
[junit4:junit4]   2> 45470 T2539 oascc.ConnectionManager.waitForConnected Waiting for client to connect to ZooKeeper
[junit4:junit4]   2> 45470 T2610 oaz.ClientCnxn$SendThread.primeConnection Socket connection established to 127.0.0.1/127.0.0.1:51389, initiating session
[junit4:junit4]   2> 45470 T2541 oazs.NIOServerCnxn$Factory.run Accepted socket connection from /127.0.0.1:51420
[junit4:junit4]   2> 45470 T2541 oazs.NIOServerCnxn.readConnectRequest Client attempting to establish new session at /127.0.0.1:51420
[junit4:junit4]   2> 45501 T2543 oazs.NIOServerCnxn.finishSessionInit Established session 0x139ff6ed7370006 with negotiated timeout 5000 for client /127.0.0.1:51420
[junit4:junit4]   2> 45501 T2610 oaz.ClientCnxn$SendThread.readConnectResult Session establishment complete on server 127.0.0.1/127.0.0.1:51389, sessionid = 0x139ff6ed7370006, negotiated timeout = 5000
[junit4:junit4]   2> 45501 T2611 oascc.ConnectionManager.process Watcher org.apache.solr.common.cloud.ConnectionManager@1352bed name:ZooKeeperConnection Watcher:127.0.0.1:51389/solr got event WatchedEvent state:SyncConnected type:None path:null path:null type:None
[junit4:junit4]   2> 45501 T2539 oascc.ConnectionManager.waitForConnected Client is connected to ZooKeeper
[junit4:junit4]   2> 45501 T2544 oazs.PrepRequestProcessor.pRequest Got user-level KeeperException when processing sessionid:0x139ff6ed7370006 type:create cxid:0x1 zxid:0xfffffffffffffffe txntype:unknown reqpath:n/a Error Path:/solr/overseer Error:KeeperErrorCode = NodeExists for /solr/overseer
[junit4:junit4]   2> 45501 T2544 oazs.PrepRequestProcessor.pRequest Got user-level KeeperException when processing sessionid:0x139ff6ed7370006 type:create cxid:0x2 zxid:0xfffffffffffffffe txntype:unknown reqpath:n/a Error Path:/solr/overseer Error:KeeperErrorCode = NodeExists for /solr/overseer
[junit4:junit4]   2> 45517 T2539 oasc.ZkController.createEphemeralLiveNode Register node as live in ZooKeeper:/live_nodes/127.0.0.1:51417_solr
[junit4:junit4]   2> 45517 T2544 oazs.PrepRequestProcessor.pRequest Got user-level KeeperException when processing sessionid:0x139ff6ed7370006 type:delete cxid:0x4 zxid:0xfffffffffffffffe txntype:unknown reqpath:n/a Error Path:/solr/live_nodes/127.0.0.1:51417_solr Error:KeeperErrorCode = NoNode for /solr/live_nodes/127.0.0.1:51417_solr
[junit4:junit4]   2> 45532 T2539 oascc.SolrZkClient.makePath makePath: /live_nodes/127.0.0.1:51417_solr
[junit4:junit4]   2> 45564 T2573 oascc.ZkStateReader$3.process Updating live nodes
[junit4:junit4]   2> 45564 T2597 oascc.ZkStateReader$3.process Updating live nodes
[junit4:junit4]   2> 45564 T2585 oascc.ZkStateReader$3.process Updating live nodes
[junit4:junit4]   2> 45564 T2559 oascc.ZkStateReader$3.process Updating live nodes
[junit4:junit4]   2> 45564 T2539 oashc.HttpShardHandlerFactory.getParameter Setting socketTimeout to: 0
[junit4:junit4]   2> 45564 T2539 oashc.HttpShardHandlerFactory.getParameter Setting urlScheme to: http://
[junit4:junit4]   2> 45564 T2539 oashc.HttpShardHandlerFactory.getParameter Setting connTimeout to: 0
[junit4:junit4]   2> 45564 T2539 oashc.HttpShardHandlerFactory.getParameter Setting maxConnectionsPerHost to: 20
[junit4:junit4]   2> 45564 T2539 oashc.HttpShardHandlerFactory.getParameter Setting corePoolSize to: 0
[junit4:junit4]   2> 45564 T2539 oashc.HttpShardHandlerFactory.getParameter Setting maximumPoolSize to: 2147483647
[junit4:junit4]   2> 45564 T2539 oashc.HttpShardHandlerFactory.getParameter Setting maxThreadIdleTime to: 5
[junit4:junit4]   2> 45564 T2539 oashc.HttpShardHandlerFactory.getParameter Setting sizeOfQueue to: -1
[junit4:junit4]   2> 45564 T2539 oashc.HttpShardHandlerFactory.getParameter Setting fairnessPolicy to: false
[junit4:junit4]   2> 45564 T2539 oascsi.HttpClientUtil.createClient Creating new http client, config:maxConnectionsPerHost=20&maxConnections=10000&socketTimeout=0&connTimeout=0&retry=false
[junit4:junit4]   2> 45611 T2539 oascc.ZkStateReader.createClusterStateWatchersAndUpdate Updating cluster state from ZooKeeper... 
[junit4:junit4]   2> 45626 T2539 oasc.CoreContainer.create Creating SolrCore 'collection1' using instanceDir: C:\Users\JenkinsSlave\workspace\Lucene-Solr-4.x-Windows\solr\build\solr-core\test\J0\.\solrtest-jetty4-1348610262612\collection1
[junit4:junit4]   2> 45626 T2539 oasc.ZkController.createCollectionZkNode Check for collection zkNode:collection1
[junit4:junit4]   2> 45626 T2539 oasc.ZkController.createCollectionZkNode Collection zkNode exists
[junit4:junit4]   2> 45626 T2539 oasc.ZkController.readConfigName Load collection config from:/collections/collection1
[junit4:junit4]   2> 45626 T2539 oasc.SolrResourceLoader.<init> new SolrResourceLoader for directory: 'C:\Users\JenkinsSlave\workspace\Lucene-Solr-4.x-Windows\solr\build\solr-core\test\J0\.\solrtest-jetty4-1348610262612\collection1\'
[junit4:junit4]   2> 45626 T2539 oasc.SolrResourceLoader.replaceClassLoader Adding 'file:/C:/Users/JenkinsSlave/workspace/Lucene-Solr-4.x-Windows/solr/build/solr-core/test/J0/solrtest-jetty4-1348610262612/collection1/lib/classes/' to classloader
[junit4:junit4]   2> 45642 T2539 oasc.SolrResourceLoader.replaceClassLoader Adding 'file:/C:/Users/JenkinsSlave/workspace/Lucene-Solr-4.x-Windows/solr/build/solr-core/test/J0/solrtest-jetty4-1348610262612/collection1/lib/README' to classloader
[junit4:junit4]   2> 45689 T2539 oasc.SolrConfig.<init> Using Lucene MatchVersion: LUCENE_41
[junit4:junit4]   2> 45736 T2539 oasc.SolrConfig.<init> Loaded SolrConfig: solrconfig.xml
[junit4:junit4]   2> 45751 T2539 oass.IndexSchema.readSchema Reading Solr Schema
[junit4:junit4]   2> 45751 T2539 oass.IndexSchema.readSchema Schema name=test
[junit4:junit4]   2> 46345 T2539 oass.OpenExchangeRatesOrgProvider.init Initialized with rates=open-exchange-rates.json, refreshInterval=1440.
[junit4:junit4]   2> 46361 T2539 oass.IndexSchema.readSchema default search field in schema is text
[junit4:junit4]   2> 46361 T2539 oass.IndexSchema.readSchema unique key field: id
[junit4:junit4]   2> 46376 T2539 oass.FileExchangeRateProvider.reload Reloading exchange rates from file currency.xml
[junit4:junit4]   2> 46376 T2539 oass.FileExchangeRateProvider.reload Reloading exchange rates from file currency.xml
[junit4:junit4]   2> 46392 T2539 oass.OpenExchangeRatesOrgProvider.reload Reloading exchange rates from open-exchange-rates.json
[junit4:junit4]   2> 46392 T2539 oass.OpenExchangeRatesOrgProvider.reload Reloading exchange rates from open-exchange-rates.json
[junit4:junit4]   2> 46392 T2539 oasc.SolrCore.<init> [collection1] Opening new SolrCore at C:\Users\JenkinsSlave\workspace\Lucene-Solr-4.x-Windows\solr\build\solr-core\test\J0\.\solrtest-jetty4-1348610262612\collection1\, dataDir=.\org.apache.solr.cloud.FullSolrCloudDistribCmdsTest-1348610217783/jetty4\
[junit4:junit4]   2> 46392 T2539 oasc.JmxMonitoredMap.<init> JMX monitoring is enabled. Adding Solr mbeans to JMX Server: com.sun.jmx.mbeanserver.JmxMBeanServer@45e380
[junit4:junit4]   2> 46392 T2539 oasc.SolrCore.getNewIndexDir WARNING New index directory detected: old=null new=.\org.apache.solr.cloud.FullSolrCloudDistribCmdsTest-1348610217783/jetty4\index/
[junit4:junit4]   2> 46392 T2539 oasc.SolrCore.initIndex WARNING [collection1] Solr index directory '.\org.apache.solr.cloud.FullSolrCloudDistribCmdsTest-1348610217783\jetty4\index' doesn't exist. Creating new index...
[junit4:junit4]   2> 46392 T2539 oasc.CachingDirectoryFactory.get return new directory for C:\Users\JenkinsSlave\workspace\Lucene-Solr-4.x-Windows\solr\build\solr-core\test\J0\.\org.apache.solr.cloud.FullSolrCloudDistribCmdsTest-1348610217783\jetty4\index forceNew:false
[junit4:junit4]   2> 46439 T2539 oasc.SolrDeletionPolicy.onCommit SolrDeletionPolicy.onCommit: commits:num=1
[junit4:junit4]   2> 		commit{dir=NRTCachingDirectory(org.apache.lucene.store.SimpleFSDirectory@C:\Users\JenkinsSlave\workspace\Lucene-Solr-4.x-Windows\solr\build\solr-core\test\J0\org.apache.solr.cloud.FullSolrCloudDistribCmdsTest-1348610217783\jetty4\index lockFactory=org.apache.lucene.store.NativeFSLockFactory@9bf63a; maxCacheMB=48.0 maxMergeSizeMB=4.0),segFN=segments_1,generation=1,filenames=[segments_1]
[junit4:junit4]   2> 46439 T2539 oasc.SolrDeletionPolicy.updateCommits newest commit = 1
[junit4:junit4]   2> 46439 T2539 oasc.SolrCore.initWriters created xml: solr.XMLResponseWriter
[junit4:junit4]   2> 46439 T2539 oasup.UpdateRequestProcessorChain.init inserting DistributedUpdateProcessorFactory into updateRequestProcessorChain "dedupe"
[junit4:junit4]   2> 46439 T2539 oasup.UpdateRequestProcessorChain.init inserting DistributedUpdateProcessorFactory into updateRequestProcessorChain "dedupe-allfields"
[junit4:junit4]   2> 46439 T2539 oasup.UpdateRequestProcessorChain.init inserting DistributedUpdateProcessorFactory into updateRequestProcessorChain "stored_sig"
[junit4:junit4]   2> 46439 T2539 oasup.UpdateRequestProcessorChain.init inserting DistributedUpdateProcessorFactory into updateRequestProcessorChain "uniq-fields"
[junit4:junit4]   2> 46454 T2539 oasup.UpdateRequestProcessorChain.init inserting DistributedUpdateProcessorFactory into updateRequestProcessorChain "distrib-dup-test-chain-implicit"
[junit4:junit4]   2> 46454 T2539 oasc.RequestHandlers.initHandlersFromConfig adding lazy requestHandler: solr.ReplicationHandler
[junit4:junit4]   2> 46454 T2539 oasc.RequestHandlers.initHandlersFromConfig created /replication: solr.ReplicationHandler
[junit4:junit4]   2> 46454 T2539 oasc.RequestHandlers.initHandlersFromConfig created standard: solr.StandardRequestHandler
[junit4:junit4]   2> 46454 T2539 oasc.RequestHandlers.initHandlersFromConfig created /get: solr.RealTimeGetHandler
[junit4:junit4]   2> 46454 T2539 oasc.RequestHandlers.initHandlersFromConfig created dismax: solr.SearchHandler
[junit4:junit4]   2> 46454 T2539 oasc.RequestHandlers.initHandlersFromConfig created mock: org.apache.solr.core.MockQuerySenderListenerReqHandler
[junit4:junit4]   2> 46454 T2539 oasc.RequestHandlers.initHandlersFromConfig created /admin/: org.apache.solr.handler.admin.AdminHandlers
[junit4:junit4]   2> 46454 T2539 oasc.RequestHandlers.initHandlersFromConfig created defaults: solr.StandardRequestHandler
[junit4:junit4]   2> 46454 T2539 oasc.RequestHandlers.initHandlersFromConfig adding lazy requestHandler: solr.StandardRequestHandler
[junit4:junit4]   2> 46454 T2539 oasc.RequestHandlers.initHandlersFromConfig created lazy: solr.StandardRequestHandler
[junit4:junit4]   2> 46454 T2539 oasc.RequestHandlers.initHandlersFromConfig created /update: solr.UpdateRequestHandler
[junit4:junit4]   2> 46454 T2539 oasc.RequestHandlers.initHandlersFromConfig created /terms: org.apache.solr.handler.component.SearchHandler
[junit4:junit4]   2> 46454 T2539 oasc.RequestHandlers.initHandlersFromConfig created spellCheckCompRH: org.apache.solr.handler.component.SearchHandler
[junit4:junit4]   2> 46454 T2539 oasc.RequestHandlers.initHandlersFromConfig created spellCheckCompRH_Direct: org.apache.solr.handler.component.SearchHandler
[junit4:junit4]   2> 46454 T2539 oasc.RequestHandlers.initHandlersFromConfig created spellCheckWithWordbreak: org.apache.solr.handler.component.SearchHandler
[junit4:junit4]   2> 46454 T2539 oasc.RequestHandlers.initHandlersFromConfig created spellCheckWithWordbreak_Direct: org.apache.solr.handler.component.SearchHandler
[junit4:junit4]   2> 46454 T2539 oasc.RequestHandlers.initHandlersFromConfig created spellCheckCompRH1: org.apache.solr.handler.component.SearchHandler
[junit4:junit4]   2> 46454 T2539 oasc.RequestHandlers.initHandlersFromConfig created tvrh: org.apache.solr.handler.component.SearchHandler
[junit4:junit4]   2> 46454 T2539 oasc.RequestHandlers.initHandlersFromConfig created /mlt: solr.MoreLikeThisHandler
[junit4:junit4]   2> 46454 T2539 oasc.RequestHandlers.initHandlersFromConfig created /debug/dump: solr.DumpRequestHandler
[junit4:junit4]   2> 46454 T2539 oashl.XMLLoader.init xsltCacheLifetimeSeconds=60
[junit4:junit4]   2> 46470 T2539 oasc.SolrCore.initDeprecatedSupport WARNING solrconfig.xml uses deprecated <admin/gettableFiles>, Please update your config to use the ShowFileRequestHandler.
[junit4:junit4]   2> 46470 T2539 oasc.SolrCore.initDeprecatedSupport WARNING adding ShowFileRequestHandler with hidden files: [SCHEMA.XML, OLD_SYNONYMS.TXT, STOPWORDS.TXT, PROTWORDS.TXT, OPEN-EXCHANGE-RATES.JSON, SYNONYMS.TXT, CURRENCY.XML, MAPPING-ISOLATIN1ACCENT.TXT]
[junit4:junit4]   2> 46470 T2539 oass.SolrIndexSearcher.<init> Opening Searcher@97aff5 main
[junit4:junit4]   2> 46486 T2539 oasu.CommitTracker.<init> Hard AutoCommit: disabled
[junit4:junit4]   2> 46486 T2539 oasu.CommitTracker.<init> Soft AutoCommit: disabled
[junit4:junit4]   2> 46486 T2539 oashc.SpellCheckComponent.inform Initializing spell checkers
[junit4:junit4]   2> 46532 T2539 oass.DirectSolrSpellChecker.init init: {name=direct,classname=DirectSolrSpellChecker,field=lowerfilt,minQueryLength=3}
[junit4:junit4]   2> 46767 T2612 oasc.SolrCore.registerSearcher [collection1] Registered new searcher Searcher@97aff5 main{StandardDirectoryReader(segments_1:1)}
[junit4:junit4]   2> 47064 T2560 oascc.ZkStateReader.updateClusterState Updating cloud state from ZooKeeper... 
[junit4:junit4]   2> 47142 T2559 oascc.ZkStateReader$2.process A cluster state change has occurred - updating...
[junit4:junit4]   2> 47142 T2573 oascc.ZkStateReader$2.process A cluster state change has occurred - updating...
[junit4:junit4]   2> 47142 T2585 oascc.ZkStateReader$2.process A cluster state change has occurred - updating...
[junit4:junit4]   2> 47142 T2611 oascc.ZkStateReader$2.process A cluster state change has occurred - updating...
[junit4:junit4]   2> 47142 T2597 oascc.ZkStateReader$2.process A cluster state change has occurred - updating...
[junit4:junit4]   2> 47282 T2539 oasc.CoreContainer.register registering core: collection1
[junit4:junit4]   2> 47282 T2539 oasc.ZkController.register Register shard - core:collection1 address:http://127.0.0.1:51417/solr shardId:shard2
[junit4:junit4]   2>  C183_STATE=coll:collection1 core:collection1 props:{shard=shard1, roles=null, state=recovering, core=collection1, collection=collection1, node_name=127.0.0.1:51411_solr, base_url=http://127.0.0.1:51411/solr}
[junit4:junit4]   2> 47892 T2599 C183 P51411 oasc.RecoveryStrategy.doRecovery Begin buffering updates. core=collection1
[junit4:junit4]   2> 47892 T2599 C183 P51411 oasu.UpdateLog.bufferUpdates Starting to buffer updates. FSUpdateLog{state=ACTIVE, tlog=null}
[junit4:junit4]   2> 47892 T2599 C183 P51411 oasc.RecoveryStrategy.replicate Attempting to replicate from http://127.0.0.1:51400/solr/collection1/. core=collection1
[junit4:junit4]   2> 47892 T2599 C183 P51411 oascsi.HttpClientUtil.createClient Creating new http client, config:maxConnections=128&maxConnectionsPerHost=32&followRedirects=false
[junit4:junit4]   2> 47907 T2567 C184 P51400 oasu.DirectUpdateHandler2.commit start commit{flags=0,_version_=0,optimize=false,openSearcher=true,waitSearcher=true,expungeDeletes=false,softCommit=false}
[junit4:junit4]   2> 47907 T2567 C184 P51400 oasc.SolrDeletionPolicy.onInit SolrDeletionPolicy.onInit: commits:num=1
[junit4:junit4]   2> 		commit{dir=NRTCachingDirectory(org.apache.lucene.store.SimpleFSDirectory@C:\Users\JenkinsSlave\workspace\Lucene-Solr-4.x-Windows\solr\build\solr-core\test\J0\org.apache.solr.cloud.FullSolrCloudDistribCmdsTest-1348610217783\jetty1\index lockFactory=org.apache.lucene.store.NativeFSLockFactory@8efcce; maxCacheMB=48.0 maxMergeSizeMB=4.0),segFN=segments_1,generation=1,filenames=[segments_1]
[junit4:junit4]   2> 47923 T2567 C184 P51400 oasc.SolrDeletionPolicy.updateCommits newest commit = 1
[junit4:junit4]   2> 47923 T2567 C184 P51400 oass.SolrIndexSearcher.<init> Opening Searcher@16782c0 main
[junit4:junit4]   2> 47923 T2567 C184 P51400 oasu.DirectUpdateHandler2.commit end_commit_flush
[junit4:junit4]   2> 47923 T2574 oasc.SolrCore.registerSearcher [collection1] Registered new searcher Searcher@16782c0 main{StandardDirectoryReader(segments_1:1)}
[junit4:junit4]   2> 47923 T2567 C184 P51400 /update {waitSearcher=true&commit=true&commit_end_point=true&wt=javabin&softCommit=false&version=2} {commit=} 0 16
[junit4:junit4]   2> 47923 T2599 C183 P51411 oash.ReplicationHandler.inform Commits will be reserved for  10000
[junit4:junit4]   2> 47923 T2599 C183 P51411 oash.SnapPuller.<init>  No value set for 'pollInterval'. Timer Task not started.
[junit4:junit4]   2> 47923 T2568 C184 P51400 oash.ReplicationHandler.inform Commits will be reserved for  10000
[junit4:junit4]   2> 47923 T2568 C184 P51400 REQ /replication {command=indexversion&wt=javabin&qt=/replication&version=2} status=0 QTime=0 
[junit4:junit4]   2> 47939 T2599 C183 P51411 oasc.SolrDeletionPolicy.onInit SolrDeletionPolicy.onInit: commits:num=1
[junit4:junit4]   2> 		commit{dir=NRTCachingDirectory(org.apache.lucene.store.SimpleFSDirectory@C:\Users\JenkinsSlave\workspace\Lucene-Solr-4.x-Windows\solr\build\solr-core\test\J0\org.apache.solr.cloud.FullSolrCloudDistribCmdsTest-1348610217783\jetty3\index lockFactory=org.apache.lucene.store.NativeFSLockFactory@1cf64ef; maxCacheMB=48.0 maxMergeSizeMB=4.0),segFN=segments_1,generation=1,filenames=[segments_1]
[junit4:junit4]   2> 47939 T2599 C183 P51411 oasc.SolrDeletionPolicy.updateCommits newest commit = 1
[junit4:junit4]   2> 47939 T2599 C183 P51411 oasu.DirectUpdateHandler2.commit start commit{flags=0,_version_=0,optimize=false,openSearcher=true,waitSearcher=true,expungeDeletes=false,softCommit=false}
[junit4:junit4]   2> 47986 T2599 C183 P51411 oasc.SolrDeletionPolicy.onCommit SolrDeletionPolicy.onCommit: commits:num=2
[junit4:junit4]   2> 		commit{dir=NRTCachingDirectory(org.apache.lucene.store.SimpleFSDirectory@C:\Users\JenkinsSlave\workspace\Lucene-Solr-4.x-Windows\solr\build\solr-core\test\J0\org.apache.solr.cloud.FullSolrCloudDistribCmdsTest-1348610217783\jetty3\index lockFactory=org.apache.lucene.store.NativeFSLockFactory@1cf64ef; maxCacheMB=48.0 maxMergeSizeMB=4.0),segFN=segments_1,generation=1,filenames=[segments_1]
[junit4:junit4]   2> 		commit{dir=NRTCachingDirectory(org.apache.lucene.store.SimpleFSDirectory@C:\Users\JenkinsSlave\workspace\Lucene-Solr-4.x-Windows\solr\build\solr-core\test\J0\org.apache.solr.cloud.FullSolrCloudDistribCmdsTest-1348610217783\jetty3\index lockFactory=org.apache.lucene.store.NativeFSLockFactory@1cf64ef; maxCacheMB=48.0 maxMergeSizeMB=4.0),segFN=segments_2,generation=2,filenames=[segments_2]
[junit4:junit4]   2> 47986 T2599 C183 P51411 oasc.SolrDeletionPolicy.updateCommits newest commit = 2
[junit4:junit4]   2> 48001 T2599 C183 P51411 oass.SolrIndexSearcher.<init> Opening Searcher@122c531 main
[junit4:junit4]   2> 48001 T2599 C183 P51411 oasu.DirectUpdateHandler2.commit end_commit_flush
[junit4:junit4]   2> 48001 T2598 oasc.SolrCore.registerSearcher [collection1] Registered new searcher Searcher@122c531 main{StandardDirectoryReader(segments_2:2)}
[junit4:junit4]   2> 48001 T2599 C183 P51411 oasc.RecoveryStrategy.replay No replay needed. core=collection1
[junit4:junit4]   2> 48001 T2599 C183 P51411 oasc.RecoveryStrategy.doRecovery Replication Recovery was successful - registering as Active. core=collection1
[junit4:junit4]   2> 48017 T2599 C183 P51411 oasc.RecoveryStrategy.doRecovery Finished recovery process. core=collection1
[junit4:junit4]   2> 48173 T2560 oascc.ZkStateReader.updateClusterState Updating cloud state from ZooKeeper... 
[junit4:junit4]   2> 48204 T2559 oascc.ZkStateReader$2.process A cluster state change has occurred - updating...
[junit4:junit4]   2> 48204 T2573 oascc.ZkStateReader$2.process A cluster state change has occurred - updating...
[junit4:junit4]   2> 48204 T2597 oascc.ZkStateReader$2.process A cluster state change has occurred - updating...
[junit4:junit4]   2> 48204 T2585 oascc.ZkStateReader$2.process A cluster state change has occurred - updating...
[junit4:junit4]   2> 48204 T2611 oascc.ZkStateReader$2.process A cluster state change has occurred - updating...
[junit4:junit4]   2> 77298 T2539 oasc.ZkController.getLeader SEVERE Error getting leader from zk org.apache.solr.common.SolrException: No registered leader was found, collection:collection1 slice:shard2
[junit4:junit4]   2> 	at org.apache.solr.common.cloud.ZkStateReader.getLeaderProps(ZkStateReader.java:413)
[junit4:junit4]   2> 	at org.apache.solr.common.cloud.ZkStateReader.getLeaderUrl(ZkStateReader.java:390)
[junit4:junit4]   2> 	at org.apache.solr.cloud.ZkController.getLeader(ZkController.java:642)
[junit4:junit4]   2> 	at org.apache.solr.cloud.ZkController.register(ZkController.java:577)
[junit4:junit4]   2> 	at org.apache.solr.cloud.ZkController.register(ZkController.java:532)
[junit4:junit4]   2> 	at org.apache.solr.core.CoreContainer.registerInZk(CoreContainer.java:709)
[junit4:junit4]   2> 	at org.apache.solr.core.CoreContainer.register(CoreContainer.java:693)
[junit4:junit4]   2> 	at org.apache.solr.core.CoreContainer.load(CoreContainer.java:535)
[junit4:junit4]   2> 	at org.apache.solr.core.CoreContainer.load(CoreContainer.java:356)
[junit4:junit4]   2> 	at org.apache.solr.core.CoreContainer$Initializer.initialize(CoreContainer.java:308)
[junit4:junit4]   2> 	at org.apache.solr.servlet.SolrDispatchFilter.init(SolrDispatchFilter.java:107)
[junit4:junit4]   2> 	at org.eclipse.jetty.servlet.FilterHolder.doStart(FilterHolder.java:114)
[junit4:junit4]   2> 	at org.eclipse.jetty.util.component.AbstractLifeCycle.start(AbstractLifeCycle.java:59)
[junit4:junit4]   2> 	at org.eclipse.jetty.servlet.ServletHandler.initialize(ServletHandler.java:754)
[junit4:junit4]   2> 	at org.eclipse.jetty.servlet.ServletHandler.updateMappings(ServletHandler.java:1227)
[junit4:junit4]   2> 	at org.eclipse.jetty.servlet.ServletHandler.setFilterMappings(ServletHandler.java:1263)
[junit4:junit4]   2> 	at org.eclipse.jetty.servlet.ServletHandler.addFilterWithMapping(ServletHandler.java:965)
[junit4:junit4]   2> 	at org.eclipse.jetty.servlet.ServletHandler.addFilterWithMapping(ServletHandler.java:923)
[junit4:junit4]   2> 	at org.eclipse.jetty.servlet.ServletContextHandler.addFilter(ServletContextHandler.java:333)
[junit4:junit4]   2> 	at org.apache.solr.client.solrj.embedded.JettySolrRunner$1.lifeCycleStarted(JettySolrRunner.java:158)
[junit4:junit4]   2> 	at org.eclipse.jetty.util.component.AbstractLifeCycle.setStarted(AbstractLifeCycle.java:169)
[junit4:junit4]   2> 	at org.eclipse.jetty.util.component.AbstractLifeCycle.start(AbstractLifeCycle.java:60)
[junit4:junit4]   2> 	at org.apache.solr.client.solrj.embedded.JettySolrRunner.start(JettySolrRunner.java:210)
[junit4:junit4]   2> 	at org.apache.solr.client.solrj.embedded.JettySolrRunner.start(JettySolrRunner.java:190)
[junit4:junit4]   2> 	at org.apache.solr.BaseDistributedSearchTestCase.createJetty(BaseDistributedSearchTestCase.java:262)
[junit4:junit4]   2> 	at org.apache.solr.cloud.AbstractFullDistribZkTestBase.createJettys(AbstractFullDistribZkTestBase.java:294)
[junit4:junit4]   2> 	at org.apache.solr.cloud.AbstractFullDistribZkTestBase.createServers(AbstractFullDistribZkTestBase.java:268)
[junit4:junit4]   2> 	at org.apache.solr.BaseDistributedSearchTestCase.testDistribSearch(BaseDistributedSearchTestCase.java:693)
[junit4:junit4]   2> 	at sun.reflect.NativeMethodAccessorImpl.invoke0(Native Method)
[junit4:junit4]   2> 	at sun.reflect.NativeMethodAccessorImpl.invoke(NativeMethodAccessorImpl.java:57)
[junit4:junit4]   2> 	at sun.reflect.DelegatingMethodAccessorImpl.invoke(DelegatingMethodAccessorImpl.java:43)
[junit4:junit4]   2> 	at java.lang.reflect.Method.invoke(Method.java:601)
[junit4:junit4]   2> 	at com.carrotsearch.randomizedtesting.RandomizedRunner.invoke(RandomizedRunner.java:1559)
[junit4:junit4]   2> 	at com.carrotsearch.randomizedtesting.RandomizedRunner.access$600(RandomizedRunner.java:79)
[junit4:junit4]   2> 	at com.carrotsearch.randomizedtesting.RandomizedRunner$6.evaluate(RandomizedRunner.java:737)
[junit4:junit4]   2> 	at com.carrotsearch.randomizedtesting.RandomizedRunner$7.evaluate(RandomizedRunner.java:773)
[junit4:junit4]   2> 	at com.carrotsearch.randomizedtesting.RandomizedRunner$8.evaluate(RandomizedRunner.java:787)
[junit4:junit4]   2> 	at com.carrotsearch.randomizedtesting.rules.SystemPropertiesRestoreRule$1.evaluate(SystemPropertiesRestoreRule.java:53)
[junit4:junit4]   2> 	at org.apache.lucene.util.TestRuleSetupTeardownChained$1.evaluate(TestRuleSetupTeardownChained.java:50)
[junit4:junit4]   2> 	at org.apache.lucene.util.TestRuleFieldCacheSanity$1.evaluate(TestRuleFieldCacheSanity.java:51)
[junit4:junit4]   2> 	at org.apache.lucene.util.AbstractBeforeAfterRule$1.evaluate(AbstractBeforeAfterRule.java:45)
[junit4:junit4]   2> 	at com.carrotsearch.randomizedtesting.rules.SystemPropertiesInvariantRule$1.evaluate(SystemPropertiesInvariantRule.java:55)
[junit4:junit4]   2> 	at org.apache.lucene.util.TestRuleThreadAndTestName$1.evaluate(TestRuleThreadAndTestName.java:48)
[junit4:junit4]   2> 	at org.apache.lucene.util.TestRuleIgnoreAfterMaxFailures$1.evaluate(TestRuleIgnoreAfterMaxFailures.java:70)
[junit4:junit4]   2> 	at org.apache.lucene.util.TestRuleMarkFailure$1.evaluate(TestRuleMarkFailure.java:48)
[junit4:junit4]   2> 	at com.carrotsearch.randomizedtesting.rules.StatementAdapter.evaluate(StatementAdapter.java:36)
[junit4:junit4]   2> 	at com.carrotsearch.randomizedtesting.ThreadLeakControl$StatementRunner.run(ThreadLeakControl.java:358)
[junit4:junit4]   2> 	at com.carrotsearch.randomizedtesting.ThreadLeakControl.forkTimeoutingTask(ThreadLeakControl.java:782)
[junit4:junit4]   2> 	at com.carrotsearch.randomizedtesting.ThreadLeakControl$3.evaluate(ThreadLeakControl.java:442)
[junit4:junit4]   2> 	at com.carrotsearch.randomizedtesting.RandomizedRunner.runSingleTest(RandomizedRunner.java:746)
[junit4:junit4]   2> 	at com.carrotsearch.randomizedtesting.RandomizedRunner$3.evaluate(RandomizedRunner.java:648)
[junit4:junit4]   2> 	at com.carrotsearch.randomizedtesting.RandomizedRunner$4.evaluate(RandomizedRunner.java:682)
[junit4:junit4]   2> 	at com.carrotsearch.randomizedtesting.RandomizedRunner$5.evaluate(RandomizedRunner.java:693)
[junit4:junit4]   2> 	at com.carrotsearch.randomizedtesting.rules.StatementAdapter.evaluate(StatementAdapter.java:36)
[junit4:junit4]   2> 	at com.carrotsearch.randomizedtesting.rules.SystemPropertiesRestoreRule$1.evaluate(SystemPropertiesRestoreRule.java:53)
[junit4:junit4]   2> 	at org.apache.lucene.util.AbstractBeforeAfterRule$1.evaluate(AbstractBeforeAfterRule.java:45)
[junit4:junit4]   2> 	at org.apache.lucene.util.TestRuleStoreClassName$1.evaluate(TestRuleStoreClassName.java:42)
[junit4:junit4]   2> 	at com.carrotsearch.randomizedtesting.rules.SystemPropertiesInvariantRule$1.evaluate(SystemPropertiesInvariantRule.java:55)
[junit4:junit4]   2> 	at com.carrotsearch.randomizedtesting.rules.NoShadowingOrOverridesOnMethodsRule$1.evaluate(NoShadowingOrOverridesOnMethodsRule.java:39)
[junit4:junit4]   2> 	at com.carrotsearch.randomizedtesting.rules.NoShadowingOrOverridesOnMethodsRule$1.evaluate(NoShadowingOrOverridesOnMethodsRule.java:39)
[junit4:junit4]   2> 	at com.carrotsearch.randomizedtesting.rules.StatementAdapter.evaluate(StatementAdapter.java:36)
[junit4:junit4]   2> 	at org.apache.lucene.util.TestRuleAssertionsRequired$1.evaluate(TestRuleAssertionsRequired.java:43)
[junit4:junit4]   2> 	at org.apache.lucene.util.TestRuleMarkFailure$1.evaluate(TestRuleMarkFailure.java:48)
[junit4:junit4]   2> 	at org.apache.lucene.util.TestRuleIgnoreAfterMaxFailures$1.evaluate(TestRuleIgnoreAfterMaxFailures.java:70)
[junit4:junit4]   2> 	at org.apache.lucene.util.TestRuleIgnoreTestSuites$1.evaluate(TestRuleIgnoreTestSuites.java:55)
[junit4:junit4]   2> 	at com.carrotsearch.randomizedtesting.rules.StatementAdapter.evaluate(StatementAdapter.java:36)
[junit4:junit4]   2> 	at com.carrotsearch.randomizedtesting.ThreadLeakControl$StatementRunner.run(ThreadLeakControl.java:358)
[junit4:junit4]   2> 	at java.lang.Thread.run(Thread.java:722)
[junit4:junit4]   2> 
[junit4:junit4]   2> 77314 T2539 oasc.SolrException.log SEVERE :org.apache.solr.common.SolrException: Error getting leader from zk
[junit4:junit4]   2> 		at org.apache.solr.cloud.ZkController.getLeader(ZkController.java:662)
[junit4:junit4]   2> 		at org.apache.solr.cloud.ZkController.register(ZkController.java:577)
[junit4:junit4]   2> 		at org.apache.solr.cloud.ZkController.register(ZkController.java:532)
[junit4:junit4]   2> 		at org.apache.solr.core.CoreContainer.registerInZk(CoreContainer.java:709)
[junit4:junit4]   2> 		at org.apache.solr.core.CoreContainer.register(CoreContainer.java:693)
[junit4:junit4]   2> 		at org.apache.solr.core.CoreContainer.load(CoreContainer.java:535)
[junit4:junit4]   2> 		at org.apache.solr.core.CoreContainer.load(CoreContainer.java:356)
[junit4:junit4]   2> 		at org.apache.solr.core.CoreContainer$Initializer.initialize(CoreContainer.java:308)
[junit4:junit4]   2> 		at org.apache.solr.servlet.SolrDispatchFilter.init(SolrDispatchFilter.java:107)
[junit4:junit4]   2> 		at org.eclipse.jetty.servlet.FilterHolder.doStart(FilterHolder.java:114)
[junit4:junit4]   2> 		at org.eclipse.jetty.util.component.AbstractLifeCycle.start(AbstractLifeCycle.java:59)
[junit4:junit4]   2> 		at org.eclipse.jetty.servlet.ServletHandler.initialize(ServletHandler.java:754)
[junit4:junit4]   2> 		at org.eclipse.jetty.servlet.ServletHandler.updateMappings(ServletHandler.java:1227)
[junit4:junit4]   2> 		at org.eclipse.jetty.servlet.ServletHandler.setFilterMappings(ServletHandler.java:1263)
[junit4:junit4]   2> 		at org.eclipse.jetty.servlet.ServletHandler.addFilterWithMapping(ServletHandler.java:965)
[junit4:junit4]   2> 		at org.eclipse.jetty.servlet.ServletHandler.addFilterWithMapping(ServletHandler.java:923)
[junit4:junit4]   2> 		at org.eclipse.jetty.servlet.ServletContextHandler.addFilter(ServletContextHandler.java:333)
[junit4:junit4]   2> 		at org.apache.solr.client.solrj.embedded.JettySolrRunner$1.lifeCycleStarted(JettySolrRunner.java:158)
[junit4:junit4]   2> 		at org.eclipse.jetty.util.component.AbstractLifeCycle.setStarted(AbstractLifeCycle.java:169)
[junit4:junit4]   2> 		at org.eclipse.jetty.util.component.AbstractLifeCycle.start(AbstractLifeCycle.java:60)
[junit4:junit4]   2> 		at org.apache.solr.client.solrj.embedded.JettySolrRunner.start(JettySolrRunner.java:210)
[junit4:junit4]   2> 		at org.apache.solr.client.solrj.embedded.JettySolrRunner.start(JettySolrRunner.java:190)
[junit4:junit4]   2> 		at org.apache.solr.BaseDistributedSearchTestCase.createJetty(BaseDistributedSearchTestCase.java:262)
[junit4:junit4]   2> 		at org.apache.solr.cloud.AbstractFullDistribZkTestBase.createJettys(AbstractFullDistribZkTestBase.java:294)
[junit4:junit4]   2> 		at org.apache.solr.cloud.AbstractFullDistribZkTestBase.createServers(AbstractFullDistribZkTestBase.java:268)
[junit4:junit4]   2> 		at org.apache.solr.BaseDistributedSearchTestCase.testDistribSearch(BaseDistributedSearchTestCase.java:693)
[junit4:junit4]   2> 		at sun.reflect.NativeMethodAccessorImpl.invoke0(Native Method)
[junit4:junit4]   2> 		at sun.reflect.NativeMethodAccessorImpl.invoke(NativeMethodAccessorImpl.java:57)
[junit4:junit4]   2> 		at sun.reflect.DelegatingMethodAccessorImpl.invoke(DelegatingMethodAccessorImpl.java:43)
[junit4:junit4]   2> 		at java.lang.reflect.Method.invoke(Method.java:601)
[junit4:junit4]   2> 		at com.carrotsearch.randomizedtesting.RandomizedRunner.invoke(RandomizedRunner.java:1559)
[junit4:junit4]   2> 		at com.carrotsearch.randomizedtesting.RandomizedRunner.access$600(RandomizedRunner.java:79)
[junit4:junit4]   2> 		at com.carrotsearch.randomizedtesting.RandomizedRunner$6.evaluate(RandomizedRunner.java:737)
[junit4:junit4]   2> 		at com.carrotsearch.randomizedtesting.RandomizedRunner$7.evaluate(RandomizedRunner.java:773)
[junit4:junit4]   2> 		at com.carrotsearch.randomizedtesting.RandomizedRunner$8.evaluate(RandomizedRunner.java:787)
[junit4:junit4]   2> 		at com.carrotsearch.randomizedtesting.rules.SystemPropertiesRestoreRule$1.evaluate(SystemPropertiesRestoreRule.java:53)
[junit4:junit4]   2> 		at org.apache.lucene.util.TestRuleSetupTeardownChained$1.evaluate(TestRuleSetupTeardownChained.java:50)
[junit4:junit4]   2> 		at org.apache.lucene.util.TestRuleFieldCacheSanity$1.evaluate(TestRuleFieldCacheSanity.java:51)
[junit4:junit4]   2> 		at org.apache.lucene.util.AbstractBeforeAfterRule$1.evaluate(AbstractBeforeAfterRule.java:45)
[junit4:junit4]   2> 		at com.carrotsearch.randomizedtesting.rules.SystemPropertiesInvariantRule$1.evaluate(SystemPropertiesInvariantRule.java:55)
[junit4:junit4]   2> 		at org.apache.lucene.util.TestRuleThreadAndTestName$1.evaluate(TestRuleThreadAndTestName.java:48)
[junit4:junit4]   2> 		at org.apache.lucene.util.TestRuleIgnoreAfterMaxFailures$1.evaluate(TestRuleIgnoreAfterMaxFailures.java:70)
[junit4:junit4]   2> 		at org.apache.lucene.util.TestRuleMarkFailure$1.evaluate(TestRuleMarkFailure.java:48)
[junit4:junit4]   2> 		at com.carrotsearch.randomizedtesting.rules.StatementAdapter.evaluate(StatementAdapter.java:36)
[junit4:junit4]   2> 		at com.carrotsearch.randomizedtesting.ThreadLeakControl$StatementRunner.run(ThreadLeakControl.java:358)
[junit4:junit4]   2> 		at com.carrotsearch.randomizedtesting.ThreadLeakControl.forkTimeoutingTask(ThreadLeakControl.java:782)
[junit4:junit4]   2> 		at com.carrotsearch.randomizedtesting.ThreadLeakControl$3.evaluate(ThreadLeakControl.java:442)
[junit4:junit4]   2> 		at com.carrotsearch.randomizedtesting.RandomizedRunner.runSingleTest(RandomizedRunner.java:746)
[junit4:junit4]   2> 		at com.carrotsearch.randomizedtesting.RandomizedRunner$3.evaluate(RandomizedRunner.java:648)
[junit4:junit4]   2> 		at com.carrotsearch.randomizedtesting.RandomizedRunner$4.evaluate(RandomizedRunner.java:682)
[junit4:junit4]   2> 		at com.carrotsearch.randomizedtesting.RandomizedRunner$5.evaluate(RandomizedRunner.java:693)
[junit4:junit4]   2> 		at com.carrotsearch.randomizedtesting.rules.StatementAdapter.evaluate(StatementAdapter.java:36)
[junit4:junit4]   2> 		at com.carrotsearch.randomizedtesting.rules.SystemPropertiesRestoreRule$1.evaluate(SystemPropertiesRestoreRule.java:53)
[junit4:junit4]   2> 		at org.apache.lucene.util.AbstractBeforeAfterRule$1.evaluate(AbstractBeforeAfterRule.java:45)
[junit4:junit4]   2> 		at org.apache.lucene.util.TestRuleStoreClassName$1.evaluate(TestRuleStoreClassName.java:42)
[junit4:junit4]   2> 		at com.carrotsearch.randomizedtesting.rules.SystemPropertiesInvariantRule$1.evaluate(SystemPropertiesInvariantRule.java:55)
[junit4:junit4]   2> 		at com.carrotsearch.randomizedtesting.rules.NoShadowingOrOverridesOnMethodsRule$1.evaluate(NoShadowingOrOverridesOnMethodsRule.java:39)
[junit4:junit4]   2> 		at com.carrotsearch.randomizedtesting.rules.NoShadowingOrOverridesOnMethodsRule$1.evaluate(NoShadowingOrOverridesOnMethodsRule.java:39)
[junit4:junit4]   2> 		at com.carrotsearch.randomizedtesting.rules.StatementAdapter.evaluate(StatementAdapter.java:36)
[junit4:junit4]   2> 		at org.apache.lucene.util.TestRuleAssertionsRequired$1.evaluate(TestRuleAssertionsRequired.java:43)
[junit4:junit4]   2> 		at org.apache.lucene.util.TestRuleMarkFailure$1.evaluate(TestRuleMarkFailure.java:48)
[junit4:junit4]   2> 		at org.apache.lucene.util.TestRuleIgnoreAfterMaxFailures$1.evaluate(TestRuleIgnoreAfterMaxFailures.java:70)
[junit4:junit4]   2> 		at org.apache.lucene.util.TestRuleIgnoreTestSuites$1.evaluate(TestRuleIgnoreTestSuites.java:55)
[junit4:junit4]   2> 		at com.carrotsearch.randomizedtesting.rules.StatementAdapter.evaluate(StatementAdapter.java:36)
[junit4:junit4]   2> 		at com.carrotsearch.randomizedtesting.ThreadLeakControl$StatementRunner.run(ThreadLeakControl.java:358)
[junit4:junit4]   2> 		at java.lang.Thread.run(Thread.java:722)
[junit4:junit4]   2> 	Caused by: org.apache.solr.common.SolrException: No registered leader was found, collection:collection1 slice:shard2
[junit4:junit4]   2> 		at org.apache.solr.common.cloud.ZkStateReader.getLeaderProps(ZkStateReader.java:413)
[junit4:junit4]   2> 		at org.apache.solr.common.cloud.ZkStateReader.getLeaderUrl(ZkStateReader.java:390)
[junit4:junit4]   2> 		at org.apache.solr.cloud.ZkController.getLeader(ZkController.java:642)
[junit4:junit4]   2> 		... 65 more
[junit4:junit4]   2> 	
[junit4:junit4]   2> 77314 T2539 oasc.SolrException.log SEVERE null:org.apache.solr.common.cloud.ZooKeeperException: 
[junit4:junit4]   2> 		at org.apache.solr.core.CoreContainer.registerInZk(CoreContainer.java:732)
[junit4:junit4]   2> 		at org.apache.solr.core.CoreContainer.register(CoreContainer.java:693)
[junit4:junit4]   2> 		at org.apache.solr.core.CoreContainer.load(CoreContainer.java:535)
[junit4:junit4]   2> 		at org.apache.solr.core.CoreContainer.load(CoreContainer.java:356)
[junit4:junit4]   2> 		at org.apache.solr.core.CoreContainer$Initializer.initialize(CoreContainer.java:308)
[junit4:junit4]   2> 		at org.apache.solr.servlet.SolrDispatchFilter.init(SolrDispatchFilter.java:107)
[junit4:junit4]   2> 		at org.eclipse.jetty.servlet.FilterHolder.doStart(FilterHolder.java:114)
[junit4:junit4]   2> 		at org.eclipse.jetty.util.component.AbstractLifeCycle.start(AbstractLifeCycle.java:59)
[junit4:junit4]   2> 		at org.eclipse.jetty.servlet.ServletHandler.initialize(ServletHandler.java:754)
[junit4:junit4]   2> 		at org.eclipse.jetty.servlet.ServletHandler.updateMappings(ServletHandler.java:1227)
[junit4:junit4]   2> 		at org.eclipse.jetty.servlet.ServletHandler.setFilterMappings(ServletHandler.java:1263)
[junit4:junit4]   2> 		at org.eclipse.jetty.servlet.ServletHandler.addFilterWithMapping(ServletHandler.java:965)
[junit4:junit4]   2> 		at org.eclipse.jetty.servlet.ServletHandler.addFilterWithMapping(ServletHandler.java:923)
[junit4:junit4]   2> 		at org.eclipse.jetty.servlet.ServletContextHandler.addFilter(ServletContextHandler.java:333)
[junit4:junit4]   2> 		at org.apache.solr.client.solrj.embedded.JettySolrRunner$1.lifeCycleStarted(JettySolrRunner.java:158)
[junit4:junit4]   2> 		at org.eclipse.jetty.util.component.AbstractLifeCycle.setStarted(AbstractLifeCycle.java:169)
[junit4:junit4]   2> 		at org.eclipse.jetty.util.component.AbstractLifeCycle.start(AbstractLifeCycle.java:60)
[junit4:junit4]   2> 		at org.apache.solr.client.solrj.embedded.JettySolrRunner.start(JettySolrRunner.java:210)
[junit4:junit4]   2> 		at org.apache.solr.client.solrj.embedded.JettySolrRunner.start(JettySolrRunner.java:190)
[junit4:junit4]   2> 		at org.apache.solr.BaseDistributedSearchTestCase.createJetty(BaseDistributedSearchTestCase.java:262)
[junit4:junit4]   2> 		at org.apache.solr.cloud.AbstractFullDistribZkTestBase.createJettys(AbstractFullDistribZkTestBase.java:294)
[junit4:junit4]   2> 		at org.apache.solr.cloud.AbstractFullDistribZkTestBase.createServers(AbstractFullDistribZkTestBase.java:268)
[junit4:junit4]   2> 		at org.apache.solr.BaseDistributedSearchTestCase.testDistribSearch(BaseDistributedSearchTestCase.java:693)
[junit4:junit4]   2> 		at sun.reflect.NativeMethodAccessorImpl.invoke0(Native Method)
[junit4:junit4]   2> 		at sun.reflect.NativeMethodAccessorImpl.invoke(NativeMethodAccessorImpl.java:57)
[junit4:junit4]   2> 		at sun.reflect.DelegatingMethodAccessorImpl.invoke(DelegatingMethodAccessorImpl.java:43)
[junit4:junit4]   2> 		at java.lang.reflect.Method.invoke(Method.java:601)
[junit4:junit4]   2> 		at com.carrotsearch.randomizedtesting.RandomizedRunner.invoke(RandomizedRunner.java:1559)
[junit4:junit4]   2> 		at com.carrotsearch.randomizedtesting.RandomizedRunner.access$600(RandomizedRunner.java:79)
[junit4:junit4]   2> 		at com.carrotsearch.randomizedtesting.RandomizedRunner$6.evaluate(RandomizedRunner.java:737)
[junit4:junit4]   2> 		at com.carrotsearch.randomizedtesting.RandomizedRunner$7.evaluate(RandomizedRunner.java:773)
[junit4:junit4]   2> 		at com.carrotsearch.randomizedtesting.RandomizedRunner$8.evaluate(RandomizedRunner.java:787)
[junit4:junit4]   2> 		at com.carrotsearch.randomizedtesting.rules.SystemPropertiesRestoreRule$1.evaluate(SystemPropertiesRestoreRule.java:53)
[junit4:junit4]   2> 		at org.apache.lucene.util.TestRuleSetupTeardownChained$1.evaluate(TestRuleSetupTeardownChained.java:50)
[junit4:junit4]   2> 		at org.apache.lucene.util.TestRuleFieldCacheSanity$1.evaluate(TestRuleFieldCacheSanity.java:51)
[junit4:junit4]   2> 		at org.apache.lucene.util.AbstractBeforeAfterRule$1.evaluate(AbstractBeforeAfterRule.java:45)
[junit4:junit4]   2> 		at com.carrotsearch.randomizedtesting.rules.SystemPropertiesInvariantRule$1.evaluate(SystemPropertiesInvariantRule.java:55)
[junit4:junit4]   2> 		at org.apache.lucene.util.TestRuleThreadAndTestName$1.evaluate(TestRuleThreadAndTestName.java:48)
[junit4:junit4]   2> 		at org.apache.lucene.util.TestRuleIgnoreAfterMaxFailures$1.evaluate(TestRuleIgnoreAfterMaxFailures.java:70)
[junit4:junit4]   2> 		at org.apache.lucene.util.TestRuleMarkFailure$1.evaluate(TestRuleMarkFailure.java:48)
[junit4:junit4]   2> 		at com.carrotsearch.randomizedtesting.rules.StatementAdapter.evaluate(StatementAdapter.java:36)
[junit4:junit4]   2> 		at com.carrotsearch.randomizedtesting.ThreadLeakControl$StatementRunner.run(ThreadLeakControl.java:358)
[junit4:junit4]   2> 		at com.carrotsearch.randomizedtesting.ThreadLeakControl.forkTimeoutingTask(ThreadLeakControl.java:782)
[junit4:junit4]   2> 		at com.carrotsearch.randomizedtesting.ThreadLeakControl$3.evaluate(ThreadLeakControl.java:442)
[junit4:junit4]   2> 		at com.carrotsearch.randomizedtesting.RandomizedRunner.runSingleTest(RandomizedRunner.java:746)
[junit4:junit4]   2> 		at com.carrotsearch.randomizedtesting.RandomizedRunner$3.evaluate(RandomizedRunner.java:648)
[junit4:junit4]   2> 		at com.carrotsearch.randomizedtesting.RandomizedRunner$4.evaluate(RandomizedRunner.java:682)
[junit4:junit4]   2> 		at com.carrotsearch.randomizedtesting.RandomizedRunner$5.evaluate(RandomizedRunner.java:693)
[junit4:junit4]   2> 		at com.carrotsearch.randomizedtesting.rules.StatementAdapter.evaluate(StatementAdapter.java:36)
[junit4:junit4]   2> 		at com.carrotsearch.randomizedtesting.rules.SystemPropertiesRestoreRule$1.evaluate(SystemPropertiesRestoreRule.java:53)
[junit4:junit4]   2> 		at org.apache.lucene.util.AbstractBeforeAfterRule$1.evaluate(AbstractBeforeAfterRule.java:45)
[junit4:junit4]   2> 		at org.apache.lucene.util.TestRuleStoreClassName$1.evaluate(TestRuleStoreClassName.java:42)
[junit4:junit4]   2> 		at com.carrotsearch.randomizedtesting.rules.SystemPropertiesInvariantRule$1.evaluate(SystemPropertiesInvariantRule.java:55)
[junit4:junit4]   2> 		at com.carrotsearch.randomizedtesting.rules.NoShadowingOrOverridesOnMethodsRule$1.evaluate(NoShadowingOrOverridesOnMethodsRule.java:39)
[junit4:junit4]   2> 		at com.carrotsearch.randomizedtesting.rules.NoShadowingOrOverridesOnMethodsRule$1.evaluate(NoShadowingOrOverridesOnMethodsRule.java:39)
[junit4:junit4]   2> 		at com.carrotsearch.randomizedtesting.rules.StatementAdapter.evaluate(StatementAdapter.java:36)
[junit4:junit4]   2> 		at org.apache.lucene.util.TestRuleAssertionsRequired$1.evaluate(TestRuleAssertionsRequired.java:43)
[junit4:junit4]   2> 		at org.apache.lucene.util.TestRuleMarkFailure$1.evaluate(TestRuleMarkFailure.java:48)
[junit4:junit4]   2> 		at org.apache.lucene.util.TestRuleIgnoreAfterMaxFailures$1.evaluate(TestRuleIgnoreAfterMaxFailures.java:70)
[junit4:junit4]   2> 		at org.apache.lucene.util.TestRuleIgnoreTestSuites$1.evaluate(TestRuleIgnoreTestSuites.java:55)
[junit4:junit4]   2> 		at com.carrotsearch.randomizedtesting.rules.StatementAdapter.evaluate(StatementAdapter.java:36)
[junit4:junit4]   2> 		at com.carrotsearch.randomizedtesting.ThreadLeakControl$StatementRunner.run(ThreadLeakControl.java:358)
[junit4:junit4]   2> 		at java.lang.Thread.run(Thread.java:722)
[junit4:junit4]   2> 	Caused by: org.apache.solr.common.SolrException: Error getting leader from zk
[junit4:junit4]   2> 		at org.apache.solr.cloud.ZkController.getLeader(ZkController.java:662)
[junit4:junit4]   2> 		at org.apache.solr.cloud.ZkController.register(ZkController.java:577)
[junit4:junit4]   2> 		at org.apache.solr.cloud.ZkController.register(ZkController.java:532)
[junit4:junit4]   2> 		at org.apache.solr.core.CoreContainer.registerInZk(CoreContainer.java:709)
[junit4:junit4]   2> 		... 62 more
[junit4:junit4]   2> 	Caused by: org.apache.solr.common.SolrException: No registered leader was found, collection:collection1 slice:shard2
[junit4:junit4]   2> 		at org.apache.solr.common.cloud.ZkStateReader.getLeaderProps(ZkStateReader.java:413)
[junit4:junit4]   2> 		at org.apache.solr.common.cloud.ZkStateReader.getLeaderUrl(ZkStateReader.java:390)
[junit4:junit4]   2> 		at org.apache.solr.cloud.ZkController.getLeader(ZkController.java:642)
[junit4:junit4]   2> 		... 65 more
[junit4:junit4]   2> 	
[junit4:junit4]   2> 77314 T2539 oass.SolrDispatchFilter.init user.dir=C:\Users\JenkinsSlave\workspace\Lucene-Solr-4.x-Windows\solr\build\solr-core\test\J0
[junit4:junit4]   2> 77314 T2539 oass.SolrDispatchFilter.init SolrDispatchFilter.init() done
[junit4:junit4]   2> 77314 T2539 oascsi.HttpClientUtil.createClient Creating new http client, config:maxConnections=128&maxConnectionsPerHost=32&followRedirects=false
[junit4:junit4]   2> 77314 T2539 oaz.ZooKeeper.<init> Initiating client connection, connectString=127.0.0.1:51389/solr sessionTimeout=10000 watcher=org.apache.solr.common.cloud.ConnectionManager@14ac29a
[junit4:junit4]   2> 77329 T2613 oaz.ClientCnxn$SendThread.startConnect Opening socket connection to server /127.0.0.1:51389
[junit4:junit4]   2> 77329 T2539 oascc.ConnectionManager.waitForConnected Waiting for client to connect to ZooKeeper
[junit4:junit4]   2> 77329 T2613 oaz.ClientCnxn$SendThread.primeConnection Socket connection established to 127.0.0.1/127.0.0.1:51389, initiating session
[junit4:junit4]   2> 77329 T2541 oazs.NIOServerCnxn$Factory.run Accepted socket connection from /127.0.0.1:51425
[junit4:junit4]   2> 77329 T2541 oazs.NIOServerCnxn.readConnectRequest Client attempting to establish new session at /127.0.0.1:51425
[junit4:junit4]   2> 77329 T2543 oazs.NIOServerCnxn.finishSessionInit Established session 0x139ff6ed7370007 with negotiated timeout 10000 for client /127.0.0.1:51425
[junit4:junit4]   2> 77329 T2613 oaz.ClientCnxn$SendThread.readConnectResult Session establishment complete on server 127.0.0.1/127.0.0.1:51389, sessionid = 0x139ff6ed7370007, negotiated timeout = 10000
[junit4:junit4]   2> 77329 T2614 oascc.ConnectionManager.process Watcher org.apache.solr.common.cloud.ConnectionManager@14ac29a name:ZooKeeperConnection Watcher:127.0.0.1:51389/solr got event WatchedEvent state:SyncConnected type:None path:null path:null type:None
[junit4:junit4]   2> 77329 T2539 oascc.ConnectionManager.waitForConnected Client is connected to ZooKeeper
[junit4:junit4]   2> 77329 T2539 oascc.ZkStateReader.createClusterStateWatchersAndUpdate Updating cluster state from ZooKeeper... 
[junit4:junit4]   2> 77329 T2539 oasc.ChaosMonkey.monkeyLog monkey: init - expire sessions:true cause connection loss:true
[junit4:junit4]   2> 77329 T2539 oascsi.HttpClientUtil.createClient Creating new http client, config:
[junit4:junit4]   2> 77736 T2560 oascc.ZkStateReader.updateClusterState Updating cloud state from ZooKeeper... 
[junit4:junit4]   2> 77736 T2559 oascc.ZkStateReader$2.process A cluster state change has occurred - updating...
[junit4:junit4]   2> 77736 T2614 oascc.ZkStateReader$2.process A cluster state change has occurred - updating...
[junit4:junit4]   2> 77736 T2573 oascc.ZkStateReader$2.process A cluster state change has occurred - updating...
[junit4:junit4]   2> 77736 T2611 oascc.ZkStateReader$2.process A cluster state change has occurred - updating...
[junit4:junit4]   2> 77736 T2597 oascc.ZkStateReader$2.process A cluster state change has occurred - updating...
[junit4:junit4]   2> 77736 T2585 oascc.ZkStateReader$2.process A cluster state change has occurred - updating...
[junit4:junit4]   2> 87329 T2544 oazs.PrepRequestProcessor.pRequest Processed session termination for sessionid: 0x139ff6ed7370007
[junit4:junit4]   2> 87329 T2541 oazs.NIOServerCnxn.closeSock Closed socket connection for client /127.0.0.1:51425 which had sessionid 0x139ff6ed7370007
[junit4:junit4]   2> 87329 T2614 oaz.ClientCnxn$EventThread.run EventThread shut down
[junit4:junit4]   2> 87329 T2539 oaz.ZooKeeper.close Session: 0x139ff6ed7370007 closed
[junit4:junit4]   2> 87329 T2543 oazs.SyncRequestProcessor.run SyncRequestProcessor exited!
[junit4:junit4]   2> 87329 T2544 oazs.PrepRequestProcessor.run PrepRequestProcessor exited loop!
[junit4:junit4]   2> 87329 T2539 oazs.FinalRequestProcessor.shutdown shutdown of request processor complete
[junit4:junit4]   2> 88236 T2542 oazs.SessionTrackerImpl.run SessionTrackerImpl exited loop!
[junit4:junit4]   2> 89439 T2596 oaz.ClientCnxn$SendThread.run Client session timed out, have not heard from server in 3344ms for sessionid 0x139ff6ed7370005, closing socket connection and attempting reconnect
[junit4:junit4]   2> 89439 T2584 oaz.ClientCnxn$SendThread.run Client session timed out, have not heard from server in 3344ms for sessionid 0x139ff6ed7370004, closing socket connection and attempting reconnect
[junit4:junit4]   2> 89439 T2610 oaz.ClientCnxn$SendThread.run Client session timed out, have not heard from server in 3344ms for sessionid 0x139ff6ed7370006, closing socket connection and attempting reconnect
[junit4:junit4]   2> 89439 T2572 oaz.ClientCnxn$SendThread.run Client session timed out, have not heard from server in 3344ms for sessionid 0x139ff6ed7370003, closing socket connection and attempting reconnect
[junit4:junit4]   2> 89579 T2539 oazs.NIOServerCnxn.closeSock Closed socket connection for client /127.0.0.1:51408 which had sessionid 0x139ff6ed7370003
[junit4:junit4]   2> 89579 T2539 oazs.NIOServerCnxn.closeSock Closed socket connection for client /127.0.0.1:51409 which had sessionid 0x139ff6ed7370002
[junit4:junit4]   2> 89579 T2558 oaz.ClientCnxn$SendThread.run Unable to read additional data from server sessionid 0x139ff6ed7370002, likely server has closed socket, closing socket connection and attempting reconnect
[junit4:junit4]   2> 89579 T2539 oazs.NIOServerCnxn.closeSock Closed socket connection for client /127.0.0.1:51410 which had sessionid 0x139ff6ed7370004
[junit4:junit4]   2> 89579 T2539 oazs.NIOServerCnxn.closeSock Closed socket connection for client /127.0.0.1:51414 which had sessionid 0x139ff6ed7370005
[junit4:junit4]   2> 89579 T2539 oazs.NIOServerCnxn.closeSock Closed socket connection for client /127.0.0.1:51420 which had sessionid 0x139ff6ed7370006
[junit4:junit4]   2> 89579 T2541 oazs.NIOServerCnxn$Factory.run NIOServerCnxn factory exited run method
[junit4:junit4]   2> 89595 T2539 oazs.FinalRequestProcessor.shutdown shutdown of request processor complete
[junit4:junit4]   2> 89595 T2539 oasc.ChaosMonkey.monkeyLog monkey: stop shard! 51396
[junit4:junit4]   2> 89595 T2539 oasc.CoreContainer.shutdown Shutting down CoreContainer instance=1545936
[junit4:junit4]   2> 89595 T2539 oasc.SolrCore.close [collection1]  CLOSING SolrCore org.apache.solr.core.SolrCore@e8ff77
[junit4:junit4]   2> 89595 T2539 oasc.SolrCore.closeSearcher [collection1] Closing main searcher on request.
[junit4:junit4]   2> 89595 T2539 oasu.DirectUpdateHandler2.close closing DirectUpdateHandler2{commits=0,autocommits=0,soft autocommits=0,optimizes=0,rollbacks=0,expungeDeletes=0,docsPending=0,adds=0,deletesById=0,deletesByQuery=0,errors=0,cumulative_adds=0,cumulative_deletesById=0,cumulative_deletesByQuery=0,cumulative_errors=0}
[junit4:junit4]   2> 89595 T2539 oasu.DefaultSolrCoreState.decref SolrCoreState ref count has reached 0 - closing IndexWriter
[junit4:junit4]   2> 89595 T2539 oasu.DefaultSolrCoreState.decref Closing SolrCoreState - canceling any ongoing recovery
[junit4:junit4]   2> 89595 T2560 oasc.Overseer$ClusterStateUpdater.amILeader According to ZK I (id=88382519232626690-127.0.0.1:51396_solr-n_0000000000) am no longer a leader.
[junit4:junit4]   2> 89689 T2573 oascc.ConnectionManager.process Watcher org.apache.solr.common.cloud.ConnectionManager@14fc82f name:ZooKeeperConnection Watcher:127.0.0.1:51389/solr got event WatchedEvent state:Disconnected type:None path:null path:null type:None
[junit4:junit4]   2> 89689 T2573 oascc.ConnectionManager.process zkClient has disconnected
[junit4:junit4]   2> 89689 T2611 oascc.ConnectionManager.process Watcher org.apache.solr.common.cloud.ConnectionManager@1352bed name:ZooKeeperConnection Watcher:127.0.0.1:51389/solr got event WatchedEvent state:Disconnected type:None path:null path:null type:None
[junit4:junit4]   2> 89689 T2611 oascc.ConnectionManager.process zkClient has disconnected
[junit4:junit4]   2> 89689 T2585 oascc.ConnectionManager.process Watcher org.apache.solr.common.cloud.ConnectionManager@1c5b3c3 name:ZooKeeperConnection Watcher:127.0.0.1:51389/solr got event WatchedEvent state:Disconnected type:None path:null path:null type:None
[junit4:junit4]   2> 89689 T2585 oascc.ConnectionManager.process zkClient has disconnected
[junit4:junit4]   2> 89689 T2597 oascc.ConnectionManager.process Watcher org.apache.solr.common.cloud.ConnectionManager@9038d3 name:ZooKeeperConnection Watcher:127.0.0.1:51389/solr got event WatchedEvent state:Disconnected type:None path:null path:null type:None
[junit4:junit4]   2> 89689 T2597 oascc.ConnectionManager.process zkClient has disconnected
[junit4:junit4]   2> 89689 T2559 oascc.ConnectionManager.process Watcher org.apache.solr.common.cloud.ConnectionManager@f0c7ae name:ZooKeeperConnection Watcher:127.0.0.1:51389/solr got event WatchedEvent state:Disconnected type:None path:null path:null type:None
[junit4:junit4]   2> 89689 T2559 oascc.ConnectionManager.process zkClient has disconnected
[junit4:junit4]   2> 89689 T2539 oaz.ZooKeeper.close Session: 0x139ff6ed7370002 closed
[junit4:junit4]   2> 89689 T2559 oaz.ClientCnxn$EventThread.run EventThread shut down
[junit4:junit4]   2> 89689 T2539 oejsh.ContextHandler.doStop stopped o.e.j.s.ServletContextHandler{/solr,null}
[junit4:junit4]   2> 89740 T2539 oasc.ChaosMonkey.monkeyLog monkey: stop shard! 51400
[junit4:junit4]   2> 89740 T2539 oasc.CoreContainer.shutdown Shutting down CoreContainer instance=17450938
[junit4:junit4]   2> 89741 T2539 oasc.SolrCore.close [collection1]  CLOSING SolrCore org.apache.solr.core.SolrCore@7e1f42
[junit4:junit4]   2> 89748 T2539 oasc.SolrCore.closeSearcher [collection1] Closing main searcher on request.
[junit4:junit4]   2> 89748 T2539 oasu.DirectUpdateHandler2.close closing DirectUpdateHandler2{commits=1,autocommits=0,soft autocommits=0,optimizes=0,rollbacks=0,expungeDeletes=0,docsPending=0,adds=0,deletesById=0,deletesByQuery=0,errors=0,cumulative_adds=0,cumulative_deletesById=0,cumulative_deletesByQuery=0,cumulative_errors=0}
[junit4:junit4]   2> 89751 T2539 oasu.DefaultSolrCoreState.decref SolrCoreState ref count has reached 0 - closing IndexWriter
[junit4:junit4]   2> 89755 T2539 oasu.DefaultSolrCoreState.decref Closing SolrCoreState - canceling any ongoing recovery
[junit4:junit4]   2> 90871 T2584 oaz.ClientCnxn$SendThread.startConnect Opening socket connection to server 127.0.0.1/127.0.0.1:51389
[junit4:junit4]   2> 91403 T2572 oaz.ClientCnxn$SendThread.startConnect Opening socket connection to server 127.0.0.1/127.0.0.1:51389
[junit4:junit4]   2> 91418 T2596 oaz.ClientCnxn$SendThread.startConnect Opening socket connection to server 127.0.0.1/127.0.0.1:51389
[junit4:junit4]   2> 91543 T2610 oaz.ClientCnxn$SendThread.startConnect Opening socket connection to server 127.0.0.1/127.0.0.1:51389
[junit4:junit4]   2> 91871 T2584 oaz.ClientCnxn$SendThread.run WARNING Session 0x139ff6ed7370004 for server null, unexpected error, closing socket connection and attempting reconnect java.net.ConnectException: Connection refused: no further information
[junit4:junit4]   2> 	at sun.nio.ch.SocketChannelImpl.checkConnect(Native Method)
[junit4:junit4]   2> 	at sun.nio.ch.SocketChannelImpl.finishConnect(SocketChannelImpl.java:692)
[junit4:junit4]   2> 	at org.apache.zookeeper.ClientCnxn$SendThread.run(ClientCnxn.java:1143)
[junit4:junit4]   2> 
[junit4:junit4]   2> 92445 T2596 oaz.ClientCnxn$SendThread.run WARNING Session 0x139ff6ed7370005 for server null, unexpected error, closing socket connection and attempting reconnect java.net.ConnectException: Connection refused: no further information
[junit4:junit4]   2> 	at sun.nio.ch.SocketChannelImpl.checkConnect(Native Method)
[junit4:junit4]   2> 	at sun.nio.ch.SocketChannelImpl.finishConnect(SocketChannelImpl.java:692)
[junit4:junit4]   2> 	at org.apache.zookeeper.ClientCnxn$SendThread.run(ClientCnxn.java:1143)
[junit4:junit4]   2> 
[junit4:junit4]   2> 92554 T2610 oaz.ClientCnxn$SendThread.run WARNING Session 0x139ff6ed7370006 for server null, unexpected error, closing socket connection and attempting reconnect java.net.ConnectException: Connection refused: no further information
[junit4:junit4]   2> 	at sun.nio.ch.SocketChannelImpl.checkConnect(Native Method)
[junit4:junit4]   2> 	at sun.nio.ch.SocketChannelImpl.finishConnect(SocketChannelImpl.java:692)
[junit4:junit4]   2> 	at org.apache.zookeeper.ClientCnxn$SendThread.run(ClientCnxn.java:1143)
[junit4:junit4]   2> 
[junit4:junit4]   2> 92554 T2539 oaz.ZooKeeper.close Session: 0x139ff6ed7370003 closed
[junit4:junit4]   2> 92554 T2573 oaz.ClientCnxn$EventThread.run EventThread shut down
[junit4:junit4]   2> 92554 T2539 oejsh.ContextHandler.doStop stopped o.e.j.s.ServletContextHandler{/solr,null}
[junit4:junit4]   2> 92607 T2539 oasc.ChaosMonkey.monkeyLog monkey: stop shard! 51404
[junit4:junit4]   2> 92607 T2539 oasc.CoreContainer.shutdown Shutting down CoreContainer instance=30679351
[junit4:junit4]   2> 92608 T2539 oasc.SolrCore.close [collection1]  CLOSING SolrCore org.apache.solr.core.SolrCore@1e7064c
[junit4:junit4]   2> 92614 T2539 oasc.SolrCore.closeSearcher [collection1] Closing main searcher on request.
[junit4:junit4]   2> 92614 T2539 oasu.DirectUpdateHandler2.close closing DirectUpdateHandler2{commits=0,autocommits=0,soft autocommits=0,optimizes=0,rollbacks=0,expungeDeletes=0,docsPending=0,adds=0,deletesById=0,deletesByQuery=0,errors=0,cumulative_adds=0,cumulative_deletesById=0,cumulative_deletesByQuery=0,cumulative_errors=0}
[junit4:junit4]   2> 92614 T2539 oasu.DefaultSolrCoreState.decref SolrCoreState ref count has reached 0 - closing IndexWriter
[junit4:junit4]   2> 92614 T2539 oasu.DefaultSolrCoreState.decref Closing SolrCoreState - canceling any ongoing recovery
[junit4:junit4]   2> 93205 T2584 oaz.ClientCnxn$SendThread.startConnect Opening socket connection to server 127.0.0.1/127.0.0.1:51389
[junit4:junit4]   2> 93799 T2610 oaz.ClientCnxn$SendThread.startConnect Opening socket connection to server 127.0.0.1/127.0.0.1:51389
[junit4:junit4]   2> 94080 T2596 oaz.ClientCnxn$SendThread.startConnect Opening socket connection to server 127.0.0.1/127.0.0.1:51389
[junit4:junit4]   2> 94346 T2539 oaz.ZooKeeper.close Session: 0x139ff6ed7370004 closed
[junit4:junit4]   2> 94346 T2585 oaz.ClientCnxn$EventThread.run EventThread shut down
[junit4:junit4]   2> 94346 T2539 oejsh.ContextHandler.doStop stopped o.e.j.s.ServletContextHandler{/solr,null}
[junit4:junit4]   2> 94399 T2539 oasc.ChaosMonkey.monkeyLog monkey: stop shard! 51411
[junit4:junit4]   2> 94399 T2539 oasc.CoreContainer.shutdown Shutting down CoreContainer instance=31778919
[junit4:junit4]   2> 94400 T2539 oasc.SolrCore.close [collection1]  CLOSING SolrCore org.apache.solr.core.SolrCore@1052336
[junit4:junit4]   2> 94415 T2539 oasc.SolrCore.closeSearcher [collection1] Closing main searcher on request.
[junit4:junit4]   2> 94415 T2539 oasu.DirectUpdateHandler2.close closing DirectUpdateHandler2{commits=1,autocommits=0,soft autocommits=0,optimizes=0,rollbacks=0,expungeDeletes=0,docsPending=0,adds=0,deletesById=0,deletesByQuery=0,errors=0,cumulative_adds=0,cumulative_deletesById=0,cumulative_deletesByQuery=0,cumulative_errors=0}
[junit4:junit4]   2> 94415 T2539 oasu.DefaultSolrCoreState.decref SolrCoreState ref count has reached 0 - closing IndexWriter
[junit4:junit4]   2> 94415 T2539 oasu.DefaultSolrCoreState.decref Closing SolrCoreState - canceling any ongoing recovery
[junit4:junit4]   2> 94822 T2610 oaz.ClientCnxn$SendThread.run WARNING Session 0x139ff6ed7370006 for server null, unexpected error, closing socket connection and attempting reconnect java.net.ConnectException: Connection refused: no further information
[junit4:junit4]   2> 	at sun.nio.ch.SocketChannelImpl.checkConnect(Native Method)
[junit4:junit4]   2> 	at sun.nio.ch.SocketChannelImpl.finishConnect(SocketChannelImpl.java:692)
[junit4:junit4]   2> 	at org.apache.zookeeper.ClientCnxn$SendThread.run(ClientCnxn.java:1143)
[junit4:junit4]   2> 
[junit4:junit4]   2> 95195 T2597 oaz.ClientCnxn$EventThread.run EventThread shut down
[junit4:junit4]   2> 95195 T2539 oaz.ZooKeeper.close Session: 0x139ff6ed7370005 closed
[junit4:junit4]   2> 95196 T2539 oejsh.ContextHandler.doStop stopped o.e.j.s.ServletContextHandler{/solr,null}
[junit4:junit4]   2> 95248 T2539 oasc.ChaosMonkey.monkeyLog monkey: stop shard! 51417
[junit4:junit4]   2> 95248 T2539 oasc.CoreContainer.shutdown Shutting down CoreContainer instance=24014275
[jun

[...truncated too long message...]

539 oas.SolrTestCaseJ4.tearDown ###Ending testDistribSearch
[junit4:junit4]   2> NOTE: reproduce with: ant test  -Dtestcase=FullSolrCloudDistribCmdsTest -Dtests.method=testDistribSearch -Dtests.seed=501F48191C20334D -Dtests.slow=true -Dtests.locale=ar_DZ -Dtests.timezone=Asia/Colombo -Dtests.file.encoding=US-ASCII
[junit4:junit4] ERROR   97.8s | FullSolrCloudDistribCmdsTest.testDistribSearch <<<
[junit4:junit4]    > Throwable #1: org.apache.solr.common.SolrException: No registered leader was found, collection:collection1 slice:shard2
[junit4:junit4]    > 	at __randomizedtesting.SeedInfo.seed([501F48191C20334D:D1F9C6016B7F5371]:0)
[junit4:junit4]    > 	at org.apache.solr.common.cloud.ZkStateReader.getLeaderProps(ZkStateReader.java:413)
[junit4:junit4]    > 	at org.apache.solr.cloud.AbstractFullDistribZkTestBase.createJettys(AbstractFullDistribZkTestBase.java:324)
[junit4:junit4]    > 	at org.apache.solr.cloud.AbstractFullDistribZkTestBase.createServers(AbstractFullDistribZkTestBase.java:268)
[junit4:junit4]    > 	at org.apache.solr.BaseDistributedSearchTestCase.testDistribSearch(BaseDistributedSearchTestCase.java:693)
[junit4:junit4]    > 	at sun.reflect.NativeMethodAccessorImpl.invoke0(Native Method)
[junit4:junit4]    > 	at sun.reflect.NativeMethodAccessorImpl.invoke(NativeMethodAccessorImpl.java:57)
[junit4:junit4]    > 	at sun.reflect.DelegatingMethodAccessorImpl.invoke(DelegatingMethodAccessorImpl.java:43)
[junit4:junit4]    > 	at java.lang.reflect.Method.invoke(Method.java:601)
[junit4:junit4]    > 	at com.carrotsearch.randomizedtesting.RandomizedRunner.invoke(RandomizedRunner.java:1559)
[junit4:junit4]    > 	at com.carrotsearch.randomizedtesting.RandomizedRunner.access$600(RandomizedRunner.java:79)
[junit4:junit4]    > 	at com.carrotsearch.randomizedtesting.RandomizedRunner$6.evaluate(RandomizedRunner.java:737)
[junit4:junit4]    > 	at com.carrotsearch.randomizedtesting.RandomizedRunner$7.evaluate(RandomizedRunner.java:773)
[junit4:junit4]    > 	at com.carrotsearch.randomizedtesting.RandomizedRunner$8.evaluate(RandomizedRunner.java:787)
[junit4:junit4]    > 	at com.carrotsearch.randomizedtesting.rules.SystemPropertiesRestoreRule$1.evaluate(SystemPropertiesRestoreRule.java:53)
[junit4:junit4]    > 	at org.apache.lucene.util.TestRuleSetupTeardownChained$1.evaluate(TestRuleSetupTeardownChained.java:50)
[junit4:junit4]    > 	at org.apache.lucene.util.TestRuleFieldCacheSanity$1.evaluate(TestRuleFieldCacheSanity.java:51)
[junit4:junit4]    > 	at org.apache.lucene.util.AbstractBeforeAfterRule$1.evaluate(AbstractBeforeAfterRule.java:45)
[junit4:junit4]    > 	at com.carrotsearch.randomizedtesting.rules.SystemPropertiesInvariantRule$1.evaluate(SystemPropertiesInvariantRule.java:55)
[junit4:junit4]    > 	at org.apache.lucene.util.TestRuleThreadAndTestName$1.evaluate(TestRuleThreadAndTestName.java:48)
[junit4:junit4]    > 	at org.apache.lucene.util.TestRuleIgnoreAfterMaxFailures$1.evaluate(TestRuleIgnoreAfterMaxFailures.java:70)
[junit4:junit4]    > 	at org.apache.lucene.util.TestRuleMarkFailure$1.evaluate(TestRuleMarkFailure.java:48)
[junit4:junit4]    > 	at com.carrotsearch.randomizedtesting.rules.StatementAdapter.evaluate(StatementAdapter.java:36)
[junit4:junit4]    > 	at com.carrotsearch.randomizedtesting.ThreadLeakControl$StatementRunner.run(ThreadLeakControl.java:358)
[junit4:junit4]    > 	at com.carrotsearch.randomizedtesting.ThreadLeakControl.forkTimeoutingTask(ThreadLeakControl.java:782)
[junit4:junit4]    > 	at com.carrotsearch.randomizedtesting.ThreadLeakControl$3.evaluate(ThreadLeakControl.java:442)
[junit4:junit4]    > 	at com.carrotsearch.randomizedtesting.RandomizedRunner.runSingleTest(RandomizedRunner.java:746)
[junit4:junit4]    > 	at com.carrotsearch.randomizedtesting.RandomizedRunner$3.evaluate(RandomizedRunner.java:648)
[junit4:junit4]    > 	at com.carrotsearch.randomizedtesting.RandomizedRunner$4.evaluate(RandomizedRunner.java:682)
[junit4:junit4]    > 	at com.carrotsearch.randomizedtesting.RandomizedRunner$5.evaluate(RandomizedRunner.java:693)
[junit4:junit4]    > 	at com.carrotsearch.randomizedtesting.rules.StatementAdapter.evaluate(StatementAdapter.java:36)
[junit4:junit4]    > 	at com.carrotsearch.randomizedtesting.rules.SystemPropertiesRestoreRule$1.evaluate(SystemPropertiesRestoreRule.java:53)
[junit4:junit4]    > 	at org.apache.lucene.util.AbstractBeforeAfterRule$1.evaluate(AbstractBeforeAfterRule.java:45)
[junit4:junit4]    > 	at org.apache.lucene.util.TestRuleStoreClassName$1.evaluate(TestRuleStoreClassName.java:42)
[junit4:junit4]    > 	at com.carrotsearch.randomizedtesting.rules.SystemPropertiesInvariantRule$1.evaluate(SystemPropertiesInvariantRule.java:55)
[junit4:junit4]    > 	at com.carrotsearch.randomizedtesting.rules.NoShadowingOrOverridesOnMethodsRule$1.evaluate(NoShadowingOrOverridesOnMethodsRule.java:39)
[junit4:junit4]    > 	at com.carrotsearch.randomizedtesting.rules.NoShadowingOrOverridesOnMethodsRule$1.evaluate(NoShadowingOrOverridesOnMethodsRule.java:39)
[junit4:junit4]    > 	at com.carrotsearch.randomizedtesting.rules.StatementAdapter.evaluate(StatementAdapter.java:36)
[junit4:junit4]    > 	at org.apache.lucene.util.TestRuleAssertionsRequired$1.evaluate(TestRuleAssertionsRequired.java:43)
[junit4:junit4]    > 	at org.apache.lucene.util.TestRuleMarkFailure$1.evaluate(TestRuleMarkFailure.java:48)
[junit4:junit4]    > 	at org.apache.lucene.util.TestRuleIgnoreAfterMaxFailures$1.evaluate(TestRuleIgnoreAfterMaxFailures.java:70)
[junit4:junit4]    > 	at org.apache.lucene.util.TestRuleIgnoreTestSuites$1.evaluate(TestRuleIgnoreTestSuites.java:55)
[junit4:junit4]    > 	at com.carrotsearch.randomizedtesting.rules.StatementAdapter.evaluate(StatementAdapter.java:36)
[junit4:junit4]    > 	at com.carrotsearch.randomizedtesting.ThreadLeakControl$StatementRunner.run(ThreadLeakControl.java:358)
[junit4:junit4]    > 	at java.lang.Thread.run(Thread.java:722)
[junit4:junit4]   2> 97848 T2539 oas.SolrTestCaseJ4.deleteCore ###deleteCore
[junit4:junit4]   2> NOTE: test params are: codec=SimpleText, sim=RandomSimilarityProvider(queryNorm=true,coord=crazy): {}, locale=ar_DZ, timezone=Asia/Colombo
[junit4:junit4]   2> NOTE: Windows 7 6.1 x86/Oracle Corporation 1.7.0_07 (32-bit)/cpus=2,threads=1,free=141458704,total=266338304
[junit4:junit4]   2> NOTE: All tests run in this JVM: [CacheHeaderTest, TestSearchPerf, ResponseLogComponentTest, SuggesterTSTTest, DirectUpdateHandlerTest, StatelessScriptUpdateProcessorFactoryTest, DocumentAnalysisRequestHandlerTest, TestQueryUtils, ConvertedLegacyTest, SolrPluginUtilsTest, ZkNodePropsTest, TestFoldingMultitermQuery, TestBinaryResponseWriter, TestSurroundQueryParser, RequestHandlersTest, SolrCmdDistributorTest, TestPropInject, TestLMDirichletSimilarityFactory, DistributedSpellCheckComponentTest, FastVectorHighlighterTest, TestCollationKeyRangeQueries, TestJmxIntegration, OverseerTest, TestDistributedGrouping, TestRandomFaceting, XsltUpdateRequestHandlerTest, TestStressRecovery, TestFastLRUCache, NumericFieldsTest, SolrRequestParserTest, TestElisionMultitermQuery, OpenExchangeRatesOrgProviderTest, DistanceFunctionTest, ResourceLoaderTest, CSVRequestHandlerTest, TestPseudoReturnFields, TermVectorComponentDistributedTest, TestRangeQuery, TestLuceneMatchVersion, TestExtendedDismaxParser, LoggingHandlerTest, SignatureUpdateProcessorFactoryTest, PolyFieldTest, TestDistributedSearch, FieldMutatingUpdateProcessorTest, SearchHandlerTest, TestLRUCache, TestQuerySenderNoQuery, SpellingQueryConverterTest, TestDocumentBuilder, TestMergePolicyConfig, LegacyHTMLStripCharFilterTest, QueryParsingTest, TestSolrDeletionPolicy2, SoftAutoCommitTest, TestRemoteStreaming, TestRealTimeGet, DefaultValueUpdateProcessorTest, NoCacheHeaderTest, TestPerFieldSimilarity, TestStressVersions, TestPluginEnable, FileBasedSpellCheckerTest, TestSort, FieldAnalysisRequestHandlerTest, ZkSolrClientTest, SpatialFilterTest, TestHashPartitioner, UpdateParamsTest, PingRequestHandlerTest, BasicFunctionalityTest, SpellPossibilityIteratorTest, TestJmxMonitoredMap, OutputWriterTest, TestReplicationHandler, CoreContainerCoreInitFailuresTest, TestPhraseSuggestions, MinimalSchemaTest, TestReload, TestStressReorder, StatsComponentTest, RecoveryZkTest, LeaderElectionIntegrationTest, CopyFieldTest, TestCSVResponseWriter, DirectSolrConnectionTest, UUIDFieldTest, JsonLoaderTest, CoreAdminHandlerTest, TestDefaultSimilarityFactory, RequiredFieldsTest, FileUtilsTest, TestCodecSupport, HighlighterTest, IndexSchemaRuntimeFieldTest, UniqFieldsUpdateProcessorFactoryTest, TimeZoneUtilsTest, TestUpdate, TestQuerySenderListener, ClusterStateUpdateTest, LukeRequestHandlerTest, TestPHPSerializedResponseWriter, TestReversedWildcardFilterFactory, TestWriterPerf, PrimUtilsTest, TestSystemIdResolver, TestFaceting, DocumentBuilderTest, DebugComponentTest, BasicDistributedZkTest, SpellCheckComponentTest, FullSolrCloudDistribCmdsTest]
[junit4:junit4] Completed in 97.88s, 1 test, 1 error <<< FAILURES!

[...truncated 352 lines...]
BUILD FAILED
C:\Users\JenkinsSlave\workspace\Lucene-Solr-4.x-Windows\build.xml:32: The following error occurred while executing this line:
C:\Users\JenkinsSlave\workspace\Lucene-Solr-4.x-Windows\solr\build.xml:179: The following error occurred while executing this line:
C:\Users\JenkinsSlave\workspace\Lucene-Solr-4.x-Windows\lucene\module-build.xml:61: The following error occurred while executing this line:
C:\Users\JenkinsSlave\workspace\Lucene-Solr-4.x-Windows\lucene\common-build.xml:1142: The following error occurred while executing this line:
C:\Users\JenkinsSlave\workspace\Lucene-Solr-4.x-Windows\lucene\common-build.xml:815: There were test failures: 231 suites, 955 tests, 1 error, 12 ignored (7 assumptions)

Total time: 42 minutes 4 seconds
Build step 'Invoke Ant' marked build as failure
Recording test results
Description set: Java: 32bit/jdk1.7.0_07 -server -XX:+UseG1GC
Email was triggered for: Failure
Sending email for trigger: Failure



Mime
View raw message