lucene-dev mailing list archives

Site index · List index
Message view « Date » · « Thread »
Top « Date » · « Thread »
From Apache Jenkins Server <jenk...@builds.apache.org>
Subject [JENKINS] Lucene-Solr-Tests-4.x-java7 - Build # 449 - Still Failing
Date Sat, 15 Sep 2012 05:37:51 GMT
Build: https://builds.apache.org/job/Lucene-Solr-Tests-4.x-java7/449/

1 tests failed.
FAILED:  org.apache.solr.cloud.BasicDistributedZk2Test.testDistribSearch

Error Message:
Shard still reported as live in zk

Stack Trace:
java.lang.AssertionError: Shard still reported as live in zk
	at __randomizedtesting.SeedInfo.seed([E6C592FF7530567A:67231CE7026F3646]:0)
	at org.junit.Assert.fail(Assert.java:93)
	at org.apache.solr.cloud.AbstractFullDistribZkTestBase.waitToSeeNotLive(AbstractFullDistribZkTestBase.java:1215)
	at org.apache.solr.cloud.BasicDistributedZk2Test.brindDownShardIndexSomeDocsAndRecover(BasicDistributedZk2Test.java:190)
	at org.apache.solr.cloud.BasicDistributedZk2Test.doTest(BasicDistributedZk2Test.java:83)
	at org.apache.solr.BaseDistributedSearchTestCase.testDistribSearch(BaseDistributedSearchTestCase.java:691)
	at sun.reflect.NativeMethodAccessorImpl.invoke0(Native Method)
	at sun.reflect.NativeMethodAccessorImpl.invoke(NativeMethodAccessorImpl.java:57)
	at sun.reflect.DelegatingMethodAccessorImpl.invoke(DelegatingMethodAccessorImpl.java:43)
	at java.lang.reflect.Method.invoke(Method.java:601)
	at com.carrotsearch.randomizedtesting.RandomizedRunner.invoke(RandomizedRunner.java:1559)
	at com.carrotsearch.randomizedtesting.RandomizedRunner.access$600(RandomizedRunner.java:79)
	at com.carrotsearch.randomizedtesting.RandomizedRunner$6.evaluate(RandomizedRunner.java:737)
	at com.carrotsearch.randomizedtesting.RandomizedRunner$7.evaluate(RandomizedRunner.java:773)
	at com.carrotsearch.randomizedtesting.RandomizedRunner$8.evaluate(RandomizedRunner.java:787)
	at com.carrotsearch.randomizedtesting.rules.SystemPropertiesRestoreRule$1.evaluate(SystemPropertiesRestoreRule.java:53)
	at org.apache.lucene.util.TestRuleSetupTeardownChained$1.evaluate(TestRuleSetupTeardownChained.java:50)
	at org.apache.lucene.util.TestRuleFieldCacheSanity$1.evaluate(TestRuleFieldCacheSanity.java:51)
	at org.apache.lucene.util.AbstractBeforeAfterRule$1.evaluate(AbstractBeforeAfterRule.java:45)
	at com.carrotsearch.randomizedtesting.rules.SystemPropertiesInvariantRule$1.evaluate(SystemPropertiesInvariantRule.java:55)
	at org.apache.lucene.util.TestRuleThreadAndTestName$1.evaluate(TestRuleThreadAndTestName.java:48)
	at org.apache.lucene.util.TestRuleIgnoreAfterMaxFailures$1.evaluate(TestRuleIgnoreAfterMaxFailures.java:70)
	at org.apache.lucene.util.TestRuleMarkFailure$1.evaluate(TestRuleMarkFailure.java:48)
	at com.carrotsearch.randomizedtesting.rules.StatementAdapter.evaluate(StatementAdapter.java:36)
	at com.carrotsearch.randomizedtesting.ThreadLeakControl$StatementRunner.run(ThreadLeakControl.java:358)
	at com.carrotsearch.randomizedtesting.ThreadLeakControl.forkTimeoutingTask(ThreadLeakControl.java:782)
	at com.carrotsearch.randomizedtesting.ThreadLeakControl$3.evaluate(ThreadLeakControl.java:442)
	at com.carrotsearch.randomizedtesting.RandomizedRunner.runSingleTest(RandomizedRunner.java:746)
	at com.carrotsearch.randomizedtesting.RandomizedRunner$3.evaluate(RandomizedRunner.java:648)
	at com.carrotsearch.randomizedtesting.RandomizedRunner$4.evaluate(RandomizedRunner.java:682)
	at com.carrotsearch.randomizedtesting.RandomizedRunner$5.evaluate(RandomizedRunner.java:693)
	at com.carrotsearch.randomizedtesting.rules.StatementAdapter.evaluate(StatementAdapter.java:36)
	at com.carrotsearch.randomizedtesting.rules.SystemPropertiesRestoreRule$1.evaluate(SystemPropertiesRestoreRule.java:53)
	at org.apache.lucene.util.AbstractBeforeAfterRule$1.evaluate(AbstractBeforeAfterRule.java:45)
	at org.apache.lucene.util.TestRuleStoreClassName$1.evaluate(TestRuleStoreClassName.java:42)
	at com.carrotsearch.randomizedtesting.rules.SystemPropertiesInvariantRule$1.evaluate(SystemPropertiesInvariantRule.java:55)
	at com.carrotsearch.randomizedtesting.rules.NoShadowingOrOverridesOnMethodsRule$1.evaluate(NoShadowingOrOverridesOnMethodsRule.java:39)
	at com.carrotsearch.randomizedtesting.rules.NoShadowingOrOverridesOnMethodsRule$1.evaluate(NoShadowingOrOverridesOnMethodsRule.java:39)
	at com.carrotsearch.randomizedtesting.rules.StatementAdapter.evaluate(StatementAdapter.java:36)
	at org.apache.lucene.util.TestRuleAssertionsRequired$1.evaluate(TestRuleAssertionsRequired.java:43)
	at org.apache.lucene.util.TestRuleMarkFailure$1.evaluate(TestRuleMarkFailure.java:48)
	at org.apache.lucene.util.TestRuleIgnoreAfterMaxFailures$1.evaluate(TestRuleIgnoreAfterMaxFailures.java:70)
	at org.apache.lucene.util.TestRuleIgnoreTestSuites$1.evaluate(TestRuleIgnoreTestSuites.java:55)
	at com.carrotsearch.randomizedtesting.rules.StatementAdapter.evaluate(StatementAdapter.java:36)
	at com.carrotsearch.randomizedtesting.ThreadLeakControl$StatementRunner.run(ThreadLeakControl.java:358)
	at java.lang.Thread.run(Thread.java:722)




Build Log:
[...truncated 7724 lines...]
[junit4:junit4] Suite: org.apache.solr.cloud.BasicDistributedZk2Test
[junit4:junit4]   2> 4 T112 oas.SolrTestCaseJ4.setUp ###Starting testDistribSearch
[junit4:junit4]   2> Creating dataDir: /usr/home/hudson/hudson-slave/workspace/Lucene-Solr-Tests-4.x-java7/solr/build/solr-core/test/J1/./solrtest-BasicDistributedZk2Test-1347686588406
[junit4:junit4]   2> 5 T112 oasc.ZkTestServer.run STARTING ZK TEST SERVER
[junit4:junit4]   2> 8 T113 oazs.ZooKeeperServer.setTickTime tickTime set to 1000
[junit4:junit4]   2> 9 T113 oazs.NIOServerCnxn$Factory.<init> binding to port 0.0.0.0/0.0.0.0:0
[junit4:junit4]   2> 9 T113 oazsp.FileTxnSnapLog.save Snapshotting: 0
[junit4:junit4]   2> 106 T112 oasc.ZkTestServer.run start zk server on port:29325
[junit4:junit4]   2> 106 T112 oaz.ZooKeeper.<init> Initiating client connection, connectString=127.0.0.1:29325 sessionTimeout=10000 watcher=org.apache.solr.common.cloud.ConnectionManager@63130f0d
[junit4:junit4]   2> 107 T118 oaz.ClientCnxn$SendThread.startConnect Opening socket connection to server /127.0.0.1:29325
[junit4:junit4]   2> 107 T112 oascc.ConnectionManager.waitForConnected Waiting for client to connect to ZooKeeper
[junit4:junit4]   2> 108 T118 oaz.ClientCnxn$SendThread.primeConnection Socket connection established to localhost/127.0.0.1:29325, initiating session
[junit4:junit4]   2> 108 T114 oazs.NIOServerCnxn$Factory.run Accepted socket connection from /140.211.11.196:29326
[junit4:junit4]   2> 108 T114 oazs.NIOServerCnxn.readConnectRequest Client attempting to establish new session at /140.211.11.196:29326
[junit4:junit4]   2> 109 T116 oazsp.FileTxnLog.append Creating new log file: log.1
[junit4:junit4]   2> 121 T116 oazs.NIOServerCnxn.finishSessionInit Established session 0x139c8615ffb0000 with negotiated timeout 10000 for client /140.211.11.196:29326
[junit4:junit4]   2> 122 T118 oaz.ClientCnxn$SendThread.readConnectResult Session establishment complete on server localhost/127.0.0.1:29325, sessionid = 0x139c8615ffb0000, negotiated timeout = 10000
[junit4:junit4]   2> 122 T119 oascc.ConnectionManager.process Watcher org.apache.solr.common.cloud.ConnectionManager@63130f0d name:ZooKeeperConnection Watcher:127.0.0.1:29325 got event WatchedEvent state:SyncConnected type:None path:null path:null type:None
[junit4:junit4]   2> 123 T112 oascc.ConnectionManager.waitForConnected Client is connected to ZooKeeper
[junit4:junit4]   2> 123 T112 oascc.SolrZkClient.makePath makePath: /solr
[junit4:junit4]   2> 132 T117 oazs.PrepRequestProcessor.pRequest Processed session termination for sessionid: 0x139c8615ffb0000
[junit4:junit4]   2> 133 T119 oaz.ClientCnxn$EventThread.run EventThread shut down
[junit4:junit4]   2> 133 T112 oaz.ZooKeeper.close Session: 0x139c8615ffb0000 closed
[junit4:junit4]   2> 133 T114 oazs.NIOServerCnxn.closeSock Closed socket connection for client /140.211.11.196:29326 which had sessionid 0x139c8615ffb0000
[junit4:junit4]   2> 133 T112 oaz.ZooKeeper.<init> Initiating client connection, connectString=127.0.0.1:29325/solr sessionTimeout=10000 watcher=org.apache.solr.common.cloud.ConnectionManager@18f2116d
[junit4:junit4]   2> 134 T120 oaz.ClientCnxn$SendThread.startConnect Opening socket connection to server /127.0.0.1:29325
[junit4:junit4]   2> 134 T112 oascc.ConnectionManager.waitForConnected Waiting for client to connect to ZooKeeper
[junit4:junit4]   2> 135 T120 oaz.ClientCnxn$SendThread.primeConnection Socket connection established to localhost/127.0.0.1:29325, initiating session
[junit4:junit4]   2> 135 T114 oazs.NIOServerCnxn$Factory.run Accepted socket connection from /140.211.11.196:29327
[junit4:junit4]   2> 136 T114 oazs.NIOServerCnxn.readConnectRequest Client attempting to establish new session at /140.211.11.196:29327
[junit4:junit4]   2> 138 T116 oazs.NIOServerCnxn.finishSessionInit Established session 0x139c8615ffb0001 with negotiated timeout 10000 for client /140.211.11.196:29327
[junit4:junit4]   2> 138 T120 oaz.ClientCnxn$SendThread.readConnectResult Session establishment complete on server localhost/127.0.0.1:29325, sessionid = 0x139c8615ffb0001, negotiated timeout = 10000
[junit4:junit4]   2> 138 T121 oascc.ConnectionManager.process Watcher org.apache.solr.common.cloud.ConnectionManager@18f2116d name:ZooKeeperConnection Watcher:127.0.0.1:29325/solr got event WatchedEvent state:SyncConnected type:None path:null path:null type:None
[junit4:junit4]   2> 139 T112 oascc.ConnectionManager.waitForConnected Client is connected to ZooKeeper
[junit4:junit4]   2> 139 T112 oascc.SolrZkClient.makePath makePath: /collections/collection1
[junit4:junit4]   2> 150 T112 oascc.SolrZkClient.makePath makePath: /collections/collection1/shards
[junit4:junit4]   2> 153 T112 oascc.SolrZkClient.makePath makePath: /collections/control_collection
[junit4:junit4]   2> 156 T112 oascc.SolrZkClient.makePath makePath: /collections/control_collection/shards
[junit4:junit4]   2> 160 T112 oasc.AbstractZkTestCase.putConfig put /usr/home/hudson/hudson-slave/workspace/Lucene-Solr-Tests-4.x-java7/solr/build/solr-core/test-files/solr/collection1/conf/solrconfig.xml to /configs/conf1/solrconfig.xml
[junit4:junit4]   2> 162 T112 oascc.SolrZkClient.makePath makePath: /configs/conf1/solrconfig.xml
[junit4:junit4]   2> 176 T112 oasc.AbstractZkTestCase.putConfig put /usr/home/hudson/hudson-slave/workspace/Lucene-Solr-Tests-4.x-java7/solr/build/solr-core/test-files/solr/collection1/conf/schema.xml to /configs/conf1/schema.xml
[junit4:junit4]   2> 178 T112 oascc.SolrZkClient.makePath makePath: /configs/conf1/schema.xml
[junit4:junit4]   2> 283 T112 oasc.AbstractZkTestCase.putConfig put /usr/home/hudson/hudson-slave/workspace/Lucene-Solr-Tests-4.x-java7/solr/build/solr-core/test-files/solr/collection1/conf/solrconfig.xml to /configs/conf1/solrconfig.xml
[junit4:junit4]   2> 285 T112 oascc.SolrZkClient.makePath makePath: /configs/conf1/solrconfig.xml
[junit4:junit4]   2> 289 T112 oasc.AbstractZkTestCase.putConfig put /usr/home/hudson/hudson-slave/workspace/Lucene-Solr-Tests-4.x-java7/solr/build/solr-core/test-files/solr/collection1/conf/stopwords.txt to /configs/conf1/stopwords.txt
[junit4:junit4]   2> 290 T112 oascc.SolrZkClient.makePath makePath: /configs/conf1/stopwords.txt
[junit4:junit4]   2> 296 T112 oasc.AbstractZkTestCase.putConfig put /usr/home/hudson/hudson-slave/workspace/Lucene-Solr-Tests-4.x-java7/solr/build/solr-core/test-files/solr/collection1/conf/protwords.txt to /configs/conf1/protwords.txt
[junit4:junit4]   2> 296 T112 oascc.SolrZkClient.makePath makePath: /configs/conf1/protwords.txt
[junit4:junit4]   2> 301 T112 oasc.AbstractZkTestCase.putConfig put /usr/home/hudson/hudson-slave/workspace/Lucene-Solr-Tests-4.x-java7/solr/build/solr-core/test-files/solr/collection1/conf/currency.xml to /configs/conf1/currency.xml
[junit4:junit4]   2> 301 T112 oascc.SolrZkClient.makePath makePath: /configs/conf1/currency.xml
[junit4:junit4]   2> 305 T112 oasc.AbstractZkTestCase.putConfig put /usr/home/hudson/hudson-slave/workspace/Lucene-Solr-Tests-4.x-java7/solr/build/solr-core/test-files/solr/collection1/conf/open-exchange-rates.json to /configs/conf1/open-exchange-rates.json
[junit4:junit4]   2> 306 T112 oascc.SolrZkClient.makePath makePath: /configs/conf1/open-exchange-rates.json
[junit4:junit4]   2> 310 T112 oasc.AbstractZkTestCase.putConfig put /usr/home/hudson/hudson-slave/workspace/Lucene-Solr-Tests-4.x-java7/solr/build/solr-core/test-files/solr/collection1/conf/mapping-ISOLatin1Accent.txt to /configs/conf1/mapping-ISOLatin1Accent.txt
[junit4:junit4]   2> 311 T112 oascc.SolrZkClient.makePath makePath: /configs/conf1/mapping-ISOLatin1Accent.txt
[junit4:junit4]   2> 315 T112 oasc.AbstractZkTestCase.putConfig put /usr/home/hudson/hudson-slave/workspace/Lucene-Solr-Tests-4.x-java7/solr/build/solr-core/test-files/solr/collection1/conf/old_synonyms.txt to /configs/conf1/old_synonyms.txt
[junit4:junit4]   2> 316 T112 oascc.SolrZkClient.makePath makePath: /configs/conf1/old_synonyms.txt
[junit4:junit4]   2> 320 T112 oasc.AbstractZkTestCase.putConfig put /usr/home/hudson/hudson-slave/workspace/Lucene-Solr-Tests-4.x-java7/solr/build/solr-core/test-files/solr/collection1/conf/synonyms.txt to /configs/conf1/synonyms.txt
[junit4:junit4]   2> 321 T112 oascc.SolrZkClient.makePath makePath: /configs/conf1/synonyms.txt
[junit4:junit4]   2> 325 T117 oazs.PrepRequestProcessor.pRequest Processed session termination for sessionid: 0x139c8615ffb0001
[junit4:junit4]   2> 327 T121 oaz.ClientCnxn$EventThread.run EventThread shut down
[junit4:junit4]   2> 327 T114 oazs.NIOServerCnxn.closeSock Closed socket connection for client /140.211.11.196:29327 which had sessionid 0x139c8615ffb0001
[junit4:junit4]   2> 327 T112 oaz.ZooKeeper.close Session: 0x139c8615ffb0001 closed
[junit4:junit4]   2> 330 T112 oejs.Server.doStart jetty-8.1.2.v20120308
[junit4:junit4]   2> 333 T112 oejs.AbstractConnector.doStart Started SocketConnector@0.0.0.0:29328
[junit4:junit4]   2> 334 T112 oasc.SolrResourceLoader.locateSolrHome JNDI not configured for solr (NoInitialContextEx)
[junit4:junit4]   2> 334 T112 oasc.SolrResourceLoader.locateSolrHome using system property solr.solr.home: /usr/home/hudson/hudson-slave/workspace/Lucene-Solr-Tests-4.x-java7/solr/build/solr-core/test-files/solr
[junit4:junit4]   2> 335 T112 oasc.SolrResourceLoader.<init> new SolrResourceLoader for deduced Solr Home: '/usr/home/hudson/hudson-slave/workspace/Lucene-Solr-Tests-4.x-java7/solr/build/solr-core/test-files/solr/'
[junit4:junit4]   2> 376 T112 oass.SolrDispatchFilter.init SolrDispatchFilter.init()
[junit4:junit4]   2> 377 T112 oasc.SolrResourceLoader.locateSolrHome JNDI not configured for solr (NoInitialContextEx)
[junit4:junit4]   2> 378 T112 oasc.SolrResourceLoader.locateSolrHome using system property solr.solr.home: /usr/home/hudson/hudson-slave/workspace/Lucene-Solr-Tests-4.x-java7/solr/build/solr-core/test-files/solr
[junit4:junit4]   2> 378 T112 oasc.CoreContainer$Initializer.initialize looking for solr.xml: /usr/home/hudson/hudson-slave/workspace/Lucene-Solr-Tests-4.x-java7/solr/build/solr-core/test-files/solr/solr.xml
[junit4:junit4]   2> 379 T112 oasc.CoreContainer.<init> New CoreContainer 1248427579
[junit4:junit4]   2> 379 T112 oasc.CoreContainer.load Loading CoreContainer using Solr Home: '/usr/home/hudson/hudson-slave/workspace/Lucene-Solr-Tests-4.x-java7/solr/build/solr-core/test-files/solr/'
[junit4:junit4]   2> 380 T112 oasc.SolrResourceLoader.<init> new SolrResourceLoader for directory: '/usr/home/hudson/hudson-slave/workspace/Lucene-Solr-Tests-4.x-java7/solr/build/solr-core/test-files/solr/'
[junit4:junit4]   2> 413 T112 oasc.CoreContainer.load Registering Log Listener
[junit4:junit4]   2> 428 T112 oasc.CoreContainer.initZooKeeper Zookeeper client=127.0.0.1:29325/solr
[junit4:junit4]   2> 429 T112 oaz.ZooKeeper.<init> Initiating client connection, connectString=127.0.0.1:29325/solr sessionTimeout=5000 watcher=org.apache.solr.common.cloud.ConnectionManager@4fb2c3b8
[junit4:junit4]   2> 430 T131 oaz.ClientCnxn$SendThread.startConnect Opening socket connection to server /127.0.0.1:29325
[junit4:junit4]   2> 430 T112 oascc.ConnectionManager.waitForConnected Waiting for client to connect to ZooKeeper
[junit4:junit4]   2> 432 T131 oaz.ClientCnxn$SendThread.primeConnection Socket connection established to localhost/127.0.0.1:29325, initiating session
[junit4:junit4]   2> 432 T114 oazs.NIOServerCnxn$Factory.run Accepted socket connection from /140.211.11.196:29329
[junit4:junit4]   2> 432 T114 oazs.NIOServerCnxn.readConnectRequest Client attempting to establish new session at /140.211.11.196:29329
[junit4:junit4]   2> 435 T116 oazs.NIOServerCnxn.finishSessionInit Established session 0x139c8615ffb0002 with negotiated timeout 5000 for client /140.211.11.196:29329
[junit4:junit4]   2> 435 T131 oaz.ClientCnxn$SendThread.readConnectResult Session establishment complete on server localhost/127.0.0.1:29325, sessionid = 0x139c8615ffb0002, negotiated timeout = 5000
[junit4:junit4]   2> 436 T132 oascc.ConnectionManager.process Watcher org.apache.solr.common.cloud.ConnectionManager@4fb2c3b8 name:ZooKeeperConnection Watcher:127.0.0.1:29325/solr got event WatchedEvent state:SyncConnected type:None path:null path:null type:None
[junit4:junit4]   2> 436 T112 oascc.ConnectionManager.waitForConnected Client is connected to ZooKeeper
[junit4:junit4]   2> 438 T117 oazs.PrepRequestProcessor.pRequest Got user-level KeeperException when processing sessionid:0x139c8615ffb0002 type:create cxid:0x2 zxid:0xfffffffffffffffe txntype:unknown reqpath:n/a Error Path:/solr/overseer Error:KeeperErrorCode = NodeExists for /solr/overseer
[junit4:junit4]   2> 446 T112 oascc.SolrZkClient.makePath makePath: /live_nodes
[junit4:junit4]   2> 450 T112 oasc.ZkController.createEphemeralLiveNode Register node as live in ZooKeeper:/live_nodes/127.0.0.1:29328_solr
[junit4:junit4]   2> 450 T117 oazs.PrepRequestProcessor.pRequest Got user-level KeeperException when processing sessionid:0x139c8615ffb0002 type:delete cxid:0x7 zxid:0xfffffffffffffffe txntype:unknown reqpath:n/a Error Path:/solr/live_nodes/127.0.0.1:29328_solr Error:KeeperErrorCode = NoNode for /solr/live_nodes/127.0.0.1:29328_solr
[junit4:junit4]   2> 452 T112 oascc.SolrZkClient.makePath makePath: /live_nodes/127.0.0.1:29328_solr
[junit4:junit4]   2> 461 T112 oashc.HttpShardHandlerFactory.getParameter Setting socketTimeout to: 0
[junit4:junit4]   2> 462 T112 oashc.HttpShardHandlerFactory.getParameter Setting urlScheme to: http://
[junit4:junit4]   2> 462 T112 oashc.HttpShardHandlerFactory.getParameter Setting connTimeout to: 0
[junit4:junit4]   2> 463 T112 oashc.HttpShardHandlerFactory.getParameter Setting maxConnectionsPerHost to: 20
[junit4:junit4]   2> 463 T112 oashc.HttpShardHandlerFactory.getParameter Setting corePoolSize to: 0
[junit4:junit4]   2> 464 T112 oashc.HttpShardHandlerFactory.getParameter Setting maximumPoolSize to: 2147483647
[junit4:junit4]   2> 464 T112 oashc.HttpShardHandlerFactory.getParameter Setting maxThreadIdleTime to: 5
[junit4:junit4]   2> 465 T112 oashc.HttpShardHandlerFactory.getParameter Setting sizeOfQueue to: -1
[junit4:junit4]   2> 465 T112 oashc.HttpShardHandlerFactory.getParameter Setting fairnessPolicy to: false
[junit4:junit4]   2> 466 T112 oascsi.HttpClientUtil.createClient Creating new http client, config:maxConnectionsPerHost=20&maxConnections=10000&socketTimeout=0&connTimeout=0&retry=false
[junit4:junit4]   2> 483 T112 oascc.SolrZkClient.makePath makePath: /overseer_elect/election
[junit4:junit4]   2> 492 T117 oazs.PrepRequestProcessor.pRequest Got user-level KeeperException when processing sessionid:0x139c8615ffb0002 type:delete cxid:0x15 zxid:0xfffffffffffffffe txntype:unknown reqpath:n/a Error Path:/solr/overseer_elect/leader Error:KeeperErrorCode = NoNode for /solr/overseer_elect/leader
[junit4:junit4]   2> 502 T112 oascc.SolrZkClient.makePath makePath: /overseer_elect/leader
[junit4:junit4]   2> 505 T112 oasc.Overseer.start Overseer (id=88321988258103298-127.0.0.1:29328_solr-n_0000000000) starting
[junit4:junit4]   2> 506 T117 oazs.PrepRequestProcessor.pRequest Got user-level KeeperException when processing sessionid:0x139c8615ffb0002 type:create cxid:0x1a zxid:0xfffffffffffffffe txntype:unknown reqpath:n/a Error Path:/solr/overseer Error:KeeperErrorCode = NodeExists for /solr/overseer
[junit4:junit4]   2> 513 T117 oazs.PrepRequestProcessor.pRequest Got user-level KeeperException when processing sessionid:0x139c8615ffb0002 type:create cxid:0x1b zxid:0xfffffffffffffffe txntype:unknown reqpath:n/a Error Path:/solr/overseer Error:KeeperErrorCode = NodeExists for /solr/overseer
[junit4:junit4]   2> 515 T117 oazs.PrepRequestProcessor.pRequest Got user-level KeeperException when processing sessionid:0x139c8615ffb0002 type:create cxid:0x1c zxid:0xfffffffffffffffe txntype:unknown reqpath:n/a Error Path:/solr/overseer Error:KeeperErrorCode = NodeExists for /solr/overseer
[junit4:junit4]   2> 522 T117 oazs.PrepRequestProcessor.pRequest Got user-level KeeperException when processing sessionid:0x139c8615ffb0002 type:create cxid:0x1d zxid:0xfffffffffffffffe txntype:unknown reqpath:n/a Error Path:/solr/overseer Error:KeeperErrorCode = NodeExists for /solr/overseer
[junit4:junit4]   2> 524 T134 oasc.OverseerCollectionProcessor.run Process current queue of collection creations
[junit4:junit4]   2> 524 T112 oascc.SolrZkClient.makePath makePath: /clusterstate.json
[junit4:junit4]   2> 535 T112 oascc.ZkStateReader.createClusterStateWatchersAndUpdate Updating cluster state from ZooKeeper... 
[junit4:junit4]   2> 538 T133 oasc.Overseer$ClusterStateUpdater.run Starting to work on the main queue
[junit4:junit4]   2> 543 T112 oasc.CoreContainer.create Creating SolrCore 'collection1' using instanceDir: /usr/home/hudson/hudson-slave/workspace/Lucene-Solr-Tests-4.x-java7/solr/build/solr-core/test-files/solr/collection1
[junit4:junit4]   2> 544 T112 oasc.ZkController.createCollectionZkNode Check for collection zkNode:control_collection
[junit4:junit4]   2> 545 T112 oasc.ZkController.createCollectionZkNode Collection zkNode exists
[junit4:junit4]   2> 545 T112 oasc.ZkController.readConfigName Load collection config from:/collections/control_collection
[junit4:junit4]   2> 547 T112 oasc.SolrResourceLoader.<init> new SolrResourceLoader for directory: '/usr/home/hudson/hudson-slave/workspace/Lucene-Solr-Tests-4.x-java7/solr/build/solr-core/test-files/solr/collection1/'
[junit4:junit4]   2> 549 T112 oasc.SolrResourceLoader.replaceClassLoader Adding 'file:/usr/home/hudson/hudson-slave/workspace/Lucene-Solr-Tests-4.x-java7/solr/build/solr-core/test-files/solr/collection1/lib/classes/' to classloader
[junit4:junit4]   2> 550 T112 oasc.SolrResourceLoader.replaceClassLoader Adding 'file:/usr/home/hudson/hudson-slave/workspace/Lucene-Solr-Tests-4.x-java7/solr/build/solr-core/test-files/solr/collection1/lib/README' to classloader
[junit4:junit4]   2> 600 T112 oasc.SolrConfig.<init> Using Lucene MatchVersion: LUCENE_40
[junit4:junit4]   2> 664 T112 oasc.SolrConfig.<init> Loaded SolrConfig: solrconfig.xml
[junit4:junit4]   2> 766 T112 oass.IndexSchema.readSchema Reading Solr Schema
[junit4:junit4]   2> 773 T112 oass.IndexSchema.readSchema Schema name=test
[junit4:junit4]   2> 1369 T112 oass.OpenExchangeRatesOrgProvider.init Initialized with rates=open-exchange-rates.json, refreshInterval=1440.
[junit4:junit4]   2> 1380 T112 oass.IndexSchema.readSchema default search field in schema is text
[junit4:junit4]   2> 1384 T112 oass.IndexSchema.readSchema unique key field: id
[junit4:junit4]   2> 1406 T112 oass.FileExchangeRateProvider.reload Reloading exchange rates from file currency.xml
[junit4:junit4]   2> 1412 T112 oass.FileExchangeRateProvider.reload Reloading exchange rates from file currency.xml
[junit4:junit4]   2> 1417 T112 oass.OpenExchangeRatesOrgProvider.reload Reloading exchange rates from open-exchange-rates.json
[junit4:junit4]   2> 1420 T112 oass.OpenExchangeRatesOrgProvider.reload Reloading exchange rates from open-exchange-rates.json
[junit4:junit4]   2> 1422 T112 oasc.SolrCore.<init> [collection1] Opening new SolrCore at /usr/home/hudson/hudson-slave/workspace/Lucene-Solr-Tests-4.x-java7/solr/build/solr-core/test-files/solr/collection1/, dataDir=./org.apache.solr.cloud.BasicDistributedZk2Test-1347686588405/control/data/
[junit4:junit4]   2> 1423 T112 oasc.JmxMonitoredMap.<init> JMX monitoring is enabled. Adding Solr mbeans to JMX Server: com.sun.jmx.mbeanserver.JmxMBeanServer@601f7f3e
[junit4:junit4]   2> 1456 T112 oasc.SolrCore.getNewIndexDir WARNING New index directory detected: old=null new=./org.apache.solr.cloud.BasicDistributedZk2Test-1347686588405/control/data/index/
[junit4:junit4]   2> 1458 T112 oasc.SolrCore.initIndex WARNING [collection1] Solr index directory './org.apache.solr.cloud.BasicDistributedZk2Test-1347686588405/control/data/index' doesn't exist. Creating new index...
[junit4:junit4]   2> 1459 T112 oasc.CachingDirectoryFactory.get return new directory for /usr/home/hudson/hudson-slave/workspace/Lucene-Solr-Tests-4.x-java7/solr/build/solr-core/test/J1/./org.apache.solr.cloud.BasicDistributedZk2Test-1347686588405/control/data/index forceNew:false
[junit4:junit4]   2> 1477 T112 oasc.SolrDeletionPolicy.onCommit SolrDeletionPolicy.onCommit: commits:num=1
[junit4:junit4]   2> 		commit{dir=NRTCachingDirectory(org.apache.lucene.store.NIOFSDirectory@/usr/home/hudson/hudson-slave/workspace/Lucene-Solr-Tests-4.x-java7/solr/build/solr-core/test/J1/org.apache.solr.cloud.BasicDistributedZk2Test-1347686588405/control/data/index lockFactory=org.apache.lucene.store.NativeFSLockFactory@62c360a5; maxCacheMB=48.0 maxMergeSizeMB=4.0),segFN=segments_1,generation=1,filenames=[segments_1]
[junit4:junit4]   2> 1477 T112 oasc.SolrDeletionPolicy.updateCommits newest commit = 1
[junit4:junit4]   2> 1479 T112 oasc.SolrCore.initWriters created xml: solr.XMLResponseWriter
[junit4:junit4]   2> 1481 T112 oasup.UpdateRequestProcessorChain.init inserting DistributedUpdateProcessorFactory into updateRequestProcessorChain "dedupe"
[junit4:junit4]   2> 1482 T112 oasup.UpdateRequestProcessorChain.init inserting DistributedUpdateProcessorFactory into updateRequestProcessorChain "dedupe-allfields"
[junit4:junit4]   2> 1482 T112 oasup.UpdateRequestProcessorChain.init inserting DistributedUpdateProcessorFactory into updateRequestProcessorChain "stored_sig"
[junit4:junit4]   2> 1483 T112 oasup.UpdateRequestProcessorChain.init inserting DistributedUpdateProcessorFactory into updateRequestProcessorChain "uniq-fields"
[junit4:junit4]   2> 1484 T112 oasup.UpdateRequestProcessorChain.init inserting DistributedUpdateProcessorFactory into updateRequestProcessorChain "distrib-dup-test-chain-implicit"
[junit4:junit4]   2> 1484 T112 oasc.RequestHandlers.initHandlersFromConfig adding lazy requestHandler: solr.ReplicationHandler
[junit4:junit4]   2> 1485 T112 oasc.RequestHandlers.initHandlersFromConfig created /replication: solr.ReplicationHandler
[junit4:junit4]   2> 1486 T112 oasc.RequestHandlers.initHandlersFromConfig created standard: solr.StandardRequestHandler
[junit4:junit4]   2> 1486 T112 oasc.RequestHandlers.initHandlersFromConfig created /get: solr.RealTimeGetHandler
[junit4:junit4]   2> 1487 T112 oasc.RequestHandlers.initHandlersFromConfig created dismax: solr.SearchHandler
[junit4:junit4]   2> 1488 T112 oasc.RequestHandlers.initHandlersFromConfig created mock: org.apache.solr.core.MockQuerySenderListenerReqHandler
[junit4:junit4]   2> 1489 T112 oasc.RequestHandlers.initHandlersFromConfig created /admin/: org.apache.solr.handler.admin.AdminHandlers
[junit4:junit4]   2> 1489 T112 oasc.RequestHandlers.initHandlersFromConfig created defaults: solr.StandardRequestHandler
[junit4:junit4]   2> 1490 T112 oasc.RequestHandlers.initHandlersFromConfig adding lazy requestHandler: solr.StandardRequestHandler
[junit4:junit4]   2> 1490 T112 oasc.RequestHandlers.initHandlersFromConfig created lazy: solr.StandardRequestHandler
[junit4:junit4]   2> 1491 T112 oasc.RequestHandlers.initHandlersFromConfig created /update: solr.UpdateRequestHandler
[junit4:junit4]   2> 1492 T112 oasc.RequestHandlers.initHandlersFromConfig created /terms: org.apache.solr.handler.component.SearchHandler
[junit4:junit4]   2> 1492 T112 oasc.RequestHandlers.initHandlersFromConfig created spellCheckCompRH: org.apache.solr.handler.component.SearchHandler
[junit4:junit4]   2> 1493 T112 oasc.RequestHandlers.initHandlersFromConfig created spellCheckCompRH_Direct: org.apache.solr.handler.component.SearchHandler
[junit4:junit4]   2> 1494 T112 oasc.RequestHandlers.initHandlersFromConfig created spellCheckWithWordbreak: org.apache.solr.handler.component.SearchHandler
[junit4:junit4]   2> 1494 T112 oasc.RequestHandlers.initHandlersFromConfig created spellCheckWithWordbreak_Direct: org.apache.solr.handler.component.SearchHandler
[junit4:junit4]   2> 1495 T112 oasc.RequestHandlers.initHandlersFromConfig created spellCheckCompRH1: org.apache.solr.handler.component.SearchHandler
[junit4:junit4]   2> 1496 T112 oasc.RequestHandlers.initHandlersFromConfig created tvrh: org.apache.solr.handler.component.SearchHandler
[junit4:junit4]   2> 1496 T112 oasc.RequestHandlers.initHandlersFromConfig created /mlt: solr.MoreLikeThisHandler
[junit4:junit4]   2> 1497 T112 oasc.RequestHandlers.initHandlersFromConfig created /debug/dump: solr.DumpRequestHandler
[junit4:junit4]   2> 1501 T112 oashl.XMLLoader.init xsltCacheLifetimeSeconds=60
[junit4:junit4]   2> 1506 T112 oasc.SolrCore.initDeprecatedSupport WARNING solrconfig.xml uses deprecated <admin/gettableFiles>, Please update your config to use the ShowFileRequestHandler.
[junit4:junit4]   2> 1507 T112 oasc.SolrCore.initDeprecatedSupport WARNING adding ShowFileRequestHandler with hidden files: [SCHEMA.XML, OLD_SYNONYMS.TXT, STOPWORDS.TXT, PROTWORDS.TXT, OPEN-EXCHANGE-RATES.JSON, SYNONYMS.TXT, CURRENCY.XML, MAPPING-ISOLATIN1ACCENT.TXT]
[junit4:junit4]   2> 1511 T112 oass.SolrIndexSearcher.<init> Opening Searcher@4a01c5f2 main
[junit4:junit4]   2> 1513 T112 oasu.CommitTracker.<init> Hard AutoCommit: disabled
[junit4:junit4]   2> 1513 T112 oasu.CommitTracker.<init> Soft AutoCommit: disabled
[junit4:junit4]   2> 1514 T112 oashc.SpellCheckComponent.inform Initializing spell checkers
[junit4:junit4]   2> 1523 T112 oass.DirectSolrSpellChecker.init init: {name=direct,classname=DirectSolrSpellChecker,field=lowerfilt,minQueryLength=3}
[junit4:junit4]   2> 1583 T135 oasc.SolrCore.registerSearcher [collection1] Registered new searcher Searcher@4a01c5f2 main{StandardDirectoryReader(segments_1:1)}
[junit4:junit4]   2> 1589 T117 oazs.PrepRequestProcessor.pRequest Got user-level KeeperException when processing sessionid:0x139c8615ffb0002 type:create cxid:0x56 zxid:0xfffffffffffffffe txntype:unknown reqpath:n/a Error Path:/solr/overseer/queue Error:KeeperErrorCode = NoNode for /solr/overseer/queue
[junit4:junit4]   2> 1600 T112 oasc.CoreContainer.register registering core: collection1
[junit4:junit4]   2> 1601 T112 oasc.ZkController.register Register shard - core:collection1 address:http://127.0.0.1:29328/solr shardId:control_shard
[junit4:junit4]   2> 1602 T112 oascc.SolrZkClient.makePath makePath: /collections/control_collection/leader_elect/control_shard/election
[junit4:junit4]   2> 1620 T117 oazs.PrepRequestProcessor.pRequest Got user-level KeeperException when processing sessionid:0x139c8615ffb0002 type:delete cxid:0x65 zxid:0xfffffffffffffffe txntype:unknown reqpath:n/a Error Path:/solr/collections/control_collection/leaders Error:KeeperErrorCode = NoNode for /solr/collections/control_collection/leaders
[junit4:junit4]   2> 1621 T112 oasc.ShardLeaderElectionContext.runLeaderProcess Running the leader process.
[junit4:junit4]   2> 1622 T117 oazs.PrepRequestProcessor.pRequest Got user-level KeeperException when processing sessionid:0x139c8615ffb0002 type:create cxid:0x66 zxid:0xfffffffffffffffe txntype:unknown reqpath:n/a Error Path:/solr/overseer Error:KeeperErrorCode = NodeExists for /solr/overseer
[junit4:junit4]   2> 2066 T133 oascc.ZkStateReader.updateClusterState Updating cloud state from ZooKeeper... 
[junit4:junit4]   2> 2068 T117 oazs.PrepRequestProcessor.pRequest Got user-level KeeperException when processing sessionid:0x139c8615ffb0002 type:create cxid:0x6d zxid:0xfffffffffffffffe txntype:unknown reqpath:n/a Error Path:/solr/overseer/queue-work Error:KeeperErrorCode = NoNode for /solr/overseer/queue-work
[junit4:junit4]   2> 2115 T132 oascc.ZkStateReader$2.process A cluster state change has occurred - updating...
[junit4:junit4]   2> 2133 T112 oasc.ShardLeaderElectionContext.waitForReplicasToComeUp Enough replicas found to continue.
[junit4:junit4]   2> 2134 T112 oasc.ShardLeaderElectionContext.runLeaderProcess I may be the new leader - try and sync
[junit4:junit4]   2> 2135 T112 oasc.SyncStrategy.sync Sync replicas to http://127.0.0.1:29328/solr/collection1/
[junit4:junit4]   2> 2135 T112 oasc.SyncStrategy.syncReplicas Sync Success - now sync replicas to me
[junit4:junit4]   2> 2136 T112 oasc.SyncStrategy.syncToMe http://127.0.0.1:29328/solr/collection1/ has no replicas
[junit4:junit4]   2> 2136 T112 oasc.ShardLeaderElectionContext.runLeaderProcess I am the new leader: http://127.0.0.1:29328/solr/collection1/
[junit4:junit4]   2> 2137 T112 oascc.SolrZkClient.makePath makePath: /collections/control_collection/leaders/control_shard
[junit4:junit4]   2> 2152 T117 oazs.PrepRequestProcessor.pRequest Got user-level KeeperException when processing sessionid:0x139c8615ffb0002 type:create cxid:0x8b zxid:0xfffffffffffffffe txntype:unknown reqpath:n/a Error Path:/solr/overseer Error:KeeperErrorCode = NodeExists for /solr/overseer
[junit4:junit4]   2> 2634 T133 oascc.ZkStateReader.updateClusterState Updating cloud state from ZooKeeper... 
[junit4:junit4]   2> 2650 T132 oascc.ZkStateReader$2.process A cluster state change has occurred - updating...
[junit4:junit4]   2> 2666 T112 oasc.ZkController.register We are http://127.0.0.1:29328/solr/collection1/ and leader is http://127.0.0.1:29328/solr/collection1/
[junit4:junit4]   2> 2666 T112 oasc.ZkController.register No LogReplay needed for core=collection1 baseURL=http://127.0.0.1:29328/solr
[junit4:junit4]   2> 2667 T112 oasc.ZkController.checkRecovery I am the leader, no recovery necessary
[junit4:junit4]   2> 2670 T112 oascc.ZkStateReader.updateClusterState Updating cloud state from ZooKeeper... 
[junit4:junit4]   2> 2671 T112 oass.SolrDispatchFilter.init user.dir=/usr/home/hudson/hudson-slave/workspace/Lucene-Solr-Tests-4.x-java7/solr/build/solr-core/test/J1
[junit4:junit4]   2> 2671 T112 oass.SolrDispatchFilter.init SolrDispatchFilter.init() done
[junit4:junit4]   2> 2672 T112 oascsi.HttpClientUtil.createClient Creating new http client, config:maxConnections=128&maxConnectionsPerHost=32&followRedirects=false
[junit4:junit4]   2> 2691 T112 oejs.Server.doStart jetty-8.1.2.v20120308
[junit4:junit4]   2> 2694 T112 oejs.AbstractConnector.doStart Started SocketConnector@0.0.0.0:29336
[junit4:junit4]   2> 2695 T112 oasc.SolrResourceLoader.locateSolrHome JNDI not configured for solr (NoInitialContextEx)
[junit4:junit4]   2> 2696 T112 oasc.SolrResourceLoader.locateSolrHome using system property solr.solr.home: /usr/home/hudson/hudson-slave/workspace/Lucene-Solr-Tests-4.x-java7/solr/build/solr-core/test-files/solr
[junit4:junit4]   2> 2696 T112 oasc.SolrResourceLoader.<init> new SolrResourceLoader for deduced Solr Home: '/usr/home/hudson/hudson-slave/workspace/Lucene-Solr-Tests-4.x-java7/solr/build/solr-core/test-files/solr/'
[junit4:junit4]   2> 2745 T112 oass.SolrDispatchFilter.init SolrDispatchFilter.init()
[junit4:junit4]   2> 2746 T112 oasc.SolrResourceLoader.locateSolrHome JNDI not configured for solr (NoInitialContextEx)
[junit4:junit4]   2> 2746 T112 oasc.SolrResourceLoader.locateSolrHome using system property solr.solr.home: /usr/home/hudson/hudson-slave/workspace/Lucene-Solr-Tests-4.x-java7/solr/build/solr-core/test-files/solr
[junit4:junit4]   2> 2747 T112 oasc.CoreContainer$Initializer.initialize looking for solr.xml: /usr/home/hudson/hudson-slave/workspace/Lucene-Solr-Tests-4.x-java7/solr/build/solr-core/test-files/solr/solr.xml
[junit4:junit4]   2> 2748 T112 oasc.CoreContainer.<init> New CoreContainer 956863727
[junit4:junit4]   2> 2748 T112 oasc.CoreContainer.load Loading CoreContainer using Solr Home: '/usr/home/hudson/hudson-slave/workspace/Lucene-Solr-Tests-4.x-java7/solr/build/solr-core/test-files/solr/'
[junit4:junit4]   2> 2749 T112 oasc.SolrResourceLoader.<init> new SolrResourceLoader for directory: '/usr/home/hudson/hudson-slave/workspace/Lucene-Solr-Tests-4.x-java7/solr/build/solr-core/test-files/solr/'
[junit4:junit4]   2> 2786 T112 oasc.CoreContainer.load Registering Log Listener
[junit4:junit4]   2> 2804 T112 oasc.CoreContainer.initZooKeeper Zookeeper client=127.0.0.1:29325/solr
[junit4:junit4]   2> 2805 T112 oaz.ZooKeeper.<init> Initiating client connection, connectString=127.0.0.1:29325/solr sessionTimeout=5000 watcher=org.apache.solr.common.cloud.ConnectionManager@17f9959e
[junit4:junit4]   2> 2806 T145 oaz.ClientCnxn$SendThread.startConnect Opening socket connection to server /127.0.0.1:29325
[junit4:junit4]   2> 2806 T112 oascc.ConnectionManager.waitForConnected Waiting for client to connect to ZooKeeper
[junit4:junit4]   2> 2807 T145 oaz.ClientCnxn$SendThread.primeConnection Socket connection established to localhost/127.0.0.1:29325, initiating session
[junit4:junit4]   2> 2807 T114 oazs.NIOServerCnxn$Factory.run Accepted socket connection from /140.211.11.196:29337
[junit4:junit4]   2> 2808 T114 oazs.NIOServerCnxn.readConnectRequest Client attempting to establish new session at /140.211.11.196:29337
[junit4:junit4]   2> 2813 T116 oazs.NIOServerCnxn.finishSessionInit Established session 0x139c8615ffb0003 with negotiated timeout 5000 for client /140.211.11.196:29337
[junit4:junit4]   2> 2813 T145 oaz.ClientCnxn$SendThread.readConnectResult Session establishment complete on server localhost/127.0.0.1:29325, sessionid = 0x139c8615ffb0003, negotiated timeout = 5000
[junit4:junit4]   2> 2814 T146 oascc.ConnectionManager.process Watcher org.apache.solr.common.cloud.ConnectionManager@17f9959e name:ZooKeeperConnection Watcher:127.0.0.1:29325/solr got event WatchedEvent state:SyncConnected type:None path:null path:null type:None
[junit4:junit4]   2> 2814 T112 oascc.ConnectionManager.waitForConnected Client is connected to ZooKeeper
[junit4:junit4]   2> 2816 T117 oazs.PrepRequestProcessor.pRequest Got user-level KeeperException when processing sessionid:0x139c8615ffb0003 type:create cxid:0x1 zxid:0xfffffffffffffffe txntype:unknown reqpath:n/a Error Path:/solr/overseer Error:KeeperErrorCode = NodeExists for /solr/overseer
[junit4:junit4]   2> 2817 T117 oazs.PrepRequestProcessor.pRequest Got user-level KeeperException when processing sessionid:0x139c8615ffb0003 type:create cxid:0x2 zxid:0xfffffffffffffffe txntype:unknown reqpath:n/a Error Path:/solr/overseer Error:KeeperErrorCode = NodeExists for /solr/overseer
[junit4:junit4]   2> 2819 T112 oasc.ZkController.createEphemeralLiveNode Register node as live in ZooKeeper:/live_nodes/127.0.0.1:29336_solr
[junit4:junit4]   2> 2820 T117 oazs.PrepRequestProcessor.pRequest Got user-level KeeperException when processing sessionid:0x139c8615ffb0003 type:delete cxid:0x4 zxid:0xfffffffffffffffe txntype:unknown reqpath:n/a Error Path:/solr/live_nodes/127.0.0.1:29336_solr Error:KeeperErrorCode = NoNode for /solr/live_nodes/127.0.0.1:29336_solr
[junit4:junit4]   2> 2828 T112 oascc.SolrZkClient.makePath makePath: /live_nodes/127.0.0.1:29336_solr
[junit4:junit4]   2> 2831 T132 oascc.ZkStateReader$3.process Updating live nodes
[junit4:junit4]   2> 2832 T112 oashc.HttpShardHandlerFactory.getParameter Setting socketTimeout to: 0
[junit4:junit4]   2> 2833 T112 oashc.HttpShardHandlerFactory.getParameter Setting urlScheme to: http://
[junit4:junit4]   2> 2833 T112 oashc.HttpShardHandlerFactory.getParameter Setting connTimeout to: 0
[junit4:junit4]   2> 2834 T112 oashc.HttpShardHandlerFactory.getParameter Setting maxConnectionsPerHost to: 20
[junit4:junit4]   2> 2834 T112 oashc.HttpShardHandlerFactory.getParameter Setting corePoolSize to: 0
[junit4:junit4]   2> 2835 T112 oashc.HttpShardHandlerFactory.getParameter Setting maximumPoolSize to: 2147483647
[junit4:junit4]   2> 2836 T112 oashc.HttpShardHandlerFactory.getParameter Setting maxThreadIdleTime to: 5
[junit4:junit4]   2> 2836 T112 oashc.HttpShardHandlerFactory.getParameter Setting sizeOfQueue to: -1
[junit4:junit4]   2> 2837 T112 oashc.HttpShardHandlerFactory.getParameter Setting fairnessPolicy to: false
[junit4:junit4]   2> 2837 T112 oascsi.HttpClientUtil.createClient Creating new http client, config:maxConnectionsPerHost=20&maxConnections=10000&socketTimeout=0&connTimeout=0&retry=false
[junit4:junit4]   2> 2858 T112 oascc.ZkStateReader.createClusterStateWatchersAndUpdate Updating cluster state from ZooKeeper... 
[junit4:junit4]   2> 2866 T112 oasc.CoreContainer.create Creating SolrCore 'collection1' using instanceDir: /usr/home/hudson/hudson-slave/workspace/Lucene-Solr-Tests-4.x-java7/solr/build/solr-core/test-files/solr/collection1
[junit4:junit4]   2> 2866 T112 oasc.ZkController.createCollectionZkNode Check for collection zkNode:collection1
[junit4:junit4]   2> 2868 T112 oasc.ZkController.createCollectionZkNode Collection zkNode exists
[junit4:junit4]   2> 2868 T112 oasc.ZkController.readConfigName Load collection config from:/collections/collection1
[junit4:junit4]   2> 2870 T112 oasc.SolrResourceLoader.<init> new SolrResourceLoader for directory: '/usr/home/hudson/hudson-slave/workspace/Lucene-Solr-Tests-4.x-java7/solr/build/solr-core/test-files/solr/collection1/'
[junit4:junit4]   2> 2871 T112 oasc.SolrResourceLoader.replaceClassLoader Adding 'file:/usr/home/hudson/hudson-slave/workspace/Lucene-Solr-Tests-4.x-java7/solr/build/solr-core/test-files/solr/collection1/lib/classes/' to classloader
[junit4:junit4]   2> 2872 T112 oasc.SolrResourceLoader.replaceClassLoader Adding 'file:/usr/home/hudson/hudson-slave/workspace/Lucene-Solr-Tests-4.x-java7/solr/build/solr-core/test-files/solr/collection1/lib/README' to classloader
[junit4:junit4]   2> 2928 T112 oasc.SolrConfig.<init> Using Lucene MatchVersion: LUCENE_40
[junit4:junit4]   2> 3014 T112 oasc.SolrConfig.<init> Loaded SolrConfig: solrconfig.xml
[junit4:junit4]   2> 3116 T112 oass.IndexSchema.readSchema Reading Solr Schema
[junit4:junit4]   2> 3124 T112 oass.IndexSchema.readSchema Schema name=test
[junit4:junit4]   2> 3157 T133 oascc.ZkStateReader.updateClusterState Updating cloud state from ZooKeeper... 
[junit4:junit4]   2> 3171 T146 oascc.ZkStateReader$2.process A cluster state change has occurred - updating...
[junit4:junit4]   2> 3171 T132 oascc.ZkStateReader$2.process A cluster state change has occurred - updating...
[junit4:junit4]   2> 3797 T112 oass.OpenExchangeRatesOrgProvider.init Initialized with rates=open-exchange-rates.json, refreshInterval=1440.
[junit4:junit4]   2> 3810 T112 oass.IndexSchema.readSchema default search field in schema is text
[junit4:junit4]   2> 3814 T112 oass.IndexSchema.readSchema unique key field: id
[junit4:junit4]   2> 3837 T112 oass.FileExchangeRateProvider.reload Reloading exchange rates from file currency.xml
[junit4:junit4]   2> 3844 T112 oass.FileExchangeRateProvider.reload Reloading exchange rates from file currency.xml
[junit4:junit4]   2> 3849 T112 oass.OpenExchangeRatesOrgProvider.reload Reloading exchange rates from open-exchange-rates.json
[junit4:junit4]   2> 3852 T112 oass.OpenExchangeRatesOrgProvider.reload Reloading exchange rates from open-exchange-rates.json
[junit4:junit4]   2> 3855 T112 oasc.SolrCore.<init> [collection1] Opening new SolrCore at /usr/home/hudson/hudson-slave/workspace/Lucene-Solr-Tests-4.x-java7/solr/build/solr-core/test-files/solr/collection1/, dataDir=./org.apache.solr.cloud.BasicDistributedZk2Test-1347686588405/jetty1/
[junit4:junit4]   2> 3855 T112 oasc.JmxMonitoredMap.<init> JMX monitoring is enabled. Adding Solr mbeans to JMX Server: com.sun.jmx.mbeanserver.JmxMBeanServer@601f7f3e
[junit4:junit4]   2> 3857 T112 oasc.SolrCore.getNewIndexDir WARNING New index directory detected: old=null new=./org.apache.solr.cloud.BasicDistributedZk2Test-1347686588405/jetty1/index/
[junit4:junit4]   2> 3858 T112 oasc.SolrCore.initIndex WARNING [collection1] Solr index directory './org.apache.solr.cloud.BasicDistributedZk2Test-1347686588405/jetty1/index' doesn't exist. Creating new index...
[junit4:junit4]   2> 3859 T112 oasc.CachingDirectoryFactory.get return new directory for /usr/home/hudson/hudson-slave/workspace/Lucene-Solr-Tests-4.x-java7/solr/build/solr-core/test/J1/./org.apache.solr.cloud.BasicDistributedZk2Test-1347686588405/jetty1/index forceNew:false
[junit4:junit4]   2> 3908 T112 oasc.SolrDeletionPolicy.onCommit SolrDeletionPolicy.onCommit: commits:num=1
[junit4:junit4]   2> 		commit{dir=NRTCachingDirectory(org.apache.lucene.store.NIOFSDirectory@/usr/home/hudson/hudson-slave/workspace/Lucene-Solr-Tests-4.x-java7/solr/build/solr-core/test/J1/org.apache.solr.cloud.BasicDistributedZk2Test-1347686588405/jetty1/index lockFactory=org.apache.lucene.store.NativeFSLockFactory@6747fee2; maxCacheMB=48.0 maxMergeSizeMB=4.0),segFN=segments_1,generation=1,filenames=[segments_1]
[junit4:junit4]   2> 3909 T112 oasc.SolrDeletionPolicy.updateCommits newest commit = 1
[junit4:junit4]   2> 3910 T112 oasc.SolrCore.initWriters created xml: solr.XMLResponseWriter
[junit4:junit4]   2> 3915 T112 oasup.UpdateRequestProcessorChain.init inserting DistributedUpdateProcessorFactory into updateRequestProcessorChain "dedupe"
[junit4:junit4]   2> 3916 T112 oasup.UpdateRequestProcessorChain.init inserting DistributedUpdateProcessorFactory into updateRequestProcessorChain "dedupe-allfields"
[junit4:junit4]   2> 3916 T112 oasup.UpdateRequestProcessorChain.init inserting DistributedUpdateProcessorFactory into updateRequestProcessorChain "stored_sig"
[junit4:junit4]   2> 3917 T112 oasup.UpdateRequestProcessorChain.init inserting DistributedUpdateProcessorFactory into updateRequestProcessorChain "uniq-fields"
[junit4:junit4]   2> 3919 T112 oasup.UpdateRequestProcessorChain.init inserting DistributedUpdateProcessorFactory into updateRequestProcessorChain "distrib-dup-test-chain-implicit"
[junit4:junit4]   2> 3919 T112 oasc.RequestHandlers.initHandlersFromConfig adding lazy requestHandler: solr.ReplicationHandler
[junit4:junit4]   2> 3920 T112 oasc.RequestHandlers.initHandlersFromConfig created /replication: solr.ReplicationHandler
[junit4:junit4]   2> 3921 T112 oasc.RequestHandlers.initHandlersFromConfig created standard: solr.StandardRequestHandler
[junit4:junit4]   2> 3922 T112 oasc.RequestHandlers.initHandlersFromConfig created /get: solr.RealTimeGetHandler
[junit4:junit4]   2> 3923 T112 oasc.RequestHandlers.initHandlersFromConfig created dismax: solr.SearchHandler
[junit4:junit4]   2> 3924 T112 oasc.RequestHandlers.initHandlersFromConfig created mock: org.apache.solr.core.MockQuerySenderListenerReqHandler
[junit4:junit4]   2> 3925 T112 oasc.RequestHandlers.initHandlersFromConfig created /admin/: org.apache.solr.handler.admin.AdminHandlers
[junit4:junit4]   2> 3926 T112 oasc.RequestHandlers.initHandlersFromConfig created defaults: solr.StandardRequestHandler
[junit4:junit4]   2> 3926 T112 oasc.RequestHandlers.initHandlersFromConfig adding lazy requestHandler: solr.StandardRequestHandler
[junit4:junit4]   2> 3927 T112 oasc.RequestHandlers.initHandlersFromConfig created lazy: solr.StandardRequestHandler
[junit4:junit4]   2> 3928 T112 oasc.RequestHandlers.initHandlersFromConfig created /update: solr.UpdateRequestHandler
[junit4:junit4]   2> 3929 T112 oasc.RequestHandlers.initHandlersFromConfig created /terms: org.apache.solr.handler.component.SearchHandler
[junit4:junit4]   2> 3929 T112 oasc.RequestHandlers.initHandlersFromConfig created spellCheckCompRH: org.apache.solr.handler.component.SearchHandler
[junit4:junit4]   2> 3930 T112 oasc.RequestHandlers.initHandlersFromConfig created spellCheckCompRH_Direct: org.apache.solr.handler.component.SearchHandler
[junit4:junit4]   2> 3931 T112 oasc.RequestHandlers.initHandlersFromConfig created spellCheckWithWordbreak: org.apache.solr.handler.component.SearchHandler
[junit4:junit4]   2> 3932 T112 oasc.RequestHandlers.initHandlersFromConfig created spellCheckWithWordbreak_Direct: org.apache.solr.handler.component.SearchHandler
[junit4:junit4]   2> 3933 T112 oasc.RequestHandlers.initHandlersFromConfig created spellCheckCompRH1: org.apache.solr.handler.component.SearchHandler
[junit4:junit4]   2> 3935 T112 oasc.RequestHandlers.initHandlersFromConfig created tvrh: org.apache.solr.handler.component.SearchHandler
[junit4:junit4]   2> 3936 T112 oasc.RequestHandlers.initHandlersFromConfig created /mlt: solr.MoreLikeThisHandler
[junit4:junit4]   2> 3937 T112 oasc.RequestHandlers.initHandlersFromConfig created /debug/dump: solr.DumpRequestHandler
[junit4:junit4]   2> 3941 T112 oashl.XMLLoader.init xsltCacheLifetimeSeconds=60
[junit4:junit4]   2> 3946 T112 oasc.SolrCore.initDeprecatedSupport WARNING solrconfig.xml uses deprecated <admin/gettableFiles>, Please update your config to use the ShowFileRequestHandler.
[junit4:junit4]   2> 3948 T112 oasc.SolrCore.initDeprecatedSupport WARNING adding ShowFileRequestHandler with hidden files: [SCHEMA.XML, OLD_SYNONYMS.TXT, STOPWORDS.TXT, PROTWORDS.TXT, OPEN-EXCHANGE-RATES.JSON, SYNONYMS.TXT, CURRENCY.XML, MAPPING-ISOLATIN1ACCENT.TXT]
[junit4:junit4]   2> 3953 T112 oass.SolrIndexSearcher.<init> Opening Searcher@6484f8e6 main
[junit4:junit4]   2> 3955 T112 oasu.CommitTracker.<init> Hard AutoCommit: disabled
[junit4:junit4]   2> 3955 T112 oasu.CommitTracker.<init> Soft AutoCommit: disabled
[junit4:junit4]   2> 3956 T112 oashc.SpellCheckComponent.inform Initializing spell checkers
[junit4:junit4]   2> 3990 T112 oass.DirectSolrSpellChecker.init init: {name=direct,classname=DirectSolrSpellChecker,field=lowerfilt,minQueryLength=3}
[junit4:junit4]   2> 4216 T147 oasc.SolrCore.registerSearcher [collection1] Registered new searcher Searcher@6484f8e6 main{StandardDirectoryReader(segments_1:1)}
[junit4:junit4]   2> 4683 T133 oascc.ZkStateReader.updateClusterState Updating cloud state from ZooKeeper... 
[junit4:junit4]   2> 4696 T132 oascc.ZkStateReader$2.process A cluster state change has occurred - updating...
[junit4:junit4]   2> 4696 T146 oascc.ZkStateReader$2.process A cluster state change has occurred - updating...
[junit4:junit4]   2> 4736 T112 oasc.CoreContainer.register registering core: collection1
[junit4:junit4]   2> 4736 T112 oasc.ZkController.register Register shard - core:collection1 address:http://127.0.0.1:29336/solr shardId:shard1
[junit4:junit4]   2> 4738 T112 oascc.SolrZkClient.makePath makePath: /collections/collection1/leader_elect/shard1/election
[junit4:junit4]   2> 4758 T117 oazs.PrepRequestProcessor.pRequest Got user-level KeeperException when processing sessionid:0x139c8615ffb0003 type:delete cxid:0x43 zxid:0xfffffffffffffffe txntype:unknown reqpath:n/a Error Path:/solr/collections/collection1/leaders Error:KeeperErrorCode = NoNode for /solr/collections/collection1/leaders
[junit4:junit4]   2> 4759 T112 oasc.ShardLeaderElectionContext.runLeaderProcess Running the leader process.
[junit4:junit4]   2> 4760 T117 oazs.PrepRequestProcessor.pRequest Got user-level KeeperException when processing sessionid:0x139c8615ffb0003 type:create cxid:0x44 zxid:0xfffffffffffffffe txntype:unknown reqpath:n/a Error Path:/solr/overseer Error:KeeperErrorCode = NodeExists for /solr/overseer
[junit4:junit4]   2> 4770 T112 oasc.ShardLeaderElectionContext.waitForReplicasToComeUp Enough replicas found to continue.
[junit4:junit4]   2> 4771 T112 oasc.ShardLeaderElectionContext.runLeaderProcess I may be the new leader - try and sync
[junit4:junit4]   2> 4771 T112 oasc.SyncStrategy.sync Sync replicas to http://127.0.0.1:29336/solr/collection1/
[junit4:junit4]   2> 4771 T112 oasc.SyncStrategy.syncReplicas Sync Success - now sync replicas to me
[junit4:junit4]   2> 4772 T112 oasc.SyncStrategy.syncToMe http://127.0.0.1:29336/solr/collection1/ has no replicas
[junit4:junit4]   2> 4772 T112 oasc.ShardLeaderElectionContext.runLeaderProcess I am the new leader: http://127.0.0.1:29336/solr/collection1/
[junit4:junit4]   2> 4773 T112 oascc.SolrZkClient.makePath makePath: /collections/collection1/leaders/shard1
[junit4:junit4]   2> 4779 T117 oazs.PrepRequestProcessor.pRequest Got user-level KeeperException when processing sessionid:0x139c8615ffb0003 type:create cxid:0x4e zxid:0xfffffffffffffffe txntype:unknown reqpath:n/a Error Path:/solr/overseer Error:KeeperErrorCode = NodeExists for /solr/overseer
[junit4:junit4]   2> 5214 T133 oascc.ZkStateReader.updateClusterState Updating cloud state from ZooKeeper... 
[junit4:junit4]   2> 5236 T132 oascc.ZkStateReader$2.process A cluster state change has occurred - updating...
[junit4:junit4]   2> 5236 T146 oascc.ZkStateReader$2.process A cluster state change has occurred - updating...
[junit4:junit4]   2> 5261 T112 oasc.ZkController.register We are http://127.0.0.1:29336/solr/collection1/ and leader is http://127.0.0.1:29336/solr/collection1/
[junit4:junit4]   2> 5261 T112 oasc.ZkController.register No LogReplay needed for core=collection1 baseURL=http://127.0.0.1:29336/solr
[junit4:junit4]   2> 5262 T112 oasc.ZkController.checkRecovery I am the leader, no recovery necessary
[junit4:junit4]   2> 5265 T112 oascc.ZkStateReader.updateClusterState Updating cloud state from ZooKeeper... 
[junit4:junit4]   2> 5267 T112 oass.SolrDispatchFilter.init user.dir=/usr/home/hudson/hudson-slave/workspace/Lucene-Solr-Tests-4.x-java7/solr/build/solr-core/test/J1
[junit4:junit4]   2> 5267 T112 oass.SolrDispatchFilter.init SolrDispatchFilter.init() done
[junit4:junit4]   2> 5268 T112 oascsi.HttpClientUtil.createClient Creating new http client, config:maxConnections=128&maxConnectionsPerHost=32&followRedirects=false
[junit4:junit4]   2> 5291 T112 oejs.Server.doStart jetty-8.1.2.v20120308
[junit4:junit4]   2> 5294 T112 oejs.AbstractConnector.doStart Started SocketConnector@0.0.0.0:29344
[junit4:junit4]   2> 5295 T112 oasc.SolrResourceLoader.locateSolrHome JNDI not configured for solr (NoInitialContextEx)
[junit4:junit4]   2> 5296 T112 oasc.SolrResourceLoader.locateSolrHome using system property solr.solr.home: /usr/home/hudson/hudson-slave/workspace/Lucene-Solr-Tests-4.x-java7/solr/build/solr-core/test-files/solr
[junit4:junit4]   2> 5296 T112 oasc.SolrResourceLoader.<init> new SolrResourceLoader for deduced Solr Home: '/usr/home/hudson/hudson-slave/workspace/Lucene-Solr-Tests-4.x-java7/solr/build/solr-core/test-files/solr/'
[junit4:junit4]   2> 5344 T112 oass.SolrDispatchFilter.init SolrDispatchFilter.init()
[junit4:junit4]   2> 5345 T112 oasc.SolrResourceLoader.locateSolrHome JNDI not configured for solr (NoInitialContextEx)
[junit4:junit4]   2> 5345 T112 oasc.SolrResourceLoader.locateSolrHome using system property solr.solr.home: /usr/home/hudson/hudson-slave/workspace/Lucene-Solr-Tests-4.x-java7/solr/build/solr-core/test-files/solr
[junit4:junit4]   2> 5346 T112 oasc.CoreContainer$Initializer.initialize looking for solr.xml: /usr/home/hudson/hudson-slave/workspace/Lucene-Solr-Tests-4.x-java7/solr/build/solr-core/test-files/solr/solr.xml
[junit4:junit4]   2> 5346 T112 oasc.CoreContainer.<init> New CoreContainer 1189276245
[junit4:junit4]   2> 5347 T112 oasc.CoreContainer.load Loading CoreContainer using Solr Home: '/usr/home/hudson/hudson-slave/workspace/Lucene-Solr-Tests-4.x-java7/solr/build/solr-core/test-files/solr/'
[junit4:junit4]   2> 5348 T112 oasc.SolrResourceLoader.<init> new SolrResourceLoader for directory: '/usr/home/hudson/hudson-slave/workspace/Lucene-Solr-Tests-4.x-java7/solr/build/solr-core/test-files/solr/'
[junit4:junit4]   2> 5386 T112 oasc.CoreContainer.load Registering Log Listener
[junit4:junit4]   2> 5405 T112 oasc.CoreContainer.initZooKeeper Zookeeper client=127.0.0.1:29325/solr
[junit4:junit4]   2> 5406 T112 oaz.ZooKeeper.<init> Initiating client connection, connectString=127.0.0.1:29325/solr sessionTimeout=5000 watcher=org.apache.solr.common.cloud.ConnectionManager@73e4ad43
[junit4:junit4]   2> 5407 T157 oaz.ClientCnxn$SendThread.startConnect Opening socket connection to server /127.0.0.1:29325
[junit4:junit4]   2> 5407 T112 oascc.ConnectionManager.waitForConnected Waiting for client to connect to ZooKeeper
[junit4:junit4]   2> 5409 T157 oaz.ClientCnxn$SendThread.primeConnection Socket connection established to localhost/127.0.0.1:29325, initiating session
[junit4:junit4]   2> 5409 T114 oazs.NIOServerCnxn$Factory.run Accepted socket connection from /140.211.11.196:29345
[junit4:junit4]   2> 5410 T114 oazs.NIOServerCnxn.readConnectRequest Client attempting to establish new session at /140.211.11.196:29345
[junit4:junit4]   2> 5412 T116 oazs.NIOServerCnxn.finishSessionInit Established session 0x139c8615ffb0004 with negotiated timeout 5000 for client /140.211.11.196:29345
[junit4:junit4]   2> 5412 T157 oaz.ClientCnxn$SendThread.readConnectResult Session establishment complete on server localhost/127.0.0.1:29325, sessionid = 0x139c8615ffb0004, negotiated timeout = 5000
[junit4:junit4]   2> 5413 T158 oascc.ConnectionManager.process Watcher org.apache.solr.common.cloud.ConnectionManager@73e4ad43 name:ZooKeeperConnection Watcher:127.0.0.1:29325/solr got event WatchedEvent state:SyncConnected type:None path:null path:null type:None
[junit4:junit4]   2> 5413 T112 oascc.ConnectionManager.waitForConnected Client is connected to ZooKeeper
[junit4:junit4]   2> 5414 T117 oazs.PrepRequestProcessor.pRequest Got user-level KeeperException when processing sessionid:0x139c8615ffb0004 type:create cxid:0x1 zxid:0xfffffffffffffffe txntype:unknown reqpath:n/a Error Path:/solr/overseer Error:KeeperErrorCode = NodeExists for /solr/overseer
[junit4:junit4]   2> 5416 T117 oazs.PrepRequestProcessor.pRequest Got user-level KeeperException when processing sessionid:0x139c8615ffb0004 type:create cxid:0x2 zxid:0xfffffffffffffffe txntype:unknown reqpath:n/a Error Path:/solr/overseer Error:KeeperErrorCode = NodeExists for /solr/overseer
[junit4:junit4]   2> 5424 T112 oasc.ZkController.createEphemeralLiveNode Register node as live in ZooKeeper:/live_nodes/127.0.0.1:29344_solr
[junit4:junit4]   2> 5425 T117 oazs.PrepRequestProcessor.pRequest Got user-level KeeperException when processing sessionid:0x139c8615ffb0004 type:delete cxid:0x4 zxid:0xfffffffffffffffe txntype:unknown reqpath:n/a Error Path:/solr/live_nodes/127.0.0.1:29344_solr Error:KeeperErrorCode = NoNode for /solr/live_nodes/127.0.0.1:29344_solr
[junit4:junit4]   2> 5426 T112 oascc.SolrZkClient.makePath makePath: /live_nodes/127.0.0.1:29344_solr
[junit4:junit4]   2> 5430 T146 oascc.ZkStateReader$3.process Updating live nodes
[junit4:junit4]   2> 5430 T132 oascc.ZkStateReader$3.process Updating live nodes
[junit4:junit4]   2> 5431 T112 oashc.HttpShardHandlerFactory.getParameter Setting socketTimeout to: 0
[junit4:junit4]   2> 5432 T112 oashc.HttpShardHandlerFactory.getParameter Setting urlScheme to: http://
[junit4:junit4]   2> 5432 T112 oashc.HttpShardHandlerFactory.getParameter Setting connTimeout to: 0
[junit4:junit4]   2> 5433 T112 oashc.HttpShardHandlerFactory.getParameter Setting maxConnectionsPerHost to: 20
[junit4:junit4]   2> 5433 T112 oashc.HttpShardHandlerFactory.getParameter Setting corePoolSize to: 0
[junit4:junit4]   2> 5434 T112 oashc.HttpShardHandlerFactory.getParameter Setting maximumPoolSize to: 2147483647
[junit4:junit4]   2> 5434 T112 oashc.HttpShardHandlerFactory.getParameter Setting maxThreadIdleTime to: 5
[junit4:junit4]   2> 5435 T112 oashc.HttpShardHandlerFactory.getParameter Setting sizeOfQueue to: -1
[junit4:junit4]   2> 5435 T112 oashc.HttpShardHandlerFactory.getParameter Setting fairnessPolicy to: false
[junit4:junit4]   2> 5436 T112 oascsi.HttpClientUtil.createClient Creating new http client, config:maxConnectionsPerHost=20&maxConnections=10000&socketTimeout=0&connTimeout=0&retry=false
[junit4:junit4]   2> 5454 T112 oascc.ZkStateReader.createClusterStateWatchersAndUpdate Updating cluster state from ZooKeeper... 
[junit4:junit4]   2> 5470 T112 oasc.CoreContainer.create Creating SolrCore 'collection1' using instanceDir: /usr/home/hudson/hudson-slave/workspace/Lucene-Solr-Tests-4.x-java7/solr/build/solr-core/test-files/solr/collection1
[junit4:junit4]   2> 5471 T112 oasc.ZkController.createCollectionZkNode Check for collection zkNode:collection1
[junit4:junit4]   2> 5472 T112 oasc.ZkController.createCollectionZkNode Collection zkNode exists
[junit4:junit4]   2> 5473 T112 oasc.ZkController.readConfigName Load collection config from:/collections/collection1
[junit4:junit4]   2> 5475 T112 oasc.SolrResourceLoader.<init> new SolrResourceLoader for directory: '/usr/home/hudson/hudson-slave/workspace/Lucene-Solr-Tests-4.x-java7/solr/build/solr-core/test-files/solr/collection1/'
[junit4:junit4]   2> 5477 T112 oasc.SolrResourceLoader.replaceClassLoader Adding 'file:/usr/home/hudson/hudson-slave/workspace/Lucene-Solr-Tests-4.x-java7/solr/build/solr-core/test-files/solr/collection1/lib/classes/' to classloader
[junit4:junit4]   2> 5478 T112 oasc.SolrResourceLoader.replaceClassLoader Adding 'file:/usr/home/hudson/hudson-slave/workspace/Lucene-Solr-Tests-4.x-java7/solr/build/solr-core/test-files/solr/collection1/lib/README' to classloader
[junit4:junit4]   2> 5537 T112 oasc.SolrConfig.<init> Using Lucene MatchVersion: LUCENE_40
[junit4:junit4]   2> 5617 T112 oasc.SolrConfig.<init> Loaded SolrConfig: solrconfig.xml
[junit4:junit4]   2> 5718 T112 oass.IndexSchema.readSchema Reading Solr Schema
[junit4:junit4]   2> 5730 T112 oass.IndexSchema.readSchema Schema name=test
[junit4:junit4]   2> 5752 T133 oascc.ZkStateReader.updateClusterState Updating cloud state from ZooKeeper... 
[junit4:junit4]   2> 5766 T132 oascc.ZkStateReader$2.process A cluster state change has occurred - updating...
[junit4:junit4]   2> 5766 T146 oascc.ZkStateReader$2.process A cluster state change has occurred - updating...
[junit4:junit4]   2> 5766 T158 oascc.ZkStateReader$2.process A cluster state change has occurred - updating...
[junit4:junit4]   2> 6430 T112 oass.OpenExchangeRatesOrgProvider.init Initialized with rates=open-exchange-rates.json, refreshInterval=1440.
[junit4:junit4]   2> 6444 T112 oass.IndexSchema.readSchema default search field in schema is text
[junit4:junit4]   2> 6449 T112 oass.IndexSchema.readSchema unique key field: id
[junit4:junit4]   2> 6472 T112 oass.FileExchangeRateProvider.reload Reloading exchange rates from file currency.xml
[junit4:junit4]   2> 6479 T112 oass.FileExchangeRateProvider.reload Reloading exchange rates from file currency.xml
[junit4:junit4]   2> 6484 T112 oass.OpenExchangeRatesOrgProvider.reload Reloading exchange rates from open-exchange-rates.json
[junit4:junit4]   2> 6487 T112 oass.OpenExchangeRatesOrgProvider.reload Reloading exchange rates from open-exchange-rates.json
[junit4:junit4]   2> 6490 T112 oasc.SolrCore.<init> [collection1] Opening new SolrCore at /usr/home/hudson/hudson-slave/workspace/Lucene-Solr-Tests-4.x-java7/solr/build/solr-core/test-files/solr/collection1/, dataDir=./org.apache.solr.cloud.BasicDistributedZk2Test-1347686588405/jetty2/
[junit4:junit4]   2> 6491 T112 oasc.JmxMonitoredMap.<init> JMX monitoring is enabled. Adding Solr mbeans to JMX Server: com.sun.jmx.mbeanserver.JmxMBeanServer@601f7f3e
[junit4:junit4]   2> 6492 T112 oasc.SolrCore.getNewIndexDir WARNING New index directory detected: old=null new=./org.apache.solr.cloud.BasicDistributedZk2Test-1347686588405/jetty2/index/
[junit4:junit4]   2> 6493 T112 oasc.SolrCore.initIndex WARNING [collection1] Solr index directory './org.apache.solr.cloud.BasicDistributedZk2Test-1347686588405/jetty2/index' doesn't exist. Creating new index...
[junit4:junit4]   2> 6495 T112 oasc.CachingDirectoryFactory.get return new directory for /usr/home/hudson/hudson-slave/workspace/Lucene-Solr-Tests-4.x-java7/solr/build/solr-core/test/J1/./org.apache.solr.cloud.BasicDistributedZk2Test-1347686588405/jetty2/index forceNew:false
[junit4:junit4]   2> 6507 T112 oasc.SolrDeletionPolicy.onCommit SolrDeletionPolicy.onCommit: commits:num=1
[junit4:junit4]   2> 		commit{dir=NRTCachingDirectory(org.apache.lucene.store.NIOFSDirectory@/usr/home/hudson/hudson-slave/workspace/Lucene-Solr-Tests-4.x-java7/solr/build/solr-core/test/J1/org.apache.solr.cloud.BasicDistributedZk2Test-1347686588405/jetty2/index lockFactory=org.apache.lucene.store.NativeFSLockFactory@3a64fcde; maxCacheMB=48.0 maxMergeSizeMB=4.0),segFN=segments_1,generation=1,filenames=[segments_1]
[junit4:junit4]   2> 6508 T112 oasc.SolrDeletionPolicy.updateCommits newest commit = 1
[junit4:junit4]   2> 6509 T112 oasc.SolrCore.initWriters created xml: solr.XMLResponseWriter
[junit4:junit4]   2> 6512 T112 oasup.UpdateRequestProcessorChain.init inserting DistributedUpdateProcessorFactory into updateRequestProcessorChain "dedupe"
[junit4:junit4]   2> 6513 T112 oasup.UpdateRequestProcessorChain.init inserting DistributedUpdateProcessorFactory into updateRequestProcessorChain "dedupe-allfields"
[junit4:junit4]   2> 6514 T112 oasup.UpdateRequestProcessorChain.init inserting DistributedUpdateProcessorFactory into updateRequestProcessorChain "stored_sig"
[junit4:junit4]   2> 6514 T112 oasup.UpdateRequestProcessorChain.init inserting DistributedUpdateProcessorFactory into updateRequestProcessorChain "uniq-fields"
[junit4:junit4]   2> 6515 T112 oasup.UpdateRequestProcessorChain.init inserting DistributedUpdateProcessorFactory into updateRequestProcessorChain "distrib-dup-test-chain-implicit"
[junit4:junit4]   2> 6516 T112 oasc.RequestHandlers.initHandlersFromConfig adding lazy requestHandler: solr.ReplicationHandler
[junit4:junit4]   2> 6517 T112 oasc.RequestHandlers.initHandlersFromConfig created /replication: solr.ReplicationHandler
[junit4:junit4]   2> 6518 T112 oasc.RequestHandlers.initHandlersFromConfig created standard: solr.StandardRequestHandler
[junit4:junit4]   2> 6519 T112 oasc.RequestHandlers.initHandlersFromConfig created /get: solr.RealTimeGetHandler
[junit4:junit4]   2> 6520 T112 oasc.RequestHandlers.initHandlersFromConfig created dismax: solr.SearchHandler
[junit4:junit4]   2> 6520 T112 oasc.RequestHandlers.initHandlersFromConfig created mock: org.apache.solr.core.MockQuerySenderListenerReqHandler
[junit4:junit4]   2> 6521 T112 oasc.RequestHandlers.initHandlersFromConfig created /admin/: org.apache.solr.handler.admin.AdminHandlers
[junit4:junit4]   2> 6522 T112 oasc.RequestHandlers.initHandlersFromConfig created defaults: solr.StandardRequestHandler
[junit4:junit4]   2> 6523 T112 oasc.RequestHandlers.initHandlersFromConfig adding lazy requestHandler: solr.StandardRequestHandler
[junit4:junit4]   2> 6524 T112 oasc.RequestHandlers.initHandlersFromConfig created lazy: solr.StandardRequestHandler
[junit4:junit4]   2> 6524 T112 oasc.RequestHandlers.initHandlersFromConfig created /update: solr.UpdateRequestHandler
[junit4:junit4]   2> 6525 T112 oasc.RequestHandlers.initHandlersFromConfig created /terms: org.apache.solr.handler.component.SearchHandler
[junit4:junit4]   2> 6526 T112 oasc.RequestHandlers.initHandlersFromConfig created spellCheckCompRH: org.apache.solr.handler.component.SearchHandler
[junit4:junit4]   2> 6527 T112 oasc.RequestHandlers.initHandlersFromConfig created spellCheckCompRH_Direct: org.apache.solr.handler.component.SearchHandler
[junit4:junit4]   2> 6528 T112 oasc.RequestHandlers.initHandlersFromConfig created spellCheckWithWordbreak: org.apache.solr.handler.component.SearchHandler
[junit4:junit4]   2> 6529 T112 oasc.RequestHandlers.initHandlersFromConfig created spellCheckWithWordbreak_Direct: org.apache.solr.handler.component.SearchHandler
[junit4:junit4]   2> 6530 T112 oasc.RequestHandlers.initHandlersFromConfig created spellCheckCompRH1: org.apache.solr.handler.component.SearchHandler
[junit4:junit4]   2> 6531 T112 oasc.RequestHandlers.initHandlersFromConfig created tvrh: org.apache.solr.handler.component.SearchHandler
[junit4:junit4]   2> 6532 T112 oasc.RequestHandlers.initHandlersFromConfig created /mlt: solr.MoreLikeThisHandler
[junit4:junit4]   2> 6533 T112 oasc.RequestHandlers.initHandlersFromConfig created /debug/dump: solr.DumpRequestHandler
[junit4:junit4]   2> 6537 T112 oashl.XMLLoader.init xsltCacheLifetimeSeconds=60
[junit4:junit4]   2> 6543 T112 oasc.SolrCore.initDeprecatedSupport WARNING solrconfig.xml uses deprecated <admin/gettableFiles>, Please update your config to use the ShowFileRequestHandler.
[junit4:junit4]   2> 6545 T112 oasc.SolrCore.initDeprecatedSupport WARNING adding ShowFileRequestHandler with hidden files: [SCHEMA.XML, OLD_SYNONYMS.TXT, STOPWORDS.TXT, PROTWORDS.TXT, OPEN-EXCHANGE-RATES.JSON, SYNONYMS.TXT, CURRENCY.XML, MAPPING-ISOLATIN1ACCENT.TXT]
[junit4:junit4]   2> 6549 T112 oass.SolrIndexSearcher.<init> Opening Searcher@730781bb main
[junit4:junit4]   2> 6551 T112 oasu.CommitTracker.<init> Hard AutoCommit: disabled
[junit4:junit4]   2> 6552 T112 oasu.CommitTracker.<init> Soft AutoCommit: disabled
[junit4:junit4]   2> 6553 T112 oashc.SpellCheckComponent.inform Initializing spell checkers
[junit4:junit4]   2> 6562 T112 oass.DirectSolrSpellChecker.init init: {name=direct,classname=DirectSolrSpellChecker,field=lowerfilt,minQueryLength=3}
[junit4:junit4]   2> 6629 T159 oasc.SolrCore.registerSearcher [collection1] Registered new searcher Searcher@730781bb main{StandardDirectoryReader(segments_1:1)}
[junit4:junit4]   2> 6777 T133 oascc.ZkStateReader.updateClusterState Updating cloud state from ZooKeeper... 
[junit4:junit4]   2> 6791 T158 oascc.ZkStateReader$2.process A cluster state change has occurred - updating...
[junit4:junit4]   2> 6791 T132 oascc.ZkStateReader$2.process A cluster state change has occurred - updating...
[junit4:junit4]   2> 6791 T146 oascc.ZkStateReader$2.process A cluster state change has occurred - updating...
[junit4:junit4]   2> 7140 T112 oasc.CoreContainer.register registering core: collection1
[junit4:junit4]   2> 7141 T112 oasc.ZkController.register Register shard - core:collection1 address:http://127.0.0.1:29344/solr shardId:shard2
[junit4:junit4]   2> 7142 T112 oascc.SolrZkClient.makePath makePath: /collections/collection1/leader_elect/shard2/election
[junit4:junit4]   2> 7159 T117 oazs.PrepRequestProcessor.pRequest Got user-level KeeperException when processing sessionid:0x139c8615ffb0004 type:delete cxid:0x42 zxid:0xfffffffffffffffe txntype:unknown reqpath:n/a Error Path:/solr/collections/collection1/leaders/shard2 Error:KeeperErrorCode = NoNode for /solr/collections/collection1/leaders/shard2
[junit4:junit4]   2> 7161 T112 oasc.ShardLeaderElectionContext.runLeaderProcess Running the leader process.
[junit4:junit4]   2> 7162 T117 oazs.PrepRequestProcessor.pRequest Got user-level KeeperException when processing sessionid:0x139c8615ffb0004 type:create cxid:0x43 zxid:0xfffffffffffffffe txntype:unknown reqpath:n/a Error Path:/solr/overseer Error:KeeperErrorCode = NodeExists for /solr/overseer
[junit4:junit4]   2> 7171 T112 oasc.ShardLeaderElectionContext.waitForReplicasToComeUp Enough replicas found to continue.
[junit4:junit4]   2> 7171 T112 oasc.ShardLeaderElectionContext.runLeaderProcess I may be the new leader - try and sync
[junit4:junit4]   2> 7172 T112 oasc.SyncStrategy.sync Sync replicas to http://127.0.0.1:29344/solr/collection1/
[junit4:junit4]   2> 7173 T112 oasc.SyncStrategy.syncReplicas Sync Success - now sync replicas to me
[junit4:junit4]   2> 7173 T112 oasc.SyncStrategy.syncToMe http://127.0.0.1:29344/solr/collection1/ has no replicas
[junit4:junit4]   2> 7174 T112 oasc.ShardLeaderElectionContext.runLeaderProcess I am the new leader: http://127.0.0.1:29344/solr/collection1/
[junit4:junit4]   2> 7174 T112 oascc.SolrZkClient.makePath makePath: /collections/collection1/leaders/shard2
[junit4:junit4]   2> 7179 T117 oazs.PrepRequestProcessor.pRequest Got user-level KeeperException when processing sessionid:0x139c8615ffb0004 type:create cxid:0x4c zxid:0xfffffffffffffffe txntype:unknown reqpath:n/a Error Path:/solr/overseer Error:KeeperErrorCode = NodeExists for /solr/overseer
[junit4:junit4]   2> 7298 T133 oascc.ZkStateReader.updateClusterState Updating cloud state from ZooKeeper... 
[junit4:junit4]   2> 7324 T132 oascc.ZkStateReader$2.process A cluster state change has occurred - updating...
[junit4:junit4]   2> 7324 T158 oascc.ZkStateReader$2.process A cluster state change has occurred - updating...
[junit4:junit4]   2> 7324 T146 oascc.ZkStateReader$2.process A cluster state change has occurred - updating...
[junit4:junit4]   2> 7341 T112 oasc.ZkController.register We are http://127.0.0.1:29344/solr/collection1/ and leader is http://127.0.0.1:29344/solr/collection1/
[junit4:junit4]   2> 7341 T112 oasc.ZkController.register No LogReplay needed for core=collection1 baseURL=http://127.0.0.1:29344/solr
[junit4:junit4]   2> 7342 T112 oasc.ZkController.checkRecovery I am the leader, no recovery necessary
[junit4:junit4]   2> 7344 T112 oascc.ZkStateReader.updateClusterState Updating cloud state from ZooKeeper... 
[junit4:junit4]   2> 7346 T112 oass.SolrDispatchFilter.init user.dir=/usr/home/hudson/hudson-slave/workspace/Lucene-Solr-Tests-4.x-java7/solr/build/solr-core/test/J1
[junit4:junit4]   2> 7346 T112 oass.SolrDispatchFilter.init SolrDispatchFilter.init() done
[junit4:junit4]   2> 7347 T112 oascsi.HttpClientUtil.createClient Creating new http client, config:maxConnections=128&maxConnectionsPerHost=32&followRedirects=false
[junit4:junit4]   2> 7369 T112 oejs.Server.doStart jetty-8.1.2.v20120308
[junit4:junit4]   2> 7373 T112 oejs.AbstractConnector.doStart Started SocketConnector@0.0.0.0:29348
[junit4:junit4]   2> 7373 T112 oasc.SolrResourceLoader.locateSolrHome JNDI not configured for solr (NoInitialContextEx)
[junit4:junit4]   2> 7374 T112 oasc.SolrResourceLoader.locateSolrHome using system property solr.solr.home: /usr/home/hudson/hudson-slave/workspace/Lucene-Solr-Tests-4.x-java7/solr/build/solr-core/test-files/solr
[junit4:junit4]   2> 7375 T112 oasc.SolrResourceLoader.<init> new SolrResourceLoader for deduced Solr Home: '/usr/home/hudson/hudson-slave/workspace/Lucene-Solr-Tests-4.x-java7/solr/build/solr-core/test-files/solr/'
[junit4:junit4]   2> 7433 T112 oass.SolrDispatchFilter.init SolrDispatchFilter.init()
[junit4:junit4]   2> 7434 T112 oasc.SolrResourceLoader.locateSolrHome JNDI not configured for solr (NoInitialContextEx)
[junit4:junit4]   2> 7434 T112 oasc.SolrResourceLoader.locateSolrHome using system property solr.solr.home: /usr/home/hudson/hudson-slave/workspace/Lucene-Solr-Tests-4.x-java7/solr/build/solr-core/test-files/solr
[junit4:junit4]   2> 7435 T112 oasc.CoreContainer$Initializer.initialize looking for solr.xml: /usr/home/hudson/hudson-slave/workspace/Lucene-Solr-Tests-4.x-java7/solr/build/solr-core/test-files/solr/solr.xml
[junit4:junit4]   2> 7435 T112 oasc.CoreContainer.<init> New CoreContainer 796512881
[junit4:junit4]   2> 7436 T112 oasc.CoreContainer.load Loading CoreContainer using Solr Home: '/usr/home/hudson/hudson-slave/workspace/Lucene-Solr-Tests-4.x-java7/solr/build/solr-core/test-files/solr/'
[junit4:junit4]   2> 7437 T112 oasc.SolrResourceLoader.<init> new SolrResourceLoader for directory: '/usr/home/hudson/hudson-slave/workspace/Lucene-Solr-Tests-4.x-java7/solr/build/solr-core/test-files/solr/'
[junit4:junit4]   2> 7477 T112 oasc.CoreContainer.load Registering Log Listener
[junit4:junit4]   2> 7495 T112 oasc.CoreContainer.initZooKeeper Zookeeper client=127.0.0.1:29325/solr
[junit4:junit4]   2> 7496 T112 oaz.ZooKeeper.<init> Initiating client connection, connectString=127.0.0.1:29325/solr sessionTimeout=5000 watcher=org.apache.solr.common.cloud.ConnectionManager@7a2861a
[junit4:junit4]   2> 7497 T169 oaz.ClientCnxn$SendThread.startConnect Opening socket connection to server /127.0.0.1:29325
[junit4:junit4]   2> 7497 T112 oascc.ConnectionManager.waitForConnected Waiting for client to connect to ZooKeeper
[junit4:junit4]   2> 7499 T169 oaz.ClientCnxn$SendThread.primeConnection Socket connection established to localhost/127.0.0.1:29325, initiating session
[junit4:junit4]   2> 7499 T114 oazs.NIOServerCnxn$Factory.run Accepted socket connection from /140.211.11.196:29349
[junit4:junit4]   2> 7500 T114 oazs.NIOServerCnxn.readConnectRequest Client attempting to establish new session at /140.211.11.196:29349
[junit4:junit4]   2> 7502 T116 oazs.NIOServerCnxn.finishSessionInit Established session 0x139c8615ffb0005 with negotiated timeout 5000 for client /140.211.11.196:29349
[junit4:junit4]   2> 7502 T169 oaz.ClientCnxn$SendThread.readConnectResult Session establishment complete on server localhost/127.0.0.1:29325, sessionid = 0x139c8615ffb0005, negotiated timeout = 5000
[junit4:junit4]   2> 7503 T170 oascc.ConnectionManager.process Watcher org.apache.solr.common.cloud.ConnectionManager@7a2861a name:ZooKeeperConnection Watcher:127.0.0.1:29325/solr got event WatchedEvent state:SyncConnected type:None path:null path:null type:None
[junit4:junit4]   2> 7503 T112 oascc.ConnectionManager.waitForConnected Client is connected to ZooKeeper
[junit4:junit4]   2> 7505 T117 oazs.PrepRequestProcessor.pRequest Got user-level KeeperException when processing sessionid:0x139c8615ffb0005 type:create cxid:0x1 zxid:0xfffffffffffffffe txntype:unknown reqpath:n/a Error Path:/solr/overseer Error:KeeperErrorCode = NodeExists for /solr/overseer
[junit4:junit4]   2> 7515 T117 oazs.PrepRequestProcessor.pRequest Got user-level KeeperException when processing sessionid:0x139c8615ffb0005 type:create cxid:0x2 zxid:0xfffffffffffffffe txntype:unknown reqpath:n/a Error Path:/solr/overseer Error:KeeperErrorCode = NodeExists for /solr/overseer
[junit4:junit4]   2> 7517 T112 oasc.ZkController.createEphemeralLiveNode Register node as live in ZooKeeper:/live_nodes/127.0.0.1:29348_solr
[junit4:junit4]   2> 7518 T117 oazs.PrepRequestProcessor.pRequest Got user-level KeeperException when processing sessionid:0x139c8615ffb0005 type:delete cxid:0x4 zxid:0xfffffffffffffffe txntype:unknown reqpath:n/a Error Path:/solr/live_nodes/127.0.0.1:29348_solr Error:KeeperErrorCode = NoNode for /solr/live_nodes/127.0.0.1:29348_solr
[junit4:junit4]   2> 7520 T112 oascc.SolrZkClient.makePath makePath: /live_nodes/127.0.0.1:29348_solr
[junit4:junit4]   2> 7523 T132 oascc.ZkStateReader$3.process Updating live nodes
[junit4:junit4]   2> 7523 T158 oascc.ZkStateReader$3.process Updating live nodes
[junit4:junit4]   2> 7523 T146 oascc.ZkStateReader$3.process Updating live nodes
[junit4:junit4]   2> 7525 T112 oashc.HttpShardHandlerFactory.getParameter Setting socketTimeout to: 0
[junit4:junit4]   2> 7526 T112 oashc.HttpShardHandlerFactory.getParameter Setting urlScheme to: http://
[junit4:junit4]   2> 7527 T112 oashc.HttpShardHandlerFactory.getParameter Setting connTimeout to: 0
[junit4:junit4]   2> 7528 T112 oashc.HttpShardHandlerFactory.getParameter Setting maxConnectionsPerHost to: 20
[junit4:junit4]   2> 7528 T112 oashc.HttpShardHandlerFactory.getParameter Setting corePoolSize to: 0
[junit4:junit4]   2> 7529 T112 oashc.HttpShardHandlerFactory.getParameter Setting maximumPoolSize to: 2147483647
[junit4:junit4]   2> 7530 T112 oashc.HttpShardHandlerFactory.getParameter Setting maxThreadIdleTime to: 5
[junit4:junit4]   2> 7531 T112 oashc.HttpShardHandlerFactory.getParameter Setting sizeOfQueue to: -1
[junit4:junit4]   2> 7532 T112 oashc.HttpShardHandlerFactory.getParameter Setting fairnessPolicy to: false
[junit4:junit4]   2> 7533 T112 oascsi.HttpClientUtil.createClient Creating new http client, config:maxConnectionsPerHost=20&maxConnections=10000&socketTimeout=0&connTimeout=0&retry=false
[junit4:junit4]   2> 7559 T112 oascc.ZkStateReader.createClusterStateWatchersAndUpdate Updating cluster state from ZooKeeper... 
[junit4:junit4]   2> 7570 T112 oasc.CoreContainer.create Creating SolrCore 'collection1' using instanceDir: /usr/home/hudson/hudson-slave/workspace/Lucene-Solr-Tests-4.x-java7/solr/build/solr-core/test-files/solr/collection1
[junit4:junit4]   2> 7571 T112 oasc.ZkController.createCollectionZkNode Check for collection zkNode:collection1
[junit4:junit4]   2> 7572 T112 oasc.ZkController.createCollectionZkNode Collection zkNode exists
[junit4:junit4]   2> 7573 T112 oasc.ZkController.readConfigName Load collection config from:/collections/collection1
[junit4:junit4]   2> 7575 T112 oasc.SolrResourceLoader.<init> new SolrResourceLoader for directory: '/usr/home/hudson/hudson-slave/workspace/Lucene-Solr-Tests-4.x-java7/solr/build/solr-core/test-files/solr/collection1/'
[junit4:junit4]   2> 7577 T112 oasc.SolrResourceLoader.replaceClassLoader Adding 'file:/usr/home/hudson/hudson-slave/workspace/Lucene-Solr-Tests-4.x-java7/solr/build/solr-core/test-files/solr/collection1/lib/classes/' to classloader
[junit4:junit4]   2> 7579 T112 oasc.SolrResourceLoader.replaceClassLoader Adding 'file:/usr/home/hudson/hudson-slave/workspace/Lucene-Solr-Tests-4.x-java7/solr/build/solr-core/test-files/solr/collection1/lib/README' to classloader
[junit4:junit4]   2> 7651 T112 oasc.SolrConfig.<init> Using Lucene MatchVersion: LUCENE_40
[junit4:junit4]   2> 7755 T112 oasc.SolrConfig.<init> Loaded SolrConfig: solrconfig.xml
[junit4:junit4]   2> 7838 T133 oascc.ZkStateReader.updateClusterState Updating cloud state from ZooKeeper... 
[junit4:junit4]   2> 7853 T158 oascc.ZkStateReader$2.process A cluster state change has occurred - updating...
[junit4:junit4]   2> 7853 T132 oascc.ZkStateReader$2.process A cluster state change has occurred - updating...
[junit4:junit4]   2> 7853 T146 oascc.ZkStateReader$2.process A cluster state change has occurred - updating...
[junit4:junit4]   2> 7857 T170 oascc.ZkStateReader$2.process A cluster state change has occurred - updating...
[junit4:junit4]   2> 7857 T112 oass.IndexSchema.readSchema Reading Solr Schema
[junit4:junit4]   2> 7865 T112 oass.IndexSchema.readSchema Schema name=test
[junit4:junit4]   2> 8765 T112 oass.OpenExchangeRatesOrgProvider.init Initialized with rates=open-exchange-rates.json, refreshInterval=1440.
[junit4:junit4]   2> 8778 T112 oass.IndexSchema.readSchema default search field in schema is text
[junit4:junit4]   2> 8783 T112 oass.IndexSchema.readSchema unique key field: id
[junit4:junit4]   2> 8806 T112 oass.FileExchangeRateProvider.reload Reloading exchange rates from file currency.xml
[junit4:junit4]   2> 8813 T112 oass.FileExchangeRateProvider.reload Reloading exchange rates from file currency.xml
[junit4:junit4]   2> 8819 T112 oass.OpenExchangeRatesOrgProvider.reload Reloading exchange rates from open-exchange-rates.json
[junit4:junit4]   2> 8822 T112 oass.OpenExchangeRatesOrgProvider.reload Reloading exchange rates from open-exchange-rates.json
[junit4:junit4]   2> 8825 T112 oasc.SolrCore.<init> [collection1] Opening new SolrCore at /usr/home/hudson/hudson-slave/workspace/Lucene-Solr-Tests-4.x-java7/solr/build/solr-core/test-files/solr/collection1/, dataDir=./org.apache.solr.cloud.BasicDistributedZk2Test-1347686588405/jetty3/
[junit4:junit4]   2> 8825 T112 oasc.JmxMonitoredMap.<init> JMX monitoring is enabled. Adding Solr mbeans to JMX Server: com.sun.jmx.mbeanserver.JmxMBeanServer@601f7f3e
[junit4:junit4]   2> 8827 T112 oasc.SolrCore.getNewIndexDir WARNING New index directory detected: old=null new=./org.apache.solr.cloud.BasicDistributedZk2Test-1347686588405/jetty3/index/
[junit4:junit4]   2> 8828 T112 oasc.SolrCore.initIndex WARNING [collection1] Solr index directory './org.apache.solr.cloud.BasicDistributedZk2Test-1347686588405/jetty3/index' doesn't exist. Creating new index...
[junit4:junit4]   2> 8829 T112 oasc.CachingDirectoryFactory.get return new directory for /usr/home/hudson/hudson-slave/workspace/Lucene-Solr-Tests-4.x-java7/solr/build/solr-core/test/J1/./org.apache.solr.cloud.BasicDistributedZk2Test-1347686588405/jetty3/index forceNew:false
[junit4:junit4]   2> 8855 T112 oasc.SolrDeletionPolicy.onCommit SolrDeletionPolicy.onCommit: commits:num=1
[junit4:junit4]   2> 		commit{dir=NRTCachingDirectory(org.apache.lucene.store.NIOFSDirectory@/usr/home/hudson/hudson-slave/workspace/Lucene-Solr-Tests-4.x-java7/solr/build/solr-core/test/J1/org.apache.solr.cloud.BasicDistributedZk2Test-1347686588405/jetty3/index lockFactory=org.apache.lucene.store.NativeFSLockFactory@664968be; maxCacheMB=48.0 maxMergeSizeMB=4.0),segFN=segments_1,generation=1,filenames=[segments_1]
[junit4:junit4]   2> 8856 T112 oasc.SolrDeletionPolicy.updateCommits newest commit = 1
[junit4:junit4]   2> 8858 T112 oasc.SolrCore.initWriters created xml: solr.XMLResponseWriter
[junit4:junit4]   2> 8862 T112 oasup.UpdateRequestProcessorChain.init inserting DistributedUpdateProcessorFactory into updateRequestProcessorChain "dedupe"
[junit4:junit4]   2> 8862 T112 oasup.UpdateRequestProcessorChain.init inserting DistributedUpdateProcessorFactory into updateRequestProcessorChain "dedupe-allfields"
[junit4:junit4]   2> 8863 T112 oasup.UpdateRequestProcessorChain.init inserting DistributedUpdateProcessorFactory into updateRequestProcessorChain "stored_sig"
[junit4:junit4]   2> 8864 T112 oasup.UpdateRequestProcessorChain.init inserting DistributedUpdateProcessorFactory into updateRequestProcessorChain "uniq-fields"
[junit4:junit4]   2> 8865 T112 oasup.UpdateRequestProcessorChain.init inserting DistributedUpdateProcessorFactory into updateRequestProcessorChain "distrib-dup-test-chain-implicit"
[junit4:junit4]   2> 8865 T112 oasc.RequestHandlers.initHandlersFromConfig adding lazy requestHandler: solr.ReplicationHandler
[junit4:junit4]   2> 8866 T112 oasc.RequestHandlers.initHandlersFromConfig created /replication: solr.ReplicationHandler
[junit4:junit4]   2> 8867 T112 oasc.RequestHandlers.initHandlersFromConfig created standard: solr.StandardRequestHandler
[junit4:junit4]   2> 8868 T112 oasc.RequestHandlers.initHandlersFromConfig created /get: solr.RealTimeGetHandler
[junit4:junit4]   2> 8869 T112 oasc.RequestHandlers.initHandlersFromConfig created dismax: solr.SearchHandler
[junit4:junit4]   2> 8870 T112 oasc.RequestHandlers.initHandlersFromConfig created mock: org.apache.solr.core.MockQuerySenderListenerReqHandler
[junit4:junit4]   2> 8871 T112 oasc.RequestHandlers.initHandlersFromConfig created /admin/: org.apache.solr.handler.admin.AdminHandlers
[junit4:junit4]   2> 8872 T112 oasc.RequestHandlers.initHandlersFromConfig created defaults: solr.StandardRequestHandler
[junit4:junit4]   2> 8873 T112 oasc.RequestHandlers.initHandlersFromConfig adding lazy requestHandler: solr.StandardRequestHandler
[junit4:junit4]   2> 8874 T112 oasc.RequestHandlers.initHandlersFromConfig created lazy: solr.StandardRequestHandler
[junit4:junit4]   2> 8875 T112 oasc.RequestHandlers.initHandlersFromConfig created /update: solr.UpdateRequestHandler
[junit4:junit4]   2> 8876 T112 oasc.RequestHandlers.initHandlersFromConfig created /terms: org.apache.solr.handler.component.SearchHandler
[junit4:junit4]   2> 8877 T112 oasc.RequestHandlers.initHandlersFromConfig created spellCheckCompRH: org.apache.solr.handler.component.SearchHandler
[junit4:junit4]   2> 8878 T112 oasc.RequestHandlers.initHandlersFromConfig created spellCheckCompRH_Direct: org.apache.solr.handler.component.SearchHandler
[junit4:junit4]   2> 8879 T112 oasc.RequestHandlers.initHandlersFromConfig created spellCheckWithWordbreak: org.apache.solr.handler.component.SearchHandler
[junit4:junit4]   2> 8880 T112 oasc.RequestHandlers.initHandlersFromConfig created spellCheckWithWordbreak_Direct: org.apache.solr.handler.component.SearchHandler
[junit4:junit4]   2> 8881 T112 oasc.RequestHandlers.initHandlersFromConfig created spellCheckCompRH1: org.apache.solr.handler.component.SearchHandler
[junit4:junit4]   2> 8882 T112 oasc.RequestHandlers.initHandlersFromConfig created tvrh: org.apache.solr.handler.component.SearchHandler
[junit4:junit4]   2> 8883 T112 oasc.RequestHandlers.initHandlersFromConfig created /mlt: solr.MoreLikeThisHandler
[junit4:junit4]   2> 8884 T112 oasc.RequestHandlers.initHandlersFromConfig created /debug/dump: solr.DumpRequestHandler
[junit4:junit4]   2> 8888 T112 oashl.XMLLoader.init xsltCacheLifetimeSeconds=60
[junit4:junit4]   2> 8895 T112 oasc.SolrCore.initDeprecatedSupport WARNING solrconfig.xml uses deprecated <admin/gettableFiles>, Please update your config to use the ShowFileRequestHandler.
[junit4:junit4]   2> 8897 T112 oasc.SolrCore.initDeprecatedSupport WARNING adding ShowFileRequestHandler with hidden files: [SCHEMA.XML, OLD_SYNONYMS.TXT, STOPWORDS.TXT, PROTWORDS.TXT, OPEN-EXCHANGE-RATES.JSON, SYNONYMS.TXT, CURRENCY.XML, MAPPING-ISOLATIN1ACCENT.TXT]
[junit4:junit4]   2> 8902 T112 oass.SolrIndexSearcher.<init> Opening Searcher@387eca51 main
[junit4:junit4]   2> 8904 T112 oasu.CommitTracker.<init> Hard AutoCommit: disabled
[junit4:junit4]   2> 8904 T112 oasu.CommitTracker.<init> Soft AutoCommit: disabled
[junit4:junit4]   2> 8905 T112 oashc.SpellCheckComponent.inform Initializing spell checkers
[junit4:junit4]   2> 9108 T112 oass.DirectSolrSpellChecker.init init: {name=direct,classname=DirectSolrSpellChecker,field=lowerfilt,minQueryLength=3}
[junit4:junit4]   2> 9254 T171 oasc.SolrCore.registerSearcher [collection1] Registered new searcher Searcher@387eca51 main{StandardDirectoryReader(segments_1:1)}
[junit4:junit4]   2> 9366 T133 oascc.ZkStateReader.updateClusterState Updating cloud state from ZooKeeper... 
[junit4:junit4]   2> 9445 T146 oascc.ZkStateReader$2.process A cluster state change has occurred - updating...
[junit4:junit4]   2> 9445 T158 oascc.ZkStateReader$2.process A cluster state change has occurred - updating...
[junit4:junit4]   2> 9445 T170 oascc.ZkStateReader$2.process A cluster state change has occurred - updating...
[junit4:junit4]   2> 9445 T132 oascc.ZkStateReader$2.process A cluster state change has occurred - updating...
[junit4:junit4]   2> 9792 T112 oasc.CoreContainer.register registering core: collection1
[junit4:junit4]   2> 9793 T112 oasc.ZkController.register Register shard - core:collection1 address:http://127.0.0.1:29348/solr shardId:shard1
[junit4:junit4]   2> 9797 T112 oasc.ZkController.register We are http://127.0.0.1:29348/solr/collection1/ and leader is http://127.0.0.1:29336/solr/collection1/
[junit4:junit4]   2> 9797 T112 oasc.ZkController.register No LogReplay needed for core=collection1 baseURL=http://127.0.0.1:29348/solr
[junit4:junit4]   2> 9798 T112 oasc.ZkController.checkRecovery Core needs to recover:collection1
[junit4:junit4]   2> 9798 T112 oasu.DefaultSolrCoreState.doRecovery Running recovery - first canceling any ongoing recovery
[junit4:junit4]   2> ASYNC  NEW_CORE C11 name=collection1 org.apache.solr.core.SolrCore@3aa696ef url=http://127.0.0.1:29348/solr/collection1 node=127.0.0.1:29348_solr
[junit4:junit4]   2> 9806 T172 C11 P29348 oasc.RecoveryStrategy.run Starting recovery process.  core=collection1 recoveringAfterStartup=true
[junit4:junit4]   2> 9808 T172 C11 P29348 oasc.RecoveryStrategy.doRecovery ###### startupVersions=[]
[junit4:junit4]   2> 9806 T112 oascc.ZkStateReader.updateClusterState Updating cloud state from ZooKeeper... 
[junit4:junit4]   2> 9820 T172 C11 P29348 oasc.RecoveryStrategy.doRecovery Attempting to PeerSync from http://127.0.0.1:29336/solr/collection1/ core=collection1 - recoveringAfterStartup=true
[junit4:junit4]   2> 9821 T112 oass.SolrDispatchFilter.init user.dir=/usr/home/hudson/hudson-slave/workspace/Lucene-Solr-Tests-4.x-java7/solr/build/solr-core/test/J1
[junit4:junit4]   2> 9821 T112 oass.SolrDispatchFilter.init SolrDispatchFilter.init() done
[junit4:junit4]   2> 9821 T112 oascsi.HttpClientUtil.createClient Creating new http client, config:maxConnections=128&maxConnectionsPerHost=32&followRedirects=false
[junit4:junit4]   2> 9832 T172 C11 P29348 oascsi.HttpClientUtil.createClient Creating new http client, config:maxConnectionsPerHost=20&maxConnections=10000&connTimeout=30000&socketTimeout=30000&retry=false
[junit4:junit4]   2> 9834 T112 oejs.Server.doStart jetty-8.1.2.v20120308
[junit4:junit4]   2> 9836 T112 oejs.AbstractConnector.doStart Started SocketConnector@0.0.0.0:29355
[junit4:junit4]   2> 9837 T112 oasc.SolrResourceLoader.locateSolrHome JNDI not configured for solr (NoInitialContextEx)
[junit4:junit4]   2> 9837 T112 oasc.SolrResourceLoader.locateSolrHome using system property solr.solr.home: /usr/home/hudson/hudson-slave/workspace/Lucene-Solr-Tests-4.x-java7/solr/build/solr-core/test-files/solr
[junit4:junit4]   2> 9837 T112 oasc.SolrResourceLoader.<init> new SolrResourceLoader for deduced Solr Home: '/usr/home/hudson/hudson-slave/workspace/Lucene-Solr-Tests-4.x-java7/solr/build/solr-core/test-files/solr/'
[junit4:junit4]   2> 9854 T172 C11 P29348 oasu.PeerSync.sync PeerSync: core=collection1 url=http://127.0.0.1:29348/solr START replicas=[http://127.0.0.1:29336/solr/collection1/] nUpdates=100
[junit4:junit4]   2> 9855 T172 C11 P29348 oasu.PeerSync.sync WARNING no frame of reference to tell of we've missed updates
[junit4:junit4]   2> 9856 T172 C11 P29348 oasc.RecoveryStrategy.doRecovery PeerSync Recovery was not successful - trying replication. core=collection1
[junit4:junit4]   2> 9857 T172 C11 P29348 oasc.RecoveryStrategy.doRecovery Starting Replication Recovery. core=collection1
[junit4:junit4]   2> 9857 T172 C11 P29348 oascsi.HttpClientUtil.createClient Creating new http client, config:maxConnections=128&maxConnectionsPerHost=32&followRedirects=false
[junit4:junit4]   2> 9890 T112 oass.SolrDispatchFilter.init SolrDispatchFilter.init()
[junit4:junit4]   2> 9891 T112 oasc.SolrResourceLoader.locateSolrHome JNDI not configured for solr (NoInitialContextEx)
[junit4:junit4]   2> 9892 T112 oasc.SolrResourceLoader.locateSolrHome using system property solr.solr.home: /usr/home/hudson/hudson-slave/workspace/Lucene-Solr-Tests-4.x-java7/solr/build/solr-core/test-files/solr
[junit4:junit4]   2> 9893 T112 oasc.CoreContainer$Initializer.initialize looking for solr.xml: /usr/home/hudson/hudson-slave/workspace/Lucene-Solr-Tests-4.x-java7/solr/build/solr-core/test-files/solr/solr.xml
[junit4:junit4]   2> 9893 T112 oasc.CoreContainer.<init> New CoreContainer 113756411
[junit4:junit4]   2> 9894 T112 oasc.CoreContainer.load Loading CoreContainer using Solr Home: '/usr/home/hudson/hudson-slave/workspace/Lucene-Solr-Tests-4.x-java7/solr/build/solr-core/test-files/solr/'
[junit4:junit4]   2> 9895 T112 oasc.SolrResourceLoader.<init> new SolrResourceLoader for directory: '/usr/home/hudson/hudson-slave/workspace/Lucene-Solr-Tests-4.x-java7/solr/build/solr-core/test-files/solr/'
[junit4:junit4]   2> ASYNC  NEW_CORE C12 name=collection1 org.apache.solr.core.SolrCore@bdc6429 url=http://127.0.0.1:29336/solr/collection1 node=127.0.0.1:29336_solr
[junit4:junit4]   2> 9902 T139 C12 P29336 REQ /get {distrib=false&qt=/get&wt=javabin&version=2&getVersions=100} status=0 QTime=1 
[junit4:junit4]   2> 9930 T112 oasc.CoreContainer.load Registering Log Listener
[junit4:junit4]   2> 9947 T112 oasc.CoreContainer.initZooKeeper Zookeeper client=127.0.0.1:29325/solr
[junit4:junit4]   2> 9948 T112 oaz.ZooKeeper.<init> Initiating client connection, connectString=127.0.0.1:29325/solr sessionTimeout=5000 watcher=org.apache.solr.common.cloud.ConnectionManager@2cf10cfc
[junit4:junit4]   2> 9950 T183 oaz.ClientCnxn$SendThread.startConnect Opening socket connection to server /127.0.0.1:29325
[junit4:junit4]   2> 9950 T112 oascc.ConnectionManager.waitForConnected Waiting for client to connect to ZooKeeper
[junit4:junit4]   2> 9951 T183 oaz.ClientCnxn$SendThread.primeConnection Socket connection established to localhost/127.0.0.1:29325, initiating session
[junit4:junit4]   2> 9951 T114 oazs.NIOServerCnxn$Factory.run Accepted socket connection from /140.211.11.196:29358
[junit4:junit4]   2> 9952 T114 oazs.NIOServerCnxn.readConnectRequest Client attempting to establish new session at /140.211.11.196:29358
[junit4:junit4]   2> 9954 T116 oazs.NIOServerCnxn.finishSessionInit Established session 0x139c8615ffb0006 with negotiated timeout 5000 for client /140.211.11.196:29358
[junit4:junit4]   2> 9954 T183 oaz.ClientCnxn$SendThread.readConnectResult Session establishment complete on server localhost/127.0.0.1:29325, sessionid = 0x139c8615ffb0006, negotiated timeout = 5000
[junit4:junit4]   2> 9955 T184 oascc.ConnectionManager.process Watcher org.apache.solr.common.cloud.ConnectionManager@2cf10cfc name:ZooKeeperConnection Watcher:127.0.0.1:29325/solr got event WatchedEvent state:SyncConnected type:None path:null path:null type:None
[junit4:junit4]   2> 9955 T112 oascc.ConnectionManager.waitForConnected Client is connected to ZooKeeper
[junit4:junit4]   2> 9956 T117 oazs.PrepRequestProcessor.pRequest Got user-level KeeperException when processing sessionid:0x139c8615ffb0006 type:create cxid:0x1 zxid:0xfffffffffffffffe txntype:unknown reqpath:n/a Error Path:/solr/overseer Error:KeeperErrorCode = NodeExists for /solr/overseer
[junit4:junit4]   2> 9965 T117 oazs.PrepRequestProcessor.pRequest Got user-level KeeperException when processing sessionid:0x139c8615ffb0006 type:create cxid:0x2 zxid:0xfffffffffffffffe txntype:unknown reqpath:n/a Error Path:/solr/overseer Error:KeeperErrorCode = NodeExists for /solr/overseer
[junit4:junit4]   2> 9967 T112 oasc.ZkController.createEphemeralLiveNode Register node as live in ZooKeeper:/live_nodes/127.0.0.1:29355_solr
[junit4:junit4]   2> 9968 T117 oazs.PrepRequestProcessor.pRequest Got user-level KeeperException when processing sessionid:0x139c8615ffb0006 type:delete cxid:0x4 zxid:0xfffffffffffffffe txntype:unknown reqpath:n/a Error Path:/solr/live_nodes/127.0.0.1:29355_solr Error:KeeperErrorCode = NoNode for /solr/live_nodes/127.0.0.1:29355_solr
[junit4:junit4]   2> 9969 T112 oascc.SolrZkClient.makePath makePath: /live_nodes/127.0.0.1:29355_solr
[junit4:junit4]   2> 9971 T133 oascc.ZkStateReader.updateClusterState Updating cloud state from ZooKeeper... 
[junit4:junit4]   2> 9977 T132 oascc.ZkStateReader$3.process Updating live nodes
[junit4:junit4]   2> 9977 T158 oascc.ZkStateReader$3.process Updating live nodes
[junit4:junit4]   2> 9977 T146 oascc.ZkStateReader$3.process Updating live nodes
[junit4:junit4]   2> 9977 T170 oascc.ZkStateReader$3.process Updating live nodes
[junit4:junit4]   2> 9979 T112 oashc.HttpShardHandlerFactory.getParameter Setting socketTimeout to: 0
[junit4:junit4]   2> 9980 T112 oashc.HttpShardHandlerFactory.getParameter Setting urlScheme to: http://
[junit4:junit4]   2> 9980 T112 oashc.HttpShardHandlerFactory.getParameter Setting connTimeout to: 0
[junit4:junit4]   2> 9981 T112 oashc.HttpShardHandlerFactory.getParameter Setting maxConnectionsPerHost to: 20
[junit4:junit4]   2> 9981 T112 oashc.HttpShardHandlerFactory.getParameter Setting corePoolSize to: 0
[junit4:junit4]   2> 9982 T112 oashc.HttpShardHandlerFactory.getParameter Setting maximumPoolSize to: 2147483647
[junit4:junit4]   2> 9982 T112 oashc.HttpShardHandlerFactory.getParameter Setting maxThreadIdleTime to: 5
[junit4:junit4]   2> 9983 T112 oashc.HttpShardHandlerFactory.getParameter Setting sizeOfQueue to: -1
[junit4:junit4]   2> 9983 T112 oashc.HttpShardHandlerFactory.getParameter Setting fairnessPolicy to: false
[junit4:junit4]   2> 9984 T112 oascsi.HttpClientUtil.createClient Creating new http client, config:maxConnectionsPerHost=20&maxConnections=10000&socketTimeout=0&connTimeout=0&retry=false
[junit4:junit4]   2> 9989 T170 oascc.ZkStateReader$2.process A cluster state change has occurred - updating...
[junit4:junit4]   2> 9989 T146 oascc.ZkStateReader$2.process A cluster state change has occurred - updating...
[junit4:junit4]   2> 9989 T158 oascc.ZkStateReader$2.process A cluster state change has occurred - updating...
[junit4:junit4]   2> 9992 T132 oascc.ZkStateReader$2.process A cluster state change has occurred - updating...
[junit4:junit4]   2> 9999 T112 oascc.ZkStateReader.createClusterStateWatchersAndUpdate Updating cluster state from ZooKeeper... 
[junit4:junit4]   2> 10007 T112 oasc.CoreContainer.create Creating SolrCore 'collection1' using instanceDir: /usr/home/hudson/hudson-slave/workspace/Lucene-Solr-Tests-4.x-java7/solr/build/solr-core/test-files/solr/collection1
[junit4:junit4]   2> 10007 T112 oasc.ZkController.createCollectionZkNode Check for collection zkNode:collection1
[junit4:junit4]   2> 10008 T112 oasc.ZkController.createCollectionZkNode Collection zkNode exists
[junit4:junit4]   2> 10009 T112 oasc.ZkController.readConfigName Load collection config from:/collections/collection1
[junit4:junit4]   2> 10010 T112 oasc.SolrResourceLoader.<init> new SolrResourceLoader for directory: '/usr/home/hudson/hudson-slave/workspace/Lucene-Solr-Tests-4.x-java7/solr/build/solr-core/test-files/solr/collection1/'
[junit4:junit4]   2> 10012 T112 oasc.SolrResourceLoader.replaceClassLoader Adding 'file:/usr/home/hudson/hudson-slave/workspace/Lucene-Solr-Tests-4.x-java7/solr/build/solr-core/test-files/solr/collection1/lib/classes/' to classloader
[junit4:junit4]   2> 10013 T112 oasc.SolrResourceLoader.replaceClassLoader Adding 'file:/usr/home/hudson/hudson-slave/workspace/Lucene-Solr-Tests-4.x-java7/solr/build/solr-core/test-files/solr/collection1/lib/README' to classloader
[junit4:junit4]   2> 10076 T112 oasc.SolrConfig.<init> Using Lucene MatchVersion: LUCENE_40
[junit4:junit4]   2> 10153 T112 oasc.SolrConfig.<init> Loaded SolrConfig: solrconfig.xml
[junit4:junit4]   2> 10254 T112 oass.IndexSchema.readSchema Reading Solr Schema
[junit4:junit4]   2> 10263 T112 oass.IndexSchema.readSchema Schema name=test
[junit4:junit4]   2> 10927 T112 oass.OpenExchangeRatesOrgProvider.init Initialized with rates=open-exchange-rates.json, refreshInterval=1440.
[junit4:junit4]   2> 10938 T112 oass.IndexSchema.readSchema default search field in schema is text
[junit4:junit4]   2> 10941 T112 oass.IndexSchema.readSchema unique key field: id
[junit4:junit4]   2> 10959 T112 oass.FileExchangeRateProvider.reload Reloading exchange rates from file currency.xml
[junit4:junit4]   2> 10963 T112 oass.FileExchangeRateProvider.reload Reloading exchange rates from file currency.xml
[junit4:junit4]   2> 10968 T112 oass.OpenExchangeRatesOrgProvider.reload Reloading exchange rates from open-exchange-rates.json
[junit4:junit4]   2> 10970 T112 oass.OpenExchangeRatesOrgProvider.reload Reloading exchange rates from open-exchange-rates.json
[junit4:junit4]   2> 10971 T112 oasc.SolrCore.<init> [collection1] Opening new SolrCore at /usr/home/hudson/hudson-slave/workspace/Lucene-Solr-Tests-4.x-java7/solr/build/solr-core/test-files/solr/collection1/, dataDir=./org.apache.solr.cloud.BasicDistributedZk2Test-1347686588405/jetty4/
[junit4:junit4]   2> 10972 T112 oasc.JmxMonitoredMap.<init> JMX monitoring is enabled. Adding Solr mbeans to JMX Server: com.sun.jmx.mbeanserver.JmxMBeanServer@601f7f3e
[junit4:junit4]   2> 10973 T112 oasc.SolrCore.getNewIndexDir WARNING New index directory detected: old=null new=./org.apache.solr.cloud.BasicDistributedZk2Test-1347686588405/jetty4/index/
[junit4:junit4]   2> 10973 T112 oasc.SolrCore.initIndex WARNING [collection1] Solr index directory './org.apache.solr.cloud.BasicDistributedZk2Test-1347686588405/jetty4/index' doesn't exist. Creating new index...
[junit4:junit4]   2> 10974 T112 oasc.CachingDirectoryFactory.get return new directory for /usr/home/hudson/hudson-slave/workspace/Lucene-Solr-Tests-4.x-java7/solr/build/solr-core/test/J1/./org.apache.solr.cloud.BasicDistributedZk2Test-1347686588405/jetty4/index forceNew:false
[junit4:junit4]   2> 10980 T112 oasc.SolrDeletionPolicy.onCommit SolrDeletionPolicy.onCommit: commits:num=1
[junit4:junit4]   2> 		commit{dir=NRTCachingDirectory(org.apache.lucene.store.NIOFSDirectory@/usr/home/hudson/hudson-slave/workspace/Lucene-Solr-Tests-4.x-java7/solr/build/solr-core/test/J1/org.apache.solr.cloud.BasicDistributedZk2Test-1347686588405/jetty4/index lockFactory=org.apache.lucene.store.NativeFSLockFactory@5eb1b21a; maxCacheMB=48.0 maxMergeSizeMB=4.0),segFN=segments_1,generation=1,filenames=[segments_1]
[junit4:junit4]   2> 10980 T112 oasc.SolrDeletionPolicy.updateCommits newest commit = 1
[junit4:junit4]   2> 10981 T112 oasc.SolrCore.initWriters created xml: solr.XMLResponseWriter
[junit4:junit4]   2> 10983 T112 oasup.UpdateRequestProcessorChain.init inserting DistributedUpdateProcessorFactory into updateRequestProcessorChain "dedupe"
[junit4:junit4]   2> 10984 T112 oasup.UpdateRequestProcessorChain.init inserting DistributedUpdateProcessorFactory into updateRequestProcessorChain "dedupe-allfields"
[junit4:junit4]   2> 10984 T112 oasup.UpdateRequestProcessorChain.init inserting DistributedUpdateProcessorFactory into updateRequestProcessorChain "stored_sig"
[junit4:junit4]   2> 10985 T112 oasup.UpdateRequestProcessorChain.init inserting DistributedUpdateProcessorFactory into updateRequestProcessorChain "uniq-fields"
[junit4:junit4]   2> 10985 T112 oasup.UpdateRequestProcessorChain.init inserting DistributedUpdateProcessorFactory into updateRequestProcessorChain "distrib-dup-test-chain-implicit"
[junit4:junit4]   2> 10986 T112 oasc.RequestHandlers.initHandlersFromConfig adding lazy requestHandler: solr.ReplicationHandler
[junit4:junit4]   2> 10986 T112 oasc.RequestHandlers.initHandlersFromConfig created /replication: solr.ReplicationHandler
[junit4:junit4]   2> 10987 T112 oasc.RequestHandlers.initHandlersFromConfig created standard: solr.StandardRequestHandler
[junit4:junit4]   2> 10987 T112 oasc.RequestHandlers.initHandlersFromConfig created /get: solr.RealTimeGetHandler
[junit4:junit4]   2> 10988 T112 oasc.RequestHandlers.initHandlersFromConfig created dismax: solr.SearchHandler
[junit4:junit4]   2> 10989 T112 oasc.RequestHandlers.initHandlersFromConfig created mock: org.apache.solr.core.MockQuerySenderListenerReqHandler
[junit4:junit4]   2> 10989 T112 oasc.RequestHandlers.initHandlersFromConfig created /admin/: org.apache.solr.handler.admin.AdminHandlers
[junit4:junit4]   2> 10990 T112 oasc.RequestHandlers.initHandlersFromConfig created defaults: solr.StandardRequestHandler
[junit4:junit4]   2> 10990 T112 oasc.RequestHandlers.initHandlersFromConfig adding lazy requestHandler: solr.StandardRequestHandler
[junit4:junit4]   2> 10991 T112 oasc.RequestHandlers.initHandlersFromConfig created lazy: solr.StandardRequestHandler
[junit4:junit4]   2> 10991 T112 oasc.RequestHandlers.initHandlersFromConfig created /update: solr.UpdateRequestHandler
[junit4:junit4]   2> 10992 T112 oasc.RequestHandlers.initHandlersFromConfig created /terms: org.apache.solr.handler.component.SearchHandler
[junit4:junit4]   2> 10992 T112 oasc.RequestHandlers.initHandlersFromConfig created spellCheckCompRH: org.apache.solr.handler.component.SearchHandler
[junit4:junit4]   2> 10993 T112 oasc.RequestHandlers.initHandlersFromConfig created spellCheckCompRH_Direct: org.apache.solr.handler.component.SearchHandler
[junit4:junit4]   2> 10994 T112 oasc.RequestHandlers.initHandlersFromConfig created spellCheckWithWordbreak: org.apache.solr.handler.component.SearchHandler
[junit4:junit4]   2> 10994 T112 oasc.RequestHandlers.initHandlersFromConfig created spellCheckWithWordbreak_Direct: org.apache.solr.handler.component.SearchHandler
[junit4:junit4]   2> 10995 T112 oasc.RequestHandlers.initHandlersFromConfig created spellCheckCompRH1: org.apache.solr.handler.component.SearchHandler
[junit4:junit4]   2> 10995 T112 oasc.RequestHandlers.initHandlersFromConfig created tvrh: org.apache.solr.handler.component.SearchHandler
[junit4:junit4]   2> 10996 T112 oasc.RequestHandlers.initHandlersFromConfig created /mlt: solr.MoreLikeThisHandler
[junit4:junit4]   2> 10997 T112 oasc.RequestHandlers.initHandlersFromConfig created /debug/dump: solr.DumpRequestHandler
[junit4:junit4]   2> 10999 T112 oashl.XMLLoader.init xsltCacheLifetimeSeconds=60
[junit4:junit4]   2> 11003 T112 oasc.SolrCore.initDeprecatedSupport WARNING solrconfig.xml uses deprecated <admin/gettableFiles>, Please update your config to use the ShowFileRequestHandler.
[junit4:junit4]   2> 11005 T112 oasc.SolrCore.initDeprecatedSupport WARNING adding ShowFileRequestHandler with hidden files: [SCHEMA.XML, OLD_SYNONYMS.TXT, STOPWORDS.TXT, PROTWORDS.TXT, OPEN-EXCHANGE-RATES.JSON, SYNONYMS.TXT, CURRENCY.XML, MAPPING-ISOLATIN1ACCENT.TXT]
[junit4:junit4]   2> 11008 T112 oass.SolrIndexSearcher.<init> Opening Searcher@3c7f7489 main
[junit4:junit4]   2> 11009 T112 oasu.CommitTracker.<init> Hard AutoCommit: disabled
[junit4:junit4]   2> 11009 T112 oasu.CommitTracker.<init> Soft AutoCommit: disabled
[junit4:junit4]   2> 11010 T112 oashc.SpellCheckComponent.inform Initializing spell checkers
[junit4:junit4]   2> 11016 T112 oass.DirectSolrSpellChecker.init init: {name=direct,classname=DirectSolrSpellChecker,field=lowerfilt,minQueryLength=3}
[junit4:junit4]   2> 11061 T185 oasc.SolrCore.registerSearcher [collection1] Registered new searcher Searcher@3c7f7489 main{StandardDirectoryReader(segments_1:1)}
[junit4:junit4]   2> 11499 T133 oascc.ZkStateReader.updateClusterState Updating cloud state from ZooKeeper... 
[junit4:junit4]   2> 11513 T132 oascc.ZkStateReader$2.process A cluster state change has occurred - updating...
[junit4:junit4]   2> 11513 T184 oascc.ZkStateReader$2.process A cluster state change has occurred - updating...
[junit4:junit4]   2> 11513 T146 oascc.ZkStateReader$2.process A cluster state change has occurred - updating...
[junit4:junit4]   2> 11513 T170 oascc.ZkStateReader$2.process A cluster state change has occurred - updating...
[junit4:junit4]   2> 11513 T158 oascc.ZkStateReader$2.process A cluster state change has occurred - updating...
[junit4:junit4]   2> 11568 T112 oasc.CoreContainer.register registering core: collection1
[junit4:junit4]   2> 11568 T112 oasc.ZkController.register Register shard - core:collection1 address:http://127.0.0.1:29355/solr shardId:shard2
[junit4:junit4]   2> 11572 T112 oasc.ZkController.register We are http://127.0.0.1:29355/solr/collection1/ and leader is http://127.0.0.1:29344/solr/collection1/
[junit4:junit4]   2> 11573 T112 oasc.ZkController.register No LogReplay needed for core=collection1 baseURL=http://127.0.0.1:29355/solr
[junit4:junit4]   2> 11573 T112 oasc.ZkController.checkRecovery Core needs to recover:collection1
[junit4:junit4]   2> 11573 T112 oasu.DefaultSolrCoreState.doRecovery Running recovery - first canceling any ongoing recovery
[junit4:junit4]   2> ASYNC  NEW_CORE C13 name=collection1 org.apache.solr.core.SolrCore@ec01643 url=http://127.0.0.1:29355/solr/collection1 node=127.0.0.1:29355_solr
[junit4:junit4]   2> 11574 T186 C13 P29355 oasc.RecoveryStrategy.run Starting recovery process.  core=collection1 recoveringAfterStartup=true
[junit4:junit4]   2> 11575 T186 C13 P29355 oasc.RecoveryStrategy.doRecovery ###### startupVersions=[]
[junit4:junit4]   2> 11575 T112 oascc.ZkStateReader.updateClusterState Updating cloud state from ZooKeeper... 
[junit4:junit4]   2> 11576 T186 C13 P29355 oasc.RecoveryStrategy.doRecovery Attempting to PeerSync from http://127.0.0.1:29344/solr/collection1/ core=collection1 - recoveringAfterStartup=true
[junit4:junit4]   2> 11576 T186 C13 P29355 oasu.PeerSync.sync PeerSync: core=collection1 url=http://127.0.0.1:29355/solr START replicas=[http://127.0.0.1:29344/solr/collection1/] nUpdates=100
[junit4:junit4]   2> 11576 T112 oass.SolrDispatchFilter.init user.dir=/usr/home/hudson/hudson-slave/workspace/Lucene-Solr-Tests-4.x-java7/solr/build/solr-core/test/J1
[junit4:junit4]   2> 11577 T186 C13 P29355 oasu.PeerSync.sync WARNING no frame of reference to tell of we've missed updates
[junit4:junit4]   2> 11577 T112 oass.SolrDispatchFilter.init SolrDispatchFilter.init() done
[junit4:junit4]   2> 11577 T186 C13 P29355 oasc.RecoveryStrategy.doRecovery PeerSync Recovery was not successful - trying replication. core=collection1
[junit4:junit4]   2> 11577 T186 C13 P29355 oasc.RecoveryStrategy.doRecovery Starting Replication Recovery. core=collection1
[junit4:junit4]   2> 11577 T112 oascsi.HttpClientUtil.createClient Creating new http client, config:maxConnections=128&maxConnectionsPerHost=32&followRedirects=false
[junit4:junit4]   2> 11578 T186 C13 P29355 oascsi.HttpClientUtil.createClient Creating new http client, config:maxConnections=128&maxConnectionsPerHost=32&followRedirects=false
[junit4:junit4]   2> ASYNC  NEW_CORE C14 name=collection1 org.apache.solr.core.SolrCore@c19900e url=http://127.0.0.1:29344/solr/collection1 node=127.0.0.1:29344_solr
[junit4:junit4]   2> 11585 T150 C14 P29344 REQ /get {distrib=false&qt=/get&wt=javabin&version=2&getVersions=100} status=0 QTime=1 
[junit4:junit4]   2> 11595 T112 oaz.ZooKeeper.<init> Initiating client connection, connectString=127.0.0.1:29325/solr sessionTimeout=10000 watcher=org.apache.solr.common.cloud.ConnectionManager@18d2ef22
[junit4:junit4]   2> 11596 T188 oaz.ClientCnxn$SendThread.startConnect Opening socket connection to server /127.0.0.1:29325
[junit4:junit4]   2> 11596 T112 oascc.ConnectionManager.waitForConnected Waiting for client to connect to ZooKeeper
[junit4:junit4]   2> 11597 T188 oaz.ClientCnxn$SendThread.primeConnection Socket connection established to localhost/127.0.0.1:29325, initiating session
[junit4:junit4]   2> 11597 T114 oazs.NIOServerCnxn$Factory.run Accepted socket connection from /140.211.11.196:29366
[junit4:junit4]   2> 11597 T114 oazs.NIOServerCnxn.readConnectRequest Client attempting to establish new session at /140.211.11.196:29366
[junit4:junit4]   2> 11599 T116 oazs.NIOServerCnxn.finishSessionInit Established session 0x139c8615ffb0007 with negotiated timeout 10000 for client /140.211.11.196:29366
[junit4:junit4]   2> 11599 T188 oaz.ClientCnxn$SendThread.readConnectResult Session establishment complete on server localhost/127.0.0.1:29325, sessionid = 0x139c8615ffb0007, negotiated timeout = 10000
[junit4:junit4]   2> 11599 T189 oascc.ConnectionManager.process Watcher org.apache.solr.common.cloud.ConnectionManager@18d2ef22 name:ZooKeeperConnection Watcher:127.0.0.1:29325/solr got event WatchedEvent state:SyncConnected type:None path:null path:null type:None
[junit4:junit4]   2> 11600 T112 oascc.ConnectionManager.waitForConnected Client is connected to ZooKeeper
[junit4:junit4]   2> 11601 T112 oascc.ZkStateReader.createClusterStateWatchersAndUpdate Updating cluster state from ZooKeeper... 
[junit4:junit4]   2> 11604 T112 oasc.ChaosMonkey.monkeyLog monkey: init - expire sessions:true cause connection loss:true
[junit4:junit4]   2> 11605 T112 oascsi.HttpClientUtil.createClient Creating new http client, config:
[junit4:junit4]   2> 11613 T112 oascc.ZkStateReader.updateClusterState Updating cloud state from ZooKeeper... 
[junit4:junit4]   2> ASYNC  NEW_CORE C15 name=collection1 org.apache.solr.core.SolrCore@dd78450 url=http://127.0.0.1:29328/solr/collection1 node=127.0.0.1:29328_solr
[junit4:junit4]   2> 11691 T124 C15 P29328 oasc.SolrDeletionPolicy.onInit SolrDeletionPolicy.onInit: commits:num=1
[junit4:junit4]   2> 		commit{dir=NRTCachingDirectory(org.apache.lucene.store.NIOFSDirectory@/usr/home/hudson/hudson-slave/workspace/Lucene-Solr-Tests-4.x-java7/solr/build/solr-core/test/J1/org.apache.solr.cloud.BasicDistributedZk2Test-1347686588405/control/data/index lockFactory=org.apache.lucene.store.NativeFSLockFactory@62c360a5; maxCacheMB=48.0 maxMergeSizeMB=4.0),segFN=segments_1,generation=1,filenames=[segments_1]
[junit4:junit4]   2> 11692 T124 C15 P29328 oasc.SolrDeletionPolicy.updateCommits newest commit = 1
[junit4:junit4]   2> 11719 T124 C15 P29328 /update {wt=javabin&version=2} {add=[1 (1413151824374923264)]} 0 47
[junit4:junit4]   2> 11720 T112 oaz.ZooKeeper.<init> Initiating client connection, connectString=127.0.0.1:29325/solr sessionTimeout=10000 watcher=org.apache.solr.common.cloud.ConnectionManager@d9ef26b
[junit4:junit4]   2> 11721 T190 oaz.ClientCnxn$SendThread.startConnect Opening socket connection to server /127.0.0.1:29325
[junit4:junit4]   2> 11721 T112 oascc.ConnectionManager.waitForConnected Waiting for client to connect to ZooKeeper
[junit4:junit4]   2> 11722 T190 oaz.ClientCnxn$SendThread.primeConnection Socket connection established to localhost/127.0.0.1:29325, initiating session
[junit4:junit4]   2> 11722 T114 oazs.NIOServerCnxn$Factory.run Accepted socket connection from /140.211.11.196:29368
[junit4:junit4]   2> 11723 T114 oazs.NIOServerCnxn.readConnectRequest Client attempting to establish new session at /140.211.11.196:29368
[junit4:junit4]   2> 11724 T116 oazs.NIOServerCnxn.finishSessionInit Established session 0x139c8615ffb0008 with negotiated timeout 10000 for client /140.211.11.196:29368
[junit4:junit4]   2> 11724 T190 oaz.ClientCnxn$SendThread.readConnectResult Session establishment complete on server localhost/127.0.0.1:29325, sessionid = 0x139c8615ffb0008, negotiated timeout = 10000
[junit4:junit4]   2> 11725 T191 oascc.ConnectionManager.process Watcher org.apache.solr.common.cloud.ConnectionManager@d9ef26b name:ZooKeeperConnection Watcher:127.0.0.1:29325/solr got event WatchedEvent state:SyncConnected type:None path:null path:null type:None
[junit4:junit4]   2> 11725 T112 oascc.ConnectionManager.waitForConnected Client is connected to ZooKeeper
[junit4:junit4]   2> 11726 T112 oascc.ZkStateReader.createClusterStateWatchersAndUpdate Updating cluster state from ZooKeeper... 
[junit4:junit4]   2> 11749 T140 C12 P29336 oasc.SolrDeletionPolicy.onInit SolrDeletionPolicy.onInit: commits:num=1
[junit4:junit4]   2> 		commit{dir=NRTCachingDirectory(org.apache.lucene.store.NIOFSDirectory@/usr/home/hudson/hudson-slave/workspace/Lucene-Solr-Tests-4.x-java7/solr/build/solr-core/test/J1/org.apache.solr.cloud.BasicDistributedZk2Test-1347686588405/jetty1/index lockFactory=org.apache.lucene.store.NativeFSLockFactory@6747fee2; maxCacheMB=48.0 maxMergeSizeMB=4.0),segFN=segments_1,generation=1,filenames=[segments_1]
[junit4:junit4]   2> 11750 T140 C12 P29336 oasc.SolrDeletionPolicy.updateCommits newest commit = 1
[junit4:junit4]   2>  C11_STATE=coll:collection1 core:collection1 props:{shard=shard1, roles=null, state=recovering, core=collection1, collection=collection1, node_name=127.0.0.1:29348_solr, base_url=http://127.0.0.1:29348/solr}
[junit4:junit4]   2> 11793 T162 C11 P29348 oasc.SolrDeletionPolicy.onInit SolrDeletionPolicy.onInit: commits:num=1
[junit4:junit4]   2> 		commit{dir=NRTCachingDirectory(org.apache.lucene.store.NIOFSDirectory@/usr/home/hudson/hudson-slave/workspace/Lucene-Solr-Tests-4.x-java7/solr/build/solr-core/test/J1/org.apache.solr.cloud.BasicDistributedZk2Test-1347686588405/jetty3/index lockFactory=org.apache.lucene.store.NativeFSLockFactory@664968be; maxCacheMB=48.0 maxMergeSizeMB=4.0),segFN=segments_1,generation=1,filenames=[segments_1]
[junit4:junit4]   2> 11794 T162 C11 P29348 oasc.SolrDeletionPolicy.updateCommits newest commit = 1
[junit4:junit4]   2> 11800 T162 C11 P29348 REQ /update {distrib.from=http://127.0.0.1:29336/solr/collection1/&update.distrib=FROMLEADER&wt=javabin&version=2} status=0 QTime=11 
[junit4:junit4]   2> 11801 T140 C12 P29336 /update {wt=javabin&version=2} {add=[1 (1413151824435740672)]} 0 62
[junit4:junit4]   2> 11802 T112 oasc.AbstractDistribZkTestBase.waitForRecoveriesToFinish Wait for recoveries to finish - collection: collection1 failOnTimeout:true timeout (sec):1440
[junit4:junit4]   2> 11803 T112 oascc.ZkStateReader.updateClusterState Updating cloud state from ZooKeeper... 
[junit4:junit4]   2> 12020 T133 oascc.ZkStateReader.updateClusterState Updating cloud state from ZooKeeper... 
[junit4:junit4]   2> 12035 T184 oascc.ZkStateReader$2.process A cluster state change has occurred - updating...
[junit4:junit4]   2> 12035 T191 oascc.ZkStateReader$2.process A cluster state change has occurred - updating...
[junit4:junit4]   2> 12035 T146 oascc.ZkStateReader$2.process A cluster state change has occurred - updating...
[junit4:junit4]   2> 12035 T170 oascc.ZkStateReader$2.process A cluster state change has occurred - updating...
[junit4:junit4]   2> 12035 T158 oascc.ZkStateReader$2.process A cluster state change has occurred - updating...
[junit4:junit4]   2> 12035 T189 oascc.ZkStateReader$2.process A cluster state change has occurred - updating...
[junit4:junit4]   2> 12035 T132 oascc.ZkStateReader$2.process A cluster state change has occurred - updating...
[junit4:junit4]   2> 12805 T112 oascc.ZkStateReader.updateClusterState Updating cloud state from ZooKeeper... 
[junit4:junit4]   2> 12891 T172 C11 P29348 oasc.RecoveryStrategy.doRecovery Begin buffering updates. core=collection1
[junit4:junit4]   2> 12891 T172 C11 P29348 oasu.UpdateLog.bufferUpdates Starting to buffer updates. FSUpdateLog{state=ACTIVE, tlog=tlog{file=./org.apache.solr.cloud.BasicDistributedZk2Test-1347686588405/jetty3/tlog/tlog.0000000000000000000 refcount=1}}
[junit4:junit4]   2> 12892 T172 C11 P29348 oasc.RecoveryStrategy.replicate Attempting to replicate from http://127.0.0.1:29336/solr/collection1/. core=collection1
[junit4:junit4]   2> 12892 T172 C11 P29348 oascsi.HttpClientUtil.createClient Creating new http client, config:maxConnections=128&maxConnectionsPerHost=32&followRedirects=false
[junit4:junit4]   2> 12917 T141 C12 P29336 oasu.DirectUpdateHandler2.commit start commit{flags=0,_version_=0,optimize=false,openSearcher=true,waitSearcher=true,expungeDeletes=false,softCommit=false}
[junit4:junit4]   2> 13159 T141 C12 P29336 oasc.SolrDeletionPolicy.onCommit SolrDeletionPolicy.onCommit: commits:num=2
[junit4:junit4]   2> 		commit{dir=NRTCachingDirectory(org.apache.lucene.store.NIOFSDirectory@/usr/home/hudson/hudson-slave/workspace/Lucene-Solr-Tests-4.x-java7/solr/build/solr-core/test/J1/org.apache.solr.cloud.BasicDistributedZk2Test-1347686588405/jetty1/index lockFactory=org.apache.lucene.store.NativeFSLockFactory@6747fee2; maxCacheMB=48.0 maxMergeSizeMB=4.0),segFN=segments_1,generation=1,filenames=[segments_1]
[junit4:junit4]   2> 		commit{dir=NRTCachingDirectory(org.apache.lucene.store.NIOFSDirectory@/usr/home/hudson/hudson-slave/workspace/Lucene-Solr-Tests-4.x-java7/solr/build/solr-core/test/J1/org.apache.solr.cloud.BasicDistributedZk2Test-1347686588405/jetty1/index lockFactory=org.apache.lucene.store.NativeFSLockFactory@6747fee2; maxCacheMB=48.0 maxMergeSizeMB=4.0),segFN=segments_2,generation=2,filenames=[_0_Block_0.tip, _0_Block_0.pos, _0_Block_0.tim, _0_MockVariableIntBlock_0.doc, _0_TestBloomFilteredLucene40Postings_0.prx, _0_MockVariableIntBlock_0.skp, _0_MockFixedIntBlock_0.tib, _0_MockVariableIntBlock_0.pyl, _0_MockFixedIntBlock_0.skp, _0_MockFixedIntBlock_0.pyl, _0_MockVariableIntBlock_0.tib, _0_MockFixedIntBlock_0.tii, _0_MockVariableIntBlock_0.pos, _0_TestBloomFilteredLucene40Postings_0.frq, _0.si, _0_MockVariableIntBlock_0.tii, _0_TestBloomFilteredLucene40Postings_0.tim, _0_TestBloomFilteredLucene40Postings_0.blm, _0_TestBloomFilteredLucene40Postings_0.tip, _0.fnm, _0_Block_0.doc, _0_MockFixedIntBlock_0.pos, _0_nrm.cfs, _0_MockFixedIntBlock_0.frq, _0_MockFixedIntBlock_0.doc, _0_MockVariableIntBlock_0.frq, _0_nrm.cfe, segments_2, _0.fdx, _0.fdt]
[junit4:junit4]   2> 13160 T141 C12 P29336 oasc.SolrDeletionPolicy.updateCommits newest commit = 2
[junit4:junit4]   2> 13253 T141 C12 P29336 oass.SolrIndexSearcher.<init> Opening Searcher@1f043cf3 main
[junit4:junit4]   2> 13255 T141 C12 P29336 oasu.DirectUpdateHandler2.commit end_commit_flush
[junit4:junit4]   2> 13257 T147 oasc.SolrCore.registerSearcher [collection1] Registered new searcher Searcher@1f043cf3 main{StandardDirectoryReader(segments_2:3 _0(4.0.0.2):C1)}
[junit4:junit4]   2> 13258 T141 C12 P29336 /update {waitSearcher=true&commit=true&commit_end_point=true&wt=javabin&softCommit=false&version=2} {commit=} 0 341
[junit4:junit4]   2> 13259 T172 C11 P29348 oash.ReplicationHandler.inform Commits will be reserved for  10000
[junit4:junit4]   2> 13259 T172 C11 P29348 oascsi.HttpClientUtil.createClient Creating new http client, config:connTimeout=5000&socketTimeout=20000&allowCompression=false&maxConnections=10000&maxConnectionsPerHost=10000
[junit4:junit4]   2> 13277 T172 C11 P29348 oash.SnapPuller.<init>  No value set for 'pollInterval'. Timer Task not started.
[junit4:junit4]   2> 13334 T142 C12 P29336 oash.ReplicationHandler.inform Commits will be reserved for  10000
[junit4:junit4]   2> 13335 T142 C12 P29336 REQ /replication {command=indexversion&wt=javabin&qt=/replication&version=2} status=0 QTime=55 
[junit4:junit4]   2> 13336 T172 C11 P29348 oash.SnapPuller.fetchLatestIndex Master's generation: 2
[junit4:junit4]   2> 13336 T172 C11 P29348 oash.SnapPuller.fetchLatestIndex Slave's generation: 1
[junit4:junit4]   2> 13337 T172 C11 P29348 oash.SnapPuller.fetchLatestIndex Starting replication process
[junit4:junit4]   2> 13344 T142 C12 P29336 REQ /replication {command=filelist&generation=2&wt=javabin&qt=/replication&version=2} status=0 QTime=4 
[junit4:junit4]   2> 13346 T172 C11 P29348 oash.SnapPuller.fetchLatestIndex Number of files in latest index in master: 30
[junit4:junit4]   2> 13356 T172 C11 P29348 oash.SnapPuller.fetchLatestIndex Starting download to ./org.apache.solr.cloud.BasicDistributedZk2Test-1347686588405/jetty3/index.20120915140821748 fullCopy=true
[junit4:junit4]   2> 13361 T142 C12 P29336 REQ /replication {file=_0_Block_0.pos&command=filecontent&checksum=true&generation=2&qt=/replication&wt=filestream} status=0 QTime=0 
[junit4:junit4]   2> 13370 T142 C12 P29336 REQ /replication {file=_0_Block_0.tip&command=filecontent&checksum=true&generation=2&qt=/replication&wt=filestream} status=0 QTime=1 
[junit4:junit4]   2> 13377 T142 C12 P29336 REQ /replication {file=_0_MockVariableIntBlock_0.doc&command=filecontent&checksum=true&generation=2&qt=/replication&wt=filestream} status=0 QTime=0 
[junit4:junit4]   2> 13383 T142 C12 P29336 REQ /replication {file=_0_Block_0.tim&command=filecontent&checksum=true&generation=2&qt=/replication&wt=filestream} status=0 QTime=1 
[junit4:junit4]   2> 13389 T142 C12 P29336 REQ /replication {file=_0_TestBloomFilteredLucene40Postings_0.prx&command=filecontent&checksum=true&generation=2&qt=/replication&wt=filestream} status=0 QTime=1 
[junit4:junit4]   2> 13395 T142 C12 P29336 REQ /replication {file=_0_MockVariableIntBlock_0.skp&command=filecontent&checksum=true&generation=2&qt=/replication&wt=filestream} status=0 QTime=1 
[junit4:junit4]   2> 13397 T172 C11 P29348 oash.SnapPuller$FileFetcher.fetchPackets WARNING No content recieved for file: {name=_0_MockVariableIntBlock_0.skp, lastmodified=1347686601000, size=0}
[junit4:junit4]   2> 13402 T142 C12 P29336 REQ /replication {file=_0_MockFixedIntBlock_0.tib&command=filecontent&checksum=true&generation=2&qt=/replication&wt=filestream} status=0 QTime=1 
[junit4:junit4]   2> 13408 T142 C12 P29336 REQ /replication {file=_0_MockVariableIntBlock_0.pyl&command=filecontent&checksum=true&generation=2&qt=/replication&wt=filestream} status=0 QTime=1 
[junit4:junit4]   2> 13410 T172 C11 P29348 oash.SnapPuller$FileFetcher.fetchPackets WARNING No content recieved for file: {name=_0_MockVariableIntBlock_0.pyl, lastmodified=1347686601000, size=0}
[junit4:junit4]   2> 13452 T142 C12 P29336 REQ /replication {file=_0_MockFixedIntBlock_0.pyl&command=filecontent&checksum=true&generation=2&qt=/replication&wt=filestream} status=0 QTime=0 
[junit4:junit4]   2> 13455 T172 C11 P29348 oash.SnapPuller$FileFetcher.fetchPackets WARNING No content recieved for file: {name=_0_MockFixedIntBlock_0.pyl, lastmodified=1347686601000, size=0}
[junit4:junit4]   2> 13461 T142 C12 P29336 REQ /replication {file=_0_MockFixedIntBlock_0.skp&command=filecontent&checksum=true&generation=2&qt=/replication&wt=filestream} status=0 QTime=0 
[junit4:junit4]   2> 13463 T172 C11 P29348 oash.SnapPuller$FileFetcher.fetchPackets WARNING No content recieved for file: {name=_0_MockFixedIntBlock_0.skp, lastmodified=1347686601000, size=0}
[junit4:junit4]   2> 13468 T142 C12 P29336 REQ /replication {file=_0_MockVariableIntBlock_0.tib&command=filecontent&checksum=true&generation=2&qt=/replication&wt=filestream} status=0 QTime=1 
[junit4:junit4]   2> 13481 T142 C12 P29336 REQ /replication {file=_0_MockFixedIntBlock_0.tii&command=filecontent&checksum=true&generation=2&qt=/replication&wt=filestream} status=0 QTime=0 
[junit4:junit4]   2> 13488 T142 C12 P29336 REQ /replication {file=_0_MockVariableIntBlock_0.pos&command=filecontent&checksum=true&generation=2&qt=/replication&wt=filestream} status=0 QTime=0 
[junit4:junit4]   2> 13495 T142 C12 P29336 REQ /replication {file=_0_TestBloomFilteredLucene40Postings_0.frq&command=filecontent&checksum=true&generation=2&qt=/replication&wt=filestream} status=0 QTime=1 
[junit4:junit4]   2> 13501 T142 C12 P29336 REQ /replication {file=_0.si&command=filecontent&checksum=true&generation=2&qt=/replication&wt=filestream} status=0 QTime=1 
[junit4:junit4]   2> 13507 T142 C12 P29336 REQ /replication {file=_0_MockVariableIntBlock_0.tii&command=filecontent&checksum=true&generation=2&qt=/replication&wt=filestream} status=0 QTime=1 
[junit4:junit4]   2> 13524 T142 C12 P29336 REQ /replication {file=_0_TestBloomFilteredLucene40Postings_0.tim&command=filecontent&checksum=true&generation=2&qt=/replication&wt=filestream} status=0 QTime=0 
[junit4:junit4]   2> 13530 T142 C12 P29336 REQ /replication {file=_0_TestBloomFilteredLucene40Postings_0.tip&command=filecontent&checksum=true&generation=2&qt=/replication&wt=filestream} status=0 QTime=0 
[junit4:junit4]   2> 13537 T142 C12 P29336 REQ /replication {file=_0_TestBloomFilteredLucene40Postings_0.blm&command=filecontent&checksum=true&generation=2&qt=/replication&wt=filestream} status=0 QTime=1 
[junit4:junit4]   2> 13543 T142 C12 P29336 REQ /replication {file=_0_Block_0.doc&command=filecontent&checksum=true&generation=2&qt=/replication&wt=filestream} status=0 QTime=0 
[junit4:junit4]   2> 13555 T142 C12 P29336 REQ /replication {file=_0.fnm&command=filecontent&checksum=true&generation=2&qt=/replication&wt=filestream} status=0 QTime=0 
[junit4:junit4]   2> 13563 T142 C12 P29336 REQ /replication {file=_0_MockFixedIntBlock_0.pos&command=filecontent&checksum=true&generation=2&qt=/replication&wt=filestream} status=0 QTime=0 
[junit4:junit4]   2> 13569 T142 C12 P29336 REQ /replication {file=_0_nrm.cfs&command=filecontent&checksum=true&generation=2&qt=/replication&wt=filestream} status=0 QTime=1 
[junit4:junit4]   2> 13583 T142 C12 P29336 REQ /replication {file=_0_MockFixedIntBlock_0.frq&command=filecontent&checksum=true&generation=2&qt=/replication&wt=filestream} status=0 QTime=0 
[junit4:junit4]   2> 13589 T142 C12 P29336 REQ /replication {file=_0_MockFixedIntBlock_0.doc&command=filecontent&checksum=true&generation=2&qt=/replication&wt=filestream} status=0 QTime=0 
[junit4:junit4]   2> 13595 T142 C12 P29336 REQ /replication {file=_0_nrm.cfe&command=filecontent&checksum=true&generation=2&qt=/replication&wt=filestream} status=0 QTime=0 
[junit4:junit4]   2> 13600 T142 C12 P29336 REQ /replication {file=_0_MockVariableIntBlock_0.frq&command=filecontent&checksum=true&generation=2&qt=/replication&wt=filestream} status=0 QTime=0 
[junit4:junit4]   2> 13606 T142 C12 P29336 REQ /replication {file=segments_2&command=filecontent&checksum=true&generation=2&qt=/replication&wt=filestream} status=0 QTime=0 
[junit4:junit4]   2> 13622 T142 C12 P29336 REQ /replication {file=_0.fdx&command=filecontent&checksum=true&generation=2&qt=/replication&wt=filestream} status=0 QTime=1 
[junit4:junit4]   2> 13627 T142 C12 P29336 REQ /replication {file=_0.fdt&command=filecontent&checksum=true&generation=2&qt=/replication&wt=filestream} status=0 QTime=0 
[junit4:junit4]   2> 13629 T172 C11 P29348 oash.SnapPuller.fetchLatestIndex Total time taken for download : 0 secs
[junit4:junit4]   2> 13630 T172 C11 P29348 oash.SnapPuller.modifyIndexProps New index installed. Updating index properties... index=index.20120915140821748
[junit4:junit4]   2> 13636 T172 C11 P29348 oasu.DefaultSolrCoreState.newIndexWriter Creating new IndexWriter...
[junit4:junit4]   2> 13636 T172 C11 P29348 oasu.DefaultSolrCoreState.newIndexWriter Waiting until IndexWriter is unused... core=collection1
[junit4:junit4]   2> 13636 T172 C11 P29348 oasu.DefaultSolrCoreState.newIndexWriter Rollback old IndexWriter... core=collection1
[junit4:junit4]   2> 13640 T172 C11 P29348 oasc.SolrCore.getNewIndexDir WARNING New index directory detected: old=./org.apache.solr.cloud.BasicDistributedZk2Test-1347686588405/jetty3/index/ new=./org.apache.solr.cloud.BasicDistributedZk2Test-1347686588405/jetty3/index.20120915140821748
[junit4:junit4]   2> 13640 T172 C11 P29348 oasc.CachingDirectoryFactory.get return new directory for /usr/home/hudson/hudson-slave/workspace/Lucene-Solr-Tests-4.x-java7/solr/build/solr-core/test/J1/./org.apache.solr.cloud.BasicDistributedZk2Test-1347686588405/jetty3/index.20120915140821748 forceNew:true
[junit4:junit4]   2> 13650 T172 C11 P29348 oasc.SolrDeletionPolicy.onInit SolrDeletionPolicy.onInit: commits:num=1
[junit4:junit4]   2> 		commit{dir=NRTCachingDirectory(org.apache.lucene.store.NIOFSDirectory@/usr/home/hudson/hudson-slave/workspace/Lucene-Solr-Tests-4.x-java7/solr/build/solr-core/test/J1/org.apache.solr.cloud.BasicDistributedZk2Test-1347686588405/jetty3/index.20120915140821748 lockFactory=org.apache.lucene.store.NativeFSLockFactory@46c045f8; maxCacheMB=48.0 maxMergeSizeMB=4.0),segFN=segments_2,generation=2,filenames=[_0_Block_0.pos, _0_Block_0.tip, _0_MockVariableIntBlock_0.doc, _0_Block_0.tim, _0_TestBloomFilteredLucene40Postings_0.prx, _0_MockVariableIntBlock_0.skp, _0_MockFixedIntBlock_0.tib, _0_MockVariableIntBlock_0.pyl, _0_MockFixedIntBlock_0.pyl, _0_MockFixedIntBlock_0.skp, _0_MockVariableIntBlock_0.tib, _0_MockFixedIntBlock_0.tii, _0_MockVariableIntBlock_0.pos, _0_TestBloomFilteredLucene40Postings_0.frq, _0.si, _0_MockVariableIntBlock_0.tii, _0_TestBloomFilteredLucene40Postings_0.tim, _0_TestBloomFilteredLucene40Postings_0.blm, _0_TestBloomFilteredLucene40Postings_0.tip, _0.fnm, _0_Block_0.doc, _0_MockFixedIntBlock_0.pos, _0_nrm.cfs, _0_MockFixedIntBlock_0.frq, _0_MockFixedIntBlock_0.doc, _0_nrm.cfe, _0_MockVariableIntBlock_0.frq, segments_2, _0.fdx, _0.fdt]
[junit4:junit4]   2> 13650 T172 C11 P29348 oasc.SolrDeletionPolicy.updateCommits newest commit = 2
[junit4:junit4]   2> 13650 T172 C11 P29348 oasu.DefaultSolrCoreState.newIndexWriter New IndexWriter is ready to be used.
[junit4:junit4]   2> 13656 T172 C11 P29348 oass.SolrIndexSearcher.<init> Opening Searcher@65340bf8 main
[junit4:junit4]   2> 13658 T171 oasc.SolrCore.registerSearcher [collection1] Registered new searcher Searcher@65340bf8 main{StandardDirectoryReader(segments_2:3:nrt _0(4.0.0.2):C1)}
[junit4:junit4]   2> 13659 T171 oasc.CachingDirectoryFactory.close Closing directory:/usr/home/hudson/hudson-slave/workspace/Lucene-Solr-Tests-4.x-java7/solr/build/solr-core/test/J1/./org.apache.solr.cloud.BasicDistributedZk2Test-1347686588405/jetty3/index
[junit4:junit4]   2> 13659 T171 oash.SnapPuller$2.onClose removing old index directory ./org.apache.solr.cloud.BasicDistributedZk2Test-1347686588405/jetty3/index
[junit4:junit4]   2> 13660 T172 C11 P29348 oasu.DirectUpdateHandler2.commit start commit{flags=0,_version_=0,optimize=false,openSearcher=true,waitSearcher=true,expungeDeletes=false,softCommit=false}
[junit4:junit4]   2> 13662 T172 C11 P29348 oass.SolrIndexSearcher.<init> Opening Searcher@1f555795 main
[junit4:junit4]   2> 13662 T172 C11 P29348 oasu.DirectUpdateHandler2.commit end_commit_flush
[junit4:junit4]   2> 13663 T171 oasc.SolrCore.registerSearcher [collection1] Registered new searcher Searcher@1f555795 main{StandardDirectoryReader(segments_2:3:nrt _0(4.0.0.2):C1)}
[junit4:junit4]   2> 13667 T172 C11 P29348 oasc.RecoveryStrategy.replay Replaying buffered documents. core=collection1
[junit4:junit4]   2> 13668 T194 C11 P29348 oasu.UpdateLog$LogReplayer.doReplay WARNING Starting log replay tlog{file=./org.apache.solr.cloud.BasicDistributedZk2Test-1347686588405/jetty3/tlog/tlog.0000000000000000000 refcount=2} active=true starting pos=429
[junit4:junit4]   2> 13671 T194 C11 P29348 oasu.DirectUpdateHandler2.commit start commit{flags=2,_version_=0,optimize=false,openSearcher=true,waitSearcher=true,expungeDeletes=false,softCommit=false}
[junit4:junit4]   2> 13672 T194 C11 P29348 oass.SolrIndexSearcher.<init> Opening Searcher@7df8fc8c main
[junit4:junit4]   2> 13673 T194 C11 P29348 oasu.DirectUpdateHandler2.commit end_commit_flush
[junit4:junit4]   2> 13674 T171 oasc.SolrCore.registerSearcher [collection1] Registered new searcher Searcher@7df8fc8c main{StandardDirectoryReader(segments_2:3:nrt _0(4.0.0.2):C1)}
[junit4:junit4]   2> 13675 T194 C11 P29348 oasu.UpdateLog$LogReplayer.run WARNING Log replay finished. recoveryInfo=RecoveryInfo{adds=0 deletes=0 deleteByQuery=0 errors=0 positionOfStart=429}
[junit4:junit4]   2> 13675 T172 C11 P29348 oasc.RecoveryStrategy.doRecovery Replication Recovery was successful - registering as Active. core=collection1
[junit4:junit4]   2> 13677 T172 C11 P29348 oasc.RecoveryStrategy.doRecovery Finished recovery process. core=collection1
[junit4:junit4]   2> 13808 T112 oascc.ZkStateReader.updateClusterState Updating cloud state from ZooKeeper... 
[junit4:junit4]   2> 14048 T133 oascc.ZkStateReader.updateClusterState Updating cloud state from ZooKeeper... 
[junit4:junit4]   2> 14062 T184 oascc.ZkStateReader$2.process A cluster state change has occurred - updating...
[junit4:junit4]   2> 14062 T170 oascc.ZkStateReader$2.process A cluster state change has occurred - updating...
[junit4:junit4]   2> 14062 T158 oascc.ZkStateReader$2.process A cluster state change has occurred - updating...
[junit4:junit4]   2> 14062 T189 oascc.ZkStateReader$2.process A cluster state change has occurred - updating...
[junit4:junit4]   2> 14062 T146 oascc.ZkStateReader$2.process A cluster state change has occurred - updating...
[junit4:junit4]   2> 14062 T132 oascc.ZkStateReader$2.process A cluster state change has occurred - updating...
[junit4:junit4]   2> 14062 T191 oascc.ZkStateReader$2.process A cluster state change has occurred - updating...
[junit4:junit4]   2>  C13_STATE=coll:collection1 core:collection1 props:{shard=shard2, roles=null, state=recovering, core=collection1, collection=collection1, node_name=127.0.0.1:29355_solr, base_url=http://127.0.0.1:29355/solr}
[junit4:junit4]   2> 14596 T186 C13 P29355 oasc.RecoveryStrategy.doRecovery Begin buffering updates. core=collection1
[junit4:junit4]   2> 14596 T186 C13 P29355 oasu.UpdateLog.bufferUpdates Starting to buffer updates. FSUpdateLog{state=ACTIVE, tlog=null}
[junit4:junit4]   2> 14596 T186 C13 P29355 oasc.RecoveryStrategy.replicate Attempting to replicate from http://127.0.0.1:29344/solr/collection1/. core=collection1
[junit4:junit4]   2> 14597 T186 C13 P29355 oascsi.HttpClientUtil.createClient Creating new http client, config:maxConnections=128&maxConnectionsPerHost=32&followRedirects=false
[junit4:junit4]   2> 14610 T152 C14 P29344 oasu.DirectUpdateHandler2.commit start commit{flags=0,_version_=0,optimize=false,openSearcher=true,waitSearcher=true,expungeDeletes=false,softCommit=false}
[junit4:junit4]   2> 14614 T152 C14 P29344 oasc.SolrDeletionPolicy.onInit SolrDeletionPolicy.onInit: commits:num=1
[junit4:junit4]   2> 		commit{dir=NRTCachingDirectory(org.apache.lucene.store.NIOFSDirectory@/usr/home/hudson/hudson-slave/workspace/Lucene-Solr-Tests-4.x-java7/solr/build/solr-core/test/J1/org.apache.solr.cloud.BasicDistributedZk2Test-1347686588405/jetty2/index lockFactory=org.apache.lucene.store.NativeFSLockFactory@3a64fcde; maxCacheMB=48.0 maxMergeSizeMB=4.0),segFN=segments_1,generation=1,filenames=[segments_1]
[junit4:junit4]   2> 14615 T152 C14 P29344 oasc.SolrDeletionPolicy.updateCommits newest commit = 1
[junit4:junit4]   2> 14616 T152 C14 P29344 oass.SolrIndexSearcher.<init> Opening Searcher@575bedd main
[junit4:junit4]   2> 14616 T152 C14 P29344 oasu.DirectUpdateHandler2.commit end_commit_flush
[junit4:junit4]   2> 14618 T159 oasc.SolrCore.registerSearcher [collection1] Registered new searcher Searcher@575bedd main{StandardDirectoryReader(segments_1:1)}
[junit4:junit4]   2> 14618 T152 C14 P29344 /update {waitSearcher=true&commit=true&commit_end_point=true&wt=javabin&softCommit=false&version=2} {commit=} 0 8
[junit4:junit4]   2> 14619 T186 C13 P29355 oash.ReplicationHandler.inform Commits will be reserved for  10000
[junit4:junit4]   2> 14619 T186 C13 P29355 oash.SnapPuller.<init>  No value set for 'pollInterval'. Timer Task not started.
[junit4:junit4]   2> 14621 T153 C14 P29344 oash.ReplicationHandler.inform Commits will be reserved for  10000
[junit4:junit4]   2> 14622 T153 C14 P29344 REQ /replication {command=indexversion&wt=javabin&qt=/replication&version=2} status=0 QTime=1 
[junit4:junit4]   2> 14625 T186 C13 P29355 oasc.SolrDeletionPolicy.onInit SolrDeletionPolicy.onInit: commits:num=1
[junit4:junit4]   2> 		commit{dir=NRTCachingDirectory(org.apache.lucene.store.NIOFSDirectory@/usr/home/hudson/hudson-slave/workspace/Lucene-Solr-Tests-4.x-java7/solr/build/solr-core/test/J1/org.apache.solr.cloud.BasicDistributedZk2Test-1347686588405/jetty4/index lockFactory=org.apache.lucene.store.NativeFSLockFactory@5eb1b21a; maxCacheMB=48.0 maxMergeSizeMB=4.0),segFN=segments_1,generation=1,filenames=[segments_1]
[junit4:junit4]   2> 14626 T186 C13 P29355 oasc.SolrDeletionPolicy.updateCommits newest commit = 1
[junit4:junit4]   2> 14626 T186 C13 P29355 oasu.DirectUpdateHandler2.commit start commit{flags=0,_version_=0,optimize=false,openSearcher=true,waitSearcher=true,expungeDeletes=false,softCommit=false}
[junit4:junit4]   2> 14629 T186 C13 P29355 oasc.SolrDeletionPolicy.onCommit SolrDeletionPolicy.onCommit: commits:num=2
[junit4:junit4]   2> 		commit{dir=NRTCachingDirectory(org.apache.lucene.store.NIOFSDirectory@/usr/home/hudson/hudson-slave/workspace/Lucene-Solr-Tests-4.x-java7/solr/build/solr-core/test/J1/org.apache.solr.cloud.BasicDistributedZk2Test-1347686588405/jetty4/index lockFactory=org.apache.lucene.store.NativeFSLockFactory@5eb1b21a; maxCacheMB=48.0 maxMergeSizeMB=4.0),segFN=segments_1,generation=1,filenames=[segments_1]
[junit4:junit4]   2> 		commit{dir=NRTCachingDirectory(org.apache.lucene.store.NIOFSDirectory@/usr/home/hudson/hudson-slave/workspace/Lucene-Solr-Tests-4.x-java7/solr/build/solr-core/test/J1/org.apache.solr.cloud.BasicDistributedZk2Test-1347686588405/jetty4/index lockFactory=org.apache.lucene.store.NativeFSLockFactory@5eb1b21a; maxCacheMB=48.0 maxMergeSizeMB=4.0),segFN=segments_2,generation=2,filenames=[segments_2]
[junit4:junit4]   2> 14630 T186 C13 P29355 oasc.SolrDeletionPolicy.updateCommits newest commit = 2
[junit4:junit4]   2> 14633 T186 C13 P29355 oass.SolrIndexSearcher.<init> Opening Searcher@20a26542 main
[junit4:junit4]   2> 14634 T186 C13 P29355 oasu.DirectUpdateHandler2.commit end_commit_flush
[junit4:junit4]   2> 14636 T185 oasc.SolrCore.registerSearcher [collection1] Registered new searcher Searcher@20a26542 main{StandardDirectoryReader(segments_2:2)}
[junit4:junit4]   2> 14637 T186 C13 P29355 oasc.RecoveryStrategy.replay No replay needed. core=collection1
[junit4:junit4]   2> 14637 T186 C13 P29355 oasc.RecoveryStrategy.doRecovery Replication Recovery was successful - registering as Active. core=collection1
[junit4:junit4]   2> 14639 T186 C13 P29355 oasc.RecoveryStrategy.doRecovery Finished recovery process. core=collection1
[junit4:junit4]   2> 14811 T112 oascc.ZkStateReader.updateClusterState Updating cloud state from ZooKeeper... 
[junit4:junit4]   2> 15090 T133 oascc.ZkStateReader.updateClusterState Updating cloud state from ZooKeeper... 
[junit4:junit4]   2> 15135 T184 oascc.ZkStateReader$2.process A cluster state change has occurred - updating...
[junit4:junit4]   2> 15135 T158 oascc.ZkStateReader$2.process A cluster state change has occurred - updating...
[junit4:junit4]   2> 15135 T170 oascc.ZkStateReader$2.process A cluster state change has occurred - updating...
[junit4:junit4]   2> 15135 T191 oascc.ZkStateReader$2.process A cluster state change has occurred - updating...
[junit4:junit4]   2> 15135 T189 oascc.ZkStateReader$2.process A cluster state change has occurred - updating...
[junit4:junit4]   2> 15135 T146 oascc.ZkStateReader$2.process A cluster state change has occurred - updating...
[junit4:junit4]   2> 15135 T132 oascc.ZkStateReader$2.process A cluster state change has occurred - updating...
[junit4:junit4]   2> 15814 T112 oascc.ZkStateReader.updateClusterState Updating cloud state from ZooKeeper... 
[junit4:junit4]   2> 15819 T124 C15 P29328 oasu.DirectUpdateHandler2.commit start commit{flags=0,_version_=0,optimize=false,openSearcher=true,waitSearcher=true,expungeDeletes=false,softCommit=false}
[junit4:junit4]   2> 15909 T124 C15 P29328 oasc.SolrDeletionPolicy.onCommit SolrDeletionPolicy.onCommit: commits:num=2
[junit4:junit4]   2> 		commit{dir=NRTCachingDirectory(org.apache.lucene.store.NIOFSDirectory@/usr/home/hudson/hudson-slave/workspace/Lucene-Solr-Tests-4.x-java7/solr/build/solr-core/test/J1/org.apache.solr.cloud.BasicDistributedZk2Test-1347686588405/control/data/index lockFactory=org.apache.lucene.store.NativeFSLockFactory@62c360a5; maxCacheMB=48.0 maxMergeSizeMB=4.0),segFN=segments_1,generation=1,filenames=[segments_1]
[junit4:junit4]   2> 		commit{dir=NRTCachingDirectory(org.apache.lucene.store.NIOFSDirectory@/usr/home/hudson/hudson-slave/workspace/Lucene-Solr-Tests-4.x-java7/solr/build/solr-core/test/J1/org.apache.solr.cloud.BasicDistributedZk2Test-1347686588405/control/data/index lockFactory=org.apache.lucene.store.NativeFSLockFactory@62c360a5; maxCacheMB=48.0 maxMergeSizeMB=4.0),segFN=segments_2,generation=2,filenames=[_0_Block_0.tip, _0_Block_0.pos, _0_Block_0.tim, _0_MockVariableIntBlock_0.doc, _0_TestBloomFilteredLucene40Postings_0.prx, _0_MockVariableIntBlock_0.skp, _0_MockFixedIntBlock_0.tib, _0_MockVariableIntBlock_0.pyl, _0_MockFixedIntBlock_0.skp, _0_MockFixedIntBlock_0.pyl, _0_MockVariableIntBlock_0.tib, _0_MockFixedIntBlock_0.tii, _0_MockVariableIntBlock_0.pos, _0_TestBloomFilteredLucene40Postings_0.frq, _0.si, _0_MockVariableIntBlock_0.tii, _0_TestBloomFilteredLucene40Postings_0.tim, _0_TestBloomFilteredLucene40Postings_0.blm, _0_TestBloomFilteredLucene40Postings_0.tip, _0.fnm, _0_Block_0.doc, _0_MockFixedIntBlock_0.pos, _0_nrm.cfs, _0_MockFixedIntBlock_0.frq, _0_MockFixedIntBlock_0.doc, _0_MockVariableIntBlock_0.frq, _0_nrm.cfe, segments_2, _0.fdx, _0.fdt]
[junit4:junit4]   2> 15910 T124 C15 P29328 oasc.SolrDeletionPolicy.updateCommits newest commit = 2
[junit4:junit4]   2> 15934 T124 C15 P29328 oass.SolrIndexSearcher.<init> Opening Searcher@78b3ffa3 main
[junit4:junit4]   2> 15935 T124 C15 P29328 oasu.DirectUpdateHandler2.commit end_commit_flush
[junit4:junit4]   2> 15936 T135 oasc.SolrCore.registerSearcher [collection1] Registered new searcher Searcher@78b3ffa3 main{StandardDirectoryReader(segments_2:3 _0(4.0.0.2):C1)}
[junit4:junit4]   2> 15937 T124 C15 P29328 /update {waitSearcher=true&wt=javabin&commit=true&softCommit=false&version=2} {commit=} 0 118
[junit4:junit4]   2> 15940 T154 C14 P29344 oasu.DirectUpdateHandler2.commit start commit{flags=0,_version_=0,optimize=false,openSearcher=true,waitSearcher=true,expungeDeletes=false,softCommit=false}
[junit4:junit4]   2> 15944 T154 C14 P29344 oass.SolrIndexSearcher.<init> Opening Searcher@5b540c33 main
[junit4:junit4]   2> 15945 T154 C14 P29344 oasu.DirectUpdateHandler2.commit end_commit_flush
[junit4:junit4]   2> 15946 T159 oasc.SolrCore.registerSearcher [collection1] Registered new searcher Searcher@5b540c33 main{StandardDirectoryReader(segments_1:1)}
[junit4:junit4]   2> 15946 T154 C14 P29344 oasu.SolrCmdDistributor.distribCommit Distrib commit to:[StdNode: http://127.0.0.1:29336/solr/collection1/, StdNode: http://127.0.0.1:29348/solr/collection1/, StdNode: http://127.0.0.1:29355/solr/collection1/]
[junit4:junit4]   2> 15950 T143 C12 P29336 oasu.DirectUpdateHandler2.commit start commit{flags=0,_version_=0,optimize=false,openSearcher=true,waitSearcher=true,expungeDeletes=false,softCommit=false}
[junit4:junit4]   2>  C11_STATE=coll:collection1 core:collection1 props:{shard=shard1, roles=null, state=active, core=collection1, collection=collection1, node_name=127.0.0.1:29348_solr, base_url=http://127.0.0.1:29348/solr}
[junit4:junit4]   2> 15951 T162 C11 P29348 oasu.DirectUpdateHandler2.commit start commit{flags=0,_version_=0,optimize=false,openSearcher=true,waitSearcher=true,expungeDeletes=false,softCommit=false}
[junit4:junit4]   2> 15955 T162 C11 P29348 oass.SolrIndexSearcher.<init> Opening Searcher@6564b4dc main
[junit4:junit4]   2> 15956 T162 C11 P29348 oasu.DirectUpdateHandler2.commit end_commit_flush
[junit4:junit4]   2> 15958 T171 oasc.SolrCore.registerSearcher [collection1] Registered new searcher Searcher@6564b4dc main{StandardDirectoryReader(segments_2:3:nrt _0(4.0.0.2):C1)}
[junit4:junit4]   2>  C13_STATE=coll:collection1 core:collection1 props:{shard=shard2, roles=null, state=active, core=collection1, collection=collection1, node_name=127.0.0.1:29355_solr, base_url=http://127.0.0.1:29355/solr}
[junit4:junit4]   2> 15958 T175 C13 P29355 oasu.DirectUpdateHandler2.commit start commit{flags=0,_version_=0,optimize=false,openSearcher=true,waitSearcher=true,expungeDeletes=false,softCommit=false}
[junit4:junit4]   2> 15958 T162 C11 P29348 /update {waitSearcher=true&commit=true&wt=javabin&commit_end_point=true&expungeDeletes=false&softCommit=false&version=2} {commit=} 0 7
[junit4:junit4]   2> 15962 T175 C13 P29355 oass.SolrIndexSearcher.<init> Opening Searcher@40220d72 main
[junit4:junit4]   2> 15962 T175 C13 P29355 oasu.DirectUpdateHandler2.commit end_commit_flush
[junit4:junit4]   2> 15963 T185 oasc.SolrCore.registerSearcher [collection1] Registered new searcher Searcher@40220d72 main{StandardDirectoryReader(segments_2:2)}
[junit4:junit4]   2> 15964 T175 C13 P29355 /update {waitSearcher=true&commit=true&wt=javabin&commit_end_point=true&expungeDeletes=false&softCommit=false&version=2} {commit=} 0 6
[junit4:junit4]   2> 15968 T143 C12 P29336 oass.SolrIndexSearcher.<init> Opening Searcher@7cd61476 main
[junit4:junit4]   2> 15969 T143 C12 P29336 oasu.DirectUpdateHandler2.commit end_commit_flush
[junit4:junit4]   2> 15970 T147 oasc.SolrCore.registerSearcher [collection1] Registered new searcher Searcher@7cd61476 main{StandardDirectoryReader(segments_2:3 _0(4.0.0.2):C1)}
[junit4:junit4]   2> 15971 T143 C12 P29336 /update {waitSearcher=true&commit=true&wt=javabin&commit_end_point=true&expungeDeletes=false&softCommit=false&version=2} {commit=} 0 21
[junit4:junit4]   2> 15972 T154 C14 P29344 /update {waitSearcher=true&wt=javabin&commit=true&softCommit=false&version=2} {commit=} 0 32
[junit4:junit4]   2> 15978 T125 C15 P29328 REQ /select {fl=id,score&shard.url=127.0.0.1:29328/solr/collection1/&NOW=1347686604375&start=0&q=*:*&distrib=false&isShard=true&wt=javabin&fsv=true&rows=10&version=2} hits=1 status=0 QTime=0 
[junit4:junit4]   2> 15998 T125 C15 P29328 REQ /select {shard.url=127.0.0.1:29328/solr/collection1/&NOW=1347686604375&q=*:*&ids=1&distrib=false&isShard=true&wt=javabin&version=2} status=0 QTime=7 
[junit4:junit4]   2> 15999 T124 C15 P29328 REQ /select {wt=javabin&q=*:*&version=2} hits=1 status=0 QTime=25 
[junit4:junit4]   2> 16000 T112 oaz.ZooKeeper.<init> Initiating client connection, connectString=127.0.0.1:29325/solr sessionTimeout=10000 watcher=org.apache.solr.common.cloud.ConnectionManager@4776af4c
[junit4:junit4]   2> 16002 T199 oaz.ClientCnxn$SendThread.startConnect Opening socket connection to server /127.0.0.1:29325
[junit4:junit4]   2> 16002 T112 oascc.ConnectionManager.waitForConnected Waiting for client to connect to ZooKeeper
[junit4:junit4]   2> 16002 T199 oaz.ClientCnxn$SendThread.primeConnection Socket connection established to localhost/127.0.0.1:29325, initiating session
[junit4:junit4]   2> 16003 T114 oazs.NIOServerCnxn$Factory.run Accepted socket connection from /140.211.11.196:29384
[junit4:junit4]   2> 16003 T114 oazs.NIOServerCnxn.readConnectRequest Client attempting to establish new session at /140.211.11.196:29384
[junit4:junit4]   2> 16005 T116 oazs.NIOServerCnxn.finishSessionInit Established session 0x139c8615ffb0009 with negotiated timeout 10000 for client /140.211.11.196:29384
[junit4:junit4]   2> 16005 T199 oaz.ClientCnxn$SendThread.readConnectResult Session establishment complete on server localhost/127.0.0.1:29325, sessionid = 0x139c8615ffb0009, negotiated timeout = 10000
[junit4:junit4]   2> 16005 T200 oascc.ConnectionManager.process Watcher org.apache.solr.common.cloud.ConnectionManager@4776af4c name:ZooKeeperConnection Watcher:127.0.0.1:29325/solr got event WatchedEvent state:SyncConnected type:None path:null path:null type:None
[junit4:junit4]   2> 16005 T112 oascc.ConnectionManager.waitForConnected Client is connected to ZooKeeper
[junit4:junit4]   2> 16006 T112 oascc.ZkStateReader.createClusterStateWatchersAndUpdate Updating cluster state from ZooKeeper... 
[junit4:junit4]   2> 16008 T117 oazs.PrepRequestProcessor.pRequest Processed session termination for sessionid: 0x139c8615ffb0009
[junit4:junit4]   2> 16009 T200 oaz.ClientCnxn$EventThread.run EventThread shut down
[junit4:junit4]   2> 16009 T112 oaz.ZooKeeper.close Session: 0x139c8615ffb0009 closed
[junit4:junit4]   2> 16010 T114 oazs.NIOServerCnxn.closeSock Closed socket connection for client /140.211.11.196:29384 which had sessionid 0x139c8615ffb0009
[junit4:junit4]   2> 16012 T144 C12 P29336 REQ /select {distrib=false&wt=javabin&q=*:*&version=2} hits=1 status=0 QTime=0 
[junit4:junit4]   2> 16015 T155 C14 P29344 REQ /select {distrib=false&wt=javabin&q=*:*&version=2} hits=0 status=0 QTime=0 
[junit4:junit4]   2> 16024 T163 C11 P29348 REQ /select {fl=id,score&shard.url=127.0.0.1:29336/solr/collection1/|127.0.0.1:29348/solr/collection1/&NOW=1347686604420&start=0&q=*:*&distrib=false&isShard=true&wt=javabin&fsv=true&rows=10&version=2} hits=1 status=0 QTime=1 
[junit4:junit4]   2> 16024 T176 C13 P29355 REQ /select {fl=id,score&shard.url=127.0.0.1:29344/solr/collection1/|127.0.0.1:29355/solr/collection1/&NOW=1347686604420&start=0&q=*:*&distrib=false&isShard=true&wt=javabin&fsv=true&rows=10&version=2} hits=0 status=0 QTime=0 
[junit4:junit4]   2> 16028 T163 C11 P29348 REQ /select {shard.url=127.0.0.1:29336/solr/collection1/|127.0.0.1:29348/solr/collection1/&NOW=1347686604420&q=*:*&ids=1&distrib=false&isShard=true&wt=javabin&version=2} status=0 QTime=0 
[junit4:junit4]   2> 16030 T140 C12 P29336 REQ /select {wt=javabin&q=*:*&version=2} hits=1 status=0 QTime=11 
[junit4:junit4]   2> 16040 T124 C15 P29328 /update {wt=javabin&version=2} {add=[2 (1413151828933083136)]} 0 6
[junit4:junit4]   2> 16066 T175 C13 P29355 REQ /update {update.distrib=FROMLEADER&distrib.from=http://127.0.0.1:29344/solr/collection1/&wt=javabin&version=2} status=0 QTime=5 
[junit4:junit4]   2> 16067 T156 C14 P29344 REQ /update {distrib.from=http://127.0.0.1:29336/solr/collection1/&update.distrib=TOLEADER&wt=javabin&version=2} status=0 QTime=18 
[junit4:junit4]   2> 16068 T140 C12 P29336 /update {wt=javabin&version=2} {add=[2]} 0 25
[junit4:junit4]   2> 16076 T124 C15 P29328 /update {wt=javabin&version=2} {add=[3 (1413151828972929024)]} 0 4
[junit4:junit4]   2> 16094 T175 C13 P29355 REQ /update {update.distrib=FROMLEADER&distrib.from=http://127.0.0.1:29344/solr/collection1/&wt=javabin&version=2} status=0 QTime=4 
[junit4:junit4]   2> 16095 T156 C14 P29344 REQ /update {distrib.from=http://127.0.0.1:29336/solr/collection1/&update.distrib=TOLEADER&wt=javabin&version=2} status=0 QTime=13 
[junit4:junit4]   2> 16096 T140 C12 P29336 /update {wt=javabin&version=2} {add=[3]} 0 17
[junit4:junit4]   2> 16103 T124 C15 P29328 /update {wt=javabin&version=2} {add=[4 (1413151829001240576)]} 0 4
[junit4:junit4]   2> 16127 T162 C11 P29348 REQ /update {update.distrib=FROMLEADER&distrib.from=http://127.0.0.1:29336/solr/collection1/&wt=javabin&version=2} status=0 QTime=5 
[junit4:junit4]   2> 16128 T143 C12 P29336 REQ /update {distrib.from=http://127.0.0.1:29344/solr/collection1/&update.distrib=TOLEADER&wt=javabin&version=2} status=0 QTime=19 
[junit4:junit4]   2> 16129 T154 C14 P29344 /update {wt=javabin&version=2} {add=[4]} 0 23
[junit4:junit4]   2> 16136 T124 C15 P29328 /update {wt=javabin&version=2} {add=[5 (1413151829035843584)]} 0 4
[junit4:junit4]   2> 16152 T175 C13 P29355 REQ /update {distrib.from=http://127.0.0.1:29344/solr/collection1/&update.distrib=FROMLEADER&wt=javabin&version=2} status=0 QTime=5 
[junit4:junit4]   2> 16153 T154 C14 P29344 /update {wt=javabin&version=2} {add=[5 (1413151829044232192)]} 0 13
[junit4:junit4]   2> 16161 T124 C15 P29328 /update {wt=javabin&version=2} {add=[6 (1413151829062057984)]} 0 4
[junit4:junit4]   2> 16177 T175 C13 P29355 REQ /update {distrib.from=http://127.0.0.1:29344/solr/collection1/&update.distrib=FROMLEADER&wt=javabin&version=2} status=0 QTime=3 
[junit4:junit4]   2> 16179 T154 C14 P29344 /update {wt=javabin&version=2} {add=[6 (1413151829070446592)]} 0 14
[junit4:junit4]   2> 16186 T124 C15 P29328 /update {wt=javabin&version=2} {add=[7 (1413151829088272384)]} 0 4
[junit4:junit4]   2> 16199 T175 C13 P29355 REQ /update {distrib.from=http://127.0.0.1:29344/solr/collection1/&update.distrib=FROMLEADER&wt=javabin&version=2} status=0 QTime=4 
[junit4:junit4]   2> 16200 T154 C14 P29344 /update {wt=javabin&version=2} {add=[7 (1413151829095612416)]} 0 11
[junit4:junit4]   2> 16206 T124 C15 P29328 /update {wt=javabin&version=2} {add=[8 (1413151829110292480)]} 0 3
[junit4:junit4]   2> 16227 T162 C11 P29348 REQ /update {update.distrib=FROMLEADER&distrib.from=http://127.0.0.1:29336/solr/collection1/&wt=javabin&version=2} status=0 QTime=4 
[junit4:junit4]   2> 16228 T143 C12 P29336 REQ /update {distrib.from=http://127.0.0.1:29344/solr/collection1/&update.distrib=TOLEADER&wt=javabin&version=2} status=0 QTime=12 
[junit4:junit4]   2> 16229 T154 C14 P29344 /update {wt=javabin&version=2} {add=[8]} 0 16
[junit4:junit4]   2> 16259 T124 C15 P29328 /update {wt=javabin&version=2} {add=[9 (1413151829164818432)]} 0 4
[junit4:junit4]   2> 16277 T175 C13 P29355 REQ /update {update.distrib=FROMLEADER&distrib.from=http://127.0.0.1:29344/solr/collection1/&wt=javabin&version=2} status=0 QTime=3 
[junit4:junit4]   2> 16278 T156 C14 P29344 REQ /update {distrib.from=http://127.0.0.1:29336/solr/collection1/&update.distrib=TOLEADER&wt=javabin&version=2} status=0 QTime=13 
[junit4:junit4]   2> 16279 T140 C12 P29336 /update {wt=javabin&version=2} {add=[9]} 0 17
[junit4:junit4]   2> 16286 T124 C15 P29328 /update {wt=javabin&version=2} {add=[10 (1413151829193129984)]} 0 4
[junit4:junit4]   2> 16299 T162 C11 P29348 REQ /update {distrib.from=http://127.0.0.1:29336/solr/collection1/&update.distrib=FROMLEADER&wt=javabin&version=2} status=0 QTime=4 
[junit4:junit4]   2> 16299 T140 C12 P29336 /update {wt=javabin&version=2} {add=[10 (1413151829200470016)]} 0 10
[junit4:junit4]   2> 16331 T124 C15 P29328 /update {wt=javabin&version=2} {add=[11 (1413151829214101504)]} 0 29
[junit4:junit4]   2> 16347 T162 C11 P29348 REQ /update {update.distrib=FROMLEADER&distrib.from=http://127.0.0.1:29336/solr/collection1/&wt=javabin&version=2} status=0 QTime=3 
[junit4:junit4]   2> 16348 T143 C12 P29336 REQ /update {distrib.from=http://127.0.0.1:29344/solr/collection1/&update.distrib=TOLEADER&wt=javabin&version=2} status=0 QTime=11 
[junit4:junit4]   2> 16349 T154 C14 P29344 /update {wt=javabin&version=2} {add=[11]} 0 15
[junit4:junit4]   2> 16357 T124 C15 P29328 /update {wt=javabin&version=2} {add=[12 (1413151829266530304)]} 0 5
[junit4:junit4]   2> 16371 T162 C11 P29348 REQ /update {distrib.from=http://127.0.0.1:29336/solr/collection1/&update.distrib=FROMLEADER&wt=javabin&version=2} status=0 QTime=4 
[junit4:junit4]   2> 16372 T140 C12 P29336 /update {wt=javabin&version=2} {add=[12 (1413151829275967488)]} 0 11
[junit4:junit4]   2> 16379 T124 C15 P29328 /update {wt=javabin&version=2} {add=[13 (1413151829290647552)]} 0 3
[junit4:junit4]   2> 16396 T162 C11 P29348 REQ /update {update.distrib=FROMLEADER&distrib.from=http://127.0.0.1:29336/solr/collection1/&wt=javabin&version=2} status=0 QTime=3 
[junit4:junit4]   2> 16397 T143 C12 P29336 REQ /update {distrib.from=http://127.0.0.1:29344/solr/collection1/&update.distrib=TOLEADER&wt=javabin&version=2} status=0 QTime=11 
[junit4:junit4]   2> 16397 T154 C14 P29344 /update {wt=javabin&version=2} {add=[13]} 0 14
[junit4:junit4]   2> 16403 T124 C15 P29328 /update {wt=javabin&version=2} {add=[14 (1413151829316861952)]} 0 3
[junit4:junit4]   2> 16415 T162 C11 P29348 REQ /update {distrib.from=http://127.0.0.1:29336/solr/collection1/&update.distrib=FROMLEADER&wt=javabin&version=2} status=0 QTime=3 
[junit4:junit4]   2> 16416 T140 C12 P29336 /update {wt=javabin&version=2} {add=[14 (1413151829323153408)]} 0 10
[junit4:junit4]   2> 16422 T124 C15 P29328 /update {wt=javabin&version=2} {add=[15 (1413151829336784896)]} 0 3
[junit4:junit4]   2> 16438 T162 C11 P29348 REQ /update {update.distrib=FROMLEADER&distrib.from=http://127.0.0.1:29336/solr/collection1/&wt=javabin&version=2} status=0 QTime=3 
[junit4:junit4]   2> 16439 T143 C12 P29336 REQ /update {distrib.from=http://127.0.0.1:29344/solr/collection1/&update.distrib=TOLEADER&wt=javabin&version=2} status=0 QTime=10 
[junit4:junit4]   2> 16439 T154 C14 P29344 /update {wt=javabin&version=2} {add=[15]} 0 13
[junit4:junit4]   2> 16445 T124 C15 P29328 /update {wt=javabin&version=2} {add=[16 (1413151829360902144)]} 0 2
[junit4:junit4]   2> 16460 T162 C11 P29348 REQ /update {update.distrib=FROMLEADER&distrib.from=http://127.0.0.1:29336/solr/collection1/&wt=javabin&version=2} status=0 QTime=3 
[junit4:junit4]   2> 16461 T143 C12 P29336 REQ /update {distrib.from=http://127.0.0.1:29344/solr/collection1/&update.distrib=TOLEADER&wt=javabin&version=2} status=0 QTime=9 
[junit4:junit4]   2> 16462 T154 C14 P29344 /update {wt=javabin&version=2} {add=[16]} 0 13
[junit4:junit4]   2> 16475 T124 C15 P29328 /update {wt=javabin&version=2} {add=[17 (1413151829387116544)]} 0 10
[junit4:junit4]   2> 16509 T175 C13 P29355 REQ /update {update.distrib=FROMLEADER&distrib.from=http://127.0.0.1:29344/solr/collection1/&wt=javabin&version=2} status=0 QTime=8 
[junit4:junit4]   2> 16511 T156 C14 P29344 REQ /update {distrib.from=http://127.0.0.1:29336/solr/collection1/&update.distrib=TOLEADER&wt=javabin&version=2} status=0 QTime=26 
[junit4:junit4]   2> 16512 T140 C12 P29336 /update {wt=javabin&version=2} {add=[17]} 0 33
[junit4:junit4]   2> 16518 T124 C15 P29328 /update {wt=javabin&version=2} {add=[100 (1413151829437448192)]} 0 3
[junit4:junit4]   2> 16578 T162 C11 P29348 REQ /update {update.distrib=FROMLEADER&distrib.from=http://127.0.0.1:29336/solr/collection1/&wt=javabin&version=2} status=0 QTime=25 
[junit4:junit4]   2> 16579 T143 C12 P29336 REQ /update {distrib.from=http://127.0.0.1:29344/solr/collection1/&update.distrib=TOLEADER&wt=javabin&version=2} status=0 QTime=54 
[junit4:junit4]   2> 16580 T154 C14 P29344 /update {wt=javabin&version=2} {add=[100]} 0 59
[junit4:junit4]   2> 16586 T124 C15 P29328 /update {wt=javabin&version=2} {add=[101 (1413151829508751360)]} 0 2
[junit4:junit4]   2> 16602 T162 C11 P29348 REQ /update {update.distrib=FROMLEADER&distrib.from=http://127.0.0.1:29336/solr/collection1/&wt=javabin&version=2} status=0 QTime=4 
[junit4:junit4]   2> 16603 T143 C12 P29336 REQ /update {distrib.from=http://127.0.0.1:29344/solr/collection1/&update.distrib=TOLEADER&wt=javabin&version=2} status=0 QTime=11 
[junit4:junit4]   2> 16604 T154 C14 P29344 /update {wt=javabin&version=2} {add=[101]} 0 15
[junit4:junit4]   2> 16610 T124 C15 P29328 /update {wt=javabin&version=2} {add=[102 (1413151829533917184)]} 0 3
[junit4:junit4]   2> 16622 T162 C11 P29348 REQ /update {distrib.from=http://127.0.0.1:29336/solr/collection1/&update.distrib=FROMLEADER&wt=javabin&version=2} status=0 QTime=3 
[junit4:junit4]   2> 16623 T140 C12 P29336 /update {wt=javabin&version=2} {add=[102 (1413151829540208640)]} 0 10
[junit4:junit4]   2> 16651 T124 C15 P29328 /update {wt=javabin&version=2} {add=[103 (1413151829553840128)]} 0 25
[junit4:junit4]   2> 16666 T175 C13 P29355 REQ /update {update.distrib=FROMLEADER&distrib.from=http://127.0.0.1:29344/solr/collection1/&wt=javabin&version=2} status=0 QTime=3 
[junit4:junit4]   2> 16667 T156 C14 P29344 REQ /update {distrib.from=http://127.0.0.1:29336/solr/collection1/&update.distrib=TOLEADER&wt=javabin&version=2} status=0 QTime=10 
[junit4:junit4]   2> 16668 T140 C12 P29336 /update {wt=javabin&version=2} {add=[103]} 0 14
[junit4:junit4]   2> 16675 T124 C15 P29328 /update {wt=javabin&version=2} {add=[104 (1413151829601026048)]} 0 4
[junit4:junit4]   2> 16690 T175 C13 P29355 REQ /update {update.distrib=FROMLEADER&distrib.from=http://127.0.0.1:29344/solr/collection1/&wt=javabin&version=2} status=0 QTime=3 
[junit4:junit4]   2> 16691 T156 C14 P29344 REQ /update {distrib.from=http://127.0.0.1:29336/solr/collection1/&update.distrib=TOLEADER&wt=javabin&version=2} status=0 QTime=10 
[junit4:junit4]   2> 16692 T140 C12 P29336 /update {wt=javabin&version=2} {add=[104]} 0 14
[junit4:junit4]   2> 16698 T124 C15 P29328 /update {wt=javabin&version=2} {add=[105 (1413151829626191872)]} 0 3
[junit4:junit4]   2> 16748 T175 C13 P29355 REQ /update {distrib.from=http://127.0.0.1:29344/solr/collection1/&update.distrib=FROMLEADER&wt=javabin&version=2} status=0 QTime=23 
[junit4:junit4]   2> 16749 T154 C14 P29344 /update {wt=javabin&version=2} {add=[105 (1413151829631434752)]} 0 48
[junit4:junit4]   2> 16759 T124 C15 P29328 /update {wt=javabin&version=2} {add=[106 (1413151829690155008)]} 0 3
[junit4:junit4]   2> 16772 T175 C13 P29355 REQ /update {distrib.from=http://127.0.0.1:29344/solr/collection1/&update.distrib=FROMLEADER&wt=javabin&version=2} status=0 QTime=4 
[junit4:junit4]   2> 16773 T154 C14 P29344 /update {wt=javabin&version=2} {add=[106 (1413151829696446464)]} 0 11
[junit4:junit4]   2> 16779 T124 C15 P29328 /update {wt=javabin&version=2} {add=[107 (1413151829711126528)]} 0 3
[junit4:junit4]   2> 16790 T162 C11 P29348 REQ /update {distrib.from=http://127.0.0.1:29336/solr/collection1/&update.distrib=FROMLEADER&wt=javabin&version=2} status=0 QTime=3 
[junit4:junit4]   2> 16791 T140 C12 P29336 /update {wt=javabin&version=2} {add=[107 (1413151829717417984)]} 0 9
[junit4:junit4]   2> 16796 T124 C15 P29328 /update {wt=javabin&version=2} {add=[108 (1413151829728952320)]} 0 2
[junit4:junit4]   2> 16809 T162 C11 P29348 REQ /update {update.distrib=FROMLEADER&distrib.from=http://127.0.0.1:29336/solr/collection1/&wt=javabin&version=2} status=0 QTime=2 
[junit4:junit4]   2> 16810 T143 C12 P29336 REQ /update {distrib.from=http://127.0.0.1:29344/solr/collection1/&update.distrib=TOLEADER&wt=javabin&version=2} status=0 QTime=8 
[junit4:junit4]   2> 16811 T154 C14 P29344 /update {wt=javabin&version=2} {add=[108]} 0 12
[junit4:junit4]   2> 16816 T124 C15 P29328 /update {wt=javabin&version=2} {add=[109 (1413151829750972416)]} 0 2
[junit4:junit4]   2> 16830 T162 C11 P29348 REQ /update {update.distrib=FROMLEADER&distrib.from=http://127.0.0.1:29336/solr/collection1/&wt=javabin&version=2} status=0 QTime=3 
[junit4:junit4]   2> 16831 T143 C12 P29336 REQ /update {distrib.from=http://127.0.0.1:29344/solr/collection1/&update.distrib=TOLEADER&wt=javabin&version=2} status=0 QTime=9 
[junit4:junit4]   2> 16832 T154 C14 P29344 /update {wt=javabin&version=2} {add=[109]} 0 13
[junit4:junit4]   2> 16837 T124 C15 P29328 /update {wt=javabin&version=2} {add=[110 (1413151829772992512)]} 0 2
[junit4:junit4]   2> 16851 T162 C11 P29348 REQ /update {update.distrib=FROMLEADER&distrib.from=http://127.0.0.1:29336/solr/collection1/&wt=javabin&version=2} status=0 QTime=2 
[junit4:junit4]   2> 16852 T143 C12 P29336 REQ /update {distrib.from=http://127.0.0.1:29344/solr/collection1/&update.distrib=TOLEADER&wt=javabin&version=2} status=0 QTime=9 
[junit4:junit4]   2> 16853 T154 C14 P29344 /update {wt=javabin&version=2} {add=[110]} 0 13
[junit4:junit4]   2> 16860 T124 C15 P29328 /update {wt=javabin&version=2} {add=[111 (1413151829796061184)]} 0 3
[junit4:junit4]   2> 16871 T162 C11 P29348 REQ /update {distrib.from=http://127.0.0.1:29336/solr/collection1/&update.distrib=FROMLEADER&wt=javabin&version=2} status=0 QTime=3 
[junit4:junit4]   2> 16872 T140 C12 P29336 /update {wt=javabin&version=2} {add=[111 (1413151829802352640)]} 0 9
[junit4:junit4]   2> 16878 T124 C15 P29328 /update {wt=javabin&version=2} {add=[112 (1413151829814935552)]} 0 3
[junit4:junit4]   2> 16893 T175 C13 P29355 REQ /update {update.distrib=FROMLEADER&distrib.from=http://127.0.0.1:29344/solr/collection1/&wt=javabin&version=2} status=0 QTime=3 
[junit4:junit4]   2> 16894 T156 C14 P29344 REQ /update {distrib.from=http://127.0.0.1:29336/solr/collection1/&update.distrib=TOLEADER&wt=javabin&version=2} status=0 QTime=10 
[junit4:junit4]   2> 16895 T140 C12 P29336 /update {wt=javabin&version=2} {add=[112]} 0 14
[junit4:junit4]   2> 16917 T124 C15 P29328 /update {wt=javabin&version=2} {add=[113 (1413151829839052800)]} 0 19
[junit4:junit4]   2> 16932 T162 C11 P29348 REQ /update {update.distrib=FROMLEADER&distrib.from=http://127.0.0.1:29336/solr/collection1/&wt=javabin&version=2} status=0 QTime=2 
[junit4:junit4]   2> 16933 T143 C12 P29336 REQ /update {distrib.from=http://127.0.0.1:29344/solr/collection1/&update.distrib=TOLEADER&wt=javabin&version=2} status=0 QTime=9 
[junit4:junit4]   2> 16934 T154 C14 P29344 /update {wt=javabin&version=2} {add=[113]} 0 14
[junit4:junit4]   2> 16941 T124 C15 P29328 /update {wt=javabin&version=2} {add=[114 (1413151829879947264)]} 0 4
[junit4:junit4]   2> 16952 T162 C11 P29348 REQ /update {distrib.from=http://127.0.0.1:29336/solr/collection1/&update.distrib=FROMLEADER&wt=javabin&version=2} status=0 QTime=3 
[junit4:junit4]   2> 16953 T140 C12 P29336 /update {wt=javabin&version=2} {add=[114 (1413151829887287296)]} 0 9
[junit4:junit4]   2> 16959 T124 C15 P29328 /update {wt=javabin&version=2} {add=[115 (1413151829899870208)]} 0 3
[junit4:junit4]   2> 16974 T175 C13 P29355 REQ /update {update.distrib=FROMLEADER&distrib.from=http://127.0.0.1:29344/solr/collection1/&wt=javabin&version=2} status=0 QTime=3 
[junit4:junit4]   2> 16975 T156 C14 P29344 REQ /update {distrib.from=http://127.0.0.1:29336/solr/collection1/&update.distrib=TOLEADER&wt=javabin&version=2} status=0 QTime=9 
[junit4:junit4]   2> 16976 T140 C12 P29336 /update {wt=javabin&version=2} {add=[115]} 0 14
[junit4:junit4]   2> 16981 T124 C15 P29328 /update {wt=javabin&version=2} {add=[116 (1413151829923987456)]} 0 2
[junit4:junit4]   2> 16997 T175 C13 P29355 REQ /update {update.distrib=FROMLEADER&distrib.from=http://127.0.0.1:29344/solr/collection1/&wt=javabin&version=2} status=0 QTime=3 
[junit4:junit4]   2> 16998 T156 C14 P29344 REQ /update {distrib.from=http://127.0.0.1:29336/solr/collection1/&update.distrib=TOLEADER&wt=javabin&version=2} status=0 QTime=10 
[junit4:junit4]   2> 16999 T140 C12 P29336 /update {wt=javabin&version=2} {add=[116]} 0 14
[junit4:junit4]   2> 17009 T124 C15 P29328 /update {wt=javabin&version=2} {add=[117 (1413151829952299008)]} 0 3
[junit4:junit4]   2> 17025 T175 C13 P29355 REQ /update {update.distrib=FROMLEADER&distrib.from=http://127.0.0.1:29344/solr/collection1/&wt=javabin&version=2} status=0 QTime=3 
[junit4:junit4]   2> 17026 T156 C14 P29344 REQ /update {distrib.from=http://127.0.0.1:29336/solr/collection1/&update.distrib=TOLEADER&wt=javabin&version=2} status=0 QTime=10 
[junit4:junit4]   2> 17027 T140 C12 P29336 /update {wt=javabin&version=2} {add=[117]} 0 14
[junit4:junit4]   2> 17034 T124 C15 P29328 /update {wt=javabin&version=2} {add=[118 (1413151829978513408)]} 0 3
[junit4:junit4]   2> 17133 T162 C11 P29348 REQ /update {update.distrib=FROMLEADER&distrib.from=http://127.0.0.1:29336/solr/collection1/&wt=javabin&version=2} status=0 QTime=17 
[junit4:junit4]   2> 17134 T143 C12 P29336 REQ /update {distrib.from=http://127.0.0.1:29344/solr/collection1/&update.distrib=TOLEADER&wt=javabin&version=2} status=0 QTime=93 
[junit4:junit4]   2> 17135 T154 C14 P29344 /update {wt=javabin&version=2} {add=[118]} 0 97
[junit4:junit4]   2> 17140 T124 C15 P29328 /update {wt=javabin&version=2} {add=[119 (1413151830090711040)]} 0 2
[junit4:junit4]   2> 17151 T175 C13 P29355 REQ /update {distrib.from=http://127.0.0.1:29344/solr/collection1/&update.distrib=FROMLEADER&wt=javabin&version=2} status=0 QTime=2 
[junit4:junit4]   2> 17152 T154 C14 P29344 /update {wt=javabin&version=2} {add=[119 (1413151830097002496)]} 0 8
[junit4:junit4]   2> 17158 T124 C15 P29328 /update {wt=javabin&version=2} {add=[120 (1413151830109585408)]} 0 2
[junit4:junit4]   2> 17173 T175 C13 P29355 REQ /update {update.distrib=FROMLEADER&distrib.from=http://127.0.0.1:29344/solr/collection1/&wt=javabin&version=2} status=0 QTime=2 
[junit4:junit4]   2> 17174 T156 C14 P29344 REQ /update {distrib.from=http://127.0.0.1:29336/solr/collection1/&update.distrib=TOLEADER&wt=javabin&version=2} status=0 QTime=9 
[junit4:junit4]   2> 17175 T140 C12 P29336 /update {wt=javabin&version=2} {add=[120]} 0 13
[junit4:junit4]   2> 17180 T124 C15 P29328 /update {wt=javabin&version=2} {add=[121 (1413151830132654080)]} 0 2
[junit4:junit4]   2> 17191 T175 C13 P29355 REQ /update {distrib.from=http://127.0.0.1:29344/solr/collection1/&update.distrib=FROMLEADER&wt=javabin&version=2} status=0 QTime=2 
[junit4:junit4]   2> 17192 T154 C14 P29344 /update {wt=javabin&version=2} {add=[121 (1413151830138945536)]} 0 8
[junit4:junit4]   2> 17197 T124 C15 P29328 /update {wt=javabin&version=2} {add=[122 (1413151830150479872)]} 0 2
[junit4:junit4]   2> 17210 T162 C11 P29348 REQ /update {distrib.from=http://127.0.0.1:29336/solr/collection1/&update.distrib=FROMLEADER&wt=javabin&version=2} status=0 QTime=4 
[junit4:junit4]   2> 17210 T140 C12 P29336 /update {wt=javabin&version=2} {add=[122 (1413151830155722752)]} 0 10
[junit4:junit4]   2> 17231 T124 C15 P29328 /update {wt=javabin&version=2} {add=[123 (1413151830170402816)]} 0 17
[junit4:junit4]   2> 17244 T162 C11 P29348 REQ /update {update.distrib=FROMLEADER&distrib.from=http://127.0.0.1:29336/solr/collection1/&wt=javabin&version=2} status=0 QTime=2 
[junit4:junit4]   2> 17245 T143 C12 P29336 REQ /update {distrib.from=http://127.0.0.1:29344/solr/collection1/&update.distrib=TOLEADER&wt=javabin&version=2} status=0 QTime=8 
[junit4:junit4]   2> 17246 T154 C14 P29344 /update {wt=javabin&version=2} {add=[123]} 0 12
[junit4:junit4]   2> 17253 T124 C15 P29328 /update {wt=javabin&version=2} {add=[124 (1413151830207102976)]} 0 4
[junit4:junit4]   2> 17268 T162 C11 P29348 REQ /update {update.distrib=FROMLEADER&distrib.from=http://127.0.0.1:29336/solr/collection1/&wt=javabin&version=2} status=0 QTime=2 
[junit4:junit4]   2> 17269 T143 C12 P29336 REQ /update {distrib.from=http://127.0.0.1:29344/solr/collection1/&update.distrib=TOLEADER&wt=javabin&version=2} status=0 QTime=10 
[junit4:junit4]   2> 17270 T154 C14 P29344 /update {wt=javabin&version=2} {add=[124]} 0 14
[junit4:junit4]   2> 17277 T124 C15 P29328 /update {wt=javabin&version=2} {add=[125 (1413151830232268800)]} 0 4
[junit4:junit4]   2> 17293 T162 C11 P29348 REQ /update {update.distrib=FROMLEADER&distrib.from=http://127.0.0.1:29336/solr/collection1/&wt=javabin&version=2} status=0 QTime=3 
[junit4:junit4]   2> 17294 T143 C12 P29336 REQ /update {distrib.from=http://127.0.0.1:29344/solr/collection1/&update.distrib=TOLEADER&wt=javabin&version=2} status=0 QTime=10 
[junit4:junit4]   2> 17295 T154 C14 P29344 /update {wt=javabin&version=2} {add=[125]} 0 14
[junit4:junit4]   2> 17302 T124 C15 P29328 /update {wt=javabin&version=2} {add=[126 (1413151830258483200)]} 0 4
[junit4:junit4]   2> 17311 T175 C13 P29355 REQ /update {distrib.from=http://127.0.0.1:29344/solr/collection1/&update.distrib=FROMLEADER&wt=javabin&version=2} status=0 QTime=2 
[junit4:junit4]   2> 17312 T154 C14 P29344 /update {wt=javabin&version=2} {add=[126 (1413151830265823232)]} 0 7
[junit4:junit4]   2> 17318 T124 C15 P29328 /update {wt=javabin&version=2} {add=[127 (1413151830276308992)]} 0 3
[junit4:junit4]   2> 17356 T175 C13 P29355 REQ /update {distrib.from=http://127.0.0.1:29344/solr/collection1/&update.distrib=FROMLEADER&wt=javabin&version=2} status=0 QTime=16 
[junit4:junit4]   2> 17357 T154 C14 P29344 /update {wt=javabin&version=2} {add=[127 (1413151830283649024)]} 0 35
[junit4:junit4]   2> 17364 T124 C15 P29328 /update {wt=javabin&version=2} {add=[128 (1413151830323494912)]} 0 4
[junit4:junit4]   2> 17376 T175 C13 P29355 REQ /update {distrib.from=http://127.0.0.1:29344/solr/collection1/&update.distrib=FROMLEADER&wt=javabin&version=2} status=0 QTime=3 
[junit4:junit4]   2> 17378 T154 C14 P29344 /update {wt=javabin&version=2} {add=[128 (1413151830330834944)]} 0 10
[junit4:junit4]   2> 17384 T124 C15 P29328 /update {wt=javabin&version=2} {add=[129 (1413151830345515008)]} 0 3
[junit4:junit4]   2> 17400 T162 C11 P29348 REQ /update {update.distrib=FROMLEADER&distrib.from=http://127.0.0.1:29336/solr/collection1/&wt=javabin&version=2} status=0 QTime=3 
[junit4:junit4]   2> 17401 T143 C12 P29336 REQ /update {distrib.from=http://127.0.0.1:29344/solr/collection1/&update.distrib=TOLEADER&wt=javabin&version=2} status=0 QTime=10 
[junit4:junit4]   2> 17402 T154 C14 P29344 /update {wt=javabin&version=2} {add=[129]} 0 14
[junit4:junit4]   2> 17409 T124 C15 P29328 /update {wt=javabin&version=2} {add=[130 (1413151830370680832)]} 0 4
[junit4:junit4]   2> 17424 T175 C13 P29355 REQ /update {update.distrib=FROMLEADER&distrib.from=http://127.0.0.1:29344/solr/collection1/&wt=javabin&version=2} status=0 QTime=2 
[junit4:junit4]   2> 17425 T156 C14 P29344 REQ /update {distrib.from=http://127.0.0.1:29336/solr/collection1/&update.distrib=TOLEADER&wt=javabin&version=2} status=0 QTime=10 
[junit4:junit4]   2> 17426 T140 C12 P29336 /update {wt=javabin&version=2} {add=[130]} 0 14
[junit4:junit4]   2> 17434 T124 C15 P29328 /update {wt=javabin&version=2} {add=[131 (1413151830396895232)]} 0 3
[junit4:junit4]   2> 17445 T175 C13 P29355 REQ /update {distrib.from=http://127.0.0.1:29344/solr/collection1/&update.distrib=FROMLEADER&wt=javabin&version=2} status=0 QTime=2 
[junit4:junit4]   2> 17447 T154 C14 P29344 /update {wt=javabin&version=2} {add=[131 (1413151830405283840)]} 0 7
[junit4:junit4]   2> 17454 T124 C15 P29328 /update {wt=javabin&version=2} {add=[132 (1413151830417866752)]} 0 4
[junit4:junit4]   2> 17469 T162 C11 P29348 REQ /update {update.distrib=FROMLEADER&distrib.from=http://127.0.0.1:29336/solr/collection1/&wt=javabin&version=2} status=0 QTime=4 
[junit4:junit4]   2> 17470 T143 C12 P29336 REQ /update {distrib.from=http://127.0.0.1:29344/solr/collection1/&update.distrib=TOLEADER&wt=javabin&version=2} status=0 QTime=9 
[junit4:junit4]   2> 17471 T154 C14 P29344 /update {wt=javabin&version=2} {add=[132]} 0 13
[junit4:junit4]   2> 17498 T124 C15 P29328 /update {wt=javabin&version=2} {add=[133 (1413151830443032576)]} 0 24
[junit4:junit4]   2> 17512 T162 C11 P29348 REQ /update {update.distrib=FROMLEADER&distrib.from=http://127.0.0.1:29336/solr/collection1/&wt=javabin&version=2} status=0 QTime=3 
[junit4:junit4]   2> 17514 T143 C12 P29336 REQ /update {distrib.from=http://127.0.0.1:29344/solr/collection1/&update.distrib=TOLEADER&wt=javabin&version=2} status=0 QTime=9 
[junit4:junit4]   2> 17514 T154 C14 P29344 /update {wt=javabin&version=2} {add=[133]} 0 12
[junit4:junit4]   2> 17522 T124 C15 P29328 /update {wt=javabin&version=2} {add=[134 (1413151830488121344)]} 0 5
[junit4:junit4]   2> 17535 T175 C13 P29355 REQ /update {update.distrib=FROMLEADER&distrib.from=http://127.0.0.1:29344/solr/collection1/&wt=javabin&version=2} status=0 QTime=2 
[junit4:junit4]   2> 17536 T156 C14 P29344 REQ /update {distrib.from=http://127.0.0.1:29336/solr/collection1/&update.distrib=TOLEADER&wt=javabin&version=2} status=0 QTime=8 
[junit4:junit4]   2> 17537 T140 C12 P29336 /update {wt=javabin&version=2} {add=[134]} 0 12
[junit4:junit4]   2> 17543 T124 C15 P29328 /update {wt=javabin&version=2} {add=[135 (1413151830512238592)]} 0 3
[junit4:junit4]   2> 17555 T162 C11 P29348 REQ /update {update.distrib=FROMLEADER&distrib.from=http://127.0.0.1:29336/solr/collection1/&wt=javabin&version=2} status=0 QTime=2 
[junit4:junit4]   2> 17556 T143 C12 P29336 REQ /update {distrib.from=http://127.0.0.1:29344/solr/collection1/&update.distrib=TOLEADER&wt=javabin&version=2} status=0 QTime=7 
[junit4:junit4]   2> 17556 T154 C14 P29344 /update {wt=javabin&version=2} {add=[135]} 0 10
[junit4:junit4]   2> 17562 T124 C15 P29328 /update {wt=javabin&version=2} {add=[136 (1413151830532161536)]} 0 3
[junit4:junit4]   2> 17577 T175 C13 P29355 REQ /update {update.distrib=FROMLEADER&distrib.from=http://127.0.0.1:29344/solr/collection1/&wt=javabin&version=2} status=0 QTime=3 
[junit4:junit4]   2> 17578 T156 C14 P29344 REQ /update {distrib.from=http://127.0.0.1:29336/solr/collection1/&update.distrib=TOLEADER&wt=javabin&version=2} status=0 QTime=9 
[junit4:junit4]   2> 17579 T140 C12 P29336 /update {wt=javabin&version=2} {add=[136]} 0 13
[junit4:junit4]   2> 17586 T124 C15 P29328 /update {wt=javabin&version=2} {add=[137 (1413151830557327360)]} 0 3
[junit4:junit4]   2> 17600 T175 C13 P29355 REQ /update {update.distrib=FROMLEADER&distrib.from=http://127.0.0.1:29344/solr/collection1/&wt=javabin&version=2} status=0 QTime=3 
[junit4:junit4]   2> 17601 T156 C14 P29344 REQ /update {distrib.from=http://127.0.0.1:29336/solr/collection1/&update.distrib=TOLEADER&wt=javabin&version=2} status=0 QTime=9 
[junit4:junit4]   2> 17602 T140 C12 P29336 /update {wt=javabin&version=2} {add=[137]} 0 13
[junit4:junit4]   2> 17608 T124 C15 P29328 /update {wt=javabin&version=2} {add=[138 (1413151830580396032)]} 0 3
[junit4:junit4]   2> 17621 T162 C11 P29348 REQ /update {update.distrib=FROMLEADER&distrib.from=http://127.0.0.1:29336/solr/collection1/&wt=javabin&version=2} status=0 QTime=3 
[junit4:junit4]   2> 17623 T143 C12 P29336 REQ /update {distrib.from=http://127.0.0.1:29344/solr/collection1/&update.distrib=TOLEADER&wt=javabin&version=2} status=0 QTime=9 
[junit4:junit4]   2> 17623 T154 C14 P29344 /update {wt=javabin&version=2} {add=[138]} 0 12
[junit4:junit4]   2> 17630 T124 C15 P29328 /update {wt=javabin&version=2} {add=[139 (1413151830603464704)]} 0 3
[junit4:junit4]   2> 17640 T175 C13 P29355 REQ /update {distrib.from=http://127.0.0.1:29344/solr/collection1/&update.distrib=FROMLEADER&wt=javabin&version=2} status=0 QTime=3 
[junit4:junit4]   2> 17641 T154 C14 P29344 /update {wt=javabin&version=2} {add=[139 (1413151830608707584)]} 0 8
[junit4:junit4]   2> 17647 T124 C15 P29328 /update {wt=javabin&version=2} {add=[140 (1413151830621290496)]} 0 3
[junit4:junit4]   2> 17658 T175 C13 P29355 REQ /update {distrib.from=http://127.0.0.1:29344/solr/collection1/&update.distrib=FROMLEADER&wt=javabin&version=2} status=0 QTime=3 
[junit4:junit4]   2> 17659 T154 C14 P29344 /update {wt=javabin&version=2} {add=[140 (1413151830627581952)]} 0 8
[junit4:junit4]   2> 17664 T124 C15 P29328 /update {wt=javabin&version=2} {add=[141 (1413151830640164864)]} 0 2
[junit4:junit4]   2> 17677 T175 C13 P29355 REQ /update {update.distrib=FROMLEADER&distrib.from=http://127.0.0.1:29344/solr/collection1/&wt=javabin&version=2} status=0 QTime=3 
[junit4:junit4]   2> 17678 T156 C14 P29344 REQ /update {distrib.from=http://127.0.0.1:29336/solr/collection1/&update.distrib=TOLEADER&wt=javabin&version=2} status=0 QTime=8 
[junit4:junit4]   2> 17679 T140 C12 P29336 /update {wt=javabin&version=2} {add=[141]} 0 12
[junit4:junit4]   2> 17684 T124 C15 P29328 /update {wt=javabin&version=2} {add=[142 (1413151830661136384)]} 0 2
[junit4:junit4]   2> 17753 T175 C13 P29355 REQ /update {distrib.from=http://127.0.0.1:29344/solr/collection1/&update.distrib=FROMLEADER&wt=javabin&version=2} status=0 QTime=36 
[junit4:junit4]   2> 17754 T154 C14 P29344 /update {wt=javabin&version=2} {add=[142 (1413151830666379264)]} 0 67
[junit4:junit4]   2> 17778 T124 C15 P29328 /update {wt=javabin&version=2} {add=[143 (1413151830745022464)]} 0 16
[junit4:junit4]   2> 17792 T175 C13 P29355 REQ /update {update.distrib=FROMLEADER&distrib.from=http://127.0.0.1:29344/solr/collection1/&wt=javabin&version=2} status=0 QTime=3 
[junit4:junit4]   2> 17793 T156 C14 P29344 REQ /update {distrib.from=http://127.0.0.1:29336/solr/collection1/&update.distrib=TOLEADER&wt=javabin&version=2} status=0 QTime=9 
[junit4:junit4]   2> 17794 T140 C12 P29336 /update {wt=javabin&version=2} {add=[143]} 0 13
[junit4:junit4]   2> 17800 T124 C15 P29328 /update {wt=javabin&version=2} {add=[144 (1413151830780674048)]} 0 3
[junit4:junit4]   2> 17811 T175 C13 P29355 REQ /update {distrib.from=http://127.0.0.1:29344/solr/collection1/&update.distrib=FROMLEADER&wt=javabin&version=2} status=0 QTime=2 
[junit4:junit4]   2> 17811 T154 C14 P29344 /update {wt=javabin&version=2} {add=[144 (1413151830790111232)]} 0 5
[junit4:junit4]   2> 17816 T124 C15 P29328 /update {wt=javabin&version=2} {add=[145 (1413151830798499840)]} 0 2
[junit4:junit4]   2> 17828 T175 C13 P29355 REQ /update {update.distrib=FROMLEADER&distrib.from=http://127.0.0.1:29344/solr/collection1/&wt=javabin&version=2} status=0 QTime=2 
[junit4:junit4]   2> 17828 T156 C14 P29344 REQ /update {distrib.from=http://127.0.0.1:29336/solr/collection1/&update.distrib=TOLEADER&wt=javabin&version=2} status=0 QTime=6 
[junit4:junit4]   2> 17829 T140 C12 P29336 /update {wt=javabin&version=2} {add=[145]} 0 9
[junit4:junit4]   2> 17835 T124 C15 P29328 /update {wt=javabin&version=2} {add=[146 (1413151830818422784)]} 0 2
[junit4:junit4]   2> 17872 T162 C11 P29348 REQ /update {distrib.from=http://127.0.0.1:29336/solr/collection1/&update.distrib=FROMLEADER&wt=javabin&version=2} status=0 QTime=15 
[junit4:junit4]   2> 17873 T140 C12 P29336 /update {wt=javabin&version=2} {add=[146 (1413151830825762816)]} 0 34
[junit4:junit4]   2> 17878 T124 C15 P29328 /update {wt=javabin&version=2} {add=[147 (1413151830863511552)]} 0 2
[junit4:junit4]   2> 17890 T175 C13 P29355 REQ /update {update.distrib=FROMLEADER&distrib.from=http://127.0.0.1:29344/solr/collection1/&wt=javabin&version=2} status=0 QTime=2 
[junit4:junit4]   2> 17891 T156 C14 P29344 REQ /update {distrib.from=http://127.0.0.1:29336/solr/collection1/&update.distrib=TOLEADER&wt=javabin&version=2} status=0 QTime=7 
[junit4:junit4]   2> 17892 T140 C12 P29336 /update {wt=javabin&version=2} {add=[147]} 0 10
[junit4:junit4]   2> 17896 T124 C15 P29328 /update {wt=javabin&version=2} {add=[148 (1413151830883434496)]} 0 2
[junit4:junit4]   2> 17907 T162 C11 P29348 REQ /update {distrib.from=http://127.0.0.1:29336/solr/collection1/&update.distrib=FROMLEADER&wt=javabin&version=2} status=0 QTime=3 
[junit4:junit4]   2> 17907 T140 C12 P29336 /update {wt=javabin&version=2} {add=[148 (1413151830888677376)]} 0 8
[junit4:junit4]   2> 17912 T124 C15 P29328 /update {wt=javabin&version=2} {add=[149 (1413151830900211712)]} 0 2
[junit4:junit4]   2> 17924 T175 C13 P29355 REQ /update {update.distrib=FROMLEADER&distrib.from=http://127.0.0.1:29344/solr/collection1/&wt=javabin&version=2} status=0 QTime=2 
[junit4:junit4]   2> 17924 T156 C14 P29344 REQ /update {distrib.from=http://127.0.0.1:29336/solr/collection1/&update.distrib=TOLEADER&wt=javabin&version=2} status=0 QTime=6 
[junit4:junit4]   2> 17925 T140 C12 P29336 /update {wt=javabin&version=2} {add=[149]} 0 10
[junit4:junit4]   2> 17925 T112 oasc.AbstractDistribZkTestBase.waitForRecoveriesToFinish Wait for recoveries to finish - collection: collection1 failOnTimeout:true timeout (sec):1440
[junit4:junit4]   2> 17927 T112 oascc.ZkStateReader.updateClusterState Updating cloud state from ZooKeeper... 
[junit4:junit4]   2> 17931 T124 C15 P29328 oasu.DirectUpdateHandler2.commit start commit{flags=0,_version_=0,optimize=false,openSearcher=true,waitSearcher=true,expungeDeletes=false,softCommit=false}
[junit4:junit4]   2> 18384 T124 C15 P29328 oasc.SolrDeletionPolicy.onCommit SolrDeletionPolicy.onCommit: commits:num=2
[junit4:junit4]   2> 		commit{dir=NRTCachingDirectory(org.apache.lucene.store.NIOFSDirectory@/usr/home/hudson/hudson-slave/workspace/Lucene-Solr-Tests-4.x-java7/solr/build/solr-core/test/J1/org.apache.solr.cloud.BasicDistributedZk2Test-1347686588405/control/data/index lockFactory=org.apache.lucene.store.NativeFSLockFactory@62c360a5; maxCacheMB=48.0 maxMergeSizeMB=4.0),segFN=segments_2,generation=2,filenames=[_0_Block_0.tip, _0_Block_0.pos, _0_Block_0.tim, _0_MockVariableIntBlock_0.doc, _0_TestBloomFilteredLucene40Postings_0.prx, _0_MockVariableIntBlock_0.skp, _0_MockFixedIntBlock_0.tib, _0_MockVariableIntBlock_0.pyl, _0_MockFixedIntBlock_0.skp, _0_MockFixedIntBlock_0.pyl, _0_MockVariableIntBlock_0.tib, _0_MockFixedIntBlock_0.tii, _0_MockVariableIntBlock_0.pos, _0_TestBloomFilteredLucene40Postings_0.frq, _0.si, _0_MockVariableIntBlock_0.tii, _0_TestBloomFilteredLucene40Postings_0.tim, _0_TestBloomFilteredLucene40Postings_0.blm, _0_TestBloomFilteredLucene40Postings_0.tip, _0.fnm, _0_Block_0.doc, _0_MockFixedIntBlock_0.pos, _0_nrm.cfs, _0_MockFixedIntBlock_0.frq, _0_MockFixedIntBlock_0.doc, _0_MockVariableIntBlock_0.frq, _0_nrm.cfe, segments_2, _0.fdx, _0.fdt]
[junit4:junit4]   2> 		commit{dir=NRTCachingDirectory(org.apache.lucene.store.NIOFSDirectory@/usr/home/hudson/hudson-slave/workspace/Lucene-Solr-Tests-4.x-java7/solr/build/solr-core/test/J1/org.apache.solr.cloud.BasicDistributedZk2Test-1347686588405/control/data/index lockFactory=org.apache.lucene.store.NativeFSLockFactory@62c360a5; maxCacheMB=48.0 maxMergeSizeMB=4.0),segFN=segments_3,generation=3,filenames=[_5_nrm.cfe, _6_MockFixedIntBlock_0.pyl, _3_MockVariableIntBlock_0.frq, _3.fdt, _4_MockVariableIntBlock_0.tii, _7.fnm, _6_MockFixedIntBlock_0.skp, _6_Block_0.pos, _3_TestBloomFilteredLucene40Postings_0.frq, _7_MockFixedIntBlock_0.pos, _7_MockFixedIntBlock_0.skp, _6_MockVariableIntBlock_0.tii, _1_Block_0.pos, _3_TestBloomFilteredLucene40Postings_0.tim, _0_TestBloomFilteredLucene40Postings_0.blm, _6_MockVariableIntBlock_0.tib, _4_MockFixedIntBlock_0.pos, _1_MockVariableIntBlock_0.tii, _3_TestBloomFilteredLucene40Postings_0.tip, _1_MockVariableIntBlock_0.tib, _5_TestBloomFilteredLucene40Postings_0.frq, _1.fdx, _4_MockVariableIntBlock_0.tib, _1.fdt, _5_nrm.cfs, _0_MockVariableIntBlock_0.frq, _4_MockFixedIntBlock_0.frq, _1_MockFixedIntBlock_0.pos, _6.fdt, _2.si, _1_MockVariableIntBlock_0.skp, _7_MockVariableIntBlock_0.pos, _2_Block_0.tim, _3_MockFixedIntBlock_0.frq, _0_MockVariableIntBlock_0.doc, _2_Block_0.tip, _6.fdx, _1_MockVariableIntBlock_0.pyl, _6_MockFixedIntBlock_0.tib, _6_MockFixedIntBlock_0.tii, _5_Block_0.tim, _3_MockVariableIntBlock_0.tii, _2_nrm.cfe, _0_MockVariableIntBlock_0.pos, _7_MockVariableIntBlock_0.skp, _2_nrm.cfs, _2_TestBloomFilteredLucene40Postings_0.frq, _4_TestBloomFi

[...truncated too long message...]

keeper.ClientCnxn$EventThread.processEvent(ClientCnxn.java:526)
[junit4:junit4]   2> 	at org.apache.zookeeper.ClientCnxn$EventThread.run(ClientCnxn.java:502)
[junit4:junit4]   2> 
[junit4:junit4]   2> 188829 T184 oasc.JmxMonitoredMap$SolrDynamicMBean.getMBeanInfo WARNING Could not getStatistics on info bean Lazy[solr.ReplicationHandler] java.lang.IllegalArgumentException: /usr/home/hudson/hudson-slave/workspace/Lucene-Solr-Tests-4.x-java7/solr/build/solr-core/test/J1/org.apache.solr.cloud.BasicDistributedZk2Test-1347686588405/jetty4/index does not exist
[junit4:junit4]   2> 	at org.apache.commons.io.FileUtils.sizeOfDirectory(FileUtils.java:2074)
[junit4:junit4]   2> 	at org.apache.solr.handler.ReplicationHandler.getIndexSize(ReplicationHandler.java:477)
[junit4:junit4]   2> 	at org.apache.solr.handler.ReplicationHandler.getStatistics(ReplicationHandler.java:525)
[junit4:junit4]   2> 	at org.apache.solr.core.RequestHandlers$LazyRequestHandlerWrapper.getStatistics(RequestHandlers.java:310)
[junit4:junit4]   2> 	at org.apache.solr.core.JmxMonitoredMap$SolrDynamicMBean.getMBeanInfo(JmxMonitoredMap.java:231)
[junit4:junit4]   2> 	at com.sun.jmx.interceptor.DefaultMBeanServerInterceptor.getClassName(DefaultMBeanServerInterceptor.java:1804)
[junit4:junit4]   2> 	at com.sun.jmx.interceptor.DefaultMBeanServerInterceptor.safeGetClassName(DefaultMBeanServerInterceptor.java:1595)
[junit4:junit4]   2> 	at com.sun.jmx.interceptor.DefaultMBeanServerInterceptor.checkMBeanPermission(DefaultMBeanServerInterceptor.java:1813)
[junit4:junit4]   2> 	at com.sun.jmx.interceptor.DefaultMBeanServerInterceptor.exclusiveUnregisterMBean(DefaultMBeanServerInterceptor.java:430)
[junit4:junit4]   2> 	at com.sun.jmx.interceptor.DefaultMBeanServerInterceptor.unregisterMBean(DefaultMBeanServerInterceptor.java:415)
[junit4:junit4]   2> 	at com.sun.jmx.mbeanserver.JmxMBeanServer.unregisterMBean(JmxMBeanServer.java:536)
[junit4:junit4]   2> 	at org.apache.solr.core.JmxMonitoredMap.unregister(JmxMonitoredMap.java:175)
[junit4:junit4]   2> 	at org.apache.solr.core.JmxMonitoredMap.clear(JmxMonitoredMap.java:116)
[junit4:junit4]   2> 	at org.apache.solr.core.SolrCore.close(SolrCore.java:864)
[junit4:junit4]   2> 	at org.apache.solr.cloud.ShardLeaderElectionContext.runLeaderProcess(ElectionContext.java:213)
[junit4:junit4]   2> 	at org.apache.solr.cloud.LeaderElector.runIamLeaderProcess(LeaderElector.java:158)
[junit4:junit4]   2> 	at org.apache.solr.cloud.LeaderElector.checkIfIamLeader(LeaderElector.java:102)
[junit4:junit4]   2> 	at org.apache.solr.cloud.LeaderElector.access$000(LeaderElector.java:56)
[junit4:junit4]   2> 	at org.apache.solr.cloud.LeaderElector$1.process(LeaderElector.java:131)
[junit4:junit4]   2> 	at org.apache.zookeeper.ClientCnxn$EventThread.processEvent(ClientCnxn.java:526)
[junit4:junit4]   2> 	at org.apache.zookeeper.ClientCnxn$EventThread.run(ClientCnxn.java:502)
[junit4:junit4]   2> 
[junit4:junit4]   2> 188835 T184 oasc.SolrCore.closeSearcher [collection1] Closing main searcher on request.
[junit4:junit4]   2> 188839 T184 oasu.DirectUpdateHandler2.close closing DirectUpdateHandler2{commits=5,autocommits=0,soft autocommits=0,optimizes=0,rollbacks=0,expungeDeletes=0,docsPending=0,adds=0,deletesById=0,deletesByQuery=0,errors=0,cumulative_adds=35,cumulative_deletesById=0,cumulative_deletesByQuery=0,cumulative_errors=0}
[junit4:junit4]   2> 188839 T184 oasu.DefaultSolrCoreState.decref SolrCoreState ref count has reached 0 - closing IndexWriter
[junit4:junit4]   2> 188842 T184 oasu.DefaultSolrCoreState.decref Closing SolrCoreState - canceling any ongoing recovery
[junit4:junit4]   2> 188842 T184 oasc.LeaderElector$1.process WARNING  org.apache.zookeeper.KeeperException$SessionExpiredException: KeeperErrorCode = Session expired for /collections/collection1/leader_elect/shard2/election/88321988258103302-127.0.0.1:29355_solr_collection1-n_0000000004
[junit4:junit4]   2> 	at org.apache.zookeeper.KeeperException.create(KeeperException.java:118)
[junit4:junit4]   2> 	at org.apache.zookeeper.KeeperException.create(KeeperException.java:42)
[junit4:junit4]   2> 	at org.apache.zookeeper.ZooKeeper.delete(ZooKeeper.java:734)
[junit4:junit4]   2> 	at org.apache.solr.common.cloud.SolrZkClient$2.execute(SolrZkClient.java:178)
[junit4:junit4]   2> 	at org.apache.solr.common.cloud.SolrZkClient$2.execute(SolrZkClient.java:175)
[junit4:junit4]   2> 	at org.apache.solr.common.cloud.ZkCmdExecutor.retryOperation(ZkCmdExecutor.java:67)
[junit4:junit4]   2> 	at org.apache.solr.common.cloud.SolrZkClient.delete(SolrZkClient.java:175)
[junit4:junit4]   2> 	at org.apache.solr.cloud.ElectionContext.cancelElection(ElectionContext.java:60)
[junit4:junit4]   2> 	at org.apache.solr.cloud.ShardLeaderElectionContext.runLeaderProcess(ElectionContext.java:151)
[junit4:junit4]   2> 	at org.apache.solr.cloud.LeaderElector.runIamLeaderProcess(LeaderElector.java:158)
[junit4:junit4]   2> 	at org.apache.solr.cloud.LeaderElector.checkIfIamLeader(LeaderElector.java:102)
[junit4:junit4]   2> 	at org.apache.solr.cloud.LeaderElector.joinElection(LeaderElector.java:275)
[junit4:junit4]   2> 	at org.apache.solr.cloud.ShardLeaderElectionContext.rejoinLeaderElection(ElectionContext.java:326)
[junit4:junit4]   2> 	at org.apache.solr.cloud.ShardLeaderElectionContext.runLeaderProcess(ElectionContext.java:204)
[junit4:junit4]   2> 	at org.apache.solr.cloud.LeaderElector.runIamLeaderProcess(LeaderElector.java:158)
[junit4:junit4]   2> 	at org.apache.solr.cloud.LeaderElector.checkIfIamLeader(LeaderElector.java:102)
[junit4:junit4]   2> 	at org.apache.solr.cloud.LeaderElector.access$000(LeaderElector.java:56)
[junit4:junit4]   2> 	at org.apache.solr.cloud.LeaderElector$1.process(LeaderElector.java:131)
[junit4:junit4]   2> 	at org.apache.zookeeper.ClientCnxn$EventThread.processEvent(ClientCnxn.java:526)
[junit4:junit4]   2> 	at org.apache.zookeeper.ClientCnxn$EventThread.run(ClientCnxn.java:502)
[junit4:junit4]   2> 
[junit4:junit4]   2> 188843 T184 oascc.ZkStateReader$3.process Updating live nodes
[junit4:junit4]   2> 188843 T184 oascc.ZkStateReader$3.process WARNING ZooKeeper watch triggered, but Solr cannot talk to ZK
[junit4:junit4]   2> 188843 T184 oascc.ZkStateReader$2.process A cluster state change has occurred - updating...
[junit4:junit4]   2> 188844 T184 oascc.ZkStateReader$2.process WARNING ZooKeeper watch triggered, but Solr cannot talk to ZK
[junit4:junit4]   2> 188844 T184 oascc.ConnectionManager.process Watcher org.apache.solr.common.cloud.ConnectionManager@2cf10cfc name:ZooKeeperConnection Watcher:127.0.0.1:29325/solr got event WatchedEvent state:Disconnected type:None path:null path:null type:None
[junit4:junit4]   2> 188844 T184 oascc.ConnectionManager.process Client->ZooKeeper status change trigger but we are already closed
[junit4:junit4]   2> 188845 T184 oaz.ClientCnxn$EventThread.run EventThread shut down
[junit4:junit4]   2> NOTE: test params are: codec=Lucene40: {n_f1=PostingsFormat(name=TestBloomFilteredLucene40Postings), foo_b=Block(blocksize=128), foo_d=MockFixedIntBlock(blockSize=647), foo_f=Block(blocksize=128), n_tl1=PostingsFormat(name=TestBloomFilteredLucene40Postings), n_d1=MockVariableIntBlock(baseBlockSize=115), rnd_b=MockFixedIntBlock(blockSize=647), intDefault=MockVariableIntBlock(baseBlockSize=115), n_td1=PostingsFormat(name=TestBloomFilteredLucene40Postings), timestamp=MockVariableIntBlock(baseBlockSize=115), id=MockFixedIntBlock(blockSize=647), range_facet_sl=Block(blocksize=128), range_facet_si=PostingsFormat(name=TestBloomFilteredLucene40Postings), oddField_s=Block(blocksize=128), multiDefault=PostingsFormat(name=TestBloomFilteredLucene40Postings), n_tf1=MockVariableIntBlock(baseBlockSize=115), n_dt1=PostingsFormat(name=TestBloomFilteredLucene40Postings), n_ti1=MockFixedIntBlock(blockSize=647), range_facet_l=MockVariableIntBlock(baseBlockSize=115), text=Block(blocksize=128), _version_=MockVariableIntBlock(baseBlockSize=115), SubjectTerms_mfacet=MockVariableIntBlock(baseBlockSize=115), a_t=MockVariableIntBlock(baseBlockSize=115), n_tdt1=MockVariableIntBlock(baseBlockSize=115), other_tl1=MockVariableIntBlock(baseBlockSize=115), n_l1=MockVariableIntBlock(baseBlockSize=115), a_si=PostingsFormat(name=TestBloomFilteredLucene40Postings)}, sim=RandomSimilarityProvider(queryNorm=false,coord=crazy): {}, locale=ms, timezone=Australia/Eucla
[junit4:junit4]   2> NOTE: FreeBSD 9.0-RELEASE amd64/Oracle Corporation 1.7.0_06 (64-bit)/cpus=16,threads=1,free=56447776,total=116391936
[junit4:junit4]   2> NOTE: All tests run in this JVM: [ZkNodePropsTest, LegacyHTMLStripCharFilterTest, TestMergePolicyConfig, DirectUpdateHandlerTest, ShowFileRequestHandlerTest, TestReversedWildcardFilterFactory, TestCSVLoader, RequiredFieldsTest, ConvertedLegacyTest, TimeZoneUtilsTest, TestQueryUtils, MultiTermTest, SolrInfoMBeanTest, BasicZkTest, DisMaxRequestHandlerTest, XmlUpdateRequestHandlerTest, SolrCoreTest, BasicDistributedZk2Test]
[junit4:junit4] Completed on J1 in 189.12s, 1 test, 1 failure <<< FAILURES!

[...truncated 496 lines...]
BUILD FAILED
/usr/home/hudson/hudson-slave/workspace/Lucene-Solr-Tests-4.x-java7/build.xml:29: The following error occurred while executing this line:
/usr/home/hudson/hudson-slave/workspace/Lucene-Solr-Tests-4.x-java7/solr/build.xml:146: The following error occurred while executing this line:
/usr/home/hudson/hudson-slave/workspace/Lucene-Solr-Tests-4.x-java7/lucene/module-build.xml:63: The following error occurred while executing this line:
/usr/home/hudson/hudson-slave/workspace/Lucene-Solr-Tests-4.x-java7/lucene/common-build.xml:1133: The following error occurred while executing this line:
/usr/home/hudson/hudson-slave/workspace/Lucene-Solr-Tests-4.x-java7/lucene/common-build.xml:810: There were test failures: 229 suites, 927 tests, 1 failure, 6 ignored (1 assumption)

Total time: 34 minutes 34 seconds
Build step 'Invoke Ant' marked build as failure
Recording test results
Email was triggered for: Failure
Sending email for trigger: Failure



Mime
View raw message