lucene-dev mailing list archives

Site index · List index
Message view « Date » · « Thread »
Top « Date » · « Thread »
From Apache Jenkins Server <jenk...@builds.apache.org>
Subject [JENKINS] Lucene-Solr-Tests-trunk-Java6 - Build # 15235 - Still Failing
Date Sat, 15 Sep 2012 07:07:08 GMT
Build: https://builds.apache.org/job/Lucene-Solr-Tests-trunk-Java6/15235/

1 tests failed.
FAILED:  org.apache.solr.cloud.BasicDistributedZk2Test.testDistribSearch

Error Message:
Shard still reported as live in zk

Stack Trace:
java.lang.AssertionError: Shard still reported as live in zk
	at __randomizedtesting.SeedInfo.seed([F6F5A9D221F8A205:771327CA56A7C239]:0)
	at org.junit.Assert.fail(Assert.java:93)
	at org.apache.solr.cloud.AbstractFullDistribZkTestBase.waitToSeeNotLive(AbstractFullDistribZkTestBase.java:1215)
	at org.apache.solr.cloud.BasicDistributedZk2Test.brindDownShardIndexSomeDocsAndRecover(BasicDistributedZk2Test.java:190)
	at org.apache.solr.cloud.BasicDistributedZk2Test.doTest(BasicDistributedZk2Test.java:83)
	at org.apache.solr.BaseDistributedSearchTestCase.testDistribSearch(BaseDistributedSearchTestCase.java:691)
	at sun.reflect.NativeMethodAccessorImpl.invoke0(Native Method)
	at sun.reflect.NativeMethodAccessorImpl.invoke(NativeMethodAccessorImpl.java:57)
	at sun.reflect.DelegatingMethodAccessorImpl.invoke(DelegatingMethodAccessorImpl.java:43)
	at java.lang.reflect.Method.invoke(Method.java:616)
	at com.carrotsearch.randomizedtesting.RandomizedRunner.invoke(RandomizedRunner.java:1559)
	at com.carrotsearch.randomizedtesting.RandomizedRunner.access$600(RandomizedRunner.java:79)
	at com.carrotsearch.randomizedtesting.RandomizedRunner$6.evaluate(RandomizedRunner.java:737)
	at com.carrotsearch.randomizedtesting.RandomizedRunner$7.evaluate(RandomizedRunner.java:773)
	at com.carrotsearch.randomizedtesting.RandomizedRunner$8.evaluate(RandomizedRunner.java:787)
	at com.carrotsearch.randomizedtesting.rules.SystemPropertiesRestoreRule$1.evaluate(SystemPropertiesRestoreRule.java:53)
	at org.apache.lucene.util.TestRuleSetupTeardownChained$1.evaluate(TestRuleSetupTeardownChained.java:50)
	at org.apache.lucene.util.TestRuleFieldCacheSanity$1.evaluate(TestRuleFieldCacheSanity.java:51)
	at org.apache.lucene.util.AbstractBeforeAfterRule$1.evaluate(AbstractBeforeAfterRule.java:45)
	at com.carrotsearch.randomizedtesting.rules.SystemPropertiesInvariantRule$1.evaluate(SystemPropertiesInvariantRule.java:55)
	at org.apache.lucene.util.TestRuleThreadAndTestName$1.evaluate(TestRuleThreadAndTestName.java:48)
	at org.apache.lucene.util.TestRuleIgnoreAfterMaxFailures$1.evaluate(TestRuleIgnoreAfterMaxFailures.java:70)
	at org.apache.lucene.util.TestRuleMarkFailure$1.evaluate(TestRuleMarkFailure.java:48)
	at com.carrotsearch.randomizedtesting.rules.StatementAdapter.evaluate(StatementAdapter.java:36)
	at com.carrotsearch.randomizedtesting.ThreadLeakControl$StatementRunner.run(ThreadLeakControl.java:358)
	at com.carrotsearch.randomizedtesting.ThreadLeakControl.forkTimeoutingTask(ThreadLeakControl.java:782)
	at com.carrotsearch.randomizedtesting.ThreadLeakControl$3.evaluate(ThreadLeakControl.java:442)
	at com.carrotsearch.randomizedtesting.RandomizedRunner.runSingleTest(RandomizedRunner.java:746)
	at com.carrotsearch.randomizedtesting.RandomizedRunner$3.evaluate(RandomizedRunner.java:648)
	at com.carrotsearch.randomizedtesting.RandomizedRunner$4.evaluate(RandomizedRunner.java:682)
	at com.carrotsearch.randomizedtesting.RandomizedRunner$5.evaluate(RandomizedRunner.java:693)
	at com.carrotsearch.randomizedtesting.rules.StatementAdapter.evaluate(StatementAdapter.java:36)
	at com.carrotsearch.randomizedtesting.rules.SystemPropertiesRestoreRule$1.evaluate(SystemPropertiesRestoreRule.java:53)
	at org.apache.lucene.util.AbstractBeforeAfterRule$1.evaluate(AbstractBeforeAfterRule.java:45)
	at org.apache.lucene.util.TestRuleStoreClassName$1.evaluate(TestRuleStoreClassName.java:42)
	at com.carrotsearch.randomizedtesting.rules.SystemPropertiesInvariantRule$1.evaluate(SystemPropertiesInvariantRule.java:55)
	at com.carrotsearch.randomizedtesting.rules.NoShadowingOrOverridesOnMethodsRule$1.evaluate(NoShadowingOrOverridesOnMethodsRule.java:39)
	at com.carrotsearch.randomizedtesting.rules.NoShadowingOrOverridesOnMethodsRule$1.evaluate(NoShadowingOrOverridesOnMethodsRule.java:39)
	at com.carrotsearch.randomizedtesting.rules.StatementAdapter.evaluate(StatementAdapter.java:36)
	at org.apache.lucene.util.TestRuleAssertionsRequired$1.evaluate(TestRuleAssertionsRequired.java:43)
	at org.apache.lucene.util.TestRuleMarkFailure$1.evaluate(TestRuleMarkFailure.java:48)
	at org.apache.lucene.util.TestRuleIgnoreAfterMaxFailures$1.evaluate(TestRuleIgnoreAfterMaxFailures.java:70)
	at org.apache.lucene.util.TestRuleIgnoreTestSuites$1.evaluate(TestRuleIgnoreTestSuites.java:55)
	at com.carrotsearch.randomizedtesting.rules.StatementAdapter.evaluate(StatementAdapter.java:36)
	at com.carrotsearch.randomizedtesting.ThreadLeakControl$StatementRunner.run(ThreadLeakControl.java:358)
	at java.lang.Thread.run(Thread.java:679)




Build Log:
[...truncated 7582 lines...]
[junit4:junit4] Suite: org.apache.solr.cloud.BasicDistributedZk2Test
[junit4:junit4]   2> 4 T1887 oas.SolrTestCaseJ4.setUp ###Starting testDistribSearch
[junit4:junit4]   2> Creating dataDir: /usr/home/hudson/hudson-slave/workspace/Lucene-Solr-Tests-trunk-Java6/solr/build/solr-core/test/J1/./solrtest-BasicDistributedZk2Test-1347692626743
[junit4:junit4]   2> 5 T1887 oasc.ZkTestServer.run STARTING ZK TEST SERVER
[junit4:junit4]   2> 7 T1888 oazs.ZooKeeperServer.setTickTime tickTime set to 1000
[junit4:junit4]   2> 8 T1888 oazs.NIOServerCnxn$Factory.<init> binding to port 0.0.0.0/0.0.0.0:0
[junit4:junit4]   2> 9 T1888 oazsp.FileTxnSnapLog.save Snapshotting: 0
[junit4:junit4]   2> 106 T1887 oasc.ZkTestServer.run start zk server on port:46808
[junit4:junit4]   2> 106 T1887 oaz.ZooKeeper.<init> Initiating client connection, connectString=127.0.0.1:46808 sessionTimeout=10000 watcher=org.apache.solr.common.cloud.ConnectionManager@1faa889a
[junit4:junit4]   2> 107 T1893 oaz.ClientCnxn$SendThread.startConnect Opening socket connection to server /127.0.0.1:46808
[junit4:junit4]   2> 107 T1887 oascc.ConnectionManager.waitForConnected Waiting for client to connect to ZooKeeper
[junit4:junit4]   2> 108 T1893 oaz.ClientCnxn$SendThread.primeConnection Socket connection established to localhost/127.0.0.1:46808, initiating session
[junit4:junit4]   2> 108 T1889 oazs.NIOServerCnxn$Factory.run Accepted socket connection from /140.211.11.196:37751
[junit4:junit4]   2> 109 T1889 oazs.NIOServerCnxn.readConnectRequest Client attempting to establish new session at /140.211.11.196:37751
[junit4:junit4]   2> 109 T1891 oazsp.FileTxnLog.append Creating new log file: log.1
[junit4:junit4]   2> 112 T1891 oazs.NIOServerCnxn.finishSessionInit Established session 0x139c8bd833b0000 with negotiated timeout 10000 for client /140.211.11.196:37751
[junit4:junit4]   2> 112 T1893 oaz.ClientCnxn$SendThread.readConnectResult Session establishment complete on server localhost/127.0.0.1:46808, sessionid = 0x139c8bd833b0000, negotiated timeout = 10000
[junit4:junit4]   2> 113 T1894 oascc.ConnectionManager.process Watcher org.apache.solr.common.cloud.ConnectionManager@1faa889a name:ZooKeeperConnection Watcher:127.0.0.1:46808 got event WatchedEvent state:SyncConnected type:None path:null path:null type:None
[junit4:junit4]   2> 113 T1887 oascc.ConnectionManager.waitForConnected Client is connected to ZooKeeper
[junit4:junit4]   2> 113 T1887 oascc.SolrZkClient.makePath makePath: /solr
[junit4:junit4]   2> 116 T1892 oazs.PrepRequestProcessor.pRequest Processed session termination for sessionid: 0x139c8bd833b0000
[junit4:junit4]   2> 125 T1894 oaz.ClientCnxn$EventThread.run EventThread shut down
[junit4:junit4]   2> 125 T1887 oaz.ZooKeeper.close Session: 0x139c8bd833b0000 closed
[junit4:junit4]   2> 126 T1887 oaz.ZooKeeper.<init> Initiating client connection, connectString=127.0.0.1:46808/solr sessionTimeout=10000 watcher=org.apache.solr.common.cloud.ConnectionManager@538d41c3
[junit4:junit4]   2> 125 T1889 oazs.NIOServerCnxn.closeSock Closed socket connection for client /140.211.11.196:37751 which had sessionid 0x139c8bd833b0000
[junit4:junit4]   2> 128 T1895 oaz.ClientCnxn$SendThread.startConnect Opening socket connection to server /127.0.0.1:46808
[junit4:junit4]   2> 129 T1895 oaz.ClientCnxn$SendThread.primeConnection Socket connection established to localhost/127.0.0.1:46808, initiating session
[junit4:junit4]   2> 128 T1887 oascc.ConnectionManager.waitForConnected Waiting for client to connect to ZooKeeper
[junit4:junit4]   2> 129 T1889 oazs.NIOServerCnxn$Factory.run Accepted socket connection from /140.211.11.196:64052
[junit4:junit4]   2> 130 T1889 oazs.NIOServerCnxn.readConnectRequest Client attempting to establish new session at /140.211.11.196:64052
[junit4:junit4]   2> 133 T1891 oazs.NIOServerCnxn.finishSessionInit Established session 0x139c8bd833b0001 with negotiated timeout 10000 for client /140.211.11.196:64052
[junit4:junit4]   2> 133 T1895 oaz.ClientCnxn$SendThread.readConnectResult Session establishment complete on server localhost/127.0.0.1:46808, sessionid = 0x139c8bd833b0001, negotiated timeout = 10000
[junit4:junit4]   2> 134 T1896 oascc.ConnectionManager.process Watcher org.apache.solr.common.cloud.ConnectionManager@538d41c3 name:ZooKeeperConnection Watcher:127.0.0.1:46808/solr got event WatchedEvent state:SyncConnected type:None path:null path:null type:None
[junit4:junit4]   2> 134 T1887 oascc.ConnectionManager.waitForConnected Client is connected to ZooKeeper
[junit4:junit4]   2> 134 T1887 oascc.SolrZkClient.makePath makePath: /collections/collection1
[junit4:junit4]   2> 194 T1887 oascc.SolrZkClient.makePath makePath: /collections/collection1/shards
[junit4:junit4]   2> 197 T1887 oascc.SolrZkClient.makePath makePath: /collections/control_collection
[junit4:junit4]   2> 246 T1887 oascc.SolrZkClient.makePath makePath: /collections/control_collection/shards
[junit4:junit4]   2> 249 T1887 oasc.AbstractZkTestCase.putConfig put /usr/home/hudson/hudson-slave/workspace/Lucene-Solr-Tests-trunk-Java6/solr/build/solr-core/test-files/solr/collection1/conf/solrconfig.xml to /configs/conf1/solrconfig.xml
[junit4:junit4]   2> 250 T1887 oascc.SolrZkClient.makePath makePath: /configs/conf1/solrconfig.xml
[junit4:junit4]   2> 307 T1887 oasc.AbstractZkTestCase.putConfig put /usr/home/hudson/hudson-slave/workspace/Lucene-Solr-Tests-trunk-Java6/solr/build/solr-core/test-files/solr/collection1/conf/schema.xml to /configs/conf1/schema.xml
[junit4:junit4]   2> 308 T1887 oascc.SolrZkClient.makePath makePath: /configs/conf1/schema.xml
[junit4:junit4]   2> 417 T1887 oasc.AbstractZkTestCase.putConfig put /usr/home/hudson/hudson-slave/workspace/Lucene-Solr-Tests-trunk-Java6/solr/build/solr-core/test-files/solr/collection1/conf/solrconfig.xml to /configs/conf1/solrconfig.xml
[junit4:junit4]   2> 418 T1887 oascc.SolrZkClient.makePath makePath: /configs/conf1/solrconfig.xml
[junit4:junit4]   2> 420 T1887 oasc.AbstractZkTestCase.putConfig put /usr/home/hudson/hudson-slave/workspace/Lucene-Solr-Tests-trunk-Java6/solr/build/solr-core/test-files/solr/collection1/conf/stopwords.txt to /configs/conf1/stopwords.txt
[junit4:junit4]   2> 420 T1887 oascc.SolrZkClient.makePath makePath: /configs/conf1/stopwords.txt
[junit4:junit4]   2> 433 T1887 oasc.AbstractZkTestCase.putConfig put /usr/home/hudson/hudson-slave/workspace/Lucene-Solr-Tests-trunk-Java6/solr/build/solr-core/test-files/solr/collection1/conf/protwords.txt to /configs/conf1/protwords.txt
[junit4:junit4]   2> 434 T1887 oascc.SolrZkClient.makePath makePath: /configs/conf1/protwords.txt
[junit4:junit4]   2> 436 T1887 oasc.AbstractZkTestCase.putConfig put /usr/home/hudson/hudson-slave/workspace/Lucene-Solr-Tests-trunk-Java6/solr/build/solr-core/test-files/solr/collection1/conf/currency.xml to /configs/conf1/currency.xml
[junit4:junit4]   2> 436 T1887 oascc.SolrZkClient.makePath makePath: /configs/conf1/currency.xml
[junit4:junit4]   2> 443 T1887 oasc.AbstractZkTestCase.putConfig put /usr/home/hudson/hudson-slave/workspace/Lucene-Solr-Tests-trunk-Java6/solr/build/solr-core/test-files/solr/collection1/conf/open-exchange-rates.json to /configs/conf1/open-exchange-rates.json
[junit4:junit4]   2> 444 T1887 oascc.SolrZkClient.makePath makePath: /configs/conf1/open-exchange-rates.json
[junit4:junit4]   2> 451 T1887 oasc.AbstractZkTestCase.putConfig put /usr/home/hudson/hudson-slave/workspace/Lucene-Solr-Tests-trunk-Java6/solr/build/solr-core/test-files/solr/collection1/conf/mapping-ISOLatin1Accent.txt to /configs/conf1/mapping-ISOLatin1Accent.txt
[junit4:junit4]   2> 452 T1887 oascc.SolrZkClient.makePath makePath: /configs/conf1/mapping-ISOLatin1Accent.txt
[junit4:junit4]   2> 459 T1887 oasc.AbstractZkTestCase.putConfig put /usr/home/hudson/hudson-slave/workspace/Lucene-Solr-Tests-trunk-Java6/solr/build/solr-core/test-files/solr/collection1/conf/old_synonyms.txt to /configs/conf1/old_synonyms.txt
[junit4:junit4]   2> 459 T1887 oascc.SolrZkClient.makePath makePath: /configs/conf1/old_synonyms.txt
[junit4:junit4]   2> 463 T1887 oasc.AbstractZkTestCase.putConfig put /usr/home/hudson/hudson-slave/workspace/Lucene-Solr-Tests-trunk-Java6/solr/build/solr-core/test-files/solr/collection1/conf/synonyms.txt to /configs/conf1/synonyms.txt
[junit4:junit4]   2> 463 T1887 oascc.SolrZkClient.makePath makePath: /configs/conf1/synonyms.txt
[junit4:junit4]   2> 473 T1892 oazs.PrepRequestProcessor.pRequest Processed session termination for sessionid: 0x139c8bd833b0001
[junit4:junit4]   2> 480 T1896 oaz.ClientCnxn$EventThread.run EventThread shut down
[junit4:junit4]   2> 480 T1887 oaz.ZooKeeper.close Session: 0x139c8bd833b0001 closed
[junit4:junit4]   2> 481 T1889 oazs.NIOServerCnxn.closeSock Closed socket connection for client /140.211.11.196:64052 which had sessionid 0x139c8bd833b0001
[junit4:junit4]   2> 482 T1887 oejs.Server.doStart jetty-8.1.2.v20120308
[junit4:junit4]   2> 486 T1887 oejs.AbstractConnector.doStart Started SocketConnector@0.0.0.0:44120
[junit4:junit4]   2> 487 T1887 oasc.SolrResourceLoader.locateSolrHome JNDI not configured for solr (NoInitialContextEx)
[junit4:junit4]   2> 487 T1887 oasc.SolrResourceLoader.locateSolrHome using system property solr.solr.home: /usr/home/hudson/hudson-slave/workspace/Lucene-Solr-Tests-trunk-Java6/solr/build/solr-core/test-files/solr
[junit4:junit4]   2> 488 T1887 oasc.SolrResourceLoader.<init> new SolrResourceLoader for deduced Solr Home: '/usr/home/hudson/hudson-slave/workspace/Lucene-Solr-Tests-trunk-Java6/solr/build/solr-core/test-files/solr/'
[junit4:junit4]   2> 511 T1887 oass.SolrDispatchFilter.init SolrDispatchFilter.init()
[junit4:junit4]   2> 511 T1887 oasc.SolrResourceLoader.locateSolrHome JNDI not configured for solr (NoInitialContextEx)
[junit4:junit4]   2> 511 T1887 oasc.SolrResourceLoader.locateSolrHome using system property solr.solr.home: /usr/home/hudson/hudson-slave/workspace/Lucene-Solr-Tests-trunk-Java6/solr/build/solr-core/test-files/solr
[junit4:junit4]   2> 512 T1887 oasc.CoreContainer$Initializer.initialize looking for solr.xml: /usr/home/hudson/hudson-slave/workspace/Lucene-Solr-Tests-trunk-Java6/solr/build/solr-core/test-files/solr/solr.xml
[junit4:junit4]   2> 512 T1887 oasc.CoreContainer.<init> New CoreContainer 1466463929
[junit4:junit4]   2> 512 T1887 oasc.CoreContainer.load Loading CoreContainer using Solr Home: '/usr/home/hudson/hudson-slave/workspace/Lucene-Solr-Tests-trunk-Java6/solr/build/solr-core/test-files/solr/'
[junit4:junit4]   2> 513 T1887 oasc.SolrResourceLoader.<init> new SolrResourceLoader for directory: '/usr/home/hudson/hudson-slave/workspace/Lucene-Solr-Tests-trunk-Java6/solr/build/solr-core/test-files/solr/'
[junit4:junit4]   2> 530 T1887 oasc.CoreContainer.load Registering Log Listener
[junit4:junit4]   2> 540 T1887 oasc.CoreContainer.initZooKeeper Zookeeper client=127.0.0.1:46808/solr
[junit4:junit4]   2> 541 T1887 oaz.ZooKeeper.<init> Initiating client connection, connectString=127.0.0.1:46808/solr sessionTimeout=5000 watcher=org.apache.solr.common.cloud.ConnectionManager@4e6307e6
[junit4:junit4]   2> 542 T1887 oascc.ConnectionManager.waitForConnected Waiting for client to connect to ZooKeeper
[junit4:junit4]   2> 542 T1906 oaz.ClientCnxn$SendThread.startConnect Opening socket connection to server /127.0.0.1:46808
[junit4:junit4]   2> 543 T1906 oaz.ClientCnxn$SendThread.primeConnection Socket connection established to localhost/127.0.0.1:46808, initiating session
[junit4:junit4]   2> 543 T1889 oazs.NIOServerCnxn$Factory.run Accepted socket connection from /140.211.11.196:52061
[junit4:junit4]   2> 544 T1889 oazs.NIOServerCnxn.readConnectRequest Client attempting to establish new session at /140.211.11.196:52061
[junit4:junit4]   2> 545 T1891 oazs.NIOServerCnxn.finishSessionInit Established session 0x139c8bd833b0002 with negotiated timeout 5000 for client /140.211.11.196:52061
[junit4:junit4]   2> 545 T1906 oaz.ClientCnxn$SendThread.readConnectResult Session establishment complete on server localhost/127.0.0.1:46808, sessionid = 0x139c8bd833b0002, negotiated timeout = 5000
[junit4:junit4]   2> 546 T1907 oascc.ConnectionManager.process Watcher org.apache.solr.common.cloud.ConnectionManager@4e6307e6 name:ZooKeeperConnection Watcher:127.0.0.1:46808/solr got event WatchedEvent state:SyncConnected type:None path:null path:null type:None
[junit4:junit4]   2> 546 T1887 oascc.ConnectionManager.waitForConnected Client is connected to ZooKeeper
[junit4:junit4]   2> 547 T1892 oazs.PrepRequestProcessor.pRequest Got user-level KeeperException when processing sessionid:0x139c8bd833b0002 type:create cxid:0x2 zxid:0xfffffffffffffffe txntype:unknown reqpath:n/a Error Path:/solr/overseer Error:KeeperErrorCode = NodeExists for /solr/overseer
[junit4:junit4]   2> 561 T1887 oascc.SolrZkClient.makePath makePath: /live_nodes
[junit4:junit4]   2> 563 T1887 oasc.ZkController.createEphemeralLiveNode Register node as live in ZooKeeper:/live_nodes/127.0.0.1:44120_solr
[junit4:junit4]   2> 564 T1892 oazs.PrepRequestProcessor.pRequest Got user-level KeeperException when processing sessionid:0x139c8bd833b0002 type:delete cxid:0x7 zxid:0xfffffffffffffffe txntype:unknown reqpath:n/a Error Path:/solr/live_nodes/127.0.0.1:44120_solr Error:KeeperErrorCode = NoNode for /solr/live_nodes/127.0.0.1:44120_solr
[junit4:junit4]   2> 572 T1887 oascc.SolrZkClient.makePath makePath: /live_nodes/127.0.0.1:44120_solr
[junit4:junit4]   2> 585 T1887 oashc.HttpShardHandlerFactory.getParameter Setting socketTimeout to: 0
[junit4:junit4]   2> 586 T1887 oashc.HttpShardHandlerFactory.getParameter Setting urlScheme to: http://
[junit4:junit4]   2> 586 T1887 oashc.HttpShardHandlerFactory.getParameter Setting connTimeout to: 0
[junit4:junit4]   2> 586 T1887 oashc.HttpShardHandlerFactory.getParameter Setting maxConnectionsPerHost to: 20
[junit4:junit4]   2> 587 T1887 oashc.HttpShardHandlerFactory.getParameter Setting corePoolSize to: 0
[junit4:junit4]   2> 587 T1887 oashc.HttpShardHandlerFactory.getParameter Setting maximumPoolSize to: 2147483647
[junit4:junit4]   2> 587 T1887 oashc.HttpShardHandlerFactory.getParameter Setting maxThreadIdleTime to: 5
[junit4:junit4]   2> 588 T1887 oashc.HttpShardHandlerFactory.getParameter Setting sizeOfQueue to: -1
[junit4:junit4]   2> 588 T1887 oashc.HttpShardHandlerFactory.getParameter Setting fairnessPolicy to: false
[junit4:junit4]   2> 588 T1887 oascsi.HttpClientUtil.createClient Creating new http client, config:maxConnectionsPerHost=20&maxConnections=10000&socketTimeout=0&connTimeout=0&retry=false
[junit4:junit4]   2> 598 T1887 oascc.SolrZkClient.makePath makePath: /overseer_elect/election
[junit4:junit4]   2> 639 T1892 oazs.PrepRequestProcessor.pRequest Got user-level KeeperException when processing sessionid:0x139c8bd833b0002 type:delete cxid:0x15 zxid:0xfffffffffffffffe txntype:unknown reqpath:n/a Error Path:/solr/overseer_elect/leader Error:KeeperErrorCode = NoNode for /solr/overseer_elect/leader
[junit4:junit4]   2> 640 T1887 oascc.SolrZkClient.makePath makePath: /overseer_elect/leader
[junit4:junit4]   2> 642 T1887 oasc.Overseer.start Overseer (id=88322383986491394-127.0.0.1:44120_solr-n_0000000000) starting
[junit4:junit4]   2> 643 T1892 oazs.PrepRequestProcessor.pRequest Got user-level KeeperException when processing sessionid:0x139c8bd833b0002 type:create cxid:0x1a zxid:0xfffffffffffffffe txntype:unknown reqpath:n/a Error Path:/solr/overseer Error:KeeperErrorCode = NodeExists for /solr/overseer
[junit4:junit4]   2> 651 T1892 oazs.PrepRequestProcessor.pRequest Got user-level KeeperException when processing sessionid:0x139c8bd833b0002 type:create cxid:0x1b zxid:0xfffffffffffffffe txntype:unknown reqpath:n/a Error Path:/solr/overseer Error:KeeperErrorCode = NodeExists for /solr/overseer
[junit4:junit4]   2> 652 T1892 oazs.PrepRequestProcessor.pRequest Got user-level KeeperException when processing sessionid:0x139c8bd833b0002 type:create cxid:0x1c zxid:0xfffffffffffffffe txntype:unknown reqpath:n/a Error Path:/solr/overseer Error:KeeperErrorCode = NodeExists for /solr/overseer
[junit4:junit4]   2> 658 T1892 oazs.PrepRequestProcessor.pRequest Got user-level KeeperException when processing sessionid:0x139c8bd833b0002 type:create cxid:0x1d zxid:0xfffffffffffffffe txntype:unknown reqpath:n/a Error Path:/solr/overseer Error:KeeperErrorCode = NodeExists for /solr/overseer
[junit4:junit4]   2> 660 T1909 oasc.OverseerCollectionProcessor.run Process current queue of collection creations
[junit4:junit4]   2> 660 T1887 oascc.SolrZkClient.makePath makePath: /clusterstate.json
[junit4:junit4]   2> 667 T1887 oascc.ZkStateReader.createClusterStateWatchersAndUpdate Updating cluster state from ZooKeeper... 
[junit4:junit4]   2> 668 T1908 oasc.Overseer$ClusterStateUpdater.run Starting to work on the main queue
[junit4:junit4]   2> 673 T1887 oasc.CoreContainer.create Creating SolrCore 'collection1' using instanceDir: /usr/home/hudson/hudson-slave/workspace/Lucene-Solr-Tests-trunk-Java6/solr/build/solr-core/test-files/solr/collection1
[junit4:junit4]   2> 674 T1887 oasc.ZkController.createCollectionZkNode Check for collection zkNode:control_collection
[junit4:junit4]   2> 674 T1887 oasc.ZkController.createCollectionZkNode Collection zkNode exists
[junit4:junit4]   2> 675 T1887 oasc.ZkController.readConfigName Load collection config from:/collections/control_collection
[junit4:junit4]   2> 676 T1887 oasc.SolrResourceLoader.<init> new SolrResourceLoader for directory: '/usr/home/hudson/hudson-slave/workspace/Lucene-Solr-Tests-trunk-Java6/solr/build/solr-core/test-files/solr/collection1/'
[junit4:junit4]   2> 677 T1887 oasc.SolrResourceLoader.replaceClassLoader Adding 'file:/usr/home/hudson/hudson-slave/workspace/Lucene-Solr-Tests-trunk-Java6/solr/build/solr-core/test-files/solr/collection1/lib/classes/' to classloader
[junit4:junit4]   2> 678 T1887 oasc.SolrResourceLoader.replaceClassLoader Adding 'file:/usr/home/hudson/hudson-slave/workspace/Lucene-Solr-Tests-trunk-Java6/solr/build/solr-core/test-files/solr/collection1/lib/README' to classloader
[junit4:junit4]   2> 714 T3 oasc.CoreContainer.finalize SEVERE CoreContainer was not shutdown prior to finalize(), indicates a bug -- POSSIBLE RESOURCE LEAK!!!  instance=1856609712
[junit4:junit4]   2> 733 T1887 oasc.SolrConfig.<init> Using Lucene MatchVersion: LUCENE_50
[junit4:junit4]   2> 808 T1887 oasc.SolrConfig.<init> Loaded SolrConfig: solrconfig.xml
[junit4:junit4]   2> 910 T1887 oass.IndexSchema.readSchema Reading Solr Schema
[junit4:junit4]   2> 917 T1887 oass.IndexSchema.readSchema Schema name=test
[junit4:junit4]   2> 1510 T1887 oass.OpenExchangeRatesOrgProvider.init Initialized with rates=open-exchange-rates.json, refreshInterval=1440.
[junit4:junit4]   2> 1521 T1887 oass.IndexSchema.readSchema default search field in schema is text
[junit4:junit4]   2> 1525 T1887 oass.IndexSchema.readSchema unique key field: id
[junit4:junit4]   2> 1536 T1887 oass.FileExchangeRateProvider.reload Reloading exchange rates from file currency.xml
[junit4:junit4]   2> 1540 T1887 oass.FileExchangeRateProvider.reload Reloading exchange rates from file currency.xml
[junit4:junit4]   2> 1544 T1887 oass.OpenExchangeRatesOrgProvider.reload Reloading exchange rates from open-exchange-rates.json
[junit4:junit4]   2> 1545 T1887 oass.OpenExchangeRatesOrgProvider.reload Reloading exchange rates from open-exchange-rates.json
[junit4:junit4]   2> 1546 T1887 oasc.SolrCore.<init> [collection1] Opening new SolrCore at /usr/home/hudson/hudson-slave/workspace/Lucene-Solr-Tests-trunk-Java6/solr/build/solr-core/test-files/solr/collection1/, dataDir=./org.apache.solr.cloud.BasicDistributedZk2Test-1347692626742/control/data/
[junit4:junit4]   2> 1547 T1887 oasc.JmxMonitoredMap.<init> JMX monitoring is enabled. Adding Solr mbeans to JMX Server: com.sun.jmx.mbeanserver.JmxMBeanServer@4e46b90a
[junit4:junit4]   2> 1581 T1887 oasc.SolrCore.getNewIndexDir WARNING New index directory detected: old=null new=./org.apache.solr.cloud.BasicDistributedZk2Test-1347692626742/control/data/index/
[junit4:junit4]   2> 1582 T1887 oasc.SolrCore.initIndex WARNING [collection1] Solr index directory './org.apache.solr.cloud.BasicDistributedZk2Test-1347692626742/control/data/index' doesn't exist. Creating new index...
[junit4:junit4]   2> 1584 T1887 oasc.CachingDirectoryFactory.get return new directory for /usr/home/hudson/hudson-slave/workspace/Lucene-Solr-Tests-trunk-Java6/solr/build/solr-core/test/J1/./org.apache.solr.cloud.BasicDistributedZk2Test-1347692626742/control/data/index forceNew:false
[junit4:junit4]   2> 1607 T1887 oasc.SolrDeletionPolicy.onCommit SolrDeletionPolicy.onCommit: commits:num=1
[junit4:junit4]   2> 		commit{dir=/usr/home/hudson/hudson-slave/workspace/Lucene-Solr-Tests-trunk-Java6/solr/build/solr-core/test/J1/org.apache.solr.cloud.BasicDistributedZk2Test-1347692626742/control/data/index,segFN=segments_1,generation=1,filenames=[segments_1]
[junit4:junit4]   2> 1608 T1887 oasc.SolrDeletionPolicy.updateCommits newest commit = 1
[junit4:junit4]   2> 1609 T1887 oasc.SolrCore.initWriters created xml: solr.XMLResponseWriter
[junit4:junit4]   2> 1611 T1887 oasup.UpdateRequestProcessorChain.init inserting DistributedUpdateProcessorFactory into updateRequestProcessorChain "dedupe"
[junit4:junit4]   2> 1611 T1887 oasup.UpdateRequestProcessorChain.init inserting DistributedUpdateProcessorFactory into updateRequestProcessorChain "dedupe-allfields"
[junit4:junit4]   2> 1612 T1887 oasup.UpdateRequestProcessorChain.init inserting DistributedUpdateProcessorFactory into updateRequestProcessorChain "stored_sig"
[junit4:junit4]   2> 1612 T1887 oasup.UpdateRequestProcessorChain.init inserting DistributedUpdateProcessorFactory into updateRequestProcessorChain "uniq-fields"
[junit4:junit4]   2> 1613 T1887 oasup.UpdateRequestProcessorChain.init inserting DistributedUpdateProcessorFactory into updateRequestProcessorChain "distrib-dup-test-chain-implicit"
[junit4:junit4]   2> 1614 T1887 oasc.RequestHandlers.initHandlersFromConfig adding lazy requestHandler: solr.ReplicationHandler
[junit4:junit4]   2> 1614 T1887 oasc.RequestHandlers.initHandlersFromConfig created /replication: solr.ReplicationHandler
[junit4:junit4]   2> 1615 T1887 oasc.RequestHandlers.initHandlersFromConfig created standard: solr.StandardRequestHandler
[junit4:junit4]   2> 1615 T1887 oasc.RequestHandlers.initHandlersFromConfig created /get: solr.RealTimeGetHandler
[junit4:junit4]   2> 1616 T1887 oasc.RequestHandlers.initHandlersFromConfig created dismax: solr.SearchHandler
[junit4:junit4]   2> 1616 T1887 oasc.RequestHandlers.initHandlersFromConfig created mock: org.apache.solr.core.MockQuerySenderListenerReqHandler
[junit4:junit4]   2> 1617 T1887 oasc.RequestHandlers.initHandlersFromConfig created /admin/: org.apache.solr.handler.admin.AdminHandlers
[junit4:junit4]   2> 1618 T1887 oasc.RequestHandlers.initHandlersFromConfig created defaults: solr.StandardRequestHandler
[junit4:junit4]   2> 1618 T1887 oasc.RequestHandlers.initHandlersFromConfig adding lazy requestHandler: solr.StandardRequestHandler
[junit4:junit4]   2> 1619 T1887 oasc.RequestHandlers.initHandlersFromConfig created lazy: solr.StandardRequestHandler
[junit4:junit4]   2> 1619 T1887 oasc.RequestHandlers.initHandlersFromConfig created /update: solr.UpdateRequestHandler
[junit4:junit4]   2> 1620 T1887 oasc.RequestHandlers.initHandlersFromConfig created /terms: org.apache.solr.handler.component.SearchHandler
[junit4:junit4]   2> 1620 T1887 oasc.RequestHandlers.initHandlersFromConfig created spellCheckCompRH: org.apache.solr.handler.component.SearchHandler
[junit4:junit4]   2> 1621 T1887 oasc.RequestHandlers.initHandlersFromConfig created spellCheckCompRH_Direct: org.apache.solr.handler.component.SearchHandler
[junit4:junit4]   2> 1621 T1887 oasc.RequestHandlers.initHandlersFromConfig created spellCheckWithWordbreak: org.apache.solr.handler.component.SearchHandler
[junit4:junit4]   2> 1622 T1887 oasc.RequestHandlers.initHandlersFromConfig created spellCheckWithWordbreak_Direct: org.apache.solr.handler.component.SearchHandler
[junit4:junit4]   2> 1622 T1887 oasc.RequestHandlers.initHandlersFromConfig created spellCheckCompRH1: org.apache.solr.handler.component.SearchHandler
[junit4:junit4]   2> 1623 T1887 oasc.RequestHandlers.initHandlersFromConfig created tvrh: org.apache.solr.handler.component.SearchHandler
[junit4:junit4]   2> 1624 T1887 oasc.RequestHandlers.initHandlersFromConfig created /mlt: solr.MoreLikeThisHandler
[junit4:junit4]   2> 1624 T1887 oasc.RequestHandlers.initHandlersFromConfig created /debug/dump: solr.DumpRequestHandler
[junit4:junit4]   2> 1628 T1887 oashl.XMLLoader.init xsltCacheLifetimeSeconds=60
[junit4:junit4]   2> 1633 T1887 oasc.SolrCore.initDeprecatedSupport WARNING solrconfig.xml uses deprecated <admin/gettableFiles>, Please update your config to use the ShowFileRequestHandler.
[junit4:junit4]   2> 1634 T1887 oasc.SolrCore.initDeprecatedSupport WARNING adding ShowFileRequestHandler with hidden files: [SCHEMA.XML, OLD_SYNONYMS.TXT, STOPWORDS.TXT, PROTWORDS.TXT, OPEN-EXCHANGE-RATES.JSON, SYNONYMS.TXT, CURRENCY.XML, MAPPING-ISOLATIN1ACCENT.TXT]
[junit4:junit4]   2> 1638 T1887 oass.SolrIndexSearcher.<init> Opening Searcher@5c339b3a main
[junit4:junit4]   2> 1639 T1887 oasu.CommitTracker.<init> Hard AutoCommit: disabled
[junit4:junit4]   2> 1640 T1887 oasu.CommitTracker.<init> Soft AutoCommit: disabled
[junit4:junit4]   2> 1640 T1887 oashc.SpellCheckComponent.inform Initializing spell checkers
[junit4:junit4]   2> 1655 T1887 oass.DirectSolrSpellChecker.init init: {name=direct,classname=DirectSolrSpellChecker,field=lowerfilt,minQueryLength=3}
[junit4:junit4]   2> 1694 T1910 oasc.SolrCore.registerSearcher [collection1] Registered new searcher Searcher@5c339b3a main{StandardDirectoryReader(segments_1:1)}
[junit4:junit4]   2> 1697 T1892 oazs.PrepRequestProcessor.pRequest Got user-level KeeperException when processing sessionid:0x139c8bd833b0002 type:create cxid:0x56 zxid:0xfffffffffffffffe txntype:unknown reqpath:n/a Error Path:/solr/overseer/queue Error:KeeperErrorCode = NoNode for /solr/overseer/queue
[junit4:junit4]   2> 1708 T1887 oasc.CoreContainer.register registering core: collection1
[junit4:junit4]   2> 1708 T1887 oasc.ZkController.register Register shard - core:collection1 address:http://127.0.0.1:44120/solr shardId:control_shard
[junit4:junit4]   2> 1709 T1887 oascc.SolrZkClient.makePath makePath: /collections/control_collection/leader_elect/control_shard/election
[junit4:junit4]   2> 1725 T1892 oazs.PrepRequestProcessor.pRequest Got user-level KeeperException when processing sessionid:0x139c8bd833b0002 type:delete cxid:0x65 zxid:0xfffffffffffffffe txntype:unknown reqpath:n/a Error Path:/solr/collections/control_collection/leaders Error:KeeperErrorCode = NoNode for /solr/collections/control_collection/leaders
[junit4:junit4]   2> 1725 T1887 oasc.ShardLeaderElectionContext.runLeaderProcess Running the leader process.
[junit4:junit4]   2> 1726 T1892 oazs.PrepRequestProcessor.pRequest Got user-level KeeperException when processing sessionid:0x139c8bd833b0002 type:create cxid:0x66 zxid:0xfffffffffffffffe txntype:unknown reqpath:n/a Error Path:/solr/overseer Error:KeeperErrorCode = NodeExists for /solr/overseer
[junit4:junit4]   2> 2173 T1908 oascc.ZkStateReader.updateClusterState Updating cloud state from ZooKeeper... 
[junit4:junit4]   2> 2173 T1892 oazs.PrepRequestProcessor.pRequest Got user-level KeeperException when processing sessionid:0x139c8bd833b0002 type:create cxid:0x6d zxid:0xfffffffffffffffe txntype:unknown reqpath:n/a Error Path:/solr/overseer/queue-work Error:KeeperErrorCode = NoNode for /solr/overseer/queue-work
[junit4:junit4]   2> 2218 T1907 oascc.ZkStateReader$2.process A cluster state change has occurred - updating...
[junit4:junit4]   2> 2235 T1887 oasc.ShardLeaderElectionContext.waitForReplicasToComeUp Enough replicas found to continue.
[junit4:junit4]   2> 2235 T1887 oasc.ShardLeaderElectionContext.runLeaderProcess I may be the new leader - try and sync
[junit4:junit4]   2> 2236 T1887 oasc.SyncStrategy.sync Sync replicas to http://127.0.0.1:44120/solr/collection1/
[junit4:junit4]   2> 2236 T1887 oasc.SyncStrategy.syncReplicas Sync Success - now sync replicas to me
[junit4:junit4]   2> 2236 T1887 oasc.SyncStrategy.syncToMe http://127.0.0.1:44120/solr/collection1/ has no replicas
[junit4:junit4]   2> 2237 T1887 oasc.ShardLeaderElectionContext.runLeaderProcess I am the new leader: http://127.0.0.1:44120/solr/collection1/
[junit4:junit4]   2> 2237 T1887 oascc.SolrZkClient.makePath makePath: /collections/control_collection/leaders/control_shard
[junit4:junit4]   2> 2240 T1892 oazs.PrepRequestProcessor.pRequest Got user-level KeeperException when processing sessionid:0x139c8bd833b0002 type:create cxid:0x8b zxid:0xfffffffffffffffe txntype:unknown reqpath:n/a Error Path:/solr/overseer Error:KeeperErrorCode = NodeExists for /solr/overseer
[junit4:junit4]   2> 2722 T1908 oascc.ZkStateReader.updateClusterState Updating cloud state from ZooKeeper... 
[junit4:junit4]   2> 2734 T1907 oascc.ZkStateReader$2.process A cluster state change has occurred - updating...
[junit4:junit4]   2> 2751 T1887 oasc.ZkController.register We are http://127.0.0.1:44120/solr/collection1/ and leader is http://127.0.0.1:44120/solr/collection1/
[junit4:junit4]   2> 2751 T1887 oasc.ZkController.register No LogReplay needed for core=collection1 baseURL=http://127.0.0.1:44120/solr
[junit4:junit4]   2> 2751 T1887 oasc.ZkController.checkRecovery I am the leader, no recovery necessary
[junit4:junit4]   2> 2753 T1887 oascc.ZkStateReader.updateClusterState Updating cloud state from ZooKeeper... 
[junit4:junit4]   2> 2753 T1887 oass.SolrDispatchFilter.init user.dir=/usr/home/hudson/hudson-slave/workspace/Lucene-Solr-Tests-trunk-Java6/solr/build/solr-core/test/J1
[junit4:junit4]   2> 2754 T1887 oass.SolrDispatchFilter.init SolrDispatchFilter.init() done
[junit4:junit4]   2> 2754 T1887 oascsi.HttpClientUtil.createClient Creating new http client, config:maxConnections=128&maxConnectionsPerHost=32&followRedirects=false
[junit4:junit4]   2> 2765 T1887 oejs.Server.doStart jetty-8.1.2.v20120308
[junit4:junit4]   2> 2767 T1887 oejs.AbstractConnector.doStart Started SocketConnector@0.0.0.0:30314
[junit4:junit4]   2> 2768 T1887 oasc.SolrResourceLoader.locateSolrHome JNDI not configured for solr (NoInitialContextEx)
[junit4:junit4]   2> 2768 T1887 oasc.SolrResourceLoader.locateSolrHome using system property solr.solr.home: /usr/home/hudson/hudson-slave/workspace/Lucene-Solr-Tests-trunk-Java6/solr/build/solr-core/test-files/solr
[junit4:junit4]   2> 2768 T1887 oasc.SolrResourceLoader.<init> new SolrResourceLoader for deduced Solr Home: '/usr/home/hudson/hudson-slave/workspace/Lucene-Solr-Tests-trunk-Java6/solr/build/solr-core/test-files/solr/'
[junit4:junit4]   2> 2791 T1887 oass.SolrDispatchFilter.init SolrDispatchFilter.init()
[junit4:junit4]   2> 2792 T1887 oasc.SolrResourceLoader.locateSolrHome JNDI not configured for solr (NoInitialContextEx)
[junit4:junit4]   2> 2792 T1887 oasc.SolrResourceLoader.locateSolrHome using system property solr.solr.home: /usr/home/hudson/hudson-slave/workspace/Lucene-Solr-Tests-trunk-Java6/solr/build/solr-core/test-files/solr
[junit4:junit4]   2> 2792 T1887 oasc.CoreContainer$Initializer.initialize looking for solr.xml: /usr/home/hudson/hudson-slave/workspace/Lucene-Solr-Tests-trunk-Java6/solr/build/solr-core/test-files/solr/solr.xml
[junit4:junit4]   2> 2793 T1887 oasc.CoreContainer.<init> New CoreContainer 403938299
[junit4:junit4]   2> 2793 T1887 oasc.CoreContainer.load Loading CoreContainer using Solr Home: '/usr/home/hudson/hudson-slave/workspace/Lucene-Solr-Tests-trunk-Java6/solr/build/solr-core/test-files/solr/'
[junit4:junit4]   2> 2793 T1887 oasc.SolrResourceLoader.<init> new SolrResourceLoader for directory: '/usr/home/hudson/hudson-slave/workspace/Lucene-Solr-Tests-trunk-Java6/solr/build/solr-core/test-files/solr/'
[junit4:junit4]   2> 2810 T1887 oasc.CoreContainer.load Registering Log Listener
[junit4:junit4]   2> 2821 T1887 oasc.CoreContainer.initZooKeeper Zookeeper client=127.0.0.1:46808/solr
[junit4:junit4]   2> 2821 T1887 oaz.ZooKeeper.<init> Initiating client connection, connectString=127.0.0.1:46808/solr sessionTimeout=5000 watcher=org.apache.solr.common.cloud.ConnectionManager@32c974a9
[junit4:junit4]   2> 2822 T1920 oaz.ClientCnxn$SendThread.startConnect Opening socket connection to server /127.0.0.1:46808
[junit4:junit4]   2> 2822 T1887 oascc.ConnectionManager.waitForConnected Waiting for client to connect to ZooKeeper
[junit4:junit4]   2> 2823 T1920 oaz.ClientCnxn$SendThread.primeConnection Socket connection established to localhost/127.0.0.1:46808, initiating session
[junit4:junit4]   2> 2823 T1889 oazs.NIOServerCnxn$Factory.run Accepted socket connection from /140.211.11.196:15494
[junit4:junit4]   2> 2824 T1889 oazs.NIOServerCnxn.readConnectRequest Client attempting to establish new session at /140.211.11.196:15494
[junit4:junit4]   2> 2825 T1891 oazs.NIOServerCnxn.finishSessionInit Established session 0x139c8bd833b0003 with negotiated timeout 5000 for client /140.211.11.196:15494
[junit4:junit4]   2> 2825 T1920 oaz.ClientCnxn$SendThread.readConnectResult Session establishment complete on server localhost/127.0.0.1:46808, sessionid = 0x139c8bd833b0003, negotiated timeout = 5000
[junit4:junit4]   2> 2825 T1921 oascc.ConnectionManager.process Watcher org.apache.solr.common.cloud.ConnectionManager@32c974a9 name:ZooKeeperConnection Watcher:127.0.0.1:46808/solr got event WatchedEvent state:SyncConnected type:None path:null path:null type:None
[junit4:junit4]   2> 2825 T1887 oascc.ConnectionManager.waitForConnected Client is connected to ZooKeeper
[junit4:junit4]   2> 2826 T1892 oazs.PrepRequestProcessor.pRequest Got user-level KeeperException when processing sessionid:0x139c8bd833b0003 type:create cxid:0x1 zxid:0xfffffffffffffffe txntype:unknown reqpath:n/a Error Path:/solr/overseer Error:KeeperErrorCode = NodeExists for /solr/overseer
[junit4:junit4]   2> 2827 T1892 oazs.PrepRequestProcessor.pRequest Got user-level KeeperException when processing sessionid:0x139c8bd833b0003 type:create cxid:0x2 zxid:0xfffffffffffffffe txntype:unknown reqpath:n/a Error Path:/solr/overseer Error:KeeperErrorCode = NodeExists for /solr/overseer
[junit4:junit4]   2> 2835 T1887 oasc.ZkController.createEphemeralLiveNode Register node as live in ZooKeeper:/live_nodes/127.0.0.1:30314_solr
[junit4:junit4]   2> 2835 T1892 oazs.PrepRequestProcessor.pRequest Got user-level KeeperException when processing sessionid:0x139c8bd833b0003 type:delete cxid:0x4 zxid:0xfffffffffffffffe txntype:unknown reqpath:n/a Error Path:/solr/live_nodes/127.0.0.1:30314_solr Error:KeeperErrorCode = NoNode for /solr/live_nodes/127.0.0.1:30314_solr
[junit4:junit4]   2> 2836 T1887 oascc.SolrZkClient.makePath makePath: /live_nodes/127.0.0.1:30314_solr
[junit4:junit4]   2> 2837 T1907 oascc.ZkStateReader$3.process Updating live nodes
[junit4:junit4]   2> 2838 T1887 oashc.HttpShardHandlerFactory.getParameter Setting socketTimeout to: 0
[junit4:junit4]   2> 2838 T1887 oashc.HttpShardHandlerFactory.getParameter Setting urlScheme to: http://
[junit4:junit4]   2> 2838 T1887 oashc.HttpShardHandlerFactory.getParameter Setting connTimeout to: 0
[junit4:junit4]   2> 2839 T1887 oashc.HttpShardHandlerFactory.getParameter Setting maxConnectionsPerHost to: 20
[junit4:junit4]   2> 2839 T1887 oashc.HttpShardHandlerFactory.getParameter Setting corePoolSize to: 0
[junit4:junit4]   2> 2839 T1887 oashc.HttpShardHandlerFactory.getParameter Setting maximumPoolSize to: 2147483647
[junit4:junit4]   2> 2840 T1887 oashc.HttpShardHandlerFactory.getParameter Setting maxThreadIdleTime to: 5
[junit4:junit4]   2> 2840 T1887 oashc.HttpShardHandlerFactory.getParameter Setting sizeOfQueue to: -1
[junit4:junit4]   2> 2840 T1887 oashc.HttpShardHandlerFactory.getParameter Setting fairnessPolicy to: false
[junit4:junit4]   2> 2841 T1887 oascsi.HttpClientUtil.createClient Creating new http client, config:maxConnectionsPerHost=20&maxConnections=10000&socketTimeout=0&connTimeout=0&retry=false
[junit4:junit4]   2> 2849 T1887 oascc.ZkStateReader.createClusterStateWatchersAndUpdate Updating cluster state from ZooKeeper... 
[junit4:junit4]   2> 2854 T1887 oasc.CoreContainer.create Creating SolrCore 'collection1' using instanceDir: /usr/home/hudson/hudson-slave/workspace/Lucene-Solr-Tests-trunk-Java6/solr/build/solr-core/test-files/solr/collection1
[junit4:junit4]   2> 2855 T1887 oasc.ZkController.createCollectionZkNode Check for collection zkNode:collection1
[junit4:junit4]   2> 2855 T1887 oasc.ZkController.createCollectionZkNode Collection zkNode exists
[junit4:junit4]   2> 2855 T1887 oasc.ZkController.readConfigName Load collection config from:/collections/collection1
[junit4:junit4]   2> 2856 T1887 oasc.SolrResourceLoader.<init> new SolrResourceLoader for directory: '/usr/home/hudson/hudson-slave/workspace/Lucene-Solr-Tests-trunk-Java6/solr/build/solr-core/test-files/solr/collection1/'
[junit4:junit4]   2> 2857 T1887 oasc.SolrResourceLoader.replaceClassLoader Adding 'file:/usr/home/hudson/hudson-slave/workspace/Lucene-Solr-Tests-trunk-Java6/solr/build/solr-core/test-files/solr/collection1/lib/classes/' to classloader
[junit4:junit4]   2> 2858 T1887 oasc.SolrResourceLoader.replaceClassLoader Adding 'file:/usr/home/hudson/hudson-slave/workspace/Lucene-Solr-Tests-trunk-Java6/solr/build/solr-core/test-files/solr/collection1/lib/README' to classloader
[junit4:junit4]   2> 2895 T1887 oasc.SolrConfig.<init> Using Lucene MatchVersion: LUCENE_50
[junit4:junit4]   2> 2948 T1887 oasc.SolrConfig.<init> Loaded SolrConfig: solrconfig.xml
[junit4:junit4]   2> 3049 T1887 oass.IndexSchema.readSchema Reading Solr Schema
[junit4:junit4]   2> 3056 T1887 oass.IndexSchema.readSchema Schema name=test
[junit4:junit4]   2> 3237 T1908 oascc.ZkStateReader.updateClusterState Updating cloud state from ZooKeeper... 
[junit4:junit4]   2> 3250 T1921 oascc.ZkStateReader$2.process A cluster state change has occurred - updating...
[junit4:junit4]   2> 3250 T1907 oascc.ZkStateReader$2.process A cluster state change has occurred - updating...
[junit4:junit4]   2> 3550 T1887 oass.OpenExchangeRatesOrgProvider.init Initialized with rates=open-exchange-rates.json, refreshInterval=1440.
[junit4:junit4]   2> 3558 T1887 oass.IndexSchema.readSchema default search field in schema is text
[junit4:junit4]   2> 3561 T1887 oass.IndexSchema.readSchema unique key field: id
[junit4:junit4]   2> 3570 T1887 oass.FileExchangeRateProvider.reload Reloading exchange rates from file currency.xml
[junit4:junit4]   2> 3574 T1887 oass.FileExchangeRateProvider.reload Reloading exchange rates from file currency.xml
[junit4:junit4]   2> 3577 T1887 oass.OpenExchangeRatesOrgProvider.reload Reloading exchange rates from open-exchange-rates.json
[junit4:junit4]   2> 3578 T1887 oass.OpenExchangeRatesOrgProvider.reload Reloading exchange rates from open-exchange-rates.json
[junit4:junit4]   2> 3578 T1887 oasc.SolrCore.<init> [collection1] Opening new SolrCore at /usr/home/hudson/hudson-slave/workspace/Lucene-Solr-Tests-trunk-Java6/solr/build/solr-core/test-files/solr/collection1/, dataDir=./org.apache.solr.cloud.BasicDistributedZk2Test-1347692626742/jetty1/
[junit4:junit4]   2> 3579 T1887 oasc.JmxMonitoredMap.<init> JMX monitoring is enabled. Adding Solr mbeans to JMX Server: com.sun.jmx.mbeanserver.JmxMBeanServer@4e46b90a
[junit4:junit4]   2> 3580 T1887 oasc.SolrCore.getNewIndexDir WARNING New index directory detected: old=null new=./org.apache.solr.cloud.BasicDistributedZk2Test-1347692626742/jetty1/index/
[junit4:junit4]   2> 3580 T1887 oasc.SolrCore.initIndex WARNING [collection1] Solr index directory './org.apache.solr.cloud.BasicDistributedZk2Test-1347692626742/jetty1/index' doesn't exist. Creating new index...
[junit4:junit4]   2> 3581 T1887 oasc.CachingDirectoryFactory.get return new directory for /usr/home/hudson/hudson-slave/workspace/Lucene-Solr-Tests-trunk-Java6/solr/build/solr-core/test/J1/./org.apache.solr.cloud.BasicDistributedZk2Test-1347692626742/jetty1/index forceNew:false
[junit4:junit4]   2> 3595 T1887 oasc.SolrDeletionPolicy.onCommit SolrDeletionPolicy.onCommit: commits:num=1
[junit4:junit4]   2> 		commit{dir=/usr/home/hudson/hudson-slave/workspace/Lucene-Solr-Tests-trunk-Java6/solr/build/solr-core/test/J1/org.apache.solr.cloud.BasicDistributedZk2Test-1347692626742/jetty1/index,segFN=segments_1,generation=1,filenames=[segments_1]
[junit4:junit4]   2> 3595 T1887 oasc.SolrDeletionPolicy.updateCommits newest commit = 1
[junit4:junit4]   2> 3596 T1887 oasc.SolrCore.initWriters created xml: solr.XMLResponseWriter
[junit4:junit4]   2> 3597 T1887 oasup.UpdateRequestProcessorChain.init inserting DistributedUpdateProcessorFactory into updateRequestProcessorChain "dedupe"
[junit4:junit4]   2> 3598 T1887 oasup.UpdateRequestProcessorChain.init inserting DistributedUpdateProcessorFactory into updateRequestProcessorChain "dedupe-allfields"
[junit4:junit4]   2> 3598 T1887 oasup.UpdateRequestProcessorChain.init inserting DistributedUpdateProcessorFactory into updateRequestProcessorChain "stored_sig"
[junit4:junit4]   2> 3598 T1887 oasup.UpdateRequestProcessorChain.init inserting DistributedUpdateProcessorFactory into updateRequestProcessorChain "uniq-fields"
[junit4:junit4]   2> 3599 T1887 oasup.UpdateRequestProcessorChain.init inserting DistributedUpdateProcessorFactory into updateRequestProcessorChain "distrib-dup-test-chain-implicit"
[junit4:junit4]   2> 3599 T1887 oasc.RequestHandlers.initHandlersFromConfig adding lazy requestHandler: solr.ReplicationHandler
[junit4:junit4]   2> 3600 T1887 oasc.RequestHandlers.initHandlersFromConfig created /replication: solr.ReplicationHandler
[junit4:junit4]   2> 3600 T1887 oasc.RequestHandlers.initHandlersFromConfig created standard: solr.StandardRequestHandler
[junit4:junit4]   2> 3601 T1887 oasc.RequestHandlers.initHandlersFromConfig created /get: solr.RealTimeGetHandler
[junit4:junit4]   2> 3601 T1887 oasc.RequestHandlers.initHandlersFromConfig created dismax: solr.SearchHandler
[junit4:junit4]   2> 3602 T1887 oasc.RequestHandlers.initHandlersFromConfig created mock: org.apache.solr.core.MockQuerySenderListenerReqHandler
[junit4:junit4]   2> 3602 T1887 oasc.RequestHandlers.initHandlersFromConfig created /admin/: org.apache.solr.handler.admin.AdminHandlers
[junit4:junit4]   2> 3603 T1887 oasc.RequestHandlers.initHandlersFromConfig created defaults: solr.StandardRequestHandler
[junit4:junit4]   2> 3603 T1887 oasc.RequestHandlers.initHandlersFromConfig adding lazy requestHandler: solr.StandardRequestHandler
[junit4:junit4]   2> 3603 T1887 oasc.RequestHandlers.initHandlersFromConfig created lazy: solr.StandardRequestHandler
[junit4:junit4]   2> 3604 T1887 oasc.RequestHandlers.initHandlersFromConfig created /update: solr.UpdateRequestHandler
[junit4:junit4]   2> 3604 T1887 oasc.RequestHandlers.initHandlersFromConfig created /terms: org.apache.solr.handler.component.SearchHandler
[junit4:junit4]   2> 3605 T1887 oasc.RequestHandlers.initHandlersFromConfig created spellCheckCompRH: org.apache.solr.handler.component.SearchHandler
[junit4:junit4]   2> 3605 T1887 oasc.RequestHandlers.initHandlersFromConfig created spellCheckCompRH_Direct: org.apache.solr.handler.component.SearchHandler
[junit4:junit4]   2> 3605 T1887 oasc.RequestHandlers.initHandlersFromConfig created spellCheckWithWordbreak: org.apache.solr.handler.component.SearchHandler
[junit4:junit4]   2> 3606 T1887 oasc.RequestHandlers.initHandlersFromConfig created spellCheckWithWordbreak_Direct: org.apache.solr.handler.component.SearchHandler
[junit4:junit4]   2> 3606 T1887 oasc.RequestHandlers.initHandlersFromConfig created spellCheckCompRH1: org.apache.solr.handler.component.SearchHandler
[junit4:junit4]   2> 3607 T1887 oasc.RequestHandlers.initHandlersFromConfig created tvrh: org.apache.solr.handler.component.SearchHandler
[junit4:junit4]   2> 3607 T1887 oasc.RequestHandlers.initHandlersFromConfig created /mlt: solr.MoreLikeThisHandler
[junit4:junit4]   2> 3608 T1887 oasc.RequestHandlers.initHandlersFromConfig created /debug/dump: solr.DumpRequestHandler
[junit4:junit4]   2> 3610 T1887 oashl.XMLLoader.init xsltCacheLifetimeSeconds=60
[junit4:junit4]   2> 3613 T1887 oasc.SolrCore.initDeprecatedSupport WARNING solrconfig.xml uses deprecated <admin/gettableFiles>, Please update your config to use the ShowFileRequestHandler.
[junit4:junit4]   2> 3614 T1887 oasc.SolrCore.initDeprecatedSupport WARNING adding ShowFileRequestHandler with hidden files: [SCHEMA.XML, OLD_SYNONYMS.TXT, STOPWORDS.TXT, PROTWORDS.TXT, OPEN-EXCHANGE-RATES.JSON, SYNONYMS.TXT, CURRENCY.XML, MAPPING-ISOLATIN1ACCENT.TXT]
[junit4:junit4]   2> 3618 T1887 oass.SolrIndexSearcher.<init> Opening Searcher@e2e7c66 main
[junit4:junit4]   2> 3619 T1887 oasu.CommitTracker.<init> Hard AutoCommit: disabled
[junit4:junit4]   2> 3619 T1887 oasu.CommitTracker.<init> Soft AutoCommit: disabled
[junit4:junit4]   2> 3619 T1887 oashc.SpellCheckComponent.inform Initializing spell checkers
[junit4:junit4]   2> 3635 T1887 oass.DirectSolrSpellChecker.init init: {name=direct,classname=DirectSolrSpellChecker,field=lowerfilt,minQueryLength=3}
[junit4:junit4]   2> 3695 T1922 oasc.SolrCore.registerSearcher [collection1] Registered new searcher Searcher@e2e7c66 main{StandardDirectoryReader(segments_1:1)}
[junit4:junit4]   2> 3753 T1908 oascc.ZkStateReader.updateClusterState Updating cloud state from ZooKeeper... 
[junit4:junit4]   2> 3764 T1907 oascc.ZkStateReader$2.process A cluster state change has occurred - updating...
[junit4:junit4]   2> 3764 T1921 oascc.ZkStateReader$2.process A cluster state change has occurred - updating...
[junit4:junit4]   2> 4199 T1887 oasc.CoreContainer.register registering core: collection1
[junit4:junit4]   2> 4199 T1887 oasc.ZkController.register Register shard - core:collection1 address:http://127.0.0.1:30314/solr shardId:shard1
[junit4:junit4]   2> 4200 T1887 oascc.SolrZkClient.makePath makePath: /collections/collection1/leader_elect/shard1/election
[junit4:junit4]   2> 4212 T1892 oazs.PrepRequestProcessor.pRequest Got user-level KeeperException when processing sessionid:0x139c8bd833b0003 type:delete cxid:0x43 zxid:0xfffffffffffffffe txntype:unknown reqpath:n/a Error Path:/solr/collections/collection1/leaders Error:KeeperErrorCode = NoNode for /solr/collections/collection1/leaders
[junit4:junit4]   2> 4213 T1887 oasc.ShardLeaderElectionContext.runLeaderProcess Running the leader process.
[junit4:junit4]   2> 4214 T1892 oazs.PrepRequestProcessor.pRequest Got user-level KeeperException when processing sessionid:0x139c8bd833b0003 type:create cxid:0x44 zxid:0xfffffffffffffffe txntype:unknown reqpath:n/a Error Path:/solr/overseer Error:KeeperErrorCode = NodeExists for /solr/overseer
[junit4:junit4]   2> 4215 T1887 oasc.ShardLeaderElectionContext.waitForReplicasToComeUp Enough replicas found to continue.
[junit4:junit4]   2> 4216 T1887 oasc.ShardLeaderElectionContext.runLeaderProcess I may be the new leader - try and sync
[junit4:junit4]   2> 4216 T1887 oasc.SyncStrategy.sync Sync replicas to http://127.0.0.1:30314/solr/collection1/
[junit4:junit4]   2> 4216 T1887 oasc.SyncStrategy.syncReplicas Sync Success - now sync replicas to me
[junit4:junit4]   2> 4217 T1887 oasc.SyncStrategy.syncToMe http://127.0.0.1:30314/solr/collection1/ has no replicas
[junit4:junit4]   2> 4218 T1887 oasc.ShardLeaderElectionContext.runLeaderProcess I am the new leader: http://127.0.0.1:30314/solr/collection1/
[junit4:junit4]   2> 4218 T1887 oascc.SolrZkClient.makePath makePath: /collections/collection1/leaders/shard1
[junit4:junit4]   2> 4221 T1892 oazs.PrepRequestProcessor.pRequest Got user-level KeeperException when processing sessionid:0x139c8bd833b0003 type:create cxid:0x4e zxid:0xfffffffffffffffe txntype:unknown reqpath:n/a Error Path:/solr/overseer Error:KeeperErrorCode = NodeExists for /solr/overseer
[junit4:junit4]   2> 4267 T1908 oascc.ZkStateReader.updateClusterState Updating cloud state from ZooKeeper... 
[junit4:junit4]   2> 4271 T1921 oascc.ZkStateReader$2.process A cluster state change has occurred - updating...
[junit4:junit4]   2> 4271 T1907 oascc.ZkStateReader$2.process A cluster state change has occurred - updating...
[junit4:junit4]   2> 4273 T1887 oasc.ZkController.register We are http://127.0.0.1:30314/solr/collection1/ and leader is http://127.0.0.1:30314/solr/collection1/
[junit4:junit4]   2> 4273 T1887 oasc.ZkController.register No LogReplay needed for core=collection1 baseURL=http://127.0.0.1:30314/solr
[junit4:junit4]   2> 4274 T1887 oasc.ZkController.checkRecovery I am the leader, no recovery necessary
[junit4:junit4]   2> 4275 T1887 oascc.ZkStateReader.updateClusterState Updating cloud state from ZooKeeper... 
[junit4:junit4]   2> 4276 T1887 oass.SolrDispatchFilter.init user.dir=/usr/home/hudson/hudson-slave/workspace/Lucene-Solr-Tests-trunk-Java6/solr/build/solr-core/test/J1
[junit4:junit4]   2> 4276 T1887 oass.SolrDispatchFilter.init SolrDispatchFilter.init() done
[junit4:junit4]   2> 4276 T1887 oascsi.HttpClientUtil.createClient Creating new http client, config:maxConnections=128&maxConnectionsPerHost=32&followRedirects=false
[junit4:junit4]   2> 4290 T1887 oejs.Server.doStart jetty-8.1.2.v20120308
[junit4:junit4]   2> 4293 T1887 oejs.AbstractConnector.doStart Started SocketConnector@0.0.0.0:22876
[junit4:junit4]   2> 4293 T1887 oasc.SolrResourceLoader.locateSolrHome JNDI not configured for solr (NoInitialContextEx)
[junit4:junit4]   2> 4294 T1887 oasc.SolrResourceLoader.locateSolrHome using system property solr.solr.home: /usr/home/hudson/hudson-slave/workspace/Lucene-Solr-Tests-trunk-Java6/solr/build/solr-core/test-files/solr
[junit4:junit4]   2> 4294 T1887 oasc.SolrResourceLoader.<init> new SolrResourceLoader for deduced Solr Home: '/usr/home/hudson/hudson-slave/workspace/Lucene-Solr-Tests-trunk-Java6/solr/build/solr-core/test-files/solr/'
[junit4:junit4]   2> 4329 T1887 oass.SolrDispatchFilter.init SolrDispatchFilter.init()
[junit4:junit4]   2> 4330 T1887 oasc.SolrResourceLoader.locateSolrHome JNDI not configured for solr (NoInitialContextEx)
[junit4:junit4]   2> 4330 T1887 oasc.SolrResourceLoader.locateSolrHome using system property solr.solr.home: /usr/home/hudson/hudson-slave/workspace/Lucene-Solr-Tests-trunk-Java6/solr/build/solr-core/test-files/solr
[junit4:junit4]   2> 4331 T1887 oasc.CoreContainer$Initializer.initialize looking for solr.xml: /usr/home/hudson/hudson-slave/workspace/Lucene-Solr-Tests-trunk-Java6/solr/build/solr-core/test-files/solr/solr.xml
[junit4:junit4]   2> 4331 T1887 oasc.CoreContainer.<init> New CoreContainer 1573701833
[junit4:junit4]   2> 4332 T1887 oasc.CoreContainer.load Loading CoreContainer using Solr Home: '/usr/home/hudson/hudson-slave/workspace/Lucene-Solr-Tests-trunk-Java6/solr/build/solr-core/test-files/solr/'
[junit4:junit4]   2> 4333 T1887 oasc.SolrResourceLoader.<init> new SolrResourceLoader for directory: '/usr/home/hudson/hudson-slave/workspace/Lucene-Solr-Tests-trunk-Java6/solr/build/solr-core/test-files/solr/'
[junit4:junit4]   2> 4358 T1887 oasc.CoreContainer.load Registering Log Listener
[junit4:junit4]   2> 4373 T1887 oasc.CoreContainer.initZooKeeper Zookeeper client=127.0.0.1:46808/solr
[junit4:junit4]   2> 4374 T1887 oaz.ZooKeeper.<init> Initiating client connection, connectString=127.0.0.1:46808/solr sessionTimeout=5000 watcher=org.apache.solr.common.cloud.ConnectionManager@27a325e3
[junit4:junit4]   2> 4375 T1932 oaz.ClientCnxn$SendThread.startConnect Opening socket connection to server /127.0.0.1:46808
[junit4:junit4]   2> 4375 T1887 oascc.ConnectionManager.waitForConnected Waiting for client to connect to ZooKeeper
[junit4:junit4]   2> 4376 T1932 oaz.ClientCnxn$SendThread.primeConnection Socket connection established to localhost/127.0.0.1:46808, initiating session
[junit4:junit4]   2> 4377 T1889 oazs.NIOServerCnxn$Factory.run Accepted socket connection from /140.211.11.196:24126
[junit4:junit4]   2> 4377 T1889 oazs.NIOServerCnxn.readConnectRequest Client attempting to establish new session at /140.211.11.196:24126
[junit4:junit4]   2> 4378 T1891 oazs.NIOServerCnxn.finishSessionInit Established session 0x139c8bd833b0004 with negotiated timeout 5000 for client /140.211.11.196:24126
[junit4:junit4]   2> 4378 T1932 oaz.ClientCnxn$SendThread.readConnectResult Session establishment complete on server localhost/127.0.0.1:46808, sessionid = 0x139c8bd833b0004, negotiated timeout = 5000
[junit4:junit4]   2> 4378 T1933 oascc.ConnectionManager.process Watcher org.apache.solr.common.cloud.ConnectionManager@27a325e3 name:ZooKeeperConnection Watcher:127.0.0.1:46808/solr got event WatchedEvent state:SyncConnected type:None path:null path:null type:None
[junit4:junit4]   2> 4379 T1887 oascc.ConnectionManager.waitForConnected Client is connected to ZooKeeper
[junit4:junit4]   2> 4379 T1892 oazs.PrepRequestProcessor.pRequest Got user-level KeeperException when processing sessionid:0x139c8bd833b0004 type:create cxid:0x1 zxid:0xfffffffffffffffe txntype:unknown reqpath:n/a Error Path:/solr/overseer Error:KeeperErrorCode = NodeExists for /solr/overseer
[junit4:junit4]   2> 4380 T1892 oazs.PrepRequestProcessor.pRequest Got user-level KeeperException when processing sessionid:0x139c8bd833b0004 type:create cxid:0x2 zxid:0xfffffffffffffffe txntype:unknown reqpath:n/a Error Path:/solr/overseer Error:KeeperErrorCode = NodeExists for /solr/overseer
[junit4:junit4]   2> 4389 T1887 oasc.ZkController.createEphemeralLiveNode Register node as live in ZooKeeper:/live_nodes/127.0.0.1:22876_solr
[junit4:junit4]   2> 4390 T1892 oazs.PrepRequestProcessor.pRequest Got user-level KeeperException when processing sessionid:0x139c8bd833b0004 type:delete cxid:0x4 zxid:0xfffffffffffffffe txntype:unknown reqpath:n/a Error Path:/solr/live_nodes/127.0.0.1:22876_solr Error:KeeperErrorCode = NoNode for /solr/live_nodes/127.0.0.1:22876_solr
[junit4:junit4]   2> 4391 T1887 oascc.SolrZkClient.makePath makePath: /live_nodes/127.0.0.1:22876_solr
[junit4:junit4]   2> 4392 T1907 oascc.ZkStateReader$3.process Updating live nodes
[junit4:junit4]   2> 4392 T1921 oascc.ZkStateReader$3.process Updating live nodes
[junit4:junit4]   2> 4393 T1887 oashc.HttpShardHandlerFactory.getParameter Setting socketTimeout to: 0
[junit4:junit4]   2> 4393 T1887 oashc.HttpShardHandlerFactory.getParameter Setting urlScheme to: http://
[junit4:junit4]   2> 4394 T1887 oashc.HttpShardHandlerFactory.getParameter Setting connTimeout to: 0
[junit4:junit4]   2> 4394 T1887 oashc.HttpShardHandlerFactory.getParameter Setting maxConnectionsPerHost to: 20
[junit4:junit4]   2> 4395 T1887 oashc.HttpShardHandlerFactory.getParameter Setting corePoolSize to: 0
[junit4:junit4]   2> 4395 T1887 oashc.HttpShardHandlerFactory.getParameter Setting maximumPoolSize to: 2147483647
[junit4:junit4]   2> 4395 T1887 oashc.HttpShardHandlerFactory.getParameter Setting maxThreadIdleTime to: 5
[junit4:junit4]   2> 4396 T1887 oashc.HttpShardHandlerFactory.getParameter Setting sizeOfQueue to: -1
[junit4:junit4]   2> 4396 T1887 oashc.HttpShardHandlerFactory.getParameter Setting fairnessPolicy to: false
[junit4:junit4]   2> 4397 T1887 oascsi.HttpClientUtil.createClient Creating new http client, config:maxConnectionsPerHost=20&maxConnections=10000&socketTimeout=0&connTimeout=0&retry=false
[junit4:junit4]   2> 4408 T1887 oascc.ZkStateReader.createClusterStateWatchersAndUpdate Updating cluster state from ZooKeeper... 
[junit4:junit4]   2> 4413 T1887 oasc.CoreContainer.create Creating SolrCore 'collection1' using instanceDir: /usr/home/hudson/hudson-slave/workspace/Lucene-Solr-Tests-trunk-Java6/solr/build/solr-core/test-files/solr/collection1
[junit4:junit4]   2> 4414 T1887 oasc.ZkController.createCollectionZkNode Check for collection zkNode:collection1
[junit4:junit4]   2> 4415 T1887 oasc.ZkController.createCollectionZkNode Collection zkNode exists
[junit4:junit4]   2> 4415 T1887 oasc.ZkController.readConfigName Load collection config from:/collections/collection1
[junit4:junit4]   2> 4416 T1887 oasc.SolrResourceLoader.<init> new SolrResourceLoader for directory: '/usr/home/hudson/hudson-slave/workspace/Lucene-Solr-Tests-trunk-Java6/solr/build/solr-core/test-files/solr/collection1/'
[junit4:junit4]   2> 4417 T1887 oasc.SolrResourceLoader.replaceClassLoader Adding 'file:/usr/home/hudson/hudson-slave/workspace/Lucene-Solr-Tests-trunk-Java6/solr/build/solr-core/test-files/solr/collection1/lib/classes/' to classloader
[junit4:junit4]   2> 4418 T1887 oasc.SolrResourceLoader.replaceClassLoader Adding 'file:/usr/home/hudson/hudson-slave/workspace/Lucene-Solr-Tests-trunk-Java6/solr/build/solr-core/test-files/solr/collection1/lib/README' to classloader
[junit4:junit4]   2> 4466 T1887 oasc.SolrConfig.<init> Using Lucene MatchVersion: LUCENE_50
[junit4:junit4]   2> 4541 T1887 oasc.SolrConfig.<init> Loaded SolrConfig: solrconfig.xml
[junit4:junit4]   2> 4642 T1887 oass.IndexSchema.readSchema Reading Solr Schema
[junit4:junit4]   2> 4648 T1887 oass.IndexSchema.readSchema Schema name=test
[junit4:junit4]   2> 4775 T1908 oascc.ZkStateReader.updateClusterState Updating cloud state from ZooKeeper... 
[junit4:junit4]   2> 4787 T1921 oascc.ZkStateReader$2.process A cluster state change has occurred - updating...
[junit4:junit4]   2> 4787 T1907 oascc.ZkStateReader$2.process A cluster state change has occurred - updating...
[junit4:junit4]   2> 4787 T1933 oascc.ZkStateReader$2.process A cluster state change has occurred - updating...
[junit4:junit4]   2> 5095 T1887 oass.OpenExchangeRatesOrgProvider.init Initialized with rates=open-exchange-rates.json, refreshInterval=1440.
[junit4:junit4]   2> 5103 T1887 oass.IndexSchema.readSchema default search field in schema is text
[junit4:junit4]   2> 5106 T1887 oass.IndexSchema.readSchema unique key field: id
[junit4:junit4]   2> 5115 T1887 oass.FileExchangeRateProvider.reload Reloading exchange rates from file currency.xml
[junit4:junit4]   2> 5119 T1887 oass.FileExchangeRateProvider.reload Reloading exchange rates from file currency.xml
[junit4:junit4]   2> 5122 T1887 oass.OpenExchangeRatesOrgProvider.reload Reloading exchange rates from open-exchange-rates.json
[junit4:junit4]   2> 5123 T1887 oass.OpenExchangeRatesOrgProvider.reload Reloading exchange rates from open-exchange-rates.json
[junit4:junit4]   2> 5125 T1887 oasc.SolrCore.<init> [collection1] Opening new SolrCore at /usr/home/hudson/hudson-slave/workspace/Lucene-Solr-Tests-trunk-Java6/solr/build/solr-core/test-files/solr/collection1/, dataDir=./org.apache.solr.cloud.BasicDistributedZk2Test-1347692626742/jetty2/
[junit4:junit4]   2> 5126 T1887 oasc.JmxMonitoredMap.<init> JMX monitoring is enabled. Adding Solr mbeans to JMX Server: com.sun.jmx.mbeanserver.JmxMBeanServer@4e46b90a
[junit4:junit4]   2> 5127 T1887 oasc.SolrCore.getNewIndexDir WARNING New index directory detected: old=null new=./org.apache.solr.cloud.BasicDistributedZk2Test-1347692626742/jetty2/index/
[junit4:junit4]   2> 5128 T1887 oasc.SolrCore.initIndex WARNING [collection1] Solr index directory './org.apache.solr.cloud.BasicDistributedZk2Test-1347692626742/jetty2/index' doesn't exist. Creating new index...
[junit4:junit4]   2> 5129 T1887 oasc.CachingDirectoryFactory.get return new directory for /usr/home/hudson/hudson-slave/workspace/Lucene-Solr-Tests-trunk-Java6/solr/build/solr-core/test/J1/./org.apache.solr.cloud.BasicDistributedZk2Test-1347692626742/jetty2/index forceNew:false
[junit4:junit4]   2> 5191 T1887 oasc.SolrDeletionPolicy.onCommit SolrDeletionPolicy.onCommit: commits:num=1
[junit4:junit4]   2> 		commit{dir=/usr/home/hudson/hudson-slave/workspace/Lucene-Solr-Tests-trunk-Java6/solr/build/solr-core/test/J1/org.apache.solr.cloud.BasicDistributedZk2Test-1347692626742/jetty2/index,segFN=segments_1,generation=1,filenames=[segments_1]
[junit4:junit4]   2> 5191 T1887 oasc.SolrDeletionPolicy.updateCommits newest commit = 1
[junit4:junit4]   2> 5192 T1887 oasc.SolrCore.initWriters created xml: solr.XMLResponseWriter
[junit4:junit4]   2> 5194 T1887 oasup.UpdateRequestProcessorChain.init inserting DistributedUpdateProcessorFactory into updateRequestProcessorChain "dedupe"
[junit4:junit4]   2> 5194 T1887 oasup.UpdateRequestProcessorChain.init inserting DistributedUpdateProcessorFactory into updateRequestProcessorChain "dedupe-allfields"
[junit4:junit4]   2> 5195 T1887 oasup.UpdateRequestProcessorChain.init inserting DistributedUpdateProcessorFactory into updateRequestProcessorChain "stored_sig"
[junit4:junit4]   2> 5195 T1887 oasup.UpdateRequestProcessorChain.init inserting DistributedUpdateProcessorFactory into updateRequestProcessorChain "uniq-fields"
[junit4:junit4]   2> 5196 T1887 oasup.UpdateRequestProcessorChain.init inserting DistributedUpdateProcessorFactory into updateRequestProcessorChain "distrib-dup-test-chain-implicit"
[junit4:junit4]   2> 5196 T1887 oasc.RequestHandlers.initHandlersFromConfig adding lazy requestHandler: solr.ReplicationHandler
[junit4:junit4]   2> 5197 T1887 oasc.RequestHandlers.initHandlersFromConfig created /replication: solr.ReplicationHandler
[junit4:junit4]   2> 5197 T1887 oasc.RequestHandlers.initHandlersFromConfig created standard: solr.StandardRequestHandler
[junit4:junit4]   2> 5197 T1887 oasc.RequestHandlers.initHandlersFromConfig created /get: solr.RealTimeGetHandler
[junit4:junit4]   2> 5198 T1887 oasc.RequestHandlers.initHandlersFromConfig created dismax: solr.SearchHandler
[junit4:junit4]   2> 5199 T1887 oasc.RequestHandlers.initHandlersFromConfig created mock: org.apache.solr.core.MockQuerySenderListenerReqHandler
[junit4:junit4]   2> 5199 T1887 oasc.RequestHandlers.initHandlersFromConfig created /admin/: org.apache.solr.handler.admin.AdminHandlers
[junit4:junit4]   2> 5199 T1887 oasc.RequestHandlers.initHandlersFromConfig created defaults: solr.StandardRequestHandler
[junit4:junit4]   2> 5200 T1887 oasc.RequestHandlers.initHandlersFromConfig adding lazy requestHandler: solr.StandardRequestHandler
[junit4:junit4]   2> 5200 T1887 oasc.RequestHandlers.initHandlersFromConfig created lazy: solr.StandardRequestHandler
[junit4:junit4]   2> 5201 T1887 oasc.RequestHandlers.initHandlersFromConfig created /update: solr.UpdateRequestHandler
[junit4:junit4]   2> 5201 T1887 oasc.RequestHandlers.initHandlersFromConfig created /terms: org.apache.solr.handler.component.SearchHandler
[junit4:junit4]   2> 5202 T1887 oasc.RequestHandlers.initHandlersFromConfig created spellCheckCompRH: org.apache.solr.handler.component.SearchHandler
[junit4:junit4]   2> 5202 T1887 oasc.RequestHandlers.initHandlersFromConfig created spellCheckCompRH_Direct: org.apache.solr.handler.component.SearchHandler
[junit4:junit4]   2> 5202 T1887 oasc.RequestHandlers.initHandlersFromConfig created spellCheckWithWordbreak: org.apache.solr.handler.component.SearchHandler
[junit4:junit4]   2> 5203 T1887 oasc.RequestHandlers.initHandlersFromConfig created spellCheckWithWordbreak_Direct: org.apache.solr.handler.component.SearchHandler
[junit4:junit4]   2> 5203 T1887 oasc.RequestHandlers.initHandlersFromConfig created spellCheckCompRH1: org.apache.solr.handler.component.SearchHandler
[junit4:junit4]   2> 5204 T1887 oasc.RequestHandlers.initHandlersFromConfig created tvrh: org.apache.solr.handler.component.SearchHandler
[junit4:junit4]   2> 5204 T1887 oasc.RequestHandlers.initHandlersFromConfig created /mlt: solr.MoreLikeThisHandler
[junit4:junit4]   2> 5205 T1887 oasc.RequestHandlers.initHandlersFromConfig created /debug/dump: solr.DumpRequestHandler
[junit4:junit4]   2> 5207 T1887 oashl.XMLLoader.init xsltCacheLifetimeSeconds=60
[junit4:junit4]   2> 5211 T1887 oasc.SolrCore.initDeprecatedSupport WARNING solrconfig.xml uses deprecated <admin/gettableFiles>, Please update your config to use the ShowFileRequestHandler.
[junit4:junit4]   2> 5212 T1887 oasc.SolrCore.initDeprecatedSupport WARNING adding ShowFileRequestHandler with hidden files: [SCHEMA.XML, OLD_SYNONYMS.TXT, STOPWORDS.TXT, PROTWORDS.TXT, OPEN-EXCHANGE-RATES.JSON, SYNONYMS.TXT, CURRENCY.XML, MAPPING-ISOLATIN1ACCENT.TXT]
[junit4:junit4]   2> 5215 T1887 oass.SolrIndexSearcher.<init> Opening Searcher@3cb4c75f main
[junit4:junit4]   2> 5216 T1887 oasu.CommitTracker.<init> Hard AutoCommit: disabled
[junit4:junit4]   2> 5216 T1887 oasu.CommitTracker.<init> Soft AutoCommit: disabled
[junit4:junit4]   2> 5217 T1887 oashc.SpellCheckComponent.inform Initializing spell checkers
[junit4:junit4]   2> 5222 T1887 oass.DirectSolrSpellChecker.init init: {name=direct,classname=DirectSolrSpellChecker,field=lowerfilt,minQueryLength=3}
[junit4:junit4]   2> 5456 T1934 oasc.SolrCore.registerSearcher [collection1] Registered new searcher Searcher@3cb4c75f main{StandardDirectoryReader(segments_1:1)}
[junit4:junit4]   2> 5792 T1908 oascc.ZkStateReader.updateClusterState Updating cloud state from ZooKeeper... 
[junit4:junit4]   2> 5811 T1907 oascc.ZkStateReader$2.process A cluster state change has occurred - updating...
[junit4:junit4]   2> 5811 T1933 oascc.ZkStateReader$2.process A cluster state change has occurred - updating...
[junit4:junit4]   2> 5811 T1921 oascc.ZkStateReader$2.process A cluster state change has occurred - updating...
[junit4:junit4]   2> 5974 T1887 oasc.CoreContainer.register registering core: collection1
[junit4:junit4]   2> 5974 T1887 oasc.ZkController.register Register shard - core:collection1 address:http://127.0.0.1:22876/solr shardId:shard2
[junit4:junit4]   2> 5975 T1887 oascc.SolrZkClient.makePath makePath: /collections/collection1/leader_elect/shard2/election
[junit4:junit4]   2> 5989 T1892 oazs.PrepRequestProcessor.pRequest Got user-level KeeperException when processing sessionid:0x139c8bd833b0004 type:delete cxid:0x42 zxid:0xfffffffffffffffe txntype:unknown reqpath:n/a Error Path:/solr/collections/collection1/leaders/shard2 Error:KeeperErrorCode = NoNode for /solr/collections/collection1/leaders/shard2
[junit4:junit4]   2> 5990 T1887 oasc.ShardLeaderElectionContext.runLeaderProcess Running the leader process.
[junit4:junit4]   2> 5991 T1892 oazs.PrepRequestProcessor.pRequest Got user-level KeeperException when processing sessionid:0x139c8bd833b0004 type:create cxid:0x43 zxid:0xfffffffffffffffe txntype:unknown reqpath:n/a Error Path:/solr/overseer Error:KeeperErrorCode = NodeExists for /solr/overseer
[junit4:junit4]   2> 5992 T1887 oasc.ShardLeaderElectionContext.waitForReplicasToComeUp Enough replicas found to continue.
[junit4:junit4]   2> 5993 T1887 oasc.ShardLeaderElectionContext.runLeaderProcess I may be the new leader - try and sync
[junit4:junit4]   2> 5993 T1887 oasc.SyncStrategy.sync Sync replicas to http://127.0.0.1:22876/solr/collection1/
[junit4:junit4]   2> 5994 T1887 oasc.SyncStrategy.syncReplicas Sync Success - now sync replicas to me
[junit4:junit4]   2> 5994 T1887 oasc.SyncStrategy.syncToMe http://127.0.0.1:22876/solr/collection1/ has no replicas
[junit4:junit4]   2> 5995 T1887 oasc.ShardLeaderElectionContext.runLeaderProcess I am the new leader: http://127.0.0.1:22876/solr/collection1/
[junit4:junit4]   2> 5995 T1887 oascc.SolrZkClient.makePath makePath: /collections/collection1/leaders/shard2
[junit4:junit4]   2> 5997 T1892 oazs.PrepRequestProcessor.pRequest Got user-level KeeperException when processing sessionid:0x139c8bd833b0004 type:create cxid:0x4c zxid:0xfffffffffffffffe txntype:unknown reqpath:n/a Error Path:/solr/overseer Error:KeeperErrorCode = NodeExists for /solr/overseer
[junit4:junit4]   2> 6314 T1908 oascc.ZkStateReader.updateClusterState Updating cloud state from ZooKeeper... 
[junit4:junit4]   2> 6333 T1933 oascc.ZkStateReader$2.process A cluster state change has occurred - updating...
[junit4:junit4]   2> 6333 T1907 oascc.ZkStateReader$2.process A cluster state change has occurred - updating...
[junit4:junit4]   2> 6333 T1921 oascc.ZkStateReader$2.process A cluster state change has occurred - updating...
[junit4:junit4]   2> 6356 T1887 oasc.ZkController.register We are http://127.0.0.1:22876/solr/collection1/ and leader is http://127.0.0.1:22876/solr/collection1/
[junit4:junit4]   2> 6356 T1887 oasc.ZkController.register No LogReplay needed for core=collection1 baseURL=http://127.0.0.1:22876/solr
[junit4:junit4]   2> 6357 T1887 oasc.ZkController.checkRecovery I am the leader, no recovery necessary
[junit4:junit4]   2> 6358 T1887 oascc.ZkStateReader.updateClusterState Updating cloud state from ZooKeeper... 
[junit4:junit4]   2> 6359 T1887 oass.SolrDispatchFilter.init user.dir=/usr/home/hudson/hudson-slave/workspace/Lucene-Solr-Tests-trunk-Java6/solr/build/solr-core/test/J1
[junit4:junit4]   2> 6359 T1887 oass.SolrDispatchFilter.init SolrDispatchFilter.init() done
[junit4:junit4]   2> 6360 T1887 oascsi.HttpClientUtil.createClient Creating new http client, config:maxConnections=128&maxConnectionsPerHost=32&followRedirects=false
[junit4:junit4]   2> 6370 T1887 oejs.Server.doStart jetty-8.1.2.v20120308
[junit4:junit4]   2> 6373 T1887 oejs.AbstractConnector.doStart Started SocketConnector@0.0.0.0:44267
[junit4:junit4]   2> 6373 T1887 oasc.SolrResourceLoader.locateSolrHome JNDI not configured for solr (NoInitialContextEx)
[junit4:junit4]   2> 6374 T1887 oasc.SolrResourceLoader.locateSolrHome using system property solr.solr.home: /usr/home/hudson/hudson-slave/workspace/Lucene-Solr-Tests-trunk-Java6/solr/build/solr-core/test-files/solr
[junit4:junit4]   2> 6374 T1887 oasc.SolrResourceLoader.<init> new SolrResourceLoader for deduced Solr Home: '/usr/home/hudson/hudson-slave/workspace/Lucene-Solr-Tests-trunk-Java6/solr/build/solr-core/test-files/solr/'
[junit4:junit4]   2> 6401 T1887 oass.SolrDispatchFilter.init SolrDispatchFilter.init()
[junit4:junit4]   2> 6401 T1887 oasc.SolrResourceLoader.locateSolrHome JNDI not configured for solr (NoInitialContextEx)
[junit4:junit4]   2> 6401 T1887 oasc.SolrResourceLoader.locateSolrHome using system property solr.solr.home: /usr/home/hudson/hudson-slave/workspace/Lucene-Solr-Tests-trunk-Java6/solr/build/solr-core/test-files/solr
[junit4:junit4]   2> 6402 T1887 oasc.CoreContainer$Initializer.initialize looking for solr.xml: /usr/home/hudson/hudson-slave/workspace/Lucene-Solr-Tests-trunk-Java6/solr/build/solr-core/test-files/solr/solr.xml
[junit4:junit4]   2> 6402 T1887 oasc.CoreContainer.<init> New CoreContainer 525797602
[junit4:junit4]   2> 6403 T1887 oasc.CoreContainer.load Loading CoreContainer using Solr Home: '/usr/home/hudson/hudson-slave/workspace/Lucene-Solr-Tests-trunk-Java6/solr/build/solr-core/test-files/solr/'
[junit4:junit4]   2> 6403 T1887 oasc.SolrResourceLoader.<init> new SolrResourceLoader for directory: '/usr/home/hudson/hudson-slave/workspace/Lucene-Solr-Tests-trunk-Java6/solr/build/solr-core/test-files/solr/'
[junit4:junit4]   2> 6422 T1887 oasc.CoreContainer.load Registering Log Listener
[junit4:junit4]   2> 6433 T1887 oasc.CoreContainer.initZooKeeper Zookeeper client=127.0.0.1:46808/solr
[junit4:junit4]   2> 6433 T1887 oaz.ZooKeeper.<init> Initiating client connection, connectString=127.0.0.1:46808/solr sessionTimeout=5000 watcher=org.apache.solr.common.cloud.ConnectionManager@49fde5cf
[junit4:junit4]   2> 6434 T1944 oaz.ClientCnxn$SendThread.startConnect Opening socket connection to server /127.0.0.1:46808
[junit4:junit4]   2> 6434 T1887 oascc.ConnectionManager.waitForConnected Waiting for client to connect to ZooKeeper
[junit4:junit4]   2> 6436 T1944 oaz.ClientCnxn$SendThread.primeConnection Socket connection established to localhost/127.0.0.1:46808, initiating session
[junit4:junit4]   2> 6436 T1889 oazs.NIOServerCnxn$Factory.run Accepted socket connection from /140.211.11.196:10607
[junit4:junit4]   2> 6436 T1889 oazs.NIOServerCnxn.readConnectRequest Client attempting to establish new session at /140.211.11.196:10607
[junit4:junit4]   2> 6437 T1891 oazs.NIOServerCnxn.finishSessionInit Established session 0x139c8bd833b0005 with negotiated timeout 5000 for client /140.211.11.196:10607
[junit4:junit4]   2> 6437 T1944 oaz.ClientCnxn$SendThread.readConnectResult Session establishment complete on server localhost/127.0.0.1:46808, sessionid = 0x139c8bd833b0005, negotiated timeout = 5000
[junit4:junit4]   2> 6438 T1945 oascc.ConnectionManager.process Watcher org.apache.solr.common.cloud.ConnectionManager@49fde5cf name:ZooKeeperConnection Watcher:127.0.0.1:46808/solr got event WatchedEvent state:SyncConnected type:None path:null path:null type:None
[junit4:junit4]   2> 6438 T1887 oascc.ConnectionManager.waitForConnected Client is connected to ZooKeeper
[junit4:junit4]   2> 6438 T1892 oazs.PrepRequestProcessor.pRequest Got user-level KeeperException when processing sessionid:0x139c8bd833b0005 type:create cxid:0x1 zxid:0xfffffffffffffffe txntype:unknown reqpath:n/a Error Path:/solr/overseer Error:KeeperErrorCode = NodeExists for /solr/overseer
[junit4:junit4]   2> 6439 T1892 oazs.PrepRequestProcessor.pRequest Got user-level KeeperException when processing sessionid:0x139c8bd833b0005 type:create cxid:0x2 zxid:0xfffffffffffffffe txntype:unknown reqpath:n/a Error Path:/solr/overseer Error:KeeperErrorCode = NodeExists for /solr/overseer
[junit4:junit4]   2> 6448 T1887 oasc.ZkController.createEphemeralLiveNode Register node as live in ZooKeeper:/live_nodes/127.0.0.1:44267_solr
[junit4:junit4]   2> 6449 T1892 oazs.PrepRequestProcessor.pRequest Got user-level KeeperException when processing sessionid:0x139c8bd833b0005 type:delete cxid:0x4 zxid:0xfffffffffffffffe txntype:unknown reqpath:n/a Error Path:/solr/live_nodes/127.0.0.1:44267_solr Error:KeeperErrorCode = NoNode for /solr/live_nodes/127.0.0.1:44267_solr
[junit4:junit4]   2> 6450 T1887 oascc.SolrZkClient.makePath makePath: /live_nodes/127.0.0.1:44267_solr
[junit4:junit4]   2> 6452 T1907 oascc.ZkStateReader$3.process Updating live nodes
[junit4:junit4]   2> 6452 T1921 oascc.ZkStateReader$3.process Updating live nodes
[junit4:junit4]   2> 6452 T1933 oascc.ZkStateReader$3.process Updating live nodes
[junit4:junit4]   2> 6452 T1887 oashc.HttpShardHandlerFactory.getParameter Setting socketTimeout to: 0
[junit4:junit4]   2> 6453 T1887 oashc.HttpShardHandlerFactory.getParameter Setting urlScheme to: http://
[junit4:junit4]   2> 6453 T1887 oashc.HttpShardHandlerFactory.getParameter Setting connTimeout to: 0
[junit4:junit4]   2> 6453 T1887 oashc.HttpShardHandlerFactory.getParameter Setting maxConnectionsPerHost to: 20
[junit4:junit4]   2> 6453 T1887 oashc.HttpShardHandlerFactory.getParameter Setting corePoolSize to: 0
[junit4:junit4]   2> 6454 T1887 oashc.HttpShardHandlerFactory.getParameter Setting maximumPoolSize to: 2147483647
[junit4:junit4]   2> 6454 T1887 oashc.HttpShardHandlerFactory.getParameter Setting maxThreadIdleTime to: 5
[junit4:junit4]   2> 6454 T1887 oashc.HttpShardHandlerFactory.getParameter Setting sizeOfQueue to: -1
[junit4:junit4]   2> 6455 T1887 oashc.HttpShardHandlerFactory.getParameter Setting fairnessPolicy to: false
[junit4:junit4]   2> 6455 T1887 oascsi.HttpClientUtil.createClient Creating new http client, config:maxConnectionsPerHost=20&maxConnections=10000&socketTimeout=0&connTimeout=0&retry=false
[junit4:junit4]   2> 6463 T1887 oascc.ZkStateReader.createClusterStateWatchersAndUpdate Updating cluster state from ZooKeeper... 
[junit4:junit4]   2> 6467 T1887 oasc.CoreContainer.create Creating SolrCore 'collection1' using instanceDir: /usr/home/hudson/hudson-slave/workspace/Lucene-Solr-Tests-trunk-Java6/solr/build/solr-core/test-files/solr/collection1
[junit4:junit4]   2> 6467 T1887 oasc.ZkController.createCollectionZkNode Check for collection zkNode:collection1
[junit4:junit4]   2> 6468 T1887 oasc.ZkController.createCollectionZkNode Collection zkNode exists
[junit4:junit4]   2> 6468 T1887 oasc.ZkController.readConfigName Load collection config from:/collections/collection1
[junit4:junit4]   2> 6469 T1887 oasc.SolrResourceLoader.<init> new SolrResourceLoader for directory: '/usr/home/hudson/hudson-slave/workspace/Lucene-Solr-Tests-trunk-Java6/solr/build/solr-core/test-files/solr/collection1/'
[junit4:junit4]   2> 6470 T1887 oasc.SolrResourceLoader.replaceClassLoader Adding 'file:/usr/home/hudson/hudson-slave/workspace/Lucene-Solr-Tests-trunk-Java6/solr/build/solr-core/test-files/solr/collection1/lib/classes/' to classloader
[junit4:junit4]   2> 6470 T1887 oasc.SolrResourceLoader.replaceClassLoader Adding 'file:/usr/home/hudson/hudson-slave/workspace/Lucene-Solr-Tests-trunk-Java6/solr/build/solr-core/test-files/solr/collection1/lib/README' to classloader
[junit4:junit4]   2> 6503 T1887 oasc.SolrConfig.<init> Using Lucene MatchVersion: LUCENE_50
[junit4:junit4]   2> 6551 T1887 oasc.SolrConfig.<init> Loaded SolrConfig: solrconfig.xml
[junit4:junit4]   2> 6652 T1887 oass.IndexSchema.readSchema Reading Solr Schema
[junit4:junit4]   2> 6657 T1887 oass.IndexSchema.readSchema Schema name=test
[junit4:junit4]   2> 6845 T1908 oascc.ZkStateReader.updateClusterState Updating cloud state from ZooKeeper... 
[junit4:junit4]   2> 6860 T1907 oascc.ZkStateReader$2.process A cluster state change has occurred - updating...
[junit4:junit4]   2> 6860 T1921 oascc.ZkStateReader$2.process A cluster state change has occurred - updating...
[junit4:junit4]   2> 6860 T1933 oascc.ZkStateReader$2.process A cluster state change has occurred - updating...
[junit4:junit4]   2> 6860 T1945 oascc.ZkStateReader$2.process A cluster state change has occurred - updating...
[junit4:junit4]   2> 7124 T1887 oass.OpenExchangeRatesOrgProvider.init Initialized with rates=open-exchange-rates.json, refreshInterval=1440.
[junit4:junit4]   2> 7132 T1887 oass.IndexSchema.readSchema default search field in schema is text
[junit4:junit4]   2> 7135 T1887 oass.IndexSchema.readSchema unique key field: id
[junit4:junit4]   2> 7144 T1887 oass.FileExchangeRateProvider.reload Reloading exchange rates from file currency.xml
[junit4:junit4]   2> 7148 T1887 oass.FileExchangeRateProvider.reload Reloading exchange rates from file currency.xml
[junit4:junit4]   2> 7151 T1887 oass.OpenExchangeRatesOrgProvider.reload Reloading exchange rates from open-exchange-rates.json
[junit4:junit4]   2> 7152 T1887 oass.OpenExchangeRatesOrgProvider.reload Reloading exchange rates from open-exchange-rates.json
[junit4:junit4]   2> 7153 T1887 oasc.SolrCore.<init> [collection1] Opening new SolrCore at /usr/home/hudson/hudson-slave/workspace/Lucene-Solr-Tests-trunk-Java6/solr/build/solr-core/test-files/solr/collection1/, dataDir=./org.apache.solr.cloud.BasicDistributedZk2Test-1347692626742/jetty3/
[junit4:junit4]   2> 7153 T1887 oasc.JmxMonitoredMap.<init> JMX monitoring is enabled. Adding Solr mbeans to JMX Server: com.sun.jmx.mbeanserver.JmxMBeanServer@4e46b90a
[junit4:junit4]   2> 7154 T1887 oasc.SolrCore.getNewIndexDir WARNING New index directory detected: old=null new=./org.apache.solr.cloud.BasicDistributedZk2Test-1347692626742/jetty3/index/
[junit4:junit4]   2> 7155 T1887 oasc.SolrCore.initIndex WARNING [collection1] Solr index directory './org.apache.solr.cloud.BasicDistributedZk2Test-1347692626742/jetty3/index' doesn't exist. Creating new index...
[junit4:junit4]   2> 7156 T1887 oasc.CachingDirectoryFactory.get return new directory for /usr/home/hudson/hudson-slave/workspace/Lucene-Solr-Tests-trunk-Java6/solr/build/solr-core/test/J1/./org.apache.solr.cloud.BasicDistributedZk2Test-1347692626742/jetty3/index forceNew:false
[junit4:junit4]   2> 7160 T1887 oasc.SolrDeletionPolicy.onCommit SolrDeletionPolicy.onCommit: commits:num=1
[junit4:junit4]   2> 		commit{dir=/usr/home/hudson/hudson-slave/workspace/Lucene-Solr-Tests-trunk-Java6/solr/build/solr-core/test/J1/org.apache.solr.cloud.BasicDistributedZk2Test-1347692626742/jetty3/index,segFN=segments_1,generation=1,filenames=[segments_1]
[junit4:junit4]   2> 7161 T1887 oasc.SolrDeletionPolicy.updateCommits newest commit = 1
[junit4:junit4]   2> 7161 T1887 oasc.SolrCore.initWriters created xml: solr.XMLResponseWriter
[junit4:junit4]   2> 7163 T1887 oasup.UpdateRequestProcessorChain.init inserting DistributedUpdateProcessorFactory into updateRequestProcessorChain "dedupe"
[junit4:junit4]   2> 7163 T1887 oasup.UpdateRequestProcessorChain.init inserting DistributedUpdateProcessorFactory into updateRequestProcessorChain "dedupe-allfields"
[junit4:junit4]   2> 7163 T1887 oasup.UpdateRequestProcessorChain.init inserting DistributedUpdateProcessorFactory into updateRequestProcessorChain "stored_sig"
[junit4:junit4]   2> 7164 T1887 oasup.UpdateRequestProcessorChain.init inserting DistributedUpdateProcessorFactory into updateRequestProcessorChain "uniq-fields"
[junit4:junit4]   2> 7164 T1887 oasup.UpdateRequestProcessorChain.init inserting DistributedUpdateProcessorFactory into updateRequestProcessorChain "distrib-dup-test-chain-implicit"
[junit4:junit4]   2> 7165 T1887 oasc.RequestHandlers.initHandlersFromConfig adding lazy requestHandler: solr.ReplicationHandler
[junit4:junit4]   2> 7165 T1887 oasc.RequestHandlers.initHandlersFromConfig created /replication: solr.ReplicationHandler
[junit4:junit4]   2> 7166 T1887 oasc.RequestHandlers.initHandlersFromConfig created standard: solr.StandardRequestHandler
[junit4:junit4]   2> 7166 T1887 oasc.RequestHandlers.initHandlersFromConfig created /get: solr.RealTimeGetHandler
[junit4:junit4]   2> 7167 T1887 oasc.RequestHandlers.initHandlersFromConfig created dismax: solr.SearchHandler
[junit4:junit4]   2> 7167 T1887 oasc.RequestHandlers.initHandlersFromConfig created mock: org.apache.solr.core.MockQuerySenderListenerReqHandler
[junit4:junit4]   2> 7167 T1887 oasc.RequestHandlers.initHandlersFromConfig created /admin/: org.apache.solr.handler.admin.AdminHandlers
[junit4:junit4]   2> 7168 T1887 oasc.RequestHandlers.initHandlersFromConfig created defaults: solr.StandardRequestHandler
[junit4:junit4]   2> 7168 T1887 oasc.RequestHandlers.initHandlersFromConfig adding lazy requestHandler: solr.StandardRequestHandler
[junit4:junit4]   2> 7169 T1887 oasc.RequestHandlers.initHandlersFromConfig created lazy: solr.StandardRequestHandler
[junit4:junit4]   2> 7169 T1887 oasc.RequestHandlers.initHandlersFromConfig created /update: solr.UpdateRequestHandler
[junit4:junit4]   2> 7169 T1887 oasc.RequestHandlers.initHandlersFromConfig created /terms: org.apache.solr.handler.component.SearchHandler
[junit4:junit4]   2> 7170 T1887 oasc.RequestHandlers.initHandlersFromConfig created spellCheckCompRH: org.apache.solr.handler.component.SearchHandler
[junit4:junit4]   2> 7170 T1887 oasc.RequestHandlers.initHandlersFromConfig created spellCheckCompRH_Direct: org.apache.solr.handler.component.SearchHandler
[junit4:junit4]   2> 7171 T1887 oasc.RequestHandlers.initHandlersFromConfig created spellCheckWithWordbreak: org.apache.solr.handler.component.SearchHandler
[junit4:junit4]   2> 7171 T1887 oasc.RequestHandlers.initHandlersFromConfig created spellCheckWithWordbreak_Direct: org.apache.solr.handler.component.SearchHandler
[junit4:junit4]   2> 7172 T1887 oasc.RequestHandlers.initHandlersFromConfig created spellCheckCompRH1: org.apache.solr.handler.component.SearchHandler
[junit4:junit4]   2> 7172 T1887 oasc.RequestHandlers.initHandlersFromConfig created tvrh: org.apache.solr.handler.component.SearchHandler
[junit4:junit4]   2> 7173 T1887 oasc.RequestHandlers.initHandlersFromConfig created /mlt: solr.MoreLikeThisHandler
[junit4:junit4]   2> 7173 T1887 oasc.RequestHandlers.initHandlersFromConfig created /debug/dump: solr.DumpRequestHandler
[junit4:junit4]   2> 7176 T1887 oashl.XMLLoader.init xsltCacheLifetimeSeconds=60
[junit4:junit4]   2> 7180 T1887 oasc.SolrCore.initDeprecatedSupport WARNING solrconfig.xml uses deprecated <admin/gettableFiles>, Please update your config to use the ShowFileRequestHandler.
[junit4:junit4]   2> 7181 T1887 oasc.SolrCore.initDeprecatedSupport WARNING adding ShowFileRequestHandler with hidden files: [SCHEMA.XML, OLD_SYNONYMS.TXT, STOPWORDS.TXT, PROTWORDS.TXT, OPEN-EXCHANGE-RATES.JSON, SYNONYMS.TXT, CURRENCY.XML, MAPPING-ISOLATIN1ACCENT.TXT]
[junit4:junit4]   2> 7184 T1887 oass.SolrIndexSearcher.<init> Opening Searcher@33d4a2bd main
[junit4:junit4]   2> 7185 T1887 oasu.CommitTracker.<init> Hard AutoCommit: disabled
[junit4:junit4]   2> 7185 T1887 oasu.CommitTracker.<init> Soft AutoCommit: disabled
[junit4:junit4]   2> 7186 T1887 oashc.SpellCheckComponent.inform Initializing spell checkers
[junit4:junit4]   2> 7193 T1887 oass.DirectSolrSpellChecker.init init: {name=direct,classname=DirectSolrSpellChecker,field=lowerfilt,minQueryLength=3}
[junit4:junit4]   2> 7251 T1946 oasc.SolrCore.registerSearcher [collection1] Registered new searcher Searcher@33d4a2bd main{StandardDirectoryReader(segments_1:1)}
[junit4:junit4]   2> 7364 T1908 oascc.ZkStateReader.updateClusterState Updating cloud state from ZooKeeper... 
[junit4:junit4]   2> 7381 T1907 oascc.ZkStateReader$2.process A cluster state change has occurred - updating...
[junit4:junit4]   2> 7381 T1921 oascc.ZkStateReader$2.process A cluster state change has occurred - updating...
[junit4:junit4]   2> 7381 T1945 oascc.ZkStateReader$2.process A cluster state change has occurred - updating...
[junit4:junit4]   2> 7381 T1933 oascc.ZkStateReader$2.process A cluster state change has occurred - updating...
[junit4:junit4]   2> 7758 T1887 oasc.CoreContainer.register registering core: collection1
[junit4:junit4]   2> 7758 T1887 oasc.ZkController.register Register shard - core:collection1 address:http://127.0.0.1:44267/solr shardId:shard1
[junit4:junit4]   2> 7761 T1887 oasc.ZkController.register We are http://127.0.0.1:44267/solr/collection1/ and leader is http://127.0.0.1:30314/solr/collection1/
[junit4:junit4]   2> 7761 T1887 oasc.ZkController.register No LogReplay needed for core=collection1 baseURL=http://127.0.0.1:44267/solr
[junit4:junit4]   2> 7761 T1887 oasc.ZkController.checkRecovery Core needs to recover:collection1
[junit4:junit4]   2> 7762 T1887 oasu.DefaultSolrCoreState.doRecovery Running recovery - first canceling any ongoing recovery
[junit4:junit4]   2> ASYNC  NEW_CORE C164 name=collection1 org.apache.solr.core.SolrCore@23b8710a url=http://127.0.0.1:44267/solr/collection1 node=127.0.0.1:44267_solr
[junit4:junit4]   2> 7764 T1947 C164 P44267 oasc.RecoveryStrategy.run Starting recovery process.  core=collection1 recoveringAfterStartup=true
[junit4:junit4]   2> 7764 T1887 oascc.ZkStateReader.updateClusterState Updating cloud state from ZooKeeper... 
[junit4:junit4]   2> 7764 T1947 C164 P44267 oasc.RecoveryStrategy.doRecovery ###### startupVersions=[]
[junit4:junit4]   2> 7764 T1887 oass.SolrDispatchFilter.init user.dir=/usr/home/hudson/hudson-slave/workspace/Lucene-Solr-Tests-trunk-Java6/solr/build/solr-core/test/J1
[junit4:junit4]   2> 7765 T1887 oass.SolrDispatchFilter.init SolrDispatchFilter.init() done
[junit4:junit4]   2> 7765 T1947 C164 P44267 oasc.RecoveryStrategy.doRecovery Attempting to PeerSync from http://127.0.0.1:30314/solr/collection1/ core=collection1 - recoveringAfterStartup=true
[junit4:junit4]   2> 7765 T1887 oascsi.HttpClientUtil.createClient Creating new http client, config:maxConnections=128&maxConnectionsPerHost=32&followRedirects=false
[junit4:junit4]   2> 7766 T1947 C164 P44267 oasu.PeerSync.sync PeerSync: core=collection1 url=http://127.0.0.1:44267/solr START replicas=[http://127.0.0.1:30314/solr/collection1/] nUpdates=100
[junit4:junit4]   2> 7766 T1947 C164 P44267 oasu.PeerSync.sync WARNING no frame of reference to tell of we've missed updates
[junit4:junit4]   2> 7767 T1947 C164 P44267 oasc.RecoveryStrategy.doRecovery PeerSync Recovery was not successful - trying replication. core=collection1
[junit4:junit4]   2> 7767 T1947 C164 P44267 oasc.RecoveryStrategy.doRecovery Starting Replication Recovery. core=collection1
[junit4:junit4]   2> 7767 T1947 C164 P44267 oascsi.HttpClientUtil.createClient Creating new http client, config:maxConnections=128&maxConnectionsPerHost=32&followRedirects=false
[junit4:junit4]   2> ASYNC  NEW_CORE C165 name=collection1 org.apache.solr.core.SolrCore@50a146bd url=http://127.0.0.1:30314/solr/collection1 node=127.0.0.1:30314_solr
[junit4:junit4]   2> 7776 T1913 C165 P30314 REQ /get {distrib=false&qt=/get&wt=javabin&version=2&getVersions=100} status=0 QTime=1 
[junit4:junit4]   2> 7779 T1887 oejs.Server.doStart jetty-8.1.2.v20120308
[junit4:junit4]   2> 7781 T1887 oejs.AbstractConnector.doStart Started SocketConnector@0.0.0.0:45953
[junit4:junit4]   2> 7782 T1887 oasc.SolrResourceLoader.locateSolrHome JNDI not configured for solr (NoInitialContextEx)
[junit4:junit4]   2> 7782 T1887 oasc.SolrResourceLoader.locateSolrHome using system property solr.solr.home: /usr/home/hudson/hudson-slave/workspace/Lucene-Solr-Tests-trunk-Java6/solr/build/solr-core/test-files/solr
[junit4:junit4]   2> 7782 T1887 oasc.SolrResourceLoader.<init> new SolrResourceLoader for deduced Solr Home: '/usr/home/hudson/hudson-slave/workspace/Lucene-Solr-Tests-trunk-Java6/solr/build/solr-core/test-files/solr/'
[junit4:junit4]   2> 7804 T1887 oass.SolrDispatchFilter.init SolrDispatchFilter.init()
[junit4:junit4]   2> 7804 T1887 oasc.SolrResourceLoader.locateSolrHome JNDI not configured for solr (NoInitialContextEx)
[junit4:junit4]   2> 7805 T1887 oasc.SolrResourceLoader.locateSolrHome using system property solr.solr.home: /usr/home/hudson/hudson-slave/workspace/Lucene-Solr-Tests-trunk-Java6/solr/build/solr-core/test-files/solr
[junit4:junit4]   2> 7805 T1887 oasc.CoreContainer$Initializer.initialize looking for solr.xml: /usr/home/hudson/hudson-slave/workspace/Lucene-Solr-Tests-trunk-Java6/solr/build/solr-core/test-files/solr/solr.xml
[junit4:junit4]   2> 7805 T1887 oasc.CoreContainer.<init> New CoreContainer 313878547
[junit4:junit4]   2> 7806 T1887 oasc.CoreContainer.load Loading CoreContainer using Solr Home: '/usr/home/hudson/hudson-slave/workspace/Lucene-Solr-Tests-trunk-Java6/solr/build/solr-core/test-files/solr/'
[junit4:junit4]   2> 7806 T1887 oasc.SolrResourceLoader.<init> new SolrResourceLoader for directory: '/usr/home/hudson/hudson-slave/workspace/Lucene-Solr-Tests-trunk-Java6/solr/build/solr-core/test-files/solr/'
[junit4:junit4]   2> 7823 T1887 oasc.CoreContainer.load Registering Log Listener
[junit4:junit4]   2> 7833 T1887 oasc.CoreContainer.initZooKeeper Zookeeper client=127.0.0.1:46808/solr
[junit4:junit4]   2> 7834 T1887 oaz.ZooKeeper.<init> Initiating client connection, connectString=127.0.0.1:46808/solr sessionTimeout=5000 watcher=org.apache.solr.common.cloud.ConnectionManager@68b344cc
[junit4:junit4]   2> 7835 T1958 oaz.ClientCnxn$SendThread.startConnect Opening socket connection to server /127.0.0.1:46808
[junit4:junit4]   2> 7835 T1887 oascc.ConnectionManager.waitForConnected Waiting for client to connect to ZooKeeper
[junit4:junit4]   2> 7836 T1958 oaz.ClientCnxn$SendThread.primeConnection Socket connection established to localhost/127.0.0.1:46808, initiating session
[junit4:junit4]   2> 7836 T1889 oazs.NIOServerCnxn$Factory.run Accepted socket connection from /140.211.11.196:10277
[junit4:junit4]   2> 7837 T1889 oazs.NIOServerCnxn.readConnectRequest Client attempting to establish new session at /140.211.11.196:10277
[junit4:junit4]   2> 7838 T1891 oazs.NIOServerCnxn.finishSessionInit Established session 0x139c8bd833b0006 with negotiated timeout 5000 for client /140.211.11.196:10277
[junit4:junit4]   2> 7838 T1958 oaz.ClientCnxn$SendThread.readConnectResult Session establishment complete on server localhost/127.0.0.1:46808, sessionid = 0x139c8bd833b0006, negotiated timeout = 5000
[junit4:junit4]   2> 7839 T1959 oascc.ConnectionManager.process Watcher org.apache.solr.common.cloud.ConnectionManager@68b344cc name:ZooKeeperConnection Watcher:127.0.0.1:46808/solr got event WatchedEvent state:SyncConnected type:None path:null path:null type:None
[junit4:junit4]   2> 7839 T1887 oascc.ConnectionManager.waitForConnected Client is connected to ZooKeeper
[junit4:junit4]   2> 7840 T1892 oazs.PrepRequestProcessor.pRequest Got user-level KeeperException when processing sessionid:0x139c8bd833b0006 type:create cxid:0x1 zxid:0xfffffffffffffffe txntype:unknown reqpath:n/a Error Path:/solr/overseer Error:KeeperErrorCode = NodeExists for /solr/overseer
[junit4:junit4]   2> 7850 T1892 oazs.PrepRequestProcessor.pRequest Got user-level KeeperException when processing sessionid:0x139c8bd833b0006 type:create cxid:0x2 zxid:0xfffffffffffffffe txntype:unknown reqpath:n/a Error Path:/solr/overseer Error:KeeperErrorCode = NodeExists for /solr/overseer
[junit4:junit4]   2> 7851 T1887 oasc.ZkController.createEphemeralLiveNode Register node as live in ZooKeeper:/live_nodes/127.0.0.1:45953_solr
[junit4:junit4]   2> 7851 T1892 oazs.PrepRequestProcessor.pRequest Got user-level KeeperException when processing sessionid:0x139c8bd833b0006 type:delete cxid:0x4 zxid:0xfffffffffffffffe txntype:unknown reqpath:n/a Error Path:/solr/live_nodes/127.0.0.1:45953_solr Error:KeeperErrorCode = NoNode for /solr/live_nodes/127.0.0.1:45953_solr
[junit4:junit4]   2> 7858 T1887 oascc.SolrZkClient.makePath makePath: /live_nodes/127.0.0.1:45953_solr
[junit4:junit4]   2> 7859 T1933 oascc.ZkStateReader$3.process Updating live nodes
[junit4:junit4]   2> 7859 T1921 oascc.ZkStateReader$3.process Updating live nodes
[junit4:junit4]   2> 7859 T1945 oascc.ZkStateReader$3.process Updating live nodes
[junit4:junit4]   2> 7859 T1907 oascc.ZkStateReader$3.process Updating live nodes
[junit4:junit4]   2> 7860 T1887 oashc.HttpShardHandlerFactory.getParameter Setting socketTimeout to: 0
[junit4:junit4]   2> 7860 T1887 oashc.HttpShardHandlerFactory.getParameter Setting urlScheme to: http://
[junit4:junit4]   2> 7860 T1887 oashc.HttpShardHandlerFactory.getParameter Setting connTimeout to: 0
[junit4:junit4]   2> 7861 T1887 oashc.HttpShardHandlerFactory.getParameter Setting maxConnectionsPerHost to: 20
[junit4:junit4]   2> 7861 T1887 oashc.HttpShardHandlerFactory.getParameter Setting corePoolSize to: 0
[junit4:junit4]   2> 7861 T1887 oashc.HttpShardHandlerFactory.getParameter Setting maximumPoolSize to: 2147483647
[junit4:junit4]   2> 7862 T1887 oashc.HttpShardHandlerFactory.getParameter Setting maxThreadIdleTime to: 5
[junit4:junit4]   2> 7862 T1887 oashc.HttpShardHandlerFactory.getParameter Setting sizeOfQueue to: -1
[junit4:junit4]   2> 7862 T1887 oashc.HttpShardHandlerFactory.getParameter Setting fairnessPolicy to: false
[junit4:junit4]   2> 7863 T1887 oascsi.HttpClientUtil.createClient Creating new http client, config:maxConnectionsPerHost=20&maxConnections=10000&socketTimeout=0&connTimeout=0&retry=false
[junit4:junit4]   2> 7870 T1887 oascc.ZkStateReader.createClusterStateWatchersAndUpdate Updating cluster state from ZooKeeper... 
[junit4:junit4]   2> 7875 T1887 oasc.CoreContainer.create Creating SolrCore 'collection1' using instanceDir: /usr/home/hudson/hudson-slave/workspace/Lucene-Solr-Tests-trunk-Java6/solr/build/solr-core/test-files/solr/collection1
[junit4:junit4]   2> 7875 T1887 oasc.ZkController.createCollectionZkNode Check for collection zkNode:collection1
[junit4:junit4]   2> 7875 T1887 oasc.ZkController.createCollectionZkNode Collection zkNode exists
[junit4:junit4]   2> 7876 T1887 oasc.ZkController.readConfigName Load collection config from:/collections/collection1
[junit4:junit4]   2> 7877 T1887 oasc.SolrResourceLoader.<init> new SolrResourceLoader for directory: '/usr/home/hudson/hudson-slave/workspace/Lucene-Solr-Tests-trunk-Java6/solr/build/solr-core/test-files/solr/collection1/'
[junit4:junit4]   2> 7878 T1887 oasc.SolrResourceLoader.replaceClassLoader Adding 'file:/usr/home/hudson/hudson-slave/workspace/Lucene-Solr-Tests-trunk-Java6/solr/build/solr-core/test-files/solr/collection1/lib/classes/' to classloader
[junit4:junit4]   2> 7878 T1887 oasc.SolrResourceLoader.replaceClassLoader Adding 'file:/usr/home/hudson/hudson-slave/workspace/Lucene-Solr-Tests-trunk-Java6/solr/build/solr-core/test-files/solr/collection1/lib/README' to classloader
[junit4:junit4]   2> 7886 T1908 oascc.ZkStateReader.updateClusterState Updating cloud state from ZooKeeper... 
[junit4:junit4]   2> 7897 T1959 oascc.ZkStateReader$2.process A cluster state change has occurred - updating...
[junit4:junit4]   2> 7897 T1933 oascc.ZkStateReader$2.process A cluster state change has occurred - updating...
[junit4:junit4]   2> 7897 T1945 oascc.ZkStateReader$2.process A cluster state change has occurred - updating...
[junit4:junit4]   2> 7897 T1921 oascc.ZkStateReader$2.process A cluster state change has occurred - updating...
[junit4:junit4]   2> 7897 T1907 oascc.ZkStateReader$2.process A cluster state change has occurred - updating...
[junit4:junit4]   2> 7911 T1887 oasc.SolrConfig.<init> Using Lucene MatchVersion: LUCENE_50
[junit4:junit4]   2> 7963 T1887 oasc.SolrConfig.<init> Loaded SolrConfig: solrconfig.xml
[junit4:junit4]   2> 8064 T1887 oass.IndexSchema.readSchema Reading Solr Schema
[junit4:junit4]   2> 8068 T1887 oass.IndexSchema.readSchema Schema name=test
[junit4:junit4]   2> 8499 T1887 oass.OpenExchangeRatesOrgProvider.init Initialized with rates=open-exchange-rates.json, refreshInterval=1440.
[junit4:junit4]   2> 8507 T1887 oass.IndexSchema.readSchema default search field in schema is text
[junit4:junit4]   2> 8510 T1887 oass.IndexSchema.readSchema unique key field: id
[junit4:junit4]   2> 8519 T1887 oass.FileExchangeRateProvider.reload Reloading exchange rates from file currency.xml
[junit4:junit4]   2> 8523 T1887 oass.FileExchangeRateProvider.reload Reloading exchange rates from file currency.xml
[junit4:junit4]   2> 8526 T1887 oass.OpenExchangeRatesOrgProvider.reload Reloading exchange rates from open-exchange-rates.json
[junit4:junit4]   2> 8527 T1887 oass.OpenExchangeRatesOrgProvider.reload Reloading exchange rates from open-exchange-rates.json
[junit4:junit4]   2> 8528 T1887 oasc.SolrCore.<init> [collection1] Opening new SolrCore at /usr/home/hudson/hudson-slave/workspace/Lucene-Solr-Tests-trunk-Java6/solr/build/solr-core/test-files/solr/collection1/, dataDir=./org.apache.solr.cloud.BasicDistributedZk2Test-1347692626742/jetty4/
[junit4:junit4]   2> 8528 T1887 oasc.JmxMonitoredMap.<init> JMX monitoring is enabled. Adding Solr mbeans to JMX Server: com.sun.jmx.mbeanserver.JmxMBeanServer@4e46b90a
[junit4:junit4]   2> 8529 T1887 oasc.SolrCore.getNewIndexDir WARNING New index directory detected: old=null new=./org.apache.solr.cloud.BasicDistributedZk2Test-1347692626742/jetty4/index/
[junit4:junit4]   2> 8530 T1887 oasc.SolrCore.initIndex WARNING [collection1] Solr index directory './org.apache.solr.cloud.BasicDistributedZk2Test-1347692626742/jetty4/index' doesn't exist. Creating new index...
[junit4:junit4]   2> 8530 T1887 oasc.CachingDirectoryFactory.get return new directory for /usr/home/hudson/hudson-slave/workspace/Lucene-Solr-Tests-trunk-Java6/solr/build/solr-core/test/J1/./org.apache.solr.cloud.BasicDistributedZk2Test-1347692626742/jetty4/index forceNew:false
[junit4:junit4]   2> 8535 T1887 oasc.SolrDeletionPolicy.onCommit SolrDeletionPolicy.onCommit: commits:num=1
[junit4:junit4]   2> 		commit{dir=/usr/home/hudson/hudson-slave/workspace/Lucene-Solr-Tests-trunk-Java6/solr/build/solr-core/test/J1/org.apache.solr.cloud.BasicDistributedZk2Test-1347692626742/jetty4/index,segFN=segments_1,generation=1,filenames=[segments_1]
[junit4:junit4]   2> 8535 T1887 oasc.SolrDeletionPolicy.updateCommits newest commit = 1
[junit4:junit4]   2> 8536 T1887 oasc.SolrCore.initWriters created xml: solr.XMLResponseWriter
[junit4:junit4]   2> 8537 T1887 oasup.UpdateRequestProcessorChain.init inserting DistributedUpdateProcessorFactory into updateRequestProcessorChain "dedupe"
[junit4:junit4]   2> 8538 T1887 oasup.UpdateRequestProcessorChain.init inserting DistributedUpdateProcessorFactory into updateRequestProcessorChain "dedupe-allfields"
[junit4:junit4]   2> 8538 T1887 oasup.UpdateRequestProcessorChain.init inserting DistributedUpdateProcessorFactory into updateRequestProcessorChain "stored_sig"
[junit4:junit4]   2> 8538 T1887 oasup.UpdateRequestProcessorChain.init inserting DistributedUpdateProcessorFactory into updateRequestProcessorChain "uniq-fields"
[junit4:junit4]   2> 8539 T1887 oasup.UpdateRequestProcessorChain.init inserting DistributedUpdateProcessorFactory into updateRequestProcessorChain "distrib-dup-test-chain-implicit"
[junit4:junit4]   2> 8539 T1887 oasc.RequestHandlers.initHandlersFromConfig adding lazy requestHandler: solr.ReplicationHandler
[junit4:junit4]   2> 8540 T1887 oasc.RequestHandlers.initHandlersFromConfig created /replication: solr.ReplicationHandler
[junit4:junit4]   2> 8540 T1887 oasc.RequestHandlers.initHandlersFromConfig created standard: solr.StandardRequestHandler
[junit4:junit4]   2> 8541 T1887 oasc.RequestHandlers.initHandlersFromConfig created /get: solr.RealTimeGetHandler
[junit4:junit4]   2> 8541 T1887 oasc.RequestHandlers.initHandlersFromConfig created dismax: solr.SearchHandler
[junit4:junit4]   2> 8542 T1887 oasc.RequestHandlers.initHandlersFromConfig created mock: org.apache.solr.core.MockQuerySenderListenerReqHandler
[junit4:junit4]   2> 8542 T1887 oasc.RequestHandlers.initHandlersFromConfig created /admin/: org.apache.solr.handler.admin.AdminHandlers
[junit4:junit4]   2> 8543 T1887 oasc.RequestHandlers.initHandlersFromConfig created defaults: solr.StandardRequestHandler
[junit4:junit4]   2> 8543 T1887 oasc.RequestHandlers.initHandlersFromConfig adding lazy requestHandler: solr.StandardRequestHandler
[junit4:junit4]   2> 8543 T1887 oasc.RequestHandlers.initHandlersFromConfig created lazy: solr.StandardRequestHandler
[junit4:junit4]   2> 8544 T1887 oasc.RequestHandlers.initHandlersFromConfig created /update: solr.UpdateRequestHandler
[junit4:junit4]   2> 8544 T1887 oasc.RequestHandlers.initHandlersFromConfig created /terms: org.apache.solr.handler.component.SearchHandler
[junit4:junit4]   2> 8545 T1887 oasc.RequestHandlers.initHandlersFromConfig created spellCheckCompRH: org.apache.solr.handler.component.SearchHandler
[junit4:junit4]   2> 8545 T1887 oasc.RequestHandlers.initHandlersFromConfig created spellCheckCompRH_Direct: org.apache.solr.handler.component.SearchHandler
[junit4:junit4]   2> 8545 T1887 oasc.RequestHandlers.initHandlersFromConfig created spellCheckWithWordbreak: org.apache.solr.handler.component.SearchHandler
[junit4:junit4]   2> 8546 T1887 oasc.RequestHandlers.initHandlersFromConfig created spellCheckWithWordbreak_Direct: org.apache.solr.handler.component.SearchHandler
[junit4:junit4]   2> 8546 T1887 oasc.RequestHandlers.initHandlersFromConfig created spellCheckCompRH1: org.apache.solr.handler.component.SearchHandler
[junit4:junit4]   2> 8547 T1887 oasc.RequestHandlers.initHandlersFromConfig created tvrh: org.apache.solr.handler.component.SearchHandler
[junit4:junit4]   2> 8547 T1887 oasc.RequestHandlers.initHandlersFromConfig created /mlt: solr.MoreLikeThisHandler
[junit4:junit4]   2> 8548 T1887 oasc.RequestHandlers.initHandlersFromConfig created /debug/dump: solr.DumpRequestHandler
[junit4:junit4]   2> 8550 T1887 oashl.XMLLoader.init xsltCacheLifetimeSeconds=60
[junit4:junit4]   2> 8554 T1887 oasc.SolrCore.initDeprecatedSupport WARNING solrconfig.xml uses deprecated <admin/gettableFiles>, Please update your config to use the ShowFileRequestHandler.
[junit4:junit4]   2> 8555 T1887 oasc.SolrCore.initDeprecatedSupport WARNING adding ShowFileRequestHandler with hidden files: [SCHEMA.XML, OLD_SYNONYMS.TXT, STOPWORDS.TXT, PROTWORDS.TXT, OPEN-EXCHANGE-RATES.JSON, SYNONYMS.TXT, CURRENCY.XML, MAPPING-ISOLATIN1ACCENT.TXT]
[junit4:junit4]   2> 8558 T1887 oass.SolrIndexSearcher.<init> Opening Searcher@229355bd main
[junit4:junit4]   2> 8559 T1887 oasu.CommitTracker.<init> Hard AutoCommit: disabled
[junit4:junit4]   2> 8559 T1887 oasu.CommitTracker.<init> Soft AutoCommit: disabled
[junit4:junit4]   2> 8560 T1887 oashc.SpellCheckComponent.inform Initializing spell checkers
[junit4:junit4]   2> 8565 T1887 oass.DirectSolrSpellChecker.init init: {name=direct,classname=DirectSolrSpellChecker,field=lowerfilt,minQueryLength=3}
[junit4:junit4]   2> 8610 T1960 oasc.SolrCore.registerSearcher [collection1] Registered new searcher Searcher@229355bd main{StandardDirectoryReader(segments_1:1)}
[junit4:junit4]   2> 8902 T1908 oascc.ZkStateReader.updateClusterState Updating cloud state from ZooKeeper... 
[junit4:junit4]   2> 8914 T1907 oascc.ZkStateReader$2.process A cluster state change has occurred - updating...
[junit4:junit4]   2> 8914 T1921 oascc.ZkStateReader$2.process A cluster state change has occurred - updating...
[junit4:junit4]   2> 8915 T1933 oascc.ZkStateReader$2.process A cluster state change has occurred - updating...
[junit4:junit4]   2> 8914 T1959 oascc.ZkStateReader$2.process A cluster state change has occurred - updating...
[junit4:junit4]   2> 8914 T1945 oascc.ZkStateReader$2.process A cluster state change has occurred - updating...
[junit4:junit4]   2> 9115 T1887 oasc.CoreContainer.register registering core: collection1
[junit4:junit4]   2> 9115 T1887 oasc.ZkController.register Register shard - core:collection1 address:http://127.0.0.1:45953/solr shardId:shard2
[junit4:junit4]   2> 9117 T1887 oasc.ZkController.register We are http://127.0.0.1:45953/solr/collection1/ and leader is http://127.0.0.1:22876/solr/collection1/
[junit4:junit4]   2> 9118 T1887 oasc.ZkController.register No LogReplay needed for core=collection1 baseURL=http://127.0.0.1:45953/solr
[junit4:junit4]   2> 9118 T1887 oasc.ZkController.checkRecovery Core needs to recover:collection1
[junit4:junit4]   2> 9118 T1887 oasu.DefaultSolrCoreState.doRecovery Running recovery - first canceling any ongoing recovery
[junit4:junit4]   2> ASYNC  NEW_CORE C166 name=collection1 org.apache.solr.core.SolrCore@49f984de url=http://127.0.0.1:45953/solr/collection1 node=127.0.0.1:45953_solr
[junit4:junit4]   2> 9119 T1961 C166 P45953 oasc.RecoveryStrategy.run Starting recovery process.  core=collection1 recoveringAfterStartup=true
[junit4:junit4]   2> 9119 T1887 oascc.ZkStateReader.updateClusterState Updating cloud state from ZooKeeper... 
[junit4:junit4]   2> 9120 T1961 C166 P45953 oasc.RecoveryStrategy.doRecovery ###### startupVersions=[]
[junit4:junit4]   2> 9120 T1887 oass.SolrDispatchFilter.init user.dir=/usr/home/hudson/hudson-slave/workspace/Lucene-Solr-Tests-trunk-Java6/solr/build/solr-core/test/J1
[junit4:junit4]   2> 9120 T1887 oass.SolrDispatchFilter.init SolrDispatchFilter.init() done
[junit4:junit4]   2> 9121 T1961 C166 P45953 oasc.RecoveryStrategy.doRecovery Attempting to PeerSync from http://127.0.0.1:22876/solr/collection1/ core=collection1 - recoveringAfterStartup=true
[junit4:junit4]   2> 9121 T1961 C166 P45953 oasu.PeerSync.sync PeerSync: core=collection1 url=http://127.0.0.1:45953/solr START replicas=[http://127.0.0.1:22876/solr/collection1/] nUpdates=100
[junit4:junit4]   2> 9121 T1887 oascsi.HttpClientUtil.createClient Creating new http client, config:maxConnections=128&maxConnectionsPerHost=32&followRedirects=false
[junit4:junit4]   2> 9121 T1961 C166 P45953 oasu.PeerSync.sync WARNING no frame of reference to tell of we've missed updates
[junit4:junit4]   2> 9122 T1961 C166 P45953 oasc.RecoveryStrategy.doRecovery PeerSync Recovery was not successful - trying replication. core=collection1
[junit4:junit4]   2> 9122 T1961 C166 P45953 oasc.RecoveryStrategy.doRecovery Starting Replication Recovery. core=collection1
[junit4:junit4]   2> 9122 T1961 C166 P45953 oascsi.HttpClientUtil.createClient Creating new http client, config:maxConnections=128&maxConnectionsPerHost=32&followRedirects=false
[junit4:junit4]   2> ASYNC  NEW_CORE C167 name=collection1 org.apache.solr.core.SolrCore@1d61251c url=http://127.0.0.1:22876/solr/collection1 node=127.0.0.1:22876_solr
[junit4:junit4]   2> 9128 T1925 C167 P22876 REQ /get {distrib=false&qt=/get&wt=javabin&version=2&getVersions=100} status=0 QTime=0 
[junit4:junit4]   2> 9133 T1887 oaz.ZooKeeper.<init> Initiating client connection, connectString=127.0.0.1:46808/solr sessionTimeout=10000 watcher=org.apache.solr.common.cloud.ConnectionManager@65ec88db
[junit4:junit4]   2> 9133 T1963 oaz.ClientCnxn$SendThread.startConnect Opening socket connection to server /127.0.0.1:46808
[junit4:junit4]   2> 9133 T1887 oascc.ConnectionManager.waitForConnected Waiting for client to connect to ZooKeeper
[junit4:junit4]   2> 9134 T1963 oaz.ClientCnxn$SendThread.primeConnection Socket connection established to localhost/127.0.0.1:46808, initiating session
[junit4:junit4]   2> 9135 T1889 oazs.NIOServerCnxn$Factory.run Accepted socket connection from /140.211.11.196:37279
[junit4:junit4]   2> 9135 T1889 oazs.NIOServerCnxn.readConnectRequest Client attempting to establish new session at /140.211.11.196:37279
[junit4:junit4]   2> 9136 T1891 oazs.NIOServerCnxn.finishSessionInit Established session 0x139c8bd833b0007 with negotiated timeout 10000 for client /140.211.11.196:37279
[junit4:junit4]   2> 9136 T1963 oaz.ClientCnxn$SendThread.readConnectResult Session establishment complete on server localhost/127.0.0.1:46808, sessionid = 0x139c8bd833b0007, negotiated timeout = 10000
[junit4:junit4]   2> 9136 T1964 oascc.ConnectionManager.process Watcher org.apache.solr.common.cloud.ConnectionManager@65ec88db name:ZooKeeperConnection Watcher:127.0.0.1:46808/solr got event WatchedEvent state:SyncConnected type:None path:null path:null type:None
[junit4:junit4]   2> 9136 T1887 oascc.ConnectionManager.waitForConnected Client is connected to ZooKeeper
[junit4:junit4]   2> 9137 T1887 oascc.ZkStateReader.createClusterStateWatchersAndUpdate Updating cluster state from ZooKeeper... 
[junit4:junit4]   2> 9138 T1887 oasc.ChaosMonkey.monkeyLog monkey: init - expire sessions:true cause connection loss:true
[junit4:junit4]   2> 9138 T1887 oascsi.HttpClientUtil.createClient Creating new http client, config:
[junit4:junit4]   2> 9144 T1887 oascc.ZkStateReader.updateClusterState Updating cloud state from ZooKeeper... 
[junit4:junit4]   2> ASYNC  NEW_CORE C168 name=collection1 org.apache.solr.core.SolrCore@15adb642 url=http://127.0.0.1:44120/solr/collection1 node=127.0.0.1:44120_solr
[junit4:junit4]   2> 9153 T1899 C168 P44120 oasc.SolrDeletionPolicy.onInit SolrDeletionPolicy.onInit: commits:num=1
[junit4:junit4]   2> 		commit{dir=/usr/home/hudson/hudson-slave/workspace/Lucene-Solr-Tests-trunk-Java6/solr/build/solr-core/test/J1/org.apache.solr.cloud.BasicDistributedZk2Test-1347692626742/control/data/index,segFN=segments_1,generation=1,filenames=[segments_1]
[junit4:junit4]   2> 9154 T1899 C168 P44120 oasc.SolrDeletionPolicy.updateCommits newest commit = 1
[junit4:junit4]   2> 9157 T1899 C168 P44120 /update {wt=javabin&version=2} {add=[1 (1413158153368895488)]} 0 8
[junit4:junit4]   2> 9158 T1887 oaz.ZooKeeper.<init> Initiating client connection, connectString=127.0.0.1:46808/solr sessionTimeout=10000 watcher=org.apache.solr.common.cloud.ConnectionManager@6c4b078f
[junit4:junit4]   2> 9158 T1965 oaz.ClientCnxn$SendThread.startConnect Opening socket connection to server /127.0.0.1:46808
[junit4:junit4]   2> 9158 T1887 oascc.ConnectionManager.waitForConnected Waiting for client to connect to ZooKeeper
[junit4:junit4]   2> 9159 T1965 oaz.ClientCnxn$SendThread.primeConnection Socket connection established to localhost/127.0.0.1:46808, initiating session
[junit4:junit4]   2> 9159 T1889 oazs.NIOServerCnxn$Factory.run Accepted socket connection from /140.211.11.196:49643
[junit4:junit4]   2> 9159 T1889 oazs.NIOServerCnxn.readConnectRequest Client attempting to establish new session at /140.211.11.196:49643
[junit4:junit4]   2> 9160 T1891 oazs.NIOServerCnxn.finishSessionInit Established session 0x139c8bd833b0008 with negotiated timeout 10000 for client /140.211.11.196:49643
[junit4:junit4]   2> 9160 T1965 oaz.ClientCnxn$SendThread.readConnectResult Session establishment complete on server localhost/127.0.0.1:46808, sessionid = 0x139c8bd833b0008, negotiated timeout = 10000
[junit4:junit4]   2> 9161 T1966 oascc.ConnectionManager.process Watcher org.apache.solr.common.cloud.ConnectionManager@6c4b078f name:ZooKeeperConnection Watcher:127.0.0.1:46808/solr got event WatchedEvent state:SyncConnected type:None path:null path:null type:None
[junit4:junit4]   2> 9161 T1887 oascc.ConnectionManager.waitForConnected Client is connected to ZooKeeper
[junit4:junit4]   2> 9161 T1887 oascc.ZkStateReader.createClusterStateWatchersAndUpdate Updating cluster state from ZooKeeper... 
[junit4:junit4]   2> 9167 T1915 C165 P30314 oasc.SolrDeletionPolicy.onInit SolrDeletionPolicy.onInit: commits:num=1
[junit4:junit4]   2> 		commit{dir=/usr/home/hudson/hudson-slave/workspace/Lucene-Solr-Tests-trunk-Java6/solr/build/solr-core/test/J1/org.apache.solr.cloud.BasicDistributedZk2Test-1347692626742/jetty1/index,segFN=segments_1,generation=1,filenames=[segments_1]
[junit4:junit4]   2> 9167 T1915 C165 P30314 oasc.SolrDeletionPolicy.updateCommits newest commit = 1
[junit4:junit4]   2>  C164_STATE=coll:collection1 core:collection1 props:{shard=shard1, roles=null, state=recovering, core=collection1, collection=collection1, node_name=127.0.0.1:44267_solr, base_url=http://127.0.0.1:44267/solr}
[junit4:junit4]   2> 9180 T1937 C164 P44267 oasc.SolrDeletionPolicy.onInit SolrDeletionPolicy.onInit: commits:num=1
[junit4:junit4]   2> 		commit{dir=/usr/home/hudson/hudson-slave/workspace/Lucene-Solr-Tests-trunk-Java6/solr/build/solr-core/test/J1/org.apache.solr.cloud.BasicDistributedZk2Test-1347692626742/jetty3/index,segFN=segments_1,generation=1,filenames=[segments_1]
[junit4:junit4]   2> 9180 T1937 C164 P44267 oasc.SolrDeletionPolicy.updateCommits newest commit = 1
[junit4:junit4]   2> 9184 T1937 C164 P44267 REQ /update {distrib.from=http://127.0.0.1:30314/solr/collection1/&update.distrib=FROMLEADER&wt=javabin&version=2} status=0 QTime=9 
[junit4:junit4]   2> 9184 T1915 C165 P30314 /update {wt=javabin&version=2} {add=[1 (1413158153383575552)]} 0 21
[junit4:junit4]   2> 9185 T1887 oasc.AbstractDistribZkTestBase.waitForRecoveriesToFinish Wait for recoveries to finish - collection: collection1 failOnTimeout:true timeout (sec):1440
[junit4:junit4]   2> 9186 T1887 oascc.ZkStateReader.updateClusterState Updating cloud state from ZooKeeper... 
[junit4:junit4]   2> 9418 T1908 oascc.ZkStateReader.updateClusterState Updating cloud state from ZooKeeper... 
[junit4:junit4]   2> 9430 T1907 oascc.ZkStateReader$2.process A cluster state change has occurred - updating...
[junit4:junit4]   2> 9430 T1966 oascc.ZkStateReader$2.process A cluster state change has occurred - updating...
[junit4:junit4]   2> 9430 T1964 oascc.ZkStateReader$2.process A cluster state change has occurred - updating...
[junit4:junit4]   2> 9430 T1933 oascc.ZkStateReader$2.process A cluster state change has occurred - updating...
[junit4:junit4]   2> 9430 T1945 oascc.ZkStateReader$2.process A cluster state change has occurred - updating...
[junit4:junit4]   2> 9430 T1959 oascc.ZkStateReader$2.process A cluster state change has occurred - updating...
[junit4:junit4]   2> 9430 T1921 oascc.ZkStateReader$2.process A cluster state change has occurred - updating...
[junit4:junit4]   2> 10187 T1887 oascc.ZkStateReader.updateClusterState Updating cloud state from ZooKeeper... 
[junit4:junit4]   2> 10781 T1947 C164 P44267 oasc.RecoveryStrategy.doRecovery Begin buffering updates. core=collection1
[junit4:junit4]   2> 10781 T1947 C164 P44267 oasu.UpdateLog.bufferUpdates Starting to buffer updates. FSUpdateLog{state=ACTIVE, tlog=tlog{file=./org.apache.solr.cloud.BasicDistributedZk2Test-1347692626742/jetty3/tlog/tlog.0000000000000000000 refcount=1}}
[junit4:junit4]   2> 10781 T1947 C164 P44267 oasc.RecoveryStrategy.replicate Attempting to replicate from http://127.0.0.1:30314/solr/collection1/. core=collection1
[junit4:junit4]   2> 10781 T1947 C164 P44267 oascsi.HttpClientUtil.createClient Creating new http client, config:maxConnections=128&maxConnectionsPerHost=32&followRedirects=false
[junit4:junit4]   2> 10788 T1916 C165 P30314 oasu.DirectUpdateHandler2.commit start commit{flags=0,_version_=0,optimize=false,openSearcher=true,waitSearcher=true,expungeDeletes=false,softCommit=false}
[junit4:junit4]   2> 10897 T1916 C165 P30314 oasc.SolrDeletionPolicy.onCommit SolrDeletionPolicy.onCommit: commits:num=2
[junit4:junit4]   2> 		commit{dir=/usr/home/hudson/hudson-slave/workspace/Lucene-Solr-Tests-trunk-Java6/solr/build/solr-core/test/J1/org.apache.solr.cloud.BasicDistributedZk2Test-1347692626742/jetty1/index,segFN=segments_1,generation=1,filenames=[segments_1]
[junit4:junit4]   2> 		commit{dir=/usr/home/hudson/hudson-slave/workspace/Lucene-Solr-Tests-trunk-Java6/solr/build/solr-core/test/J1/org.apache.solr.cloud.BasicDistributedZk2Test-1347692626742/jetty1/index,segFN=segments_2,generation=2,filenames=[_0_TestBloomFilteredLucene40Postings_0.tim, _0_TestBloomFilteredLucene40Postings_0.tip, _0_TestBloomFilteredLucene40Postings_0.blm, _0.fnm, _0_Pulsing40_0.tim, _0_Memory_0.ram, _0_TestBloomFilteredLucene40Postings_0.prx, _0_nrm.cfs, _0_Pulsing40_0.prx, _0_Pulsing40_0.frq, _0_nrm.cfe, _0_SimpleText_0.pst, _0_Pulsing40_0.tip, segments_2, _0_TestBloomFilteredLucene40Postings_0.frq, _0.fdx, _0.si, _0.fdt]
[junit4:junit4]   2> 10898 T1916 C165 P30314 oasc.SolrDeletionPolicy.updateCommits newest commit = 2
[junit4:junit4]   2> 10910 T1916 C165 P30314 oass.SolrIndexSearcher.<init> Opening Searcher@71a05d80 main
[junit4:junit4]   2> 10911 T1916 C165 P30314 oasu.DirectUpdateHandler2.commit end_commit_flush
[junit4:junit4]   2> 10912 T1922 oasc.SolrCore.registerSearcher [collection1] Registered new searcher Searcher@71a05d80 main{StandardDirectoryReader(segments_2:3 _0(5.0):C1)}
[junit4:junit4]   2> 10913 T1916 C165 P30314 /update {waitSearcher=true&commit=true&commit_end_point=true&wt=javabin&softCommit=false&version=2} {commit=} 0 125
[junit4:junit4]   2> 10914 T1947 C164 P44267 oash.ReplicationHandler.inform Commits will be reserved for  10000
[junit4:junit4]   2> 10914 T1947 C164 P44267 oash.SnapPuller.<init>  No value set for 'pollInterval'. Timer Task not started.
[junit4:junit4]   2> 10916 T1917 C165 P30314 oash.ReplicationHandler.inform Commits will be reserved for  10000
[junit4:junit4]   2> 10916 T1917 C165 P30314 REQ /replication {command=indexversion&wt=javabin&qt=/replication&version=2} status=0 QTime=1 
[junit4:junit4]   2> 10917 T1947 C164 P44267 oash.SnapPuller.fetchLatestIndex Master's generation: 2
[junit4:junit4]   2> 10917 T1947 C164 P44267 oash.SnapPuller.fetchLatestIndex Slave's generation: 1
[junit4:junit4]   2> 10917 T1947 C164 P44267 oash.SnapPuller.fetchLatestIndex Starting replication process
[junit4:junit4]   2> 10921 T1917 C165 P30314 REQ /replication {command=filelist&generation=2&wt=javabin&qt=/replication&version=2} status=0 QTime=2 
[junit4:junit4]   2> 10922 T1947 C164 P44267 oash.SnapPuller.fetchLatestIndex Number of files in latest index in master: 18
[junit4:junit4]   2> 10927 T1947 C164 P44267 oash.SnapPuller.fetchLatestIndex Starting download to ./org.apache.solr.cloud.BasicDistributedZk2Test-1347692626742/jetty3/index.20120915123357660 fullCopy=true
[junit4:junit4]   2> 10930 T1917 C165 P30314 REQ /replication {file=_0_TestBloomFilteredLucene40Postings_0.tim&command=filecontent&checksum=true&generation=2&qt=/replication&wt=filestream} status=0 QTime=0 
[junit4:junit4]   2> 10936 T1917 C165 P30314 REQ /replication {file=_0_TestBloomFilteredLucene40Postings_0.blm&command=filecontent&checksum=true&generation=2&qt=/replication&wt=filestream} status=0 QTime=0 
[junit4:junit4]   2> 10940 T1917 C165 P30314 REQ /replication {file=_0_TestBloomFilteredLucene40Postings_0.tip&command=filecontent&checksum=true&generation=2&qt=/replication&wt=filestream} status=0 QTime=0 
[junit4:junit4]   2> 10944 T1917 C165 P30314 REQ /replication {file=_0_Pulsing40_0.tim&command=filecontent&checksum=true&generation=2&qt=/replication&wt=filestream} status=0 QTime=0 
[junit4:junit4]   2> 10948 T1917 C165 P30314 REQ /replication {file=_0.fnm&command=filecontent&checksum=true&generation=2&qt=/replication&wt=filestream} status=0 QTime=0 
[junit4:junit4]   2> 10952 T1917 C165 P30314 REQ /replication {file=_0_Memory_0.ram&command=filecontent&checksum=true&generation=2&qt=/replication&wt=filestream} status=0 QTime=0 
[junit4:junit4]   2> 10956 T1917 C165 P30314 REQ /replication {file=_0_TestBloomFilteredLucene40Postings_0.prx&command=filecontent&checksum=true&generation=2&qt=/replication&wt=filestream} status=0 QTime=0 
[junit4:junit4]   2> 10960 T1917 C165 P30314 REQ /replication {file=_0_nrm.cfs&command=filecontent&checksum=true&generation=2&qt=/replication&wt=filestream} status=0 QTime=0 
[junit4:junit4]   2> 10969 T1917 C165 P30314 REQ /replication {file=_0_Pulsing40_0.prx&command=filecontent&checksum=true&generation=2&qt=/replication&wt=filestream} status=0 QTime=0 
[junit4:junit4]   2> 10977 T1917 C165 P30314 REQ /replication {file=_0_Pulsing40_0.frq&command=filecontent&checksum=true&generation=2&qt=/replication&wt=filestream} status=0 QTime=0 
[junit4:junit4]   2> 10981 T1917 C165 P30314 REQ /replication {file=_0_SimpleText_0.pst&command=filecontent&checksum=true&generation=2&qt=/replication&wt=filestream} status=0 QTime=0 
[junit4:junit4]   2> 10985 T1917 C165 P30314 REQ /replication {file=_0_nrm.cfe&command=filecontent&checksum=true&generation=2&qt=/replication&wt=filestream} status=0 QTime=0 
[junit4:junit4]   2> 10989 T1917 C165 P30314 REQ /replication {file=segments_2&command=filecontent&checksum=true&generation=2&qt=/replication&wt=filestream} status=0 QTime=0 
[junit4:junit4]   2> 10993 T1917 C165 P30314 REQ /replication {file=_0_Pulsing40_0.tip&command=filecontent&checksum=true&generation=2&qt=/replication&wt=filestream} status=0 QTime=0 
[junit4:junit4]   2> 10997 T1917 C165 P30314 REQ /replication {file=_0.fdx&command=filecontent&checksum=true&generation=2&qt=/replication&wt=filestream} status=0 QTime=0 
[junit4:junit4]   2> 11001 T1917 C165 P30314 REQ /replication {file=_0_TestBloomFilteredLucene40Postings_0.frq&command=filecontent&checksum=true&generation=2&qt=/replication&wt=filestream} status=0 QTime=0 
[junit4:junit4]   2> 11005 T1917 C165 P30314 REQ /replication {file=_0.si&command=filecontent&checksum=true&generation=2&qt=/replication&wt=filestream} status=0 QTime=0 
[junit4:junit4]   2> 11009 T1917 C165 P30314 REQ /replication {file=_0.fdt&command=filecontent&checksum=true&generation=2&qt=/replication&wt=filestream} status=0 QTime=0 
[junit4:junit4]   2> 11010 T1947 C164 P44267 oash.SnapPuller.fetchLatestIndex Total time taken for download : 0 secs
[junit4:junit4]   2> 11022 T1947 C164 P44267 oash.SnapPuller.modifyIndexProps New index installed. Updating index properties... index=index.20120915123357660
[junit4:junit4]   2> 11023 T1947 C164 P44267 oasu.DefaultSolrCoreState.newIndexWriter Creating new IndexWriter...
[junit4:junit4]   2> 11024 T1947 C164 P44267 oasu.DefaultSolrCoreState.newIndexWriter Waiting until IndexWriter is unused... core=collection1
[junit4:junit4]   2> 11024 T1947 C164 P44267 oasu.DefaultSolrCoreState.newIndexWriter Rollback old IndexWriter... core=collection1
[junit4:junit4]   2> 11029 T1947 C164 P44267 oasc.SolrCore.getNewIndexDir WARNING New index directory detected: old=./org.apache.solr.cloud.BasicDistributedZk2Test-1347692626742/jetty3/index/ new=./org.apache.solr.cloud.BasicDistributedZk2Test-1347692626742/jetty3/index.20120915123357660
[junit4:junit4]   2> 11030 T1947 C164 P44267 oasc.CachingDirectoryFactory.get return new directory for /usr/home/hudson/hudson-slave/workspace/Lucene-Solr-Tests-trunk-Java6/solr/build/solr-core/test/J1/./org.apache.solr.cloud.BasicDistributedZk2Test-1347692626742/jetty3/index.20120915123357660 forceNew:true
[junit4:junit4]   2> 11038 T1947 C164 P44267 oasc.SolrDeletionPolicy.onInit SolrDeletionPolicy.onInit: commits:num=1
[junit4:junit4]   2> 		commit{dir=/usr/home/hudson/hudson-slave/workspace/Lucene-Solr-Tests-trunk-Java6/solr/build/solr-core/test/J1/org.apache.solr.cloud.BasicDistributedZk2Test-1347692626742/jetty3/index.20120915123357660,segFN=segments_2,generation=2,filenames=[_0_TestBloomFilteredLucene40Postings_0.tim, _0_TestBloomFilteredLucene40Postings_0.tip, _0_TestBloomFilteredLucene40Postings_0.blm, _0.fnm, _0_Pulsing40_0.tim, _0_Memory_0.ram, _0_TestBloomFilteredLucene40Postings_0.prx, _0_nrm.cfs, _0_Pulsing40_0.prx, _0_Pulsing40_0.frq, _0_nrm.cfe, _0_SimpleText_0.pst, _0_Pulsing40_0.tip, segments_2, _0.fdx, _0_TestBloomFilteredLucene40Postings_0.frq, _0.si, _0.fdt]
[junit4:junit4]   2> 11039 T1947 C164 P44267 oasc.SolrDeletionPolicy.updateCommits newest commit = 2
[junit4:junit4]   2> 11039 T1947 C164 P44267 oasu.DefaultSolrCoreState.newIndexWriter New IndexWriter is ready to be used.
[junit4:junit4]   2> 11042 T1947 C164 P44267 oass.SolrIndexSearcher.<init> Opening Searcher@7c67201a main
[junit4:junit4]   2> 11044 T1946 oasc.SolrCore.registerSearcher [collection1] Registered new searcher Searcher@7c67201a main{StandardDirectoryReader(segments_2:3:nrt _0(5.0):C1)}
[junit4:junit4]   2> 11044 T1946 oasc.CachingDirectoryFactory.close Closing directory:/usr/home/hudson/hudson-slave/workspace/Lucene-Solr-Tests-trunk-Java6/solr/build/solr-core/test/J1/./org.apache.solr.cloud.BasicDistributedZk2Test-1347692626742/jetty3/index
[junit4:junit4]   2> 11044 T1946 oash.SnapPuller$2.onClose removing old index directory ./org.apache.solr.cloud.BasicDistributedZk2Test-1347692626742/jetty3/index
[junit4:junit4]   2> 11046 T1947 C164 P44267 oasu.DirectUpdateHandler2.commit start commit{flags=0,_version_=0,optimize=false,openSearcher=true,waitSearcher=true,expungeDeletes=false,softCommit=false}
[junit4:junit4]   2> 11047 T1947 C164 P44267 oass.SolrIndexSearcher.<init> Opening Searcher@743630 main
[junit4:junit4]   2> 11047 T1947 C164 P44267 oasu.DirectUpdateHandler2.commit end_commit_flush
[junit4:junit4]   2> 11049 T1946 oasc.SolrCore.registerSearcher [collection1] Registered new searcher Searcher@743630 main{StandardDirectoryReader(segments_2:3:nrt _0(5.0):C1)}
[junit4:junit4]   2> 11049 T1947 C164 P44267 oasc.RecoveryStrategy.replay Replaying buffered documents. core=collection1
[junit4:junit4]   2> 11049 T1969 C164 P44267 oasu.UpdateLog$LogReplayer.doReplay WARNING Starting log replay tlog{file=./org.apache.solr.cloud.BasicDistributedZk2Test-1347692626742/jetty3/tlog/tlog.0000000000000000000 refcount=2} active=true starting pos=432
[junit4:junit4]   2> 11050 T1969 C164 P44267 oasu.DirectUpdateHandler2.commit start commit{flags=2,_version_=0,optimize=false,openSearcher=true,waitSearcher=true,expungeDeletes=false,softCommit=false}
[junit4:junit4]   2> 11051 T1969 C164 P44267 oass.SolrIndexSearcher.<init> Opening Searcher@43befc2 main
[junit4:junit4]   2> 11052 T1969 C164 P44267 oasu.DirectUpdateHandler2.commit end_commit_flush
[junit4:junit4]   2> 11053 T1946 oasc.SolrCore.registerSearcher [collection1] Registered new searcher Searcher@43befc2 main{StandardDirectoryReader(segments_2:3:nrt _0(5.0):C1)}
[junit4:junit4]   2> 11053 T1969 C164 P44267 oasu.UpdateLog$LogReplayer.run WARNING Log replay finished. recoveryInfo=RecoveryInfo{adds=0 deletes=0 deleteByQuery=0 errors=0 positionOfStart=432}
[junit4:junit4]   2> 11054 T1947 C164 P44267 oasc.RecoveryStrategy.doRecovery Replication Recovery was successful - registering as Active. core=collection1
[junit4:junit4]   2> 11055 T1947 C164 P44267 oasc.RecoveryStrategy.doRecovery Finished recovery process. core=collection1
[junit4:junit4]   2> 11189 T1887 oascc.ZkStateReader.updateClusterState Updating cloud state from ZooKeeper... 
[junit4:junit4]   2> 11438 T1908 oascc.ZkStateReader.updateClusterState Updating cloud state from ZooKeeper... 
[junit4:junit4]   2> 11449 T1907 oascc.ZkStateReader$2.process A cluster state change has occurred - updating...
[junit4:junit4]   2> 11449 T1933 oascc.ZkStateReader$2.process A cluster state change has occurred - updating...
[junit4:junit4]   2> 11449 T1964 oascc.ZkStateReader$2.process A cluster state change has occurred - updating...
[junit4:junit4]   2> 11449 T1921 oascc.ZkStateReader$2.process A cluster state change has occurred - updating...
[junit4:junit4]   2> 11449 T1945 oascc.ZkStateReader$2.process A cluster state change has occurred - updating...
[junit4:junit4]   2> 11449 T1959 oascc.ZkStateReader$2.process A cluster state change has occurred - updating...
[junit4:junit4]   2> 11449 T1966 oascc.ZkStateReader$2.process A cluster state change has occurred - updating...
[junit4:junit4]   2>  C166_STATE=coll:collection1 core:collection1 props:{shard=shard2, roles=null, state=recovering, core=collection1, collection=collection1, node_name=127.0.0.1:45953_solr, base_url=http://127.0.0.1:45953/solr}
[junit4:junit4]   2> 12136 T1961 C166 P45953 oasc.RecoveryStrategy.doRecovery Begin buffering updates. core=collection1
[junit4:junit4]   2> 12136 T1961 C166 P45953 oasu.UpdateLog.bufferUpdates Starting to buffer updates. FSUpdateLog{state=ACTIVE, tlog=null}
[junit4:junit4]   2> 12136 T1961 C166 P45953 oasc.RecoveryStrategy.replicate Attempting to replicate from http://127.0.0.1:22876/solr/collection1/. core=collection1
[junit4:junit4]   2> 12136 T1961 C166 P45953 oascsi.HttpClientUtil.createClient Creating new http client, config:maxConnections=128&maxConnectionsPerHost=32&followRedirects=false
[junit4:junit4]   2> 12146 T1927 C167 P22876 oasu.DirectUpdateHandler2.commit start commit{flags=0,_version_=0,optimize=false,openSearcher=true,waitSearcher=true,expungeDeletes=false,softCommit=false}
[junit4:junit4]   2> 12150 T1927 C167 P22876 oasc.SolrDeletionPolicy.onInit SolrDeletionPolicy.onInit: commits:num=1
[junit4:junit4]   2> 		commit{dir=/usr/home/hudson/hudson-slave/workspace/Lucene-Solr-Tests-trunk-Java6/solr/build/solr-core/test/J1/org.apache.solr.cloud.BasicDistributedZk2Test-1347692626742/jetty2/index,segFN=segments_1,generation=1,filenames=[segments_1]
[junit4:junit4]   2> 12150 T1927 C167 P22876 oasc.SolrDeletionPolicy.updateCommits newest commit = 1
[junit4:junit4]   2> 12151 T1927 C167 P22876 oass.SolrIndexSearcher.<init> Opening Searcher@60baae35 main
[junit4:junit4]   2> 12151 T1927 C167 P22876 oasu.DirectUpdateHandler2.commit end_commit_flush
[junit4:junit4]   2> 12152 T1934 oasc.SolrCore.registerSearcher [collection1] Registered new searcher Searcher@60baae35 main{StandardDirectoryReader(segments_1:1)}
[junit4:junit4]   2> 12153 T1927 C167 P22876 /update {waitSearcher=true&commit=true&commit_end_point=true&wt=javabin&softCommit=false&version=2} {commit=} 0 7
[junit4:junit4]   2> 12154 T1961 C166 P45953 oash.ReplicationHandler.inform Commits will be reserved for  10000
[junit4:junit4]   2> 12154 T1961 C166 P45953 oash.SnapPuller.<init>  No value set for 'pollInterval'. Timer Task not started.
[junit4:junit4]   2> 12155 T1928 C167 P22876 oash.ReplicationHandler.inform Commits will be reserved for  10000
[junit4:junit4]   2> 12155 T1928 C167 P22876 REQ /replication {command=indexversion&wt=javabin&qt=/replication&version=2} status=0 QTime=0 
[junit4:junit4]   2> 12158 T1961 C166 P45953 oasc.SolrDeletionPolicy.onInit SolrDeletionPolicy.onInit: commits:num=1
[junit4:junit4]   2> 		commit{dir=/usr/home/hudson/hudson-slave/workspace/Lucene-Solr-Tests-trunk-Java6/solr/build/solr-core/test/J1/org.apache.solr.cloud.BasicDistributedZk2Test-1347692626742/jetty4/index,segFN=segments_1,generation=1,filenames=[segments_1]
[junit4:junit4]   2> 12159 T1961 C166 P45953 oasc.SolrDeletionPolicy.updateCommits newest commit = 1
[junit4:junit4]   2> 12159 T1961 C166 P45953 oasu.DirectUpdateHandler2.commit start commit{flags=0,_version_=0,optimize=false,openSearcher=true,waitSearcher=true,expungeDeletes=false,softCommit=false}
[junit4:junit4]   2> 12161 T1961 C166 P45953 oasc.SolrDeletionPolicy.onCommit SolrDeletionPolicy.onCommit: commits:num=2
[junit4:junit4]   2> 		commit{dir=/usr/home/hudson/hudson-slave/workspace/Lucene-Solr-Tests-trunk-Java6/solr/build/solr-core/test/J1/org.apache.solr.cloud.BasicDistributedZk2Test-1347692626742/jetty4/index,segFN=segments_1,generation=1,filenames=[segments_1]
[junit4:junit4]   2> 		commit{dir=/usr/home/hudson/hudson-slave/workspace/Lucene-Solr-Tests-trunk-Java6/solr/build/solr-core/test/J1/org.apache.solr.cloud.BasicDistributedZk2Test-1347692626742/jetty4/index,segFN=segments_2,generation=2,filenames=[segments_2]
[junit4:junit4]   2> 12161 T1961 C166 P45953 oasc.SolrDeletionPolicy.updateCommits newest commit = 2
[junit4:junit4]   2> 12163 T1961 C166 P45953 oass.SolrIndexSearcher.<init> Opening Searcher@9d3f99 main
[junit4:junit4]   2> 12164 T1961 C166 P45953 oasu.DirectUpdateHandler2.commit end_commit_flush
[junit4:junit4]   2> 12165 T1960 oasc.SolrCore.registerSearcher [collection1] Registered new searcher Searcher@9d3f99 main{StandardDirectoryReader(segments_2:2)}
[junit4:junit4]   2> 12165 T1961 C166 P45953 oasc.RecoveryStrategy.replay No replay needed. core=collection1
[junit4:junit4]   2> 12165 T1961 C166 P45953 oasc.RecoveryStrategy.doRecovery Replication Recovery was successful - registering as Active. core=collection1
[junit4:junit4]   2> 12175 T1961 C166 P45953 oasc.RecoveryStrategy.doRecovery Finished recovery process. core=collection1
[junit4:junit4]   2> 12191 T1887 oascc.ZkStateReader.updateClusterState Updating cloud state from ZooKeeper... 
[junit4:junit4]   2> 12454 T1908 oascc.ZkStateReader.updateClusterState Updating cloud state from ZooKeeper... 
[junit4:junit4]   2> 12468 T1966 oascc.ZkStateReader$2.process A cluster state change has occurred - updating...
[junit4:junit4]   2> 12468 T1907 oascc.ZkStateReader$2.process A cluster state change has occurred - updating...
[junit4:junit4]   2> 12468 T1964 oascc.ZkStateReader$2.process A cluster state change has occurred - updating...
[junit4:junit4]   2> 12468 T1945 oascc.ZkStateReader$2.process A cluster state change has occurred - updating...
[junit4:junit4]   2> 12468 T1933 oascc.ZkStateReader$2.process A cluster state change has occurred - updating...
[junit4:junit4]   2> 12468 T1959 oascc.ZkStateReader$2.process A cluster state change has occurred - updating...
[junit4:junit4]   2> 12468 T1921 oascc.ZkStateReader$2.process A cluster state change has occurred - updating...
[junit4:junit4]   2> 13193 T1887 oascc.ZkStateReader.updateClusterState Updating cloud state from ZooKeeper... 
[junit4:junit4]   2> 13196 T1899 C168 P44120 oasu.DirectUpdateHandler2.commit start commit{flags=0,_version_=0,optimize=false,openSearcher=true,waitSearcher=true,expungeDeletes=false,softCommit=false}
[junit4:junit4]   2> 13271 T1899 C168 P44120 oasc.SolrDeletionPolicy.onCommit SolrDeletionPolicy.onCommit: commits:num=2
[junit4:junit4]   2> 		commit{dir=/usr/home/hudson/hudson-slave/workspace/Lucene-Solr-Tests-trunk-Java6/solr/build/solr-core/test/J1/org.apache.solr.cloud.BasicDistributedZk2Test-1347692626742/control/data/index,segFN=segments_1,generation=1,filenames=[segments_1]
[junit4:junit4]   2> 		commit{dir=/usr/home/hudson/hudson-slave/workspace/Lucene-Solr-Tests-trunk-Java6/solr/build/solr-core/test/J1/org.apache.solr.cloud.BasicDistributedZk2Test-1347692626742/control/data/index,segFN=segments_2,generation=2,filenames=[_0_TestBloomFilteredLucene40Postings_0.tim, _0_TestBloomFilteredLucene40Postings_0.tip, _0_TestBloomFilteredLucene40Postings_0.blm, _0.fnm, _0_Pulsing40_0.tim, _0_Memory_0.ram, _0_TestBloomFilteredLucene40Postings_0.prx, _0_nrm.cfs, _0_Pulsing40_0.prx, _0_Pulsing40_0.frq, _0_nrm.cfe, _0_SimpleText_0.pst, _0_Pulsing40_0.tip, segments_2, _0_TestBloomFilteredLucene40Postings_0.frq, _0.fdx, _0.si, _0.fdt]
[junit4:junit4]   2> 13271 T1899 C168 P44120 oasc.SolrDeletionPolicy.updateCommits newest commit = 2
[junit4:junit4]   2> 13280 T1899 C168 P44120 oass.SolrIndexSearcher.<init> Opening Searcher@2ff24579 main
[junit4:junit4]   2> 13280 T1899 C168 P44120 oasu.DirectUpdateHandler2.commit end_commit_flush
[junit4:junit4]   2> 13281 T1910 oasc.SolrCore.registerSearcher [collection1] Registered new searcher Searcher@2ff24579 main{StandardDirectoryReader(segments_2:3 _0(5.0):C1)}
[junit4:junit4]   2> 13282 T1899 C168 P44120 /update {waitSearcher=true&wt=javabin&commit=true&softCommit=false&version=2} {commit=} 0 86
[junit4:junit4]   2> 13284 T1915 C165 P30314 oasu.DirectUpdateHandler2.commit start commit{flags=0,_version_=0,optimize=false,openSearcher=true,waitSearcher=true,expungeDeletes=false,softCommit=false}
[junit4:junit4]   2> 13292 T1915 C165 P30314 oass.SolrIndexSearcher.<init> Opening Searcher@a922c52 main
[junit4:junit4]   2> 13293 T1915 C165 P30314 oasu.DirectUpdateHandler2.commit end_commit_flush
[junit4:junit4]   2> 13294 T1922 oasc.SolrCore.registerSearcher [collection1] Registered new searcher Searcher@a922c52 main{StandardDirectoryReader(segments_2:3 _0(5.0):C1)}
[junit4:junit4]   2> 13295 T1915 C165 P30314 oasu.SolrCmdDistributor.distribCommit Distrib commit to:[StdNode: http://127.0.0.1:44267/solr/collection1/, StdNode: http://127.0.0.1:22876/solr/collection1/, StdNode: http://127.0.0.1:45953/solr/collection1/]
[junit4:junit4]   2> 13297 T1929 C167 P22876 oasu.DirectUpdateHandler2.commit start commit{flags=0,_version_=0,optimize=false,openSearcher=true,waitSearcher=true,expungeDeletes=false,softCommit=false}
[junit4:junit4]   2>  C164_STATE=coll:collection1 core:collection1 props:{shard=shard1, roles=null, state=active, core=collection1, collection=collection1, node_name=127.0.0.1:44267_solr, base_url=http://127.0.0.1:44267/solr}
[junit4:junit4]   2> 13297 T1937 C164 P44267 oasu.DirectUpdateHandler2.commit start commit{flags=0,_version_=0,optimize=false,openSearcher=true,waitSearcher=true,expungeDeletes=false,softCommit=false}
[junit4:junit4]   2> 13300 T1937 C164 P44267 oass.SolrIndexSearcher.<init> Opening Searcher@3d480876 main
[junit4:junit4]   2> 13301 T1929 C167 P22876 oass.SolrIndexSearcher.<init> Opening Searcher@7d6e44ca main
[junit4:junit4]   2> 13301 T1937 C164 P44267 oasu.DirectUpdateHandler2.commit end_commit_flush
[junit4:junit4]   2> 13301 T1929 C167 P22876 oasu.DirectUpdateHandler2.commit end_commit_flush
[junit4:junit4]   2> 13302 T1946 oasc.SolrCore.registerSearcher [collection1] Registered new searcher Searcher@3d480876 main{StandardDirectoryReader(segments_2:3:nrt _0(5.0):C1)}
[junit4:junit4]   2> 13302 T1934 oasc.SolrCore.registerSearcher [collection1] Registered new searcher Searcher@7d6e44ca main{StandardDirectoryReader(segments_1:1)}
[junit4:junit4]   2> 13302 T1937 C164 P44267 /update {waitSearcher=true&commit=true&wt=javabin&commit_end_point=true&expungeDeletes=false&softCommit=false&version=2} {commit=} 0 5
[junit4:junit4]   2> 13303 T1929 C167 P22876 /update {waitSearcher=true&commit=true&wt=javabin&commit_end_point=true&expungeDeletes=false&softCommit=false&version=2} {commit=} 0 6
[junit4:junit4]   2>  C166_STATE=coll:collection1 core:collection1 props:{shard=shard2, roles=null, state=active, core=collection1, collection=collection1, node_name=127.0.0.1:45953_solr, base_url=http://127.0.0.1:45953/solr}
[junit4:junit4]   2> 13304 T1951 C166 P45953 oasu.DirectUpdateHandler2.commit start commit{flags=0,_version_=0,optimize=false,openSearcher=true,waitSearcher=true,expungeDeletes=false,softCommit=false}
[junit4:junit4]   2> 13307 T1951 C166 P45953 oass.SolrIndexSearcher.<init> Opening Searcher@dabe1b6 main
[junit4:junit4]   2> 13308 T1951 C166 P45953 oasu.DirectUpdateHandler2.commit end_commit_flush
[junit4:junit4]   2> 13309 T1960 oasc.SolrCore.registerSearcher [collection1] Registered new searcher Searcher@dabe1b6 main{StandardDirectoryReader(segments_2:2)}
[junit4:junit4]   2> 13309 T1951 C166 P45953 /update {waitSearcher=true&commit=true&wt=javabin&commit_end_point=true&expungeDeletes=false&softCommit=false&version=2} {commit=} 0 5
[junit4:junit4]   2> 13310 T1915 C165 P30314 /update {waitSearcher=true&wt=javabin&commit=true&softCommit=false&version=2} {commit=} 0 26
[junit4:junit4]   2> 13346 T1900 C168 P44120 REQ /select {fl=id,score&shard.url=127.0.0.1:44120/solr/collection1/&NOW=1347692640080&start=0&q=*:*&distrib=false&isShard=true&wt=javabin&fsv=true&rows=10&version=2} hits=1 status=0 QTime=1 
[junit4:junit4]   2> 13349 T1900 C168 P44120 REQ /select {shard.url=127.0.0.1:44120/solr/collection1/&NOW=1347692640080&q=*:*&ids=1&distrib=false&isShard=true&wt=javabin&version=2} status=0 QTime=0 
[junit4:junit4]   2> 13350 T1899 C168 P44120 REQ /select {wt=javabin&q=*:*&version=2} hits=1 status=0 QTime=8 
[junit4:junit4]   2> 13351 T1887 oaz.ZooKeeper.<init> Initiating client connection, connectString=127.0.0.1:46808/solr sessionTimeout=10000 watcher=org.apache.solr.common.cloud.ConnectionManager@6cf44a4e
[junit4:junit4]   2> 13352 T1973 oaz.ClientCnxn$SendThread.startConnect Opening socket connection to server /127.0.0.1:46808
[junit4:junit4]   2> 13352 T1887 oascc.ConnectionManager.waitForConnected Waiting for client to connect to ZooKeeper
[junit4:junit4]   2> 13353 T1973 oaz.ClientCnxn$SendThread.primeConnection Socket connection established to localhost/127.0.0.1:46808, initiating session
[junit4:junit4]   2> 13353 T1889 oazs.NIOServerCnxn$Factory.run Accepted socket connection from /140.211.11.196:65490
[junit4:junit4]   2> 13353 T1889 oazs.NIOServerCnxn.readConnectRequest Client attempting to establish new session at /140.211.11.196:65490
[junit4:junit4]   2> 13354 T1891 oazs.NIOServerCnxn.finishSessionInit Established session 0x139c8bd833b0009 with negotiated timeout 10000 for client /140.211.11.196:65490
[junit4:junit4]   2> 13354 T1973 oaz.ClientCnxn$SendThread.readConnectResult Session establishment complete on server localhost/127.0.0.1:46808, sessionid = 0x139c8bd833b0009, negotiated timeout = 10000
[junit4:junit4]   2> 13355 T1974 oascc.ConnectionManager.process Watcher org.apache.solr.common.cloud.ConnectionManager@6cf44a4e name:ZooKeeperConnection Watcher:127.0.0.1:46808/solr got event WatchedEvent state:SyncConnected type:None path:null path:null type:None
[junit4:junit4]   2> 13355 T1887 oascc.ConnectionManager.waitForConnected Client is connected to ZooKeeper
[junit4:junit4]   2> 13356 T1887 oascc.ZkStateReader.createClusterStateWatchersAndUpdate Updating cluster state from ZooKeeper... 
[junit4:junit4]   2> 13357 T1892 oazs.PrepRequestProcessor.pRequest Processed session termination for sessionid: 0x139c8bd833b0009
[junit4:junit4]   2> 13358 T1974 oaz.ClientCnxn$EventThread.run EventThread shut down
[junit4:junit4]   2> 13358 T1889 oazs.NIOServerCnxn.closeSock Closed socket connection for client /140.211.11.196:65490 which had sessionid 0x139c8bd833b0009
[junit4:junit4]   2> 13358 T1887 oaz.ZooKeeper.close Session: 0x139c8bd833b0009 closed
[junit4:junit4]   2> 13360 T1918 C165 P30314 REQ /select {distrib=false&wt=javabin&q=*:*&version=2} hits=1 status=0 QTime=1 
[junit4:junit4]   2> 13362 T1930 C167 P22876 REQ /select {distrib=false&wt=javabin&q=*:*&version=2} hits=0 status=0 QTime=0 
[junit4:junit4]   2> 13366 T1938 C164 P44267 REQ /select {fl=id,score&shard.url=127.0.0.1:30314/solr/collection1/|127.0.0.1:44267/solr/collection1/&NOW=1347692640101&start=0&q=*:*&distrib=false&isShard=true&wt=javabin&fsv=true&rows=10&version=2} hits=1 status=0 QTime=0 
[junit4:junit4]   2> 13366 T1926 C167 P22876 REQ /select {fl=id,score&shard.url=127.0.0.1:22876/solr/collection1/|127.0.0.1:45953/solr/collection1/&NOW=1347692640101&start=0&q=*:*&distrib=false&isShard=true&wt=javabin&fsv=true&rows=10&version=2} hits=0 status=0 QTime=0 
[junit4:junit4]   2> 13369 T1938 C164 P44267 REQ /select {shard.url=127.0.0.1:30314/solr/collection1/|127.0.0.1:44267/solr/collection1/&NOW=1347692640101&q=*:*&ids=1&distrib=false&isShard=true&wt=javabin&version=2} status=0 QTime=0 
[junit4:junit4]   2> 13370 T1931 C167 P22876 REQ /select {wt=javabin&q=*:*&version=2} hits=1 status=0 QTime=7 
[junit4:junit4]   2> 13376 T1899 C168 P44120 /update {wt=javabin&version=2} {add=[2 (1413158157797031936)]} 0 3
[junit4:junit4]   2> 13387 T1951 C166 P45953 REQ /update {distrib.from=http://127.0.0.1:22876/solr/collection1/&update.distrib=FROMLEADER&wt=javabin&version=2} status=0 QTime=3 
[junit4:junit4]   2> 13387 T1931 C167 P22876 /update {wt=javabin&version=2} {add=[2 (1413158157802274816)]} 0 9
[junit4:junit4]   2> 13391 T1899 C168 P44120 /update {wt=javabin&version=2} {add=[3 (1413158157814857728)]} 0 1
[junit4:junit4]   2> 13400 T1951 C166 P45953 REQ /update {update.distrib=FROMLEADER&distrib.from=http://127.0.0.1:22876/solr/collection1/&wt=javabin&version=2} status=0 QTime=1 
[junit4:junit4]   2> 13400 T1929 C167 P22876 REQ /update {distrib.from=http://127.0.0.1:30314/solr/collection1/&update.distrib=TOLEADER&wt=javabin&version=2} status=0 QTime=5 
[junit4:junit4]   2> 13401 T1915 C165 P30314 /update {wt=javabin&version=2} {add=[3]} 0 8
[junit4:junit4]   2> 13405 T1899 C168 P44120 /update {wt=javabin&version=2} {add=[4 (1413158157829537792)]} 0 1
[junit4:junit4]   2> 13416 T1937 C164 P44267 REQ /update {distrib.from=http://127.0.0.1:30314/solr/collection1/&update.distrib=FROMLEADER&wt=javabin&version=2} status=0 QTime=4 
[junit4:junit4]   2> 13416 T1915 C165 P30314 /update {wt=javabin&version=2} {add=[4 (1413158157832683520)]} 0 9
[junit4:junit4]   2> 13420 T1899 C168 P44120 /update {wt=javabin&version=2} {add=[5 (1413158157845266432)]} 0 1
[junit4:junit4]   2> 13430 T1951 C166 P45953 REQ /update {update.distrib=FROMLEADER&distrib.from=http://127.0.0.1:22876/solr/collection1/&wt=javabin&version=2} status=0 QTime=1 
[junit4:junit4]   2> 13431 T1929 C167 P22876 REQ /update {distrib.from=http://127.0.0.1:30314/solr/collection1/&update.distrib=TOLEADER&wt=javabin&version=2} status=0 QTime=6 
[junit4:junit4]   2> 13431 T1915 C165 P30314 /update {wt=javabin&version=2} {add=[5]} 0 8
[junit4:junit4]   2> 13435 T1899 C168 P44120 /update {wt=javabin&version=2} {add=[6 (1413158157860995072)]} 0 1
[junit4:junit4]   2> 13441 T1951 C166 P45953 REQ /update {distrib.from=http://127.0.0.1:22876/solr/collection1/&update.distrib=FROMLEADER&wt=javabin&version=2} status=0 QTime=1 
[junit4:junit4]   2> 13441 T1931 C167 P22876 /update {wt=javabin&version=2} {add=[6 (1413158157864140800)]} 0 4
[junit4:junit4]   2> 13445 T1899 C168 P44120 /update {wt=javabin&version=2} {add=[7 (1413158157871480832)]} 0 1
[junit4:junit4]   2> 13453 T1951 C166 P45953 REQ /update {update.distrib=FROMLEADER&distrib.from=http://127.0.0.1:22876/solr/collection1/&wt=javabin&version=2} status=0 QTime=1 
[junit4:junit4]   2> 13453 T1929 C167 P22876 REQ /update {distrib.from=http://127.0.0.1:30314/solr/collection1/&update.distrib=TOLEADER&wt=javabin&version=2} status=0 QTime=4 
[junit4:junit4]   2> 13454 T1915 C165 P30314 /update {wt=javabin&version=2} {add=[7]} 0 7
[junit4:junit4]   2> 13458 T1899 C168 P44120 /update {wt=javabin&version=2} {add=[8 (1413158157885112320)]} 0 1
[junit4:junit4]   2> 13465 T1937 C164 P44267 REQ /update {distrib.from=http://127.0.0.1:30314/solr/collection1/&update.distrib=FROMLEADER&wt=javabin&version=2} status=0 QTime=1 
[junit4:junit4]   2> 13466 T1915 C165 P30314 /update {wt=javabin&version=2} {add=[8 (1413158157888258048)]} 0 6
[junit4:junit4]   2> 13470 T1899 C168 P44120 /update {wt=javabin&version=2} {add=[9 (1413158157897695232)]} 0 1
[junit4:junit4]   2> 13476 T1951 C166 P45953 REQ /update {distrib.from=http://127.0.0.1:22876/solr/collection1/&update.distrib=FROMLEADER&wt=javabin&version=2} status=0 QTime=1 
[junit4:junit4]   2> 13476 T1931 C167 P22876 /update {wt=javabin&version=2} {add=[9 (1413158157901889536)]} 0 3
[junit4:junit4]   2> 13480 T1899 C168 P44120 /update {wt=javabin&version=2} {add=[10 (1413158157908180992)]} 0 1
[junit4:junit4]   2> 13488 T1937 C164 P44267 REQ /update {update.distrib=FROMLEADER&distrib.from=http://127.0.0.1:30314/solr/collection1/&wt=javabin&version=2} status=0 QTime=1 
[junit4:junit4]   2> 13489 T1919 C165 P30314 REQ /update {distrib.from=http://127.0.0.1:22876/solr/collection1/&update.distrib=TOLEADER&wt=javabin&version=2} status=0 QTime=6 
[junit4:junit4]   2> 13489 T1931 C167 P22876 /update {wt=javabin&version=2} {add=[10]} 0 7
[junit4:junit4]   2> 13508 T1899 C168 P44120 /update {wt=javabin&version=2} {add=[11 (1413158157921812480)]} 0 16
[junit4:junit4]   2> 13516 T1937 C164 P44267 REQ /update {distrib.from=http://127.0.0.1:30314/solr/collection1/&update.distrib=FROMLEADER&wt=javabin&version=2} status=0 QTime=1 
[junit4:junit4]   2> 13517 T1915 C165 P30314 /update {wt=javabin&version=2} {add=[11 (1413158157941735424)]} 0 6
[junit4:junit4]   2> 13522 T1899 C168 P44120 /update {wt=javabin&version=2} {add=[12 (1413158157951172608)]} 0 2
[junit4:junit4]   2> 13530 T1937 C164 P44267 REQ /update {distrib.from=http://127.0.0.1:30314/solr/collection1/&update.distrib=FROMLEADER&wt=javabin&version=2} status=0 QTime=1 
[junit4:junit4]   2> 13531 T1915 C165 P30314 /update {wt=javabin&version=2} {add=[12 (1413158157956415488)]} 0 6
[junit4:junit4]   2> 13535 T1899 C168 P44120 /update {wt=javabin&version=2} {add=[13 (1413158157965852672)]} 0 1
[junit4:junit4]   2> 13543 T1937 C164 P44267 REQ /update {distrib.from=http://127.0.0.1:30314/solr/collection1/&update.distrib=FROMLEADER&wt=javabin&version=2} status=0 QTime=1 
[junit4:junit4]   2> 13544 T1915 C165 P30314 /update {wt=javabin&version=2} {add=[13 (1413158157970046976)]} 0 6
[junit4:junit4]   2> 13548 T1899 C168 P44120 /update {wt=javabin&version=2} {add=[14 (1413158157979484160)]} 0 1
[junit4:junit4]   2> 13555 T1937 C164 P44267 REQ /update {distrib.from=http://127.0.0.1:30314/solr/collection1/&update.distrib=FROMLEADER&wt=javabin&version=2} status=0 QTime=1 
[junit4:junit4]   2> 13556 T1915 C165 P30314 /update {wt=javabin&version=2} {add=[14 (1413158157983678464)]} 0 5
[junit4:junit4]   2> 13559 T1899 C168 P44120 /update {wt=javabin&version=2} {add=[15 (1413158157991018496)]} 0 1
[junit4:junit4]   2> 13565 T1937 C164 P44267 REQ /update {distrib.from=http://127.0.0.1:30314/solr/collection1/&update.distrib=FROMLEADER&wt=javabin&version=2} status=0 QTime=1 
[junit4:junit4]   2> 13566 T1915 C165 P30314 /update {wt=javabin&version=2} {add=[15 (1413158157994164224)]} 0 5
[junit4:junit4]   2> 13569 T1899 C168 P44120 /update {wt=javabin&version=2} {add=[16 (1413158158001504256)]} 0 1
[junit4:junit4]   2> 13575 T1937 C164 P44267 REQ /update {distrib.from=http://127.0.0.1:30314/solr/collection1/&update.distrib=FROMLEADER&wt=javabin&version=2} status=0 QTime=1 
[junit4:junit4]   2> 13575 T1915 C165 P30314 /update {wt=javabin&version=2} {add=[16 (1413158158004649984)]} 0 4
[junit4:junit4]   2> 13580 T1899 C168 P44120 /update {wt=javabin&version=2} {add=[17 (1413158158011990016)]} 0 2
[junit4:junit4]   2> 13594 T1951 C166 P45953 REQ /update {update.distrib=FROMLEADER&distrib.from=http://127.0.0.1:22876/solr/collection1/&wt=javabin&version=2} status=0 QTime=2 
[junit4:junit4]   2> 13595 T1929 C167 P22876 REQ /update {distrib.from=http://127.0.0.1:30314/solr/collection1/&update.distrib=TOLEADER&wt=javabin&version=2} status=0 QTime=9 
[junit4:junit4]   2> 13595 T1915 C165 P30314 /update {wt=javabin&version=2} {add=[17]} 0 12
[junit4:junit4]   2> 13599 T1899 C168 P44120 /update {wt=javabin&version=2} {add=[100 (1413158158032961536)]} 0 1
[junit4:junit4]   2> 13654 T1937 C164 P44267 REQ /update {update.distrib=FROMLEADER&distrib.from=http://127.0.0.1:30314/solr/collection1/&wt=javabin&version=2} status=0 QTime=17 
[junit4:junit4]   2> 13655 T1919 C165 P30314 REQ /update {distrib.from=http://127.0.0.1:22876/solr/collection1/&update.distrib=TOLEADER&wt=javabin&version=2} status=0 QTime=51 
[junit4:junit4]   2> 13656 T1931 C167 P22876 /update {wt=javabin&version=2} {add=[100]} 0 54
[junit4:junit4]   2> 13660 T1899 C168 P44120 /update {wt=javabin&version=2} {add=[101 (1413158158096924672)]} 0 1
[junit4:junit4]   2> 13678 T1937 C164 P44267 REQ /update {update.distrib=FROMLEADER&distrib.from=http://127.0.0.1:30314/solr/collection1/&wt=javabin&version=2} status=0 QTime=2 
[junit4:junit4]   2> 13679 T1919 C165 P30314 REQ /update {distrib.from=http://127.0.0.1:22876/solr/collection1/&update.distrib=TOLEADER&wt=javabin&version=2} status=0 QTime=14 
[junit4:junit4]   2> 13680 T1931 C167 P22876 /update {wt=javabin&version=2} {add=[101]} 0 17
[junit4:junit4]   2> 13683 T1899 C168 P44120 /update {wt=javabin&version=2} {add=[102 (1413158158121041920)]} 0 1
[junit4:junit4]   2> 13691 T1937 C164 P44267 REQ /update {distrib.from=http://127.0.0.1:30314/solr/collection1/&update.distrib=FROMLEADER&wt=javabin&version=2} status=0 QTime=1 
[junit4:junit4]   2> 13691 T1915 C165 P30314 /update {wt=javabin&version=2} {add=[102 (1413158158125236224)]} 0 5
[junit4:junit4]   2> 13709 T1899 C168 P44120 /update {wt=javabin&version=2} {add=[103 (1413158158133624832)]} 0 15
[junit4:junit4]   2> 13719 T1951 C166 P45953 REQ /update {update.distrib=FROMLEADER&distrib.from=http://127.0.0.1:22876/solr/collection1/&wt=javabin&version=2} status=0 QTime=1 
[junit4:junit4]   2> 13720 T1929 C167 P22876 REQ /update {distrib.from=http://127.0.0.1:30314/solr/collection1/&update.distrib=TOLEADER&wt=javabin&version=2} status=0 QTime=5 
[junit4:junit4]   2> 13721 T1915 C165 P30314 /update {wt=javabin&version=2} {add=[103]} 0 9
[junit4:junit4]   2> 13726 T1899 C168 P44120 /update {wt=javabin&version=2} {add=[104 (1413158158165082112)]} 0 2
[junit4:junit4]   2> 13733 T1951 C166 P45953 REQ /update {distrib.from=http://127.0.0.1:22876/solr/collection1/&update.distrib=FROMLEADER&wt=javabin&version=2} status=0 QTime=1 
[junit4:junit4]   2> 13733 T1931 C167 P22876 /update {wt=javabin&version=2} {add=[104 (1413158158170324992)]} 0 4
[junit4:junit4]   2> 13737 T1899 C168 P44120 /update {wt=javabin&version=2} {add=[105 (1413158158177665024)]} 0 1
[junit4:junit4]   2> 13792 T1951 C166 P45953 REQ /update {distrib.from=http://127.0.0.1:22876/solr/collection1/&update.distrib=FROMLEADER&wt=javabin&version=2} status=0 QTime=25 
[junit4:junit4]   2> 13793 T1931 C167 P22876 /update {wt=javabin&version=2} {add=[105 (1413158158181859328)]} 0 53
[junit4:junit4]   2> 13798 T1899 C168 P44120 /update {wt=javabin&version=2} {add=[106 (1413158158241628160)]} 0 2
[junit4:junit4]   2> 13809 T1951 C166 P45953 REQ /update {distrib.from=http://127.0.0.1:22876/solr/collection1/&update.distrib=FROMLEADER&wt=javabin&version=2} status=0 QTime=3 
[junit4:junit4]   2> 13810 T1931 C167 P22876 /update {wt=javabin&version=2} {add=[106 (1413158158245822464)]} 0 9
[junit4:junit4]   2> 13815 T1899 C168 P44120 /update {wt=javabin&version=2} {add=[107 (1413158158258405376)]} 0 2
[junit4:junit4]   2> 13827 T1937 C164 P44267 REQ /update {update.distrib=FROMLEADER&distrib.from=http://127.0.0.1:30314/solr/collection1/&wt=javabin&version=2} status=0 QTime=1 
[junit4:junit4]   2> 13828 T1919 C165 P30314 REQ /update {distrib.from=http://127.0.0.1:22876/solr/collection1/&update.distrib=TOLEADER&wt=javabin&version=2} status=0 QTime=7 
[junit4:junit4]   2> 13829 T1931 C167 P22876 /update {wt=javabin&version=2} {add=[107]} 0 11
[junit4:junit4]   2> 13834 T1899 C168 P44120 /update {wt=javabin&version=2} {add=[108 (1413158158278328320)]} 0 2
[junit4:junit4]   2> 13842 T1937 C164 P44267 REQ /update {distrib.from=http://127.0.0.1:30314/solr/collection1/&update.distrib=FROMLEADER&wt=javabin&version=2} status=0 QTime=1 
[junit4:junit4]   2> 13843 T1915 C165 P30314 /update {wt=javabin&version=2} {add=[108 (1413158158283571200)]} 0 6
[junit4:junit4]   2> 13847 T1899 C168 P44120 /update {wt=javabin&version=2} {add=[109 (1413158158293008384)]} 0 1
[junit4:junit4]   2> 13856 T1937 C164 P44267 REQ /update {update.distrib=FROMLEADER&distrib.from=http://127.0.0.1:30314/solr/collection1/&wt=javabin&version=2} status=0 QTime=1 
[junit4:junit4]   2> 13856 T1919 C165 P30314 REQ /update {distrib.from=http://127.0.0.1:22876/solr/collection1/&update.distrib=TOLEADER&wt=javabin&version=2} status=0 QTime=4 
[junit4:junit4]   2> 13857 T1931 C167 P22876 /update {wt=javabin&version=2} {add=[109]} 0 7
[junit4:junit4]   2> 13862 T1899 C168 P44120 /update {wt=javabin&version=2} {add=[110 (1413158158307688448)]} 0 2
[junit4:junit4]   2> 13870 T1937 C164 P44267 REQ /update {distrib.from=http://127.0.0.1:30314/solr/collection1/&update.distrib=FROMLEADER&wt=javabin&version=2} status=0 QTime=1 
[junit4:junit4]   2> 13870 T1915 C165 P30314 /update {wt=javabin&version=2} {add=[110 (1413158158312931328)]} 0 5
[junit4:junit4]   2> 13874 T1899 C168 P44120 /update {wt=javabin&version=2} {add=[111 (1413158158321319936)]} 0 1
[junit4:junit4]   2> 13883 T1937 C164 P44267 REQ /update {update.distrib=FROMLEADER&distrib.from=http://127.0.0.1:30314/solr/collection1/&wt=javabin&version=2} status=0 QTime=1 
[junit4:junit4]   2> 13883 T1919 C165 P30314 REQ /update {distrib.from=http://127.0.0.1:22876/solr/collection1/&update.distrib=TOLEADER&wt=javabin&version=2} status=0 QTime=4 
[junit4:junit4]   2> 13883 T1931 C167 P22876 /update {wt=javabin&version=2} {add=[111]} 0 6
[junit4:junit4]   2> 13887 T1899 C168 P44120 /update {wt=javabin&version=2} {add=[112 (1413158158334951424)]} 0 1
[junit4:junit4]   2> 13896 T1951 C166 P45953 REQ /update {update.distrib=FROMLEADER&distrib.from=http://127.0.0.1:22876/solr/collection1/&wt=javabin&version=2} status=0 QTime=1 
[junit4:junit4]   2> 13897 T1929 C167 P22876 REQ /update {distrib.from=http://127.0.0.1:30314/solr/collection1/&update.distrib=TOLEADER&wt=javabin&version=2} status=0 QTime=5 
[junit4:junit4]   2> 13897 T1915 C165 P30314 /update {wt=javabin&version=2} {add=[112]} 0 7
[junit4:junit4]   2> 13917 T1899 C168 P44120 /update {wt=javabin&version=2} {add=[113 (1413158158349631488)]} 0 17
[junit4:junit4]   2> 13925 T1937 C164 P44267 REQ /update {distrib.from=http://127.0.0.1:30314/solr/collection1/&update.distrib=FROMLEADER&wt=javabin&version=2} status=0 QTime=1 
[junit4:junit4]   2> 13926 T1915 C165 P30314 /update {wt=javabin&version=2} {add=[113 (1413158158371651584)]} 0 6
[junit4:junit4]   2> 13932 T1899 C168 P44120 /update {wt=javabin&version=2} {add=[114 (1413158158380040192)]} 0 3
[junit4:junit4]   2> 13939 T1937 C164 P44267 REQ /update {distrib.from=http://127.0.0.1:30314/solr/collection1/&update.distrib=FROMLEADER&wt=javabin&version=2} status=0 QTime=1 
[junit4:junit4]   2> 13939 T1915 C165 P30314 /update {wt=javabin&version=2} {add=[114 (1413158158385283072)]} 0 5
[junit4:junit4]   2> 13943 T1899 C168 P44120 /update {wt=javabin&version=2} {add=[115 (1413158158393671680)]} 0 1
[junit4:junit4]   2> 13952 T1951 C166 P45953 REQ /update {update.distrib=FROMLEADER&distrib.from=http://127.0.0.1:22876/solr/collection1/&wt=javabin&version=2} status=0 QTime=1 
[junit4:junit4]   2> 13953 T1929 C167 P22876 REQ /update {distrib.from=http://127.0.0.1:30314/solr/collection1/&update.distrib=TOLEADER&wt=javabin&version=2} status=0 QTime=5 
[junit4:junit4]   2> 13953 T1915 C165 P30314 /update {wt=javabin&version=2} {add=[115]} 0 7
[junit4:junit4]   2> 13958 T1899 C168 P44120 /update {wt=javabin&version=2} {add=[116 (1413158158408351744)]} 0 2
[junit4:junit4]   2> 13968 T1951 C166 P45953 REQ /update {update.distrib=FROMLEADER&distrib.from=http://127.0.0.1:22876/solr/collection1/&wt=javabin&version=2} status=0 QTime=1 
[junit4:junit4]   2> 13969 T1929 C167 P22876 REQ /update {distrib.from=http://127.0.0.1:30314/solr/collection1/&update.distrib=TOLEADER&wt=javabin&version=2} status=0 QTime=5 
[junit4:junit4]   2> 13969 T1915 C165 P30314 /update {wt=javabin&version=2} {add=[116]} 0 8
[junit4:junit4]   2> 13973 T1899 C168 P44120 /update {wt=javabin&version=2} {add=[117 (1413158158425128960)]} 0 1
[junit4:junit4]   2> 13980 T1951 C166 P45953 REQ /update {distrib.from=http://127.0.0.1:22876/solr/collection1/&update.distrib=FROMLEADER&wt=javabin&version=2} status=0 QTime=1 
[junit4:junit4]   2> 13981 T1931 C167 P22876 /update {wt=javabin&version=2} {add=[117 (1413158158429323264)]} 0 5
[junit4:junit4]   2> 13985 T1899 C168 P44120 /update {wt=javabin&version=2} {add=[118 (1413158158437711872)]} 0 1
[junit4:junit4]   2> 14026 T1937 C164 P44267 REQ /update {distrib.from=http://127.0.0.1:30314/solr/collection1/&update.distrib=FROMLEADER&wt=javabin&version=2} status=0 QTime=12 
[junit4:junit4]   2> 14027 T1915 C165 P30314 /update {wt=javabin&version=2} {add=[118 (1413158158441906176)]} 0 39
[junit4:junit4]   2> 14031 T1899 C168 P44120 /update {wt=javabin&version=2} {add=[119 (1413158158485946368)]} 0 1
[junit4:junit4]   2> 14041 T1951 C166 P45953 REQ /update {update.distrib=FROMLEADER&distrib.from=http://127.0.0.1:22876/solr/collection1/&wt=javabin&version=2} status=0 QTime=1 
[junit4:junit4]   2> 14042 T1929 C167 P22876 REQ /update {distrib.from=http://127.0.0.1:30314/solr/collection1/&update.distrib=TOLEADER&wt=javabin&version=2} status=0 QTime=5 
[junit4:junit4]   2> 14043 T1915 C165 P30314 /update {wt=javabin&version=2} {add=[119]} 0 9
[junit4:junit4]   2> 14046 T1899 C168 P44120 /update {wt=javabin&version=2} {add=[120 (1413158158501675008)]} 0 1
[junit4:junit4]   2> 14053 T1951 C166 P45953 REQ /update {distrib.from=http://127.0.0.1:22876/solr/collection1/&update.distrib=FROMLEADER&wt=javabin&version=2} status=0 QTime=1 
[junit4:junit4]   2> 14054 T1931 C167 P22876 /update {wt=javabin&version=2} {add=[120 (1413158158505869312)]} 0 5
[junit4:junit4]   2> 14057 T1899 C168 P44120 /update {wt=javabin&version=2} {add=[121 (1413158158513209344)]} 0 1
[junit4:junit4]   2> 14063 T1951 C166 P45953 REQ /update {distrib.from=http://127.0.0.1:22876/solr/collection1/&update.distrib=FROMLEADER&wt=javabin&version=2} status=0 QTime=1 
[junit4:junit4]   2> 14064 T1931 C167 P22876 /update {wt=javabin&version=2} {add=[121 (1413158158516355072)]} 0 5
[junit4:junit4]   2> 14067 T1899 C168 P44120 /update {wt=javabin&version=2} {add=[122 (1413158158523695104)]} 0 1
[junit4:junit4]   2> 14076 T1937 C164 P44267 REQ /update {distrib.from=http://127.0.0.1:30314/solr/collection1/&update.distrib=FROMLEADER&wt=javabin&version=2} status=0 QTime=2 
[junit4:junit4]   2> 14076 T1915 C165 P30314 /update {wt=javabin&version=2} {add=[122 (1413158158526840832)]} 0 7
[junit4:junit4]   2> 14089 T1899 C168 P44120 /update {wt=javabin&version=2} {add=[123 (1413158158537326592)]} 0 10
[junit4:junit4]   2> 14097 T1937 C164 P44267 REQ /update {update.distrib=FROMLEADER&distrib.from=http://127.0.0.1:30314/solr/collection1/&wt=javabin&version=2} status=0 QTime=1 
[junit4:junit4]   2> 14097 T1919 C165 P30314 REQ /update {distrib.from=http://127.0.0.1:22876/solr/collection1/&update.distrib=TOLEADER&wt=javabin&version=2} status=0 QTime=4 
[junit4:junit4]   2> 14098 T1931 C167 P22876 /update {wt=javabin&version=2} {add=[123]} 0 7
[junit4:junit4]   2> 14103 T1899 C168 P44120 /update {wt=javabin&version=2} {add=[124 (1413158158559346688)]} 0 3
[junit4:junit4]   2> 14109 T1937 C164 P44267 REQ /update {distrib.from=http://127.0.0.1:30314/solr/collection1/&update.distrib=FROMLEADER&wt=javabin&version=2} status=0 QTime=1 
[junit4:junit4]   2> 14109 T1915 C165 P30314 /update {wt=javabin&version=2} {add=[124 (1413158158564589568)]} 0 4
[junit4:junit4]   2> 14113 T1899 C168 P44120 /update {wt=javabin&version=2} {add=[125 (1413158158571929600)]} 0 1
[junit4:junit4]   2> 14121 T1937 C164 P44267 REQ /update {update.distrib=FROMLEADER&distrib.from=http://127.0.0.1:30314/solr/collection1/&wt=javabin&version=2} status=0 QTime=1 
[junit4:junit4]   2> 14121 T1919 C165 P30314 REQ /update {distrib.from=http://127.0.0.1:22876/solr/collection1/&update.distrib=TOLEADER&wt=javabin&version=2} status=0 QTime=4 
[junit4:junit4]   2> 14121 T1931 C167 P22876 /update {wt=javabin&version=2} {add=[125]} 0 6
[junit4:junit4]   2> 14125 T1899 C168 P44120 /update {wt=javabin&version=2} {add=[126 (1413158158584512512)]} 0 1
[junit4:junit4]   2> 14134 T1951 C166 P45953 REQ /update {update.distrib=FROMLEADER&distrib.from=http://127.0.0.1:22876/solr/collection1/&wt=javabin&version=2} status=0 QTime=1 
[junit4:junit4]   2> 14135 T1929 C167 P22876 REQ /update {distrib.from=http://127.0.0.1:30314/solr/collection1/&update.distrib=TOLEADER&wt=javabin&version=2} status=0 QTime=5 
[junit4:junit4]   2> 14135 T1915 C165 P30314 /update {wt=javabin&version=2} {add=[126]} 0 7
[junit4:junit4]   2> 14139 T1899 C168 P44120 /update {wt=javabin&version=2} {add=[127 (1413158158599192576)]} 0 1
[junit4:junit4]   2> 14170 T1951 C166 P45953 REQ /update {distrib.from=http://127.0.0.1:22876/solr/collection1/&update.distrib=FROMLEADER&wt=javabin&version=2} status=0 QTime=13 
[junit4:junit4]   2> 14171 T1931 C167 P22876 /update {wt=javabin&version=2} {add=[127 (1413158158603386880)]} 0 29
[junit4:junit4]   2> 14175 T1899 C168 P44120 /update {wt=javabin&version=2} {add=[128 (1413158158636941312)]} 0 1
[junit4:junit4]   2> 14186 T1951 C166 P45953 REQ /update {distrib.from=http://127.0.0.1:22876/solr/collection1/&update.distrib=FROMLEADER&wt=javabin&version=2} status=0 QTime=3 
[junit4:junit4]   2> 14186 T1931 C167 P22876 /update {wt=javabin&version=2} {add=[128 (1413158158641135616)]} 0 8
[junit4:junit4]   2> 14190 T1899 C168 P44120 /update {wt=javabin&version=2} {add=[129 (1413158158652669952)]} 0 1
[junit4:junit4]   2> 14199 T1937 C164 P44267 REQ /update {update.distrib=FROMLEADER&distrib.from=http://127.0.0.1:30314/solr/collection1/&wt=javabin&version=2} status=0 QTime=1 
[junit4:junit4]   2> 14199 T1919 C165 P30314 REQ /update {distrib.from=http://127.0.0.1:22876/solr/collection1/&update.distrib=TOLEADER&wt=javabin&version=2} status=0 QTime=4 
[junit4:junit4]   2> 14200 T1931 C167 P22876 /update {wt=javabin&version=2} {add=[129]} 0 7
[junit4:junit4]   2> 14203 T1899 C168 P44120 /update {wt=javabin&version=2} {add=[130 (1413158158666301440)]} 0 1
[junit4:junit4]   2> 14212 T1951 C166 P45953 REQ /update {update.distrib=FROMLEADER&distrib.from=http://127.0.0.1:22876/solr/collection1/&wt=javabin&version=2} status=0 QTime=1 
[junit4:junit4]   2> 14213 T1929 C167 P22876 REQ /update {distrib.from=http://127.0.0.1:30314/solr/collection1/&update.distrib=TOLEADER&wt=javabin&version=2} status=0 QTime=5 
[junit4:junit4]   2> 14213 T1915 C165 P30314 /update {wt=javabin&version=2} {add=[130]} 0 7
[junit4:junit4]   2> 14217 T1899 C168 P44120 /update {wt=javabin&version=2} {add=[131 (1413158158680981504)]} 0 1
[junit4:junit4]   2> 14224 T1951 C166 P45953 REQ /update {distrib.from=http://127.0.0.1:22876/solr/collection1/&update.distrib=FROMLEADER&wt=javabin&version=2} status=0 QTime=1 
[junit4:junit4]   2> 14225 T1931 C167 P22876 /update {wt=javabin&version=2} {add=[131 (1413158158685175808)]} 0 5
[junit4:junit4]   2> 14228 T1899 C168 P44120 /update {wt=javabin&version=2} {add=[132 (1413158158692515840)]} 0 1
[junit4:junit4]   2> 14237 T1937 C164 P44267 REQ /update {update.distrib=FROMLEADER&distrib.from=http://127.0.0.1:30314/solr/collection1/&wt=javabin&version=2} status=0 QTime=1 
[junit4:junit4]   2> 14237 T1919 C165 P30314 REQ /update {distrib.from=http://127.0.0.1:22876/solr/collection1/&update.distrib=TOLEADER&wt=javabin&version=2} status=0 QTime=4 
[junit4:junit4]   2> 14238 T1931 C167 P22876 /update {wt=javabin&version=2} {add=[132]} 0 7
[junit4:junit4]   2> 14249 T1899 C168 P44120 /update {wt=javabin&version=2} {add=[133 (1413158158706147328)]} 0 9
[junit4:junit4]   2> 14256 T1937 C164 P44267 REQ /update {distrib.from=http://127.0.0.1:30314/solr/collection1/&update.distrib=FROMLEADER&wt=javabin&version=2} status=0 QTime=1 
[junit4:junit4]   2> 14256 T1915 C165 P30314 /update {wt=javabin&version=2} {add=[133 (1413158158718730240)]} 0 4
[junit4:junit4]   2> 14261 T1899 C168 P44120 /update {wt=javabin&version=2} {add=[134 (1413158158726070272)]} 0 2
[junit4:junit4]   2> 14268 T1951 C166 P45953 REQ /update {distrib.from=http://127.0.0.1:22876/solr/collection1/&update.distrib=FROMLEADER&wt=javabin&version=2} status=0 QTime=1 
[junit4:junit4]   2> 14269 T1931 C167 P22876 /update {wt=javabin&version=2} {add=[134 (1413158158731313152)]} 0 6
[junit4:junit4]   2> 14272 T1899 C168 P44120 /update {wt=javabin&version=2} {add=[135 (1413158158738653184)]} 0 1
[junit4:junit4]   2> 14278 T1937 C164 P44267 REQ /update {distrib.from=http://127.0.0.1:30314/solr/collection1/&update.distrib=FROMLEADER&wt=javabin&version=2} status=0 QTime=1 
[junit4:junit4]   2> 14278 T1915 C165 P30314 /update {wt=javabin&version=2} {add=[135 (1413158158741798912)]} 0 4
[junit4:junit4]   2> 14282 T1899 C168 P44120 /update {wt=javabin&version=2} {add=[136 (1413158158749138944)]} 0 1
[junit4:junit4]   2> 14290 T1951 C166 P45953 REQ /update {update.distrib=FROMLEADER&distrib.from=http://127.0.0.1:22876/solr/collection1/&wt=javabin&version=2} status=0 QTime=1 
[junit4:junit4]   2> 14291 T1929 C167 P22876 REQ /update {distrib.from=http://127.0.0.1:30314/solr/collection1/&update.distrib=TOLEADER&wt=javabin&version=2} status=0 QTime=5 
[junit4:junit4]   2> 14291 T1915 C165 P30314 /update {wt=javabin&version=2} {add=[136]} 0 7
[junit4:junit4]   2> 14295 T1899 C168 P44120 /update {wt=javabin&version=2} {add=[137 (1413158158762770432)]} 0 1
[junit4:junit4]   2> 14301 T1951 C166 P45953 REQ /update {distrib.from=http://127.0.0.1:22876/solr/collection1/&update.distrib=FROMLEADER&wt=javabin&version=2} status=0 QTime=1 
[junit4:junit4]   2> 14302 T1931 C167 P22876 /update {wt=javabin&version=2} {add=[137 (1413158158765916160)]} 0 5
[junit4:junit4]   2> 14305 T1899 C168 P44120 /update {wt=javabin&version=2} {add=[138 (1413158158773256192)]} 0 1
[junit4:junit4]   2> 14314 T1937 C164 P44267 REQ /update {update.distrib=FROMLEADER&distrib.from=http://127.0.0.1:30314/solr/collection1/&wt=javabin&version=2} status=0 QTime=1 
[junit4:junit4]   2> 14315 T1919 C165 P30314 REQ /update {distrib.from=http://127.0.0.1:22876/solr/collection1/&update.distrib=TOLEADER&wt=javabin&version=2} status=0 QTime=5 
[junit4:junit4]   2> 14315 T1931 C167 P22876 /update {wt=javabin&version=2} {add=[138]} 0 7
[junit4:junit4]   2> 14319 T1899 C168 P44120 /update {wt=javabin&version=2} {add=[139 (1413158158787936256)]} 0 1
[junit4:junit4]   2> 14328 T1951 C166 P45953 REQ /update {distrib.from=http://127.0.0.1:22876/solr/collection1/&update.distrib=FROMLEADER&wt=javabin&version=2} status=0 QTime=1 
[junit4:junit4]   2> 14328 T1931 C167 P22876 /update {wt=javabin&version=2} {add=[139 (1413158158792130560)]} 0 6
[junit4:junit4]   2> 14332 T1899 C168 P44120 /update {wt=javabin&version=2} {add=[140 (1413158158801567744)]} 0 1
[junit4:junit4]   2> 14340 T1951 C166 P45953 REQ /update {distrib.from=http://127.0.0.1:22876/solr/collection1/&update.distrib=FROMLEADER&wt=javabin&version=2} status=0 QTime=1 
[junit4:junit4]   2> 14341 T1931 C167 P22876 /update {wt=javabin&version=2} {add=[140 (1413158158805762048)]} 0 6
[junit4:junit4]   2> 14345 T1899 C168 P44120 /update {wt=javabin&version=2} {add=[141 (1413158158815199232)]} 0 1
[junit4:junit4]   2> 14353 T1951 C166 P45953 REQ /update {distrib.from=http://127.0.0.1:22876/solr/collection1/&update.distrib=FROMLEADER&wt=javabin&version=2} status=0 QTime=1 
[junit4:junit4]   2> 14354 T1931 C167 P22876 /update {wt=javabin&version=2} {add=[141 (1413158158819393536)]} 0 6
[junit4:junit4]   2> 14358 T1899 C168 P44120 /update {wt=javabin&version=2} {add=[142 (1413158158828830720)]} 0 1
[junit4:junit4]   2> 14388 T1951 C166 P45953 REQ /update {distrib.from=http://127.0.0.1:22876/solr/collection1/&update.distrib=FROMLEADER&wt=javabin&version=2} status=0 QTime=15 
[junit4:junit4]   2> 14388 T1931 C167 P22876 /update {wt=javabin&version=2} {add=[142 (1413158158833025024)]} 0 27
[junit4:junit4]   2> 14401 T1899 C168 P44120 /update {wt=javabin&version=2} {add=[143 (1413158158864482304)]} 0 10
[junit4:junit4]   2> 14413 T1951 C166 P45953 REQ /update {distrib.from=http://127.0.0.1:22876/solr/collection1/&update.distrib=FROMLEADER&wt=javabin&version=2} status=0 QTime=3 
[junit4:junit4]   2> 14413 T1931 C167 P22876 /update {wt=javabin&version=2} {add=[143 (1413158158878113792)]} 0 9
[junit4:junit4]   2> 14419 T1899 C168 P44120 /update {wt=javabin&version=2} {add=[144 (1413158158890696704)]} 0 3
[junit4:junit4]   2> 14427 T1951 C166 P45953 REQ /update {update.distrib=FROMLEADER&distrib.from=http://127.0.0.1:22876/solr/collection1/&wt=javabin&version=2} status=0 QTime=1 
[junit4:junit4]   2> 14428 T1929 C167 P22876 REQ /update {distrib.from=http://127.0.0.1:30314/solr/collection1/&update.distrib=TOLEADER&wt=javabin&version=2} status=0 QTime=5 
[junit4:junit4]   2> 14428 T1915 C165 P30314 /update {wt=javabin&version=2} {add=[144]} 0 7
[junit4:junit4]   2> 14432 T1899 C168 P44120 /update {wt=javabin&version=2} {add=[145 (1413158158906425344)]} 0 1
[junit4:junit4]   2> 14441 T1951 C166 P45953 REQ /update {update.distrib=FROMLEADER&distrib.from=http://127.0.0.1:22876/solr/collection1/&wt=javabin&version=2} status=0 QTime=1 
[junit4:junit4]   2> 14442 T1929 C167 P22876 REQ /update {distrib.from=http://127.0.0.1:30314/solr/collection1/&update.distrib=TOLEADER&wt=javabin&version=2} status=0 QTime=5 
[junit4:junit4]   2> 14442 T1915 C165 P30314 /update {wt=javabin&version=2} {add=[145]} 0 7
[junit4:junit4]   2> 14446 T1899 C168 P44120 /update {wt=javabin&version=2} {add=[146 (1413158158921105408)]} 0 1
[junit4:junit4]   2> 14479 T1937 C164 P44267 REQ /update {distrib.from=http://127.0.0.1:30314/solr/collection1/&update.distrib=FROMLEADER&wt=javabin&version=2} status=0 QTime=14 
[junit4:junit4]   2> 14480 T1915 C165 P30314 /update {wt=javabin&version=2} {add=[146 (1413158158925299712)]} 0 31
[junit4:junit4]   2> 14483 T1899 C168 P44120 /update {wt=javabin&version=2} {add=[147 (1413158158959902720)]} 0 1
[junit4:junit4]   2> 14492 T1951 C166 P45953 REQ /update {update.distrib=FROMLEADER&distrib.from=http://127.0.0.1:22876/solr/collection1/&wt=javabin&version=2} status=0 QTime=1 
[junit4:junit4]   2> 14493 T1929 C167 P22876 REQ /update {distrib.from=http://127.0.0.1:30314/solr/collection1/&update.distrib=TOLEADER&wt=javabin&version=2} status=0 QTime=5 
[junit4:junit4]   2> 14493 T1915 C165 P30314 /update {wt=javabin&version=2} {add=[147]} 0 7
[junit4:junit4]   2> 14497 T1899 C168 P44120 /update {wt=javabin&version=2} {add=[148 (1413158158974582784)]} 0 1
[junit4:junit4]   2> 14507 T1937 C164 P44267 REQ /update {distrib.from=http://127.0.0.1:30314/solr/collection1/&update.distrib=FROMLEADER&wt=javabin&version=2} status=0 QTime=3 
[junit4:junit4]   2> 14507 T1915 C165 P30314 /update {wt=javabin&version=2} {add=[148 (1413158158978777088)]} 0 7
[junit4:junit4]   2> 14511 T1899 C168 P44120 /update {wt=javabin&version=2} {add=[149 (1413158158989262848)]} 0 1
[junit4:junit4]   2> 14520 T1951 C166 P45953 REQ /update {update.distrib=FROMLEADER&distrib.from=http://127.0.0.1:22876/solr/collection1/&wt=javabin&version=2} status=0 QTime=1 
[junit4:junit4]   2> 14521 T1929 C167 P22876 REQ /update {distrib.from=http://127.0.0.1:30314/solr/collection1/&update.distrib=TOLEADER&wt=javabin&version=2} status=0 QTime=5 
[junit4:junit4]   2> 14521 T1915 C165 P30314 /update {wt=javabin&version=2} {add=[149]} 0 7
[junit4:junit4]   2> 14522 T1887 oasc.AbstractDistribZkTestBase.waitForRecoveriesToFinish Wait for recoveries to finish - collection: collection1 failOnTimeout:true timeout (sec):1440
[junit4:junit4]   2> 14522 T1887 oascc.ZkStateReader.updateClusterState Updating cloud state from ZooKeeper... 
[junit4:junit4]   2> 14525 T1899 C168 P44120 oasu.DirectUpdateHandler2.commit start commit{flags=0,_version_=0,optimize=false,openSearcher=true,waitSearcher=true,expungeDeletes=false,softCommit=false}
[junit4:junit4]   2> 15079 T1899 C168 P44120 oasc.SolrDeletionPolicy.onCommit SolrDeletionPolicy.onCommit: commits:num=2
[junit4:junit4]   2> 		commit{dir=/usr/home/hudson/hudson-slave/workspace/Lucene-Solr-Tests-trunk-Java6/solr/build/solr-core/test/J1/org.apache.solr.cloud.BasicDistributedZk2Test-1347692626742/control/data/index,segFN=segments_2,generation=2,filenames=[_0_TestBloomFilteredLucene40Postings_0.tim, _0_TestBloomFilteredLucene40Postings_0.tip, _0_TestBloomFilteredLucene40Postings_0.blm, _0.fnm, _0_Pulsing40_0.tim, _0_Memory_0.ram, _0_TestBloomFilteredLucene40Postings_0.prx, _0_nrm.cfs, _0_Pulsing40_0.prx, _0_Pulsing40_0.frq, _0_nrm.cfe, _0_SimpleText_0.pst, _0_Pulsing40_0.tip, segments_2, _0_TestBloomFilteredLucene40Postings_0.frq, _0.fdx, _0.si, _0.fdt]
[junit4:junit4]   2> 		commit{dir=/usr/home/hudson/hudson-slave/workspace/Lucene-Solr-Tests-trunk-Java6/solr/build/solr-core/test/J1/org.apache.solr.cloud.BasicDistributedZk2Test-1347692626742/control/data/index,segFN=segments_3,generation=3,filenames=[_4_TestBloomFilteredLucene40Postings_0.frq, _5_nrm.cfe, _5_Memory_0.ram, _2_SimpleText_0.pst, _3_TestBloomFilteredLucene40Postings_0.prx, _2_TestBloomFilteredLucene40Postings_0.blm, _7.si, _7_TestBloomFilteredLucene40Postings_0.tip, _3.fdt, _0_Pulsing40_0.frq, _7_TestBloomFilteredLucene40Postings_0.tim, _7_Memory_0.ram, _7.fnm, _0_SimpleText_0.pst, _0_TestBloomFilteredLucene40Postings_0.frq, _3_TestBloomFilteredLucene40Postings_0.frq, _3_TestBloomFilteredLucene40Postings_0.tim, _0_TestBloomFilteredLucene40Postings_0.blm, _0_Pulsing40_0.tim, _0_Memory_0.ram, _2.fdt, _7.fdx, _3_TestBloomFilteredLucene40Postings_0.tip, _2.fdx, _7.fdt, _5_TestBloomFilteredLucene40Postings_0.frq, _1.fdx, _1.fdt, _5_nrm.cfs, _3.si, _6.fdt, _3_TestBloomFilteredLucene40Postings_0.blm, _1_SimpleText_0.pst, _2.si, _6_Memory_0.ram, _2_Pulsing40_0.tim, _2_Pulsing40_0.tip, _6.fdx, _3.fnm, _4_TestBloomFilteredLucene40Postings_0.prx, _2_nrm.cfe, _1_Memory_0.ram, _5_TestBloomFilteredLucene40Postings_0.blm, _0_Pulsing40_0.tip, _2_nrm.cfs, _2_TestBloomFilteredLucene40Postings_0.frq, _4_TestBloomFilteredLucene40Postings_0.blm, _2.fnm, _3.fdx, _1.si, _4_TestBloomFilteredLucene40Postings_0.tim, _6.si, _6.fnm, _4_TestBloomFilteredLucene40Postings_0.tip, _3_nrm.cfe, _7_TestBloomFilteredLucene40Postings_0.blm, _5.fdt, _2_TestBloomFilteredLucene40Postings_0.prx, _1_Pulsing40_0.tip, _1_Pulsing40_0.tim, _4.fnm, _4_nrm.cfe, _0_Pulsing40_0.prx, _1.fnm, _1_Pulsing40_0.frq, _4.fdx, _3_SimpleText_0.pst, _1_Pulsing40_0.prx, _5_TestBloomFilteredLucene40Postings_0.prx, _2_Pulsing40_0.prx, _2_TestBloomFilteredLucene40Postings_0.tim, _0_TestBloomFilteredLucene40Postings_0.tim, _0_TestBloomFilteredLucene40Postings_0.tip, _0.fnm, _2_Pulsing40_0.frq, _2_TestBloomFilteredLucene40Postings_0.tip, _1_TestBloomFilteredLucene40Postings_0.frq, _5.si, _3_nrm.cfs, _4_Memory_0.ram, _4_nrm.cfs, _0_TestBloomFilteredLucene40Postings_0.prx, _1_TestBloomFilteredLucene40Postings_0.blm, _1_TestBloomFilteredLucene40Postings_0.tip, _6_nrm.cfs, _7_nrm.cfs, _6_TestBloomFilteredLucene40Postings_0.tip, _2_Memory_0.ram, _1_TestBloomFilteredLucene40Postings_0.tim, _0.si, _3_Memory_0.ram, _6_TestBloomFilteredLucene40Postings_0.tim, _6_TestBloomFilteredLucene40Postings_0.frq, _5_SimpleText_0.pst, _1_nrm.cfs, _5.fnm, _1_TestBloomFilteredLucene40Postings_0.prx, _7_nrm.cfe, _6_nrm.cfe, _7_TestBloomFilteredLucene40Postings_0.frq, _0_nrm.cfs, _4.fdt, _4.si, _7_TestBloomFilteredLucene40Postings_0.prx, _6_SimpleText_0.pst, _1_nrm.cfe, _7_SimpleText_0.pst, _4_SimpleText_0.pst, _0_nrm.cfe, _5.fdx, _6_TestBloomFilteredLucene40Postings_0.blm, _0.fdx, _6_TestBloomFilteredLucene40Postings_0.prx, _5_TestBloomFilteredLucene40Postings_0.tim, segments_3, _0.fdt, _5_TestBloomFilteredLucene40Postings_0.tip]
[junit4:junit4]   2> 15080 T1899 C168 P44120 oasc.SolrDeletionPolicy.updateCommits newest commit = 3
[junit4:junit4]   2> 15152 T1899 C168 P44120 oass.SolrIndexSearcher.<init> Opening Searcher@353ad96 main
[junit4:junit4]   2> 15153 T1899 C168 P44120 oasu.DirectUpdateHandler2.commit end_commit_flush
[junit4:junit4]   2> 15154 T1910 oasc.SolrCore.registerSearcher [collection1] Registered new searcher Searcher@353ad96 main{StandardDirectoryReader(segments_3:17 _0(5.0):C1 _1(5.0):C10 _2(5.0):C10 _3(5.0):C10 _4(5.0):C10 _5(5.0):C10 _6(5.0):C10 _7(5.0):C6)}
[junit4:junit4]   2> 15154 T1899 C168 P44120 /update {waitSearcher=true&wt=javabin&commit=true&softCommit=false&version=2} {commit=} 0 629
[junit4:junit4]   2> 15157 T1915 C165 P30314 oasu.DirectUpdateHandler2.commit start commit{flags=0,_version_=0,optimize=false,openSearcher=true,waitSearcher=true,expungeDeletes=false,softCommit=false}
[junit4:junit4]   2> 15652 T1915 C165 P30314 oasc.SolrDeletionPolicy.onCommit SolrDeletionPolicy.onCommit: commits:num=2
[junit4:junit4]   2> 		commit{dir=/usr/home/hudson/hudson-slave/workspace/Lucene-Solr-Tests-trunk-Java6/solr/build/solr-core/test/J1/org.apache.solr.cloud.BasicDistributedZk2Test-1347692626742/jetty1/index,segFN=segments_2,generation=2,filenames=[_0_TestBloomFilteredLucene40Postings_0.tim, _0_TestBloomFilteredLucene40Postings_0.tip, _0_TestBloomFilteredLucene40Postings_0.blm, _0.fnm, _0_Pulsing40_0.tim, _0_Memory_0.ram, _0_TestBloomFilteredLucene40Postings_0.prx, _0_nrm.cfs, _0_Pulsing40_0.prx, _0_Pulsing40_0.frq, _0_nrm.cfe, _0_SimpleText_0.pst, _0_Pulsing40_0.tip, segments_2, _0_TestBloomFilteredLucene40Postings_0.frq, _0.fdx, _0.si, _0.fdt]
[junit4:junit4]   2> 		commit{dir=/usr/home/hudson/hudson-slave/workspace/Lucene-Solr-Tests-trunk-Java6/solr/build/solr-core/test/J1/org.apache.solr.cloud.BasicDistributedZk2Test-1347692626742/jetty1/index,segFN=segments_3,generation=3,filenames=[_4_TestBloomFilteredLucene40Postings_0.frq, _3_nrm.cfe, _3_TestBloomFilteredLucene40Postings_0.prx, _1_Pulsing40_0.tip, _2_TestBloomFilteredLucene40Postings_0.prx, _2_SimpleText_0.pst, _1_Pulsing40_0.tim, _2_TestBloomFilteredLucene40Postings_0.blm, _4_nrm.cfe, _4.fnm, _3.fdt, _0_Pulsing40_0.prx, _1.fnm, _0_Pulsing40_0.frq, _4.fdx, _1_Pulsing40_0.frq, _3_SimpleText_0.pst, _1_Pulsing40_0.prx, _0_SimpleText_0.pst, _0_TestBloomFilteredLucene40Postings_0.frq, _3_TestBloomFilteredLucene40Postings_0.frq, _3_TestBloomFilteredLucene40Postings_0.tim, _0_TestBloomFilteredLucene40Postings_0.tim, _2_TestBloomFilteredLucene40Postings_0.tim, _0_TestBloomFilteredLucene40Postings_0.tip, _0_TestBloomFilteredLucene40Postings_0.blm, _0.fnm, _0_Pulsing40_0.tim, _0_Memory_0.ram, _2.fdt, _3_TestBloomFilteredLucene40Postings_0.tip, _2.fdx, _1_TestBloomFilteredLucene40Postings_0.frq, _2_TestBloomFilteredLucene40Postings_0.tip, _3_nrm.cfs, _1.fdx, _1.fdt, _4_Memory_0.ram, _4_nrm.cfs, _3.si, _3_TestBloomFilteredLucene40Postings_0.blm, _1_SimpleText_0.pst, _2.si, _0_TestBloomFilteredLucene40Postings_0.prx, _1_TestBloomFilteredLucene40Postings_0.blm, _3.fnm, _4_TestBloomFilteredLucene40Postings_0.prx, _1_TestBloomFilteredLucene40Postings_0.tip, _1_Memory_0.ram, _2_nrm.cfe, _0_Pulsing40_0.tip, _2_Memory_0.ram, _3_Memory_0.ram, _0.si, _1_TestBloomFilteredLucene40Postings_0.tim, _2_nrm.cfs, _2_TestBloomFilteredLucene40Postings_0.frq, _1_nrm.cfs, _4_TestBloomFilteredLucene40Postings_0.blm, _1_TestBloomFilteredLucene40Postings_0.prx, _4.si, _4.fdt, _0_nrm.cfs, _1_nrm.cfe, _2.fnm, _3.fdx, _4_SimpleText_0.pst, _1.si, _4_TestBloomFilteredLucene40Postings_0.tim, _0_nrm.cfe, _0.fdx, _4_TestBloomFilteredLucene40Postings_0.tip, _0.fdt, segments_3]
[junit4:junit4]   2> 15653 T1915 C165 P30314 oasc.SolrDeletionPolicy.updateCommits newest commit = 3
[junit4:junit4]   2> 15689 T1915 C165 P30314 oass.SolrIndexSearcher.<init> Opening Searcher@152e76c3 main
[junit4:junit4]   2> 15690 T1915 C165 P30314 oasu.DirectUpdateHandler2.commit end_commit_flush
[junit4:junit4]   2> 15691 T1922 oasc.SolrCore.registerSearcher [collection1] Registered new searcher Searcher@152e76c3 main{StandardDirectoryReader(segments_3:11 _0(5.0):C1 _1(5.0):C10 _2(5.0):C10 _3(5.0):C10 _4(5.0):C1)}
[junit4:junit4]   2> 15692 T1915 C165 P30314 oasu.SolrCmdDistributor.distribCommit Distrib commit to:[StdNode: http://127.0.0.1:44267/solr/collection1/, StdNode: http://127.0.0.1:22876/solr/collection1/, StdNode: http://127.0.0.1:45953/solr/collection1/]
[junit4:junit4]   2> 15694 T1937 C164 P44267 oasu.DirectUpdateHandler2.commit start commit{flags=0,_version_=0,optimize=false,openSearcher=true,waitSearcher=true,expungeDeletes=false,softCommit=false}
[junit4:junit4]   2> 15694 T1929 C167 P22876 oasu.DirectUpdateHandler2.commit start commit{flags=0,_version_=0,optimize=false,openSearcher=true,waitSearcher=true,expungeDeletes=false,softCommit=false}
[junit4:junit4]   2> 15694 T1951 C166 P45953 oasu.DirectUpdateHandler2.commit start commit{flags=0,_version_=0,optimize=false,openSearcher=true,waitSearcher=true,expungeDeletes=false,softCommit=false}
[junit4:junit4]   2> 15861 T1929 C167 P22876 oasc.SolrDeletionPolicy.onCommit SolrDeletionPolicy.onCommit: commits:num=2
[junit4:junit4]   2> 		commit{dir=/usr/home/hudson/hudson-slave/workspace/Lucene-Solr-Tests-trunk-Java6/solr/build/solr-core/test/J1/org.apache.solr.cloud.BasicDistributedZk2Test-1347692626742/jetty2/index,segFN=segments_1,generation=1,filenames=[segments_1]
[junit4:junit4]   2> 		commit{dir=/usr/home/hudson/hudson-slave/workspace/Lucene-Solr-Tests-trunk-Java6/solr/build/solr-core/test/J1/org.apache.solr.cloud.BasicDistributedZk2Test-1347692626742/jetty2/index,segFN=segments_2,generation=2,filenames=[_3_nrm.cfe, _2_TestBloomFilteredLucene40Postings_0.prx, _2_SimpleText_0.pst, _3_TestBloomFilteredLucene40Postings_0.prx, _2_TestBloomFilteredLucene40Postings_0.blm, _3.fdt, _0_Pulsing40_0.prx, _1.fnm, _0_Pulsing40_0.frq, _3_SimpleText_0.pst, _0_SimpleText_0.pst, _0_TestBloomFilteredLucene40Postings_0.frq, _3_TestBloomFilteredLucene40Postings_0.frq, _0_TestBloomFilteredLucene40Postings_0.tim, _2_TestBloomFilteredLucene40Postings_0.tim, _3_TestBloomFilteredLucene40Postings_0.tim, _0_TestBloomFilteredLucene40Postings_0.tip, _0_TestBloomFilteredLucene40Postings_0.blm, _0.fnm, _0_Pulsing40_0.tim, _0_Memory_0.ram, _2.fdt, _3_TestBloomFilteredLucene40Postings_0.tip, _2.fdx, _1_TestBloomFilteredLucene40Postings_0.frq, _2_TestBloomFilteredLucene40Postings_0.tip, _3_nrm.cfs, _1.fdx, _1.fdt, _3.si, _3_TestBloomFilteredLucene40Postings_0.blm, _1_SimpleText_0.pst, _2.si, _0_TestBloomFilteredLucene40Postings_0.prx, _1_TestBloomFilteredLucene40Postings_0.blm, _3.fnm, _1_TestBloomFilteredLucene40Postings_0.tip, _1_Memory_0.ram, _2_nrm.cfe, _0_Pulsing40_0.tip, _2_Memory_0.ram, _3_Memory_0.ram, _0.

[...truncated too long message...]

sterMBean(JmxMBeanServer.java:540)
[junit4:junit4]   2> 	at org.apache.solr.core.JmxMonitoredMap.unregister(JmxMonitoredMap.java:175)
[junit4:junit4]   2> 	at org.apache.solr.core.JmxMonitoredMap.clear(JmxMonitoredMap.java:116)
[junit4:junit4]   2> 	at org.apache.solr.core.SolrCore.close(SolrCore.java:864)
[junit4:junit4]   2> 	at org.apache.solr.cloud.ShardLeaderElectionContext.runLeaderProcess(ElectionContext.java:213)
[junit4:junit4]   2> 	at org.apache.solr.cloud.LeaderElector.runIamLeaderProcess(LeaderElector.java:158)
[junit4:junit4]   2> 	at org.apache.solr.cloud.LeaderElector.checkIfIamLeader(LeaderElector.java:102)
[junit4:junit4]   2> 	at org.apache.solr.cloud.LeaderElector.access$000(LeaderElector.java:56)
[junit4:junit4]   2> 	at org.apache.solr.cloud.LeaderElector$1.process(LeaderElector.java:131)
[junit4:junit4]   2> 	at org.apache.zookeeper.ClientCnxn$EventThread.processEvent(ClientCnxn.java:526)
[junit4:junit4]   2> 	at org.apache.zookeeper.ClientCnxn$EventThread.run(ClientCnxn.java:502)
[junit4:junit4]   2> 
[junit4:junit4]   2> 183968 T1959 oasc.SolrCore.closeSearcher [collection1] Closing main searcher on request.
[junit4:junit4]   2> 183970 T1959 oasu.DirectUpdateHandler2.close closing DirectUpdateHandler2{commits=5,autocommits=0,soft autocommits=0,optimizes=0,rollbacks=0,expungeDeletes=0,docsPending=0,adds=0,deletesById=0,deletesByQuery=0,errors=0,cumulative_adds=35,cumulative_deletesById=0,cumulative_deletesByQuery=0,cumulative_errors=0}
[junit4:junit4]   2> 183970 T1959 oasu.DefaultSolrCoreState.decref SolrCoreState ref count has reached 0 - closing IndexWriter
[junit4:junit4]   2> 183973 T1959 oasu.DefaultSolrCoreState.decref Closing SolrCoreState - canceling any ongoing recovery
[junit4:junit4]   2> 183974 T1959 oasc.LeaderElector$1.process WARNING  org.apache.zookeeper.KeeperException$SessionExpiredException: KeeperErrorCode = Session expired for /collections/collection1/leader_elect/shard2/election/88322383986491398-127.0.0.1:45953_solr_collection1-n_0000000004
[junit4:junit4]   2> 	at org.apache.zookeeper.KeeperException.create(KeeperException.java:118)
[junit4:junit4]   2> 	at org.apache.zookeeper.KeeperException.create(KeeperException.java:42)
[junit4:junit4]   2> 	at org.apache.zookeeper.ZooKeeper.delete(ZooKeeper.java:734)
[junit4:junit4]   2> 	at org.apache.solr.common.cloud.SolrZkClient$2.execute(SolrZkClient.java:178)
[junit4:junit4]   2> 	at org.apache.solr.common.cloud.SolrZkClient$2.execute(SolrZkClient.java:175)
[junit4:junit4]   2> 	at org.apache.solr.common.cloud.ZkCmdExecutor.retryOperation(ZkCmdExecutor.java:67)
[junit4:junit4]   2> 	at org.apache.solr.common.cloud.SolrZkClient.delete(SolrZkClient.java:175)
[junit4:junit4]   2> 	at org.apache.solr.cloud.ElectionContext.cancelElection(ElectionContext.java:60)
[junit4:junit4]   2> 	at org.apache.solr.cloud.ShardLeaderElectionContext.runLeaderProcess(ElectionContext.java:151)
[junit4:junit4]   2> 	at org.apache.solr.cloud.LeaderElector.runIamLeaderProcess(LeaderElector.java:158)
[junit4:junit4]   2> 	at org.apache.solr.cloud.LeaderElector.checkIfIamLeader(LeaderElector.java:102)
[junit4:junit4]   2> 	at org.apache.solr.cloud.LeaderElector.joinElection(LeaderElector.java:275)
[junit4:junit4]   2> 	at org.apache.solr.cloud.ShardLeaderElectionContext.rejoinLeaderElection(ElectionContext.java:326)
[junit4:junit4]   2> 	at org.apache.solr.cloud.ShardLeaderElectionContext.runLeaderProcess(ElectionContext.java:204)
[junit4:junit4]   2> 	at org.apache.solr.cloud.LeaderElector.runIamLeaderProcess(LeaderElector.java:158)
[junit4:junit4]   2> 	at org.apache.solr.cloud.LeaderElector.checkIfIamLeader(LeaderElector.java:102)
[junit4:junit4]   2> 	at org.apache.solr.cloud.LeaderElector.access$000(LeaderElector.java:56)
[junit4:junit4]   2> 	at org.apache.solr.cloud.LeaderElector$1.process(LeaderElector.java:131)
[junit4:junit4]   2> 	at org.apache.zookeeper.ClientCnxn$EventThread.processEvent(ClientCnxn.java:526)
[junit4:junit4]   2> 	at org.apache.zookeeper.ClientCnxn$EventThread.run(ClientCnxn.java:502)
[junit4:junit4]   2> 
[junit4:junit4]   2> 183974 T1959 oascc.ZkStateReader$3.process Updating live nodes
[junit4:junit4]   2> 183975 T1959 oascc.ZkStateReader$3.process WARNING ZooKeeper watch triggered, but Solr cannot talk to ZK
[junit4:junit4]   2> 183975 T1959 oascc.ZkStateReader$2.process A cluster state change has occurred - updating...
[junit4:junit4]   2> 183975 T1959 oascc.ZkStateReader$2.process WARNING ZooKeeper watch triggered, but Solr cannot talk to ZK
[junit4:junit4]   2> 183975 T1959 oascc.ConnectionManager.process Watcher org.apache.solr.common.cloud.ConnectionManager@68b344cc name:ZooKeeperConnection Watcher:127.0.0.1:46808/solr got event WatchedEvent state:Disconnected type:None path:null path:null type:None
[junit4:junit4]   2> 183975 T1959 oascc.ConnectionManager.process Client->ZooKeeper status change trigger but we are already closed
[junit4:junit4]   2> 183976 T1959 oaz.ClientCnxn$EventThread.run EventThread shut down
[junit4:junit4]   2> NOTE: test params are: codec=Lucene40: {n_f1=PostingsFormat(name=SimpleText), foo_b=Pulsing40(freqCutoff=6 minBlockSize=57 maxBlockSize=121), foo_d=PostingsFormat(name=TestBloomFilteredLucene40Postings), foo_f=Pulsing40(freqCutoff=6 minBlockSize=57 maxBlockSize=121), n_tl1=PostingsFormat(name=SimpleText), n_d1=PostingsFormat(name=Memory doPackFST= true), rnd_b=PostingsFormat(name=TestBloomFilteredLucene40Postings), intDefault=PostingsFormat(name=Memory doPackFST= true), n_td1=PostingsFormat(name=SimpleText), id=PostingsFormat(name=TestBloomFilteredLucene40Postings), timestamp=PostingsFormat(name=Memory doPackFST= true), range_facet_sl=PostingsFormat(name=TestBloomFilteredLucene40Postings), range_facet_si=PostingsFormat(name=Memory doPackFST= true), oddField_s=PostingsFormat(name=TestBloomFilteredLucene40Postings), multiDefault=PostingsFormat(name=Memory doPackFST= true), n_tf1=PostingsFormat(name=Memory doPackFST= true), n_dt1=PostingsFormat(name=SimpleText), n_ti1=PostingsFormat(name=TestBloomFilteredLucene40Postings), range_facet_l=PostingsFormat(name=Memory doPackFST= true), text=Pulsing40(freqCutoff=6 minBlockSize=57 maxBlockSize=121), _version_=PostingsFormat(name=SimpleText), SubjectTerms_mfacet=PostingsFormat(name=SimpleText), a_t=PostingsFormat(name=Memory doPackFST= true), n_tdt1=PostingsFormat(name=SimpleText), other_tl1=PostingsFormat(name=Memory doPackFST= true), n_l1=PostingsFormat(name=Memory doPackFST= true), a_si=PostingsFormat(name=SimpleText)}, sim=RandomSimilarityProvider(queryNorm=true,coord=no): {}, locale=hr_HR, timezone=Asia/Calcutta
[junit4:junit4]   2> NOTE: FreeBSD 9.0-RELEASE amd64/Sun Microsystems Inc. 1.6.0_32 (64-bit)/cpus=16,threads=1,free=171061680,total=279117824
[junit4:junit4]   2> NOTE: All tests run in this JVM: [ClusterStateUpdateTest, DisMaxRequestHandlerTest, StandardRequestHandlerTest, TimeZoneUtilsTest, TermVectorComponentTest, BasicFunctionalityTest, ZkNodePropsTest, TestHashPartitioner, OutputWriterTest, TestReversedWildcardFilterFactory, ConvertedLegacyTest, TestPluginEnable, TestPhraseSuggestions, FieldMutatingUpdateProcessorTest, TestPropInject, TestRTGBase, TestWriterPerf, TestSolrDeletionPolicy2, TestLRUCache, PathHierarchyTokenizerFactoryTest, TestSolrCoreProperties, TestBinaryField, BadIndexSchemaTest, RequiredFieldsTest, TestDistributedGrouping, IndexSchemaTest, ScriptEngineTest, DocumentAnalysisRequestHandlerTest, FileUtilsTest, TestDocumentBuilder, LukeRequestHandlerTest, TestDocSet, TestTrie, TestSolrXMLSerializer, ShowFileRequestHandlerTest, ReturnFieldsTest, FullSolrCloudDistribCmdsTest, TestReplicationHandler, SolrIndexConfigTest, OverseerTest, UpdateParamsTest, SolrInfoMBeanTest, RAMDirectoryFactoryTest, QueryParsingTest, TestUtils, TestMultiCoreConfBootstrap, TestFastWriter, UUIDFieldTest, EchoParamsTest, XmlUpdateRequestHandlerTest, DistributedQueryElevationComponentTest, LegacyHTMLStripCharFilterTest, TestSort, SuggesterTSTTest, TestStressLucene, TestDFRSimilarityFactory, BasicDistributedZkTest, BasicZkTest, StatsComponentTest, TestRecovery, SimpleFacetsTest, SignatureUpdateProcessorFactoryTest, HighlighterTest, TestFunctionQuery, TestRemoteStreaming, TestCSVLoader, TestCSVResponseWriter, DocumentBuilderTest, BinaryUpdateRequestHandlerTest, DistanceFunctionTest, MinimalSchemaTest, TestPHPSerializedResponseWriter, TestSurroundQueryParser, IndexSchemaRuntimeFieldTest, TestValueSourceCache, DebugComponentTest, RequestHandlersTest, TestOmitPositions, TestArbitraryIndexDir, TestQueryUtils, SuggesterTest, TestSolrDeletionPolicy1, BadComponentTest, TestPropInjectDefaults, TestMergePolicyConfig, TestQuerySenderListener, TestNumberUtils, MultiTermTest, SpellPossibilityIteratorTest, TestLMJelinekMercerSimilarityFactory, TestCodecSupport, DateMathParserTest, PrimUtilsTest, OpenExchangeRatesOrgProviderTest, SpellingQueryConverterTest, TestBadConfig, BasicDistributedZk2Test]
[junit4:junit4] Completed on J1 in 185.00s, 1 test, 1 failure <<< FAILURES!

[...truncated 11 lines...]
BUILD FAILED
/usr/home/hudson/hudson-slave/workspace/Lucene-Solr-Tests-trunk-Java6/build.xml:29: The following error occurred while executing this line:
/usr/home/hudson/hudson-slave/workspace/Lucene-Solr-Tests-trunk-Java6/solr/build.xml:146: The following error occurred while executing this line:
/usr/home/hudson/hudson-slave/workspace/Lucene-Solr-Tests-trunk-Java6/lucene/module-build.xml:63: The following error occurred while executing this line:
/usr/home/hudson/hudson-slave/workspace/Lucene-Solr-Tests-trunk-Java6/lucene/common-build.xml:1133: The following error occurred while executing this line:
/usr/home/hudson/hudson-slave/workspace/Lucene-Solr-Tests-trunk-Java6/lucene/common-build.xml:810: There were test failures: 228 suites, 923 tests, 1 failure, 6 ignored (1 assumption)

Total time: 28 minutes 14 seconds
Build step 'Invoke Ant' marked build as failure
Recording test results
Email was triggered for: Failure
Sending email for trigger: Failure



Mime
View raw message