lucene-dev mailing list archives

Site index · List index
Message view « Date » · « Thread »
Top « Date » · « Thread »
From Policeman Jenkins Server <jenk...@sd-datasolutions.de>
Subject [JENKINS] Lucene-Solr-4.x-Windows (64bit/jdk1.7.0_07) - Build # 875 - Failure!
Date Sat, 22 Sep 2012 11:34:18 GMT
Build: http://jenkins.sd-datasolutions.de/job/Lucene-Solr-4.x-Windows/875/
Java: 64bit/jdk1.7.0_07 -XX:+UseSerialGC

1 tests failed.
REGRESSION:  org.apache.solr.spelling.suggest.SuggesterWFSTTest.testRebuild

Error Message:
Exception during query

Stack Trace:
java.lang.RuntimeException: Exception during query
	at __randomizedtesting.SeedInfo.seed([C5D3563925F8338A:9EF6F47A11F84910]:0)
	at org.apache.solr.SolrTestCaseJ4.assertQ(SolrTestCaseJ4.java:510)
	at org.apache.solr.SolrTestCaseJ4.assertQ(SolrTestCaseJ4.java:477)
	at org.apache.solr.spelling.suggest.SuggesterTest.testRebuild(SuggesterTest.java:105)
	at sun.reflect.NativeMethodAccessorImpl.invoke0(Native Method)
	at sun.reflect.NativeMethodAccessorImpl.invoke(NativeMethodAccessorImpl.java:57)
	at sun.reflect.DelegatingMethodAccessorImpl.invoke(DelegatingMethodAccessorImpl.java:43)
	at java.lang.reflect.Method.invoke(Method.java:601)
	at com.carrotsearch.randomizedtesting.RandomizedRunner.invoke(RandomizedRunner.java:1559)
	at com.carrotsearch.randomizedtesting.RandomizedRunner.access$600(RandomizedRunner.java:79)
	at com.carrotsearch.randomizedtesting.RandomizedRunner$6.evaluate(RandomizedRunner.java:737)
	at com.carrotsearch.randomizedtesting.RandomizedRunner$7.evaluate(RandomizedRunner.java:773)
	at com.carrotsearch.randomizedtesting.RandomizedRunner$8.evaluate(RandomizedRunner.java:787)
	at com.carrotsearch.randomizedtesting.rules.SystemPropertiesRestoreRule$1.evaluate(SystemPropertiesRestoreRule.java:53)
	at org.apache.lucene.util.TestRuleSetupTeardownChained$1.evaluate(TestRuleSetupTeardownChained.java:50)
	at org.apache.lucene.util.TestRuleFieldCacheSanity$1.evaluate(TestRuleFieldCacheSanity.java:51)
	at org.apache.lucene.util.AbstractBeforeAfterRule$1.evaluate(AbstractBeforeAfterRule.java:45)
	at com.carrotsearch.randomizedtesting.rules.SystemPropertiesInvariantRule$1.evaluate(SystemPropertiesInvariantRule.java:55)
	at org.apache.lucene.util.TestRuleThreadAndTestName$1.evaluate(TestRuleThreadAndTestName.java:48)
	at org.apache.lucene.util.TestRuleIgnoreAfterMaxFailures$1.evaluate(TestRuleIgnoreAfterMaxFailures.java:70)
	at org.apache.lucene.util.TestRuleMarkFailure$1.evaluate(TestRuleMarkFailure.java:48)
	at com.carrotsearch.randomizedtesting.rules.StatementAdapter.evaluate(StatementAdapter.java:36)
	at com.carrotsearch.randomizedtesting.ThreadLeakControl$StatementRunner.run(ThreadLeakControl.java:358)
	at com.carrotsearch.randomizedtesting.ThreadLeakControl.forkTimeoutingTask(ThreadLeakControl.java:782)
	at com.carrotsearch.randomizedtesting.ThreadLeakControl$3.evaluate(ThreadLeakControl.java:442)
	at com.carrotsearch.randomizedtesting.RandomizedRunner.runSingleTest(RandomizedRunner.java:746)
	at com.carrotsearch.randomizedtesting.RandomizedRunner$3.evaluate(RandomizedRunner.java:648)
	at com.carrotsearch.randomizedtesting.RandomizedRunner$4.evaluate(RandomizedRunner.java:682)
	at com.carrotsearch.randomizedtesting.RandomizedRunner$5.evaluate(RandomizedRunner.java:693)
	at com.carrotsearch.randomizedtesting.rules.StatementAdapter.evaluate(StatementAdapter.java:36)
	at com.carrotsearch.randomizedtesting.rules.SystemPropertiesRestoreRule$1.evaluate(SystemPropertiesRestoreRule.java:53)
	at org.apache.lucene.util.AbstractBeforeAfterRule$1.evaluate(AbstractBeforeAfterRule.java:45)
	at org.apache.lucene.util.TestRuleStoreClassName$1.evaluate(TestRuleStoreClassName.java:42)
	at com.carrotsearch.randomizedtesting.rules.SystemPropertiesInvariantRule$1.evaluate(SystemPropertiesInvariantRule.java:55)
	at com.carrotsearch.randomizedtesting.rules.NoShadowingOrOverridesOnMethodsRule$1.evaluate(NoShadowingOrOverridesOnMethodsRule.java:39)
	at com.carrotsearch.randomizedtesting.rules.NoShadowingOrOverridesOnMethodsRule$1.evaluate(NoShadowingOrOverridesOnMethodsRule.java:39)
	at com.carrotsearch.randomizedtesting.rules.StatementAdapter.evaluate(StatementAdapter.java:36)
	at org.apache.lucene.util.TestRuleAssertionsRequired$1.evaluate(TestRuleAssertionsRequired.java:43)
	at org.apache.lucene.util.TestRuleMarkFailure$1.evaluate(TestRuleMarkFailure.java:48)
	at org.apache.lucene.util.TestRuleIgnoreAfterMaxFailures$1.evaluate(TestRuleIgnoreAfterMaxFailures.java:70)
	at org.apache.lucene.util.TestRuleIgnoreTestSuites$1.evaluate(TestRuleIgnoreTestSuites.java:55)
	at com.carrotsearch.randomizedtesting.rules.StatementAdapter.evaluate(StatementAdapter.java:36)
	at com.carrotsearch.randomizedtesting.ThreadLeakControl$StatementRunner.run(ThreadLeakControl.java:358)
	at java.lang.Thread.run(Thread.java:722)
Caused by: java.lang.NullPointerException
	at org.apache.lucene.search.suggest.fst.WFSTCompletionLookup.lookupPrefix(WFSTCompletionLookup.java:192)
	at org.apache.lucene.search.suggest.fst.WFSTCompletionLookup.lookup(WFSTCompletionLookup.java:154)
	at org.apache.solr.spelling.suggest.Suggester.getSuggestions(Suggester.java:190)
	at org.apache.solr.handler.component.SpellCheckComponent.process(SpellCheckComponent.java:172)
	at org.apache.solr.handler.component.SearchHandler.handleRequestBody(SearchHandler.java:206)
	at org.apache.solr.handler.RequestHandlerBase.handleRequest(RequestHandlerBase.java:129)
	at org.apache.solr.core.SolrCore.execute(SolrCore.java:1701)
	at org.apache.solr.util.TestHarness.query(TestHarness.java:364)
	at org.apache.solr.util.TestHarness.query(TestHarness.java:346)
	at org.apache.solr.SolrTestCaseJ4.assertQ(SolrTestCaseJ4.java:484)
	... 42 more




Build Log:
[...truncated 7666 lines...]
[junit4:junit4] Suite: org.apache.solr.spelling.suggest.SuggesterWFSTTest
[junit4:junit4]   2> 1 T396 oas.SolrTestCaseJ4.initCore ####initCore
[junit4:junit4]   2> Creating dataDir: C:\Jenkins\workspace\Lucene-Solr-4.x-Windows\solr\build\solr-core\test\J0\.\solrtest-SuggesterWFSTTest-1348312742478
[junit4:junit4]   2> 3 T396 oasc.SolrResourceLoader.<init> new SolrResourceLoader for directory: 'C:\Jenkins\workspace\Lucene-Solr-4.x-Windows\solr\build\solr-core\test-files\solr\collection1\'
[junit4:junit4]   2> 4 T396 oasc.SolrResourceLoader.replaceClassLoader Adding 'file:/C:/Jenkins/workspace/Lucene-Solr-4.x-Windows/solr/build/solr-core/test-files/solr/collection1/lib/classes/' to classloader
[junit4:junit4]   2> 6 T396 oasc.SolrResourceLoader.replaceClassLoader Adding 'file:/C:/Jenkins/workspace/Lucene-Solr-4.x-Windows/solr/build/solr-core/test-files/solr/collection1/lib/README' to classloader
[junit4:junit4]   2> 66 T396 oasc.SolrConfig.<init> Using Lucene MatchVersion: LUCENE_40
[junit4:junit4]   2> 128 T396 oasc.SolrConfig.<init> Loaded SolrConfig: solrconfig-spellchecker.xml
[junit4:junit4]   2> 128 T396 oass.IndexSchema.readSchema Reading Solr Schema
[junit4:junit4]   2> 132 T396 oass.IndexSchema.readSchema Schema name=Solr SpellCheck Test
[junit4:junit4]   2> 169 T396 oass.IndexSchema.readSchema default search field in schema is text
[junit4:junit4]   2> 171 T396 oass.IndexSchema.readSchema query parser default operator is OR
[junit4:junit4]   2> 172 T396 oass.IndexSchema.readSchema unique key field: id
[junit4:junit4]   2> 177 T396 oasc.SolrResourceLoader.locateSolrHome JNDI not configured for solr (NoInitialContextEx)
[junit4:junit4]   2> 177 T396 oasc.SolrResourceLoader.locateSolrHome using system property solr.solr.home: C:\Jenkins\workspace\Lucene-Solr-4.x-Windows\solr\build\solr-core\test-files\solr
[junit4:junit4]   2> 177 T396 oasc.SolrResourceLoader.<init> new SolrResourceLoader for directory: 'C:\Jenkins\workspace\Lucene-Solr-4.x-Windows\solr\build\solr-core\test-files\solr\'
[junit4:junit4]   2> 189 T396 oasc.CoreContainer.<init> New CoreContainer 1970228286
[junit4:junit4]   2> 191 T396 oasc.SolrCore.<init> [collection1] Opening new SolrCore at C:\Jenkins\workspace\Lucene-Solr-4.x-Windows\solr\build\solr-core\test-files\solr\collection1\, dataDir=C:\Jenkins\workspace\Lucene-Solr-4.x-Windows\solr\build\solr-core\test\J0\.\solrtest-SuggesterWFSTTest-1348312742478\
[junit4:junit4]   2> 191 T396 oasc.SolrCore.<init> JMX monitoring not detected for core: collection1
[junit4:junit4]   2> 192 T396 oasc.SolrCore.getNewIndexDir WARNING New index directory detected: old=null new=C:\Jenkins\workspace\Lucene-Solr-4.x-Windows\solr\build\solr-core\test\J0\.\solrtest-SuggesterWFSTTest-1348312742478\index/
[junit4:junit4]   2> 193 T396 oasc.SolrCore.initIndex WARNING [collection1] Solr index directory 'C:\Jenkins\workspace\Lucene-Solr-4.x-Windows\solr\build\solr-core\test\J0\.\solrtest-SuggesterWFSTTest-1348312742478\index' doesn't exist. Creating new index...
[junit4:junit4]   2> 193 T396 oasc.CachingDirectoryFactory.get return new directory for C:\Jenkins\workspace\Lucene-Solr-4.x-Windows\solr\build\solr-core\test\J0\.\solrtest-SuggesterWFSTTest-1348312742478\index forceNew:false
[junit4:junit4]   2> 198 T396 oasc.SolrDeletionPolicy.onCommit SolrDeletionPolicy.onCommit: commits:num=1
[junit4:junit4]   2> 		commit{dir=MockDirWrapper(org.apache.lucene.store.SimpleFSDirectory@C:\Jenkins\workspace\Lucene-Solr-4.x-Windows\solr\build\solr-core\test\J0\solrtest-SuggesterWFSTTest-1348312742478\index lockFactory=org.apache.lucene.store.NativeFSLockFactory@7053480c),segFN=segments_1,generation=1,filenames=[segments_1]
[junit4:junit4]   2> 198 T396 oasc.SolrDeletionPolicy.updateCommits newest commit = 1
[junit4:junit4]   2> 200 T396 oasc.RequestHandlers.initHandlersFromConfig created standard: solr.StandardRequestHandler
[junit4:junit4]   2> 200 T396 oasc.RequestHandlers.initHandlersFromConfig created /suggest: org.apache.solr.handler.component.SearchHandler
[junit4:junit4]   2> 200 T396 oasc.RequestHandlers.initHandlersFromConfig created /suggest_tst: org.apache.solr.handler.component.SearchHandler
[junit4:junit4]   2> 200 T396 oasc.RequestHandlers.initHandlersFromConfig created /suggest_fst: org.apache.solr.handler.component.SearchHandler
[junit4:junit4]   2> 201 T396 oasc.RequestHandlers.initHandlersFromConfig created /suggest_wfst: org.apache.solr.handler.component.SearchHandler
[junit4:junit4]   2> 209 T396 oass.SolrIndexSearcher.<init> Opening Searcher@4a4ee303 main
[junit4:junit4]   2> 210 T396 oass.SolrIndexSearcher.getIndexDir WARNING WARNING: Directory impl does not support setting indexDir: org.apache.lucene.store.MockDirectoryWrapper
[junit4:junit4]   2> 211 T396 oasu.CommitTracker.<init> Hard AutoCommit: disabled
[junit4:junit4]   2> 212 T396 oasu.CommitTracker.<init> Soft AutoCommit: disabled
[junit4:junit4]   2> 213 T396 oashc.SpellCheckComponent.inform Initializing spell checkers
[junit4:junit4]   2> 213 T396 oasss.Suggester.init init: {name=suggest,classname=org.apache.solr.spelling.suggest.Suggester,lookupImpl=org.apache.solr.spelling.suggest.jaspell.JaspellLookup,field=suggest,storeDir=suggest,buildOnCommit=true,threshold=0.0}
[junit4:junit4]   2> 214 T396 oasssj.JaspellLookupFactory.create init: {name=suggest,classname=org.apache.solr.spelling.suggest.Suggester,lookupImpl=org.apache.solr.spelling.suggest.jaspell.JaspellLookup,field=suggest,storeDir=suggest,buildOnCommit=true,threshold=0.0}
[junit4:junit4]   2> 215 T396 oashc.SpellCheckComponent.inform Registering newSearcher listener for spellchecker: suggest
[junit4:junit4]   2> 215 T396 oashc.SpellCheckComponent.inform No queryConverter defined, using default converter
[junit4:junit4]   2> 215 T396 oashc.SpellCheckComponent.inform Initializing spell checkers
[junit4:junit4]   2> 216 T396 oasss.Suggester.init init: {name=suggest_tst,classname=org.apache.solr.spelling.suggest.Suggester,lookupImpl=org.apache.solr.spelling.suggest.tst.TSTLookup,field=suggest,storeDir=suggest_tst,buildOnCommit=true,threshold=0.0}
[junit4:junit4]   2> 217 T396 oashc.SpellCheckComponent.inform Registering newSearcher listener for spellchecker: suggest_tst
[junit4:junit4]   2> 217 T396 oashc.SpellCheckComponent.inform No queryConverter defined, using default converter
[junit4:junit4]   2> 217 T396 oashc.SpellCheckComponent.inform Initializing spell checkers
[junit4:junit4]   2> 218 T396 oasss.Suggester.init init: {name=suggest_fst,classname=org.apache.solr.spelling.suggest.Suggester,lookupImpl=org.apache.solr.spelling.suggest.fst.FSTLookup,field=suggest,storeDir=suggest_fst,buildOnCommit=true,weightBuckets=5,exactMatchFirst=true}
[junit4:junit4]   2> 219 T396 oashc.SpellCheckComponent.inform Registering newSearcher listener for spellchecker: suggest_fst
[junit4:junit4]   2> 219 T396 oashc.SpellCheckComponent.inform No queryConverter defined, using default converter
[junit4:junit4]   2> 220 T396 oashc.SpellCheckComponent.inform Initializing spell checkers
[junit4:junit4]   2> 220 T396 oasss.Suggester.init init: {name=suggest_wfst,classname=org.apache.solr.spelling.suggest.Suggester,lookupImpl=org.apache.solr.spelling.suggest.fst.WFSTLookupFactory,field=suggest,storeDir=suggest_wfst,buildOnCommit=true,exactMatchFirst=true}
[junit4:junit4]   2> 221 T396 oashc.SpellCheckComponent.inform Registering newSearcher listener for spellchecker: suggest_wfst
[junit4:junit4]   2> 221 T396 oashc.SpellCheckComponent.inform No queryConverter defined, using default converter
[junit4:junit4]   2> 222 T396 oashc.HttpShardHandlerFactory.getParameter Setting socketTimeout to: 0
[junit4:junit4]   2> 222 T396 oashc.HttpShardHandlerFactory.getParameter Setting urlScheme to: http://
[junit4:junit4]   2> 222 T396 oashc.HttpShardHandlerFactory.getParameter Setting connTimeout to: 0
[junit4:junit4]   2> 222 T396 oashc.HttpShardHandlerFactory.getParameter Setting maxConnectionsPerHost to: 20
[junit4:junit4]   2> 223 T396 oashc.HttpShardHandlerFactory.getParameter Setting corePoolSize to: 0
[junit4:junit4]   2> 223 T396 oashc.HttpShardHandlerFactory.getParameter Setting maximumPoolSize to: 2147483647
[junit4:junit4]   2> 223 T396 oashc.HttpShardHandlerFactory.getParameter Setting maxThreadIdleTime to: 5
[junit4:junit4]   2> 224 T396 oashc.HttpShardHandlerFactory.getParameter Setting sizeOfQueue to: -1
[junit4:junit4]   2> 224 T396 oashc.HttpShardHandlerFactory.getParameter Setting fairnessPolicy to: false
[junit4:junit4]   2> 224 T396 oascsi.HttpClientUtil.createClient Creating new http client, config:maxConnectionsPerHost=20&maxConnections=10000&socketTimeout=0&connTimeout=0&retry=false
[junit4:junit4]   2> 233 T396 oasc.CoreContainer.register registering core: collection1
[junit4:junit4]   2> 236 T396 oas.SolrTestCaseJ4.initCore ####initCore end
[junit4:junit4]   2> 243 T396 oas.SolrTestCaseJ4.setUp ###Starting testRebuild
[junit4:junit4]   2> ASYNC  NEW_CORE C15 name=collection1 org.apache.solr.core.SolrCore@1fceb2bd
[junit4:junit4]   2> 254 T396 C15 oasc.SolrDeletionPolicy.onInit SolrDeletionPolicy.onInit: commits:num=1
[junit4:junit4]   2> 		commit{dir=MockDirWrapper(org.apache.lucene.store.SimpleFSDirectory@C:\Jenkins\workspace\Lucene-Solr-4.x-Windows\solr\build\solr-core\test\J0\solrtest-SuggesterWFSTTest-1348312742478\index lockFactory=org.apache.lucene.store.NativeFSLockFactory@7053480c),segFN=segments_1,generation=1,filenames=[segments_1]
[junit4:junit4]   2> 254 T396 C15 oasc.SolrDeletionPolicy.updateCommits newest commit = 1
[junit4:junit4]   2> 257 T396 C15 UPDATE [collection1] webapp=null path=null params={} {add=[1]} 0 6
[junit4:junit4]   2> 272 T396 C15 UPDATE [collection1] webapp=null path=null params={} {add=[2]} 0 1
[junit4:junit4]   2> 278 T396 C15 UPDATE [collection1] webapp=null path=null params={} {add=[3]} 0 1
[junit4:junit4]   2> 284 T396 C15 oasu.DirectUpdateHandler2.commit start commit{flags=0,_version_=0,optimize=false,openSearcher=true,waitSearcher=true,expungeDeletes=false,softCommit=false}
[junit4:junit4]   2> 298 T396 C15 oasc.SolrDeletionPolicy.onCommit SolrDeletionPolicy.onCommit: commits:num=2
[junit4:junit4]   2> 		commit{dir=MockDirWrapper(org.apache.lucene.store.SimpleFSDirectory@C:\Jenkins\workspace\Lucene-Solr-4.x-Windows\solr\build\solr-core\test\J0\solrtest-SuggesterWFSTTest-1348312742478\index lockFactory=org.apache.lucene.store.NativeFSLockFactory@7053480c),segFN=segments_1,generation=1,filenames=[segments_1]
[junit4:junit4]   2> 		commit{dir=MockDirWrapper(org.apache.lucene.store.SimpleFSDirectory@C:\Jenkins\workspace\Lucene-Solr-4.x-Windows\solr\build\solr-core\test\J0\solrtest-SuggesterWFSTTest-1348312742478\index lockFactory=org.apache.lucene.store.NativeFSLockFactory@7053480c),segFN=segments_2,generation=2,filenames=[_0_Lucene40WithOrds_0.tii, _0.fnm, _0_Lucene40WithOrds_0.frq, _0_Memory_0.ram, _0_nrm.cfe, segments_2, _0.fdx, _0_Lucene40WithOrds_0.prx, _0_nrm.cfs, _0.si, _0_Lucene40WithOrds_0.tib, _0_Memory_1.ram, _0.fdt]
[junit4:junit4]   2> 299 T396 C15 oasc.SolrDeletionPolicy.updateCommits newest commit = 2
[junit4:junit4]   2> 299 T396 C15 oasc.SolrCore.getSearcher WARNING [collection1] PERFORMANCE WARNING: Overlapping onDeckSearchers=2
[junit4:junit4]   2> 308 T396 C15 oass.SolrIndexSearcher.<init> Opening Searcher@783242c8 main
[junit4:junit4]   2> 309 T396 C15 oass.SolrIndexSearcher.getIndexDir WARNING WARNING: Directory impl does not support setting indexDir: org.apache.lucene.store.MockDirectoryWrapper
[junit4:junit4]   2> 313 T396 C15 oasu.DirectUpdateHandler2.commit end_commit_flush
[junit4:junit4]   2> 313 T397 oasc.SolrCore.registerSearcher [collection1] Registered new searcher Searcher@4a4ee303 main{StandardDirectoryReader(segments_1:1)}
[junit4:junit4]   2> 314 T397 oashc.SpellCheckComponent$SpellCheckerListener.newSearcher Loading spell index for spellchecker: suggest
[junit4:junit4]   2> 314 T397 oasss.Suggester.reload reload()
[junit4:junit4]   2> 315 T397 oashc.SpellCheckComponent$SpellCheckerListener.newSearcher SEVERE Exception in reloading spell check index for spellchecker: suggest java.io.FileNotFoundException: C:\Jenkins\workspace\Lucene-Solr-4.x-Windows\solr\build\solr-core\test\J0\.\solrtest-SuggesterWFSTTest-1348312742478\suggest\jaspell.dat (The system cannot find the file specified)
[junit4:junit4]   2> 	at java.io.FileInputStream.open(Native Method)
[junit4:junit4]   2> 	at java.io.FileInputStream.<init>(FileInputStream.java:138)
[junit4:junit4]   2> 	at org.apache.solr.spelling.suggest.Suggester.reload(Suggester.java:161)
[junit4:junit4]   2> 	at org.apache.solr.handler.component.SpellCheckComponent$SpellCheckerListener.newSearcher(SpellCheckComponent.java:673)
[junit4:junit4]   2> 	at org.apache.solr.core.SolrCore$5.call(SolrCore.java:1481)
[junit4:junit4]   2> 	at java.util.concurrent.FutureTask$Sync.innerRun(FutureTask.java:334)
[junit4:junit4]   2> 	at java.util.concurrent.FutureTask.run(FutureTask.java:166)
[junit4:junit4]   2> 	at java.util.concurrent.ThreadPoolExecutor.runWorker(ThreadPoolExecutor.java:1110)
[junit4:junit4]   2> 	at java.util.concurrent.ThreadPoolExecutor$Worker.run(ThreadPoolExecutor.java:603)
[junit4:junit4]   2> 	at java.lang.Thread.run(Thread.java:722)
[junit4:junit4]   2> 
[junit4:junit4]   2> 318 T397 oashc.SpellCheckComponent$SpellCheckerListener.newSearcher Loading spell index for spellchecker: suggest_tst
[junit4:junit4]   2> 318 T397 oasss.Suggester.reload reload()
[junit4:junit4]   2> 319 T397 oashc.SpellCheckComponent$SpellCheckerListener.newSearcher SEVERE Exception in reloading spell check index for spellchecker: suggest_tst java.io.FileNotFoundException: C:\Jenkins\workspace\Lucene-Solr-4.x-Windows\solr\build\solr-core\test\J0\.\solrtest-SuggesterWFSTTest-1348312742478\suggest_tst\tst.dat (The system cannot find the file specified)
[junit4:junit4]   2> 	at java.io.FileInputStream.open(Native Method)
[junit4:junit4]   2> 	at java.io.FileInputStream.<init>(FileInputStream.java:138)
[junit4:junit4]   2> 	at org.apache.solr.spelling.suggest.Suggester.reload(Suggester.java:161)
[junit4:junit4]   2> 	at org.apache.solr.handler.component.SpellCheckComponent$SpellCheckerListener.newSearcher(SpellCheckComponent.java:673)
[junit4:junit4]   2> 	at org.apache.solr.core.SolrCore$5.call(SolrCore.java:1481)
[junit4:junit4]   2> 	at java.util.concurrent.FutureTask$Sync.innerRun(FutureTask.java:334)
[junit4:junit4]   2> 	at java.util.concurrent.FutureTask.run(FutureTask.java:166)
[junit4:junit4]   2> 	at java.util.concurrent.ThreadPoolExecutor.runWorker(ThreadPoolExecutor.java:1110)
[junit4:junit4]   2> 	at java.util.concurrent.ThreadPoolExecutor$Worker.run(ThreadPoolExecutor.java:603)
[junit4:junit4]   2> 	at java.lang.Thread.run(Thread.java:722)
[junit4:junit4]   2> 
[junit4:junit4]   2> 319 T397 oashc.SpellCheckComponent$SpellCheckerListener.newSearcher Loading spell index for spellchecker: suggest_fst
[junit4:junit4]   2> 319 T397 oasss.Suggester.reload reload()
[junit4:junit4]   2> 320 T397 oashc.SpellCheckComponent$SpellCheckerListener.newSearcher SEVERE Exception in reloading spell check index for spellchecker: suggest_fst java.io.FileNotFoundException: C:\Jenkins\workspace\Lucene-Solr-4.x-Windows\solr\build\solr-core\test\J0\.\solrtest-SuggesterWFSTTest-1348312742478\suggest_fst\fst.bin (The system cannot find the file specified)
[junit4:junit4]   2> 	at java.io.FileInputStream.open(Native Method)
[junit4:junit4]   2> 	at java.io.FileInputStream.<init>(FileInputStream.java:138)
[junit4:junit4]   2> 	at org.apache.solr.spelling.suggest.Suggester.reload(Suggester.java:161)
[junit4:junit4]   2> 	at org.apache.solr.handler.component.SpellCheckComponent$SpellCheckerListener.newSearcher(SpellCheckComponent.java:673)
[junit4:junit4]   2> 	at org.apache.solr.core.SolrCore$5.call(SolrCore.java:1481)
[junit4:junit4]   2> 	at java.util.concurrent.FutureTask$Sync.innerRun(FutureTask.java:334)
[junit4:junit4]   2> 	at java.util.concurrent.FutureTask.run(FutureTask.java:166)
[junit4:junit4]   2> 	at java.util.concurrent.ThreadPoolExecutor.runWorker(ThreadPoolExecutor.java:1110)
[junit4:junit4]   2> 	at java.util.concurrent.ThreadPoolExecutor$Worker.run(ThreadPoolExecutor.java:603)
[junit4:junit4]   2> 	at java.lang.Thread.run(Thread.java:722)
[junit4:junit4]   2> 
[junit4:junit4]   2> 320 T397 oashc.SpellCheckComponent$SpellCheckerListener.newSearcher Loading spell index for spellchecker: suggest_wfst
[junit4:junit4]   2> 320 T397 oasss.Suggester.reload reload()
[junit4:junit4]   2> 321 T397 oashc.SpellCheckComponent$SpellCheckerListener.newSearcher SEVERE Exception in reloading spell check index for spellchecker: suggest_wfst java.io.FileNotFoundException: C:\Jenkins\workspace\Lucene-Solr-4.x-Windows\solr\build\solr-core\test\J0\.\solrtest-SuggesterWFSTTest-1348312742478\suggest_wfst\wfst.bin (The system cannot find the file specified)
[junit4:junit4]   2> 	at java.io.FileInputStream.open(Native Method)
[junit4:junit4]   2> 	at java.io.FileInputStream.<init>(FileInputStream.java:138)
[junit4:junit4]   2> 	at org.apache.solr.spelling.suggest.Suggester.reload(Suggester.java:161)
[junit4:junit4]   2> 	at org.apache.solr.handler.component.SpellCheckComponent$SpellCheckerListener.newSearcher(SpellCheckComponent.java:673)
[junit4:junit4]   2> 	at org.apache.solr.core.SolrCore$5.call(SolrCore.java:1481)
[junit4:junit4]   2> 	at java.util.concurrent.FutureTask$Sync.innerRun(FutureTask.java:334)
[junit4:junit4]   2> 	at java.util.concurrent.FutureTask.run(FutureTask.java:166)
[junit4:junit4]   2> 	at java.util.concurrent.ThreadPoolExecutor.runWorker(ThreadPoolExecutor.java:1110)
[junit4:junit4]   2> 	at java.util.concurrent.ThreadPoolExecutor$Worker.run(ThreadPoolExecutor.java:603)
[junit4:junit4]   2> 	at java.lang.Thread.run(Thread.java:722)
[junit4:junit4]   2> 
[junit4:junit4]   2> 323 T397 oasc.SolrCore.registerSearcher [collection1] Registered new searcher Searcher@783242c8 main{StandardDirectoryReader(segments_2:3 _0(4.0.0.2):C3)}
[junit4:junit4]   2> 323 T396 C15 UPDATE [collection1] webapp=null path=null params={} {commit=} 0 39
[junit4:junit4]   2> 328 T396 C15 oasc.SolrException.log SEVERE java.lang.NullPointerException
[junit4:junit4]   2> 		at org.apache.lucene.search.suggest.fst.WFSTCompletionLookup.lookupPrefix(WFSTCompletionLookup.java:192)
[junit4:junit4]   2> 		at org.apache.lucene.search.suggest.fst.WFSTCompletionLookup.lookup(WFSTCompletionLookup.java:154)
[junit4:junit4]   2> 		at org.apache.solr.spelling.suggest.Suggester.getSuggestions(Suggester.java:190)
[junit4:junit4]   2> 		at org.apache.solr.handler.component.SpellCheckComponent.process(SpellCheckComponent.java:172)
[junit4:junit4]   2> 		at org.apache.solr.handler.component.SearchHandler.handleRequestBody(SearchHandler.java:206)
[junit4:junit4]   2> 		at org.apache.solr.handler.RequestHandlerBase.handleRequest(RequestHandlerBase.java:129)
[junit4:junit4]   2> 		at org.apache.solr.core.SolrCore.execute(SolrCore.java:1701)
[junit4:junit4]   2> 		at org.apache.solr.util.TestHarness.query(TestHarness.java:364)
[junit4:junit4]   2> 		at org.apache.solr.util.TestHarness.query(TestHarness.java:346)
[junit4:junit4]   2> 		at org.apache.solr.SolrTestCaseJ4.assertQ(SolrTestCaseJ4.java:484)
[junit4:junit4]   2> 		at org.apache.solr.SolrTestCaseJ4.assertQ(SolrTestCaseJ4.java:477)
[junit4:junit4]   2> 		at org.apache.solr.spelling.suggest.SuggesterTest.testRebuild(SuggesterTest.java:105)
[junit4:junit4]   2> 		at sun.reflect.NativeMethodAccessorImpl.invoke0(Native Method)
[junit4:junit4]   2> 		at sun.reflect.NativeMethodAccessorImpl.invoke(NativeMethodAccessorImpl.java:57)
[junit4:junit4]   2> 		at sun.reflect.DelegatingMethodAccessorImpl.invoke(DelegatingMethodAccessorImpl.java:43)
[junit4:junit4]   2> 		at java.lang.reflect.Method.invoke(Method.java:601)
[junit4:junit4]   2> 		at com.carrotsearch.randomizedtesting.RandomizedRunner.invoke(RandomizedRunner.java:1559)
[junit4:junit4]   2> 		at com.carrotsearch.randomizedtesting.RandomizedRunner.access$600(RandomizedRunner.java:79)
[junit4:junit4]   2> 		at com.carrotsearch.randomizedtesting.RandomizedRunner$6.evaluate(RandomizedRunner.java:737)
[junit4:junit4]   2> 		at com.carrotsearch.randomizedtesting.RandomizedRunner$7.evaluate(RandomizedRunner.java:773)
[junit4:junit4]   2> 		at com.carrotsearch.randomizedtesting.RandomizedRunner$8.evaluate(RandomizedRunner.java:787)
[junit4:junit4]   2> 		at com.carrotsearch.randomizedtesting.rules.SystemPropertiesRestoreRule$1.evaluate(SystemPropertiesRestoreRule.java:53)
[junit4:junit4]   2> 		at org.apache.lucene.util.TestRuleSetupTeardownChained$1.evaluate(TestRuleSetupTeardownChained.java:50)
[junit4:junit4]   2> 		at org.apache.lucene.util.TestRuleFieldCacheSanity$1.evaluate(TestRuleFieldCacheSanity.java:51)
[junit4:junit4]   2> 		at org.apache.lucene.util.AbstractBeforeAfterRule$1.evaluate(AbstractBeforeAfterRule.java:45)
[junit4:junit4]   2> 		at com.carrotsearch.randomizedtesting.rules.SystemPropertiesInvariantRule$1.evaluate(SystemPropertiesInvariantRule.java:55)
[junit4:junit4]   2> 		at org.apache.lucene.util.TestRuleThreadAndTestName$1.evaluate(TestRuleThreadAndTestName.java:48)
[junit4:junit4]   2> 		at org.apache.lucene.util.TestRuleIgnoreAfterMaxFailures$1.evaluate(TestRuleIgnoreAfterMaxFailures.java:70)
[junit4:junit4]   2> 		at org.apache.lucene.util.TestRuleMarkFailure$1.evaluate(TestRuleMarkFailure.java:48)
[junit4:junit4]   2> 		at com.carrotsearch.randomizedtesting.rules.StatementAdapter.evaluate(StatementAdapter.java:36)
[junit4:junit4]   2> 		at com.carrotsearch.randomizedtesting.ThreadLeakControl$StatementRunner.run(ThreadLeakControl.java:358)
[junit4:junit4]   2> 		at com.carrotsearch.randomizedtesting.ThreadLeakControl.forkTimeoutingTask(ThreadLeakControl.java:782)
[junit4:junit4]   2> 		at com.carrotsearch.randomizedtesting.ThreadLeakControl$3.evaluate(ThreadLeakControl.java:442)
[junit4:junit4]   2> 		at com.carrotsearch.randomizedtesting.RandomizedRunner.runSingleTest(RandomizedRunner.java:746)
[junit4:junit4]   2> 		at com.carrotsearch.randomizedtesting.RandomizedRunner$3.evaluate(RandomizedRunner.java:648)
[junit4:junit4]   2> 		at com.carrotsearch.randomizedtesting.RandomizedRunner$4.evaluate(RandomizedRunner.java:682)
[junit4:junit4]   2> 		at com.carrotsearch.randomizedtesting.RandomizedRunner$5.evaluate(RandomizedRunner.java:693)
[junit4:junit4]   2> 		at com.carrotsearch.randomizedtesting.rules.StatementAdapter.evaluate(StatementAdapter.java:36)
[junit4:junit4]   2> 		at com.carrotsearch.randomizedtesting.rules.SystemPropertiesRestoreRule$1.evaluate(SystemPropertiesRestoreRule.java:53)
[junit4:junit4]   2> 		at org.apache.lucene.util.AbstractBeforeAfterRule$1.evaluate(AbstractBeforeAfterRule.java:45)
[junit4:junit4]   2> 		at org.apache.lucene.util.TestRuleStoreClassName$1.evaluate(TestRuleStoreClassName.java:42)
[junit4:junit4]   2> 		at com.carrotsearch.randomizedtesting.rules.SystemPropertiesInvariantRule$1.evaluate(SystemPropertiesInvariantRule.java:55)
[junit4:junit4]   2> 		at com.carrotsearch.randomizedtesting.rules.NoShadowingOrOverridesOnMethodsRule$1.evaluate(NoShadowingOrOverridesOnMethodsRule.java:39)
[junit4:junit4]   2> 		at com.carrotsearch.randomizedtesting.rules.NoShadowingOrOverridesOnMethodsRule$1.evaluate(NoShadowingOrOverridesOnMethodsRule.java:39)
[junit4:junit4]   2> 		at com.carrotsearch.randomizedtesting.rules.StatementAdapter.evaluate(StatementAdapter.java:36)
[junit4:junit4]   2> 		at org.apache.lucene.util.TestRuleAssertionsRequired$1.evaluate(TestRuleAssertionsRequired.java:43)
[junit4:junit4]   2> 		at org.apache.lucene.util.TestRuleMarkFailure$1.evaluate(TestRuleMarkFailure.java:48)
[junit4:junit4]   2> 		at org.apache.lucene.util.TestRuleIgnoreAfterMaxFailures$1.evaluate(TestRuleIgnoreAfterMaxFailures.java:70)
[junit4:junit4]   2> 		at org.apache.lucene.util.TestRuleIgnoreTestSuites$1.evaluate(TestRuleIgnoreTestSuites.java:55)
[junit4:junit4]   2> 		at com.carrotsearch.randomizedtesting.rules.StatementAdapter.evaluate(StatementAdapter.java:36)
[junit4:junit4]   2> 		at com.carrotsearch.randomizedtesting.ThreadLeakControl$StatementRunner.run(ThreadLeakControl.java:358)
[junit4:junit4]   2> 		at java.lang.Thread.run(Thread.java:722)
[junit4:junit4]   2> 	
[junit4:junit4]   2> 329 T396 C15 REQ [collection1] webapp=null path=null params={q=ac&spellcheck.count=2&qt=/suggest_wfst&spellcheck.onlyMorePopular=true} status=500 QTime=2 
[junit4:junit4]   2> 329 T396 oasc.SolrException.log SEVERE REQUEST FAILED: q=ac&spellcheck.count=2&qt=/suggest_wfst&spellcheck.onlyMorePopular=true:java.lang.NullPointerException
[junit4:junit4]   2> 		at org.apache.lucene.search.suggest.fst.WFSTCompletionLookup.lookupPrefix(WFSTCompletionLookup.java:192)
[junit4:junit4]   2> 		at org.apache.lucene.search.suggest.fst.WFSTCompletionLookup.lookup(WFSTCompletionLookup.java:154)
[junit4:junit4]   2> 		at org.apache.solr.spelling.suggest.Suggester.getSuggestions(Suggester.java:190)
[junit4:junit4]   2> 		at org.apache.solr.handler.component.SpellCheckComponent.process(SpellCheckComponent.java:172)
[junit4:junit4]   2> 		at org.apache.solr.handler.component.SearchHandler.handleRequestBody(SearchHandler.java:206)
[junit4:junit4]   2> 		at org.apache.solr.handler.RequestHandlerBase.handleRequest(RequestHandlerBase.java:129)
[junit4:junit4]   2> 		at org.apache.solr.core.SolrCore.execute(SolrCore.java:1701)
[junit4:junit4]   2> 		at org.apache.solr.util.TestHarness.query(TestHarness.java:364)
[junit4:junit4]   2> 		at org.apache.solr.util.TestHarness.query(TestHarness.java:346)
[junit4:junit4]   2> 		at org.apache.solr.SolrTestCaseJ4.assertQ(SolrTestCaseJ4.java:484)
[junit4:junit4]   2> 		at org.apache.solr.SolrTestCaseJ4.assertQ(SolrTestCaseJ4.java:477)
[junit4:junit4]   2> 		at org.apache.solr.spelling.suggest.SuggesterTest.testRebuild(SuggesterTest.java:105)
[junit4:junit4]   2> 		at sun.reflect.NativeMethodAccessorImpl.invoke0(Native Method)
[junit4:junit4]   2> 		at sun.reflect.NativeMethodAccessorImpl.invoke(NativeMethodAccessorImpl.java:57)
[junit4:junit4]   2> 		at sun.reflect.DelegatingMethodAccessorImpl.invoke(DelegatingMethodAccessorImpl.java:43)
[junit4:junit4]   2> 		at java.lang.reflect.Method.invoke(Method.java:601)
[junit4:junit4]   2> 		at com.carrotsearch.randomizedtesting.RandomizedRunner.invoke(RandomizedRunner.java:1559)
[junit4:junit4]   2> 		at com.carrotsearch.randomizedtesting.RandomizedRunner.access$600(RandomizedRunner.java:79)
[junit4:junit4]   2> 		at com.carrotsearch.randomizedtesting.RandomizedRunner$6.evaluate(RandomizedRunner.java:737)
[junit4:junit4]   2> 		at com.carrotsearch.randomizedtesting.RandomizedRunner$7.evaluate(RandomizedRunner.java:773)
[junit4:junit4]   2> 		at com.carrotsearch.randomizedtesting.RandomizedRunner$8.evaluate(RandomizedRunner.java:787)
[junit4:junit4]   2> 		at com.carrotsearch.randomizedtesting.rules.SystemPropertiesRestoreRule$1.evaluate(SystemPropertiesRestoreRule.java:53)
[junit4:junit4]   2> 		at org.apache.lucene.util.TestRuleSetupTeardownChained$1.evaluate(TestRuleSetupTeardownChained.java:50)
[junit4:junit4]   2> 		at org.apache.lucene.util.TestRuleFieldCacheSanity$1.evaluate(TestRuleFieldCacheSanity.java:51)
[junit4:junit4]   2> 		at org.apache.lucene.util.AbstractBeforeAfterRule$1.evaluate(AbstractBeforeAfterRule.java:45)
[junit4:junit4]   2> 		at com.carrotsearch.randomizedtesting.rules.SystemPropertiesInvariantRule$1.evaluate(SystemPropertiesInvariantRule.java:55)
[junit4:junit4]   2> 		at org.apache.lucene.util.TestRuleThreadAndTestName$1.evaluate(TestRuleThreadAndTestName.java:48)
[junit4:junit4]   2> 		at org.apache.lucene.util.TestRuleIgnoreAfterMaxFailures$1.evaluate(TestRuleIgnoreAfterMaxFailures.java:70)
[junit4:junit4]   2> 		at org.apache.lucene.util.TestRuleMarkFailure$1.evaluate(TestRuleMarkFailure.java:48)
[junit4:junit4]   2> 		at com.carrotsearch.randomizedtesting.rules.StatementAdapter.evaluate(StatementAdapter.java:36)
[junit4:junit4]   2> 		at com.carrotsearch.randomizedtesting.ThreadLeakControl$StatementRunner.run(ThreadLeakControl.java:358)
[junit4:junit4]   2> 		at com.carrotsearch.randomizedtesting.ThreadLeakControl.forkTimeoutingTask(ThreadLeakControl.java:782)
[junit4:junit4]   2> 		at com.carrotsearch.randomizedtesting.ThreadLeakControl$3.evaluate(ThreadLeakControl.java:442)
[junit4:junit4]   2> 		at com.carrotsearch.randomizedtesting.RandomizedRunner.runSingleTest(RandomizedRunner.java:746)
[junit4:junit4]   2> 		at com.carrotsearch.randomizedtesting.RandomizedRunner$3.evaluate(RandomizedRunner.java:648)
[junit4:junit4]   2> 		at com.carrotsearch.randomizedtesting.RandomizedRunner$4.evaluate(RandomizedRunner.java:682)
[junit4:junit4]   2> 		at com.carrotsearch.randomizedtesting.RandomizedRunner$5.evaluate(RandomizedRunner.java:693)
[junit4:junit4]   2> 		at com.carrotsearch.randomizedtesting.rules.StatementAdapter.evaluate(StatementAdapter.java:36)
[junit4:junit4]   2> 		at com.carrotsearch.randomizedtesting.rules.SystemPropertiesRestoreRule$1.evaluate(SystemPropertiesRestoreRule.java:53)
[junit4:junit4]   2> 		at org.apache.lucene.util.AbstractBeforeAfterRule$1.evaluate(AbstractBeforeAfterRule.java:45)
[junit4:junit4]   2> 		at org.apache.lucene.util.TestRuleStoreClassName$1.evaluate(TestRuleStoreClassName.java:42)
[junit4:junit4]   2> 		at com.carrotsearch.randomizedtesting.rules.SystemPropertiesInvariantRule$1.evaluate(SystemPropertiesInvariantRule.java:55)
[junit4:junit4]   2> 		at com.carrotsearch.randomizedtesting.rules.NoShadowingOrOverridesOnMethodsRule$1.evaluate(NoShadowingOrOverridesOnMethodsRule.java:39)
[junit4:junit4]   2> 		at com.carrotsearch.randomizedtesting.rules.NoShadowingOrOverridesOnMethodsRule$1.evaluate(NoShadowingOrOverridesOnMethodsRule.java:39)
[junit4:junit4]   2> 		at com.carrotsearch.randomizedtesting.rules.StatementAdapter.evaluate(StatementAdapter.java:36)
[junit4:junit4]   2> 		at org.apache.lucene.util.TestRuleAssertionsRequired$1.evaluate(TestRuleAssertionsRequired.java:43)
[junit4:junit4]   2> 		at org.apache.lucene.util.TestRuleMarkFailure$1.evaluate(TestRuleMarkFailure.java:48)
[junit4:junit4]   2> 		at org.apache.lucene.util.TestRuleIgnoreAfterMaxFailures$1.evaluate(TestRuleIgnoreAfterMaxFailures.java:70)
[junit4:junit4]   2> 		at org.apache.lucene.util.TestRuleIgnoreTestSuites$1.evaluate(TestRuleIgnoreTestSuites.java:55)
[junit4:junit4]   2> 		at com.carrotsearch.randomizedtesting.rules.StatementAdapter.evaluate(StatementAdapter.java:36)
[junit4:junit4]   2> 		at com.carrotsearch.randomizedtesting.ThreadLeakControl$StatementRunner.run(ThreadLeakControl.java:358)
[junit4:junit4]   2> 		at java.lang.Thread.run(Thread.java:722)
[junit4:junit4]   2> 	
[junit4:junit4]   2> 330 T396 oas.SolrTestCaseJ4.tearDown ###Ending testRebuild
[junit4:junit4]   2> NOTE: reproduce with: ant test  -Dtestcase=SuggesterWFSTTest -Dtests.method=testRebuild -Dtests.seed=C5D3563925F8338A -Dtests.slow=true -Dtests.locale=es_AR -Dtests.timezone=Pacific/Rarotonga -Dtests.file.encoding=ISO-8859-1
[junit4:junit4] ERROR   0.11s | SuggesterWFSTTest.testRebuild <<<
[junit4:junit4]    > Throwable #1: java.lang.RuntimeException: Exception during query
[junit4:junit4]    > 	at __randomizedtesting.SeedInfo.seed([C5D3563925F8338A:9EF6F47A11F84910]:0)
[junit4:junit4]    > 	at org.apache.solr.SolrTestCaseJ4.assertQ(SolrTestCaseJ4.java:510)
[junit4:junit4]    > 	at org.apache.solr.SolrTestCaseJ4.assertQ(SolrTestCaseJ4.java:477)
[junit4:junit4]    > 	at org.apache.solr.spelling.suggest.SuggesterTest.testRebuild(SuggesterTest.java:105)
[junit4:junit4]    > 	at sun.reflect.NativeMethodAccessorImpl.invoke0(Native Method)
[junit4:junit4]    > 	at sun.reflect.NativeMethodAccessorImpl.invoke(NativeMethodAccessorImpl.java:57)
[junit4:junit4]    > 	at sun.reflect.DelegatingMethodAccessorImpl.invoke(DelegatingMethodAccessorImpl.java:43)
[junit4:junit4]    > 	at java.lang.reflect.Method.invoke(Method.java:601)
[junit4:junit4]    > 	at com.carrotsearch.randomizedtesting.RandomizedRunner.invoke(RandomizedRunner.java:1559)
[junit4:junit4]    > 	at com.carrotsearch.randomizedtesting.RandomizedRunner.access$600(RandomizedRunner.java:79)
[junit4:junit4]    > 	at com.carrotsearch.randomizedtesting.RandomizedRunner$6.evaluate(RandomizedRunner.java:737)
[junit4:junit4]    > 	at com.carrotsearch.randomizedtesting.RandomizedRunner$7.evaluate(RandomizedRunner.java:773)
[junit4:junit4]    > 	at com.carrotsearch.randomizedtesting.RandomizedRunner$8.evaluate(RandomizedRunner.java:787)
[junit4:junit4]    > 	at com.carrotsearch.randomizedtesting.rules.SystemPropertiesRestoreRule$1.evaluate(SystemPropertiesRestoreRule.java:53)
[junit4:junit4]    > 	at org.apache.lucene.util.TestRuleSetupTeardownChained$1.evaluate(TestRuleSetupTeardownChained.java:50)
[junit4:junit4]    > 	at org.apache.lucene.util.TestRuleFieldCacheSanity$1.evaluate(TestRuleFieldCacheSanity.java:51)
[junit4:junit4]    > 	at org.apache.lucene.util.AbstractBeforeAfterRule$1.evaluate(AbstractBeforeAfterRule.java:45)
[junit4:junit4]    > 	at com.carrotsearch.randomizedtesting.rules.SystemPropertiesInvariantRule$1.evaluate(SystemPropertiesInvariantRule.java:55)
[junit4:junit4]    > 	at org.apache.lucene.util.TestRuleThreadAndTestName$1.evaluate(TestRuleThreadAndTestName.java:48)
[junit4:junit4]    > 	at org.apache.lucene.util.TestRuleIgnoreAfterMaxFailures$1.evaluate(TestRuleIgnoreAfterMaxFailures.java:70)
[junit4:junit4]    > 	at org.apache.lucene.util.TestRuleMarkFailure$1.evaluate(TestRuleMarkFailure.java:48)
[junit4:junit4]    > 	at com.carrotsearch.randomizedtesting.rules.StatementAdapter.evaluate(StatementAdapter.java:36)
[junit4:junit4]    > 	at com.carrotsearch.randomizedtesting.ThreadLeakControl$StatementRunner.run(ThreadLeakControl.java:358)
[junit4:junit4]    > 	at com.carrotsearch.randomizedtesting.ThreadLeakControl.forkTimeoutingTask(ThreadLeakControl.java:782)
[junit4:junit4]    > 	at com.carrotsearch.randomizedtesting.ThreadLeakControl$3.evaluate(ThreadLeakControl.java:442)
[junit4:junit4]    > 	at com.carrotsearch.randomizedtesting.RandomizedRunner.runSingleTest(RandomizedRunner.java:746)
[junit4:junit4]    > 	at com.carrotsearch.randomizedtesting.RandomizedRunner$3.evaluate(RandomizedRunner.java:648)
[junit4:junit4]    > 	at com.carrotsearch.randomizedtesting.RandomizedRunner$4.evaluate(RandomizedRunner.java:682)
[junit4:junit4]    > 	at com.carrotsearch.randomizedtesting.RandomizedRunner$5.evaluate(RandomizedRunner.java:693)
[junit4:junit4]    > 	at com.carrotsearch.randomizedtesting.rules.StatementAdapter.evaluate(StatementAdapter.java:36)
[junit4:junit4]    > 	at com.carrotsearch.randomizedtesting.rules.SystemPropertiesRestoreRule$1.evaluate(SystemPropertiesRestoreRule.java:53)
[junit4:junit4]    > 	at org.apache.lucene.util.AbstractBeforeAfterRule$1.evaluate(AbstractBeforeAfterRule.java:45)
[junit4:junit4]    > 	at org.apache.lucene.util.TestRuleStoreClassName$1.evaluate(TestRuleStoreClassName.java:42)
[junit4:junit4]    > 	at com.carrotsearch.randomizedtesting.rules.SystemPropertiesInvariantRule$1.evaluate(SystemPropertiesInvariantRule.java:55)
[junit4:junit4]    > 	at com.carrotsearch.randomizedtesting.rules.NoShadowingOrOverridesOnMethodsRule$1.evaluate(NoShadowingOrOverridesOnMethodsRule.java:39)
[junit4:junit4]    > 	at com.carrotsearch.randomizedtesting.rules.NoShadowingOrOverridesOnMethodsRule$1.evaluate(NoShadowingOrOverridesOnMethodsRule.java:39)
[junit4:junit4]    > 	at com.carrotsearch.randomizedtesting.rules.StatementAdapter.evaluate(StatementAdapter.java:36)
[junit4:junit4]    > 	at org.apache.lucene.util.TestRuleAssertionsRequired$1.evaluate(TestRuleAssertionsRequired.java:43)
[junit4:junit4]    > 	at org.apache.lucene.util.TestRuleMarkFailure$1.evaluate(TestRuleMarkFailure.java:48)
[junit4:junit4]    > 	at org.apache.lucene.util.TestRuleIgnoreAfterMaxFailures$1.evaluate(TestRuleIgnoreAfterMaxFailures.java:70)
[junit4:junit4]    > 	at org.apache.lucene.util.TestRuleIgnoreTestSuites$1.evaluate(TestRuleIgnoreTestSuites.java:55)
[junit4:junit4]    > 	at com.carrotsearch.randomizedtesting.rules.StatementAdapter.evaluate(StatementAdapter.java:36)
[junit4:junit4]    > 	at com.carrotsearch.randomizedtesting.ThreadLeakControl$StatementRunner.run(ThreadLeakControl.java:358)
[junit4:junit4]    > 	at java.lang.Thread.run(Thread.java:722)
[junit4:junit4]    > Caused by: java.lang.NullPointerException
[junit4:junit4]    > 	at org.apache.lucene.search.suggest.fst.WFSTCompletionLookup.lookupPrefix(WFSTCompletionLookup.java:192)
[junit4:junit4]    > 	at org.apache.lucene.search.suggest.fst.WFSTCompletionLookup.lookup(WFSTCompletionLookup.java:154)
[junit4:junit4]    > 	at org.apache.solr.spelling.suggest.Suggester.getSuggestions(Suggester.java:190)
[junit4:junit4]    > 	at org.apache.solr.handler.component.SpellCheckComponent.process(SpellCheckComponent.java:172)
[junit4:junit4]    > 	at org.apache.solr.handler.component.SearchHandler.handleRequestBody(SearchHandler.java:206)
[junit4:junit4]    > 	at org.apache.solr.handler.RequestHandlerBase.handleRequest(RequestHandlerBase.java:129)
[junit4:junit4]    > 	at org.apache.solr.core.SolrCore.execute(SolrCore.java:1701)
[junit4:junit4]    > 	at org.apache.solr.util.TestHarness.query(TestHarness.java:364)
[junit4:junit4]    > 	at org.apache.solr.util.TestHarness.query(TestHarness.java:346)
[junit4:junit4]    > 	at org.apache.solr.SolrTestCaseJ4.assertQ(SolrTestCaseJ4.java:484)
[junit4:junit4]    > 	... 42 more
[junit4:junit4]   2> 350 T396 oas.SolrTestCaseJ4.setUp ###Starting testSuggestions
[junit4:junit4]   2> 356 T396 C15 UPDATE [collection1] webapp=null path=null params={} {add=[1]} 0 2
[junit4:junit4]   2> 362 T396 C15 UPDATE [collection1] webapp=null path=null params={} {add=[2]} 0 0
[junit4:junit4]   2> 381 T396 C15 UPDATE [collection1] webapp=null path=null params={} {add=[3]} 0 1
[junit4:junit4]   2> 386 T396 C15 oasu.DirectUpdateHandler2.commit start commit{flags=0,_version_=0,optimize=false,openSearcher=true,waitSearcher=true,expungeDeletes=false,softCommit=false}
[junit4:junit4]   2> 404 T396 C15 oasc.SolrDeletionPolicy.onCommit SolrDeletionPolicy.onCommit: commits:num=2
[junit4:junit4]   2> 		commit{dir=MockDirWrapper(org.apache.lucene.store.SimpleFSDirectory@C:\Jenkins\workspace\Lucene-Solr-4.x-Windows\solr\build\solr-core\test\J0\solrtest-SuggesterWFSTTest-1348312742478\index lockFactory=org.apache.lucene.store.NativeFSLockFactory@7053480c),segFN=segments_2,generation=2,filenames=[_0_Lucene40WithOrds_0.tii, _0.fnm, _0_Lucene40WithOrds_0.frq, _0_Memory_0.ram, _0_nrm.cfe, segments_2, _0.fdx, _0_Lucene40WithOrds_0.prx, _0_nrm.cfs, _0.si, _0_Lucene40WithOrds_0.tib, _0_Memory_1.ram, _0.fdt]
[junit4:junit4]   2> 		commit{dir=MockDirWrapper(org.apache.lucene.store.SimpleFSDirectory@C:\Jenkins\workspace\Lucene-Solr-4.x-Windows\solr\build\solr-core\test\J0\solrtest-SuggesterWFSTTest-1348312742478\index lockFactory=org.apache.lucene.store.NativeFSLockFactory@7053480c),segFN=segments_3,generation=3,filenames=[_1.fdx, _1_Lucene40WithOrds_0.frq, _1_nrm.cfs, _1_Memory_0.ram, _1.fdt, _1_Lucene40WithOrds_0.tib, _1_Memory_1.ram, _1.si, _1_Lucene40WithOrds_0.prx, _1_Lucene40WithOrds_0.tii, _1.fnm, segments_3, _1_nrm.cfe]
[junit4:junit4]   2> 405 T396 C15 oasc.SolrDeletionPolicy.updateCommits newest commit = 3
[junit4:junit4]   2> 420 T396 C15 oass.SolrIndexSearcher.<init> Opening Searcher@405f76f5 main
[junit4:junit4]   2> 420 T396 C15 oass.SolrIndexSearcher.getIndexDir WARNING WARNING: Directory impl does not support setting indexDir: org.apache.lucene.store.MockDirectoryWrapper
[junit4:junit4]   2> 420 T396 C15 oasu.DirectUpdateHandler2.commit end_commit_flush
[junit4:junit4]   2> 420 T397 oashc.SpellCheckComponent$SpellCheckerListener.buildSpellIndex Building spell index for spell checker: suggest
[junit4:junit4]   2> 421 T397 oasss.Suggester.build build()
[junit4:junit4]   2> 425 T397 oasss.Suggester.build Stored suggest data to: C:\Jenkins\workspace\Lucene-Solr-4.x-Windows\solr\build\solr-core\test\J0\.\solrtest-SuggesterWFSTTest-1348312742478\suggest\jaspell.dat
[junit4:junit4]   2> 425 T397 oashc.SpellCheckComponent$SpellCheckerListener.buildSpellIndex Building spell index for spell checker: suggest_tst
[junit4:junit4]   2> 425 T397 oasss.Suggester.build build()
[junit4:junit4]   2> 436 T397 oasss.Suggester.build Stored suggest data to: C:\Jenkins\workspace\Lucene-Solr-4.x-Windows\solr\build\solr-core\test\J0\.\solrtest-SuggesterWFSTTest-1348312742478\suggest_tst\tst.dat
[junit4:junit4]   2> 436 T397 oashc.SpellCheckComponent$SpellCheckerListener.buildSpellIndex Building spell index for spell checker: suggest_fst
[junit4:junit4]   2> 436 T397 oasss.Suggester.build build()
[junit4:junit4]   2> 453 T397 oasss.Suggester.build Stored suggest data to: C:\Jenkins\workspace\Lucene-Solr-4.x-Windows\solr\build\solr-core\test\J0\.\solrtest-SuggesterWFSTTest-1348312742478\suggest_fst\fst.bin
[junit4:junit4]   2> 453 T397 oashc.SpellCheckComponent$SpellCheckerListener.buildSpellIndex Building spell index for spell checker: suggest_wfst
[junit4:junit4]   2> 454 T397 oasss.Suggester.build build()
[junit4:junit4]   2> 463 T397 oasss.Suggester.build Stored suggest data to: C:\Jenkins\workspace\Lucene-Solr-4.x-Windows\solr\build\solr-core\test\J0\.\solrtest-SuggesterWFSTTest-1348312742478\suggest_wfst\wfst.bin
[junit4:junit4]   2> 464 T397 oasc.SolrCore.registerSearcher [collection1] Registered new searcher Searcher@405f76f5 main{StandardDirectoryReader(segments_3:7 _1(4.0.0.2):C3)}
[junit4:junit4]   2> 464 T396 C15 UPDATE [collection1] webapp=null path=null params={} {commit=} 0 78
[junit4:junit4]   2> 481 T396 C15 REQ [collection1] webapp=null path=null params={q=ac&spellcheck.count=2&qt=/suggest_wfst&spellcheck.onlyMorePopular=true} status=0 QTime=12 
[junit4:junit4]   2> 485 T396 oas.SolrTestCaseJ4.tearDown ###Ending testSuggestions
[junit4:junit4]   2> 490 T396 oas.SolrTestCaseJ4.setUp ###Starting testReload
[junit4:junit4]   2> 495 T396 C15 UPDATE [collection1] webapp=null path=null params={} {add=[1]} 0 1
[junit4:junit4]   2> 501 T396 C15 UPDATE [collection1] webapp=null path=null params={} {add=[2]} 0 0
[junit4:junit4]   2> 507 T396 C15 UPDATE [collection1] webapp=null path=null params={} {add=[3]} 0 1
[junit4:junit4]   2> 512 T396 C15 oasu.DirectUpdateHandler2.commit start commit{flags=0,_version_=0,optimize=false,openSearcher=true,waitSearcher=true,expungeDeletes=false,softCommit=false}
[junit4:junit4]   2> 538 T396 C15 oasc.SolrDeletionPolicy.onCommit SolrDeletionPolicy.onCommit: commits:num=2
[junit4:junit4]   2> 		commit{dir=MockDirWrapper(org.apache.lucene.store.SimpleFSDirectory@C:\Jenkins\workspace\Lucene-Solr-4.x-Windows\solr\build\solr-core\test\J0\solrtest-SuggesterWFSTTest-1348312742478\index lockFactory=org.apache.lucene.store.NativeFSLockFactory@7053480c),segFN=segments_3,generation=3,filenames=[_1.fdx, _1_Lucene40WithOrds_0.frq, _1_nrm.cfs, _1_Memory_0.ram, _1.fdt, _1_Lucene40WithOrds_0.tib, _1_Memory_1.ram, _1.si, _1_Lucene40WithOrds_0.prx, _1_Lucene40WithOrds_0.tii, _1.fnm, segments_3, _1_nrm.cfe]
[junit4:junit4]   2> 		commit{dir=MockDirWrapper(org.apache.lucene.store.SimpleFSDirectory@C:\Jenkins\workspace\Lucene-Solr-4.x-Windows\solr\build\solr-core\test\J0\solrtest-SuggesterWFSTTest-1348312742478\index lockFactory=org.apache.lucene.store.NativeFSLockFactory@7053480c),segFN=segments_4,generation=4,filenames=[_2.si, _2_Lucene40WithOrds_0.tii, _2_nrm.cfe, _2_Lucene40WithOrds_0.prx, _2_Memory_1.ram, _2_Lucene40WithOrds_0.frq, _2.fdt, _2_Lucene40WithOrds_0.tib, _2_Memory_0.ram, _2_nrm.cfs, _2.fdx, _2.fnm, segments_4]
[junit4:junit4]   2> 538 T396 C15 oasc.SolrDeletionPolicy.updateCommits newest commit = 4
[junit4:junit4]   2> 554 T396 C15 oass.SolrIndexSearcher.<init> Opening Searcher@1b3ac255 main
[junit4:junit4]   2> 554 T396 C15 oass.SolrIndexSearcher.getIndexDir WARNING WARNING: Directory impl does not support setting indexDir: org.apache.lucene.store.MockDirectoryWrapper
[junit4:junit4]   2> 554 T396 C15 oasu.DirectUpdateHandler2.commit end_commit_flush
[junit4:junit4]   2> 554 T397 oashc.SpellCheckComponent$SpellCheckerListener.buildSpellIndex Building spell index for spell checker: suggest
[junit4:junit4]   2> 555 T397 oasss.Suggester.build build()
[junit4:junit4]   2> 559 T397 oasss.Suggester.build Stored suggest data to: C:\Jenkins\workspace\Lucene-Solr-4.x-Windows\solr\build\solr-core\test\J0\.\solrtest-SuggesterWFSTTest-1348312742478\suggest\jaspell.dat
[junit4:junit4]   2> 560 T397 oashc.SpellCheckComponent$SpellCheckerListener.buildSpellIndex Building spell index for spell checker: suggest_tst
[junit4:junit4]   2> 560 T397 oasss.Suggester.build build()
[junit4:junit4]   2> 571 T397 oasss.Suggester.build Stored suggest data to: C:\Jenkins\workspace\Lucene-Solr-4.x-Windows\solr\build\solr-core\test\J0\.\solrtest-SuggesterWFSTTest-1348312742478\suggest_tst\tst.dat
[junit4:junit4]   2> 571 T397 oashc.SpellCheckComponent$SpellCheckerListener.buildSpellIndex Building spell index for spell checker: suggest_fst
[junit4:junit4]   2> 571 T397 oasss.Suggester.build build()
[junit4:junit4]   2> 588 T397 oasss.Suggester.build Stored suggest data to: C:\Jenkins\workspace\Lucene-Solr-4.x-Windows\solr\build\solr-core\test\J0\.\solrtest-SuggesterWFSTTest-1348312742478\suggest_fst\fst.bin
[junit4:junit4]   2> 588 T397 oashc.SpellCheckComponent$SpellCheckerListener.buildSpellIndex Building spell index for spell checker: suggest_wfst
[junit4:junit4]   2> 588 T397 oasss.Suggester.build build()
[junit4:junit4]   2> 597 T397 oasss.Suggester.build Stored suggest data to: C:\Jenkins\workspace\Lucene-Solr-4.x-Windows\solr\build\solr-core\test\J0\.\solrtest-SuggesterWFSTTest-1348312742478\suggest_wfst\wfst.bin
[junit4:junit4]   2> 597 T397 oasc.SolrCore.registerSearcher [collection1] Registered new searcher Searcher@1b3ac255 main{StandardDirectoryReader(segments_4:11 _2(4.0.0.2):C3)}
[junit4:junit4]   2> 598 T396 C15 UPDATE [collection1] webapp=null path=null params={} {commit=} 0 86
[junit4:junit4]   2> 603 T396 oas.SolrTestCaseJ4.deleteCore ###deleteCore
[junit4:junit4]   2> 603 T396 oasc.CoreContainer.shutdown Shutting down CoreContainer instance=1970228286
[junit4:junit4]   2> 608 T396 oasc.SolrCore.close [collection1]  CLOSING SolrCore org.apache.solr.core.SolrCore@1fceb2bd
[junit4:junit4]   2> 609 T396 oasc.SolrCore.closeSearcher [collection1] Closing main searcher on request.
[junit4:junit4]   2> 609 T396 oasu.DirectUpdateHandler2.close closing DirectUpdateHandler2{commits=3,autocommits=0,soft autocommits=0,optimizes=0,rollbacks=0,expungeDeletes=0,docsPending=0,adds=0,deletesById=0,deletesByQuery=0,errors=0,cumulative_adds=9,cumulative_deletesById=0,cumulative_deletesByQuery=0,cumulative_errors=0}
[junit4:junit4]   2> 609 T396 oasu.DefaultSolrCoreState.decref SolrCoreState ref count has reached 0 - closing IndexWriter
[junit4:junit4]   2> 624 T396 oasu.DefaultSolrCoreState.decref Closing SolrCoreState - canceling any ongoing recovery
[junit4:junit4]   2> NOTE: per solr.test.leavedatadir, dataDir will not be removed: C:\Jenkins\workspace\Lucene-Solr-4.x-Windows\solr\build\solr-core\test\J0\.\solrtest-SuggesterWFSTTest-1348312742478
[junit4:junit4]   2> 624 T396 oas.SolrTestCaseJ4.initCore ####initCore
[junit4:junit4]   2> 624 T396 oasc.SolrResourceLoader.<init> new SolrResourceLoader for directory: 'C:\Jenkins\workspace\Lucene-Solr-4.x-Windows\solr\build\solr-core\test-files\solr\collection1\'
[junit4:junit4]   2> 627 T396 oasc.SolrResourceLoader.replaceClassLoader Adding 'file:/C:/Jenkins/workspace/Lucene-Solr-4.x-Windows/solr/build/solr-core/test-files/solr/collection1/lib/classes/' to classloader
[junit4:junit4]   2> 628 T396 oasc.SolrResourceLoader.replaceClassLoader Adding 'file:/C:/Jenkins/workspace/Lucene-Solr-4.x-Windows/solr/build/solr-core/test-files/solr/collection1/lib/README' to classloader
[junit4:junit4]   2> 683 T396 oasc.SolrConfig.<init> Using Lucene MatchVersion: LUCENE_40
[junit4:junit4]   2> 741 T396 oasc.SolrConfig.<init> Loaded SolrConfig: solrconfig-spellchecker.xml
[junit4:junit4]   2> 742 T396 oass.IndexSchema.readSchema Reading Solr Schema
[junit4:junit4]   2> 746 T396 oass.IndexSchema.readSchema Schema name=test
[junit4:junit4]   2> 1341 T396 oass.OpenExchangeRatesOrgProvider.init Initialized with rates=open-exchange-rates.json, refreshInterval=1440.
[junit4:junit4]   2> 1352 T396 oass.IndexSchema.readSchema default search field in schema is text
[junit4:junit4]   2> 1356 T396 oass.IndexSchema.readSchema unique key field: id
[junit4:junit4]   2> 1367 T396 oass.FileExchangeRateProvider.reload Reloading exchange rates from file currency.xml
[junit4:junit4]   2> 1373 T396 oass.FileExchangeRateProvider.reload Reloading exchange rates from file currency.xml
[junit4:junit4]   2> 1378 T396 oass.OpenExchangeRatesOrgProvider.reload Reloading exchange rates from open-exchange-rates.json
[junit4:junit4]   2> 1379 T396 oass.OpenExchangeRatesOrgProvider.reload Reloading exchange rates from open-exchange-rates.json
[junit4:junit4]   2> 1380 T396 oasc.SolrResourceLoader.locateSolrHome JNDI not configured for solr (NoInitialContextEx)
[junit4:junit4]   2> 1380 T396 oasc.SolrResourceLoader.locateSolrHome using system property solr.solr.home: C:\Jenkins\workspace\Lucene-Solr-4.x-Windows\solr\build\solr-core\test-files\solr
[junit4:junit4]   2> 1381 T396 oasc.SolrResourceLoader.<init> new SolrResourceLoader for directory: 'C:\Jenkins\workspace\Lucene-Solr-4.x-Windows\solr\build\solr-core\test-files\solr\'
[junit4:junit4]   2> 1396 T396 oasc.CoreContainer.<init> New CoreContainer 1573805718
[junit4:junit4]   2> 1396 T396 oasc.SolrCore.<init> [collection1] Opening new SolrCore at C:\Jenkins\workspace\Lucene-Solr-4.x-Windows\solr\build\solr-core\test-files\solr\collection1\, dataDir=C:\Jenkins\workspace\Lucene-Solr-4.x-Windows\solr\build\solr-core\test\J0\.\solrtest-SuggesterWFSTTest-1348312742478\
[junit4:junit4]   2> 1397 T396 oasc.SolrCore.<init> JMX monitoring not detected for core: collection1
[junit4:junit4]   2> 1397 T396 oasc.SolrCore.getNewIndexDir WARNING New index directory detected: old=null new=C:\Jenkins\workspace\Lucene-Solr-4.x-Windows\solr\build\solr-core\test\J0\.\solrtest-SuggesterWFSTTest-1348312742478\index/
[junit4:junit4]   2> 1400 T396 oasc.RequestHandlers.initHandlersFromConfig created standard: solr.StandardRequestHandler
[junit4:junit4]   2> 1400 T396 oasc.RequestHandlers.initHandlersFromConfig created /suggest: org.apache.solr.handler.component.SearchHandler
[junit4:junit4]   2> 1400 T396 oasc.RequestHandlers.initHandlersFromConfig created /suggest_tst: org.apache.solr.handler.component.SearchHandler
[junit4:junit4]   2> 1401 T396 oasc.RequestHandlers.initHandlersFromConfig created /suggest_fst: org.apache.solr.handler.component.SearchHandler
[junit4:junit4]   2> 1401 T396 oasc.RequestHandlers.initHandlersFromConfig created /suggest_wfst: org.apache.solr.handler.component.SearchHandler
[junit4:junit4]   2> 1404 T396 oasc.CachingDirectoryFactory.get return new directory for C:\Jenkins\workspace\Lucene-Solr-4.x-Windows\solr\build\solr-core\test\J0\.\solrtest-SuggesterWFSTTest-1348312742478\index forceNew:false
[junit4:junit4]   2> 1410 T396 oass.SolrIndexSearcher.<init> Opening Searcher@48ccbaf5 main
[junit4:junit4]   2> 1410 T396 oass.SolrIndexSearcher.getIndexDir WARNING WARNING: Directory impl does not support setting indexDir: org.apache.lucene.store.MockDirectoryWrapper
[junit4:junit4]   2> 1410 T396 oasu.CommitTracker.<init> Hard AutoCommit: disabled
[junit4:junit4]   2> 1411 T396 oasu.CommitTracker.<init> Soft AutoCommit: disabled
[junit4:junit4]   2> 1411 T396 oashc.SpellCheckComponent.inform Initializing spell checkers
[junit4:junit4]   2> 1411 T396 oasss.Suggester.init init: {name=suggest,classname=org.apache.solr.spelling.suggest.Suggester,lookupImpl=org.apache.solr.spelling.suggest.jaspell.JaspellLookup,field=suggest,storeDir=suggest,buildOnCommit=true,threshold=0.0}
[junit4:junit4]   2> 1411 T396 oasssj.JaspellLookupFactory.create init: {name=suggest,classname=org.apache.solr.spelling.suggest.Suggester,lookupImpl=org.apache.solr.spelling.suggest.jaspell.JaspellLookup,field=suggest,storeDir=suggest,buildOnCommit=true,threshold=0.0}
[junit4:junit4]   2> 1413 T396 oashc.SpellCheckComponent.inform Registering newSearcher listener for spellchecker: suggest
[junit4:junit4]   2> 1413 T396 oashc.SpellCheckComponent.inform No queryConverter defined, using default converter
[junit4:junit4]   2> 1414 T396 oashc.SpellCheckComponent.inform Initializing spell checkers
[junit4:junit4]   2> 1414 T396 oasss.Suggester.init init: {name=suggest_tst,classname=org.apache.solr.spelling.suggest.Suggester,lookupImpl=org.apache.solr.spelling.suggest.tst.TSTLookup,field=suggest,storeDir=suggest_tst,buildOnCommit=true,threshold=0.0}
[junit4:junit4]   2> 1417 T396 oashc.SpellCheckComponent.inform Registering newSearcher listener for spellchecker: suggest_tst
[junit4:junit4]   2> 1417 T396 oashc.SpellCheckComponent.inform No queryConverter defined, using default converter
[junit4:junit4]   2> 1418 T396 oashc.SpellCheckComponent.inform Initializing spell checkers
[junit4:junit4]   2> 1418 T396 oasss.Suggester.init init: {name=suggest_fst,classname=org.apache.solr.spelling.suggest.Suggester,lookupImpl=org.apache.solr.spelling.suggest.fst.FSTLookup,field=suggest,storeDir=suggest_fst,buildOnCommit=true,weightBuckets=5,exactMatchFirst=true}
[junit4:junit4]   2> 1420 T396 oashc.SpellCheckComponent.inform Registering newSearcher listener for spellchecker: suggest_fst
[junit4:junit4]   2> 1420 T396 oashc.SpellCheckComponent.inform No queryConverter defined, using default converter
[junit4:junit4]   2> 1420 T396 oashc.SpellCheckComponent.inform Initializing spell checkers
[junit4:junit4]   2> 1422 T396 oasss.Suggester.init init: {name=suggest_wfst,classname=org.apache.solr.spelling.suggest.Suggester,lookupImpl=org.apache.solr.spelling.suggest.fst.WFSTLookupFactory,field=suggest,storeDir=suggest_wfst,buildOnCommit=true,exactMatchFirst=true}
[junit4:junit4]   2> 1423 T396 oashc.SpellCheckComponent.inform Registering newSearcher listener for spellchecker: suggest_wfst
[junit4:junit4]   2> 1424 T396 oashc.SpellCheckComponent.inform No queryConverter defined, using default converter
[junit4:junit4]   2> 1424 T396 oashc.HttpShardHandlerFactory.getParameter Setting socketTimeout to: 0
[junit4:junit4]   2> 1424 T396 oashc.HttpShardHandlerFactory.getParameter Setting urlScheme to: http://
[junit4:junit4]   2> 1425 T396 oashc.HttpShardHandlerFactory.getParameter Setting connTimeout to: 0
[junit4:junit4]   2> 1425 T396 oashc.HttpShardHandlerFactory.getParameter Setting maxConnectionsPerHost to: 20
[junit4:junit4]   2> 1425 T396 oashc.HttpShardHandlerFactory.getParameter Setting corePoolSize to: 0
[junit4:junit4]   2> 1425 T396 oashc.HttpShardHandlerFactory.getParameter Setting maximumPoolSize to: 2147483647
[junit4:junit4]   2> 1425 T396 oashc.HttpShardHandlerFactory.getParameter Setting maxThreadIdleTime to: 5
[junit4:junit4]   2> 1426 T396 oashc.HttpShardHandlerFactory.getParameter Setting sizeOfQueue to: -1
[junit4:junit4]   2> 1426 T396 oashc.HttpShardHandlerFactory.getParameter Setting fairnessPolicy to: false
[junit4:junit4]   2> 1426 T396 oascsi.HttpClientUtil.createClient Creating new http client, config:maxConnectionsPerHost=20&maxConnections=10000&socketTimeout=0&connTimeout=0&retry=false
[junit4:junit4]   2> 1436 T398 oasc.SolrCore.registerSearcher [collection1] Registered new searcher Searcher@48ccbaf5 main{StandardDirectoryReader(segments_4:11 _2(4.0.0.2):C3)}
[junit4:junit4]   2> 1436 T396 oasc.CoreContainer.register registering core: collection1
[junit4:junit4]   2> 1439 T396 oas.SolrTestCaseJ4.initCore ####initCore end
[junit4:junit4]   2> ASYNC  NEW_CORE C16 name=collection1 org.apache.solr.core.SolrCore@d103dac
[junit4:junit4]   2> 1440 T396 C16 REQ [collection1] webapp=null path=null params={q=ac&spellcheck.count=2&qt=/suggest_wfst&spellcheck.onlyMorePopular=true} status=0 QTime=1 
[junit4:junit4]   2> 1446 T396 oas.SolrTestCaseJ4.tearDown ###Ending testReload
[junit4:junit4]   2> 1453 T396 oas.SolrTestCaseJ4.setUp ###Starting testAnalyzer
[junit4:junit4]   2> 1453 T396 oasss.Suggester.init init: {lookupImpl=org.apache.solr.spelling.suggest.tst.TSTLookupFactory}
[junit4:junit4]   2> 1453 T396 oas.SolrTestCaseJ4.tearDown ###Ending testAnalyzer
[junit4:junit4]   2> 1454 T396 oas.SolrTestCaseJ4.deleteCore ###deleteCore
[junit4:junit4]   2> 1455 T396 oasc.CoreContainer.shutdown Shutting down CoreContainer instance=1573805718
[junit4:junit4]   2> 1455 T396 oasc.SolrCore.close [collection1]  CLOSING SolrCore org.apache.solr.core.SolrCore@d103dac
[junit4:junit4]   2> 1462 T396 oasc.SolrCore.closeSearcher [collection1] Closing main searcher on request.
[junit4:junit4]   2> 1464 T396 oasu.DirectUpdateHandler2.close closing DirectUpdateHandler2{commits=0,autocommits=0,soft autocommits=0,optimizes=0,rollbacks=0,expungeDeletes=0,docsPending=0,adds=0,deletesById=0,deletesByQuery=0,errors=0,cumulative_adds=0,cumulative_deletesById=0,cumulative_deletesByQuery=0,cumulative_errors=0}
[junit4:junit4]   2> 1464 T396 oasu.DefaultSolrCoreState.decref SolrCoreState ref count has reached 0 - closing IndexWriter
[junit4:junit4]   2> 1477 T396 oasu.DefaultSolrCoreState.decref Closing SolrCoreState - canceling any ongoing recovery
[junit4:junit4]   2> NOTE: test params are: codec=Lucene40: {id=PostingsFormat(name=Memory doPackFST= true), text=PostingsFormat(name=Memory doPackFST= false), suggest=PostingsFormat(name=Lucene40WithOrds), spell=PostingsFormat(name=Lucene40WithOrds)}, sim=DefaultSimilarity, locale=es_AR, timezone=Pacific/Rarotonga
[junit4:junit4]   2> NOTE: Windows 7 6.1 amd64/Oracle Corporation 1.7.0_07 (64-bit)/cpus=2,threads=1,free=23691064,total=63733760
[junit4:junit4]   2> NOTE: All tests run in this JVM: [MinimalSchemaTest, SignatureUpdateProcessorFactoryTest, LeaderElectionTest, SuggesterFSTTest, PathHierarchyTokenizerFactoryTest, StandardRequestHandlerTest, TestPropInject, LeaderElectionIntegrationTest, UUIDFieldTest, JSONWriterTest, TestPHPSerializedResponseWriter, DOMUtilTest, ClusterStateTest, TestSearchPerf, CoreAdminHandlerTest, TestRangeQuery, NotRequiredUniqueKeyTest, SampleTest, TestDFRSimilarityFactory, TestFunctionQuery, TestIndexSearcher, TestRandomFaceting, PreAnalyzedFieldTest, SpellPossibilityIteratorTest, TestDocSet, TestNumberUtils, BasicFunctionalityTest, IndexBasedSpellCheckerTest, NumericFieldsTest, TestConfig, BadIndexSchemaTest, TestSolrQueryParser, TestIBSimilarityFactory, SuggesterWFSTTest]
[junit4:junit4] Completed in 1.53s, 4 tests, 1 error <<< FAILURES!

[...truncated 609 lines...]
BUILD FAILED
C:\Jenkins\workspace\Lucene-Solr-4.x-Windows\build.xml:32: The following error occurred while executing this line:
C:\Jenkins\workspace\Lucene-Solr-4.x-Windows\solr\build.xml:179: The following error occurred while executing this line:
C:\Jenkins\workspace\Lucene-Solr-4.x-Windows\lucene\module-build.xml:63: The following error occurred while executing this line:
C:\Jenkins\workspace\Lucene-Solr-4.x-Windows\lucene\common-build.xml:1140: The following error occurred while executing this line:
C:\Jenkins\workspace\Lucene-Solr-4.x-Windows\lucene\common-build.xml:813: There were test failures: 231 suites, 954 tests, 1 error, 13 ignored (8 assumptions)

Total time: 34 minutes 31 seconds
Build step 'Invoke Ant' marked build as failure
Recording test results
Description set: Java: 64bit/jdk1.7.0_07 -XX:+UseSerialGC
Email was triggered for: Failure
Sending email for trigger: Failure



Mime
View raw message