lucene-dev mailing list archives

Site index · List index
Message view « Date » · « Thread »
Top « Date » · « Thread »
From Policeman Jenkins Server <jenk...@sd-datasolutions.de>
Subject [JENKINS] Lucene-Solr-4.x-Linux (32bit/jdk1.8.0-ea-b51) - Build # 817 - Still Failing!
Date Mon, 03 Sep 2012 00:47:15 GMT
Build: http://jenkins.sd-datasolutions.de/job/Lucene-Solr-4.x-Linux/817/
Java: 32bit/jdk1.8.0-ea-b51 -server -XX:+UseG1GC

1 tests failed.
REGRESSION:  org.apache.solr.cloud.ZkSolrClientTest.testWatchChildren

Error Message:
expected:<2> but was:<1>

Stack Trace:
java.lang.AssertionError: expected:<2> but was:<1>
	at __randomizedtesting.SeedInfo.seed([44F72C92F8B56C11:C894E8EBF71D6AA]:0)
	at org.junit.Assert.fail(Assert.java:93)
	at org.junit.Assert.failNotEquals(Assert.java:647)
	at org.junit.Assert.assertEquals(Assert.java:128)
	at org.junit.Assert.assertEquals(Assert.java:472)
	at org.junit.Assert.assertEquals(Assert.java:456)
	at org.apache.solr.cloud.ZkSolrClientTest.testWatchChildren(ZkSolrClientTest.java:218)
	at sun.reflect.NativeMethodAccessorImpl.invoke0(Native Method)
	at sun.reflect.NativeMethodAccessorImpl.invoke(NativeMethodAccessorImpl.java:57)
	at sun.reflect.DelegatingMethodAccessorImpl.invoke(DelegatingMethodAccessorImpl.java:43)
	at java.lang.reflect.Method.invoke(Method.java:474)
	at com.carrotsearch.randomizedtesting.RandomizedRunner.invoke(RandomizedRunner.java:1559)
	at com.carrotsearch.randomizedtesting.RandomizedRunner.access$600(RandomizedRunner.java:79)
	at com.carrotsearch.randomizedtesting.RandomizedRunner$6.evaluate(RandomizedRunner.java:737)
	at com.carrotsearch.randomizedtesting.RandomizedRunner$7.evaluate(RandomizedRunner.java:773)
	at com.carrotsearch.randomizedtesting.RandomizedRunner$8.evaluate(RandomizedRunner.java:787)
	at com.carrotsearch.randomizedtesting.rules.SystemPropertiesRestoreRule$1.evaluate(SystemPropertiesRestoreRule.java:53)
	at org.apache.lucene.util.TestRuleSetupTeardownChained$1.evaluate(TestRuleSetupTeardownChained.java:50)
	at org.apache.lucene.util.TestRuleFieldCacheSanity$1.evaluate(TestRuleFieldCacheSanity.java:51)
	at org.apache.lucene.util.AbstractBeforeAfterRule$1.evaluate(AbstractBeforeAfterRule.java:45)
	at com.carrotsearch.randomizedtesting.rules.SystemPropertiesInvariantRule$1.evaluate(SystemPropertiesInvariantRule.java:55)
	at org.apache.lucene.util.TestRuleThreadAndTestName$1.evaluate(TestRuleThreadAndTestName.java:48)
	at org.apache.lucene.util.TestRuleIgnoreAfterMaxFailures$1.evaluate(TestRuleIgnoreAfterMaxFailures.java:70)
	at org.apache.lucene.util.TestRuleMarkFailure$1.evaluate(TestRuleMarkFailure.java:48)
	at com.carrotsearch.randomizedtesting.rules.StatementAdapter.evaluate(StatementAdapter.java:36)
	at com.carrotsearch.randomizedtesting.ThreadLeakControl$StatementRunner.run(ThreadLeakControl.java:345)
	at com.carrotsearch.randomizedtesting.ThreadLeakControl.forkTimeoutingTask(ThreadLeakControl.java:769)
	at com.carrotsearch.randomizedtesting.ThreadLeakControl$3.evaluate(ThreadLeakControl.java:429)
	at com.carrotsearch.randomizedtesting.RandomizedRunner.runSingleTest(RandomizedRunner.java:746)
	at com.carrotsearch.randomizedtesting.RandomizedRunner$3.evaluate(RandomizedRunner.java:648)
	at com.carrotsearch.randomizedtesting.RandomizedRunner$4.evaluate(RandomizedRunner.java:682)
	at com.carrotsearch.randomizedtesting.RandomizedRunner$5.evaluate(RandomizedRunner.java:693)
	at com.carrotsearch.randomizedtesting.rules.StatementAdapter.evaluate(StatementAdapter.java:36)
	at com.carrotsearch.randomizedtesting.rules.SystemPropertiesRestoreRule$1.evaluate(SystemPropertiesRestoreRule.java:53)
	at org.apache.lucene.util.AbstractBeforeAfterRule$1.evaluate(AbstractBeforeAfterRule.java:45)
	at org.apache.lucene.util.TestRuleStoreClassName$1.evaluate(TestRuleStoreClassName.java:42)
	at com.carrotsearch.randomizedtesting.rules.SystemPropertiesInvariantRule$1.evaluate(SystemPropertiesInvariantRule.java:55)
	at com.carrotsearch.randomizedtesting.rules.NoShadowingOrOverridesOnMethodsRule$1.evaluate(NoShadowingOrOverridesOnMethodsRule.java:39)
	at com.carrotsearch.randomizedtesting.rules.NoShadowingOrOverridesOnMethodsRule$1.evaluate(NoShadowingOrOverridesOnMethodsRule.java:39)
	at org.apache.lucene.util.TestRuleAssertionsRequired$1.evaluate(TestRuleAssertionsRequired.java:40)
	at org.apache.lucene.util.TestRuleMarkFailure$1.evaluate(TestRuleMarkFailure.java:48)
	at org.apache.lucene.util.TestRuleIgnoreAfterMaxFailures$1.evaluate(TestRuleIgnoreAfterMaxFailures.java:70)
	at org.apache.lucene.util.TestRuleIgnoreTestSuites$1.evaluate(TestRuleIgnoreTestSuites.java:55)
	at com.carrotsearch.randomizedtesting.rules.StatementAdapter.evaluate(StatementAdapter.java:36)
	at com.carrotsearch.randomizedtesting.ThreadLeakControl$StatementRunner.run(ThreadLeakControl.java:345)
	at java.lang.Thread.run(Thread.java:722)




Build Log:
[...truncated 7094 lines...]
[junit4:junit4] Suite: org.apache.solr.cloud.ZkSolrClientTest
[junit4:junit4]   2> 18100 T1739 oasu.AbstractSolrTestCase.setUp ####SETUP_START testConnect
[junit4:junit4]   2> 18101 T1739 oasu.AbstractSolrTestCase.setUp ####SETUP_END testConnect
[junit4:junit4]   2> 18101 T1739 oasc.ZkTestServer.run STARTING ZK TEST SERVER
[junit4:junit4]   2> 18102 T1740 oazs.ZooKeeperServer.setTickTime tickTime set to 3000
[junit4:junit4]   2> 18102 T1740 oazs.NIOServerCnxn$Factory.<init> binding to port
0.0.0.0/0.0.0.0:0
[junit4:junit4]   2> 18103 T1740 oazsp.FileTxnSnapLog.save Snapshotting: 0
[junit4:junit4]   2> 18201 T1739 oasc.ZkTestServer.run start zk server on port:35462
[junit4:junit4]   2> 18202 T1739 oaz.ZooKeeper.<init> Initiating client connection,
connectString=127.0.0.1:35462/solr sessionTimeout=10000 watcher=org.apache.solr.common.cloud.ConnectionManager@1117c69
[junit4:junit4]   2> 18203 T1745 oaz.ClientCnxn$SendThread.startConnect Opening socket
connection to server /127.0.0.1:35462
[junit4:junit4]   2> 18203 T1739 oascc.ConnectionManager.waitForConnected Waiting for client
to connect to ZooKeeper
[junit4:junit4]   2> 18203 T1745 oaz.ClientCnxn$SendThread.primeConnection Socket connection
established to localhost.localdomain/127.0.0.1:35462, initiating session
[junit4:junit4]   2> 18203 T1741 oazs.NIOServerCnxn$Factory.run Accepted socket connection
from /127.0.0.1:49366
[junit4:junit4]   2> 18204 T1741 oazs.NIOServerCnxn.readConnectRequest Client attempting
to establish new session at /127.0.0.1:49366
[junit4:junit4]   2> 18204 T1743 oazsp.FileTxnLog.append Creating new log file: log.1
[junit4:junit4]   2> 18303 T1743 oazs.NIOServerCnxn.finishSessionInit Established session
0x139899639f70000 with negotiated timeout 10000 for client /127.0.0.1:49366
[junit4:junit4]   2> 18304 T1745 oaz.ClientCnxn$SendThread.readConnectResult Session establishment
complete on server localhost.localdomain/127.0.0.1:35462, sessionid = 0x139899639f70000, negotiated
timeout = 10000
[junit4:junit4]   2> 18304 T1746 oascc.ConnectionManager.process Watcher org.apache.solr.common.cloud.ConnectionManager@1117c69
name:ZooKeeperConnection Watcher:127.0.0.1:35462/solr got event WatchedEvent state:SyncConnected
type:None path:null path:null type:None
[junit4:junit4]   2> 18304 T1739 oascc.ConnectionManager.waitForConnected Client is connected
to ZooKeeper
[junit4:junit4]   2> 18305 T1744 oazs.PrepRequestProcessor.pRequest Processed session termination
for sessionid: 0x139899639f70000
[junit4:junit4]   2> 18306 T1746 oaz.ClientCnxn$EventThread.run EventThread shut down
[junit4:junit4]   2> 18306 T1741 oazs.NIOServerCnxn.closeSock Closed socket connection
for client /127.0.0.1:49366 which had sessionid 0x139899639f70000
[junit4:junit4]   2> 18306 T1739 oaz.ZooKeeper.close Session: 0x139899639f70000 closed
[junit4:junit4]   2> 18307 T1744 oazs.PrepRequestProcessor.run PrepRequestProcessor exited
loop!
[junit4:junit4]   2> 18307 T1743 oazs.SyncRequestProcessor.run SyncRequestProcessor exited!
[junit4:junit4]   2> 18307 T1739 oazs.FinalRequestProcessor.shutdown shutdown of request
processor complete
[junit4:junit4]   2> 18309 T1741 oazs.NIOServerCnxn$Factory.run NIOServerCnxn factory exited
run method
[junit4:junit4]   2> 18309 T1739 oazs.FinalRequestProcessor.shutdown shutdown of request
processor complete
[junit4:junit4]   2> 18310 T1739 oasu.AbstractSolrTestCase.tearDown ####TEARDOWN_START
testConnect
[junit4:junit4]   2> 18314 T1739 oasu.AbstractSolrTestCase.setUp ####SETUP_START testWatchChildren
[junit4:junit4]   2> 18315 T1739 oasu.AbstractSolrTestCase.setUp ####SETUP_END testWatchChildren
[junit4:junit4]   2> 18315 T1739 oasc.ZkTestServer.run STARTING ZK TEST SERVER
[junit4:junit4]   2> 18316 T1747 oazs.ZooKeeperServer.setTickTime tickTime set to 3000
[junit4:junit4]   2> 18316 T1747 oazs.NIOServerCnxn$Factory.<init> binding to port
0.0.0.0/0.0.0.0:0
[junit4:junit4]   2> 18317 T1747 oazsp.FileTxnSnapLog.save Snapshotting: 0
[junit4:junit4]   2> 18416 T1739 oasc.ZkTestServer.run start zk server on port:52798
[junit4:junit4]   2> 18624 T1742 oazs.SessionTrackerImpl.run SessionTrackerImpl exited
loop!
[junit4:junit4]   2> 18820 T1739 oaz.ZooKeeper.<init> Initiating client connection,
connectString=127.0.0.1:52798 sessionTimeout=10000 watcher=org.apache.solr.common.cloud.ConnectionManager@1b84aa5
[junit4:junit4]   2> 18829 T1752 oaz.ClientCnxn$SendThread.startConnect Opening socket
connection to server /127.0.0.1:52798
[junit4:junit4]   2> 18830 T1748 oazs.NIOServerCnxn$Factory.run Accepted socket connection
from /127.0.0.1:45511
[junit4:junit4]   2> 18833 T1739 oascc.ConnectionManager.waitForConnected Waiting for client
to connect to ZooKeeper
[junit4:junit4]   2> 18834 T1752 oaz.ClientCnxn$SendThread.primeConnection Socket connection
established to localhost.localdomain/127.0.0.1:52798, initiating session
[junit4:junit4]   2> 18834 T1748 oazs.NIOServerCnxn.readConnectRequest Client attempting
to establish new session at /127.0.0.1:45511
[junit4:junit4]   2> 18834 T1750 oazsp.FileTxnLog.append Creating new log file: log.1
[junit4:junit4]   2> 18890 T1750 oazs.NIOServerCnxn.finishSessionInit Established session
0x13989963acd0000 with negotiated timeout 10000 for client /127.0.0.1:45511
[junit4:junit4]   2> 18891 T1752 oaz.ClientCnxn$SendThread.readConnectResult Session establishment
complete on server localhost.localdomain/127.0.0.1:52798, sessionid = 0x13989963acd0000, negotiated
timeout = 10000
[junit4:junit4]   2> 18891 T1753 oascc.ConnectionManager.process Watcher org.apache.solr.common.cloud.ConnectionManager@1b84aa5
name:ZooKeeperConnection Watcher:127.0.0.1:52798 got event WatchedEvent state:SyncConnected
type:None path:null path:null type:None
[junit4:junit4]   2> 18891 T1739 oascc.ConnectionManager.waitForConnected Client is connected
to ZooKeeper
[junit4:junit4]   2> 18891 T1739 oascc.SolrZkClient.makePath makePath: /solr
[junit4:junit4]   2> 18895 T1751 oazs.PrepRequestProcessor.pRequest Processed session termination
for sessionid: 0x13989963acd0000
[junit4:junit4]   2> 18895 T1748 oazs.NIOServerCnxn.closeSock Closed socket connection
for client /127.0.0.1:45511 which had sessionid 0x13989963acd0000
[junit4:junit4]   2> 18895 T1739 oaz.ZooKeeper.close Session: 0x13989963acd0000 closed
[junit4:junit4]   2> 18895 T1753 oaz.ClientCnxn$EventThread.run EventThread shut down
[junit4:junit4]   2> 18896 T1739 oaz.ZooKeeper.<init> Initiating client connection,
connectString=127.0.0.1:52798/solr sessionTimeout=10000 watcher=org.apache.solr.common.cloud.ConnectionManager@28afa0
[junit4:junit4]   2> 18897 T1754 oaz.ClientCnxn$SendThread.startConnect Opening socket
connection to server /127.0.0.1:52798
[junit4:junit4]   2> 18897 T1739 oascc.ConnectionManager.waitForConnected Waiting for client
to connect to ZooKeeper
[junit4:junit4]   2> 18897 T1748 oazs.NIOServerCnxn$Factory.run Accepted socket connection
from /127.0.0.1:45512
[junit4:junit4]   2> 18897 T1754 oaz.ClientCnxn$SendThread.primeConnection Socket connection
established to localhost.localdomain/127.0.0.1:52798, initiating session
[junit4:junit4]   2> 18898 T1748 oazs.NIOServerCnxn.readConnectRequest Client attempting
to establish new session at /127.0.0.1:45512
[junit4:junit4]   2> 18898 T1750 oazs.NIOServerCnxn.finishSessionInit Established session
0x13989963acd0001 with negotiated timeout 10000 for client /127.0.0.1:45512
[junit4:junit4]   2> 18899 T1754 oaz.ClientCnxn$SendThread.readConnectResult Session establishment
complete on server localhost.localdomain/127.0.0.1:52798, sessionid = 0x13989963acd0001, negotiated
timeout = 10000
[junit4:junit4]   2> 18899 T1755 oascc.ConnectionManager.process Watcher org.apache.solr.common.cloud.ConnectionManager@28afa0
name:ZooKeeperConnection Watcher:127.0.0.1:52798/solr got event WatchedEvent state:SyncConnected
type:None path:null path:null type:None
[junit4:junit4]   2> 18899 T1739 oascc.ConnectionManager.waitForConnected Client is connected
to ZooKeeper
[junit4:junit4]   2> 18900 T1739 oascc.SolrZkClient.makePath makePath: /collections
[junit4:junit4]   2> 18902 T1739 oascc.SolrZkClient.makePath makePath: /collections/collection99/shards
[junit4:junit4]   2> 18904 T1739 oascc.SolrZkClient.makePath makePath: collections/collection99/config=collection1
[junit4:junit4]   2> 18905 T1739 oascc.SolrZkClient.makePath makePath: collections/collection99/config=collection3
[junit4:junit4]   2> 18907 T1739 oascc.SolrZkClient.makePath makePath: /collections/collection97/shards
[junit4:junit4]   2> 27609 T1751 oazs.PrepRequestProcessor.pRequest Processed session termination
for sessionid: 0x13989963acd0001
[junit4:junit4]   2> 27610 T1755 oaz.ClientCnxn$EventThread.run EventThread shut down
[junit4:junit4]   2> 27610 T1748 oazs.NIOServerCnxn.closeSock Closed socket connection
for client /127.0.0.1:45512 which had sessionid 0x13989963acd0001
[junit4:junit4]   2> 27610 T1739 oaz.ZooKeeper.close Session: 0x13989963acd0001 closed
[junit4:junit4]   2> 27611 T1750 oazs.SyncRequestProcessor.run SyncRequestProcessor exited!
[junit4:junit4]   2> 27611 T1751 oazs.PrepRequestProcessor.run PrepRequestProcessor exited
loop!
[junit4:junit4]   2> 27611 T1739 oazs.FinalRequestProcessor.shutdown shutdown of request
processor complete
[junit4:junit4]   2> 27613 T1748 oazs.NIOServerCnxn$Factory.run NIOServerCnxn factory exited
run method
[junit4:junit4]   2> 27615 T1739 oazs.FinalRequestProcessor.shutdown shutdown of request
processor complete
[junit4:junit4]   2> 27615 T1739 oasu.AbstractSolrTestCase.tearDown ####TEARDOWN_START
testWatchChildren
[junit4:junit4]   2> 27624 T1749 oazs.SessionTrackerImpl.run SessionTrackerImpl exited
loop!
[junit4:junit4]   2> NOTE: reproduce with: ant test  -Dtestcase=ZkSolrClientTest -Dtests.method=testWatchChildren
-Dtests.seed=44F72C92F8B56C11 -Dtests.multiplier=3 -Dtests.slow=true -Dtests.locale=ar_KW
-Dtests.timezone=Atlantic/Faroe -Dtests.file.encoding=UTF-8
[junit4:junit4] FAILURE 9.34s J0 | ZkSolrClientTest.testWatchChildren <<<
[junit4:junit4]    > Throwable #1: java.lang.AssertionError: expected:<2> but was:<1>
[junit4:junit4]    > 	at __randomizedtesting.SeedInfo.seed([44F72C92F8B56C11:C894E8EBF71D6AA]:0)
[junit4:junit4]    > 	at org.junit.Assert.fail(Assert.java:93)
[junit4:junit4]    > 	at org.junit.Assert.failNotEquals(Assert.java:647)
[junit4:junit4]    > 	at org.junit.Assert.assertEquals(Assert.java:128)
[junit4:junit4]    > 	at org.junit.Assert.assertEquals(Assert.java:472)
[junit4:junit4]    > 	at org.junit.Assert.assertEquals(Assert.java:456)
[junit4:junit4]    > 	at org.apache.solr.cloud.ZkSolrClientTest.testWatchChildren(ZkSolrClientTest.java:218)
[junit4:junit4]    > 	at sun.reflect.NativeMethodAccessorImpl.invoke0(Native Method)
[junit4:junit4]    > 	at sun.reflect.NativeMethodAccessorImpl.invoke(NativeMethodAccessorImpl.java:57)
[junit4:junit4]    > 	at sun.reflect.DelegatingMethodAccessorImpl.invoke(DelegatingMethodAccessorImpl.java:43)
[junit4:junit4]    > 	at java.lang.reflect.Method.invoke(Method.java:474)
[junit4:junit4]    > 	at com.carrotsearch.randomizedtesting.RandomizedRunner.invoke(RandomizedRunner.java:1559)
[junit4:junit4]    > 	at com.carrotsearch.randomizedtesting.RandomizedRunner.access$600(RandomizedRunner.java:79)
[junit4:junit4]    > 	at com.carrotsearch.randomizedtesting.RandomizedRunner$6.evaluate(RandomizedRunner.java:737)
[junit4:junit4]    > 	at com.carrotsearch.randomizedtesting.RandomizedRunner$7.evaluate(RandomizedRunner.java:773)
[junit4:junit4]    > 	at com.carrotsearch.randomizedtesting.RandomizedRunner$8.evaluate(RandomizedRunner.java:787)
[junit4:junit4]    > 	at com.carrotsearch.randomizedtesting.rules.SystemPropertiesRestoreRule$1.evaluate(SystemPropertiesRestoreRule.java:53)
[junit4:junit4]    > 	at org.apache.lucene.util.TestRuleSetupTeardownChained$1.evaluate(TestRuleSetupTeardownChained.java:50)
[junit4:junit4]    > 	at org.apache.lucene.util.TestRuleFieldCacheSanity$1.evaluate(TestRuleFieldCacheSanity.java:51)
[junit4:junit4]    > 	at org.apache.lucene.util.AbstractBeforeAfterRule$1.evaluate(AbstractBeforeAfterRule.java:45)
[junit4:junit4]    > 	at com.carrotsearch.randomizedtesting.rules.SystemPropertiesInvariantRule$1.evaluate(SystemPropertiesInvariantRule.java:55)
[junit4:junit4]    > 	at org.apache.lucene.util.TestRuleThreadAndTestName$1.evaluate(TestRuleThreadAndTestName.java:48)
[junit4:junit4]    > 	at org.apache.lucene.util.TestRuleIgnoreAfterMaxFailures$1.evaluate(TestRuleIgnoreAfterMaxFailures.java:70)
[junit4:junit4]    > 	at org.apache.lucene.util.TestRuleMarkFailure$1.evaluate(TestRuleMarkFailure.java:48)
[junit4:junit4]    > 	at com.carrotsearch.randomizedtesting.rules.StatementAdapter.evaluate(StatementAdapter.java:36)
[junit4:junit4]    > 	at com.carrotsearch.randomizedtesting.ThreadLeakControl$StatementRunner.run(ThreadLeakControl.java:345)
[junit4:junit4]    > 	at com.carrotsearch.randomizedtesting.ThreadLeakControl.forkTimeoutingTask(ThreadLeakControl.java:769)
[junit4:junit4]    > 	at com.carrotsearch.randomizedtesting.ThreadLeakControl$3.evaluate(ThreadLeakControl.java:429)
[junit4:junit4]    > 	at com.carrotsearch.randomizedtesting.RandomizedRunner.runSingleTest(RandomizedRunner.java:746)
[junit4:junit4]    > 	at com.carrotsearch.randomizedtesting.RandomizedRunner$3.evaluate(RandomizedRunner.java:648)
[junit4:junit4]    > 	at com.carrotsearch.randomizedtesting.RandomizedRunner$4.evaluate(RandomizedRunner.java:682)
[junit4:junit4]    > 	at com.carrotsearch.randomizedtesting.RandomizedRunner$5.evaluate(RandomizedRunner.java:693)
[junit4:junit4]    > 	at com.carrotsearch.randomizedtesting.rules.StatementAdapter.evaluate(StatementAdapter.java:36)
[junit4:junit4]    > 	at com.carrotsearch.randomizedtesting.rules.SystemPropertiesRestoreRule$1.evaluate(SystemPropertiesRestoreRule.java:53)
[junit4:junit4]    > 	at org.apache.lucene.util.AbstractBeforeAfterRule$1.evaluate(AbstractBeforeAfterRule.java:45)
[junit4:junit4]    > 	at org.apache.lucene.util.TestRuleStoreClassName$1.evaluate(TestRuleStoreClassName.java:42)
[junit4:junit4]    > 	at com.carrotsearch.randomizedtesting.rules.SystemPropertiesInvariantRule$1.evaluate(SystemPropertiesInvariantRule.java:55)
[junit4:junit4]    > 	at com.carrotsearch.randomizedtesting.rules.NoShadowingOrOverridesOnMethodsRule$1.evaluate(NoShadowingOrOverridesOnMethodsRule.java:39)
[junit4:junit4]    > 	at com.carrotsearch.randomizedtesting.rules.NoShadowingOrOverridesOnMethodsRule$1.evaluate(NoShadowingOrOverridesOnMethodsRule.java:39)
[junit4:junit4]    > 	at org.apache.lucene.util.TestRuleAssertionsRequired$1.evaluate(TestRuleAssertionsRequired.java:40)
[junit4:junit4]    > 	at org.apache.lucene.util.TestRuleMarkFailure$1.evaluate(TestRuleMarkFailure.java:48)
[junit4:junit4]    > 	at org.apache.lucene.util.TestRuleIgnoreAfterMaxFailures$1.evaluate(TestRuleIgnoreAfterMaxFailures.java:70)
[junit4:junit4]    > 	at org.apache.lucene.util.TestRuleIgnoreTestSuites$1.evaluate(TestRuleIgnoreTestSuites.java:55)
[junit4:junit4]    > 	at com.carrotsearch.randomizedtesting.rules.StatementAdapter.evaluate(StatementAdapter.java:36)
[junit4:junit4]    > 	at com.carrotsearch.randomizedtesting.ThreadLeakControl$StatementRunner.run(ThreadLeakControl.java:345)
[junit4:junit4]    > 	at java.lang.Thread.run(Thread.java:722)
[junit4:junit4]   2> 27657 T1739 oasu.AbstractSolrTestCase.setUp ####SETUP_START testReconnect
[junit4:junit4]   2> 27658 T1739 oasu.AbstractSolrTestCase.setUp ####SETUP_END testReconnect
[junit4:junit4]   2> 27658 T1739 oasc.ZkTestServer.run STARTING ZK TEST SERVER
[junit4:junit4]   2> 27659 T1756 oazs.ZooKeeperServer.setTickTime tickTime set to 3000
[junit4:junit4]   2> 27659 T1756 oazs.NIOServerCnxn$Factory.<init> binding to port
0.0.0.0/0.0.0.0:0
[junit4:junit4]   2> 27661 T1756 oazsp.FileTxnSnapLog.save Snapshotting: 0
[junit4:junit4]   2> 27758 T1739 oasc.ZkTestServer.run start zk server on port:49970
[junit4:junit4]   2> 27759 T1739 oaz.ZooKeeper.<init> Initiating client connection,
connectString=127.0.0.1:49970 sessionTimeout=10000 watcher=org.apache.solr.common.cloud.ConnectionManager@1e59d24
[junit4:junit4]   2> 27760 T1761 oaz.ClientCnxn$SendThread.startConnect Opening socket
connection to server /127.0.0.1:49970
[junit4:junit4]   2> 27760 T1739 oascc.ConnectionManager.waitForConnected Waiting for client
to connect to ZooKeeper
[junit4:junit4]   2> 27760 T1761 oaz.ClientCnxn$SendThread.primeConnection Socket connection
established to localhost.localdomain/127.0.0.1:49970, initiating session
[junit4:junit4]   2> 27760 T1757 oazs.NIOServerCnxn$Factory.run Accepted socket connection
from /127.0.0.1:43942
[junit4:junit4]   2> 27761 T1757 oazs.NIOServerCnxn.readConnectRequest Client attempting
to establish new session at /127.0.0.1:43942
[junit4:junit4]   2> 27761 T1759 oazsp.FileTxnLog.append Creating new log file: log.1
[junit4:junit4]   2> 27820 T1759 oazs.NIOServerCnxn.finishSessionInit Established session
0x13989965f4e0000 with negotiated timeout 10000 for client /127.0.0.1:43942
[junit4:junit4]   2> 27821 T1761 oaz.ClientCnxn$SendThread.readConnectResult Session establishment
complete on server localhost.localdomain/127.0.0.1:49970, sessionid = 0x13989965f4e0000, negotiated
timeout = 10000
[junit4:junit4]   2> 27821 T1762 oascc.ConnectionManager.process Watcher org.apache.solr.common.cloud.ConnectionManager@1e59d24
name:ZooKeeperConnection Watcher:127.0.0.1:49970 got event WatchedEvent state:SyncConnected
type:None path:null path:null type:None
[junit4:junit4]   2> 27821 T1739 oascc.ConnectionManager.waitForConnected Client is connected
to ZooKeeper
[junit4:junit4]   2> 27822 T1739 oascc.SolrZkClient.makePath makePath: /solr
[junit4:junit4]   2> 27824 T1760 oazs.PrepRequestProcessor.pRequest Processed session termination
for sessionid: 0x13989965f4e0000
[junit4:junit4]   2> 27824 T1762 oaz.ClientCnxn$EventThread.run EventThread shut down
[junit4:junit4]   2> 27824 T1739 oaz.ZooKeeper.close Session: 0x13989965f4e0000 closed
[junit4:junit4]   2> 27825 T1757 oazs.NIOServerCnxn.closeSock Closed socket connection
for client /127.0.0.1:43942 which had sessionid 0x13989965f4e0000
[junit4:junit4]   2> 27825 T1739 oaz.ZooKeeper.<init> Initiating client connection,
connectString=127.0.0.1:49970/solr sessionTimeout=10000 watcher=org.apache.solr.common.cloud.ConnectionManager@1806a6c
[junit4:junit4]   2> 27826 T1763 oaz.ClientCnxn$SendThread.startConnect Opening socket
connection to server /127.0.0.1:49970
[junit4:junit4]   2> 27826 T1739 oascc.ConnectionManager.waitForConnected Waiting for client
to connect to ZooKeeper
[junit4:junit4]   2> 27826 T1763 oaz.ClientCnxn$SendThread.primeConnection Socket connection
established to localhost.localdomain/127.0.0.1:49970, initiating session
[junit4:junit4]   2> 27826 T1757 oazs.NIOServerCnxn$Factory.run Accepted socket connection
from /127.0.0.1:43943
[junit4:junit4]   2> 27827 T1757 oazs.NIOServerCnxn.readConnectRequest Client attempting
to establish new session at /127.0.0.1:43943
[junit4:junit4]   2> 27827 T1759 oazs.NIOServerCnxn.finishSessionInit Established session
0x13989965f4e0001 with negotiated timeout 10000 for client /127.0.0.1:43943
[junit4:junit4]   2> 27827 T1763 oaz.ClientCnxn$SendThread.readConnectResult Session establishment
complete on server localhost.localdomain/127.0.0.1:49970, sessionid = 0x13989965f4e0001, negotiated
timeout = 10000
[junit4:junit4]   2> 27828 T1764 oascc.ConnectionManager.process Watcher org.apache.solr.common.cloud.ConnectionManager@1806a6c
name:ZooKeeperConnection Watcher:127.0.0.1:49970/solr got event WatchedEvent state:SyncConnected
type:None path:null path:null type:None
[junit4:junit4]   2> 27828 T1739 oascc.ConnectionManager.waitForConnected Client is connected
to ZooKeeper
[junit4:junit4]   2> 27828 T1739 oascc.SolrZkClient.makePath makePath: /collections/collection1/shards
[junit4:junit4]   2> 27830 T1739 oascc.SolrZkClient.makePath makePath: collections/collection1
[junit4:junit4]   2> 27831 T1759 oazs.SyncRequestProcessor.run SyncRequestProcessor exited!
[junit4:junit4]   2> 27831 T1760 oazs.PrepRequestProcessor.run PrepRequestProcessor exited
loop!
[junit4:junit4]   2> 27831 T1739 oazs.FinalRequestProcessor.shutdown shutdown of request
processor complete
[junit4:junit4]   2> 27833 T1739 oazs.NIOServerCnxn.closeSock Closed socket connection
for client /127.0.0.1:43943 which had sessionid 0x13989965f4e0001
[junit4:junit4]   2> 27833 T1757 oazs.NIOServerCnxn$Factory.run NIOServerCnxn factory exited
run method
[junit4:junit4]   2> 27834 T1763 oaz.ClientCnxn$SendThread.run Unable to read additional
data from server sessionid 0x13989965f4e0001, likely server has closed socket, closing socket
connection and attempting reconnect
[junit4:junit4]   2> 27834 T1739 oazs.FinalRequestProcessor.shutdown shutdown of request
processor complete
[junit4:junit4]   2> 27914 T1739 oascc.SolrZkClient.makePath makePath: collections/collection2
[junit4:junit4]   2> 27934 T1764 oascc.ConnectionManager.process Watcher org.apache.solr.common.cloud.ConnectionManager@1806a6c
name:ZooKeeperConnection Watcher:127.0.0.1:49970/solr got event WatchedEvent state:Disconnected
type:None path:null path:null type:None
[junit4:junit4]   2> 27934 T1739 oasc.ZkTestServer.run STARTING ZK TEST SERVER
[junit4:junit4]   2> 27935 T1764 oascc.ConnectionManager.process zkClient has disconnected
[junit4:junit4]   2> 27935 T1765 oazs.ZooKeeperServer.setTickTime tickTime set to 3000
[junit4:junit4]   2> 27935 T1765 oazs.NIOServerCnxn$Factory.<init> binding to port
0.0.0.0/0.0.0.0:49970
[junit4:junit4]   2> 27936 T1765 oazsp.FileSnap.deserialize Reading snapshot /mnt/ssd/jenkins/workspace/Lucene-Solr-4.x-Linux/solr/build/solr-core/test/J0/./org.apache.solr.cloud.ZkSolrClientTest-1346633097033/zookeeper/server1/data/version-2/snapshot.0
[junit4:junit4]   2> 27937 T1765 oazsp.FileTxnSnapLog.save Snapshotting: 8
[junit4:junit4]   2> 28035 T1739 oasc.ZkTestServer.run start zk server on port:49970
[junit4:junit4]   2> 28636 T1739 oascc.SolrZkClient.makePath makePath: collections/collection3
[junit4:junit4]   2> 29858 T1763 oaz.ClientCnxn$SendThread.startConnect Opening socket
connection to server localhost.localdomain/127.0.0.1:49970
[junit4:junit4]   2> 29859 T1763 oaz.ClientCnxn$SendThread.primeConnection Socket connection
established to localhost.localdomain/127.0.0.1:49970, initiating session
[junit4:junit4]   2> 29859 T1766 oazs.NIOServerCnxn$Factory.run Accepted socket connection
from /127.0.0.1:43944
[junit4:junit4]   2> 29859 T1766 oazs.NIOServerCnxn.readConnectRequest Client attempting
to renew session 0x13989965f4e0001 at /127.0.0.1:43944
[junit4:junit4]   2> 29860 T1766 oazs.NIOServerCnxn.finishSessionInit Established session
0x13989965f4e0001 with negotiated timeout 10000 for client /127.0.0.1:43944
[junit4:junit4]   2> 29860 T1763 oaz.ClientCnxn$SendThread.readConnectResult Session establishment
complete on server localhost.localdomain/127.0.0.1:49970, sessionid = 0x13989965f4e0001, negotiated
timeout = 10000
[junit4:junit4]   2> 29861 T1764 oascc.ConnectionManager.process Watcher org.apache.solr.common.cloud.ConnectionManager@1806a6c
name:ZooKeeperConnection Watcher:127.0.0.1:49970/solr got event WatchedEvent state:SyncConnected
type:None path:null path:null type:None
[junit4:junit4]   2> 29862 T1768 oazsp.FileTxnLog.append Creating new log file: log.9
[junit4:junit4]   2> 29865 T1739 oazs.ZooKeeperServer.expire Expiring session 0x13989965f4e0001,
timeout of 4000ms exceeded
[junit4:junit4]   2> 29866 T1769 oazs.PrepRequestProcessor.pRequest Processed session termination
for sessionid: 0x13989965f4e0001
[junit4:junit4]   2> 29867 T1768 oazs.NIOServerCnxn.closeSock Closed socket connection
for client /127.0.0.1:43944 which had sessionid 0x13989965f4e0001
[junit4:junit4]   2> 29867 T1763 oaz.ClientCnxn$SendThread.run Unable to read additional
data from server sessionid 0x13989965f4e0001, likely server has closed socket, closing socket
connection and attempting reconnect
[junit4:junit4]   2> 29968 T1764 oascc.ConnectionManager.process Watcher org.apache.solr.common.cloud.ConnectionManager@1806a6c
name:ZooKeeperConnection Watcher:127.0.0.1:49970/solr got event WatchedEvent state:Disconnected
type:None path:null path:null type:None
[junit4:junit4]   2> 29968 T1764 oascc.ConnectionManager.process zkClient has disconnected
[junit4:junit4]   2> 30624 T1758 oazs.SessionTrackerImpl.run SessionTrackerImpl exited
loop!
[junit4:junit4]   2> 30866 T1739 oascc.SolrZkClient.makePath makePath: collections/collection4
[junit4:junit4]   2> 31423 T1763 oaz.ClientCnxn$SendThread.startConnect Opening socket
connection to server localhost.localdomain/127.0.0.1:49970
[junit4:junit4]   2> 31423 T1763 oaz.ClientCnxn$SendThread.primeConnection Socket connection
established to localhost.localdomain/127.0.0.1:49970, initiating session
[junit4:junit4]   2> 31423 T1766 oazs.NIOServerCnxn$Factory.run Accepted socket connection
from /127.0.0.1:43945
[junit4:junit4]   2> 31424 T1766 oazs.NIOServerCnxn.readConnectRequest Client attempting
to renew session 0x13989965f4e0001 at /127.0.0.1:43945
[junit4:junit4]   2> 31424 T1766 oazs.NIOServerCnxn.finishSessionInit Invalid session 0x13989965f4e0001
for client /127.0.0.1:43945, probably expired
[junit4:junit4]   2> 31424 T1763 oaz.ClientCnxn$SendThread.run Unable to reconnect to ZooKeeper
service, session 0x13989965f4e0001 has expired, closing socket connection
[junit4:junit4]   2> 31425 T1764 oascc.ConnectionManager.process Watcher org.apache.solr.common.cloud.ConnectionManager@1806a6c
name:ZooKeeperConnection Watcher:127.0.0.1:49970/solr got event WatchedEvent state:Expired
type:None path:null path:null type:None
[junit4:junit4]   2> 31425 T1766 oazs.NIOServerCnxn.closeSock Closed socket connection
for client /127.0.0.1:43945 which had sessionid 0x13989965f4e0001
[junit4:junit4]   2> 31425 T1764 oascc.ConnectionManager.process Our previous ZooKeeper
session was expired. Attempting to reconnect to recover relationship with ZooKeeper...
[junit4:junit4]   2> 31425 T1764 oascc.DefaultConnectionStrategy.reconnect Connection expired
- starting a new one...
[junit4:junit4]   2> 31425 T1764 oaz.ZooKeeper.<init> Initiating client connection,
connectString=127.0.0.1:49970/solr sessionTimeout=10000 watcher=org.apache.solr.common.cloud.ConnectionManager@1806a6c
[junit4:junit4]   2> 31426 T1770 oaz.ClientCnxn$SendThread.startConnect Opening socket
connection to server /127.0.0.1:49970
[junit4:junit4]   2> 31426 T1764 oascc.ConnectionManager.waitForConnected Waiting for client
to connect to ZooKeeper
[junit4:junit4]   2> 31426 T1766 oazs.NIOServerCnxn$Factory.run Accepted socket connection
from /127.0.0.1:43946
[junit4:junit4]   2> 31427 T1770 oaz.ClientCnxn$SendThread.primeConnection Socket connection
established to localhost.localdomain/127.0.0.1:49970, initiating session
[junit4:junit4]   2> 31427 T1766 oazs.NIOServerCnxn.readConnectRequest Client attempting
to establish new session at /127.0.0.1:43946
[junit4:junit4]   2> 31428 T1768 oazs.NIOServerCnxn.finishSessionInit Established session
0x139899660610000 with negotiated timeout 10000 for client /127.0.0.1:43946
[junit4:junit4]   2> 31428 T1770 oaz.ClientCnxn$SendThread.readConnectResult Session establishment
complete on server localhost.localdomain/127.0.0.1:49970, sessionid = 0x139899660610000, negotiated
timeout = 10000
[junit4:junit4]   2> 31428 T1771 oascc.ConnectionManager.process Watcher org.apache.solr.common.cloud.ConnectionManager@1806a6c
name:ZooKeeperConnection Watcher:127.0.0.1:49970/solr got event WatchedEvent state:SyncConnected
type:None path:null path:null type:None
[junit4:junit4]   2> 31428 T1764 oascc.ConnectionManager.waitForConnected Client is connected
to ZooKeeper
[junit4:junit4]   2> 31428 T1764 oascc.ConnectionManager$1.update Connection with ZooKeeper
reestablished.
[junit4:junit4]   2> 31429 T1764 oascc.DefaultConnectionStrategy.reconnect Reconnected
to ZooKeeper
[junit4:junit4]   2> 31429 T1764 oascc.ConnectionManager.process Connected:true
[junit4:junit4]   2> 31429 T1764 oaz.ClientCnxn$EventThread.run EventThread shut down
[junit4:junit4]   2> 31525 T1739 oascc.SolrZkClient.makePath makePath: collections/collection4
[junit4:junit4]   2> 31526 T1769 oazs.PrepRequestProcessor.pRequest Processed session termination
for sessionid: 0x139899660610000
[junit4:junit4]   2> 31527 T1766 oazs.NIOServerCnxn.closeSock Closed socket connection
for client /127.0.0.1:43946 which had sessionid 0x139899660610000
[junit4:junit4]   2> 31527 T1771 oaz.ClientCnxn$EventThread.run EventThread shut down
[junit4:junit4]   2> 31527 T1739 oaz.ZooKeeper.close Session: 0x139899660610000 closed
[junit4:junit4]   2> 31528 T1769 oazs.PrepRequestProcessor.run PrepRequestProcessor exited
loop!
[junit4:junit4]   2> 31528 T1768 oazs.SyncRequestProcessor.run SyncRequestProcessor exited!
[junit4:junit4]   2> 31528 T1739 oazs.FinalRequestProcessor.shutdown shutdown of request
processor complete
[junit4:junit4]   2> 31530 T1766 oazs.NIOServerCnxn$Factory.run NIOServerCnxn factory exited
run method
[junit4:junit4]   2> 31530 T1739 oazs.FinalRequestProcessor.shutdown shutdown of request
processor complete
[junit4:junit4]   2> 31531 T1739 oasu.AbstractSolrTestCase.tearDown ####TEARDOWN_START
testReconnect
[junit4:junit4]   2> 31535 T1739 oasu.AbstractSolrTestCase.setUp ####SETUP_START testMakeRootNode
[junit4:junit4]   2> 31535 T1739 oasu.AbstractSolrTestCase.setUp ####SETUP_END testMakeRootNode
[junit4:junit4]   2> 31536 T1739 oasc.ZkTestServer.run STARTING ZK TEST SERVER
[junit4:junit4]   2> 31537 T1772 oazs.ZooKeeperServer.setTickTime tickTime set to 3000
[junit4:junit4]   2> 31537 T1772 oazs.NIOServerCnxn$Factory.<init> binding to port
0.0.0.0/0.0.0.0:0
[junit4:junit4]   2> 31537 T1772 oazsp.FileTxnSnapLog.save Snapshotting: 0
[junit4:junit4]   2> 31636 T1739 oasc.ZkTestServer.run start zk server on port:54699
[junit4:junit4]   2> 31637 T1739 oaz.ZooKeeper.<init> Initiating client connection,
connectString=127.0.0.1:54699 sessionTimeout=10000 watcher=org.apache.solr.common.cloud.ConnectionManager@1720ed7
[junit4:junit4]   2> 31637 T1777 oaz.ClientCnxn$SendThread.startConnect Opening socket
connection to server /127.0.0.1:54699
[junit4:junit4]   2> 31637 T1739 oascc.ConnectionManager.waitForConnected Waiting for client
to connect to ZooKeeper
[junit4:junit4]   2> 31638 T1773 oazs.NIOServerCnxn$Factory.run Accepted socket connection
from /127.0.0.1:57996
[junit4:junit4]   2> 31638 T1777 oaz.ClientCnxn$SendThread.primeConnection Socket connection
established to localhost.localdomain/127.0.0.1:54699, initiating session
[junit4:junit4]   2> 31638 T1773 oazs.NIOServerCnxn.readConnectRequest Client attempting
to establish new session at /127.0.0.1:57996
[junit4:junit4]   2> 31639 T1775 oazsp.FileTxnLog.append Creating new log file: log.1
[junit4:junit4]   2> 31720 T1775 oazs.NIOServerCnxn.finishSessionInit Established session
0x13989966e720000 with negotiated timeout 10000 for client /127.0.0.1:57996
[junit4:junit4]   2> 31720 T1777 oaz.ClientCnxn$SendThread.readConnectResult Session establishment
complete on server localhost.localdomain/127.0.0.1:54699, sessionid = 0x13989966e720000, negotiated
timeout = 10000
[junit4:junit4]   2> 31721 T1778 oascc.ConnectionManager.process Watcher org.apache.solr.common.cloud.ConnectionManager@1720ed7
name:ZooKeeperConnection Watcher:127.0.0.1:54699 got event WatchedEvent state:SyncConnected
type:None path:null path:null type:None
[junit4:junit4]   2> 31723 T1739 oascc.ConnectionManager.waitForConnected Client is connected
to ZooKeeper
[junit4:junit4]   2> 31743 T1739 oascc.SolrZkClient.makePath makePath: /solr
[junit4:junit4]   2> 31747 T1776 oazs.PrepRequestProcessor.pRequest Processed session termination
for sessionid: 0x13989966e720000
[junit4:junit4]   2> 31748 T1773 oazs.NIOServerCnxn.closeSock Closed socket connection
for client /127.0.0.1:57996 which had sessionid 0x13989966e720000
[junit4:junit4]   2> 31750 T1778 oaz.ClientCnxn$EventThread.run EventThread shut down
[junit4:junit4]   2> 31747 T1739 oaz.ZooKeeper.close Session: 0x13989966e720000 closed
[junit4:junit4]   2> 31750 T1739 oaz.ZooKeeper.<init> Initiating client connection,
connectString=127.0.0.1:54699 sessionTimeout=10000 watcher=org.apache.solr.common.cloud.ConnectionManager@24957f
[junit4:junit4]   2> 31751 T1779 oaz.ClientCnxn$SendThread.startConnect Opening socket
connection to server /127.0.0.1:54699
[junit4:junit4]   2> 31752 T1773 oazs.NIOServerCnxn$Factory.run Accepted socket connection
from /127.0.0.1:57997
[junit4:junit4]   2> 31752 T1779 oaz.ClientCnxn$SendThread.primeConnection Socket connection
established to localhost.localdomain/127.0.0.1:54699, initiating session
[junit4:junit4]   2> 31752 T1739 oascc.ConnectionManager.waitForConnected Waiting for client
to connect to ZooKeeper
[junit4:junit4]   2> 31752 T1773 oazs.NIOServerCnxn.readConnectRequest Client attempting
to establish new session at /127.0.0.1:57997
[junit4:junit4]   2> 31754 T1775 oazs.NIOServerCnxn.finishSessionInit Established session
0x13989966e720001 with negotiated timeout 10000 for client /127.0.0.1:57997
[junit4:junit4]   2> 31754 T1779 oaz.ClientCnxn$SendThread.readConnectResult Session establishment
complete on server localhost.localdomain/127.0.0.1:54699, sessionid = 0x13989966e720001, negotiated
timeout = 10000
[junit4:junit4]   2> 31754 T1780 oascc.ConnectionManager.process Watcher org.apache.solr.common.cloud.ConnectionManager@24957f
name:ZooKeeperConnection Watcher:127.0.0.1:54699 got event WatchedEvent state:SyncConnected
type:None path:null path:null type:None
[junit4:junit4]   2> 31754 T1739 oascc.ConnectionManager.waitForConnected Client is connected
to ZooKeeper
[junit4:junit4]   2> 31755 T1776 oazs.PrepRequestProcessor.pRequest Processed session termination
for sessionid: 0x13989966e720001
[junit4:junit4]   2> 31755 T1773 oazs.NIOServerCnxn.closeSock Closed socket connection
for client /127.0.0.1:57997 which had sessionid 0x13989966e720001
[junit4:junit4]   2> 31756 T1780 oaz.ClientCnxn$EventThread.run EventThread shut down
[junit4:junit4]   2> 31756 T1739 oaz.ZooKeeper.close Session: 0x13989966e720001 closed
[junit4:junit4]   2> 31756 T1776 oazs.PrepRequestProcessor.run PrepRequestProcessor exited
loop!
[junit4:junit4]   2> 31757 T1775 oazs.SyncRequestProcessor.run SyncRequestProcessor exited!
[junit4:junit4]   2> 31757 T1739 oazs.FinalRequestProcessor.shutdown shutdown of request
processor complete
[junit4:junit4]   2> 31760 T1773 oazs.NIOServerCnxn$Factory.run NIOServerCnxn factory exited
run method
[junit4:junit4]   2> 31760 T1739 oazs.FinalRequestProcessor.shutdown shutdown of request
processor complete
[junit4:junit4]   2> 31761 T1739 oasu.AbstractSolrTestCase.tearDown ####TEARDOWN_START
testMakeRootNode
[junit4:junit4]   2> 33624 T1774 oazs.SessionTrackerImpl.run SessionTrackerImpl exited
loop!
[junit4:junit4]   2> 33624 T1767 oazs.SessionTrackerImpl.run SessionTrackerImpl exited
loop!
[junit4:junit4]   2> NOTE: test params are: codec=Lucene40: {}, sim=RandomSimilarityProvider(queryNorm=true,coord=crazy):
{}, locale=ar_KW, timezone=Atlantic/Faroe
[junit4:junit4]   2> NOTE: Linux 3.2.0-29-generic i386/Oracle Corporation 1.8.0-ea (32-bit)/cpus=8,threads=1,free=164319168,total=536870912
[junit4:junit4]   2> NOTE: All tests run in this JVM: [TestQuerySenderNoQuery, BinaryUpdateRequestHandlerTest,
TestStressVersions, TestSolrQueryParser, DateMathParserTest, TestIndexSearcher, AlternateDirectoryTest,
CSVRequestHandlerTest, IndexBasedSpellCheckerTest, TestXIncludeConfig, TestPHPSerializedResponseWriter,
SOLR749Test, TestPseudoReturnFields, TermVectorComponentDistributedTest, FastVectorHighlighterTest,
TestDefaultSimilarityFactory, TestPerFieldSimilarity, TestCharFilters, TestFastLRUCache, TestIBSimilarityFactory,
DistanceFunctionTest, TestGroupingSearch, DefaultValueUpdateProcessorTest, SearchHandlerTest,
TestLMJelinekMercerSimilarityFactory, ClusterStateTest, SystemInfoHandlerTest, TestFiltering,
DistributedTermsComponentTest, FieldAnalysisRequestHandlerTest, NoCacheHeaderTest, SolrCoreCheckLockOnStartupTest,
BadComponentTest, DirectUpdateHandlerOptimizeTest, DateFieldTest, TestCoreContainer, ZkCLITest,
CopyFieldTest, CurrencyFieldTest, NotRequiredUniqueKeyTest, TestLMDirichletSimilarityFactory,
TestNumberUtils, TestBadConfig, SortByFunctionTest, DirectSolrConnectionTest, ResourceLoaderTest,
MinimalSchemaTest, TestElisionMultitermQuery, UniqFieldsUpdateProcessorFactoryTest, UpdateRequestProcessorFactoryTest,
TestFaceting, TestDocumentBuilder, CacheHeaderTest, AnalysisAfterCoreReloadTest, BasicDistributedZkTest,
SpellCheckComponentTest, TestReplicationHandler, DistributedSpellCheckComponentTest, TestRealTimeGet,
ZkControllerTest, TestDistributedGrouping, TestDistributedSearch, SpellCheckCollatorTest,
TestExtendedDismaxParser, AutoCommitTest, ZkSolrClientTest]
[junit4:junit4] Completed on J0 in 15.67s, 4 tests, 1 failure <<< FAILURES!

[...truncated 301 lines...]
BUILD FAILED
/mnt/ssd/jenkins/workspace/Lucene-Solr-4.x-Linux/build.xml:29: The following error occurred
while executing this line:
/mnt/ssd/jenkins/workspace/Lucene-Solr-4.x-Linux/solr/build.xml:144: The following error occurred
while executing this line:
/mnt/ssd/jenkins/workspace/Lucene-Solr-4.x-Linux/lucene/module-build.xml:62: The following
error occurred while executing this line:
/mnt/ssd/jenkins/workspace/Lucene-Solr-4.x-Linux/lucene/common-build.xml:1056: The following
error occurred while executing this line:
/mnt/ssd/jenkins/workspace/Lucene-Solr-4.x-Linux/lucene/common-build.xml:741: There were test
failures: 228 suites, 910 tests, 1 failure, 7 ignored (2 assumptions)

Total time: 25 minutes 14 seconds
Build step 'Invoke Ant' marked build as failure
Recording test results
Description set: Java: 32bit/jdk1.8.0-ea-b51 -server -XX:+UseG1GC
Email was triggered for: Failure
Sending email for trigger: Failure



Mime
View raw message