lucene-dev mailing list archives

Site index · List index
Message view « Date » · « Thread »
Top « Date » · « Thread »
From Apache Jenkins Server <jenk...@builds.apache.org>
Subject [JENKINS] Lucene-Solr-Tests-4.x-Java6 - Build # 697 - Failure
Date Sun, 23 Sep 2012 06:47:28 GMT
Build: https://builds.apache.org/job/Lucene-Solr-Tests-4.x-Java6/697/

2 tests failed.
REGRESSION:  org.apache.solr.cloud.BasicDistributedZk2Test.testDistribSearch

Error Message:
Shard still reported as live in zk

Stack Trace:
java.lang.AssertionError: Shard still reported as live in zk
	at __randomizedtesting.SeedInfo.seed([EF774F3D8A46BA45:6E91C125FD19DA79]:0)
	at org.junit.Assert.fail(Assert.java:93)
	at org.apache.solr.cloud.AbstractFullDistribZkTestBase.waitToSeeNotLive(AbstractFullDistribZkTestBase.java:1220)
	at org.apache.solr.cloud.BasicDistributedZk2Test.brindDownShardIndexSomeDocsAndRecover(BasicDistributedZk2Test.java:190)
	at org.apache.solr.cloud.BasicDistributedZk2Test.doTest(BasicDistributedZk2Test.java:83)
	at org.apache.solr.BaseDistributedSearchTestCase.testDistribSearch(BaseDistributedSearchTestCase.java:695)
	at sun.reflect.NativeMethodAccessorImpl.invoke0(Native Method)
	at sun.reflect.NativeMethodAccessorImpl.invoke(NativeMethodAccessorImpl.java:57)
	at sun.reflect.DelegatingMethodAccessorImpl.invoke(DelegatingMethodAccessorImpl.java:43)
	at java.lang.reflect.Method.invoke(Method.java:616)
	at com.carrotsearch.randomizedtesting.RandomizedRunner.invoke(RandomizedRunner.java:1559)
	at com.carrotsearch.randomizedtesting.RandomizedRunner.access$600(RandomizedRunner.java:79)
	at com.carrotsearch.randomizedtesting.RandomizedRunner$6.evaluate(RandomizedRunner.java:737)
	at com.carrotsearch.randomizedtesting.RandomizedRunner$7.evaluate(RandomizedRunner.java:773)
	at com.carrotsearch.randomizedtesting.RandomizedRunner$8.evaluate(RandomizedRunner.java:787)
	at com.carrotsearch.randomizedtesting.rules.SystemPropertiesRestoreRule$1.evaluate(SystemPropertiesRestoreRule.java:53)
	at org.apache.lucene.util.TestRuleSetupTeardownChained$1.evaluate(TestRuleSetupTeardownChained.java:50)
	at org.apache.lucene.util.TestRuleFieldCacheSanity$1.evaluate(TestRuleFieldCacheSanity.java:51)
	at org.apache.lucene.util.AbstractBeforeAfterRule$1.evaluate(AbstractBeforeAfterRule.java:45)
	at com.carrotsearch.randomizedtesting.rules.SystemPropertiesInvariantRule$1.evaluate(SystemPropertiesInvariantRule.java:55)
	at org.apache.lucene.util.TestRuleThreadAndTestName$1.evaluate(TestRuleThreadAndTestName.java:48)
	at org.apache.lucene.util.TestRuleIgnoreAfterMaxFailures$1.evaluate(TestRuleIgnoreAfterMaxFailures.java:70)
	at org.apache.lucene.util.TestRuleMarkFailure$1.evaluate(TestRuleMarkFailure.java:48)
	at com.carrotsearch.randomizedtesting.rules.StatementAdapter.evaluate(StatementAdapter.java:36)
	at com.carrotsearch.randomizedtesting.ThreadLeakControl$StatementRunner.run(ThreadLeakControl.java:358)
	at com.carrotsearch.randomizedtesting.ThreadLeakControl.forkTimeoutingTask(ThreadLeakControl.java:782)
	at com.carrotsearch.randomizedtesting.ThreadLeakControl$3.evaluate(ThreadLeakControl.java:442)
	at com.carrotsearch.randomizedtesting.RandomizedRunner.runSingleTest(RandomizedRunner.java:746)
	at com.carrotsearch.randomizedtesting.RandomizedRunner$3.evaluate(RandomizedRunner.java:648)
	at com.carrotsearch.randomizedtesting.RandomizedRunner$4.evaluate(RandomizedRunner.java:682)
	at com.carrotsearch.randomizedtesting.RandomizedRunner$5.evaluate(RandomizedRunner.java:693)
	at com.carrotsearch.randomizedtesting.rules.StatementAdapter.evaluate(StatementAdapter.java:36)
	at com.carrotsearch.randomizedtesting.rules.SystemPropertiesRestoreRule$1.evaluate(SystemPropertiesRestoreRule.java:53)
	at org.apache.lucene.util.AbstractBeforeAfterRule$1.evaluate(AbstractBeforeAfterRule.java:45)
	at org.apache.lucene.util.TestRuleStoreClassName$1.evaluate(TestRuleStoreClassName.java:42)
	at com.carrotsearch.randomizedtesting.rules.SystemPropertiesInvariantRule$1.evaluate(SystemPropertiesInvariantRule.java:55)
	at com.carrotsearch.randomizedtesting.rules.NoShadowingOrOverridesOnMethodsRule$1.evaluate(NoShadowingOrOverridesOnMethodsRule.java:39)
	at com.carrotsearch.randomizedtesting.rules.NoShadowingOrOverridesOnMethodsRule$1.evaluate(NoShadowingOrOverridesOnMethodsRule.java:39)
	at com.carrotsearch.randomizedtesting.rules.StatementAdapter.evaluate(StatementAdapter.java:36)
	at org.apache.lucene.util.TestRuleAssertionsRequired$1.evaluate(TestRuleAssertionsRequired.java:43)
	at org.apache.lucene.util.TestRuleMarkFailure$1.evaluate(TestRuleMarkFailure.java:48)
	at org.apache.lucene.util.TestRuleIgnoreAfterMaxFailures$1.evaluate(TestRuleIgnoreAfterMaxFailures.java:70)
	at org.apache.lucene.util.TestRuleIgnoreTestSuites$1.evaluate(TestRuleIgnoreTestSuites.java:55)
	at com.carrotsearch.randomizedtesting.rules.StatementAdapter.evaluate(StatementAdapter.java:36)
	at com.carrotsearch.randomizedtesting.ThreadLeakControl$StatementRunner.run(ThreadLeakControl.java:358)
	at java.lang.Thread.run(Thread.java:679)


REGRESSION:  org.apache.solr.cloud.SyncSliceTest.testDistribSearch

Error Message:
There are still nodes recoverying

Stack Trace:
java.lang.AssertionError: There are still nodes recoverying
	at __randomizedtesting.SeedInfo.seed([EF774F3D8A46BA45:6E91C125FD19DA79]:0)
	at org.junit.Assert.fail(Assert.java:93)
	at org.apache.solr.cloud.AbstractDistribZkTestBase.waitForRecoveriesToFinish(AbstractDistribZkTestBase.java:154)
	at org.apache.solr.cloud.AbstractFullDistribZkTestBase.waitForRecoveriesToFinish(AbstractFullDistribZkTestBase.java:560)
	at org.apache.solr.cloud.AbstractFullDistribZkTestBase.waitForThingsToLevelOut(AbstractFullDistribZkTestBase.java:1135)
	at org.apache.solr.cloud.SyncSliceTest.doTest(SyncSliceTest.java:162)
	at org.apache.solr.BaseDistributedSearchTestCase.testDistribSearch(BaseDistributedSearchTestCase.java:695)
	at sun.reflect.NativeMethodAccessorImpl.invoke0(Native Method)
	at sun.reflect.NativeMethodAccessorImpl.invoke(NativeMethodAccessorImpl.java:57)
	at sun.reflect.DelegatingMethodAccessorImpl.invoke(DelegatingMethodAccessorImpl.java:43)
	at java.lang.reflect.Method.invoke(Method.java:616)
	at com.carrotsearch.randomizedtesting.RandomizedRunner.invoke(RandomizedRunner.java:1559)
	at com.carrotsearch.randomizedtesting.RandomizedRunner.access$600(RandomizedRunner.java:79)
	at com.carrotsearch.randomizedtesting.RandomizedRunner$6.evaluate(RandomizedRunner.java:737)
	at com.carrotsearch.randomizedtesting.RandomizedRunner$7.evaluate(RandomizedRunner.java:773)
	at com.carrotsearch.randomizedtesting.RandomizedRunner$8.evaluate(RandomizedRunner.java:787)
	at com.carrotsearch.randomizedtesting.rules.SystemPropertiesRestoreRule$1.evaluate(SystemPropertiesRestoreRule.java:53)
	at org.apache.lucene.util.TestRuleSetupTeardownChained$1.evaluate(TestRuleSetupTeardownChained.java:50)
	at org.apache.lucene.util.TestRuleFieldCacheSanity$1.evaluate(TestRuleFieldCacheSanity.java:51)
	at org.apache.lucene.util.AbstractBeforeAfterRule$1.evaluate(AbstractBeforeAfterRule.java:45)
	at com.carrotsearch.randomizedtesting.rules.SystemPropertiesInvariantRule$1.evaluate(SystemPropertiesInvariantRule.java:55)
	at org.apache.lucene.util.TestRuleThreadAndTestName$1.evaluate(TestRuleThreadAndTestName.java:48)
	at org.apache.lucene.util.TestRuleIgnoreAfterMaxFailures$1.evaluate(TestRuleIgnoreAfterMaxFailures.java:70)
	at org.apache.lucene.util.TestRuleMarkFailure$1.evaluate(TestRuleMarkFailure.java:48)
	at com.carrotsearch.randomizedtesting.rules.StatementAdapter.evaluate(StatementAdapter.java:36)
	at com.carrotsearch.randomizedtesting.ThreadLeakControl$StatementRunner.run(ThreadLeakControl.java:358)
	at com.carrotsearch.randomizedtesting.ThreadLeakControl.forkTimeoutingTask(ThreadLeakControl.java:782)
	at com.carrotsearch.randomizedtesting.ThreadLeakControl$3.evaluate(ThreadLeakControl.java:442)
	at com.carrotsearch.randomizedtesting.RandomizedRunner.runSingleTest(RandomizedRunner.java:746)
	at com.carrotsearch.randomizedtesting.RandomizedRunner$3.evaluate(RandomizedRunner.java:648)
	at com.carrotsearch.randomizedtesting.RandomizedRunner$4.evaluate(RandomizedRunner.java:682)
	at com.carrotsearch.randomizedtesting.RandomizedRunner$5.evaluate(RandomizedRunner.java:693)
	at com.carrotsearch.randomizedtesting.rules.StatementAdapter.evaluate(StatementAdapter.java:36)
	at com.carrotsearch.randomizedtesting.rules.SystemPropertiesRestoreRule$1.evaluate(SystemPropertiesRestoreRule.java:53)
	at org.apache.lucene.util.AbstractBeforeAfterRule$1.evaluate(AbstractBeforeAfterRule.java:45)
	at org.apache.lucene.util.TestRuleStoreClassName$1.evaluate(TestRuleStoreClassName.java:42)
	at com.carrotsearch.randomizedtesting.rules.SystemPropertiesInvariantRule$1.evaluate(SystemPropertiesInvariantRule.java:55)
	at com.carrotsearch.randomizedtesting.rules.NoShadowingOrOverridesOnMethodsRule$1.evaluate(NoShadowingOrOverridesOnMethodsRule.java:39)
	at com.carrotsearch.randomizedtesting.rules.NoShadowingOrOverridesOnMethodsRule$1.evaluate(NoShadowingOrOverridesOnMethodsRule.java:39)
	at com.carrotsearch.randomizedtesting.rules.StatementAdapter.evaluate(StatementAdapter.java:36)
	at org.apache.lucene.util.TestRuleAssertionsRequired$1.evaluate(TestRuleAssertionsRequired.java:43)
	at org.apache.lucene.util.TestRuleMarkFailure$1.evaluate(TestRuleMarkFailure.java:48)
	at org.apache.lucene.util.TestRuleIgnoreAfterMaxFailures$1.evaluate(TestRuleIgnoreAfterMaxFailures.java:70)
	at org.apache.lucene.util.TestRuleIgnoreTestSuites$1.evaluate(TestRuleIgnoreTestSuites.java:55)
	at com.carrotsearch.randomizedtesting.rules.StatementAdapter.evaluate(StatementAdapter.java:36)
	at com.carrotsearch.randomizedtesting.ThreadLeakControl$StatementRunner.run(ThreadLeakControl.java:358)
	at java.lang.Thread.run(Thread.java:679)




Build Log:
[...truncated 7190 lines...]
[junit4:junit4] Suite: org.apache.solr.cloud.BasicDistributedZk2Test
[junit4:junit4]   2> 5 T358 oas.SolrTestCaseJ4.setUp ###Starting testDistribSearch
[junit4:junit4]   2> Creating dataDir: /usr/home/hudson/hudson-slave/workspace/Lucene-Solr-Tests-4.x-Java6/solr/build/solr-core/test/J1/./solrtest-BasicDistributedZk2Test-1348382141302
[junit4:junit4]   2> 12 T358 oasc.ZkTestServer.run STARTING ZK TEST SERVER
[junit4:junit4]   2> 129 T359 oaz.Environment.logEnv Server environment:zookeeper.version=3.3.6-1366786, built on 07/29/2012 06:22 GMT
[junit4:junit4]   2> 129 T359 oaz.Environment.logEnv Server environment:host.name=lucene.zones.apache.org
[junit4:junit4]   2> 130 T359 oaz.Environment.logEnv Server environment:java.version=1.6.0_32
[junit4:junit4]   2> 130 T359 oaz.Environment.logEnv Server environment:java.vendor=Sun Microsystems Inc.
[junit4:junit4]   2> 130 T359 oaz.Environment.logEnv Server environment:java.home=/usr/local/openjdk6/jre
[junit4:junit4]   2> 130 T359 oaz.Environment.logEnv Server environment:java.class.path=/usr/home/hudson/hudson-slave/workspace/Lucene-Solr-Tests-4.x-Java6/solr/build/solr-core/classes/test:/usr/home/hudson/hudson-slave/workspace/Lucene-Solr-Tests-4.x-Java6/solr/build/solr-test-framework/classes/java:/usr/home/hudson/hudson-slave/workspace/Lucene-Solr-Tests-4.x-Java6/solr/build/solr-core/test-files:/usr/home/hudson/hudson-slave/workspace/Lucene-Solr-Tests-4.x-Java6/lucene/build/codecs/classes/java:/usr/home/hudson/hudson-slave/workspace/Lucene-Solr-Tests-4.x-Java6/lucene/build/test-framework/classes/java:/usr/home/hudson/hudson-slave/workspace/Lucene-Solr-Tests-4.x-Java6/solr/build/solr-solrj/classes/java:/usr/home/hudson/hudson-slave/workspace/Lucene-Solr-Tests-4.x-Java6/solr/build/solr-core/classes/java:/usr/home/hudson/hudson-slave/workspace/Lucene-Solr-Tests-4.x-Java6/lucene/build/analysis/common/lucene-analyzers-common-4.1-SNAPSHOT.jar:/usr/home/hudson/hudson-slave/workspace/Lucene-Solr-Tests-4.x-Java6/lucene/build/analysis/kuromoji/lucene-analyzers-kuromoji-4.1-SNAPSHOT.jar:/usr/home/hudson/hudson-slave/workspace/Lucene-Solr-Tests-4.x-Java6/lucene/build/analysis/phonetic/lucene-analyzers-phonetic-4.1-SNAPSHOT.jar:/usr/home/hudson/hudson-slave/workspace/Lucene-Solr-Tests-4.x-Java6/lucene/build/highlighter/lucene-highlighter-4.1-SNAPSHOT.jar:/usr/home/hudson/hudson-slave/workspace/Lucene-Solr-Tests-4.x-Java6/lucene/build/memory/lucene-memory-4.1-SNAPSHOT.jar:/usr/home/hudson/hudson-slave/workspace/Lucene-Solr-Tests-4.x-Java6/lucene/build/misc/lucene-misc-4.1-SNAPSHOT.jar:/usr/home/hudson/hudson-slave/workspace/Lucene-Solr-Tests-4.x-Java6/lucene/build/spatial/lucene-spatial-4.1-SNAPSHOT.jar:/usr/home/hudson/hudson-slave/workspace/Lucene-Solr-Tests-4.x-Java6/lucene/build/suggest/lucene-suggest-4.1-SNAPSHOT.jar:/usr/home/hudson/hudson-slave/workspace/Lucene-Solr-Tests-4.x-Java6/lucene/build/grouping/lucene-grouping-4.1-SNAPSHOT.jar:/usr/home/hudson/hudson-slave/workspace/Lucene-Solr-Tests-4.x-Java6/lucene/build/queries/lucene-queries-4.1-SNAPSHOT.jar:/usr/home/hudson/hudson-slave/workspace/Lucene-Solr-Tests-4.x-Java6/lucene/build/queryparser/lucene-queryparser-4.1-SNAPSHOT.jar:/usr/home/hudson/hudson-slave/workspace/Lucene-Solr-Tests-4.x-Java6/solr/core/lib/commons-cli-1.2.jar:/usr/home/hudson/hudson-slave/workspace/Lucene-Solr-Tests-4.x-Java6/solr/core/lib/commons-codec-1.7.jar:/usr/home/hudson/hudson-slave/workspace/Lucene-Solr-Tests-4.x-Java6/solr/core/lib/commons-fileupload-1.2.1.jar:/usr/home/hudson/hudson-slave/workspace/Lucene-Solr-Tests-4.x-Java6/solr/core/lib/commons-lang-2.6.jar:/usr/home/hudson/hudson-slave/workspace/Lucene-Solr-Tests-4.x-Java6/solr/core/lib/easymock-2.2.jar:/usr/home/hudson/hudson-slave/workspace/Lucene-Solr-Tests-4.x-Java6/solr/core/lib/guava-r05.jar:/usr/home/hudson/hudson-slave/workspace/Lucene-Solr-Tests-4.x-Java6/solr/core/lib/javax.servlet-api-3.0.1.jar:/usr/home/hudson/hudson-slave/workspace/Lucene-Solr-Tests-4.x-Java6/solr/core/lib/spatial4j-0.3.jar:/usr/home/hudson/hudson-slave/workspace/Lucene-Solr-Tests-4.x-Java6/solr/solrj/lib/commons-io-2.1.jar:/usr/home/hudson/hudson-slave/workspace/Lucene-Solr-Tests-4.x-Java6/solr/solrj/lib/httpclient-4.1.3.jar:/usr/home/hudson/hudson-slave/workspace/Lucene-Solr-Tests-4.x-Java6/solr/solrj/lib/httpcore-4.1.4.jar:/usr/home/hudson/hudson-slave/workspace/Lucene-Solr-Tests-4.x-Java6/solr/solrj/lib/httpmime-4.1.3.jar:/usr/home/hudson/hudson-slave/workspace/Lucene-Solr-Tests-4.x-Java6/solr/solrj/lib/jcl-over-slf4j-1.6.4.jar:/usr/home/hudson/hudson-slave/workspace/Lucene-Solr-Tests-4.x-Java6/solr/solrj/lib/log4j-over-slf4j-1.6.4.jar:/usr/home/hudson/hudson-slave/workspace/Lucene-Solr-Tests-4.x-Java6/solr/solrj/lib/slf4j-api-1.6.4.jar:/usr/home/hudson/hudson-slave/workspace/Lucene-Solr-Tests-4.x-Java6/solr/solrj/lib/slf4j-jdk14-1.6.4.jar:/usr/home/hudson/hudson-slave/workspace/Lucene-Solr-Tests-4.x-Java6/solr/solrj/lib/wstx-asl-3.2.7.jar:/usr/home/hudson/hudson-slave/workspace/Lucene-Solr-Tests-4.x-Java6/solr/solrj/lib/zookeeper-3.3.6.jar:/usr/home/hudson/hudson-slave/workspace/Lucene-Solr-Tests-4.x-Java6/solr/example/lib/jetty-continuation-8.1.2.v20120308.jar:/usr/home/hudson/hudson-slave/workspace/Lucene-Solr-Tests-4.x-Java6/solr/example/lib/jetty-deploy-8.1.2.v20120308.jar:/usr/home/hudson/hudson-slave/workspace/Lucene-Solr-Tests-4.x-Java6/solr/example/lib/jetty-http-8.1.2.v20120308.jar:/usr/home/hudson/hudson-slave/workspace/Lucene-Solr-Tests-4.x-Java6/solr/example/lib/jetty-io-8.1.2.v20120308.jar:/usr/home/hudson/hudson-slave/workspace/Lucene-Solr-Tests-4.x-Java6/solr/example/lib/jetty-jmx-8.1.2.v20120308.jar:/usr/home/hudson/hudson-slave/workspace/Lucene-Solr-Tests-4.x-Java6/solr/example/lib/jetty-security-8.1.2.v20120308.jar:/usr/home/hudson/hudson-slave/workspace/Lucene-Solr-Tests-4.x-Java6/solr/example/lib/jetty-server-8.1.2.v20120308.jar:/usr/home/hudson/hudson-slave/workspace/Lucene-Solr-Tests-4.x-Java6/solr/example/lib/jetty-servlet-8.1.2.v20120308.jar:/usr/home/hudson/hudson-slave/workspace/Lucene-Solr-Tests-4.x-Java6/solr/example/lib/jetty-util-8.1.2.v20120308.jar:/usr/home/hudson/hudson-slave/workspace/Lucene-Solr-Tests-4.x-Java6/solr/example/lib/jetty-webapp-8.1.2.v20120308.jar:/usr/home/hudson/hudson-slave/workspace/Lucene-Solr-Tests-4.x-Java6/solr/example/lib/jetty-xml-8.1.2.v20120308.jar:/usr/home/hudson/hudson-slave/workspace/Lucene-Solr-Tests-4.x-Java6/solr/example/lib/servlet-api-3.0.jar:/usr/home/hudson/hudson-slave/workspace/Lucene-Solr-Tests-4.x-Java6/solr/example/example-DIH/solr/db/lib/hsqldb-1.8.0.10.jar:/usr/home/hudson/hudson-slave/workspace/Lucene-Solr-Tests-4.x-Java6/lucene/build/core/classes/java:/usr/home/hudson/hudson-slave/workspace/Lucene-Solr-Tests-4.x-Java6/lucene/test-framework/lib/junit-4.10.jar:/usr/home/hudson/hudson-slave/workspace/Lucene-Solr-Tests-4.x-Java6/lucene/test-framework/lib/randomizedtesting-runner-2.0.1.jar:/home/hudson/hudson-slave/tools/Ant/ant-1.8.2/lib/ant-launcher.jar:/home/hudson/.ant/lib/ivy-2.2.0.jar:/home/hudson/hudson-slave/tools/Ant/ant-1.8.2/lib/ant-apache-regexp.jar:/home/hudson/hudson-slave/tools/Ant/ant-1.8.2/lib/ant-junit.jar:/home/hudson/hudson-slave/tools/Ant/ant-1.8.2/lib/ant-apache-bsf.jar:/home/hudson/hudson-slave/tools/Ant/ant-1.8.2/lib/ant-commons-net.jar:/home/hudson/hudson-slave/tools/Ant/ant-1.8.2/lib/ant-antlr.jar:/home/hudson/hudson-slave/tools/Ant/ant-1.8.2/lib/ant-apache-log4j.jar:/home/hudson/hudson-slave/tools/Ant/ant-1.8.2/lib/ant-commons-logging.jar:/home/hudson/hudson-slave/tools/Ant/ant-1.8.2/lib/ant-apache-xalan2.jar:/home/hudson/hudson-slave/tools/Ant/ant-1.8.2/lib/ant-apache-oro.jar:/home/hudson/hudson-slave/tools/Ant/ant-1.8.2/lib/ant-junit4.jar:/home/hudson/hudson-slave/tools/Ant/ant-1.8.2/lib/ant-netrexx.jar:/home/hudson/hudson-slave/tools/Ant/ant-1.8.2/lib/ant-swing.jar:/home/hudson/hudson-slave/tools/Ant/ant-1.8.2/lib/ant-javamail.jar:/home/hudson/hudson-slave/tools/Ant/ant-1.8.2/lib/ant-jsch.jar:/home/hudson/hudson-slave/tools/Ant/ant-1.8.2/lib/ant-jmf.jar:/home/hudson/hudson-slave/tools/Ant/ant-1.8.2/lib/ant.jar:/home/hudson/hudson-slave/tools/Ant/ant-1.8.2/lib/ant-apache-bcel.jar:/home/hudson/hudson-slave/tools/Ant/ant-1.8.2/lib/ant-jai.jar:/home/hudson/hudson-slave/tools/Ant/ant-1.8.2/lib/ant-testutil.jar:/home/hudson/hudson-slave/tools/Ant/ant-1.8.2/lib/ant-apache-resolver.jar:/home/hudson/hudson-slave/tools/Ant/ant-1.8.2/lib/ant-jdepend.jar:/usr/local/openjdk6/lib/tools.jar:/home/hudson/.ivy2/cache/com.carrotsearch.randomizedtesting/junit4-ant/jars/junit4-ant-2.0.1.jar
[junit4:junit4]   2> 131 T359 oaz.Environment.logEnv Server environment:java.library.path=/usr/local/openjdk6/jre/lib/amd64/server:/usr/local/openjdk6/jre/lib/amd64:/usr/local/openjdk6/jre/../lib/amd64:/usr/java/packages/lib/amd64:/lib:/usr/lib:/usr/local/lib
[junit4:junit4]   2> 131 T359 oaz.Environment.logEnv Server environment:java.io.tmpdir=.
[junit4:junit4]   2> 132 T359 oaz.Environment.logEnv Server environment:java.compiler=<NA>
[junit4:junit4]   2> 132 T359 oaz.Environment.logEnv Server environment:os.name=FreeBSD
[junit4:junit4]   2> 132 T359 oaz.Environment.logEnv Server environment:os.arch=amd64
[junit4:junit4]   2> 132 T359 oaz.Environment.logEnv Server environment:os.version=9.0-RELEASE
[junit4:junit4]   2> 132 T359 oaz.Environment.logEnv Server environment:user.name=hudson
[junit4:junit4]   2> 133 T359 oaz.Environment.logEnv Server environment:user.home=/home/hudson
[junit4:junit4]   2> 133 T359 oaz.Environment.logEnv Server environment:user.dir=/usr/home/hudson/hudson-slave/workspace/Lucene-Solr-Tests-4.x-Java6/solr/build/solr-core/test/J1
[junit4:junit4]   2> 186 T359 oazs.ZooKeeperServer.setTickTime tickTime set to 1000
[junit4:junit4]   2> 227 T359 oazs.NIOServerCnxn$Factory.<init> binding to port 0.0.0.0/0.0.0.0:0
[junit4:junit4]   2> 309 T359 oazsp.FileTxnSnapLog.save Snapshotting: 0
[junit4:junit4]   2> 320 T358 oasc.ZkTestServer.run start zk server on port:43519
[junit4:junit4]   2> 435 T358 oaz.Environment.logEnv Client environment:zookeeper.version=3.3.6-1366786, built on 07/29/2012 06:22 GMT
[junit4:junit4]   2> 436 T358 oaz.Environment.logEnv Client environment:host.name=lucene.zones.apache.org
[junit4:junit4]   2> 436 T358 oaz.Environment.logEnv Client environment:java.version=1.6.0_32
[junit4:junit4]   2> 436 T358 oaz.Environment.logEnv Client environment:java.vendor=Sun Microsystems Inc.
[junit4:junit4]   2> 436 T358 oaz.Environment.logEnv Client environment:java.home=/usr/local/openjdk6/jre
[junit4:junit4]   2> 437 T358 oaz.Environment.logEnv Client environment:java.class.path=/usr/home/hudson/hudson-slave/workspace/Lucene-Solr-Tests-4.x-Java6/solr/build/solr-core/classes/test:/usr/home/hudson/hudson-slave/workspace/Lucene-Solr-Tests-4.x-Java6/solr/build/solr-test-framework/classes/java:/usr/home/hudson/hudson-slave/workspace/Lucene-Solr-Tests-4.x-Java6/solr/build/solr-core/test-files:/usr/home/hudson/hudson-slave/workspace/Lucene-Solr-Tests-4.x-Java6/lucene/build/codecs/classes/java:/usr/home/hudson/hudson-slave/workspace/Lucene-Solr-Tests-4.x-Java6/lucene/build/test-framework/classes/java:/usr/home/hudson/hudson-slave/workspace/Lucene-Solr-Tests-4.x-Java6/solr/build/solr-solrj/classes/java:/usr/home/hudson/hudson-slave/workspace/Lucene-Solr-Tests-4.x-Java6/solr/build/solr-core/classes/java:/usr/home/hudson/hudson-slave/workspace/Lucene-Solr-Tests-4.x-Java6/lucene/build/analysis/common/lucene-analyzers-common-4.1-SNAPSHOT.jar:/usr/home/hudson/hudson-slave/workspace/Lucene-Solr-Tests-4.x-Java6/lucene/build/analysis/kuromoji/lucene-analyzers-kuromoji-4.1-SNAPSHOT.jar:/usr/home/hudson/hudson-slave/workspace/Lucene-Solr-Tests-4.x-Java6/lucene/build/analysis/phonetic/lucene-analyzers-phonetic-4.1-SNAPSHOT.jar:/usr/home/hudson/hudson-slave/workspace/Lucene-Solr-Tests-4.x-Java6/lucene/build/highlighter/lucene-highlighter-4.1-SNAPSHOT.jar:/usr/home/hudson/hudson-slave/workspace/Lucene-Solr-Tests-4.x-Java6/lucene/build/memory/lucene-memory-4.1-SNAPSHOT.jar:/usr/home/hudson/hudson-slave/workspace/Lucene-Solr-Tests-4.x-Java6/lucene/build/misc/lucene-misc-4.1-SNAPSHOT.jar:/usr/home/hudson/hudson-slave/workspace/Lucene-Solr-Tests-4.x-Java6/lucene/build/spatial/lucene-spatial-4.1-SNAPSHOT.jar:/usr/home/hudson/hudson-slave/workspace/Lucene-Solr-Tests-4.x-Java6/lucene/build/suggest/lucene-suggest-4.1-SNAPSHOT.jar:/usr/home/hudson/hudson-slave/workspace/Lucene-Solr-Tests-4.x-Java6/lucene/build/grouping/lucene-grouping-4.1-SNAPSHOT.jar:/usr/home/hudson/hudson-slave/workspace/Lucene-Solr-Tests-4.x-Java6/lucene/build/queries/lucene-queries-4.1-SNAPSHOT.jar:/usr/home/hudson/hudson-slave/workspace/Lucene-Solr-Tests-4.x-Java6/lucene/build/queryparser/lucene-queryparser-4.1-SNAPSHOT.jar:/usr/home/hudson/hudson-slave/workspace/Lucene-Solr-Tests-4.x-Java6/solr/core/lib/commons-cli-1.2.jar:/usr/home/hudson/hudson-slave/workspace/Lucene-Solr-Tests-4.x-Java6/solr/core/lib/commons-codec-1.7.jar:/usr/home/hudson/hudson-slave/workspace/Lucene-Solr-Tests-4.x-Java6/solr/core/lib/commons-fileupload-1.2.1.jar:/usr/home/hudson/hudson-slave/workspace/Lucene-Solr-Tests-4.x-Java6/solr/core/lib/commons-lang-2.6.jar:/usr/home/hudson/hudson-slave/workspace/Lucene-Solr-Tests-4.x-Java6/solr/core/lib/easymock-2.2.jar:/usr/home/hudson/hudson-slave/workspace/Lucene-Solr-Tests-4.x-Java6/solr/core/lib/guava-r05.jar:/usr/home/hudson/hudson-slave/workspace/Lucene-Solr-Tests-4.x-Java6/solr/core/lib/javax.servlet-api-3.0.1.jar:/usr/home/hudson/hudson-slave/workspace/Lucene-Solr-Tests-4.x-Java6/solr/core/lib/spatial4j-0.3.jar:/usr/home/hudson/hudson-slave/workspace/Lucene-Solr-Tests-4.x-Java6/solr/solrj/lib/commons-io-2.1.jar:/usr/home/hudson/hudson-slave/workspace/Lucene-Solr-Tests-4.x-Java6/solr/solrj/lib/httpclient-4.1.3.jar:/usr/home/hudson/hudson-slave/workspace/Lucene-Solr-Tests-4.x-Java6/solr/solrj/lib/httpcore-4.1.4.jar:/usr/home/hudson/hudson-slave/workspace/Lucene-Solr-Tests-4.x-Java6/solr/solrj/lib/httpmime-4.1.3.jar:/usr/home/hudson/hudson-slave/workspace/Lucene-Solr-Tests-4.x-Java6/solr/solrj/lib/jcl-over-slf4j-1.6.4.jar:/usr/home/hudson/hudson-slave/workspace/Lucene-Solr-Tests-4.x-Java6/solr/solrj/lib/log4j-over-slf4j-1.6.4.jar:/usr/home/hudson/hudson-slave/workspace/Lucene-Solr-Tests-4.x-Java6/solr/solrj/lib/slf4j-api-1.6.4.jar:/usr/home/hudson/hudson-slave/workspace/Lucene-Solr-Tests-4.x-Java6/solr/solrj/lib/slf4j-jdk14-1.6.4.jar:/usr/home/hudson/hudson-slave/workspace/Lucene-Solr-Tests-4.x-Java6/solr/solrj/lib/wstx-asl-3.2.7.jar:/usr/home/hudson/hudson-slave/workspace/Lucene-Solr-Tests-4.x-Java6/solr/solrj/lib/zookeeper-3.3.6.jar:/usr/home/hudson/hudson-slave/workspace/Lucene-Solr-Tests-4.x-Java6/solr/example/lib/jetty-continuation-8.1.2.v20120308.jar:/usr/home/hudson/hudson-slave/workspace/Lucene-Solr-Tests-4.x-Java6/solr/example/lib/jetty-deploy-8.1.2.v20120308.jar:/usr/home/hudson/hudson-slave/workspace/Lucene-Solr-Tests-4.x-Java6/solr/example/lib/jetty-http-8.1.2.v20120308.jar:/usr/home/hudson/hudson-slave/workspace/Lucene-Solr-Tests-4.x-Java6/solr/example/lib/jetty-io-8.1.2.v20120308.jar:/usr/home/hudson/hudson-slave/workspace/Lucene-Solr-Tests-4.x-Java6/solr/example/lib/jetty-jmx-8.1.2.v20120308.jar:/usr/home/hudson/hudson-slave/workspace/Lucene-Solr-Tests-4.x-Java6/solr/example/lib/jetty-security-8.1.2.v20120308.jar:/usr/home/hudson/hudson-slave/workspace/Lucene-Solr-Tests-4.x-Java6/solr/example/lib/jetty-server-8.1.2.v20120308.jar:/usr/home/hudson/hudson-slave/workspace/Lucene-Solr-Tests-4.x-Java6/solr/example/lib/jetty-servlet-8.1.2.v20120308.jar:/usr/home/hudson/hudson-slave/workspace/Lucene-Solr-Tests-4.x-Java6/solr/example/lib/jetty-util-8.1.2.v20120308.jar:/usr/home/hudson/hudson-slave/workspace/Lucene-Solr-Tests-4.x-Java6/solr/example/lib/jetty-webapp-8.1.2.v20120308.jar:/usr/home/hudson/hudson-slave/workspace/Lucene-Solr-Tests-4.x-Java6/solr/example/lib/jetty-xml-8.1.2.v20120308.jar:/usr/home/hudson/hudson-slave/workspace/Lucene-Solr-Tests-4.x-Java6/solr/example/lib/servlet-api-3.0.jar:/usr/home/hudson/hudson-slave/workspace/Lucene-Solr-Tests-4.x-Java6/solr/example/example-DIH/solr/db/lib/hsqldb-1.8.0.10.jar:/usr/home/hudson/hudson-slave/workspace/Lucene-Solr-Tests-4.x-Java6/lucene/build/core/classes/java:/usr/home/hudson/hudson-slave/workspace/Lucene-Solr-Tests-4.x-Java6/lucene/test-framework/lib/junit-4.10.jar:/usr/home/hudson/hudson-slave/workspace/Lucene-Solr-Tests-4.x-Java6/lucene/test-framework/lib/randomizedtesting-runner-2.0.1.jar:/home/hudson/hudson-slave/tools/Ant/ant-1.8.2/lib/ant-launcher.jar:/home/hudson/.ant/lib/ivy-2.2.0.jar:/home/hudson/hudson-slave/tools/Ant/ant-1.8.2/lib/ant-apache-regexp.jar:/home/hudson/hudson-slave/tools/Ant/ant-1.8.2/lib/ant-junit.jar:/home/hudson/hudson-slave/tools/Ant/ant-1.8.2/lib/ant-apache-bsf.jar:/home/hudson/hudson-slave/tools/Ant/ant-1.8.2/lib/ant-commons-net.jar:/home/hudson/hudson-slave/tools/Ant/ant-1.8.2/lib/ant-antlr.jar:/home/hudson/hudson-slave/tools/Ant/ant-1.8.2/lib/ant-apache-log4j.jar:/home/hudson/hudson-slave/tools/Ant/ant-1.8.2/lib/ant-commons-logging.jar:/home/hudson/hudson-slave/tools/Ant/ant-1.8.2/lib/ant-apache-xalan2.jar:/home/hudson/hudson-slave/tools/Ant/ant-1.8.2/lib/ant-apache-oro.jar:/home/hudson/hudson-slave/tools/Ant/ant-1.8.2/lib/ant-junit4.jar:/home/hudson/hudson-slave/tools/Ant/ant-1.8.2/lib/ant-netrexx.jar:/home/hudson/hudson-slave/tools/Ant/ant-1.8.2/lib/ant-swing.jar:/home/hudson/hudson-slave/tools/Ant/ant-1.8.2/lib/ant-javamail.jar:/home/hudson/hudson-slave/tools/Ant/ant-1.8.2/lib/ant-jsch.jar:/home/hudson/hudson-slave/tools/Ant/ant-1.8.2/lib/ant-jmf.jar:/home/hudson/hudson-slave/tools/Ant/ant-1.8.2/lib/ant.jar:/home/hudson/hudson-slave/tools/Ant/ant-1.8.2/lib/ant-apache-bcel.jar:/home/hudson/hudson-slave/tools/Ant/ant-1.8.2/lib/ant-jai.jar:/home/hudson/hudson-slave/tools/Ant/ant-1.8.2/lib/ant-testutil.jar:/home/hudson/hudson-slave/tools/Ant/ant-1.8.2/lib/ant-apache-resolver.jar:/home/hudson/hudson-slave/tools/Ant/ant-1.8.2/lib/ant-jdepend.jar:/usr/local/openjdk6/lib/tools.jar:/home/hudson/.ivy2/cache/com.carrotsearch.randomizedtesting/junit4-ant/jars/junit4-ant-2.0.1.jar
[junit4:junit4]   2> 438 T358 oaz.Environment.logEnv Client environment:java.library.path=/usr/local/openjdk6/jre/lib/amd64/server:/usr/local/openjdk6/jre/lib/amd64:/usr/local/openjdk6/jre/../lib/amd64:/usr/java/packages/lib/amd64:/lib:/usr/lib:/usr/local/lib
[junit4:junit4]   2> 438 T358 oaz.Environment.logEnv Client environment:java.io.tmpdir=.
[junit4:junit4]   2> 438 T358 oaz.Environment.logEnv Client environment:java.compiler=<NA>
[junit4:junit4]   2> 438 T358 oaz.Environment.logEnv Client environment:os.name=FreeBSD
[junit4:junit4]   2> 439 T358 oaz.Environment.logEnv Client environment:os.arch=amd64
[junit4:junit4]   2> 439 T358 oaz.Environment.logEnv Client environment:os.version=9.0-RELEASE
[junit4:junit4]   2> 439 T358 oaz.Environment.logEnv Client environment:user.name=hudson
[junit4:junit4]   2> 439 T358 oaz.Environment.logEnv Client environment:user.home=/home/hudson
[junit4:junit4]   2> 440 T358 oaz.Environment.logEnv Client environment:user.dir=/usr/home/hudson/hudson-slave/workspace/Lucene-Solr-Tests-4.x-Java6/solr/build/solr-core/test/J1
[junit4:junit4]   2> 446 T358 oaz.ZooKeeper.<init> Initiating client connection, connectString=127.0.0.1:43519 sessionTimeout=10000 watcher=org.apache.solr.common.cloud.ConnectionManager@736c8a11
[junit4:junit4]   2> 510 T364 oaz.ClientCnxn$SendThread.startConnect Opening socket connection to server /127.0.0.1:43519
[junit4:junit4]   2> 510 T358 oascc.ConnectionManager.waitForConnected Waiting for client to connect to ZooKeeper
[junit4:junit4]   2> 514 T364 oaz.ClientCnxn$SendThread.primeConnection Socket connection established to localhost/127.0.0.1:43519, initiating session
[junit4:junit4]   2> 515 T360 oazs.NIOServerCnxn$Factory.run Accepted socket connection from /140.211.11.196:63321
[junit4:junit4]   2> 530 T360 oazs.NIOServerCnxn.readConnectRequest Client attempting to establish new session at /140.211.11.196:63321
[junit4:junit4]   2> 543 T362 oazsp.FileTxnLog.append Creating new log file: log.1
[junit4:junit4]   2> 572 T362 oazs.NIOServerCnxn.finishSessionInit Established session 0x139f1d6ace30000 with negotiated timeout 10000 for client /140.211.11.196:63321
[junit4:junit4]   2> 572 T364 oaz.ClientCnxn$SendThread.readConnectResult Session establishment complete on server localhost/127.0.0.1:43519, sessionid = 0x139f1d6ace30000, negotiated timeout = 10000
[junit4:junit4]   2> 578 T365 oascc.ConnectionManager.process Watcher org.apache.solr.common.cloud.ConnectionManager@736c8a11 name:ZooKeeperConnection Watcher:127.0.0.1:43519 got event WatchedEvent state:SyncConnected type:None path:null path:null type:None
[junit4:junit4]   2> 578 T358 oascc.ConnectionManager.waitForConnected Client is connected to ZooKeeper
[junit4:junit4]   2> 581 T358 oascc.SolrZkClient.makePath makePath: /solr
[junit4:junit4]   2> 633 T363 oazs.PrepRequestProcessor.pRequest Processed session termination for sessionid: 0x139f1d6ace30000
[junit4:junit4]   2> 635 T365 oaz.ClientCnxn$EventThread.run EventThread shut down
[junit4:junit4]   2> 635 T358 oaz.ZooKeeper.close Session: 0x139f1d6ace30000 closed
[junit4:junit4]   2> 636 T358 oaz.ZooKeeper.<init> Initiating client connection, connectString=127.0.0.1:43519/solr sessionTimeout=10000 watcher=org.apache.solr.common.cloud.ConnectionManager@3195df2f
[junit4:junit4]   2> 636 T360 oazs.NIOServerCnxn.closeSock Closed socket connection for client /140.211.11.196:63321 which had sessionid 0x139f1d6ace30000
[junit4:junit4]   2> 636 T366 oaz.ClientCnxn$SendThread.startConnect Opening socket connection to server /127.0.0.1:43519
[junit4:junit4]   2> 636 T358 oascc.ConnectionManager.waitForConnected Waiting for client to connect to ZooKeeper
[junit4:junit4]   2> 649 T366 oaz.ClientCnxn$SendThread.primeConnection Socket connection established to localhost/127.0.0.1:43519, initiating session
[junit4:junit4]   2> 649 T360 oazs.NIOServerCnxn$Factory.run Accepted socket connection from /140.211.11.196:59859
[junit4:junit4]   2> 649 T360 oazs.NIOServerCnxn.readConnectRequest Client attempting to establish new session at /140.211.11.196:59859
[junit4:junit4]   2> 651 T362 oazs.NIOServerCnxn.finishSessionInit Established session 0x139f1d6ace30001 with negotiated timeout 10000 for client /140.211.11.196:59859
[junit4:junit4]   2> 651 T366 oaz.ClientCnxn$SendThread.readConnectResult Session establishment complete on server localhost/127.0.0.1:43519, sessionid = 0x139f1d6ace30001, negotiated timeout = 10000
[junit4:junit4]   2> 652 T367 oascc.ConnectionManager.process Watcher org.apache.solr.common.cloud.ConnectionManager@3195df2f name:ZooKeeperConnection Watcher:127.0.0.1:43519/solr got event WatchedEvent state:SyncConnected type:None path:null path:null type:None
[junit4:junit4]   2> 652 T358 oascc.ConnectionManager.waitForConnected Client is connected to ZooKeeper
[junit4:junit4]   2> 661 T358 oascc.SolrZkClient.makePath makePath: /collections/collection1
[junit4:junit4]   2> 665 T358 oascc.SolrZkClient.makePath makePath: /collections/collection1/shards
[junit4:junit4]   2> 668 T358 oascc.SolrZkClient.makePath makePath: /collections/control_collection
[junit4:junit4]   2> 679 T358 oascc.SolrZkClient.makePath makePath: /collections/control_collection/shards
[junit4:junit4]   2> 683 T358 oasc.AbstractZkTestCase.putConfig put /usr/home/hudson/hudson-slave/workspace/Lucene-Solr-Tests-4.x-Java6/solr/build/solr-core/test-files/solr/collection1/conf/solrconfig.xml to /configs/conf1/solrconfig.xml
[junit4:junit4]   2> 703 T358 oascc.SolrZkClient.makePath makePath: /configs/conf1/solrconfig.xml
[junit4:junit4]   2> 716 T358 oasc.AbstractZkTestCase.putConfig put /usr/home/hudson/hudson-slave/workspace/Lucene-Solr-Tests-4.x-Java6/solr/build/solr-core/test-files/solr/collection1/conf/schema.xml to /configs/conf1/schema.xml
[junit4:junit4]   2> 717 T358 oascc.SolrZkClient.makePath makePath: /configs/conf1/schema.xml
[junit4:junit4]   2> 821 T358 oasc.AbstractZkTestCase.putConfig put /usr/home/hudson/hudson-slave/workspace/Lucene-Solr-Tests-4.x-Java6/solr/build/solr-core/test-files/solr/collection1/conf/solrconfig.xml to /configs/conf1/solrconfig.xml
[junit4:junit4]   2> 822 T358 oascc.SolrZkClient.makePath makePath: /configs/conf1/solrconfig.xml
[junit4:junit4]   2> 836 T358 oasc.AbstractZkTestCase.putConfig put /usr/home/hudson/hudson-slave/workspace/Lucene-Solr-Tests-4.x-Java6/solr/build/solr-core/test-files/solr/collection1/conf/stopwords.txt to /configs/conf1/stopwords.txt
[junit4:junit4]   2> 836 T358 oascc.SolrZkClient.makePath makePath: /configs/conf1/stopwords.txt
[junit4:junit4]   2> 840 T358 oasc.AbstractZkTestCase.putConfig put /usr/home/hudson/hudson-slave/workspace/Lucene-Solr-Tests-4.x-Java6/solr/build/solr-core/test-files/solr/collection1/conf/protwords.txt to /configs/conf1/protwords.txt
[junit4:junit4]   2> 841 T358 oascc.SolrZkClient.makePath makePath: /configs/conf1/protwords.txt
[junit4:junit4]   2> 851 T358 oasc.AbstractZkTestCase.putConfig put /usr/home/hudson/hudson-slave/workspace/Lucene-Solr-Tests-4.x-Java6/solr/build/solr-core/test-files/solr/collection1/conf/currency.xml to /configs/conf1/currency.xml
[junit4:junit4]   2> 852 T358 oascc.SolrZkClient.makePath makePath: /configs/conf1/currency.xml
[junit4:junit4]   2> 863 T358 oasc.AbstractZkTestCase.putConfig put /usr/home/hudson/hudson-slave/workspace/Lucene-Solr-Tests-4.x-Java6/solr/build/solr-core/test-files/solr/collection1/conf/open-exchange-rates.json to /configs/conf1/open-exchange-rates.json
[junit4:junit4]   2> 864 T358 oascc.SolrZkClient.makePath makePath: /configs/conf1/open-exchange-rates.json
[junit4:junit4]   2> 868 T358 oasc.AbstractZkTestCase.putConfig put /usr/home/hudson/hudson-slave/workspace/Lucene-Solr-Tests-4.x-Java6/solr/build/solr-core/test-files/solr/collection1/conf/mapping-ISOLatin1Accent.txt to /configs/conf1/mapping-ISOLatin1Accent.txt
[junit4:junit4]   2> 868 T358 oascc.SolrZkClient.makePath makePath: /configs/conf1/mapping-ISOLatin1Accent.txt
[junit4:junit4]   2> 875 T358 oasc.AbstractZkTestCase.putConfig put /usr/home/hudson/hudson-slave/workspace/Lucene-Solr-Tests-4.x-Java6/solr/build/solr-core/test-files/solr/collection1/conf/old_synonyms.txt to /configs/conf1/old_synonyms.txt
[junit4:junit4]   2> 876 T358 oascc.SolrZkClient.makePath makePath: /configs/conf1/old_synonyms.txt
[junit4:junit4]   2> 884 T358 oasc.AbstractZkTestCase.putConfig put /usr/home/hudson/hudson-slave/workspace/Lucene-Solr-Tests-4.x-Java6/solr/build/solr-core/test-files/solr/collection1/conf/synonyms.txt to /configs/conf1/synonyms.txt
[junit4:junit4]   2> 885 T358 oascc.SolrZkClient.makePath makePath: /configs/conf1/synonyms.txt
[junit4:junit4]   2> 888 T363 oazs.PrepRequestProcessor.pRequest Processed session termination for sessionid: 0x139f1d6ace30001
[junit4:junit4]   2> 895 T367 oaz.ClientCnxn$EventThread.run EventThread shut down
[junit4:junit4]   2> 895 T360 oazs.NIOServerCnxn.closeSock Closed socket connection for client /140.211.11.196:59859 which had sessionid 0x139f1d6ace30001
[junit4:junit4]   2> 895 T358 oaz.ZooKeeper.close Session: 0x139f1d6ace30001 closed
[junit4:junit4]   2> 897 T358 oejs.Server.doStart jetty-8.1.2.v20120308
[junit4:junit4]   2> 899 T358 oejs.AbstractConnector.doStart Started SocketConnector@0.0.0.0:35792
[junit4:junit4]   2> 900 T358 oasc.SolrResourceLoader.locateSolrHome JNDI not configured for solr (NoInitialContextEx)
[junit4:junit4]   2> 900 T358 oasc.SolrResourceLoader.locateSolrHome using system property solr.solr.home: /usr/home/hudson/hudson-slave/workspace/Lucene-Solr-Tests-4.x-Java6/solr/build/solr-core/test-files/solr
[junit4:junit4]   2> 900 T358 oasc.SolrResourceLoader.<init> new SolrResourceLoader for deduced Solr Home: '/usr/home/hudson/hudson-slave/workspace/Lucene-Solr-Tests-4.x-Java6/solr/build/solr-core/test-files/solr/'
[junit4:junit4]   2> 939 T358 oass.SolrDispatchFilter.init SolrDispatchFilter.init()
[junit4:junit4]   2> 940 T358 oasc.SolrResourceLoader.locateSolrHome JNDI not configured for solr (NoInitialContextEx)
[junit4:junit4]   2> 940 T358 oasc.SolrResourceLoader.locateSolrHome using system property solr.solr.home: /usr/home/hudson/hudson-slave/workspace/Lucene-Solr-Tests-4.x-Java6/solr/build/solr-core/test-files/solr
[junit4:junit4]   2> 941 T358 oasc.CoreContainer$Initializer.initialize looking for solr.xml: /usr/home/hudson/hudson-slave/workspace/Lucene-Solr-Tests-4.x-Java6/solr/build/solr-core/test-files/solr/solr.xml
[junit4:junit4]   2> 941 T358 oasc.CoreContainer.<init> New CoreContainer 1670516684
[junit4:junit4]   2> 942 T358 oasc.CoreContainer.load Loading CoreContainer using Solr Home: '/usr/home/hudson/hudson-slave/workspace/Lucene-Solr-Tests-4.x-Java6/solr/build/solr-core/test-files/solr/'
[junit4:junit4]   2> 943 T358 oasc.SolrResourceLoader.<init> new SolrResourceLoader for directory: '/usr/home/hudson/hudson-slave/workspace/Lucene-Solr-Tests-4.x-Java6/solr/build/solr-core/test-files/solr/'
[junit4:junit4]   2> 965 T358 oasc.CoreContainer.load Registering Log Listener
[junit4:junit4]   2> 978 T358 oasc.CoreContainer.initZooKeeper Zookeeper client=127.0.0.1:43519/solr
[junit4:junit4]   2> 1012 T358 oaz.ZooKeeper.<init> Initiating client connection, connectString=127.0.0.1:43519/solr sessionTimeout=5000 watcher=org.apache.solr.common.cloud.ConnectionManager@5a8e261b
[junit4:junit4]   2> 1013 T377 oaz.ClientCnxn$SendThread.startConnect Opening socket connection to server /127.0.0.1:43519
[junit4:junit4]   2> 1013 T358 oascc.ConnectionManager.waitForConnected Waiting for client to connect to ZooKeeper
[junit4:junit4]   2> 1014 T377 oaz.ClientCnxn$SendThread.primeConnection Socket connection established to localhost/127.0.0.1:43519, initiating session
[junit4:junit4]   2> 1014 T360 oazs.NIOServerCnxn$Factory.run Accepted socket connection from /140.211.11.196:42273
[junit4:junit4]   2> 1015 T360 oazs.NIOServerCnxn.readConnectRequest Client attempting to establish new session at /140.211.11.196:42273
[junit4:junit4]   2> 1042 T362 oazs.NIOServerCnxn.finishSessionInit Established session 0x139f1d6ace30002 with negotiated timeout 5000 for client /140.211.11.196:42273
[junit4:junit4]   2> 1042 T377 oaz.ClientCnxn$SendThread.readConnectResult Session establishment complete on server localhost/127.0.0.1:43519, sessionid = 0x139f1d6ace30002, negotiated timeout = 5000
[junit4:junit4]   2> 1043 T378 oascc.ConnectionManager.process Watcher org.apache.solr.common.cloud.ConnectionManager@5a8e261b name:ZooKeeperConnection Watcher:127.0.0.1:43519/solr got event WatchedEvent state:SyncConnected type:None path:null path:null type:None
[junit4:junit4]   2> 1043 T358 oascc.ConnectionManager.waitForConnected Client is connected to ZooKeeper
[junit4:junit4]   2> 1066 T363 oazs.PrepRequestProcessor.pRequest Got user-level KeeperException when processing sessionid:0x139f1d6ace30002 type:create cxid:0x2 zxid:0xfffffffffffffffe txntype:unknown reqpath:n/a Error Path:/solr/overseer Error:KeeperErrorCode = NodeExists for /solr/overseer
[junit4:junit4]   2> 1083 T358 oascc.SolrZkClient.makePath makePath: /live_nodes
[junit4:junit4]   2> 1123 T358 oasc.ZkController.createEphemeralLiveNode Register node as live in ZooKeeper:/live_nodes/127.0.0.1:35792_solr
[junit4:junit4]   2> 1130 T363 oazs.PrepRequestProcessor.pRequest Got user-level KeeperException when processing sessionid:0x139f1d6ace30002 type:delete cxid:0x7 zxid:0xfffffffffffffffe txntype:unknown reqpath:n/a Error Path:/solr/live_nodes/127.0.0.1:35792_solr Error:KeeperErrorCode = NoNode for /solr/live_nodes/127.0.0.1:35792_solr
[junit4:junit4]   2> 1131 T358 oascc.SolrZkClient.makePath makePath: /live_nodes/127.0.0.1:35792_solr
[junit4:junit4]   2> 1135 T358 oashc.HttpShardHandlerFactory.getParameter Setting socketTimeout to: 0
[junit4:junit4]   2> 1135 T358 oashc.HttpShardHandlerFactory.getParameter Setting urlScheme to: http://
[junit4:junit4]   2> 1135 T358 oashc.HttpShardHandlerFactory.getParameter Setting connTimeout to: 0
[junit4:junit4]   2> 1135 T358 oashc.HttpShardHandlerFactory.getParameter Setting maxConnectionsPerHost to: 20
[junit4:junit4]   2> 1136 T358 oashc.HttpShardHandlerFactory.getParameter Setting corePoolSize to: 0
[junit4:junit4]   2> 1136 T358 oashc.HttpShardHandlerFactory.getParameter Setting maximumPoolSize to: 2147483647
[junit4:junit4]   2> 1136 T358 oashc.HttpShardHandlerFactory.getParameter Setting maxThreadIdleTime to: 5
[junit4:junit4]   2> 1137 T358 oashc.HttpShardHandlerFactory.getParameter Setting sizeOfQueue to: -1
[junit4:junit4]   2> 1137 T358 oashc.HttpShardHandlerFactory.getParameter Setting fairnessPolicy to: false
[junit4:junit4]   2> 1137 T358 oascsi.HttpClientUtil.createClient Creating new http client, config:maxConnectionsPerHost=20&maxConnections=10000&socketTimeout=0&connTimeout=0&retry=false
[junit4:junit4]   2> 1150 T358 oascc.SolrZkClient.makePath makePath: /overseer_elect/election
[junit4:junit4]   2> 1181 T363 oazs.PrepRequestProcessor.pRequest Got user-level KeeperException when processing sessionid:0x139f1d6ace30002 type:delete cxid:0x15 zxid:0xfffffffffffffffe txntype:unknown reqpath:n/a Error Path:/solr/overseer_elect/leader Error:KeeperErrorCode = NoNode for /solr/overseer_elect/leader
[junit4:junit4]   2> 1182 T358 oascc.SolrZkClient.makePath makePath: /overseer_elect/leader
[junit4:junit4]   2> 1185 T358 oasc.Overseer.start Overseer (id=88367572036288514-127.0.0.1:35792_solr-n_0000000000) starting
[junit4:junit4]   2> 1185 T363 oazs.PrepRequestProcessor.pRequest Got user-level KeeperException when processing sessionid:0x139f1d6ace30002 type:create cxid:0x1a zxid:0xfffffffffffffffe txntype:unknown reqpath:n/a Error Path:/solr/overseer Error:KeeperErrorCode = NodeExists for /solr/overseer
[junit4:junit4]   2> 1220 T363 oazs.PrepRequestProcessor.pRequest Got user-level KeeperException when processing sessionid:0x139f1d6ace30002 type:create cxid:0x1b zxid:0xfffffffffffffffe txntype:unknown reqpath:n/a Error Path:/solr/overseer Error:KeeperErrorCode = NodeExists for /solr/overseer
[junit4:junit4]   2> 1221 T363 oazs.PrepRequestProcessor.pRequest Got user-level KeeperException when processing sessionid:0x139f1d6ace30002 type:create cxid:0x1c zxid:0xfffffffffffffffe txntype:unknown reqpath:n/a Error Path:/solr/overseer Error:KeeperErrorCode = NodeExists for /solr/overseer
[junit4:junit4]   2> 1227 T363 oazs.PrepRequestProcessor.pRequest Got user-level KeeperException when processing sessionid:0x139f1d6ace30002 type:create cxid:0x1d zxid:0xfffffffffffffffe txntype:unknown reqpath:n/a Error Path:/solr/overseer Error:KeeperErrorCode = NodeExists for /solr/overseer
[junit4:junit4]   2> 1234 T380 oasc.OverseerCollectionProcessor.run Process current queue of collection creations
[junit4:junit4]   2> 1234 T358 oascc.SolrZkClient.makePath makePath: /clusterstate.json
[junit4:junit4]   2> 1237 T358 oascc.ZkStateReader.createClusterStateWatchersAndUpdate Updating cluster state from ZooKeeper... 
[junit4:junit4]   2> 1272 T379 oasc.Overseer$ClusterStateUpdater.run Starting to work on the main queue
[junit4:junit4]   2> 1283 T358 oasc.CoreContainer.create Creating SolrCore 'collection1' using instanceDir: /usr/home/hudson/hudson-slave/workspace/Lucene-Solr-Tests-4.x-Java6/solr/build/solr-core/test-files/solr/collection1
[junit4:junit4]   2> 1284 T358 oasc.ZkController.createCollectionZkNode Check for collection zkNode:control_collection
[junit4:junit4]   2> 1284 T358 oasc.ZkController.createCollectionZkNode Collection zkNode exists
[junit4:junit4]   2> 1285 T358 oasc.ZkController.readConfigName Load collection config from:/collections/control_collection
[junit4:junit4]   2> 1286 T358 oasc.SolrResourceLoader.<init> new SolrResourceLoader for directory: '/usr/home/hudson/hudson-slave/workspace/Lucene-Solr-Tests-4.x-Java6/solr/build/solr-core/test-files/solr/collection1/'
[junit4:junit4]   2> 1287 T358 oasc.SolrResourceLoader.replaceClassLoader Adding 'file:/usr/home/hudson/hudson-slave/workspace/Lucene-Solr-Tests-4.x-Java6/solr/build/solr-core/test-files/solr/collection1/lib/classes/' to classloader
[junit4:junit4]   2> 1288 T358 oasc.SolrResourceLoader.replaceClassLoader Adding 'file:/usr/home/hudson/hudson-slave/workspace/Lucene-Solr-Tests-4.x-Java6/solr/build/solr-core/test-files/solr/collection1/lib/README' to classloader
[junit4:junit4]   2> 1351 T358 oasc.SolrConfig.<init> Using Lucene MatchVersion: LUCENE_41
[junit4:junit4]   2> 1402 T358 oasc.SolrConfig.<init> Loaded SolrConfig: solrconfig.xml
[junit4:junit4]   2> 1503 T358 oass.IndexSchema.readSchema Reading Solr Schema
[junit4:junit4]   2> 1508 T358 oass.IndexSchema.readSchema Schema name=test
[junit4:junit4]   2> 1995 T358 oass.OpenExchangeRatesOrgProvider.init Initialized with rates=open-exchange-rates.json, refreshInterval=1440.
[junit4:junit4]   2> 2004 T358 oass.IndexSchema.readSchema default search field in schema is text
[junit4:junit4]   2> 2007 T358 oass.IndexSchema.readSchema unique key field: id
[junit4:junit4]   2> 2023 T358 oass.FileExchangeRateProvider.reload Reloading exchange rates from file currency.xml
[junit4:junit4]   2> 2027 T358 oass.FileExchangeRateProvider.reload Reloading exchange rates from file currency.xml
[junit4:junit4]   2> 2032 T358 oass.OpenExchangeRatesOrgProvider.reload Reloading exchange rates from open-exchange-rates.json
[junit4:junit4]   2> 2033 T358 oass.OpenExchangeRatesOrgProvider.reload Reloading exchange rates from open-exchange-rates.json
[junit4:junit4]   2> 2035 T358 oasc.SolrCore.<init> [collection1] Opening new SolrCore at /usr/home/hudson/hudson-slave/workspace/Lucene-Solr-Tests-4.x-Java6/solr/build/solr-core/test-files/solr/collection1/, dataDir=./org.apache.solr.cloud.BasicDistributedZk2Test-1348382141302/control/data/
[junit4:junit4]   2> 2039 T358 oasc.JmxMonitoredMap.<init> JMX monitoring is enabled. Adding Solr mbeans to JMX Server: com.sun.jmx.mbeanserver.JmxMBeanServer@46ed5d9d
[junit4:junit4]   2> 2066 T358 oasc.SolrCore.getNewIndexDir WARNING New index directory detected: old=null new=./org.apache.solr.cloud.BasicDistributedZk2Test-1348382141302/control/data/index/
[junit4:junit4]   2> 2067 T358 oasc.SolrCore.initIndex WARNING [collection1] Solr index directory './org.apache.solr.cloud.BasicDistributedZk2Test-1348382141302/control/data/index' doesn't exist. Creating new index...
[junit4:junit4]   2> 2068 T358 oasc.CachingDirectoryFactory.get return new directory for /usr/home/hudson/hudson-slave/workspace/Lucene-Solr-Tests-4.x-Java6/solr/build/solr-core/test/J1/./org.apache.solr.cloud.BasicDistributedZk2Test-1348382141302/control/data/index forceNew:false
[junit4:junit4]   2> 2073 T358 oasc.SolrDeletionPolicy.onCommit SolrDeletionPolicy.onCommit: commits:num=1
[junit4:junit4]   2> 		commit{dir=NRTCachingDirectory(org.apache.lucene.store.NIOFSDirectory@/usr/home/hudson/hudson-slave/workspace/Lucene-Solr-Tests-4.x-Java6/solr/build/solr-core/test/J1/org.apache.solr.cloud.BasicDistributedZk2Test-1348382141302/control/data/index lockFactory=org.apache.lucene.store.NativeFSLockFactory@61981853; maxCacheMB=48.0 maxMergeSizeMB=4.0),segFN=segments_1,generation=1,filenames=[segments_1]
[junit4:junit4]   2> 2074 T358 oasc.SolrDeletionPolicy.updateCommits newest commit = 1
[junit4:junit4]   2> 2075 T358 oasc.SolrCore.initWriters created xml: solr.XMLResponseWriter
[junit4:junit4]   2> 2076 T358 oasup.UpdateRequestProcessorChain.init inserting DistributedUpdateProcessorFactory into updateRequestProcessorChain "dedupe"
[junit4:junit4]   2> 2077 T358 oasup.UpdateRequestProcessorChain.init inserting DistributedUpdateProcessorFactory into updateRequestProcessorChain "dedupe-allfields"
[junit4:junit4]   2> 2077 T358 oasup.UpdateRequestProcessorChain.init inserting DistributedUpdateProcessorFactory into updateRequestProcessorChain "stored_sig"
[junit4:junit4]   2> 2077 T358 oasup.UpdateRequestProcessorChain.init inserting DistributedUpdateProcessorFactory into updateRequestProcessorChain "uniq-fields"
[junit4:junit4]   2> 2078 T358 oasup.UpdateRequestProcessorChain.init inserting DistributedUpdateProcessorFactory into updateRequestProcessorChain "distrib-dup-test-chain-implicit"
[junit4:junit4]   2> 2078 T358 oasc.RequestHandlers.initHandlersFromConfig adding lazy requestHandler: solr.ReplicationHandler
[junit4:junit4]   2> 2079 T358 oasc.RequestHandlers.initHandlersFromConfig created /replication: solr.ReplicationHandler
[junit4:junit4]   2> 2079 T358 oasc.RequestHandlers.initHandlersFromConfig created standard: solr.StandardRequestHandler
[junit4:junit4]   2> 2080 T358 oasc.RequestHandlers.initHandlersFromConfig created /get: solr.RealTimeGetHandler
[junit4:junit4]   2> 2080 T358 oasc.RequestHandlers.initHandlersFromConfig created dismax: solr.SearchHandler
[junit4:junit4]   2> 2081 T358 oasc.RequestHandlers.initHandlersFromConfig created mock: org.apache.solr.core.MockQuerySenderListenerReqHandler
[junit4:junit4]   2> 2081 T358 oasc.RequestHandlers.initHandlersFromConfig created /admin/: org.apache.solr.handler.admin.AdminHandlers
[junit4:junit4]   2> 2081 T358 oasc.RequestHandlers.initHandlersFromConfig created defaults: solr.StandardRequestHandler
[junit4:junit4]   2> 2082 T358 oasc.RequestHandlers.initHandlersFromConfig adding lazy requestHandler: solr.StandardRequestHandler
[junit4:junit4]   2> 2082 T358 oasc.RequestHandlers.initHandlersFromConfig created lazy: solr.StandardRequestHandler
[junit4:junit4]   2> 2083 T358 oasc.RequestHandlers.initHandlersFromConfig created /update: solr.UpdateRequestHandler
[junit4:junit4]   2> 2083 T358 oasc.RequestHandlers.initHandlersFromConfig created /terms: org.apache.solr.handler.component.SearchHandler
[junit4:junit4]   2> 2083 T358 oasc.RequestHandlers.initHandlersFromConfig created spellCheckCompRH: org.apache.solr.handler.component.SearchHandler
[junit4:junit4]   2> 2084 T358 oasc.RequestHandlers.initHandlersFromConfig created spellCheckCompRH_Direct: org.apache.solr.handler.component.SearchHandler
[junit4:junit4]   2> 2084 T358 oasc.RequestHandlers.initHandlersFromConfig created spellCheckWithWordbreak: org.apache.solr.handler.component.SearchHandler
[junit4:junit4]   2> 2085 T358 oasc.RequestHandlers.initHandlersFromConfig created spellCheckWithWordbreak_Direct: org.apache.solr.handler.component.SearchHandler
[junit4:junit4]   2> 2085 T358 oasc.RequestHandlers.initHandlersFromConfig created spellCheckCompRH1: org.apache.solr.handler.component.SearchHandler
[junit4:junit4]   2> 2086 T358 oasc.RequestHandlers.initHandlersFromConfig created tvrh: org.apache.solr.handler.component.SearchHandler
[junit4:junit4]   2> 2086 T358 oasc.RequestHandlers.initHandlersFromConfig created /mlt: solr.MoreLikeThisHandler
[junit4:junit4]   2> 2087 T358 oasc.RequestHandlers.initHandlersFromConfig created /debug/dump: solr.DumpRequestHandler
[junit4:junit4]   2> 2089 T358 oashl.XMLLoader.init xsltCacheLifetimeSeconds=60
[junit4:junit4]   2> 2093 T358 oasc.SolrCore.initDeprecatedSupport WARNING solrconfig.xml uses deprecated <admin/gettableFiles>, Please update your config to use the ShowFileRequestHandler.
[junit4:junit4]   2> 2094 T358 oasc.SolrCore.initDeprecatedSupport WARNING adding ShowFileRequestHandler with hidden files: [SCHEMA.XML, OLD_SYNONYMS.TXT, STOPWORDS.TXT, PROTWORDS.TXT, OPEN-EXCHANGE-RATES.JSON, SYNONYMS.TXT, CURRENCY.XML, MAPPING-ISOLATIN1ACCENT.TXT]
[junit4:junit4]   2> 2098 T358 oass.SolrIndexSearcher.<init> Opening Searcher@34c3a7c0 main
[junit4:junit4]   2> 2117 T358 oasu.CommitTracker.<init> Hard AutoCommit: disabled
[junit4:junit4]   2> 2118 T358 oasu.CommitTracker.<init> Soft AutoCommit: disabled
[junit4:junit4]   2> 2118 T358 oashc.SpellCheckComponent.inform Initializing spell checkers
[junit4:junit4]   2> 2135 T358 oass.DirectSolrSpellChecker.init init: {name=direct,classname=DirectSolrSpellChecker,field=lowerfilt,minQueryLength=3}
[junit4:junit4]   2> 2180 T381 oasc.SolrCore.registerSearcher [collection1] Registered new searcher Searcher@34c3a7c0 main{StandardDirectoryReader(segments_1:1)}
[junit4:junit4]   2> 2184 T363 oazs.PrepRequestProcessor.pRequest Got user-level KeeperException when processing sessionid:0x139f1d6ace30002 type:create cxid:0x53 zxid:0xfffffffffffffffe txntype:unknown reqpath:n/a Error Path:/solr/overseer/queue Error:KeeperErrorCode = NoNode for /solr/overseer/queue
[junit4:junit4]   2> 2193 T358 oasc.CoreContainer.register registering core: collection1
[junit4:junit4]   2> 2194 T358 oasc.ZkController.register Register shard - core:collection1 address:http://127.0.0.1:35792/solr shardId:control_shard
[junit4:junit4]   2> 2207 T358 oascsi.HttpClientUtil.createClient Creating new http client, config:maxConnections=10000&maxConnectionsPerHost=20&connTimeout=30000&socketTimeout=30000&retry=false
[junit4:junit4]   2> 2219 T358 oascc.SolrZkClient.makePath makePath: /collections/control_collection/leader_elect/control_shard/election
[junit4:junit4]   2> 2237 T363 oazs.PrepRequestProcessor.pRequest Got user-level KeeperException when processing sessionid:0x139f1d6ace30002 type:delete cxid:0x62 zxid:0xfffffffffffffffe txntype:unknown reqpath:n/a Error Path:/solr/collections/control_collection/leaders Error:KeeperErrorCode = NoNode for /solr/collections/control_collection/leaders
[junit4:junit4]   2> 2238 T358 oasc.ShardLeaderElectionContext.runLeaderProcess Running the leader process.
[junit4:junit4]   2> 2239 T363 oazs.PrepRequestProcessor.pRequest Got user-level KeeperException when processing sessionid:0x139f1d6ace30002 type:create cxid:0x63 zxid:0xfffffffffffffffe txntype:unknown reqpath:n/a Error Path:/solr/overseer Error:KeeperErrorCode = NodeExists for /solr/overseer
[junit4:junit4]   2> 2277 T379 oascc.ZkStateReader.updateClusterState Updating cloud state from ZooKeeper... 
[junit4:junit4]   2> 2288 T363 oazs.PrepRequestProcessor.pRequest Got user-level KeeperException when processing sessionid:0x139f1d6ace30002 type:create cxid:0x6a zxid:0xfffffffffffffffe txntype:unknown reqpath:n/a Error Path:/solr/overseer/queue-work Error:KeeperErrorCode = NoNode for /solr/overseer/queue-work
[junit4:junit4]   2> 2320 T378 oascc.ZkStateReader$2.process A cluster state change has occurred - updating...
[junit4:junit4]   2> 2751 T358 oasc.ShardLeaderElectionContext.waitForReplicasToComeUp Enough replicas found to continue.
[junit4:junit4]   2> 2752 T358 oasc.ShardLeaderElectionContext.runLeaderProcess I may be the new leader - try and sync
[junit4:junit4]   2> 2752 T358 oasc.SyncStrategy.sync Sync replicas to http://127.0.0.1:35792/solr/collection1/
[junit4:junit4]   2> 2753 T358 oasc.SyncStrategy.syncReplicas Sync Success - now sync replicas to me
[junit4:junit4]   2> 2753 T358 oasc.SyncStrategy.syncToMe http://127.0.0.1:35792/solr/collection1/ has no replicas
[junit4:junit4]   2> 2754 T358 oasc.ShardLeaderElectionContext.runLeaderProcess I am the new leader: http://127.0.0.1:35792/solr/collection1/
[junit4:junit4]   2> 2754 T358 oascc.SolrZkClient.makePath makePath: /collections/control_collection/leaders/control_shard
[junit4:junit4]   2> 2774 T363 oazs.PrepRequestProcessor.pRequest Got user-level KeeperException when processing sessionid:0x139f1d6ace30002 type:create cxid:0x88 zxid:0xfffffffffffffffe txntype:unknown reqpath:n/a Error Path:/solr/overseer Error:KeeperErrorCode = NodeExists for /solr/overseer
[junit4:junit4]   2> 2828 T379 oascc.ZkStateReader.updateClusterState Updating cloud state from ZooKeeper... 
[junit4:junit4]   2> 2840 T378 oascc.ZkStateReader$2.process A cluster state change has occurred - updating...
[junit4:junit4]   2> 2884 T358 oasc.ZkController.register We are http://127.0.0.1:35792/solr/collection1/ and leader is http://127.0.0.1:35792/solr/collection1/
[junit4:junit4]   2> 2887 T358 oasc.ZkController.register No LogReplay needed for core=collection1 baseURL=http://127.0.0.1:35792/solr
[junit4:junit4]   2> 2888 T358 oasc.ZkController.checkRecovery I am the leader, no recovery necessary
[junit4:junit4]   2> 2890 T358 oascc.ZkStateReader.updateClusterState Updating cloud state from ZooKeeper... 
[junit4:junit4]   2> 2891 T358 oass.SolrDispatchFilter.init user.dir=/usr/home/hudson/hudson-slave/workspace/Lucene-Solr-Tests-4.x-Java6/solr/build/solr-core/test/J1
[junit4:junit4]   2> 2891 T358 oass.SolrDispatchFilter.init SolrDispatchFilter.init() done
[junit4:junit4]   2> 2892 T358 oascsi.HttpClientUtil.createClient Creating new http client, config:maxConnections=128&maxConnectionsPerHost=32&followRedirects=false
[junit4:junit4]   2> 3024 T358 oejs.Server.doStart jetty-8.1.2.v20120308
[junit4:junit4]   2> 3026 T358 oejs.AbstractConnector.doStart Started SocketConnector@0.0.0.0:53886
[junit4:junit4]   2> 3026 T358 oasc.SolrResourceLoader.locateSolrHome JNDI not configured for solr (NoInitialContextEx)
[junit4:junit4]   2> 3027 T358 oasc.SolrResourceLoader.locateSolrHome using system property solr.solr.home: /usr/home/hudson/hudson-slave/workspace/Lucene-Solr-Tests-4.x-Java6/solr/build/solr-core/test/J1/./solrtest-jetty1-1348382144195
[junit4:junit4]   2> 3027 T358 oasc.SolrResourceLoader.<init> new SolrResourceLoader for deduced Solr Home: '/usr/home/hudson/hudson-slave/workspace/Lucene-Solr-Tests-4.x-Java6/solr/build/solr-core/test/J1/./solrtest-jetty1-1348382144195/'
[junit4:junit4]   2> 3052 T358 oass.SolrDispatchFilter.init SolrDispatchFilter.init()
[junit4:junit4]   2> 3052 T358 oasc.SolrResourceLoader.locateSolrHome JNDI not configured for solr (NoInitialContextEx)
[junit4:junit4]   2> 3053 T358 oasc.SolrResourceLoader.locateSolrHome using system property solr.solr.home: /usr/home/hudson/hudson-slave/workspace/Lucene-Solr-Tests-4.x-Java6/solr/build/solr-core/test/J1/./solrtest-jetty1-1348382144195
[junit4:junit4]   2> 3053 T358 oasc.CoreContainer$Initializer.initialize looking for solr.xml: /usr/home/hudson/hudson-slave/workspace/Lucene-Solr-Tests-4.x-Java6/solr/build/solr-core/test/J1/./solrtest-jetty1-1348382144195/solr.xml
[junit4:junit4]   2> 3053 T358 oasc.CoreContainer.<init> New CoreContainer 769422228
[junit4:junit4]   2> 3054 T358 oasc.CoreContainer.load Loading CoreContainer using Solr Home: '/usr/home/hudson/hudson-slave/workspace/Lucene-Solr-Tests-4.x-Java6/solr/build/solr-core/test/J1/./solrtest-jetty1-1348382144195/'
[junit4:junit4]   2> 3054 T358 oasc.SolrResourceLoader.<init> new SolrResourceLoader for directory: '/usr/home/hudson/hudson-slave/workspace/Lucene-Solr-Tests-4.x-Java6/solr/build/solr-core/test/J1/./solrtest-jetty1-1348382144195/'
[junit4:junit4]   2> 3073 T358 oasc.CoreContainer.load Registering Log Listener
[junit4:junit4]   2> 3083 T358 oasc.CoreContainer.initZooKeeper Zookeeper client=127.0.0.1:43519/solr
[junit4:junit4]   2> 3084 T358 oaz.ZooKeeper.<init> Initiating client connection, connectString=127.0.0.1:43519/solr sessionTimeout=5000 watcher=org.apache.solr.common.cloud.ConnectionManager@278a676
[junit4:junit4]   2> 3084 T391 oaz.ClientCnxn$SendThread.startConnect Opening socket connection to server /127.0.0.1:43519
[junit4:junit4]   2> 3084 T358 oascc.ConnectionManager.waitForConnected Waiting for client to connect to ZooKeeper
[junit4:junit4]   2> 3086 T360 oazs.NIOServerCnxn$Factory.run Accepted socket connection from /140.211.11.196:36861
[junit4:junit4]   2> 3086 T391 oaz.ClientCnxn$SendThread.primeConnection Socket connection established to localhost/127.0.0.1:43519, initiating session
[junit4:junit4]   2> 3086 T360 oazs.NIOServerCnxn.readConnectRequest Client attempting to establish new session at /140.211.11.196:36861
[junit4:junit4]   2> 3088 T362 oazs.NIOServerCnxn.finishSessionInit Established session 0x139f1d6ace30003 with negotiated timeout 5000 for client /140.211.11.196:36861
[junit4:junit4]   2> 3088 T391 oaz.ClientCnxn$SendThread.readConnectResult Session establishment complete on server localhost/127.0.0.1:43519, sessionid = 0x139f1d6ace30003, negotiated timeout = 5000
[junit4:junit4]   2> 3088 T392 oascc.ConnectionManager.process Watcher org.apache.solr.common.cloud.ConnectionManager@278a676 name:ZooKeeperConnection Watcher:127.0.0.1:43519/solr got event WatchedEvent state:SyncConnected type:None path:null path:null type:None
[junit4:junit4]   2> 3088 T358 oascc.ConnectionManager.waitForConnected Client is connected to ZooKeeper
[junit4:junit4]   2> 3089 T363 oazs.PrepRequestProcessor.pRequest Got user-level KeeperException when processing sessionid:0x139f1d6ace30003 type:create cxid:0x1 zxid:0xfffffffffffffffe txntype:unknown reqpath:n/a Error Path:/solr/overseer Error:KeeperErrorCode = NodeExists for /solr/overseer
[junit4:junit4]   2> 3090 T363 oazs.PrepRequestProcessor.pRequest Got user-level KeeperException when processing sessionid:0x139f1d6ace30003 type:create cxid:0x2 zxid:0xfffffffffffffffe txntype:unknown reqpath:n/a Error Path:/solr/overseer Error:KeeperErrorCode = NodeExists for /solr/overseer
[junit4:junit4]   2> 3100 T358 oasc.ZkController.createEphemeralLiveNode Register node as live in ZooKeeper:/live_nodes/127.0.0.1:53886_solr
[junit4:junit4]   2> 3101 T363 oazs.PrepRequestProcessor.pRequest Got user-level KeeperException when processing sessionid:0x139f1d6ace30003 type:delete cxid:0x4 zxid:0xfffffffffffffffe txntype:unknown reqpath:n/a Error Path:/solr/live_nodes/127.0.0.1:53886_solr Error:KeeperErrorCode = NoNode for /solr/live_nodes/127.0.0.1:53886_solr
[junit4:junit4]   2> 3102 T358 oascc.SolrZkClient.makePath makePath: /live_nodes/127.0.0.1:53886_solr
[junit4:junit4]   2> 3108 T378 oascc.ZkStateReader$3.process Updating live nodes
[junit4:junit4]   2> 3109 T358 oashc.HttpShardHandlerFactory.getParameter Setting socketTimeout to: 0
[junit4:junit4]   2> 3109 T358 oashc.HttpShardHandlerFactory.getParameter Setting urlScheme to: http://
[junit4:junit4]   2> 3109 T358 oashc.HttpShardHandlerFactory.getParameter Setting connTimeout to: 0
[junit4:junit4]   2> 3110 T358 oashc.HttpShardHandlerFactory.getParameter Setting maxConnectionsPerHost to: 20
[junit4:junit4]   2> 3110 T358 oashc.HttpShardHandlerFactory.getParameter Setting corePoolSize to: 0
[junit4:junit4]   2> 3110 T358 oashc.HttpShardHandlerFactory.getParameter Setting maximumPoolSize to: 2147483647
[junit4:junit4]   2> 3111 T358 oashc.HttpShardHandlerFactory.getParameter Setting maxThreadIdleTime to: 5
[junit4:junit4]   2> 3111 T358 oashc.HttpShardHandlerFactory.getParameter Setting sizeOfQueue to: -1
[junit4:junit4]   2> 3111 T358 oashc.HttpShardHandlerFactory.getParameter Setting fairnessPolicy to: false
[junit4:junit4]   2> 3111 T358 oascsi.HttpClientUtil.createClient Creating new http client, config:maxConnectionsPerHost=20&maxConnections=10000&socketTimeout=0&connTimeout=0&retry=false
[junit4:junit4]   2> 3127 T358 oascc.ZkStateReader.createClusterStateWatchersAndUpdate Updating cluster state from ZooKeeper... 
[junit4:junit4]   2> 3132 T358 oasc.CoreContainer.create Creating SolrCore 'collection1' using instanceDir: /usr/home/hudson/hudson-slave/workspace/Lucene-Solr-Tests-4.x-Java6/solr/build/solr-core/test/J1/./solrtest-jetty1-1348382144195/collection1
[junit4:junit4]   2> 3133 T358 oasc.ZkController.createCollectionZkNode Check for collection zkNode:collection1
[junit4:junit4]   2> 3134 T358 oasc.ZkController.createCollectionZkNode Collection zkNode exists
[junit4:junit4]   2> 3134 T358 oasc.ZkController.readConfigName Load collection config from:/collections/collection1
[junit4:junit4]   2> 3135 T358 oasc.SolrResourceLoader.<init> new SolrResourceLoader for directory: '/usr/home/hudson/hudson-slave/workspace/Lucene-Solr-Tests-4.x-Java6/solr/build/solr-core/test/J1/./solrtest-jetty1-1348382144195/collection1/'
[junit4:junit4]   2> 3136 T358 oasc.SolrResourceLoader.replaceClassLoader Adding 'file:/usr/home/hudson/hudson-slave/workspace/Lucene-Solr-Tests-4.x-Java6/solr/build/solr-core/test/J1/solrtest-jetty1-1348382144195/collection1/lib/classes/' to classloader
[junit4:junit4]   2> 3137 T358 oasc.SolrResourceLoader.replaceClassLoader Adding 'file:/usr/home/hudson/hudson-slave/workspace/Lucene-Solr-Tests-4.x-Java6/solr/build/solr-core/test/J1/solrtest-jetty1-1348382144195/collection1/lib/README' to classloader
[junit4:junit4]   2> 3172 T358 oasc.SolrConfig.<init> Using Lucene MatchVersion: LUCENE_41
[junit4:junit4]   2> 3222 T358 oasc.SolrConfig.<init> Loaded SolrConfig: solrconfig.xml
[junit4:junit4]   2> 3323 T358 oass.IndexSchema.readSchema Reading Solr Schema
[junit4:junit4]   2> 3328 T358 oass.IndexSchema.readSchema Schema name=test
[junit4:junit4]   2> 3348 T379 oascc.ZkStateReader.updateClusterState Updating cloud state from ZooKeeper... 
[junit4:junit4]   2> 3363 T392 oascc.ZkStateReader$2.process A cluster state change has occurred - updating...
[junit4:junit4]   2> 3363 T378 oascc.ZkStateReader$2.process A cluster state change has occurred - updating...
[junit4:junit4]   2> 3806 T358 oass.OpenExchangeRatesOrgProvider.init Initialized with rates=open-exchange-rates.json, refreshInterval=1440.
[junit4:junit4]   2> 3815 T358 oass.IndexSchema.readSchema default search field in schema is text
[junit4:junit4]   2> 3818 T358 oass.IndexSchema.readSchema unique key field: id
[junit4:junit4]   2> 3831 T358 oass.FileExchangeRateProvider.reload Reloading exchange rates from file currency.xml
[junit4:junit4]   2> 3835 T358 oass.FileExchangeRateProvider.reload Reloading exchange rates from file currency.xml
[junit4:junit4]   2> 3839 T358 oass.OpenExchangeRatesOrgProvider.reload Reloading exchange rates from open-exchange-rates.json
[junit4:junit4]   2> 3840 T358 oass.OpenExchangeRatesOrgProvider.reload Reloading exchange rates from open-exchange-rates.json
[junit4:junit4]   2> 3841 T358 oasc.SolrCore.<init> [collection1] Opening new SolrCore at /usr/home/hudson/hudson-slave/workspace/Lucene-Solr-Tests-4.x-Java6/solr/build/solr-core/test/J1/./solrtest-jetty1-1348382144195/collection1/, dataDir=./org.apache.solr.cloud.BasicDistributedZk2Test-1348382141302/jetty1/
[junit4:junit4]   2> 3842 T358 oasc.JmxMonitoredMap.<init> JMX monitoring is enabled. Adding Solr mbeans to JMX Server: com.sun.jmx.mbeanserver.JmxMBeanServer@46ed5d9d
[junit4:junit4]   2> 3843 T358 oasc.SolrCore.getNewIndexDir WARNING New index directory detected: old=null new=./org.apache.solr.cloud.BasicDistributedZk2Test-1348382141302/jetty1/index/
[junit4:junit4]   2> 3843 T358 oasc.SolrCore.initIndex WARNING [collection1] Solr index directory './org.apache.solr.cloud.BasicDistributedZk2Test-1348382141302/jetty1/index' doesn't exist. Creating new index...
[junit4:junit4]   2> 3844 T358 oasc.CachingDirectoryFactory.get return new directory for /usr/home/hudson/hudson-slave/workspace/Lucene-Solr-Tests-4.x-Java6/solr/build/solr-core/test/J1/./org.apache.solr.cloud.BasicDistributedZk2Test-1348382141302/jetty1/index forceNew:false
[junit4:junit4]   2> 3866 T358 oasc.SolrDeletionPolicy.onCommit SolrDeletionPolicy.onCommit: commits:num=1
[junit4:junit4]   2> 		commit{dir=NRTCachingDirectory(org.apache.lucene.store.NIOFSDirectory@/usr/home/hudson/hudson-slave/workspace/Lucene-Solr-Tests-4.x-Java6/solr/build/solr-core/test/J1/org.apache.solr.cloud.BasicDistributedZk2Test-1348382141302/jetty1/index lockFactory=org.apache.lucene.store.NativeFSLockFactory@332437f7; maxCacheMB=48.0 maxMergeSizeMB=4.0),segFN=segments_1,generation=1,filenames=[segments_1]
[junit4:junit4]   2> 3867 T358 oasc.SolrDeletionPolicy.updateCommits newest commit = 1
[junit4:junit4]   2> 3868 T358 oasc.SolrCore.initWriters created xml: solr.XMLResponseWriter
[junit4:junit4]   2> 3869 T358 oasup.UpdateRequestProcessorChain.init inserting DistributedUpdateProcessorFactory into updateRequestProcessorChain "dedupe"
[junit4:junit4]   2> 3870 T358 oasup.UpdateRequestProcessorChain.init inserting DistributedUpdateProcessorFactory into updateRequestProcessorChain "dedupe-allfields"
[junit4:junit4]   2> 3870 T358 oasup.UpdateRequestProcessorChain.init inserting DistributedUpdateProcessorFactory into updateRequestProcessorChain "stored_sig"
[junit4:junit4]   2> 3871 T358 oasup.UpdateRequestProcessorChain.init inserting DistributedUpdateProcessorFactory into updateRequestProcessorChain "uniq-fields"
[junit4:junit4]   2> 3871 T358 oasup.UpdateRequestProcessorChain.init inserting DistributedUpdateProcessorFactory into updateRequestProcessorChain "distrib-dup-test-chain-implicit"
[junit4:junit4]   2> 3872 T358 oasc.RequestHandlers.initHandlersFromConfig adding lazy requestHandler: solr.ReplicationHandler
[junit4:junit4]   2> 3872 T358 oasc.RequestHandlers.initHandlersFromConfig created /replication: solr.ReplicationHandler
[junit4:junit4]   2> 3872 T358 oasc.RequestHandlers.initHandlersFromConfig created standard: solr.StandardRequestHandler
[junit4:junit4]   2> 3873 T358 oasc.RequestHandlers.initHandlersFromConfig created /get: solr.RealTimeGetHandler
[junit4:junit4]   2> 3873 T358 oasc.RequestHandlers.initHandlersFromConfig created dismax: solr.SearchHandler
[junit4:junit4]   2> 3874 T358 oasc.RequestHandlers.initHandlersFromConfig created mock: org.apache.solr.core.MockQuerySenderListenerReqHandler
[junit4:junit4]   2> 3874 T358 oasc.RequestHandlers.initHandlersFromConfig created /admin/: org.apache.solr.handler.admin.AdminHandlers
[junit4:junit4]   2> 3875 T358 oasc.RequestHandlers.initHandlersFromConfig created defaults: solr.StandardRequestHandler
[junit4:junit4]   2> 3875 T358 oasc.RequestHandlers.initHandlersFromConfig adding lazy requestHandler: solr.StandardRequestHandler
[junit4:junit4]   2> 3876 T358 oasc.RequestHandlers.initHandlersFromConfig created lazy: solr.StandardRequestHandler
[junit4:junit4]   2> 3876 T358 oasc.RequestHandlers.initHandlersFromConfig created /update: solr.UpdateRequestHandler
[junit4:junit4]   2> 3877 T358 oasc.RequestHandlers.initHandlersFromConfig created /terms: org.apache.solr.handler.component.SearchHandler
[junit4:junit4]   2> 3877 T358 oasc.RequestHandlers.initHandlersFromConfig created spellCheckCompRH: org.apache.solr.handler.component.SearchHandler
[junit4:junit4]   2> 3878 T358 oasc.RequestHandlers.initHandlersFromConfig created spellCheckCompRH_Direct: org.apache.solr.handler.component.SearchHandler
[junit4:junit4]   2> 3878 T358 oasc.RequestHandlers.initHandlersFromConfig created spellCheckWithWordbreak: org.apache.solr.handler.component.SearchHandler
[junit4:junit4]   2> 3879 T358 oasc.RequestHandlers.initHandlersFromConfig created spellCheckWithWordbreak_Direct: org.apache.solr.handler.component.SearchHandler
[junit4:junit4]   2> 3879 T358 oasc.RequestHandlers.initHandlersFromConfig created spellCheckCompRH1: org.apache.solr.handler.component.SearchHandler
[junit4:junit4]   2> 3880 T358 oasc.RequestHandlers.initHandlersFromConfig created tvrh: org.apache.solr.handler.component.SearchHandler
[junit4:junit4]   2> 3880 T358 oasc.RequestHandlers.initHandlersFromConfig created /mlt: solr.MoreLikeThisHandler
[junit4:junit4]   2> 3881 T358 oasc.RequestHandlers.initHandlersFromConfig created /debug/dump: solr.DumpRequestHandler
[junit4:junit4]   2> 3884 T358 oashl.XMLLoader.init xsltCacheLifetimeSeconds=60
[junit4:junit4]   2> 3887 T358 oasc.SolrCore.initDeprecatedSupport WARNING solrconfig.xml uses deprecated <admin/gettableFiles>, Please update your config to use the ShowFileRequestHandler.
[junit4:junit4]   2> 3888 T358 oasc.SolrCore.initDeprecatedSupport WARNING adding ShowFileRequestHandler with hidden files: [SCHEMA.XML, OLD_SYNONYMS.TXT, STOPWORDS.TXT, PROTWORDS.TXT, OPEN-EXCHANGE-RATES.JSON, SYNONYMS.TXT, CURRENCY.XML, MAPPING-ISOLATIN1ACCENT.TXT]
[junit4:junit4]   2> 3891 T358 oass.SolrIndexSearcher.<init> Opening Searcher@69d5af30 main
[junit4:junit4]   2> 3892 T358 oasu.CommitTracker.<init> Hard AutoCommit: disabled
[junit4:junit4]   2> 3893 T358 oasu.CommitTracker.<init> Soft AutoCommit: disabled
[junit4:junit4]   2> 3893 T358 oashc.SpellCheckComponent.inform Initializing spell checkers
[junit4:junit4]   2> 3899 T358 oass.DirectSolrSpellChecker.init init: {name=direct,classname=DirectSolrSpellChecker,field=lowerfilt,minQueryLength=3}
[junit4:junit4]   2> 3964 T393 oasc.SolrCore.registerSearcher [collection1] Registered new searcher Searcher@69d5af30 main{StandardDirectoryReader(segments_1:1)}
[junit4:junit4]   2> 4370 T379 oascc.ZkStateReader.updateClusterState Updating cloud state from ZooKeeper... 
[junit4:junit4]   2> 4390 T378 oascc.ZkStateReader$2.process A cluster state change has occurred - updating...
[junit4:junit4]   2> 4390 T392 oascc.ZkStateReader$2.process A cluster state change has occurred - updating...
[junit4:junit4]   2> 4470 T358 oasc.CoreContainer.register registering core: collection1
[junit4:junit4]   2> 4470 T358 oasc.ZkController.register Register shard - core:collection1 address:http://127.0.0.1:53886/solr shardId:shard1
[junit4:junit4]   2> 4471 T358 oascc.SolrZkClient.makePath makePath: /collections/collection1/leader_elect/shard1/election
[junit4:junit4]   2> 4496 T363 oazs.PrepRequestProcessor.pRequest Got user-level KeeperException when processing sessionid:0x139f1d6ace30003 type:delete cxid:0x43 zxid:0xfffffffffffffffe txntype:unknown reqpath:n/a Error Path:/solr/collections/collection1/leaders Error:KeeperErrorCode = NoNode for /solr/collections/collection1/leaders
[junit4:junit4]   2> 4497 T358 oasc.ShardLeaderElectionContext.runLeaderProcess Running the leader process.
[junit4:junit4]   2> 4497 T363 oazs.PrepRequestProcessor.pRequest Got user-level KeeperException when processing sessionid:0x139f1d6ace30003 type:create cxid:0x44 zxid:0xfffffffffffffffe txntype:unknown reqpath:n/a Error Path:/solr/overseer Error:KeeperErrorCode = NodeExists for /solr/overseer
[junit4:junit4]   2> 4499 T358 oasc.ShardLeaderElectionContext.waitForReplicasToComeUp Enough replicas found to continue.
[junit4:junit4]   2> 4500 T358 oasc.ShardLeaderElectionContext.runLeaderProcess I may be the new leader - try and sync
[junit4:junit4]   2> 4500 T358 oasc.SyncStrategy.sync Sync replicas to http://127.0.0.1:53886/solr/collection1/
[junit4:junit4]   2> 4500 T358 oasc.SyncStrategy.syncReplicas Sync Success - now sync replicas to me
[junit4:junit4]   2> 4500 T358 oasc.SyncStrategy.syncToMe http://127.0.0.1:53886/solr/collection1/ has no replicas
[junit4:junit4]   2> 4501 T358 oasc.ShardLeaderElectionContext.runLeaderProcess I am the new leader: http://127.0.0.1:53886/solr/collection1/
[junit4:junit4]   2> 4501 T358 oascc.SolrZkClient.makePath makePath: /collections/collection1/leaders/shard1
[junit4:junit4]   2> 4505 T363 oazs.PrepRequestProcessor.pRequest Got user-level KeeperException when processing sessionid:0x139f1d6ace30003 type:create cxid:0x4e zxid:0xfffffffffffffffe txntype:unknown reqpath:n/a Error Path:/solr/overseer Error:KeeperErrorCode = NodeExists for /solr/overseer
[junit4:junit4]   2> 4895 T379 oascc.ZkStateReader.updateClusterState Updating cloud state from ZooKeeper... 
[junit4:junit4]   2> 4918 T378 oascc.ZkStateReader$2.process A cluster state change has occurred - updating...
[junit4:junit4]   2> 4918 T392 oascc.ZkStateReader$2.process A cluster state change has occurred - updating...
[junit4:junit4]   2> 4966 T358 oasc.ZkController.register We are http://127.0.0.1:53886/solr/collection1/ and leader is http://127.0.0.1:53886/solr/collection1/
[junit4:junit4]   2> 4966 T358 oasc.ZkController.register No LogReplay needed for core=collection1 baseURL=http://127.0.0.1:53886/solr
[junit4:junit4]   2> 4967 T358 oasc.ZkController.checkRecovery I am the leader, no recovery necessary
[junit4:junit4]   2> 4970 T358 oascc.ZkStateReader.updateClusterState Updating cloud state from ZooKeeper... 
[junit4:junit4]   2> 4971 T358 oass.SolrDispatchFilter.init user.dir=/usr/home/hudson/hudson-slave/workspace/Lucene-Solr-Tests-4.x-Java6/solr/build/solr-core/test/J1
[junit4:junit4]   2> 4972 T358 oass.SolrDispatchFilter.init SolrDispatchFilter.init() done
[junit4:junit4]   2> 4972 T358 oascsi.HttpClientUtil.createClient Creating new http client, config:maxConnections=128&maxConnectionsPerHost=32&followRedirects=false
[junit4:junit4]   2> 5153 T358 oejs.Server.doStart jetty-8.1.2.v20120308
[junit4:junit4]   2> 5156 T358 oejs.AbstractConnector.doStart Started SocketConnector@0.0.0.0:11769
[junit4:junit4]   2> 5157 T358 oasc.SolrResourceLoader.locateSolrHome JNDI not configured for solr (NoInitialContextEx)
[junit4:junit4]   2> 5157 T358 oasc.SolrResourceLoader.locateSolrHome using system property solr.solr.home: /usr/home/hudson/hudson-slave/workspace/Lucene-Solr-Tests-4.x-Java6/solr/build/solr-core/test/J1/./solrtest-jetty2-1348382146283
[junit4:junit4]   2> 5158 T358 oasc.SolrResourceLoader.<init> new SolrResourceLoader for deduced Solr Home: '/usr/home/hudson/hudson-slave/workspace/Lucene-Solr-Tests-4.x-Java6/solr/build/solr-core/test/J1/./solrtest-jetty2-1348382146283/'
[junit4:junit4]   2> 5195 T358 oass.SolrDispatchFilter.init SolrDispatchFilter.init()
[junit4:junit4]   2> 5196 T358 oasc.SolrResourceLoader.locateSolrHome JNDI not configured for solr (NoInitialContextEx)
[junit4:junit4]   2> 5196 T358 oasc.SolrResourceLoader.locateSolrHome using system property solr.solr.home: /usr/home/hudson/hudson-slave/workspace/Lucene-Solr-Tests-4.x-Java6/solr/build/solr-core/test/J1/./solrtest-jetty2-1348382146283
[junit4:junit4]   2> 5197 T358 oasc.CoreContainer$Initializer.initialize looking for solr.xml: /usr/home/hudson/hudson-slave/workspace/Lucene-Solr-Tests-4.x-Java6/solr/build/solr-core/test/J1/./solrtest-jetty2-1348382146283/solr.xml
[junit4:junit4]   2> 5197 T358 oasc.CoreContainer.<init> New CoreContainer 1060120913
[junit4:junit4]   2> 5198 T358 oasc.CoreContainer.load Loading CoreContainer using Solr Home: '/usr/home/hudson/hudson-slave/workspace/Lucene-Solr-Tests-4.x-Java6/solr/build/solr-core/test/J1/./solrtest-jetty2-1348382146283/'
[junit4:junit4]   2> 5198 T358 oasc.SolrResourceLoader.<init> new SolrResourceLoader for directory: '/usr/home/hudson/hudson-slave/workspace/Lucene-Solr-Tests-4.x-Java6/solr/build/solr-core/test/J1/./solrtest-jetty2-1348382146283/'
[junit4:junit4]   2> 5226 T358 oasc.CoreContainer.load Registering Log Listener
[junit4:junit4]   2> 5242 T358 oasc.CoreContainer.initZooKeeper Zookeeper client=127.0.0.1:43519/solr
[junit4:junit4]   2> 5243 T358 oaz.ZooKeeper.<init> Initiating client connection, connectString=127.0.0.1:43519/solr sessionTimeout=5000 watcher=org.apache.solr.common.cloud.ConnectionManager@7b90609
[junit4:junit4]   2> 5244 T403 oaz.ClientCnxn$SendThread.startConnect Opening socket connection to server /127.0.0.1:43519
[junit4:junit4]   2> 5244 T358 oascc.ConnectionManager.waitForConnected Waiting for client to connect to ZooKeeper
[junit4:junit4]   2> 5246 T403 oaz.ClientCnxn$SendThread.primeConnection Socket connection established to localhost/127.0.0.1:43519, initiating session
[junit4:junit4]   2> 5246 T360 oazs.NIOServerCnxn$Factory.run Accepted socket connection from /140.211.11.196:26500
[junit4:junit4]   2> 5246 T360 oazs.NIOServerCnxn.readConnectRequest Client attempting to establish new session at /140.211.11.196:26500
[junit4:junit4]   2> 5248 T362 oazs.NIOServerCnxn.finishSessionInit Established session 0x139f1d6ace30004 with negotiated timeout 5000 for client /140.211.11.196:26500
[junit4:junit4]   2> 5248 T403 oaz.ClientCnxn$SendThread.readConnectResult Session establishment complete on server localhost/127.0.0.1:43519, sessionid = 0x139f1d6ace30004, negotiated timeout = 5000
[junit4:junit4]   2> 5249 T404 oascc.ConnectionManager.process Watcher org.apache.solr.common.cloud.ConnectionManager@7b90609 name:ZooKeeperConnection Watcher:127.0.0.1:43519/solr got event WatchedEvent state:SyncConnected type:None path:null path:null type:None
[junit4:junit4]   2> 5249 T358 oascc.ConnectionManager.waitForConnected Client is connected to ZooKeeper
[junit4:junit4]   2> 5250 T363 oazs.PrepRequestProcessor.pRequest Got user-level KeeperException when processing sessionid:0x139f1d6ace30004 type:create cxid:0x1 zxid:0xfffffffffffffffe txntype:unknown reqpath:n/a Error Path:/solr/overseer Error:KeeperErrorCode = NodeExists for /solr/overseer
[junit4:junit4]   2> 5251 T363 oazs.PrepRequestProcessor.pRequest Got user-level KeeperException when processing sessionid:0x139f1d6ace30004 type:create cxid:0x2 zxid:0xfffffffffffffffe txntype:unknown reqpath:n/a Error Path:/solr/overseer Error:KeeperErrorCode = NodeExists for /solr/overseer
[junit4:junit4]   2> 5260 T358 oasc.ZkController.createEphemeralLiveNode Register node as live in ZooKeeper:/live_nodes/127.0.0.1:11769_solr
[junit4:junit4]   2> 5261 T363 oazs.PrepRequestProcessor.pRequest Got user-level KeeperException when processing sessionid:0x139f1d6ace30004 type:delete cxid:0x4 zxid:0xfffffffffffffffe txntype:unknown reqpath:n/a Error Path:/solr/live_nodes/127.0.0.1:11769_solr Error:KeeperErrorCode = NoNode for /solr/live_nodes/127.0.0.1:11769_solr
[junit4:junit4]   2> 5262 T358 oascc.SolrZkClient.makePath makePath: /live_nodes/127.0.0.1:11769_solr
[junit4:junit4]   2> 5266 T378 oascc.ZkStateReader$3.process Updating live nodes
[junit4:junit4]   2> 5266 T392 oascc.ZkStateReader$3.process Updating live nodes
[junit4:junit4]   2> 5267 T358 oashc.HttpShardHandlerFactory.getParameter Setting socketTimeout to: 0
[junit4:junit4]   2> 5268 T358 oashc.HttpShardHandlerFactory.getParameter Setting urlScheme to: http://
[junit4:junit4]   2> 5269 T358 oashc.HttpShardHandlerFactory.getParameter Setting connTimeout to: 0
[junit4:junit4]   2> 5269 T358 oashc.HttpShardHandlerFactory.getParameter Setting maxConnectionsPerHost to: 20
[junit4:junit4]   2> 5270 T358 oashc.HttpShardHandlerFactory.getParameter Setting corePoolSize to: 0
[junit4:junit4]   2> 5270 T358 oashc.HttpShardHandlerFactory.getParameter Setting maximumPoolSize to: 2147483647
[junit4:junit4]   2> 5271 T358 oashc.HttpShardHandlerFactory.getParameter Setting maxThreadIdleTime to: 5
[junit4:junit4]   2> 5271 T358 oashc.HttpShardHandlerFactory.getParameter Setting sizeOfQueue to: -1
[junit4:junit4]   2> 5272 T358 oashc.HttpShardHandlerFactory.getParameter Setting fairnessPolicy to: false
[junit4:junit4]   2> 5272 T358 oascsi.HttpClientUtil.createClient Creating new http client, config:maxConnectionsPerHost=20&maxConnections=10000&socketTimeout=0&connTimeout=0&retry=false
[junit4:junit4]   2> 5294 T358 oascc.ZkStateReader.createClusterStateWatchersAndUpdate Updating cluster state from ZooKeeper... 
[junit4:junit4]   2> 5302 T358 oasc.CoreContainer.create Creating SolrCore 'collection1' using instanceDir: /usr/home/hudson/hudson-slave/workspace/Lucene-Solr-Tests-4.x-Java6/solr/build/solr-core/test/J1/./solrtest-jetty2-1348382146283/collection1
[junit4:junit4]   2> 5303 T358 oasc.ZkController.createCollectionZkNode Check for collection zkNode:collection1
[junit4:junit4]   2> 5304 T358 oasc.ZkController.createCollectionZkNode Collection zkNode exists
[junit4:junit4]   2> 5304 T358 oasc.ZkController.readConfigName Load collection config from:/collections/collection1
[junit4:junit4]   2> 5306 T358 oasc.SolrResourceLoader.<init> new SolrResourceLoader for directory: '/usr/home/hudson/hudson-slave/workspace/Lucene-Solr-Tests-4.x-Java6/solr/build/solr-core/test/J1/./solrtest-jetty2-1348382146283/collection1/'
[junit4:junit4]   2> 5308 T358 oasc.SolrResourceLoader.replaceClassLoader Adding 'file:/usr/home/hudson/hudson-slave/workspace/Lucene-Solr-Tests-4.x-Java6/solr/build/solr-core/test/J1/solrtest-jetty2-1348382146283/collection1/lib/classes/' to classloader
[junit4:junit4]   2> 5308 T358 oasc.SolrResourceLoader.replaceClassLoader Adding 'file:/usr/home/hudson/hudson-slave/workspace/Lucene-Solr-Tests-4.x-Java6/solr/build/solr-core/test/J1/solrtest-jetty2-1348382146283/collection1/lib/README' to classloader
[junit4:junit4]   2> 5363 T358 oasc.SolrConfig.<init> Using Lucene MatchVersion: LUCENE_41
[junit4:junit4]   2> 5432 T379 oascc.ZkStateReader.updateClusterState Updating cloud state from ZooKeeper... 
[junit4:junit4]   2> 5440 T358 oasc.SolrConfig.<init> Loaded SolrConfig: solrconfig.xml
[junit4:junit4]   2> 5446 T378 oascc.ZkStateReader$2.process A cluster state change has occurred - updating...
[junit4:junit4]   2> 5447 T404 oascc.ZkStateReader$2.process A cluster state change has occurred - updating...
[junit4:junit4]   2> 5446 T392 oascc.ZkStateReader$2.process A cluster state change has occurred - updating...
[junit4:junit4]   2> 5447 T358 oass.IndexSchema.readSchema Reading Solr Schema
[junit4:junit4]   2> 5457 T358 oass.IndexSchema.readSchema Schema name=test
[junit4:junit4]   2> 5927 T358 oass.OpenExchangeRatesOrgProvider.init Initialized with rates=open-exchange-rates.json, refreshInterval=1440.
[junit4:junit4]   2> 5935 T358 oass.IndexSchema.readSchema default search field in schema is text
[junit4:junit4]   2> 5938 T358 oass.IndexSchema.readSchema unique key field: id
[junit4:junit4]   2> 5954 T358 oass.FileExchangeRateProvider.reload Reloading exchange rates from file currency.xml
[junit4:junit4]   2> 5958 T358 oass.FileExchangeRateProvider.reload Reloading exchange rates from file currency.xml
[junit4:junit4]   2> 5962 T358 oass.OpenExchangeRatesOrgProvider.reload Reloading exchange rates from open-exchange-rates.json
[junit4:junit4]   2> 5964 T358 oass.OpenExchangeRatesOrgProvider.reload Reloading exchange rates from open-exchange-rates.json
[junit4:junit4]   2> 5966 T358 oasc.SolrCore.<init> [collection1] Opening new SolrCore at /usr/home/hudson/hudson-slave/workspace/Lucene-Solr-Tests-4.x-Java6/solr/build/solr-core/test/J1/./solrtest-jetty2-1348382146283/collection1/, dataDir=./org.apache.solr.cloud.BasicDistributedZk2Test-1348382141302/jetty2/
[junit4:junit4]   2> 5966 T358 oasc.JmxMonitoredMap.<init> JMX monitoring is enabled. Adding Solr mbeans to JMX Server: com.sun.jmx.mbeanserver.JmxMBeanServer@46ed5d9d
[junit4:junit4]   2> 5967 T358 oasc.SolrCore.getNewIndexDir WARNING New index directory detected: old=null new=./org.apache.solr.cloud.BasicDistributedZk2Test-1348382141302/jetty2/index/
[junit4:junit4]   2> 5968 T358 oasc.SolrCore.initIndex WARNING [collection1] Solr index directory './org.apache.solr.cloud.BasicDistributedZk2Test-1348382141302/jetty2/index' doesn't exist. Creating new index...
[junit4:junit4]   2> 5968 T358 oasc.CachingDirectoryFactory.get return new directory for /usr/home/hudson/hudson-slave/workspace/Lucene-Solr-Tests-4.x-Java6/solr/build/solr-core/test/J1/./org.apache.solr.cloud.BasicDistributedZk2Test-1348382141302/jetty2/index forceNew:false
[junit4:junit4]   2> 5985 T358 oasc.SolrDeletionPolicy.onCommit SolrDeletionPolicy.onCommit: commits:num=1
[junit4:junit4]   2> 		commit{dir=NRTCachingDirectory(org.apache.lucene.store.NIOFSDirectory@/usr/home/hudson/hudson-slave/workspace/Lucene-Solr-Tests-4.x-Java6/solr/build/solr-core/test/J1/org.apache.solr.cloud.BasicDistributedZk2Test-1348382141302/jetty2/index lockFactory=org.apache.lucene.store.NativeFSLockFactory@190e03c8; maxCacheMB=48.0 maxMergeSizeMB=4.0),segFN=segments_1,generation=1,filenames=[segments_1]
[junit4:junit4]   2> 5986 T358 oasc.SolrDeletionPolicy.updateCommits newest commit = 1
[junit4:junit4]   2> 5987 T358 oasc.SolrCore.initWriters created xml: solr.XMLResponseWriter
[junit4:junit4]   2> 5989 T358 oasup.UpdateRequestProcessorChain.init inserting DistributedUpdateProcessorFactory into updateRequestProcessorChain "dedupe"
[junit4:junit4]   2> 5989 T358 oasup.UpdateRequestProcessorChain.init inserting DistributedUpdateProcessorFactory into updateRequestProcessorChain "dedupe-allfields"
[junit4:junit4]   2> 5989 T358 oasup.UpdateRequestProcessorChain.init inserting DistributedUpdateProcessorFactory into updateRequestProcessorChain "stored_sig"
[junit4:junit4]   2> 5990 T358 oasup.UpdateRequestProcessorChain.init inserting DistributedUpdateProcessorFactory into updateRequestProcessorChain "uniq-fields"
[junit4:junit4]   2> 5990 T358 oasup.UpdateRequestProcessorChain.init inserting DistributedUpdateProcessorFactory into updateRequestProcessorChain "distrib-dup-test-chain-implicit"
[junit4:junit4]   2> 5991 T358 oasc.RequestHandlers.initHandlersFromConfig adding lazy requestHandler: solr.ReplicationHandler
[junit4:junit4]   2> 5991 T358 oasc.RequestHandlers.initHandlersFromConfig created /replication: solr.ReplicationHandler
[junit4:junit4]   2> 5992 T358 oasc.RequestHandlers.initHandlersFromConfig created standard: solr.StandardRequestHandler
[junit4:junit4]   2> 5992 T358 oasc.RequestHandlers.initHandlersFromConfig created /get: solr.RealTimeGetHandler
[junit4:junit4]   2> 5993 T358 oasc.RequestHandlers.initHandlersFromConfig created dismax: solr.SearchHandler
[junit4:junit4]   2> 5993 T358 oasc.RequestHandlers.initHandlersFromConfig created mock: org.apache.solr.core.MockQuerySenderListenerReqHandler
[junit4:junit4]   2> 5994 T358 oasc.RequestHandlers.initHandlersFromConfig created /admin/: org.apache.solr.handler.admin.AdminHandlers
[junit4:junit4]   2> 5994 T358 oasc.RequestHandlers.initHandlersFromConfig created defaults: solr.StandardRequestHandler
[junit4:junit4]   2> 5995 T358 oasc.RequestHandlers.initHandlersFromConfig adding lazy requestHandler: solr.StandardRequestHandler
[junit4:junit4]   2> 5995 T358 oasc.RequestHandlers.initHandlersFromConfig created lazy: solr.StandardRequestHandler
[junit4:junit4]   2> 5995 T358 oasc.RequestHandlers.initHandlersFromConfig created /update: solr.UpdateRequestHandler
[junit4:junit4]   2> 5996 T358 oasc.RequestHandlers.initHandlersFromConfig created /terms: org.apache.solr.handler.component.SearchHandler
[junit4:junit4]   2> 5996 T358 oasc.RequestHandlers.initHandlersFromConfig created spellCheckCompRH: org.apache.solr.handler.component.SearchHandler
[junit4:junit4]   2> 5997 T358 oasc.RequestHandlers.initHandlersFromConfig created spellCheckCompRH_Direct: org.apache.solr.handler.component.SearchHandler
[junit4:junit4]   2> 5997 T358 oasc.RequestHandlers.initHandlersFromConfig created spellCheckWithWordbreak: org.apache.solr.handler.component.SearchHandler
[junit4:junit4]   2> 5998 T358 oasc.RequestHandlers.initHandlersFromConfig created spellCheckWithWordbreak_Direct: org.apache.solr.handler.component.SearchHandler
[junit4:junit4]   2> 5998 T358 oasc.RequestHandlers.initHandlersFromConfig created spellCheckCompRH1: org.apache.solr.handler.component.SearchHandler
[junit4:junit4]   2> 5999 T358 oasc.RequestHandlers.initHandlersFromConfig created tvrh: org.apache.solr.handler.component.SearchHandler
[junit4:junit4]   2> 5999 T358 oasc.RequestHandlers.initHandlersFromConfig created /mlt: solr.MoreLikeThisHandler
[junit4:junit4]   2> 6000 T358 oasc.RequestHandlers.initHandlersFromConfig created /debug/dump: solr.DumpRequestHandler
[junit4:junit4]   2> 6003 T358 oashl.XMLLoader.init xsltCacheLifetimeSeconds=60
[junit4:junit4]   2> 6006 T358 oasc.SolrCore.initDeprecatedSupport WARNING solrconfig.xml uses deprecated <admin/gettableFiles>, Please update your config to use the ShowFileRequestHandler.
[junit4:junit4]   2> 6008 T358 oasc.SolrCore.initDeprecatedSupport WARNING adding ShowFileRequestHandler with hidden files: [SCHEMA.XML, OLD_SYNONYMS.TXT, STOPWORDS.TXT, PROTWORDS.TXT, OPEN-EXCHANGE-RATES.JSON, SYNONYMS.TXT, CURRENCY.XML, MAPPING-ISOLATIN1ACCENT.TXT]
[junit4:junit4]   2> 6011 T358 oass.SolrIndexSearcher.<init> Opening Searcher@3638043 main
[junit4:junit4]   2> 6012 T358 oasu.CommitTracker.<init> Hard AutoCommit: disabled
[junit4:junit4]   2> 6012 T358 oasu.CommitTracker.<init> Soft AutoCommit: disabled
[junit4:junit4]   2> 6013 T358 oashc.SpellCheckComponent.inform Initializing spell checkers
[junit4:junit4]   2> 6019 T358 oass.DirectSolrSpellChecker.init init: {name=direct,classname=DirectSolrSpellChecker,field=lowerfilt,minQueryLength=3}
[junit4:junit4]   2> 6069 T405 oasc.SolrCore.registerSearcher [collection1] Registered new searcher Searcher@3638043 main{StandardDirectoryReader(segments_1:1)}
[junit4:junit4]   2> 6454 T379 oascc.ZkStateReader.updateClusterState Updating cloud state from ZooKeeper... 
[junit4:junit4]   2> 6459 T404 oascc.ZkStateReader$2.process A cluster state change has occurred - updating...
[junit4:junit4]   2> 6459 T378 oascc.ZkStateReader$2.process A cluster state change has occurred - updating...
[junit4:junit4]   2> 6459 T392 oascc.ZkStateReader$2.process A cluster state change has occurred - updating...
[junit4:junit4]   2> 6576 T358 oasc.CoreContainer.register registering core: collection1
[junit4:junit4]   2> 6576 T358 oasc.ZkController.register Register shard - core:collection1 address:http://127.0.0.1:11769/solr shardId:shard2
[junit4:junit4]   2> 6577 T358 oascc.SolrZkClient.makePath makePath: /collections/collection1/leader_elect/shard2/election
[junit4:junit4]   2> 6619 T363 oazs.PrepRequestProcessor.pRequest Got user-level KeeperException when processing sessionid:0x139f1d6ace30004 type:delete cxid:0x42 zxid:0xfffffffffffffffe txntype:unknown reqpath:n/a Error Path:/solr/collections/collection1/leaders/shard2 Error:KeeperErrorCode = NoNode for /solr/collections/collection1/leaders/shard2
[junit4:junit4]   2> 6620 T358 oasc.ShardLeaderElectionContext.runLeaderProcess Running the leader process.
[junit4:junit4]   2> 6620 T363 oazs.PrepRequestProcessor.pRequest Got user-level KeeperException when processing sessionid:0x139f1d6ace30004 type:create cxid:0x43 zxid:0xfffffffffffffffe txntype:unknown reqpath:n/a Error Path:/solr/overseer Error:KeeperErrorCode = NodeExists for /solr/overseer
[junit4:junit4]   2> 6659 T358 oasc.ShardLeaderElectionContext.waitForReplicasToComeUp Enough replicas found to continue.
[junit4:junit4]   2> 6660 T358 oasc.ShardLeaderElectionContext.runLeaderProcess I may be the new leader - try and sync
[junit4:junit4]   2> 6660 T358 oasc.SyncStrategy.sync Sync replicas to http://127.0.0.1:11769/solr/collection1/
[junit4:junit4]   2> 6660 T358 oasc.SyncStrategy.syncReplicas Sync Success - now sync replicas to me
[junit4:junit4]   2> 6661 T358 oasc.SyncStrategy.syncToMe http://127.0.0.1:11769/solr/collection1/ has no replicas
[junit4:junit4]   2> 6661 T358 oasc.ShardLeaderElectionContext.runLeaderProcess I am the new leader: http://127.0.0.1:11769/solr/collection1/
[junit4:junit4]   2> 6661 T358 oascc.SolrZkClient.makePath makePath: /collections/collection1/leaders/shard2
[junit4:junit4]   2> 6665 T363 oazs.PrepRequestProcessor.pRequest Got user-level KeeperException when processing sessionid:0x139f1d6ace30004 type:create cxid:0x4c zxid:0xfffffffffffffffe txntype:unknown reqpath:n/a Error Path:/solr/overseer Error:KeeperErrorCode = NodeExists for /solr/overseer
[junit4:junit4]   2> 6999 T379 oascc.ZkStateReader.updateClusterState Updating cloud state from ZooKeeper... 
[junit4:junit4]   2> 7020 T378 oascc.ZkStateReader$2.process A cluster state change has occurred - updating...
[junit4:junit4]   2> 7020 T392 oascc.ZkStateReader$2.process A cluster state change has occurred - updating...
[junit4:junit4]   2> 7020 T404 oascc.ZkStateReader$2.process A cluster state change has occurred - updating...
[junit4:junit4]   2> 7030 T358 oasc.ZkController.register We are http://127.0.0.1:11769/solr/collection1/ and leader is http://127.0.0.1:11769/solr/collection1/
[junit4:junit4]   2> 7030 T358 oasc.ZkController.register No LogReplay needed for core=collection1 baseURL=http://127.0.0.1:11769/solr
[junit4:junit4]   2> 7031 T358 oasc.ZkController.checkRecovery I am the leader, no recovery necessary
[junit4:junit4]   2> 7033 T358 oascc.ZkStateReader.updateClusterState Updating cloud state from ZooKeeper... 
[junit4:junit4]   2> 7034 T358 oass.SolrDispatchFilter.init user.dir=/usr/home/hudson/hudson-slave/workspace/Lucene-Solr-Tests-4.x-Java6/solr/build/solr-core/test/J1
[junit4:junit4]   2> 7034 T358 oass.SolrDispatchFilter.init SolrDispatchFilter.init() done
[junit4:junit4]   2> 7035 T358 oascsi.HttpClientUtil.createClient Creating new http client, config:maxConnections=128&maxConnectionsPerHost=32&followRedirects=false
[junit4:junit4]   2> 7222 T358 oejs.Server.doStart jetty-8.1.2.v20120308
[junit4:junit4]   2> 7225 T358 oejs.AbstractConnector.doStart Started SocketConnector@0.0.0.0:34472
[junit4:junit4]   2> 7225 T358 oasc.SolrResourceLoader.locateSolrHome JNDI not configured for solr (NoInitialContextEx)
[junit4:junit4]   2> 7226 T358 oasc.SolrResourceLoader.locateSolrHome using system property solr.solr.home: /usr/home/hudson/hudson-slave/workspace/Lucene-Solr-Tests-4.x-Java6/solr/build/solr-core/test/J1/./solrtest-jetty3-1348382148345
[junit4:junit4]   2> 7226 T358 oasc.SolrResourceLoader.<init> new SolrResourceLoader for deduced Solr Home: '/usr/home/hudson/hudson-slave/workspace/Lucene-Solr-Tests-4.x-Java6/solr/build/solr-core/test/J1/./solrtest-jetty3-1348382148345/'
[junit4:junit4]   2> 7261 T358 oass.SolrDispatchFilter.init SolrDispatchFilter.init()
[junit4:junit4]   2> 7262 T358 oasc.SolrResourceLoader.locateSolrHome JNDI not configured for solr (NoInitialContextEx)
[junit4:junit4]   2> 7262 T358 oasc.SolrResourceLoader.locateSolrHome using system property solr.solr.home: /usr/home/hudson/hudson-slave/workspace/Lucene-Solr-Tests-4.x-Java6/solr/build/solr-core/test/J1/./solrtest-jetty3-1348382148345
[junit4:junit4]   2> 7262 T358 oasc.CoreContainer$Initializer.initialize looking for solr.xml: /usr/home/hudson/hudson-slave/workspace/Lucene-Solr-Tests-4.x-Java6/solr/build/solr-core/test/J1/./solrtest-jetty3-1348382148345/solr.xml
[junit4:junit4]   2> 7263 T358 oasc.CoreContainer.<init> New CoreContainer 1066003783
[junit4:junit4]   2> 7263 T358 oasc.CoreContainer.load Loading CoreContainer using Solr Home: '/usr/home/hudson/hudson-slave/workspace/Lucene-Solr-Tests-4.x-Java6/solr/build/solr-core/test/J1/./solrtest-jetty3-1348382148345/'
[junit4:junit4]   2> 7264 T358 oasc.SolrResourceLoader.<init> new SolrResourceLoader for directory: '/usr/home/hudson/hudson-slave/workspace/Lucene-Solr-Tests-4.x-Java6/solr/build/solr-core/test/J1/./solrtest-jetty3-1348382148345/'
[junit4:junit4]   2> 7288 T358 oasc.CoreContainer.load Registering Log Listener
[junit4:junit4]   2> 7303 T358 oasc.CoreContainer.initZooKeeper Zookeeper client=127.0.0.1:43519/solr
[junit4:junit4]   2> 7303 T358 oaz.ZooKeeper.<init> Initiating client connection, connectString=127.0.0.1:43519/solr sessionTimeout=5000 watcher=org.apache.solr.common.cloud.ConnectionManager@62500b5a
[junit4:junit4]   2> 7304 T415 oaz.ClientCnxn$SendThread.startConnect Opening socket connection to server /127.0.0.1:43519
[junit4:junit4]   2> 7304 T358 oascc.ConnectionManager.waitForConnected Waiting for client to connect to ZooKeeper
[junit4:junit4]   2> 7305 T415 oaz.ClientCnxn$SendThread.primeConnection Socket connection established to localhost/127.0.0.1:43519, initiating session
[junit4:junit4]   2> 7305 T360 oazs.NIOServerCnxn$Factory.run Accepted socket connection from /140.211.11.196:12178
[junit4:junit4]   2> 7306 T360 oazs.NIOServerCnxn.readConnectRequest Client attempting to establish new session at /140.211.11.196:12178
[junit4:junit4]   2> 7308 T362 oazs.NIOServerCnxn.finishSessionInit Established session 0x139f1d6ace30005 with negotiated timeout 5000 for client /140.211.11.196:12178
[junit4:junit4]   2> 7308 T415 oaz.ClientCnxn$SendThread.readConnectResult Session establishment complete on server localhost/127.0.0.1:43519, sessionid = 0x139f1d6ace30005, negotiated timeout = 5000
[junit4:junit4]   2> 7308 T416 oascc.ConnectionManager.process Watcher org.apache.solr.common.cloud.ConnectionManager@62500b5a name:ZooKeeperConnection Watcher:127.0.0.1:43519/solr got event WatchedEvent state:SyncConnected type:None path:null path:null type:None
[junit4:junit4]   2> 7308 T358 oascc.ConnectionManager.waitForConnected Client is connected to ZooKeeper
[junit4:junit4]   2> 7309 T363 oazs.PrepRequestProcessor.pRequest Got user-level KeeperException when processing sessionid:0x139f1d6ace30005 type:create cxid:0x1 zxid:0xfffffffffffffffe txntype:unknown reqpath:n/a Error Path:/solr/overseer Error:KeeperErrorCode = NodeExists for /solr/overseer
[junit4:junit4]   2> 7319 T363 oazs.PrepRequestProcessor.pRequest Got user-level KeeperException when processing sessionid:0x139f1d6ace30005 type:create cxid:0x2 zxid:0xfffffffffffffffe txntype:unknown reqpath:n/a Error Path:/solr/overseer Error:KeeperErrorCode = NodeExists for /solr/overseer
[junit4:junit4]   2> 7321 T358 oasc.ZkController.createEphemeralLiveNode Register node as live in ZooKeeper:/live_nodes/127.0.0.1:34472_solr
[junit4:junit4]   2> 7322 T363 oazs.PrepRequestProcessor.pRequest Got user-level KeeperException when processing sessionid:0x139f1d6ace30005 type:delete cxid:0x4 zxid:0xfffffffffffffffe txntype:unknown reqpath:n/a Error Path:/solr/live_nodes/127.0.0.1:34472_solr Error:KeeperErrorCode = NoNode for /solr/live_nodes/127.0.0.1:34472_solr
[junit4:junit4]   2> 7327 T358 oascc.SolrZkClient.makePath makePath: /live_nodes/127.0.0.1:34472_solr
[junit4:junit4]   2> 7330 T378 oascc.ZkStateReader$3.process Updating live nodes
[junit4:junit4]   2> 7330 T404 oascc.ZkStateReader$3.process Updating live nodes
[junit4:junit4]   2> 7330 T392 oascc.ZkStateReader$3.process Updating live nodes
[junit4:junit4]   2> 7331 T358 oashc.HttpShardHandlerFactory.getParameter Setting socketTimeout to: 0
[junit4:junit4]   2> 7332 T358 oashc.HttpShardHandlerFactory.getParameter Setting urlScheme to: http://
[junit4:junit4]   2> 7332 T358 oashc.HttpShardHandlerFactory.getParameter Setting connTimeout to: 0
[junit4:junit4]   2> 7333 T358 oashc.HttpShardHandlerFactory.getParameter Setting maxConnectionsPerHost to: 20
[junit4:junit4]   2> 7333 T358 oashc.HttpShardHandlerFactory.getParameter Setting corePoolSize to: 0
[junit4:junit4]   2> 7333 T358 oashc.HttpShardHandlerFactory.getParameter Setting maximumPoolSize to: 2147483647
[junit4:junit4]   2> 7334 T358 oashc.HttpShardHandlerFactory.getParameter Setting maxThreadIdleTime to: 5
[junit4:junit4]   2> 7334 T358 oashc.HttpShardHandlerFactory.getParameter Setting sizeOfQueue to: -1
[junit4:junit4]   2> 7335 T358 oashc.HttpShardHandlerFactory.getParameter Setting fairnessPolicy to: false
[junit4:junit4]   2> 7335 T358 oascsi.HttpClientUtil.createClient Creating new http client, config:maxConnectionsPerHost=20&maxConnections=10000&socketTimeout=0&connTimeout=0&retry=false
[junit4:junit4]   2> 7353 T358 oascc.ZkStateReader.createClusterStateWatchersAndUpdate Updating cluster state from ZooKeeper... 
[junit4:junit4]   2> 7363 T358 oasc.CoreContainer.create Creating SolrCore 'collection1' using instanceDir: /usr/home/hudson/hudson-slave/workspace/Lucene-Solr-Tests-4.x-Java6/solr/build/solr-core/test/J1/./solrtest-jetty3-1348382148345/collection1
[junit4:junit4]   2> 7363 T358 oasc.ZkController.createCollectionZkNode Check for collection zkNode:collection1
[junit4:junit4]   2> 7364 T358 oasc.ZkController.createCollectionZkNode Collection zkNode exists
[junit4:junit4]   2> 7365 T358 oasc.ZkController.readConfigName Load collection config from:/collections/collection1
[junit4:junit4]   2> 7366 T358 oasc.SolrResourceLoader.<init> new SolrResourceLoader for directory: '/usr/home/hudson/hudson-slave/workspace/Lucene-Solr-Tests-4.x-Java6/solr/build/solr-core/test/J1/./solrtest-jetty3-1348382148345/collection1/'
[junit4:junit4]   2> 7368 T358 oasc.SolrResourceLoader.replaceClassLoader Adding 'file:/usr/home/hudson/hudson-slave/workspace/Lucene-Solr-Tests-4.x-Java6/solr/build/solr-core/test/J1/solrtest-jetty3-1348382148345/collection1/lib/README' to classloader
[junit4:junit4]   2> 7369 T358 oasc.SolrResourceLoader.replaceClassLoader Adding 'file:/usr/home/hudson/hudson-slave/workspace/Lucene-Solr-Tests-4.x-Java6/solr/build/solr-core/test/J1/solrtest-jetty3-1348382148345/collection1/lib/classes/' to classloader
[junit4:junit4]   2> 7417 T358 oasc.SolrConfig.<init> Using Lucene MatchVersion: LUCENE_41
[junit4:junit4]   2> 7485 T358 oasc.SolrConfig.<init> Loaded SolrConfig: solrconfig.xml
[junit4:junit4]   2> 7531 T379 oascc.ZkStateReader.updateClusterState Updating cloud state from ZooKeeper... 
[junit4:junit4]   2> 7544 T392 oascc.ZkStateReader$2.process A cluster state change has occurred - updating...
[junit4:junit4]   2> 7544 T404 oascc.ZkStateReader$2.process A cluster state change has occurred - updating...
[junit4:junit4]   2> 7544 T378 oascc.ZkStateReader$2.process A cluster state change has occurred - updating...
[junit4:junit4]   2> 7586 T416 oascc.ZkStateReader$2.process A cluster state change has occurred - updating...
[junit4:junit4]   2> 7586 T358 oass.IndexSchema.readSchema Reading Solr Schema
[junit4:junit4]   2> 7593 T358 oass.IndexSchema.readSchema Schema name=test
[junit4:junit4]   2> 8189 T358 oass.OpenExchangeRatesOrgProvider.init Initialized with rates=open-exchange-rates.json, refreshInterval=1440.
[junit4:junit4]   2> 8201 T358 oass.IndexSchema.readSchema default search field in schema is text
[junit4:junit4]   2> 8205 T358 oass.IndexSchema.readSchema unique key field: id
[junit4:junit4]   2> 8223 T358 oass.FileExchangeRateProvider.reload Reloading exchange rates from file currency.xml
[junit4:junit4]   2> 8228 T358 oass.FileExchangeRateProvider.reload Reloading exchange rates from file currency.xml
[junit4:junit4]   2> 8233 T358 oass.OpenExchangeRatesOrgProvider.reload Reloading exchange rates from open-exchange-rates.json
[junit4:junit4]   2> 8234 T358 oass.OpenExchangeRatesOrgProvider.reload Reloading exchange rates from open-exchange-rates.json
[junit4:junit4]   2> 8236 T358 oasc.SolrCore.<init> [collection1] Opening new SolrCore at /usr/home/hudson/hudson-slave/workspace/Lucene-Solr-Tests-4.x-Java6/solr/build/solr-core/test/J1/./solrtest-jetty3-1348382148345/collection1/, dataDir=./org.apache.solr.cloud.BasicDistributedZk2Test-1348382141302/jetty3/
[junit4:junit4]   2> 8236 T358 oasc.JmxMonitoredMap.<init> JMX monitoring is enabled. Adding Solr mbeans to JMX Server: com.sun.jmx.mbeanserver.JmxMBeanServer@46ed5d9d
[junit4:junit4]   2> 8238 T358 oasc.SolrCore.getNewIndexDir WARNING New index directory detected: old=null new=./org.apache.solr.cloud.BasicDistributedZk2Test-1348382141302/jetty3/index/
[junit4:junit4]   2> 8239 T358 oasc.SolrCore.initIndex WARNING [collection1] Solr index directory './org.apache.solr.cloud.BasicDistributedZk2Test-1348382141302/jetty3/index' doesn't exist. Creating new index...
[junit4:junit4]   2> 8240 T358 oasc.CachingDirectoryFactory.get return new directory for /usr/home/hudson/hudson-slave/workspace/Lucene-Solr-Tests-4.x-Java6/solr/build/solr-core/test/J1/./org.apache.solr.cloud.BasicDistributedZk2Test-1348382141302/jetty3/index forceNew:false
[junit4:junit4]   2> 8246 T358 oasc.SolrDeletionPolicy.onCommit SolrDeletionPolicy.onCommit: commits:num=1
[junit4:junit4]   2> 		commit{dir=NRTCachingDirectory(org.apache.lucene.store.NIOFSDirectory@/usr/home/hudson/hudson-slave/workspace/Lucene-Solr-Tests-4.x-Java6/solr/build/solr-core/test/J1/org.apache.solr.cloud.BasicDistributedZk2Test-1348382141302/jetty3/index lockFactory=org.apache.lucene.store.NativeFSLockFactory@3f9ba6d6; maxCacheMB=48.0 maxMergeSizeMB=4.0),segFN=segments_1,generation=1,filenames=[segments_1]
[junit4:junit4]   2> 8247 T358 oasc.SolrDeletionPolicy.updateCommits newest commit = 1
[junit4:junit4]   2> 8248 T358 oasc.SolrCore.initWriters created xml: solr.XMLResponseWriter
[junit4:junit4]   2> 8251 T358 oasup.UpdateRequestProcessorChain.init inserting DistributedUpdateProcessorFactory into updateRequestProcessorChain "dedupe"
[junit4:junit4]   2> 8251 T358 oasup.UpdateRequestProcessorChain.init inserting DistributedUpdateProcessorFactory into updateRequestProcessorChain "dedupe-allfields"
[junit4:junit4]   2> 8252 T358 oasup.UpdateRequestProcessorChain.init inserting DistributedUpdateProcessorFactory into updateRequestProcessorChain "stored_sig"
[junit4:junit4]   2> 8252 T358 oasup.UpdateRequestProcessorChain.init inserting DistributedUpdateProcessorFactory into updateRequestProcessorChain "uniq-fields"
[junit4:junit4]   2> 8253 T358 oasup.UpdateRequestProcessorChain.init inserting DistributedUpdateProcessorFactory into updateRequestProcessorChain "distrib-dup-test-chain-implicit"
[junit4:junit4]   2> 8254 T358 oasc.RequestHandlers.initHandlersFromConfig adding lazy requestHandler: solr.ReplicationHandler
[junit4:junit4]   2> 8254 T358 oasc.RequestHandlers.initHandlersFromConfig created /replication: solr.ReplicationHandler
[junit4:junit4]   2> 8255 T358 oasc.RequestHandlers.initHandlersFromConfig created standard: solr.StandardRequestHandler
[junit4:junit4]   2> 8256 T358 oasc.RequestHandlers.initHandlersFromConfig created /get: solr.RealTimeGetHandler
[junit4:junit4]   2> 8257 T358 oasc.RequestHandlers.initHandlersFromConfig created dismax: solr.SearchHandler
[junit4:junit4]   2> 8257 T358 oasc.RequestHandlers.initHandlersFromConfig created mock: org.apache.solr.core.MockQuerySenderListenerReqHandler
[junit4:junit4]   2> 8258 T358 oasc.RequestHandlers.initHandlersFromConfig created /admin/: org.apache.solr.handler.admin.AdminHandlers
[junit4:junit4]   2> 8259 T358 oasc.RequestHandlers.initHandlersFromConfig created defaults: solr.StandardRequestHandler
[junit4:junit4]   2> 8259 T358 oasc.RequestHandlers.initHandlersFromConfig adding lazy requestHandler: solr.StandardRequestHandler
[junit4:junit4]   2> 8260 T358 oasc.RequestHandlers.initHandlersFromConfig created lazy: solr.StandardRequestHandler
[junit4:junit4]   2> 8261 T358 oasc.RequestHandlers.initHandlersFromConfig created /update: solr.UpdateRequestHandler
[junit4:junit4]   2> 8261 T358 oasc.RequestHandlers.initHandlersFromConfig created /terms: org.apache.solr.handler.component.SearchHandler
[junit4:junit4]   2> 8262 T358 oasc.RequestHandlers.initHandlersFromConfig created spellCheckCompRH: org.apache.solr.handler.component.SearchHandler
[junit4:junit4]   2> 8263 T358 oasc.RequestHandlers.initHandlersFromConfig created spellCheckCompRH_Direct: org.apache.solr.handler.component.SearchHandler
[junit4:junit4]   2> 8264 T358 oasc.RequestHandlers.initHandlersFromConfig created spellCheckWithWordbreak: org.apache.solr.handler.component.SearchHandler
[junit4:junit4]   2> 8264 T358 oasc.RequestHandlers.initHandlersFromConfig created spellCheckWithWordbreak_Direct: org.apache.solr.handler.component.SearchHandler
[junit4:junit4]   2> 8265 T358 oasc.RequestHandlers.initHandlersFromConfig created spellCheckCompRH1: org.apache.solr.handler.component.SearchHandler
[junit4:junit4]   2> 8266 T358 oasc.RequestHandlers.initHandlersFromConfig created tvrh: org.apache.solr.handler.component.SearchHandler
[junit4:junit4]   2> 8267 T358 oasc.RequestHandlers.initHandlersFromConfig created /mlt: solr.MoreLikeThisHandler
[junit4:junit4]   2> 8267 T358 oasc.RequestHandlers.initHandlersFromConfig created /debug/dump: solr.DumpRequestHandler
[junit4:junit4]   2> 8271 T358 oashl.XMLLoader.init xsltCacheLifetimeSeconds=60
[junit4:junit4]   2> 8276 T358 oasc.SolrCore.initDeprecatedSupport WARNING solrconfig.xml uses deprecated <admin/gettableFiles>, Please update your config to use the ShowFileRequestHandler.
[junit4:junit4]   2> 8278 T358 oasc.SolrCore.initDeprecatedSupport WARNING adding ShowFileRequestHandler with hidden files: [SCHEMA.XML, OLD_SYNONYMS.TXT, STOPWORDS.TXT, PROTWORDS.TXT, OPEN-EXCHANGE-RATES.JSON, SYNONYMS.TXT, CURRENCY.XML, MAPPING-ISOLATIN1ACCENT.TXT]
[junit4:junit4]   2> 8282 T358 oass.SolrIndexSearcher.<init> Opening Searcher@1adf5b8e main
[junit4:junit4]   2> 8283 T358 oasu.CommitTracker.<init> Hard AutoCommit: disabled
[junit4:junit4]   2> 8284 T358 oasu.CommitTracker.<init> Soft AutoCommit: disabled
[junit4:junit4]   2> 8284 T358 oashc.SpellCheckComponent.inform Initializing spell checkers
[junit4:junit4]   2> 8292 T358 oass.DirectSolrSpellChecker.init init: {name=direct,classname=DirectSolrSpellChecker,field=lowerfilt,minQueryLength=3}
[junit4:junit4]   2> 8350 T417 oasc.SolrCore.registerSearcher [collection1] Registered new searcher Searcher@1adf5b8e main{StandardDirectoryReader(segments_1:1)}
[junit4:junit4]   2> 8551 T379 oascc.ZkStateReader.updateClusterState Updating cloud state from ZooKeeper... 
[junit4:junit4]   2> 8565 T392 oascc.ZkStateReader$2.process A cluster state change has occurred - updating...
[junit4:junit4]   2> 8565 T378 oascc.ZkStateReader$2.process A cluster state change has occurred - updating...
[junit4:junit4]   2> 8565 T416 oascc.ZkStateReader$2.process A cluster state change has occurred - updating...
[junit4:junit4]   2> 8565 T404 oascc.ZkStateReader$2.process A cluster state change has occurred - updating...
[junit4:junit4]   2> 8863 T358 oasc.CoreContainer.register registering core: collection1
[junit4:junit4]   2> 8863 T358 oasc.ZkController.register Register shard - core:collection1 address:http://127.0.0.1:34472/solr shardId:shard1
[junit4:junit4]   2> 8867 T358 oasc.ZkController.register We are http://127.0.0.1:34472/solr/collection1/ and leader is http://127.0.0.1:53886/solr/collection1/
[junit4:junit4]   2> 8868 T358 oasc.ZkController.register No LogReplay needed for core=collection1 baseURL=http://127.0.0.1:34472/solr
[junit4:junit4]   2> 8868 T358 oasc.ZkController.checkRecovery Core needs to recover:collection1
[junit4:junit4]   2> 8868 T358 oasu.DefaultSolrCoreState.doRecovery Running recovery - first canceling any ongoing recovery
[junit4:junit4]   2> ASYNC  NEW_CORE C34 name=collection1 org.apache.solr.core.SolrCore@431029a3 url=http://127.0.0.1:34472/solr/collection1 node=127.0.0.1:34472_solr
[junit4:junit4]   2> 8874 T418 C34 P34472 oasc.RecoveryStrategy.run Starting recovery process.  core=collection1 recoveringAfterStartup=true
[junit4:junit4]   2> 8874 T358 oascc.ZkStateReader.updateClusterState Updating cloud state from ZooKeeper... 
[junit4:junit4]   2> 8875 T418 C34 P34472 oasc.RecoveryStrategy.doRecovery ###### startupVersions=[]
[junit4:junit4]   2> 8876 T358 oass.SolrDispatchFilter.init user.dir=/usr/home/hudson/hudson-slave/workspace/Lucene-Solr-Tests-4.x-Java6/solr/build/solr-core/test/J1
[junit4:junit4]   2> 8876 T358 oass.SolrDispatchFilter.init SolrDispatchFilter.init() done
[junit4:junit4]   2> 8877 T418 C34 P34472 oasc.RecoveryStrategy.doRecovery Attempting to PeerSync from http://127.0.0.1:53886/solr/collection1/ core=collection1 - recoveringAfterStartup=true
[junit4:junit4]   2> 8876 T358 oascsi.HttpClientUtil.createClient Creating new http client, config:maxConnections=128&maxConnectionsPerHost=32&followRedirects=false
[junit4:junit4]   2> 8888 T418 C34 P34472 oascsi.HttpClientUtil.createClient Creating new http client, config:maxConnectionsPerHost=20&maxConnections=10000&connTimeout=30000&socketTimeout=30000&retry=false
[junit4:junit4]   2> 8909 T418 C34 P34472 oasu.PeerSync.sync PeerSync: core=collection1 url=http://127.0.0.1:34472/solr START replicas=[http://127.0.0.1:53886/solr/collection1/] nUpdates=100
[junit4:junit4]   2> 8910 T418 C34 P34472 oasu.PeerSync.sync WARNING no frame of reference to tell of we've missed updates
[junit4:junit4]   2> 8911 T418 C34 P34472 oasc.RecoveryStrategy.doRecovery PeerSync Recovery was not successful - trying replication. core=collection1
[junit4:junit4]   2> 8911 T418 C34 P34472 oasc.RecoveryStrategy.doRecovery Starting Replication Recovery. core=collection1
[junit4:junit4]   2> 8911 T418 C34 P34472 oascsi.HttpClientUtil.createClient Creating new http client, config:maxConnections=128&maxConnectionsPerHost=32&followRedirects=false
[junit4:junit4]   2> ASYNC  NEW_CORE C35 name=collection1 org.apache.solr.core.SolrCore@10d65c82 url=http://127.0.0.1:53886/solr/collection1 node=127.0.0.1:53886_solr
[junit4:junit4]   2> 8920 T384 C35 P53886 REQ /get {distrib=false&qt=/get&wt=javabin&version=2&getVersions=100} status=0 QTime=0 
[junit4:junit4]   2> 9056 T358 oejs.Server.doStart jetty-8.1.2.v20120308
[junit4:junit4]   2> 9059 T358 oejs.AbstractConnector.doStart Started SocketConnector@0.0.0.0:36096
[junit4:junit4]   2> 9059 T358 oasc.SolrResourceLoader.locateSolrHome JNDI not configured for solr (NoInitialContextEx)
[junit4:junit4]   2> 9060 T358 oasc.SolrResourceLoader.locateSolrHome using system property solr.solr.home: /usr/home/hudson/hudson-slave/workspace/Lucene-Solr-Tests-4.x-Java6/solr/build/solr-core/test/J1/./solrtest-jetty4-1348382150185
[junit4:junit4]   2> 9060 T358 oasc.SolrResourceLoader.<init> new SolrResourceLoader for deduced Solr Home: '/usr/home/hudson/hudson-slave/workspace/Lucene-Solr-Tests-4.x-Java6/solr/build/solr-core/test/J1/./solrtest-jetty4-1348382150185/'
[junit4:junit4]   2> 9071 T379 oascc.ZkStateReader.updateClusterState Updating cloud state from ZooKeeper... 
[junit4:junit4]   2> 9089 T358 oass.SolrDispatchFilter.init SolrDispatchFilter.init()
[junit4:junit4]   2> 9089 T358 oasc.SolrResourceLoader.locateSolrHome JNDI not configured for solr (NoInitialContextEx)
[junit4:junit4]   2> 9090 T358 oasc.SolrResourceLoader.locateSolrHome using system property solr.solr.home: /usr/home/hudson/hudson-slave/workspace/Lucene-Solr-Tests-4.x-Java6/solr/build/solr-core/test/J1/./solrtest-jetty4-1348382150185
[junit4:junit4]   2> 9090 T358 oasc.CoreContainer$Initializer.initialize looking for solr.xml: /usr/home/hudson/hudson-slave/workspace/Lucene-Solr-Tests-4.x-Java6/solr/build/solr-core/test/J1/./solrtest-jetty4-1348382150185/solr.xml
[junit4:junit4]   2> 9090 T358 oasc.CoreContainer.<init> New CoreContainer 1580753738
[junit4:junit4]   2> 9091 T358 oasc.CoreContainer.load Loading CoreContainer using Solr Home: '/usr/home/hudson/hudson-slave/workspace/Lucene-Solr-Tests-4.x-Java6/solr/build/solr-core/test/J1/./solrtest-jetty4-1348382150185/'
[junit4:junit4]   2> 9091 T358 oasc.SolrResourceLoader.<init> new SolrResourceLoader for directory: '/usr/home/hudson/hudson-slave/workspace/Lucene-Solr-Tests-4.x-Java6/solr/build/solr-core/test/J1/./solrtest-jetty4-1348382150185/'
[junit4:junit4]   2> 9107 T392 oascc.ZkStateReader$2.process A cluster state change has occurred - updating...
[junit4:junit4]   2> 9107 T416 oascc.ZkStateReader$2.process A cluster state change has occurred - updating...
[junit4:junit4]   2> 9107 T404 oascc.ZkStateReader$2.process A cluster state change has occurred - updating...
[junit4:junit4]   2> 9107 T378 oascc.ZkStateReader$2.process A cluster state change has occurred - updating...
[junit4:junit4]   2> 9109 T358 oasc.CoreContainer.load Registering Log Listener
[junit4:junit4]   2> 9120 T358 oasc.CoreContainer.initZooKeeper Zookeeper client=127.0.0.1:43519/solr
[junit4:junit4]   2> 9120 T358 oaz.ZooKeeper.<init> Initiating client connection, connectString=127.0.0.1:43519/solr sessionTimeout=5000 watcher=org.apache.solr.common.cloud.ConnectionManager@2f8defe
[junit4:junit4]   2> 9128 T429 oaz.ClientCnxn$SendThread.startConnect Opening socket connection to server /127.0.0.1:43519
[junit4:junit4]   2> 9128 T358 oascc.ConnectionManager.waitForConnected Waiting for client to connect to ZooKeeper
[junit4:junit4]   2> 9130 T429 oaz.ClientCnxn$SendThread.primeConnection Socket connection established to localhost/127.0.0.1:43519, initiating session
[junit4:junit4]   2> 9130 T360 oazs.NIOServerCnxn$Factory.run Accepted socket connection from /140.211.11.196:19764
[junit4:junit4]   2> 9130 T360 oazs.NIOServerCnxn.readConnectRequest Client attempting to establish new session at /140.211.11.196:19764
[junit4:junit4]   2> 9132 T362 oazs.NIOServerCnxn.finishSessionInit Established session 0x139f1d6ace30006 with negotiated timeout 5000 for client /140.211.11.196:19764
[junit4:junit4]   2> 9132 T429 oaz.ClientCnxn$SendThread.readConnectResult Session establishment complete on server localhost/127.0.0.1:43519, sessionid = 0x139f1d6ace30006, negotiated timeout = 5000
[junit4:junit4]   2> 9132 T430 oascc.ConnectionManager.process Watcher org.apache.solr.common.cloud.ConnectionManager@2f8defe name:ZooKeeperConnection Watcher:127.0.0.1:43519/solr got event WatchedEvent state:SyncConnected type:None path:null path:null type:None
[junit4:junit4]   2> 9132 T358 oascc.ConnectionManager.waitForConnected Client is connected to ZooKeeper
[junit4:junit4]   2> 9133 T363 oazs.PrepRequestProcessor.pRequest Got user-level KeeperException when processing sessionid:0x139f1d6ace30006 type:create cxid:0x1 zxid:0xfffffffffffffffe txntype:unknown reqpath:n/a Error Path:/solr/overseer Error:KeeperErrorCode = NodeExists for /solr/overseer
[junit4:junit4]   2> 9134 T363 oazs.PrepRequestProcessor.pRequest Got user-level KeeperException when processing sessionid:0x139f1d6ace30006 type:create cxid:0x2 zxid:0xfffffffffffffffe txntype:unknown reqpath:n/a Error Path:/solr/overseer Error:KeeperErrorCode = NodeExists for /solr/overseer
[junit4:junit4]   2> 9143 T358 oasc.ZkController.createEphemeralLiveNode Register node as live in ZooKeeper:/live_nodes/127.0.0.1:36096_solr
[junit4:junit4]   2> 9144 T363 oazs.PrepRequestProcessor.pRequest Got user-level KeeperException when processing sessionid:0x139f1d6ace30006 type:delete cxid:0x4 zxid:0xfffffffffffffffe txntype:unknown reqpath:n/a Error Path:/solr/live_nodes/127.0.0.1:36096_solr Error:KeeperErrorCode = NoNode for /solr/live_nodes/127.0.0.1:36096_solr
[junit4:junit4]   2> 9145 T358 oascc.SolrZkClient.makePath makePath: /live_nodes/127.0.0.1:36096_solr
[junit4:junit4]   2> 9148 T392 oascc.ZkStateReader$3.process Updating live nodes
[junit4:junit4]   2> 9148 T404 oascc.ZkStateReader$3.process Updating live nodes
[junit4:junit4]   2> 9148 T378 oascc.ZkStateReader$3.process Updating live nodes
[junit4:junit4]   2> 9148 T416 oascc.ZkStateReader$3.process Updating live nodes
[junit4:junit4]   2> 9150 T358 oashc.HttpShardHandlerFactory.getParameter Setting socketTimeout to: 0
[junit4:junit4]   2> 9150 T358 oashc.HttpShardHandlerFactory.getParameter Setting urlScheme to: http://
[junit4:junit4]   2> 9150 T358 oashc.HttpShardHandlerFactory.getParameter Setting connTimeout to: 0
[junit4:junit4]   2> 9151 T358 oashc.HttpShardHandlerFactory.getParameter Setting maxConnectionsPerHost to: 20
[junit4:junit4]   2> 9151 T358 oashc.HttpShardHandlerFactory.getParameter Setting corePoolSize to: 0
[junit4:junit4]   2> 9152 T358 oashc.HttpShardHandlerFactory.getParameter Setting maximumPoolSize to: 2147483647
[junit4:junit4]   2> 9152 T358 oashc.HttpShardHandlerFactory.getParameter Setting maxThreadIdleTime to: 5
[junit4:junit4]   2> 9152 T358 oashc.HttpShardHandlerFactory.getParameter Setting sizeOfQueue to: -1
[junit4:junit4]   2> 9153 T358 oashc.HttpShardHandlerFactory.getParameter Setting fairnessPolicy to: false
[junit4:junit4]   2> 9153 T358 oascsi.HttpClientUtil.createClient Creating new http client, config:maxConnectionsPerHost=20&maxConnections=10000&socketTimeout=0&connTimeout=0&retry=false
[junit4:junit4]   2> 9186 T358 oascc.ZkStateReader.createClusterStateWatchersAndUpdate Updating cluster state from ZooKeeper... 
[junit4:junit4]   2> 9192 T358 oasc.CoreContainer.create Creating SolrCore 'collection1' using instanceDir: /usr/home/hudson/hudson-slave/workspace/Lucene-Solr-Tests-4.x-Java6/solr/build/solr-core/test/J1/./solrtest-jetty4-1348382150185/collection1
[junit4:junit4]   2> 9193 T358 oasc.ZkController.createCollectionZkNode Check for collection zkNode:collection1
[junit4:junit4]   2> 9194 T358 oasc.ZkController.createCollectionZkNode Collection zkNode exists
[junit4:junit4]   2> 9194 T358 oasc.ZkController.readConfigName Load collection config from:/collections/collection1
[junit4:junit4]   2> 9196 T358 oasc.SolrResourceLoader.<init> new SolrResourceLoader for directory: '/usr/home/hudson/hudson-slave/workspace/Lucene-Solr-Tests-4.x-Java6/solr/build/solr-core/test/J1/./solrtest-jetty4-1348382150185/collection1/'
[junit4:junit4]   2> 9197 T358 oasc.SolrResourceLoader.replaceClassLoader Adding 'file:/usr/home/hudson/hudson-slave/workspace/Lucene-Solr-Tests-4.x-Java6/solr/build/solr-core/test/J1/solrtest-jetty4-1348382150185/collection1/lib/README' to classloader
[junit4:junit4]   2> 9197 T358 oasc.SolrResourceLoader.replaceClassLoader Adding 'file:/usr/home/hudson/hudson-slave/workspace/Lucene-Solr-Tests-4.x-Java6/solr/build/solr-core/test/J1/solrtest-jetty4-1348382150185/collection1/lib/classes/' to classloader
[junit4:junit4]   2> 9260 T358 oasc.SolrConfig.<init> Using Lucene MatchVersion: LUCENE_41
[junit4:junit4]   2> 9331 T358 oasc.SolrConfig.<init> Loaded SolrConfig: solrconfig.xml
[junit4:junit4]   2> 9433 T358 oass.IndexSchema.readSchema Reading Solr Schema
[junit4:junit4]   2> 9440 T358 oass.IndexSchema.readSchema Schema name=test
[junit4:junit4]   2> 9892 T358 oass.OpenExchangeRatesOrgProvider.init Initialized with rates=open-exchange-rates.json, refreshInterval=1440.
[junit4:junit4]   2> 9900 T358 oass.IndexSchema.readSchema default search field in schema is text
[junit4:junit4]   2> 9903 T358 oass.IndexSchema.readSchema unique key field: id
[junit4:junit4]   2> 9915 T358 oass.FileExchangeRateProvider.reload Reloading exchange rates from file currency.xml
[junit4:junit4]   2> 9919 T358 oass.FileExchangeRateProvider.reload Reloading exchange rates from file currency.xml
[junit4:junit4]   2> 9923 T358 oass.OpenExchangeRatesOrgProvider.reload Reloading exchange rates from open-exchange-rates.json
[junit4:junit4]   2> 9924 T358 oass.OpenExchangeRatesOrgProvider.reload Reloading exchange rates from open-exchange-rates.json
[junit4:junit4]   2> 9925 T358 oasc.SolrCore.<init> [collection1] Opening new SolrCore at /usr/home/hudson/hudson-slave/workspace/Lucene-Solr-Tests-4.x-Java6/solr/build/solr-core/test/J1/./solrtest-jetty4-1348382150185/collection1/, dataDir=./org.apache.solr.cloud.BasicDistributedZk2Test-1348382141302/jetty4/
[junit4:junit4]   2> 9925 T358 oasc.JmxMonitoredMap.<init> JMX monitoring is enabled. Adding Solr mbeans to JMX Server: com.sun.jmx.mbeanserver.JmxMBeanServer@46ed5d9d
[junit4:junit4]   2> 9926 T358 oasc.SolrCore.getNewIndexDir WARNING New index directory detected: old=null new=./org.apache.solr.cloud.BasicDistributedZk2Test-1348382141302/jetty4/index/
[junit4:junit4]   2> 9927 T358 oasc.SolrCore.initIndex WARNING [collection1] Solr index directory './org.apache.solr.cloud.BasicDistributedZk2Test-1348382141302/jetty4/index' doesn't exist. Creating new index...
[junit4:junit4]   2> 9928 T358 oasc.CachingDirectoryFactory.get return new directory for /usr/home/hudson/hudson-slave/workspace/Lucene-Solr-Tests-4.x-Java6/solr/build/solr-core/test/J1/./org.apache.solr.cloud.BasicDistributedZk2Test-1348382141302/jetty4/index forceNew:false
[junit4:junit4]   2> 9947 T358 oasc.SolrDeletionPolicy.onCommit SolrDeletionPolicy.onCommit: commits:num=1
[junit4:junit4]   2> 		commit{dir=NRTCachingDirectory(org.apache.lucene.store.NIOFSDirectory@/usr/home/hudson/hudson-slave/workspace/Lucene-Solr-Tests-4.x-Java6/solr/build/solr-core/test/J1/org.apache.solr.cloud.BasicDistributedZk2Test-1348382141302/jetty4/index lockFactory=org.apache.lucene.store.NativeFSLockFactory@25703b9b; maxCacheMB=48.0 maxMergeSizeMB=4.0),segFN=segments_1,generation=1,filenames=[segments_1]
[junit4:junit4]   2> 9947 T358 oasc.SolrDeletionPolicy.updateCommits newest commit = 1
[junit4:junit4]   2> 9948 T358 oasc.SolrCore.initWriters created xml: solr.XMLResponseWriter
[junit4:junit4]   2> 9950 T358 oasup.UpdateRequestProcessorChain.init inserting DistributedUpdateProcessorFactory into updateRequestProcessorChain "dedupe"
[junit4:junit4]   2> 9950 T358 oasup.UpdateRequestProcessorChain.init inserting DistributedUpdateProcessorFactory into updateRequestProcessorChain "dedupe-allfields"
[junit4:junit4]   2> 9951 T358 oasup.UpdateRequestProcessorChain.init inserting DistributedUpdateProcessorFactory into updateRequestProcessorChain "stored_sig"
[junit4:junit4]   2> 9951 T358 oasup.UpdateRequestProcessorChain.init inserting DistributedUpdateProcessorFactory into updateRequestProcessorChain "uniq-fields"
[junit4:junit4]   2> 9952 T358 oasup.UpdateRequestProcessorChain.init inserting DistributedUpdateProcessorFactory into updateRequestProcessorChain "distrib-dup-test-chain-implicit"
[junit4:junit4]   2> 9952 T358 oasc.RequestHandlers.initHandlersFromConfig adding lazy requestHandler: solr.ReplicationHandler
[junit4:junit4]   2> 9952 T358 oasc.RequestHandlers.initHandlersFromConfig created /replication: solr.ReplicationHandler
[junit4:junit4]   2> 9953 T358 oasc.RequestHandlers.initHandlersFromConfig created standard: solr.StandardRequestHandler
[junit4:junit4]   2> 9953 T358 oasc.RequestHandlers.initHandlersFromConfig created /get: solr.RealTimeGetHandler
[junit4:junit4]   2> 9954 T358 oasc.RequestHandlers.initHandlersFromConfig created dismax: solr.SearchHandler
[junit4:junit4]   2> 9954 T358 oasc.RequestHandlers.initHandlersFromConfig created mock: org.apache.solr.core.MockQuerySenderListenerReqHandler
[junit4:junit4]   2> 9955 T358 oasc.RequestHandlers.initHandlersFromConfig created /admin/: org.apache.solr.handler.admin.AdminHandlers
[junit4:junit4]   2> 9955 T358 oasc.RequestHandlers.initHandlersFromConfig created defaults: solr.StandardRequestHandler
[junit4:junit4]   2> 9956 T358 oasc.RequestHandlers.initHandlersFromConfig adding lazy requestHandler: solr.StandardRequestHandler
[junit4:junit4]   2> 9956 T358 oasc.RequestHandlers.initHandlersFromConfig created lazy: solr.StandardRequestHandler
[junit4:junit4]   2> 9957 T358 oasc.RequestHandlers.initHandlersFromConfig created /update: solr.UpdateRequestHandler
[junit4:junit4]   2> 9957 T358 oasc.RequestHandlers.initHandlersFromConfig created /terms: org.apache.solr.handler.component.SearchHandler
[junit4:junit4]   2> 9958 T358 oasc.RequestHandlers.initHandlersFromConfig created spellCheckCompRH: org.apache.solr.handler.component.SearchHandler
[junit4:junit4]   2> 9958 T358 oasc.RequestHandlers.initHandlersFromConfig created spellCheckCompRH_Direct: org.apache.solr.handler.component.SearchHandler
[junit4:junit4]   2> 9959 T358 oasc.RequestHandlers.initHandlersFromConfig created spellCheckWithWordbreak: org.apache.solr.handler.component.SearchHandler
[junit4:junit4]   2> 9959 T358 oasc.RequestHandlers.initHandlersFromConfig created spellCheckWithWordbreak_Direct: org.apache.solr.handler.component.SearchHandler
[junit4:junit4]   2> 9960 T358 oasc.RequestHandlers.initHandlersFromConfig created spellCheckCompRH1: org.apache.solr.handler.component.SearchHandler
[junit4:junit4]   2> 9960 T358 oasc.RequestHandlers.initHandlersFromConfig created tvrh: org.apache.solr.handler.component.SearchHandler
[junit4:junit4]   2> 9960 T358 oasc.RequestHandlers.initHandlersFromConfig created /mlt: solr.MoreLikeThisHandler
[junit4:junit4]   2> 9961 T358 oasc.RequestHandlers.initHandlersFromConfig created /debug/dump: solr.DumpRequestHandler
[junit4:junit4]   2> 9964 T358 oashl.XMLLoader.init xsltCacheLifetimeSeconds=60
[junit4:junit4]   2> 9967 T358 oasc.SolrCore.initDeprecatedSupport WARNING solrconfig.xml uses deprecated <admin/gettableFiles>, Please update your config to use the ShowFileRequestHandler.
[junit4:junit4]   2> 9968 T358 oasc.SolrCore.initDeprecatedSupport WARNING adding ShowFileRequestHandler with hidden files: [SCHEMA.XML, OLD_SYNONYMS.TXT, STOPWORDS.TXT, PROTWORDS.TXT, OPEN-EXCHANGE-RATES.JSON, SYNONYMS.TXT, CURRENCY.XML, MAPPING-ISOLATIN1ACCENT.TXT]
[junit4:junit4]   2> 9971 T358 oass.SolrIndexSearcher.<init> Opening Searcher@71ebd825 main
[junit4:junit4]   2> 9972 T358 oasu.CommitTracker.<init> Hard AutoCommit: disabled
[junit4:junit4]   2> 9972 T358 oasu.CommitTracker.<init> Soft AutoCommit: disabled
[junit4:junit4]   2> 9973 T358 oashc.SpellCheckComponent.inform Initializing spell checkers
[junit4:junit4]   2> 9978 T358 oass.DirectSolrSpellChecker.init init: {name=direct,classname=DirectSolrSpellChecker,field=lowerfilt,minQueryLength=3}
[junit4:junit4]   2> 10086 T431 oasc.SolrCore.registerSearcher [collection1] Registered new searcher Searcher@71ebd825 main{StandardDirectoryReader(segments_1:1)}
[junit4:junit4]   2> 10120 T379 oascc.ZkStateReader.updateClusterState Updating cloud state from ZooKeeper... 
[junit4:junit4]   2> 10133 T430 oascc.ZkStateReader$2.process A cluster state change has occurred - updating...
[junit4:junit4]   2> 10133 T404 oascc.ZkStateReader$2.process A cluster state change has occurred - updating...
[junit4:junit4]   2> 10133 T416 oascc.ZkStateReader$2.process A cluster state change has occurred - updating...
[junit4:junit4]   2> 10133 T392 oascc.ZkStateReader$2.process A cluster state change has occurred - updating...
[junit4:junit4]   2> 10133 T378 oascc.ZkStateReader$2.process A cluster state change has occurred - updating...
[junit4:junit4]   2> 10592 T358 oasc.CoreContainer.register registering core: collection1
[junit4:junit4]   2> 10592 T358 oasc.ZkController.register Register shard - core:collection1 address:http://127.0.0.1:36096/solr shardId:shard2
[junit4:junit4]   2> 10597 T358 oasc.ZkController.register We are http://127.0.0.1:36096/solr/collection1/ and leader is http://127.0.0.1:11769/solr/collection1/
[junit4:junit4]   2> 10597 T358 oasc.ZkController.register No LogReplay needed for core=collection1 baseURL=http://127.0.0.1:36096/solr
[junit4:junit4]   2> 10598 T358 oasc.ZkController.checkRecovery Core needs to recover:collection1
[junit4:junit4]   2> 10598 T358 oasu.DefaultSolrCoreState.doRecovery Running recovery - first canceling any ongoing recovery
[junit4:junit4]   2> ASYNC  NEW_CORE C36 name=collection1 org.apache.solr.core.SolrCore@43f1a352 url=http://127.0.0.1:36096/solr/collection1 node=127.0.0.1:36096_solr
[junit4:junit4]   2> 10599 T432 C36 P36096 oasc.RecoveryStrategy.run Starting recovery process.  core=collection1 recoveringAfterStartup=true
[junit4:junit4]   2> 10600 T432 C36 P36096 oasc.RecoveryStrategy.doRecovery ###### startupVersions=[]
[junit4:junit4]   2> 10600 T358 oascc.ZkStateReader.updateClusterState Updating cloud state from ZooKeeper... 
[junit4:junit4]   2> 10601 T432 C36 P36096 oasc.RecoveryStrategy.doRecovery Attempting to PeerSync from http://127.0.0.1:11769/solr/collection1/ core=collection1 - recoveringAfterStartup=true
[junit4:junit4]   2> 10602 T432 C36 P36096 oasu.PeerSync.sync PeerSync: core=collection1 url=http://127.0.0.1:36096/solr START replicas=[http://127.0.0.1:11769/solr/collection1/] nUpdates=100
[junit4:junit4]   2> 10602 T432 C36 P36096 oasu.PeerSync.sync WARNING no frame of reference to tell of we've missed updates
[junit4:junit4]   2> 10602 T358 oass.SolrDispatchFilter.init user.dir=/usr/home/hudson/hudson-slave/workspace/Lucene-Solr-Tests-4.x-Java6/solr/build/solr-core/test/J1
[junit4:junit4]   2> 10602 T432 C36 P36096 oasc.RecoveryStrategy.doRecovery PeerSync Recovery was not successful - trying replication. core=collection1
[junit4:junit4]   2> 10602 T358 oass.SolrDispatchFilter.init SolrDispatchFilter.init() done
[junit4:junit4]   2> 10603 T432 C36 P36096 oasc.RecoveryStrategy.doRecovery Starting Replication Recovery. core=collection1
[junit4:junit4]   2> 10604 T432 C36 P36096 oascsi.HttpClientUtil.createClient Creating new http client, config:maxConnections=128&maxConnectionsPerHost=32&followRedirects=false
[junit4:junit4]   2> 10604 T358 oascsi.HttpClientUtil.createClient Creating new http client, config:maxConnections=128&maxConnectionsPerHost=32&followRedirects=false
[junit4:junit4]   2> ASYNC  NEW_CORE C37 name=collection1 org.apache.solr.core.SolrCore@22784c30 url=http://127.0.0.1:11769/solr/collection1 node=127.0.0.1:11769_solr
[junit4:junit4]   2> 10610 T396 C37 P11769 REQ /get {distrib=false&qt=/get&wt=javabin&version=2&getVersions=100} status=0 QTime=0 
[junit4:junit4]   2> 10625 T358 oaz.ZooKeeper.<init> Initiating client connection, connectString=127.0.0.1:43519/solr sessionTimeout=10000 watcher=org.apache.solr.common.cloud.ConnectionManager@2d020ab5
[junit4:junit4]   2> 10626 T434 oaz.ClientCnxn$SendThread.startConnect Opening socket connection to server /127.0.0.1:43519
[junit4:junit4]   2> 10626 T358 oascc.ConnectionManager.waitForConnected Waiting for client to connect to ZooKeeper
[junit4:junit4]   2> 10627 T434 oaz.ClientCnxn$SendThread.primeConnection Socket connection established to localhost/127.0.0.1:43519, initiating session
[junit4:junit4]   2> 10627 T360 oazs.NIOServerCnxn$Factory.run Accepted socket connection from /140.211.11.196:50643
[junit4:junit4]   2> 10627 T360 oazs.NIOServerCnxn.readConnectRequest Client attempting to establish new session at /140.211.11.196:50643
[junit4:junit4]   2> 10629 T362 oazs.NIOServerCnxn.finishSessionInit Established session 0x139f1d6ace30007 with negotiated timeout 10000 for client /140.211.11.196:50643
[junit4:junit4]   2> 10629 T434 oaz.ClientCnxn$SendThread.readConnectResult Session establishment complete on server localhost/127.0.0.1:43519, sessionid = 0x139f1d6ace30007, negotiated timeout = 10000
[junit4:junit4]   2> 10629 T435 oascc.ConnectionManager.process Watcher org.apache.solr.common.cloud.ConnectionManager@2d020ab5 name:ZooKeeperConnection Watcher:127.0.0.1:43519/solr got event WatchedEvent state:SyncConnected type:None path:null path:null type:None
[junit4:junit4]   2> 10629 T358 oascc.ConnectionManager.waitForConnected Client is connected to ZooKeeper
[junit4:junit4]   2> 10630 T358 oascc.ZkStateReader.createClusterStateWatchersAndUpdate Updating cluster state from ZooKeeper... 
[junit4:junit4]   2> 10632 T358 oasc.ChaosMonkey.monkeyLog monkey: init - expire sessions:true cause connection loss:true
[junit4:junit4]   2> 10634 T358 oascsi.HttpClientUtil.createClient Creating new http client, config:
[junit4:junit4]   2> 10638 T379 oascc.ZkStateReader.updateClusterState Updating cloud state from ZooKeeper... 
[junit4:junit4]   2> 10651 T435 oascc.ZkStateReader$2.process A cluster state change has occurred - updating...
[junit4:junit4]   2> 10652 T378 oascc.ZkStateReader$2.process A cluster state change has occurred - updating...
[junit4:junit4]   2> 10652 T430 oascc.ZkStateReader$2.process A cluster state change has occurred - updating...
[junit4:junit4]   2> 10651 T392 oascc.ZkStateReader$2.process A cluster state change has occurred - updating...
[junit4:junit4]   2> 10652 T416 oascc.ZkStateReader$2.process A cluster state change has occurred - updating...
[junit4:junit4]   2> 10652 T404 oascc.ZkStateReader$2.process A cluster state change has occurred - updating...
[junit4:junit4]   2> 10652 T358 oascc.ZkStateReader.updateClusterState Updating cloud state from ZooKeeper... 
[junit4:junit4]   2> ASYNC  NEW_CORE C38 name=collection1 org.apache.solr.core.SolrCore@16b96d9e url=http://127.0.0.1:35792/solr/collection1 node=127.0.0.1:35792_solr
[junit4:junit4]   2> 10680 T370 C38 P35792 oascsi.HttpClientUtil.createClient Creating new http client, config:maxConnections=500&maxConnectionsPerHost=16
[junit4:junit4]   2> 10701 T370 C38 P35792 oasc.SolrDeletionPolicy.onInit SolrDeletionPolicy.onInit: commits:num=1
[junit4:junit4]   2> 		commit{dir=NRTCachingDirectory(org.apache.lucene.store.NIOFSDirectory@/usr/home/hudson/hudson-slave/workspace/Lucene-Solr-Tests-4.x-Java6/solr/build/solr-core/test/J1/org.apache.solr.cloud.BasicDistributedZk2Test-1348382141302/control/data/index lockFactory=org.apache.lucene.store.NativeFSLockFactory@61981853; maxCacheMB=48.0 maxMergeSizeMB=4.0),segFN=segments_1,generation=1,filenames=[segments_1]
[junit4:junit4]   2> 10702 T370 C38 P35792 oasc.SolrDeletionPolicy.updateCommits newest commit = 1
[junit4:junit4]   2> 10736 T370 C38 P35792 /update {wt=javabin&version=2} {add=[1 (1413881163407163392)]} 0 70
[junit4:junit4]   2> 10737 T358 oaz.ZooKeeper.<init> Initiating client connection, connectString=127.0.0.1:43519/solr sessionTimeout=10000 watcher=org.apache.solr.common.cloud.ConnectionManager@30db7df3
[junit4:junit4]   2> 10738 T436 oaz.ClientCnxn$SendThread.startConnect Opening socket connection to server /127.0.0.1:43519
[junit4:junit4]   2> 10738 T358 oascc.ConnectionManager.waitForConnected Waiting for client to connect to ZooKeeper
[junit4:junit4]   2> 10739 T436 oaz.ClientCnxn$SendThread.primeConnection Socket connection established to localhost/127.0.0.1:43519, initiating session
[junit4:junit4]   2> 10739 T360 oazs.NIOServerCnxn$Factory.run Accepted socket connection from /140.211.11.196:27891
[junit4:junit4]   2> 10740 T360 oazs.NIOServerCnxn.readConnectRequest Client attempting to establish new session at /140.211.11.196:27891
[junit4:junit4]   2> 10741 T362 oazs.NIOServerCnxn.finishSessionInit Established session 0x139f1d6ace30008 with negotiated timeout 10000 for client /140.211.11.196:27891
[junit4:junit4]   2> 10741 T436 oaz.ClientCnxn$SendThread.readConnectResult Session establishment complete on server localhost/127.0.0.1:43519, sessionid = 0x139f1d6ace30008, negotiated timeout = 10000
[junit4:junit4]   2> 10742 T437 oascc.ConnectionManager.process Watcher org.apache.solr.common.cloud.ConnectionManager@30db7df3 name:ZooKeeperConnection Watcher:127.0.0.1:43519/solr got event WatchedEvent state:SyncConnected type:None path:null path:null type:None
[junit4:junit4]   2> 10742 T358 oascc.ConnectionManager.waitForConnected Client is connected to ZooKeeper
[junit4:junit4]   2> 10743 T358 oascc.ZkStateReader.createClusterStateWatchersAndUpdate Updating cluster state from ZooKeeper... 
[junit4:junit4]   2> 10766 T386 C35 P53886 oasc.SolrDeletionPolicy.onInit SolrDeletionPolicy.onInit: commits:num=1
[junit4:junit4]   2> 		commit{dir=NRTCachingDirectory(org.apache.lucene.store.NIOFSDirectory@/usr/home/hudson/hudson-slave/workspace/Lucene-Solr-Tests-4.x-Java6/solr/build/solr-core/test/J1/org.apache.solr.cloud.BasicDistributedZk2Test-1348382141302/jetty1/index lockFactory=org.apache.lucene.store.NativeFSLockFactory@332437f7; maxCacheMB=48.0 maxMergeSizeMB=4.0),segFN=segments_1,generation=1,filenames=[segments_1]
[junit4:junit4]   2> 10767 T386 C35 P53886 oasc.SolrDeletionPolicy.updateCommits newest commit = 1
[junit4:junit4]   2>  C34_STATE=coll:collection1 core:collection1 props:{shard=shard1, roles=null, state=recovering, core=collection1, collection=collection1, node_name=127.0.0.1:34472_solr, base_url=http://127.0.0.1:34472/solr}
[junit4:junit4]   2> 10861 T408 C34 P34472 oasc.SolrDeletionPolicy.onInit SolrDeletionPolicy.onInit: commits:num=1
[junit4:junit4]   2> 		commit{dir=NRTCachingDirectory(org.apache.lucene.store.NIOFSDirectory@/usr/home/hudson/hudson-slave/workspace/Lucene-Solr-Tests-4.x-Java6/solr/build/solr-core/test/J1/org.apache.solr.cloud.BasicDistributedZk2Test-1348382141302/jetty3/index lockFactory=org.apache.lucene.store.NativeFSLockFactory@3f9ba6d6; maxCacheMB=48.0 maxMergeSizeMB=4.0),segFN=segments_1,generation=1,filenames=[segments_1]
[junit4:junit4]   2> 10862 T408 C34 P34472 oasc.SolrDeletionPolicy.updateCommits newest commit = 1
[junit4:junit4]   2> 10865 T408 C34 P34472 REQ /update {distrib.from=http://127.0.0.1:53886/solr/collection1/&update.distrib=FROMLEADER&wt=javabin&version=2} status=0 QTime=8 
[junit4:junit4]   2> 10866 T386 C35 P53886 /update {wt=javabin&version=2} {add=[1 (1413881163473223680)]} 0 119
[junit4:junit4]   2> 10867 T358 oasc.AbstractDistribZkTestBase.waitForRecoveriesToFinish Wait for recoveries to finish - collection: collection1 failOnTimeout:true timeout (sec):1800
[junit4:junit4]   2> 10868 T358 oascc.ZkStateReader.updateClusterState Updating cloud state from ZooKeeper... 
[junit4:junit4]   2> 11870 T358 oascc.ZkStateReader.updateClusterState Updating cloud state from ZooKeeper... 
[junit4:junit4]   2> 11958 T418 C34 P34472 oasc.RecoveryStrategy.doRecovery Begin buffering updates. core=collection1
[junit4:junit4]   2> 11958 T418 C34 P34472 oasu.UpdateLog.bufferUpdates Starting to buffer updates. FSUpdateLog{state=ACTIVE, tlog=tlog{file=./org.apache.solr.cloud.BasicDistributedZk2Test-1348382141302/jetty3/tlog/tlog.0000000000000000000 refcount=1}}
[junit4:junit4]   2> 11959 T418 C34 P34472 oasc.RecoveryStrategy.replicate Attempting to replicate from http://127.0.0.1:53886/solr/collection1/. core=collection1
[junit4:junit4]   2> 11959 T418 C34 P34472 oascsi.HttpClientUtil.createClient Creating new http client, config:maxConnections=128&maxConnectionsPerHost=32&followRedirects=false
[junit4:junit4]   2> 11973 T387 C35 P53886 oasu.DirectUpdateHandler2.commit start commit{flags=0,_version_=0,optimize=false,openSearcher=true,waitSearcher=true,expungeDeletes=false,softCommit=false}
[junit4:junit4]   2> 12040 T387 C35 P53886 oasc.SolrDeletionPolicy.onCommit SolrDeletionPolicy.onCommit: commits:num=2
[junit4:junit4]   2> 		commit{dir=NRTCachingDirectory(org.apache.lucene.store.NIOFSDirectory@/usr/home/hudson/hudson-slave/workspace/Lucene-Solr-Tests-4.x-Java6/solr/build/solr-core/test/J1/org.apache.solr.cloud.BasicDistributedZk2Test-1348382141302/jetty1/index lockFactory=org.apache.lucene.store.NativeFSLockFactory@332437f7; maxCacheMB=48.0 maxMergeSizeMB=4.0),segFN=segments_1,generation=1,filenames=[segments_1]
[junit4:junit4]   2> 		commit{dir=NRTCachingDirectory(org.apache.lucene.store.NIOFSDirectory@/usr/home/hudson/hudson-slave/workspace/Lucene-Solr-Tests-4.x-Java6/solr/build/solr-core/test/J1/org.apache.solr.cloud.BasicDistributedZk2Test-1348382141302/jetty1/index lockFactory=org.apache.lucene.store.NativeFSLockFactory@332437f7; maxCacheMB=48.0 maxMergeSizeMB=4.0),segFN=segments_2,generation=2,filenames=[_0.fnm, _0_Pulsing40_0.tim, _0_Memory_0.ram, _0_MockFixedIntBlock_0.pos, _0_nrm.cfs, _0_MockFixedIntBlock_0.tib, _0_Pulsing40_0.prx, _0_Pulsing40_0.frq, _0_MockFixedIntBlock_0.frq, _0_Lucene40WithOrds_0.tii, _0_MockFixedIntBlock_0.skp, _0_MockFixedIntBlock_0.pyl, _0_Lucene40WithOrds_0.frq, _0_MockFixedIntBlock_0.doc, _0_MockFixedIntBlock_0.tii, _0_nrm.cfe, _0_Pulsing40_0.tip, segments_2, _0.fdx, _0_Lucene40WithOrds_0.prx, _0.si, _0_Lucene40WithOrds_0.tib, _0.fdt]
[junit4:junit4]   2> 12040 T387 C35 P53886 oasc.SolrDeletionPolicy.updateCommits newest commit = 2
[junit4:junit4]   2> 12058 T387 C35 P53886 oass.SolrIndexSearcher.<init> Opening Searcher@4dcb3007 main
[junit4:junit4]   2> 12060 T387 C35 P53886 oasu.DirectUpdateHandler2.commit end_commit_flush
[junit4:junit4]   2> 12061 T393 oasc.SolrCore.registerSearcher [collection1] Registered new searcher Searcher@4dcb3007 main{StandardDirectoryReader(segments_2:3 _0(4.1):C1)}
[junit4:junit4]   2> 12061 T387 C35 P53886 /update {waitSearcher=true&commit=true&commit_end_point=true&wt=javabin&softCommit=false&version=2} {commit=} 0 88
[junit4:junit4]   2> 12095 T418 C34 P34472 oash.ReplicationHandler.inform Commits will be reserved for  10000
[junit4:junit4]   2> 12096 T418 C34 P34472 oascsi.HttpClientUtil.createClient Creating new http client, config:connTimeout=5000&socketTimeout=20000&allowCompression=false&maxConnections=10000&maxConnectionsPerHost=10000
[junit4:junit4]   2> 12112 T418 C34 P34472 oash.SnapPuller.<init>  No value set for 'pollInterval'. Timer Task not started.
[junit4:junit4]   2> 12114 T388 C35 P53886 oash.ReplicationHandler.inform Commits will be reserved for  10000
[junit4:junit4]   2> 12114 T388 C35 P53886 REQ /replication {command=indexversion&wt=javabin&qt=/replication&version=2} status=0 QTime=1 
[junit4:junit4]   2> 12115 T418 C34 P34472 oash.SnapPuller.fetchLatestIndex Master's generation: 2
[junit4:junit4]   2> 12115 T418 C34 P34472 oash.SnapPuller.fetchLatestIndex Slave's generation: 1
[junit4:junit4]   2> 12115 T418 C34 P34472 oash.SnapPuller.fetchLatestIndex Starting replication process
[junit4:junit4]   2> 12119 T388 C35 P53886 REQ /replication {command=filelist&generation=2&wt=javabin&qt=/replication&version=2} status=0 QTime=2 
[junit4:junit4]   2> 12119 T418 C34 P34472 oash.SnapPuller.fetchLatestIndex Number of files in latest index in master: 23
[junit4:junit4]   2> 12125 T418 C34 P34472 oash.SnapPuller.fetchLatestIndex Starting download to ./org.apache.solr.cloud.BasicDistributedZk2Test-1348382141302/jetty3/index.20120923013553416 fullCopy=true
[junit4:junit4]   2> 12134 T388 C35 P53886 REQ /replication {file=_0_Pulsing40_0.tim&command=filecontent&checksum=true&generation=2&qt=/replication&wt=filestream} status=0 QTime=3 
[junit4:junit4]   2> 12146 T388 C35 P53886 REQ /replication {file=_0.fnm&command=filecontent&checksum=true&generation=2&qt=/replication&wt=filestream} status=0 QTime=0 
[junit4:junit4]   2> 12156 T388 C35 P53886 REQ /replication {file=_0_Memory_0.ram&command=filecontent&checksum=true&generation=2&qt=/replication&wt=filestream} status=0 QTime=0 
[junit4:junit4]   2> 12160 T388 C35 P53886 REQ /replication {file=_0_MockFixedIntBlock_0.pos&command=filecontent&checksum=true&generation=2&qt=/replication&wt=filestream} status=0 QTime=0 
[junit4:junit4]   2> 12164 T388 C35 P53886 REQ /replication {file=_0_nrm.cfs&command=filecontent&checksum=true&generation=2&qt=/replication&wt=filestream} status=0 QTime=0 
[junit4:junit4]   2> 12168 T388 C35 P53886 REQ /replication {file=_0_Pulsing40_0.prx&command=filecontent&checksum=true&generation=2&qt=/replication&wt=filestream} status=0 QTime=0 
[junit4:junit4]   2> 12171 T388 C35 P53886 REQ /replication {file=_0_MockFixedIntBlock_0.tib&command=filecontent&checksum=true&generation=2&qt=/replication&wt=filestream} status=0 QTime=0 
[junit4:junit4]   2> 12175 T388 C35 P53886 REQ /replication {file=_0_Pulsing40_0.frq&command=filecontent&checksum=true&generation=2&qt=/replication&wt=filestream} status=0 QTime=0 
[junit4:junit4]   2> 12179 T388 C35 P53886 REQ /replication {file=_0_MockFixedIntBlock_0.frq&command=filecontent&checksum=true&generation=2&qt=/replication&wt=filestream} status=0 QTime=0 
[junit4:junit4]   2> 12183 T388 C35 P53886 REQ /replication {file=_0_Lucene40WithOrds_0.tii&command=filecontent&checksum=true&generation=2&qt=/replication&wt=filestream} status=0 QTime=0 
[junit4:junit4]   2> 12187 T388 C35 P53886 REQ /replication {file=_0_MockFixedIntBlock_0.pyl&command=filecontent&checksum=true&generation=2&qt=/replication&wt=filestream} status=0 QTime=0 
[junit4:junit4]   2> 12188 T418 C34 P34472 oash.SnapPuller$FileFetcher.fetchPackets WARNING No content recieved for file: {name=_0_MockFixedIntBlock_0.pyl, lastmodified=1348382153000, size=0}
[junit4:junit4]   2> 12191 T388 C35 P53886 REQ /replication {file=_0_MockFixedIntBlock_0.skp&command=filecontent&checksum=true&generation=2&qt=/replication&wt=filestream} status=0 QTime=0 
[junit4:junit4]   2> 12192 T418 C34 P34472 oash.SnapPuller$FileFetcher.fetchPackets WARNING No content recieved for file: {name=_0_MockFixedIntBlock_0.skp, lastmodified=1348382153000, size=0}
[junit4:junit4]   2> 12195 T388 C35 P53886 REQ /replication {file=_0_Lucene40WithOrds_0.frq&command=filecontent&checksum=true&generation=2&qt=/replication&wt=filestream} status=0 QTime=0 
[junit4:junit4]   2> 12199 T388 C35 P53886 REQ /replication {file=_0_MockFixedIntBlock_0.tii&command=filecontent&checksum=true&generation=2&qt=/replication&wt=filestream} status=0 QTime=0 
[junit4:junit4]   2> 12203 T388 C35 P53886 REQ /replication {file=_0_MockFixedIntBlock_0.doc&command=filecontent&checksum=true&generation=2&qt=/replication&wt=filestream} status=0 QTime=0 
[junit4:junit4]   2> 12207 T388 C35 P53886 REQ /replication {file=_0_nrm.cfe&command=filecontent&checksum=true&generation=2&qt=/replication&wt=filestream} status=0 QTime=0 
[junit4:junit4]   2> 12211 T388 C35 P53886 REQ /replication {file=segments_2&command=filecontent&checksum=true&generation=2&qt=/replication&wt=filestream} status=0 QTime=0 
[junit4:junit4]   2> 12215 T388 C35 P53886 REQ /replication {file=_0_Pulsing40_0.tip&command=filecontent&checksum=true&generation=2&qt=/replication&wt=filestream} status=0 QTime=0 
[junit4:junit4]   2> 12219 T388 C35 P53886 REQ /replication {file=_0.fdx&command=filecontent&checksum=true&generation=2&qt=/replication&wt=filestream} status=0 QTime=0 
[junit4:junit4]   2> 12223 T388 C35 P53886 REQ /replication {file=_0_Lucene40WithOrds_0.prx&command=filecontent&checksum=true&generation=2&qt=/replication&wt=filestream} status=0 QTime=0 
[junit4:junit4]   2> 12227 T388 C35 P53886 REQ /replication {file=_0.si&command=filecontent&checksum=true&generation=2&qt=/replication&wt=filestream} status=0 QTime=0 
[junit4:junit4]   2> 12231 T388 C35 P53886 REQ /replication {file=_0_Lucene40WithOrds_0.tib&command=filecontent&checksum=true&generation=2&qt=/replication&wt=filestream} status=0 QTime=0 
[junit4:junit4]   2> 12235 T388 C35 P53886 REQ /replication {file=_0.fdt&command=filecontent&checksum=true&generation=2&qt=/replication&wt=filestream} status=0 QTime=0 
[junit4:junit4]   2> 12236 T418 C34 P34472 oash.SnapPuller.fetchLatestIndex Total time taken for download : 0 secs
[junit4:junit4]   2> 12237 T418 C34 P34472 oash.SnapPuller.modifyIndexProps New index installed. Updating index properties... index=index.20120923013553416
[junit4:junit4]   2> 12241 T418 C34 P34472 oasu.DefaultSolrCoreState.newIndexWriter Creating new IndexWriter...
[junit4:junit4]   2> 12241 T418 C34 P34472 oasu.DefaultSolrCoreState.newIndexWriter Waiting until IndexWriter is unused... core=collection1
[junit4:junit4]   2> 12241 T418 C34 P34472 oasu.DefaultSolrCoreState.newIndexWriter Rollback old IndexWriter... core=collection1
[junit4:junit4]   2> 12245 T418 C34 P34472 oasc.SolrCore.getNewIndexDir WARNING New index directory detected: old=./org.apache.solr.cloud.BasicDistributedZk2Test-1348382141302/jetty3/index/ new=./org.apache.solr.cloud.BasicDistributedZk2Test-1348382141302/jetty3/index.20120923013553416
[junit4:junit4]   2> 12245 T418 C34 P34472 oasc.CachingDirectoryFactory.get return new directory for /usr/home/hudson/hudson-slave/workspace/Lucene-Solr-Tests-4.x-Java6/solr/build/solr-core/test/J1/./org.apache.solr.cloud.BasicDistributedZk2Test-1348382141302/jetty3/index.20120923013553416 forceNew:true
[junit4:junit4]   2> 12254 T418 C34 P34472 oasc.SolrDeletionPolicy.onInit SolrDeletionPolicy.onInit: commits:num=1
[junit4:junit4]   2> 		commit{dir=NRTCachingDirectory(org.apache.lucene.store.NIOFSDirectory@/usr/home/hudson/hudson-slave/workspace/Lucene-Solr-Tests-4.x-Java6/solr/build/solr-core/test/J1/org.apache.solr.cloud.BasicDistributedZk2Test-1348382141302/jetty3/index.20120923013553416 lockFactory=org.apache.lucene.store.NativeFSLockFactory@4ac92718; maxCacheMB=48.0 maxMergeSizeMB=4.0),segFN=segments_2,generation=2,filenames=[_0.fnm, _0_Pulsing40_0.tim, _0_Memory_0.ram, _0_MockFixedIntBlock_0.pos, _0_nrm.cfs, _0_MockFixedIntBlock_0.tib, _0_Pulsing40_0.prx, _0_Pulsing40_0.frq, _0_MockFixedIntBlock_0.frq, _0_Lucene40WithOrds_0.tii, _0_MockFixedIntBlock_0.skp, _0_MockFixedIntBlock_0.pyl, _0_Lucene40WithOrds_0.frq, _0_MockFixedIntBlock_0.tii, _0_MockFixedIntBlock_0.doc, _0_nrm.cfe, _0_Pulsing40_0.tip, segments_2, _0.fdx, _0_Lucene40WithOrds_0.prx, _0.si, _0_Lucene40WithOrds_0.tib, _0.fdt]
[junit4:junit4]   2> 12255 T418 C34 P34472 oasc.SolrDeletionPolicy.updateCommits newest commit = 2
[junit4:junit4]   2> 12255 T418 C34 P34472 oasu.DefaultSolrCoreState.newIndexWriter New IndexWriter is ready to be used.
[junit4:junit4]   2> 12259 T418 C34 P34472 oass.SolrIndexSearcher.<init> Opening Searcher@406be93e main
[junit4:junit4]   2> 12261 T417 oasc.SolrCore.registerSearcher [collection1] Registered new searcher Searcher@406be93e main{StandardDirectoryReader(segments_2:3:nrt _0(4.1):C1)}
[junit4:junit4]   2> 12261 T417 oasc.CachingDirectoryFactory.close Closing directory:/usr/home/hudson/hudson-slave/workspace/Lucene-Solr-Tests-4.x-Java6/solr/build/solr-core/test/J1/./org.apache.solr.cloud.BasicDistributedZk2Test-1348382141302/jetty3/index
[junit4:junit4]   2> 12261 T417 oash.SnapPuller$2.onClose removing old index directory ./org.apache.solr.cloud.BasicDistributedZk2Test-1348382141302/jetty3/index
[junit4:junit4]   2> 12263 T418 C34 P34472 oasu.DirectUpdateHandler2.commit start commit{flags=0,_version_=0,optimize=false,openSearcher=false,waitSearcher=false,expungeDeletes=false,softCommit=false}
[junit4:junit4]   2> 12264 T418 C34 P34472 oasu.DirectUpdateHandler2.commit end_commit_flush
[junit4:junit4]   2> 12268 T418 C34 P34472 oasc.RecoveryStrategy.replay Replaying buffered documents. core=collection1
[junit4:junit4]   2> 12268 T440 C34 P34472 oasu.UpdateLog$LogReplayer.doReplay WARNING Starting log replay tlog{file=./org.apache.solr.cloud.BasicDistributedZk2Test-1348382141302/jetty3/tlog/tlog.0000000000000000000 refcount=2} active=true starting pos=429
[junit4:junit4]   2> 12273 T440 C34 P34472 oasu.DirectUpdateHandler2.commit start commit{flags=2,_version_=0,optimize=false,openSearcher=true,waitSearcher=true,expungeDeletes=false,softCommit=false}
[junit4:junit4]   2> 12274 T440 C34 P34472 oass.SolrIndexSearcher.<init> Opening Searcher@45fd24c1 main
[junit4:junit4]   2> 12275 T417 oasc.SolrCore.registerSearcher [collection1] Registered new searcher Searcher@45fd24c1 main{StandardDirectoryReader(segments_2:3:nrt _0(4.1):C1)}
[junit4:junit4]   2> 12276 T440 C34 P34472 oasu.DirectUpdateHandler2.commit end_commit_flush
[junit4:junit4]   2> 12276 T440 C34 P34472 oasu.UpdateLog$LogReplayer.run WARNING Log replay finished. recoveryInfo=RecoveryInfo{adds=0 deletes=0 deleteByQuery=0 errors=0 positionOfStart=429}
[junit4:junit4]   2> 12276 T418 C34 P34472 oasc.RecoveryStrategy.doRecovery Replication Recovery was successful - registering as Active. core=collection1
[junit4:junit4]   2> 12278 T418 C34 P34472 oasc.RecoveryStrategy.doRecovery Finished recovery process. core=collection1
[junit4:junit4]   2> 12663 T379 oascc.ZkStateReader.updateClusterState Updating cloud state from ZooKeeper... 
[junit4:junit4]   2> 12677 T435 oascc.ZkStateReader$2.process A cluster state change has occurred - updating...
[junit4:junit4]   2> 12677 T392 oascc.ZkStateReader$2.process A cluster state change has occurred - updating...
[junit4:junit4]   2> 12677 T416 oascc.ZkStateReader$2.process A cluster state change has occurred - updating...
[junit4:junit4]   2> 12677 T378 oascc.ZkStateReader$2.process A cluster state change has occurred - updating...
[junit4:junit4]   2> 12677 T404 oascc.ZkStateReader$2.process A cluster state change has occurred - updating...
[junit4:junit4]   2> 12677 T437 oascc.ZkStateReader$2.process A cluster state change has occurred - updating...
[junit4:junit4]   2> 12677 T430 oascc.ZkStateReader$2.process A cluster state change has occurred - updating...
[junit4:junit4]   2> 12873 T358 oascc.ZkStateReader.updateClusterState Updating cloud state from ZooKeeper... 
[junit4:junit4]   2>  C36_STATE=coll:collection1 core:collection1 props:{shard=shard2, roles=null, state=recovering, core=collection1, collection=collection1, node_name=127.0.0.1:36096_solr, base_url=http://127.0.0.1:36096/solr}
[junit4:junit4]   2> 13623 T432 C36 P36096 oasc.RecoveryStrategy.doRecovery Begin buffering updates. core=collection1
[junit4:junit4]   2> 13623 T432 C36 P36096 oasu.UpdateLog.bufferUpdates Starting to buffer updates. FSUpdateLog{state=ACTIVE, tlog=null}
[junit4:junit4]   2> 13623 T432 C36 P36096 oasc.RecoveryStrategy.replicate Attempting to replicate from http://127.0.0.1:11769/solr/collection1/. core=collection1
[junit4:junit4]   2> 13623 T432 C36 P36096 oascsi.HttpClientUtil.createClient Creating new http client, config:maxConnections=128&maxConnectionsPerHost=32&followRedirects=false
[junit4:junit4]   2> 13638 T398 C37 P11769 oasu.DirectUpdateHandler2.commit start commit{flags=0,_version_=0,optimize=false,openSearcher=true,waitSearcher=true,expungeDeletes=false,softCommit=false}
[junit4:junit4]   2> 13642 T398 C37 P11769 oasc.SolrDeletionPolicy.onInit SolrDeletionPolicy.onInit: commits:num=1
[junit4:junit4]   2> 		commit{dir=NRTCachingDirectory(org.apache.lucene.store.NIOFSDirectory@/usr/home/hudson/hudson-slave/workspace/Lucene-Solr-Tests-4.x-Java6/solr/build/solr-core/test/J1/org.apache.solr.cloud.BasicDistributedZk2Test-1348382141302/jetty2/index lockFactory=org.apache.lucene.store.NativeFSLockFactory@190e03c8; maxCacheMB=48.0 maxMergeSizeMB=4.0),segFN=segments_1,generation=1,filenames=[segments_1]
[junit4:junit4]   2> 13643 T398 C37 P11769 oasc.SolrDeletionPolicy.updateCommits newest commit = 1
[junit4:junit4]   2> 13644 T398 C37 P11769 oass.SolrIndexSearcher.<init> Opening Searcher@1aaa5fc5 main
[junit4:junit4]   2> 13645 T398 C37 P11769 oasu.DirectUpdateHandler2.commit end_commit_flush
[junit4:junit4]   2> 13646 T405 oasc.SolrCore.registerSearcher [collection1] Registered new searcher Searcher@1aaa5fc5 main{StandardDirectoryReader(segments_1:1)}
[junit4:junit4]   2> 13647 T398 C37 P11769 /update {waitSearcher=true&commit=true&commit_end_point=true&wt=javabin&softCommit=false&version=2} {commit=} 0 9
[junit4:junit4]   2> 13648 T432 C36 P36096 oash.ReplicationHandler.inform Commits will be reserved for  10000
[junit4:junit4]   2> 13648 T432 C36 P36096 oash.SnapPuller.<init>  No value set for 'pollInterval'. Timer Task not started.
[junit4:junit4]   2> 13650 T399 C37 P11769 oash.ReplicationHandler.inform Commits will be reserved for  10000
[junit4:junit4]   2> 13650 T399 C37 P11769 REQ /replication {command=indexversion&wt=javabin&qt=/replication&version=2} status=0 QTime=0 
[junit4:junit4]   2> 13654 T432 C36 P36096 oasc.SolrDeletionPolicy.onInit SolrDeletionPolicy.onInit: commits:num=1
[junit4:junit4]   2> 		commit{dir=NRTCachingDirectory(org.apache.lucene.store.NIOFSDirectory@/usr/home/hudson/hudson-slave/workspace/Lucene-Solr-Tests-4.x-Java6/solr/build/solr-core/test/J1/org.apache.solr.cloud.BasicDistributedZk2Test-1348382141302/jetty4/index lockFactory=org.apache.lucene.store.NativeFSLockFactory@25703b9b; maxCacheMB=48.0 maxMergeSizeMB=4.0),segFN=segments_1,generation=1,filenames=[segments_1]
[junit4:junit4]   2> 13654 T432 C36 P36096 oasc.SolrDeletionPolicy.updateCommits newest commit = 1
[junit4:junit4]   2> 13654 T432 C36 P36096 oasu.DirectUpdateHandler2.commit start commit{flags=0,_version_=0,optimize=false,openSearcher=true,waitSearcher=true,expungeDeletes=false,softCommit=false}
[junit4:junit4]   2> 13687 T432 C36 P36096 oasc.SolrDeletionPolicy.onCommit SolrDeletionPolicy.onCommit: commits:num=2
[junit4:junit4]   2> 		commit{dir=NRTCachingDirectory(org.apache.lucene.store.NIOFSDirectory@/usr/home/hudson/hudson-slave/workspace/Lucene-Solr-Tests-4.x-Java6/solr/build/solr-core/test/J1/org.apache.solr.cloud.BasicDistributedZk2Test-1348382141302/jetty4/index lockFactory=org.apache.lucene.store.NativeFSLockFactory@25703b9b; maxCacheMB=48.0 maxMergeSizeMB=4.0),segFN=segments_1,generation=1,filenames=[segments_1]
[junit4:junit4]   2> 		commit{dir=NRTCachingDirectory(org.apache.lucene.store.NIOFSDirectory@/usr/home/hudson/hudson-slave/workspace/Lucene-Solr-Tests-4.x-Java6/solr/build/solr-core/test/J1/org.apache.solr.cloud.BasicDistributedZk2Test-1348382141302/jetty4/index lockFactory=org.apache.lucene.store.NativeFSLockFactory@25703b9b; maxCacheMB=48.0 maxMergeSizeMB=4.0),segFN=segments_2,generation=2,filenames=[segments_2]
[junit4:junit4]   2> 13688 T432 C36 P36096 oasc.SolrDeletionPolicy.updateCommits newest commit = 2
[junit4:junit4]   2> 13690 T432 C36 P36096 oass.SolrIndexSearcher.<init> Opening Searcher@34de727a main
[junit4:junit4]   2> 13690 T432 C36 P36096 oasu.DirectUpdateHandler2.commit end_commit_flush
[junit4:junit4]   2> 13691 T431 oasc.SolrCore.registerSearcher [collection1] Registered new searcher Searcher@34de727a main{StandardDirectoryReader(segments_2:2)}
[junit4:junit4]   2> 13692 T432 C36 P36096 oasc.RecoveryStrategy.replay No replay needed. core=collection1
[junit4:junit4]   2> 13692 T432 C36 P36096 oasc.RecoveryStrategy.doRecovery Replication Recovery was successful - registering as Active. core=collection1
[junit4:junit4]   2> 13700 T432 C36 P36096 oasc.RecoveryStrategy.doRecovery Finished recovery process. core=collection1
[junit4:junit4]   2> 13875 T358 oascc.ZkStateReader.updateClusterState Updating cloud state from ZooKeeper... 
[junit4:junit4]   2> 14187 T379 oascc.ZkStateReader.updateClusterState Updating cloud state from ZooKeeper... 
[junit4:junit4]   2> 14202 T430 oascc.ZkStateReader$2.process A cluster state change has occurred - updating...
[junit4:junit4]   2> 14202 T416 oascc.ZkStateReader$2.process A cluster state change has occurred - updating...
[junit4:junit4]   2> 14202 T435 oascc.ZkStateReader$2.process A cluster state change has occurred - updating...
[junit4:junit4]   2> 14202 T378 oascc.ZkStateReader$2.process A cluster state change has occurred - updating...
[junit4:junit4]   2> 14202 T404 oascc.ZkStateReader$2.process A cluster state change has occurred - updating...
[junit4:junit4]   2> 14202 T437 oascc.ZkStateReader$2.process A cluster state change has occurred - updating...
[junit4:junit4]   2> 14202 T392 oascc.ZkStateReader$2.process A cluster state change has occurred - updating...
[junit4:junit4]   2> 14877 T358 oascc.ZkStateReader.updateClusterState Updating cloud state from ZooKeeper... 
[junit4:junit4]   2> 14880 T370 C38 P35792 oasu.DirectUpdateHandler2.commit start commit{flags=0,_version_=0,optimize=false,openSearcher=true,waitSearcher=true,expungeDeletes=false,softCommit=false}
[junit4:junit4]   2> 15006 T370 C38 P35792 oasc.SolrDeletionPolicy.onCommit SolrDeletionPolicy.onCommit: commits:num=2
[junit4:junit4]   2> 		commit{dir=NRTCachingDirectory(org.apache.lucene.store.NIOFSDirectory@/usr/home/hudson/hudson-slave/workspace/Lucene-Solr-Tests-4.x-Java6/solr/build/solr-core/test/J1/org.apache.solr.cloud.BasicDistributedZk2Test-1348382141302/control/data/index lockFactory=org.apache.lucene.store.NativeFSLockFactory@61981853; maxCacheMB=48.0 maxMergeSizeMB=4.0),segFN=segments_1,generation=1,filenames=[segments_1]
[junit4:junit4]   2> 		commit{dir=NRTCachingDirectory(org.apache.lucene.store.NIOFSDirectory@/usr/home/hudson/hudson-slave/workspace/Lucene-Solr-Tests-4.x-Java6/solr/build/solr-core/test/J1/org.apache.solr.cloud.BasicDistributedZk2Test-1348382141302/control/data/index lockFactory=org.apache.lucene.store.NativeFSLockFactory@61981853; maxCacheMB=48.0 maxMergeSizeMB=4.0),segFN=segments_2,generation=2,filenames=[_0.fnm, _0_Pulsing40_0.tim, _0_Memory_0.ram, _0_MockFixedIntBlock_0.pos, _0_nrm.cfs, _0_MockFixedIntBlock_0.tib, _0_Pulsing40_0.prx, _0_Pulsing40_0.frq, _0_MockFixedIntBlock_0.frq, _0_Lucene40WithOrds_0.tii, _0_MockFixedIntBlock_0.skp, _0_MockFixedIntBlock_0.pyl, _0_Lucene40WithOrds_0.frq, _0_MockFixedIntBlock_0.doc, _0_MockFixedIntBlock_0.tii, _0_nrm.cfe, _0_Pulsing40_0.tip, segments_2, _0.fdx, _0_Lucene40WithOrds_0.prx, _0.si, _0_Lucene40WithOrds_0.tib, _0.fdt]
[junit4:junit4]   2> 15007 T370 C38 P35792 oasc.SolrDeletionPolicy.updateCommits newest commit = 2
[junit4:junit4]   2> 15020 T370 C38 P35792 oass.SolrIndexSearcher.<init> Opening Searcher@18a1934f main
[junit4:junit4]   2> 15021 T370 C38 P35792 oasu.DirectUpdateHandler2.commit end_commit_flush
[junit4:junit4]   2> 15022 T381 oasc.SolrCore.registerSearcher [collection1] Registered new searcher Searcher@18a1934f main{StandardDirectoryReader(segments_2:3 _0(4.1):C1)}
[junit4:junit4]   2> 15023 T370 C38 P35792 /update {waitSearcher=true&wt=javabin&commit=true&softCommit=false&version=2} {commit=} 0 143
[junit4:junit4]   2> 15026 T386 C35 P53886 oasu.DirectUpdateHandler2.commit start commit{flags=0,_version_=0,optimize=false,openSearcher=true,waitSearcher=true,expungeDeletes=false,softCommit=false}
[junit4:junit4]   2> 15037 T386 C35 P53886 oass.SolrIndexSearcher.<init> Opening Searcher@23bdc15c main
[junit4:junit4]   2> 15037 T386 C35 P53886 oasu.DirectUpdateHandler2.commit end_commit_flush
[junit4:junit4]   2> 15040 T393 oasc.SolrCore.registerSearcher [collection1] Registered new searcher Searcher@23bdc15c main{StandardDirectoryReader(segments_2:3 _0(4.1):C1)}
[junit4:junit4]   2> 15041 T386 C35 P53886 oasu.SolrCmdDistributor.distribCommit Distrib commit to:[StdNode: http://127.0.0.1:34472/solr/collection1/, StdNode: http://127.0.0.1:11769/solr/collection1/, StdNode: http://127.0.0.1:36096/solr/collection1/]
[junit4:junit4]   2>  C34_STATE=coll:collection1 core:collection1 props:{shard=shard1, roles=null, state=active, core=collection1, collection=collection1, node_name=127.0.0.1:34472_solr, base_url=http://127.0.0.1:34472/solr}
[junit4:junit4]   2> 15043 T408 C34 P34472 oasu.DirectUpdateHandler2.commit start commit{flags=0,_version_=0,optimize=false,openSearcher=true,waitSearcher=true,expungeDeletes=false,softCommit=false}
[junit4:junit4]   2> 15043 T400 C37 P11769 oasu.DirectUpdateHandler2.commit start commit{flags=0,_version_=0,optimize=false,openSearcher=true,waitSearcher=true,expungeDeletes=false,softCommit=false}
[junit4:junit4]   2> 15045 T408 C34 P34472 oass.SolrIndexSearcher.<init> Opening Searcher@2ec68ba6 main
[junit4:junit4]   2> 15046 T408 C34 P34472 oasu.DirectUpdateHandler2.commit end_commit_flush
[junit4:junit4]   2> 15048 T417 oasc.SolrCore.registerSearcher [collection1] Registered new searcher Searcher@2ec68ba6 main{StandardDirectoryReader(segments_2:3:nrt _0(4.1):C1)}
[junit4:junit4]   2> 15048 T408 C34 P34472 /update {waitSearcher=true&commit=true&wt=javabin&commit_end_point=true&expungeDeletes=false&softCommit=false&version=2} {commit=} 0 5
[junit4:junit4]   2> 15049 T400 C37 P11769 oass.SolrIndexSearcher.<init> Opening Searcher@27782e36 main
[junit4:junit4]   2> 15050 T400 C37 P11769 oasu.DirectUpdateHandler2.commit end_commit_flush
[junit4:junit4]   2> 15052 T405 oasc.SolrCore.registerSearcher [collection1] Registered new searcher Searcher@27782e36 main{StandardDirectoryReader(segments_1:1)}
[junit4:junit4]   2> 15053 T400 C37 P11769 /update {waitSearcher=true&commit=true&wt=javabin&commit_end_point=true&expungeDeletes=false&softCommit=false&version=2} {commit=} 0 10
[junit4:junit4]   2>  C36_STATE=coll:collection1 core:collection1 props:{shard=shard2, roles=null, state=active, core=collection1, collection=collection1, node_name=127.0.0.1:36096_solr, base_url=http://127.0.0.1:36096/solr}
[junit4:junit4]   2> 15053 T422 C36 P36096 oasu.DirectUpdateHandler2.commit start commit{flags=0,_version_=0,optimize=false,openSearcher=true,waitSearcher=true,expungeDeletes=false,softCommit=false}
[junit4:junit4]   2> 15057 T422 C36 P36096 oass.SolrIndexSearcher.<init> Opening Searcher@7fc65051 main
[junit4:junit4]   2> 15058 T422 C36 P36096 oasu.DirectUpdateHandler2.commit end_commit_flush
[junit4:junit4]   2> 15059 T431 oasc.SolrCore.registerSearcher [collection1] Registered new searcher Searcher@7fc65051 main{StandardDirectoryReader(segments_2:2)}
[junit4:junit4]   2> 15060 T422 C36 P36096 /update {waitSearcher=true&commit=true&wt=javabin&commit_end_point=true&expungeDeletes=false&softCommit=false&version=2} {commit=} 0 7
[junit4:junit4]   2> 15060 T386 C35 P53886 /update {waitSearcher=true&wt=javabin&commit=true&softCommit=false&version=2} {commit=} 0 34
[junit4:junit4]   2> 15066 T371 C38 P35792 REQ /select {fl=id,score&shard.url=127.0.0.1:35792/solr/collection1/&NOW=1348382156359&start=0&q=*:*&distrib=false&isShard=true&wt=javabin&fsv=true&rows=10&version=2} hits=1 status=0 QTime=0 
[junit4:junit4]   2> 15075 T371 C38 P35792 REQ /select {shard.url=127.0.0.1:35792/solr/collection1/&NOW=1348382156359&q=*:*&ids=1&distrib=false&isShard=true&wt=javabin&version=2} status=0 QTime=5 
[junit4:junit4]   2> 15076 T370 C38 P35792 REQ /select {wt=javabin&q=*:*&version=2} hits=1 status=0 QTime=13 
[junit4:junit4]   2> 15077 T358 oaz.ZooKeeper.<init> Initiating client connection, connectString=127.0.0.1:43519/solr sessionTimeout=10000 watcher=org.apache.solr.common.cloud.ConnectionManager@7345eca6
[junit4:junit4]   2> 15078 T444 oaz.ClientCnxn$SendThread.startConnect Opening socket connection to server /127.0.0.1:43519
[junit4:junit4]   2> 15078 T358 oascc.ConnectionManager.waitForConnected Waiting for client to connect to ZooKeeper
[junit4:junit4]   2> 15079 T444 oaz.ClientCnxn$SendThread.primeConnection Socket connection established to localhost/127.0.0.1:43519, initiating session
[junit4:junit4]   2> 15079 T360 oazs.NIOServerCnxn$Factory.run Accepted socket connection from /140.211.11.196:37432
[junit4:junit4]   2> 15079 T360 oazs.NIOServerCnxn.readConnectRequest Client attempting to establish new session at /140.211.11.196:37432
[junit4:junit4]   2> 15081 T362 oazs.NIOServerCnxn.finishSessionInit Established session 0x139f1d6ace30009 with negotiated timeout 10000 for client /140.211.11.196:37432
[junit4:junit4]   2> 15081 T444 oaz.ClientCnxn$SendThread.readConnectResult Session establishment complete on server localhost/127.0.0.1:43519, sessionid = 0x139f1d6ace30009, negotiated timeout = 10000
[junit4:junit4]   2> 15082 T445 oascc.ConnectionManager.process Watcher org.apache.solr.common.cloud.ConnectionManager@7345eca6 name:ZooKeeperConnection Watcher:127.0.0.1:43519/solr got event WatchedEvent state:SyncConnected type:None path:null path:null type:None
[junit4:junit4]   2> 15082 T358 oascc.ConnectionManager.waitForConnected Client is connected to ZooKeeper
[junit4:junit4]   2> 15083 T358 oascc.ZkStateReader.createClusterStateWatchersAndUpdate Updating cluster state from ZooKeeper... 
[junit4:junit4]   2> 15085 T363 oazs.PrepRequestProcessor.pRequest Processed session termination for sessionid: 0x139f1d6ace30009
[junit4:junit4]   2> 15086 T445 oaz.ClientCnxn$EventThread.run EventThread shut down
[junit4:junit4]   2> 15086 T358 oaz.ZooKeeper.close Session: 0x139f1d6ace30009 closed
[junit4:junit4]   2> 15087 T360 oazs.NIOServerCnxn.closeSock Closed socket connection for client /140.211.11.196:37432 which had sessionid 0x139f1d6ace30009
[junit4:junit4]   2> 15089 T389 C35 P53886 REQ /select {distrib=false&wt=javabin&q=*:*&version=2} hits=1 status=0 QTime=1 
[junit4:junit4]   2> 15092 T401 C37 P11769 REQ /select {distrib=false&wt=javabin&q=*:*&version=2} hits=0 status=0 QTime=0 
[junit4:junit4]   2> 15097 T390 C35 P53886 REQ /select {fl=id,score&shard.url=127.0.0.1:53886/solr/collection1/|127.0.0.1:34472/solr/collection1/&NOW=1348382156390&start=0&q=*:*&distrib=false&isShard=true&wt=javabin&fsv=true&rows=10&version=2} hits=1 status=0 QTime=1 
[junit4:junit4]   2> 15097 T402 C37 P11769 REQ /select {fl=id,score&shard.url=127.0.0.1:11769/solr/collection1/|127.0.0.1:36096/solr/collection1/&NOW=1348382156390&start=0&q=*:*&distrib=false&isShard=true&wt=javabin&fsv=true&rows=10&version=2} hits=0 status=0 QTime=1 
[junit4:junit4]   2> 15101 T390 C35 P53886 REQ /select {shard.url=127.0.0.1:53886/solr/collection1/|127.0.0.1:34472/solr/collection1/&NOW=1348382156390&q=*:*&ids=1&distrib=false&isShard=true&wt=javabin&version=2} status=0 QTime=1 
[junit4:junit4]   2> 15101 T423 C36 P36096 REQ /select {wt=javabin&q=*:*&version=2} hits=1 status=0 QTime=7 
[junit4:junit4]   2> 15108 T370 C38 P35792 /update {wt=javabin&version=2} {add=[2 (1413881168029286400)]} 0 4
[junit4:junit4]   2> 15121 T422 C36 P36096 REQ /update {distrib.from=http://127.0.0.1:11769/solr/collection1/&update.distrib=FROMLEADER&wt=javabin&version=2} status=0 QTime=4 
[junit4:junit4]   2> 15122 T397 C37 P11769 /update {wt=javabin&version=2} {add=[2 (1413881168036626432)]} 0 12
[junit4:junit4]   2> 15126 T370 C38 P35792 /update {wt=javabin&version=2} {add=[3 (1413881168051306496)]} 0 1
[junit4:junit4]   2> 15135 T422 C36 P36096 REQ /update {distrib.from=http://127.0.0.1:11769/solr/collection1/&update.distrib=FROMLEADER&wt=javabin&version=2} status=0 QTime=1 
[junit4:junit4]   2> 15135 T397 C37 P11769 /update {wt=javabin&version=2} {add=[3 (1413881168055500800)]} 0 6
[junit4:junit4]   2> 15139 T370 C38 P35792 /update {wt=javabin&version=2} {add=[4 (1413881168064937984)]} 0 1
[junit4:junit4]   2> 15151 T408 C34 P34472 REQ /update {distrib.from=http://127.0.0.1:53886/solr/collection1/&update.distrib=FROMLEADER&wt=javabin&version=2} status=0 QTime=3 
[junit4:junit4]   2> 15152 T386 C35 P53886 /update {wt=javabin&version=2} {add=[4 (1413881168069132288)]} 0 10
[junit4:junit4]   2> 15157 T370 C38 P35792 /update {wt=javabin&version=2} {add=[5 (1413881168083812352)]} 0 2
[junit4:junit4]   2> 15167 T422 C36 P36096 REQ /update {distrib.from=http://127.0.0.1:11769/solr/collection1/&update.distrib=FROMLEADER&wt=javabin&version=2} status=0 QTime=2 
[junit4:junit4]   2> 15167 T397 C37 P11769 /update {wt=javabin&version=2} {add=[5 (1413881168090103808)]} 0 6
[junit4:junit4]   2> 15172 T370 C38 P35792 /update {wt=javabin&version=2} {add=[6 (1413881168098492416)]} 0 2
[junit4:junit4]   2> 15190 T422 C36 P36096 REQ /update {update.distrib=FROMLEADER&distrib.from=http://127.0.0.1:11769/solr/collection1/&wt=javabin&version=2} status=0 QTime=1 
[junit4:junit4]   2> 15191 T400 C37 P11769 REQ /update {distrib.from=http://127.0.0.1:53886/solr/collection1/&update.distrib=TOLEADER&wt=javabin&version=2} status=0 QTime=6 
[junit4:junit4]   2> 15192 T386 C35 P53886 /update {wt=javabin&version=2} {add=[6]} 0 17
[junit4:junit4]   2> 15197 T370 C38 P35792 /update {wt=javabin&version=2} {add=[7 (1413881168124706816)]} 0 2
[junit4:junit4]   2> 15208 T422 C36 P36096 REQ /update {update.distrib=FROMLEADER&distrib.from=http://127.0.0.1:11769/solr/collection1/&wt=javabin&version=2} status=0 QTime=1 
[junit4:junit4]   2> 15209 T400 C37 P11769 REQ /update {distrib.from=http://127.0.0.1:53886/solr/collection1/&update.distrib=TOLEADER&wt=javabin&version=2} status=0 QTime=6 
[junit4:junit4]   2> 15210 T386 C35 P53886 /update {wt=javabin&version=2} {add=[7]} 0 10
[junit4:junit4]   2> 15215 T370 C38 P35792 /update {wt=javabin&version=2} {add=[8 (1413881168143581184)]} 0 2
[junit4:junit4]   2> 15226 T408 C34 P34472 REQ /update {update.distrib=FROMLEADER&distrib.from=http://127.0.0.1:53886/solr/collection1/&wt=javabin&version=2} status=0 QTime=2 
[junit4:junit4]   2> 15227 T385 C35 P53886 REQ /update {distrib.from=http://127.0.0.1:11769/solr/collection1/&update.distrib=TOLEADER&wt=javabin&version=2} status=0 QTime=7 
[junit4:junit4]   2> 15228 T397 C37 P11769 /update {wt=javabin&version=2} {add=[8]} 0 10
[junit4:junit4]   2> 15233 T370 C38 P35792 /update {wt=javabin&version=2} {add=[9 (1413881168162455552)]} 0 2
[junit4:junit4]   2> 15244 T422 C36 P36096 REQ /update {update.distrib=FROMLEADER&distrib.from=http://127.0.0.1:11769/solr/collection1/&wt=javabin&version=2} status=0 QTime=1 
[junit4:junit4]   2> 15245 T400 C37 P11769 REQ /update {distrib.from=http://127.0.0.1:53886/solr/collection1/&update.distrib=TOLEADER&wt=javabin&version=2} status=0 QTime=6 
[junit4:junit4]   2> 15245 T386 C35 P53886 /update {wt=javabin&version=2} {add=[9]} 0 9
[junit4:junit4]   2> 15250 T370 C38 P35792 /update {wt=javabin&version=2} {add=[10 (1413881168180281344)]} 0 2
[junit4:junit4]   2> 15261 T408 C34 P34472 REQ /update {update.distrib=FROMLEADER&distrib.from=http://127.0.0.1:53886/solr/collection1/&wt=javabin&version=2} status=0 QTime=2 
[junit4:junit4]   2> 15262 T385 C35 P53886 REQ /update {distrib.from=http://127.0.0.1:11769/solr/collection1/&update.distrib=TOLEADER&wt=javabin&version=2} status=0 QTime=5 
[junit4:junit4]   2> 15262 T397 C37 P11769 /update {wt=javabin&version=2} {add=[10]} 0 9
[junit4:junit4]   2> 15286 T370 C38 P35792 /update {wt=javabin&version=2} {add=[11 (1413881168198107136)]} 0 20
[junit4:junit4]   2> 15294 T408 C34 P34472 REQ /update {distrib.from=http://127.0.0.1:53886/solr/collection1/&update.distrib=FROMLEADER&wt=javabin&version=2} status=0 QTime=2 
[junit4:junit4]   2> 15295 T386 C35 P53886 /update {wt=javabin&version=2} {add=[11 (1413881168223272960)]} 0 7
[junit4:junit4]   2> 15301 T370 C38 P35792 /update {wt=javabin&version=2} {add=[12 (1413881168232710144)]} 0 3
[junit4:junit4]   2> 15313 T408 C34 P34472 REQ /update {update.distrib=FROMLEADER&distrib.from=http://127.0.0.1:53886/solr/collection1/&wt=javabin&version=2} status=0 QTime=2 
[junit4:junit4]   2> 15314 T385 C35 P53886 REQ /update {distrib.from=http://127.0.0.1:11769/solr/collection1/&update.distrib=TOLEADER&wt=javabin&version=2} status=0 QTime=7 
[junit4:junit4]   2> 15314 T397 C37 P11769 /update {wt=javabin&version=2} {add=[12]} 0 10
[junit4:junit4]   2> 15319 T370 C38 P35792 /update {wt=javabin&version=2} {add=[13 (1413881168252633088)]} 0 2
[junit4:junit4]   2> 15331 T408 C34 P34472 REQ /update {update.distrib=FROMLEADER&distrib.from=http://127.0.0.1:53886/solr/collection1/&wt=javabin&version=2} status=0 QTime=2 
[junit4:junit4]   2> 15332 T385 C35 P53886 REQ /update {distrib.from=http://127.0.0.1:11769/solr/collection1/&update.distrib=TOLEADER&wt=javabin&version=2} status=0 QTime=7 
[junit4:junit4]   2> 15333 T397 C37 P11769 /update {wt=javabin&version=2} {add=[13]} 0 11
[junit4:junit4]   2> 15337 T370 C38 P35792 /update {wt=javabin&version=2} {add=[14 (1413881168271507456)]} 0 2
[junit4:junit4]   2> 15346 T408 C34 P34472 REQ /update {distrib.from=http://127.0.0.1:53886/solr/collection1/&update.distrib=FROMLEADER&wt=javabin&version=2} status=0 QTime=2 
[junit4:junit4]   2> 15347 T386 C35 P53886 /update {wt=javabin&version=2} {add=[14 (1413881168277798912)]} 0 7
[junit4:junit4]   2> 15352 T370 C38 P35792 /update {wt=javabin&version=2} {add=[15 (1413881168287236096)]} 0 2
[junit4:junit4]   2> 15360 T408 C34 P34472 REQ /update {distrib.from=http://127.0.0.1:53886/solr/collection1/&update.distrib=FROMLEADER&wt=javabin&version=2} status=0 QTime=1 
[junit4:junit4]   2> 15360 T386 C35 P53886 /update {wt=javabin&version=2} {add=[15 (1413881168291430400)]} 0 6
[junit4:junit4]   2> 15364 T370 C38 P35792 /update {wt=javabin&version=2} {add=[16 (1413881168300867584)]} 0 1
[junit4:junit4]   2> 15372 T408 C34 P34472 REQ /update {distrib.from=http://127.0.0.1:53886/solr/collection1/&update.distrib=FROMLEADER&wt=javabin&version=2} status=0 QTime=1 
[junit4:junit4]   2> 15373 T386 C35 P53886 /update {wt=javabin&version=2} {add=[16 (1413881168305061888)]} 0 6
[junit4:junit4]   2> 15380 T370 C38 P35792 /update {wt=javabin&version=2} {add=[17 (1413881168315547648)]} 0 4
[junit4:junit4]   2> 15397 T422 C36 P36096 REQ /update {update.distrib=FROMLEADER&distrib.from=http://127.0.0.1:11769/solr/collection1/&wt=javabin&version=2} status=0 QTime=3 
[junit4:junit4]   2> 15397 T400 C37 P11769 REQ /update {distrib.from=http://127.0.0.1:53886/solr/collection1/&update.distrib=TOLEADER&wt=javabin&version=2} status=0 QTime=11 
[junit4:junit4]   2> 15398 T386 C35 P53886 /update {wt=javabin&version=2} {add=[17]} 0 15
[junit4:junit4]   2> 15402 T370 C38 P35792 /update {wt=javabin&version=2} {add=[100 (1413881168340713472)]} 0 1
[junit4:junit4]   2> 15449 T408 C34 P34472 REQ /update {update.distrib=FROMLEADER&distrib.from=http://127.0.0.1:53886/solr/collection1/&wt=javabin&version=2} status=0 QTime=19 
[junit4:junit4]   2> 15450 T385 C35 P53886 REQ /update {distrib.from=http://127.0.0.1:11769/solr/collection1/&update.distrib=TOLEADER&wt=javabin&version=2} status=0 QTime=42 
[junit4:junit4]   2> 15451 T397 C37 P11769 /update {wt=javabin&version=2} {add=[100]} 0 45
[junit4:junit4]   2> 15455 T370 C38 P35792 /update {wt=javabin&version=2} {add=[101 (1413881168395239424)]} 0 2
[junit4:junit4]   2> 15469 T408 C34 P34472 REQ /update {update.distrib=FROMLEADER&distrib.from=http://127.0.0.1:53886/solr/collection1/&wt=javabin&version=2} status=0 QTime=3 
[junit4:junit4]   2> 15470 T385 C35 P53886 REQ /update {distrib.from=http://127.0.0.1:11769/solr/collection1/&update.distrib=TOLEADER&wt=javabin&version=2} status=0 QTime=9 
[junit4:junit4]   2> 15471 T397 C37 P11769 /update {wt=javabin&version=2} {add=[101]} 0 13
[junit4:junit4]   2> 15474 T370 C38 P35792 /update {wt=javabin&version=2} {add=[102 (1413881168416210944)]} 0 1
[junit4:junit4]   2> 15484 T408 C34 P34472 REQ /update {update.distrib=FROMLEADER&distrib.from=http://127.0.0.1:53886/solr/collection1/&wt=javabin&version=2} status=0 QTime=2 
[junit4:junit4]   2> 15484 T385 C35 P53886 REQ /update {distrib.from=http://127.0.0.1:11769/solr/collection1/&update.distrib=TOLEADER&wt=javabin&version=2} status=0 QTime=5 
[junit4:junit4]   2> 15485 T397 C37 P11769 /update {wt=javabin&version=2} {add=[102]} 0 8
[junit4:junit4]   2> 15508 T370 C38 P35792 /update {wt=javabin&version=2} {add=[103 (1413881168432988160)]} 0 20
[junit4:junit4]   2> 15516 T422 C36 P36096 REQ /update {distrib.from=http://127.0.0.1:11769/solr/collection1/&update.distrib=FROMLEADER&wt=javabin&version=2} status=0 QTime=1 
[junit4:junit4]   2> 15517 T397 C37 P11769 /update {wt=javabin&version=2} {add=[103 (1413881168456056832)]} 0 6
[junit4:junit4]   2> 15522 T370 C38 P35792 /update {wt=javabin&version=2} {add=[104 (1413881168465494016)]} 0 2
[junit4:junit4]   2> 15530 T422 C36 P36096 REQ /update {distrib.from=http://127.0.0.1:11769/solr/collection1/&update.distrib=FROMLEADER&wt=javabin&version=2} status=0 QTime=2 
[junit4:junit4]   2> 15530 T397 C37 P11769 /update {wt=javabin&version=2} {add=[104 (1413881168470736896)]} 0 5
[junit4:junit4]   2> 15534 T370 C38 P35792 /update {wt=javabin&version=2} {add=[105 (1413881168479125504)]} 0 1
[junit4:junit4]   2> 15570 T422 C36 P36096 REQ /update {update.distrib=FROMLEADER&distrib.from=http://127.0.0.1:11769/solr/collection1/&wt=javabin&version=2} status=0 QTime=15 
[junit4:junit4]   2> 15570 T400 C37 P11769 REQ /update {distrib.from=http://127.0.0.1:53886/solr/collection1/&update.distrib=TOLEADER&wt=javabin&version=2} status=0 QTime=31 
[junit4:junit4]   2> 15571 T386 C35 P53886 /update {wt=javabin&version=2} {add=[105]} 0 34
[junit4:junit4]   2> 15575 T370 C38 P35792 /update {wt=javabin&version=2} {add=[106 (1413881168522117120)]} 0 1
[junit4:junit4]   2> 15584 T422 C36 P36096 REQ /update {distrib.from=http://127.0.0.1:11769/solr/collection1/&update.distrib=FROMLEADER&wt=javabin&version=2} status=0 QTime=2 
[junit4:junit4]   2> 15584 T397 C37 P11769 /update {wt=javabin&version=2} {add=[106 (1413881168526311424)]} 0 6
[junit4:junit4]   2> 15588 T370 C38 P35792 /update {wt=javabin&version=2} {add=[107 (1413881168535748608)]} 0 1
[junit4:junit4]   2> 15594 T408 C34 P34472 REQ /update {distrib.from=http://127.0.0.1:53886/solr/collection1/&update.distrib=FROMLEADER&wt=javabin&version=2} status=0 QTime=1 
[junit4:junit4]   2> 15595 T386 C35 P53886 /update {wt=javabin&version=2} {add=[107 (1413881168538894336)]} 0 5
[junit4:junit4]   2> 15598 T370 C38 P35792 /update {wt=javabin&version=2} {add=[108 (1413881168546234368)]} 0 1
[junit4:junit4]   2> 15606 T408 C34 P34472 REQ /update {update.distrib=FROMLEADER&distrib.from=http://127.0.0.1:53886/solr/collection1/&wt=javabin&version=2} status=0 QTime=1 
[junit4:junit4]   2> 15607 T385 C35 P53886 REQ /update {distrib.from=http://127.0.0.1:11769/solr/collection1/&update.distrib=TOLEADER&wt=javabin&version=2} status=0 QTime=5 
[junit4:junit4]   2> 15607 T397 C37 P11769 /update {wt=javabin&version=2} {add=[108]} 0 7
[junit4:junit4]   2> 15611 T370 C38 P35792 /update {wt=javabin&version=2} {add=[109 (1413881168559865856)]} 0 1
[junit4:junit4]   2> 15618 T408 C34 P34472 REQ /update {distrib.from=http://127.0.0.1:53886/solr/collection1/&update.distrib=FROMLEADER&wt=javabin&version=2} status=0 QTime=1 
[junit4:junit4]   2> 15619 T386 C35 P53886 /update {wt=javabin&version=2} {add=[109 (1413881168564060160)]} 0 5
[junit4:junit4]   2> 15623 T370 C38 P35792 /update {wt=javabin&version=2} {add=[110 (1413881168572448768)]} 0 1
[junit4:junit4]   2> 15630 T408 C34 P34472 REQ /update {distrib.from=http://127.0.0.1:53886/solr/collection1/&update.distrib=FROMLEADER&wt=javabin&version=2} status=0 QTime=1 
[junit4:junit4]   2> 15631 T386 C35 P53886 /update {wt=javabin&version=2} {add=[110 (1413881168576643072)]} 0 5
[junit4:junit4]   2> 15634 T370 C38 P35792 /update {wt=javabin&version=2} {add=[111 (1413881168583983104)]} 0 1
[junit4:junit4]   2> 15640 T408 C34 P34472 REQ /update {distrib.from=http://127.0.0.1:53886/solr/collection1/&update.distrib=FROMLEADER&wt=javabin&version=2} status=0 QTime=1 
[junit4:junit4]   2> 15640 T386 C35 P53886 /update {wt=javabin&version=2} {add=[111 (1413881168587128832)]} 0 4
[junit4:junit4]   2> 15644 T370 C38 P35792 /update {wt=javabin&version=2} {add=[112 (1413881168594468864)]} 0 1
[junit4:junit4]   2> 15652 T422 C36 P36096 REQ /update {update.distrib=FROMLEADER&distrib.from=http://127.0.0.1:11769/solr/collection1/&wt=javabin&version=2} status=0 QTime=1 
[junit4:junit4]   2> 15652 T400 C37 P11769 REQ /update {distrib.from=http://127.0.0.1:53886/solr/collection1/&update.distrib=TOLEADER&wt=javabin&version=2} status=0 QTime=4 
[junit4:junit4]   2> 15653 T386 C35 P53886 /update {wt=javabin&version=2} {add=[112]} 0 7
[junit4:junit4]   2> 15666 T370 C38 P35792 /update {wt=javabin&version=2} {add=[113 (1413881168608100352)]} 0 10
[junit4:junit4]   2> 15673 T408 C34 P34472 REQ /update {distrib.from=http://127.0.0.1:53886/solr/collection1/&update.distrib=FROMLEADER&wt=javabin&version=2} status=0 QTime=1 
[junit4:junit4]   2> 15673 T386 C35 P53886 /update {wt=javabin&version=2} {add=[113 (1413881168621731840)]} 0 4
[junit4:junit4]   2> 15678 T370 C38 P35792 /update {wt=javabin&version=2} {add=[114 (1413881168629071872)]} 0 2
[junit4:junit4]   2> 15684 T408 C34 P34472 REQ /update {distrib.from=http://127.0.0.1:53886/solr/collection1/&update.distrib=FROMLEADER&wt=javabin&version=2} status=0 QTime=1 
[junit4:junit4]   2> 15684 T386 C35 P53886 /update {wt=javabin&version=2} {add=[114 (1413881168633266176)]} 0 4
[junit4:junit4]   2> 15688 T370 C38 P35792 /update {wt=javabin&version=2} {add=[115 (1413881168640606208)]} 0 1
[junit4:junit4]   2> 15696 

[...truncated too long message...]

4:junit4]   2> 141855 T629 oaz.ClientCnxn$EventThread.run EventThread shut down
[junit4:junit4]   2> 141855 T569 oaz.ZooKeeper.close Session: 0x139f1db984c0005 closed
[junit4:junit4]   2> 141857 T569 oejsh.ContextHandler.doStop stopped o.e.j.s.ServletContextHandler{/solr,null}
[junit4:junit4]   2> 141909 T569 oasc.ChaosMonkey.monkeyLog monkey: stop shard! 65479
[junit4:junit4]   2> 141909 T569 oasc.CoreContainer.shutdown Shutting down CoreContainer instance=1962576215
[junit4:junit4]   2> 141910 T569 oasc.SolrCore.close [collection1]  CLOSING SolrCore org.apache.solr.core.SolrCore@164cfb1d
[junit4:junit4]   2> 141935 T569 oasc.SolrCore.closeSearcher [collection1] Closing main searcher on request.
[junit4:junit4]   2> 141935 T569 oasu.DirectUpdateHandler2.close closing DirectUpdateHandler2{commits=5,autocommits=0,soft autocommits=0,optimizes=0,rollbacks=0,expungeDeletes=0,docsPending=0,adds=0,deletesById=0,deletesByQuery=0,errors=0,cumulative_adds=5,cumulative_deletesById=0,cumulative_deletesByQuery=1,cumulative_errors=0}
[junit4:junit4]   2> 141936 T569 oasu.DefaultSolrCoreState.decref SolrCoreState ref count has reached 0 - closing IndexWriter
[junit4:junit4]   2> 141938 T569 oasu.DefaultSolrCoreState.decref Closing SolrCoreState - canceling any ongoing recovery
[junit4:junit4]   2> 143200 T642 oaz.ClientCnxn$SendThread.startConnect Opening socket connection to server localhost/127.0.0.1:11613
[junit4:junit4]   2> 146957 T643 oaz.ClientCnxn$EventThread.run EventThread shut down
[junit4:junit4]   2> 146957 T569 oaz.ZooKeeper.close Session: 0x139f1db984c0006 closed
[junit4:junit4]   2> 146958 T569 oejsh.ContextHandler.doStop stopped o.e.j.s.ServletContextHandler{/solr,null}
[junit4:junit4]   2> 147127 T569 oas.SolrTestCaseJ4.tearDown ###Ending testDistribSearch
[junit4:junit4]   2> NOTE: reproduce with: ant test  -Dtestcase=SyncSliceTest -Dtests.method=testDistribSearch -Dtests.seed=EF774F3D8A46BA45 -Dtests.multiplier=3 -Dtests.slow=true -Dtests.locale=ca -Dtests.timezone=America/St_Barthelemy -Dtests.file.encoding=ISO-8859-1
[junit4:junit4] FAILURE  147s J1 | SyncSliceTest.testDistribSearch <<<
[junit4:junit4]    > Throwable #1: java.lang.AssertionError: There are still nodes recoverying
[junit4:junit4]    > 	at __randomizedtesting.SeedInfo.seed([EF774F3D8A46BA45:6E91C125FD19DA79]:0)
[junit4:junit4]    > 	at org.junit.Assert.fail(Assert.java:93)
[junit4:junit4]    > 	at org.apache.solr.cloud.AbstractDistribZkTestBase.waitForRecoveriesToFinish(AbstractDistribZkTestBase.java:154)
[junit4:junit4]    > 	at org.apache.solr.cloud.AbstractFullDistribZkTestBase.waitForRecoveriesToFinish(AbstractFullDistribZkTestBase.java:560)
[junit4:junit4]    > 	at org.apache.solr.cloud.AbstractFullDistribZkTestBase.waitForThingsToLevelOut(AbstractFullDistribZkTestBase.java:1135)
[junit4:junit4]    > 	at org.apache.solr.cloud.SyncSliceTest.doTest(SyncSliceTest.java:162)
[junit4:junit4]    > 	at org.apache.solr.BaseDistributedSearchTestCase.testDistribSearch(BaseDistributedSearchTestCase.java:695)
[junit4:junit4]    > 	at sun.reflect.NativeMethodAccessorImpl.invoke0(Native Method)
[junit4:junit4]    > 	at sun.reflect.NativeMethodAccessorImpl.invoke(NativeMethodAccessorImpl.java:57)
[junit4:junit4]    > 	at sun.reflect.DelegatingMethodAccessorImpl.invoke(DelegatingMethodAccessorImpl.java:43)
[junit4:junit4]    > 	at java.lang.reflect.Method.invoke(Method.java:616)
[junit4:junit4]    > 	at com.carrotsearch.randomizedtesting.RandomizedRunner.invoke(RandomizedRunner.java:1559)
[junit4:junit4]    > 	at com.carrotsearch.randomizedtesting.RandomizedRunner.access$600(RandomizedRunner.java:79)
[junit4:junit4]    > 	at com.carrotsearch.randomizedtesting.RandomizedRunner$6.evaluate(RandomizedRunner.java:737)
[junit4:junit4]    > 	at com.carrotsearch.randomizedtesting.RandomizedRunner$7.evaluate(RandomizedRunner.java:773)
[junit4:junit4]    > 	at com.carrotsearch.randomizedtesting.RandomizedRunner$8.evaluate(RandomizedRunner.java:787)
[junit4:junit4]    > 	at com.carrotsearch.randomizedtesting.rules.SystemPropertiesRestoreRule$1.evaluate(SystemPropertiesRestoreRule.java:53)
[junit4:junit4]    > 	at org.apache.lucene.util.TestRuleSetupTeardownChained$1.evaluate(TestRuleSetupTeardownChained.java:50)
[junit4:junit4]    > 	at org.apache.lucene.util.TestRuleFieldCacheSanity$1.evaluate(TestRuleFieldCacheSanity.java:51)
[junit4:junit4]    > 	at org.apache.lucene.util.AbstractBeforeAfterRule$1.evaluate(AbstractBeforeAfterRule.java:45)
[junit4:junit4]    > 	at com.carrotsearch.randomizedtesting.rules.SystemPropertiesInvariantRule$1.evaluate(SystemPropertiesInvariantRule.java:55)
[junit4:junit4]    > 	at org.apache.lucene.util.TestRuleThreadAndTestName$1.evaluate(TestRuleThreadAndTestName.java:48)
[junit4:junit4]    > 	at org.apache.lucene.util.TestRuleIgnoreAfterMaxFailures$1.evaluate(TestRuleIgnoreAfterMaxFailures.java:70)
[junit4:junit4]    > 	at org.apache.lucene.util.TestRuleMarkFailure$1.evaluate(TestRuleMarkFailure.java:48)
[junit4:junit4]    > 	at com.carrotsearch.randomizedtesting.rules.StatementAdapter.evaluate(StatementAdapter.java:36)
[junit4:junit4]    > 	at com.carrotsearch.randomizedtesting.ThreadLeakControl$StatementRunner.run(ThreadLeakControl.java:358)
[junit4:junit4]    > 	at com.carrotsearch.randomizedtesting.ThreadLeakControl.forkTimeoutingTask(ThreadLeakControl.java:782)
[junit4:junit4]    > 	at com.carrotsearch.randomizedtesting.ThreadLeakControl$3.evaluate(ThreadLeakControl.java:442)
[junit4:junit4]    > 	at com.carrotsearch.randomizedtesting.RandomizedRunner.runSingleTest(RandomizedRunner.java:746)
[junit4:junit4]    > 	at com.carrotsearch.randomizedtesting.RandomizedRunner$3.evaluate(RandomizedRunner.java:648)
[junit4:junit4]    > 	at com.carrotsearch.randomizedtesting.RandomizedRunner$4.evaluate(RandomizedRunner.java:682)
[junit4:junit4]    > 	at com.carrotsearch.randomizedtesting.RandomizedRunner$5.evaluate(RandomizedRunner.java:693)
[junit4:junit4]    > 	at com.carrotsearch.randomizedtesting.rules.StatementAdapter.evaluate(StatementAdapter.java:36)
[junit4:junit4]    > 	at com.carrotsearch.randomizedtesting.rules.SystemPropertiesRestoreRule$1.evaluate(SystemPropertiesRestoreRule.java:53)
[junit4:junit4]    > 	at org.apache.lucene.util.AbstractBeforeAfterRule$1.evaluate(AbstractBeforeAfterRule.java:45)
[junit4:junit4]    > 	at org.apache.lucene.util.TestRuleStoreClassName$1.evaluate(TestRuleStoreClassName.java:42)
[junit4:junit4]    > 	at com.carrotsearch.randomizedtesting.rules.SystemPropertiesInvariantRule$1.evaluate(SystemPropertiesInvariantRule.java:55)
[junit4:junit4]    > 	at com.carrotsearch.randomizedtesting.rules.NoShadowingOrOverridesOnMethodsRule$1.evaluate(NoShadowingOrOverridesOnMethodsRule.java:39)
[junit4:junit4]    > 	at com.carrotsearch.randomizedtesting.rules.NoShadowingOrOverridesOnMethodsRule$1.evaluate(NoShadowingOrOverridesOnMethodsRule.java:39)
[junit4:junit4]    > 	at com.carrotsearch.randomizedtesting.rules.StatementAdapter.evaluate(StatementAdapter.java:36)
[junit4:junit4]    > 	at org.apache.lucene.util.TestRuleAssertionsRequired$1.evaluate(TestRuleAssertionsRequired.java:43)
[junit4:junit4]    > 	at org.apache.lucene.util.TestRuleMarkFailure$1.evaluate(TestRuleMarkFailure.java:48)
[junit4:junit4]    > 	at org.apache.lucene.util.TestRuleIgnoreAfterMaxFailures$1.evaluate(TestRuleIgnoreAfterMaxFailures.java:70)
[junit4:junit4]    > 	at org.apache.lucene.util.TestRuleIgnoreTestSuites$1.evaluate(TestRuleIgnoreTestSuites.java:55)
[junit4:junit4]    > 	at com.carrotsearch.randomizedtesting.rules.StatementAdapter.evaluate(StatementAdapter.java:36)
[junit4:junit4]    > 	at com.carrotsearch.randomizedtesting.ThreadLeakControl$StatementRunner.run(ThreadLeakControl.java:358)
[junit4:junit4]    > 	at java.lang.Thread.run(Thread.java:679)
[junit4:junit4]   2> 147133 T569 oas.SolrTestCaseJ4.deleteCore ###deleteCore
[junit4:junit4]   2> NOTE: test params are: codec=SimpleText, sim=RandomSimilarityProvider(queryNorm=false,coord=yes): {}, locale=ca, timezone=America/St_Barthelemy
[junit4:junit4]   2> NOTE: FreeBSD 9.0-RELEASE amd64/Sun Microsystems Inc. 1.6.0_32 (64-bit)/cpus=16,threads=1,free=40088416,total=213909504
[junit4:junit4]   2> NOTE: All tests run in this JVM: [DebugComponentTest, TestLRUCache, TestDFRSimilarityFactory, TestReversedWildcardFilterFactory, TestPhraseSuggestions, IndexReaderFactoryTest, TestRemoteStreaming, TimeZoneUtilsTest, XsltUpdateRequestHandlerTest, SuggesterTest, TestBM25SimilarityFactory, TestTrie, SpellingQueryConverterTest, TestQueryUtils, TermVectorComponentDistributedTest, TestPluginEnable, TestCodecSupport, TestCSVLoader, EchoParamsTest, TestDistributedSearch, TestJmxIntegration, TestPropInject, HighlighterTest, ScriptEngineTest, SignatureUpdateProcessorFactoryTest, TestFoldingMultitermQuery, TestSolrDeletionPolicy1, BasicDistributedZk2Test, TestOmitPositions, TestBinaryField, SolrCoreTest, PolyFieldTest, PeerSyncTest, SyncSliceTest]
[junit4:junit4] Completed on J1 in 147.16s, 1 test, 1 failure <<< FAILURES!

[...truncated 419 lines...]
BUILD FAILED
/usr/home/hudson/hudson-slave/workspace/Lucene-Solr-Tests-4.x-Java6/build.xml:32: The following error occurred while executing this line:
/usr/home/hudson/hudson-slave/workspace/Lucene-Solr-Tests-4.x-Java6/solr/build.xml:179: The following error occurred while executing this line:
/usr/home/hudson/hudson-slave/workspace/Lucene-Solr-Tests-4.x-Java6/lucene/module-build.xml:63: The following error occurred while executing this line:
/usr/home/hudson/hudson-slave/workspace/Lucene-Solr-Tests-4.x-Java6/lucene/common-build.xml:1141: The following error occurred while executing this line:
/usr/home/hudson/hudson-slave/workspace/Lucene-Solr-Tests-4.x-Java6/lucene/common-build.xml:814: There were test failures: 231 suites, 954 tests, 2 failures, 21 ignored (3 assumptions)

Total time: 30 minutes 50 seconds
Build step 'Invoke Ant' marked build as failure
Recording test results
Email was triggered for: Failure
Sending email for trigger: Failure



Mime
View raw message