lucene-dev mailing list archives

Site index · List index
Message view « Date » · « Thread »
Top « Date » · « Thread »
From Apache Jenkins Server <jenk...@builds.apache.org>
Subject [JENKINS] Lucene-Solr-Tests-trunk-Java6 - Build # 15249 - Still Failing
Date Mon, 17 Sep 2012 05:17:06 GMT
Build: https://builds.apache.org/job/Lucene-Solr-Tests-trunk-Java6/15249/

2 tests failed.
FAILED:  org.apache.solr.cloud.SyncSliceTest.testDistribSearch

Error Message:
There are still nodes recoverying

Stack Trace:
java.lang.AssertionError: There are still nodes recoverying
	at __randomizedtesting.SeedInfo.seed([3AC9AD776862ECF7:BB2F236F1F3D8CCB]:0)
	at org.junit.Assert.fail(Assert.java:93)
	at org.apache.solr.cloud.AbstractDistribZkTestBase.waitForRecoveriesToFinish(AbstractDistribZkTestBase.java:154)
	at org.apache.solr.cloud.AbstractFullDistribZkTestBase.waitForRecoveriesToFinish(AbstractFullDistribZkTestBase.java:560)
	at org.apache.solr.cloud.AbstractFullDistribZkTestBase.waitForThingsToLevelOut(AbstractFullDistribZkTestBase.java:1135)
	at org.apache.solr.cloud.SyncSliceTest.doTest(SyncSliceTest.java:162)
	at org.apache.solr.BaseDistributedSearchTestCase.testDistribSearch(BaseDistributedSearchTestCase.java:695)
	at sun.reflect.NativeMethodAccessorImpl.invoke0(Native Method)
	at sun.reflect.NativeMethodAccessorImpl.invoke(NativeMethodAccessorImpl.java:57)
	at sun.reflect.DelegatingMethodAccessorImpl.invoke(DelegatingMethodAccessorImpl.java:43)
	at java.lang.reflect.Method.invoke(Method.java:616)
	at com.carrotsearch.randomizedtesting.RandomizedRunner.invoke(RandomizedRunner.java:1559)
	at com.carrotsearch.randomizedtesting.RandomizedRunner.access$600(RandomizedRunner.java:79)
	at com.carrotsearch.randomizedtesting.RandomizedRunner$6.evaluate(RandomizedRunner.java:737)
	at com.carrotsearch.randomizedtesting.RandomizedRunner$7.evaluate(RandomizedRunner.java:773)
	at com.carrotsearch.randomizedtesting.RandomizedRunner$8.evaluate(RandomizedRunner.java:787)
	at com.carrotsearch.randomizedtesting.rules.SystemPropertiesRestoreRule$1.evaluate(SystemPropertiesRestoreRule.java:53)
	at org.apache.lucene.util.TestRuleSetupTeardownChained$1.evaluate(TestRuleSetupTeardownChained.java:50)
	at org.apache.lucene.util.TestRuleFieldCacheSanity$1.evaluate(TestRuleFieldCacheSanity.java:51)
	at org.apache.lucene.util.AbstractBeforeAfterRule$1.evaluate(AbstractBeforeAfterRule.java:45)
	at com.carrotsearch.randomizedtesting.rules.SystemPropertiesInvariantRule$1.evaluate(SystemPropertiesInvariantRule.java:55)
	at org.apache.lucene.util.TestRuleThreadAndTestName$1.evaluate(TestRuleThreadAndTestName.java:48)
	at org.apache.lucene.util.TestRuleIgnoreAfterMaxFailures$1.evaluate(TestRuleIgnoreAfterMaxFailures.java:70)
	at org.apache.lucene.util.TestRuleMarkFailure$1.evaluate(TestRuleMarkFailure.java:48)
	at com.carrotsearch.randomizedtesting.rules.StatementAdapter.evaluate(StatementAdapter.java:36)
	at com.carrotsearch.randomizedtesting.ThreadLeakControl$StatementRunner.run(ThreadLeakControl.java:358)
	at com.carrotsearch.randomizedtesting.ThreadLeakControl.forkTimeoutingTask(ThreadLeakControl.java:782)
	at com.carrotsearch.randomizedtesting.ThreadLeakControl$3.evaluate(ThreadLeakControl.java:442)
	at com.carrotsearch.randomizedtesting.RandomizedRunner.runSingleTest(RandomizedRunner.java:746)
	at com.carrotsearch.randomizedtesting.RandomizedRunner$3.evaluate(RandomizedRunner.java:648)
	at com.carrotsearch.randomizedtesting.RandomizedRunner$4.evaluate(RandomizedRunner.java:682)
	at com.carrotsearch.randomizedtesting.RandomizedRunner$5.evaluate(RandomizedRunner.java:693)
	at com.carrotsearch.randomizedtesting.rules.StatementAdapter.evaluate(StatementAdapter.java:36)
	at com.carrotsearch.randomizedtesting.rules.SystemPropertiesRestoreRule$1.evaluate(SystemPropertiesRestoreRule.java:53)
	at org.apache.lucene.util.AbstractBeforeAfterRule$1.evaluate(AbstractBeforeAfterRule.java:45)
	at org.apache.lucene.util.TestRuleStoreClassName$1.evaluate(TestRuleStoreClassName.java:42)
	at com.carrotsearch.randomizedtesting.rules.SystemPropertiesInvariantRule$1.evaluate(SystemPropertiesInvariantRule.java:55)
	at com.carrotsearch.randomizedtesting.rules.NoShadowingOrOverridesOnMethodsRule$1.evaluate(NoShadowingOrOverridesOnMethodsRule.java:39)
	at com.carrotsearch.randomizedtesting.rules.NoShadowingOrOverridesOnMethodsRule$1.evaluate(NoShadowingOrOverridesOnMethodsRule.java:39)
	at com.carrotsearch.randomizedtesting.rules.StatementAdapter.evaluate(StatementAdapter.java:36)
	at org.apache.lucene.util.TestRuleAssertionsRequired$1.evaluate(TestRuleAssertionsRequired.java:43)
	at org.apache.lucene.util.TestRuleMarkFailure$1.evaluate(TestRuleMarkFailure.java:48)
	at org.apache.lucene.util.TestRuleIgnoreAfterMaxFailures$1.evaluate(TestRuleIgnoreAfterMaxFailures.java:70)
	at org.apache.lucene.util.TestRuleIgnoreTestSuites$1.evaluate(TestRuleIgnoreTestSuites.java:55)
	at com.carrotsearch.randomizedtesting.rules.StatementAdapter.evaluate(StatementAdapter.java:36)
	at com.carrotsearch.randomizedtesting.ThreadLeakControl$StatementRunner.run(ThreadLeakControl.java:358)
	at java.lang.Thread.run(Thread.java:679)


FAILED:  org.apache.solr.cloud.BasicDistributedZk2Test.testDistribSearch

Error Message:
Shard still reported as live in zk

Stack Trace:
java.lang.AssertionError: Shard still reported as live in zk
	at __randomizedtesting.SeedInfo.seed([3AC9AD776862ECF7:BB2F236F1F3D8CCB]:0)
	at org.junit.Assert.fail(Assert.java:93)
	at org.apache.solr.cloud.AbstractFullDistribZkTestBase.waitToSeeNotLive(AbstractFullDistribZkTestBase.java:1220)
	at org.apache.solr.cloud.BasicDistributedZk2Test.brindDownShardIndexSomeDocsAndRecover(BasicDistributedZk2Test.java:190)
	at org.apache.solr.cloud.BasicDistributedZk2Test.doTest(BasicDistributedZk2Test.java:83)
	at org.apache.solr.BaseDistributedSearchTestCase.testDistribSearch(BaseDistributedSearchTestCase.java:695)
	at sun.reflect.NativeMethodAccessorImpl.invoke0(Native Method)
	at sun.reflect.NativeMethodAccessorImpl.invoke(NativeMethodAccessorImpl.java:57)
	at sun.reflect.DelegatingMethodAccessorImpl.invoke(DelegatingMethodAccessorImpl.java:43)
	at java.lang.reflect.Method.invoke(Method.java:616)
	at com.carrotsearch.randomizedtesting.RandomizedRunner.invoke(RandomizedRunner.java:1559)
	at com.carrotsearch.randomizedtesting.RandomizedRunner.access$600(RandomizedRunner.java:79)
	at com.carrotsearch.randomizedtesting.RandomizedRunner$6.evaluate(RandomizedRunner.java:737)
	at com.carrotsearch.randomizedtesting.RandomizedRunner$7.evaluate(RandomizedRunner.java:773)
	at com.carrotsearch.randomizedtesting.RandomizedRunner$8.evaluate(RandomizedRunner.java:787)
	at com.carrotsearch.randomizedtesting.rules.SystemPropertiesRestoreRule$1.evaluate(SystemPropertiesRestoreRule.java:53)
	at org.apache.lucene.util.TestRuleSetupTeardownChained$1.evaluate(TestRuleSetupTeardownChained.java:50)
	at org.apache.lucene.util.TestRuleFieldCacheSanity$1.evaluate(TestRuleFieldCacheSanity.java:51)
	at org.apache.lucene.util.AbstractBeforeAfterRule$1.evaluate(AbstractBeforeAfterRule.java:45)
	at com.carrotsearch.randomizedtesting.rules.SystemPropertiesInvariantRule$1.evaluate(SystemPropertiesInvariantRule.java:55)
	at org.apache.lucene.util.TestRuleThreadAndTestName$1.evaluate(TestRuleThreadAndTestName.java:48)
	at org.apache.lucene.util.TestRuleIgnoreAfterMaxFailures$1.evaluate(TestRuleIgnoreAfterMaxFailures.java:70)
	at org.apache.lucene.util.TestRuleMarkFailure$1.evaluate(TestRuleMarkFailure.java:48)
	at com.carrotsearch.randomizedtesting.rules.StatementAdapter.evaluate(StatementAdapter.java:36)
	at com.carrotsearch.randomizedtesting.ThreadLeakControl$StatementRunner.run(ThreadLeakControl.java:358)
	at com.carrotsearch.randomizedtesting.ThreadLeakControl.forkTimeoutingTask(ThreadLeakControl.java:782)
	at com.carrotsearch.randomizedtesting.ThreadLeakControl$3.evaluate(ThreadLeakControl.java:442)
	at com.carrotsearch.randomizedtesting.RandomizedRunner.runSingleTest(RandomizedRunner.java:746)
	at com.carrotsearch.randomizedtesting.RandomizedRunner$3.evaluate(RandomizedRunner.java:648)
	at com.carrotsearch.randomizedtesting.RandomizedRunner$4.evaluate(RandomizedRunner.java:682)
	at com.carrotsearch.randomizedtesting.RandomizedRunner$5.evaluate(RandomizedRunner.java:693)
	at com.carrotsearch.randomizedtesting.rules.StatementAdapter.evaluate(StatementAdapter.java:36)
	at com.carrotsearch.randomizedtesting.rules.SystemPropertiesRestoreRule$1.evaluate(SystemPropertiesRestoreRule.java:53)
	at org.apache.lucene.util.AbstractBeforeAfterRule$1.evaluate(AbstractBeforeAfterRule.java:45)
	at org.apache.lucene.util.TestRuleStoreClassName$1.evaluate(TestRuleStoreClassName.java:42)
	at com.carrotsearch.randomizedtesting.rules.SystemPropertiesInvariantRule$1.evaluate(SystemPropertiesInvariantRule.java:55)
	at com.carrotsearch.randomizedtesting.rules.NoShadowingOrOverridesOnMethodsRule$1.evaluate(NoShadowingOrOverridesOnMethodsRule.java:39)
	at com.carrotsearch.randomizedtesting.rules.NoShadowingOrOverridesOnMethodsRule$1.evaluate(NoShadowingOrOverridesOnMethodsRule.java:39)
	at com.carrotsearch.randomizedtesting.rules.StatementAdapter.evaluate(StatementAdapter.java:36)
	at org.apache.lucene.util.TestRuleAssertionsRequired$1.evaluate(TestRuleAssertionsRequired.java:43)
	at org.apache.lucene.util.TestRuleMarkFailure$1.evaluate(TestRuleMarkFailure.java:48)
	at org.apache.lucene.util.TestRuleIgnoreAfterMaxFailures$1.evaluate(TestRuleIgnoreAfterMaxFailures.java:70)
	at org.apache.lucene.util.TestRuleIgnoreTestSuites$1.evaluate(TestRuleIgnoreTestSuites.java:55)
	at com.carrotsearch.randomizedtesting.rules.StatementAdapter.evaluate(StatementAdapter.java:36)
	at com.carrotsearch.randomizedtesting.ThreadLeakControl$StatementRunner.run(ThreadLeakControl.java:358)
	at java.lang.Thread.run(Thread.java:679)




Build Log:
[...truncated 7120 lines...]
[junit4:junit4] Suite: org.apache.solr.cloud.BasicDistributedZk2Test
[junit4:junit4]   2> 3 T352 oas.SolrTestCaseJ4.setUp ###Starting testDistribSearch
[junit4:junit4]   2> Creating dataDir: /usr/home/hudson/hudson-slave/workspace/Lucene-Solr-Tests-trunk-Java6/solr/build/solr-core/test/J1/./solrtest-BasicDistributedZk2Test-1347858296150
[junit4:junit4]   2> 4 T352 oasc.ZkTestServer.run STARTING ZK TEST SERVER
[junit4:junit4]   2> 7 T353 oazs.ZooKeeperServer.setTickTime tickTime set to 1000
[junit4:junit4]   2> 8 T353 oazs.NIOServerCnxn$Factory.<init> binding to port 0.0.0.0/0.0.0.0:0
[junit4:junit4]   2> 9 T353 oazsp.FileTxnSnapLog.save Snapshotting: 0
[junit4:junit4]   2> 106 T352 oasc.ZkTestServer.run start zk server on port:26973
[junit4:junit4]   2> 106 T352 oaz.ZooKeeper.<init> Initiating client connection, connectString=127.0.0.1:26973 sessionTimeout=10000 watcher=org.apache.solr.common.cloud.ConnectionManager@4d27ea69
[junit4:junit4]   2> 108 T358 oaz.ClientCnxn$SendThread.startConnect Opening socket connection to server /127.0.0.1:26973
[junit4:junit4]   2> 107 T352 oascc.ConnectionManager.waitForConnected Waiting for client to connect to ZooKeeper
[junit4:junit4]   2> 108 T358 oaz.ClientCnxn$SendThread.primeConnection Socket connection established to localhost/127.0.0.1:26973, initiating session
[junit4:junit4]   2> 109 T354 oazs.NIOServerCnxn$Factory.run Accepted socket connection from /140.211.11.196:50364
[junit4:junit4]   2> 109 T354 oazs.NIOServerCnxn.readConnectRequest Client attempting to establish new session at /140.211.11.196:50364
[junit4:junit4]   2> 109 T356 oazsp.FileTxnLog.append Creating new log file: log.1
[junit4:junit4]   2> 112 T356 oazs.NIOServerCnxn.finishSessionInit Established session 0x139d29d6d5c0000 with negotiated timeout 10000 for client /140.211.11.196:50364
[junit4:junit4]   2> 112 T358 oaz.ClientCnxn$SendThread.readConnectResult Session establishment complete on server localhost/127.0.0.1:26973, sessionid = 0x139d29d6d5c0000, negotiated timeout = 10000
[junit4:junit4]   2> 112 T359 oascc.ConnectionManager.process Watcher org.apache.solr.common.cloud.ConnectionManager@4d27ea69 name:ZooKeeperConnection Watcher:127.0.0.1:26973 got event WatchedEvent state:SyncConnected type:None path:null path:null type:None
[junit4:junit4]   2> 113 T352 oascc.ConnectionManager.waitForConnected Client is connected to ZooKeeper
[junit4:junit4]   2> 113 T352 oascc.SolrZkClient.makePath makePath: /solr
[junit4:junit4]   2> 117 T357 oazs.PrepRequestProcessor.pRequest Processed session termination for sessionid: 0x139d29d6d5c0000
[junit4:junit4]   2> 125 T359 oaz.ClientCnxn$EventThread.run EventThread shut down
[junit4:junit4]   2> 125 T352 oaz.ZooKeeper.close Session: 0x139d29d6d5c0000 closed
[junit4:junit4]   2> 125 T354 oazs.NIOServerCnxn.closeSock Closed socket connection for client /140.211.11.196:50364 which had sessionid 0x139d29d6d5c0000
[junit4:junit4]   2> 126 T352 oaz.ZooKeeper.<init> Initiating client connection, connectString=127.0.0.1:26973/solr sessionTimeout=10000 watcher=org.apache.solr.common.cloud.ConnectionManager@5f936fc6
[junit4:junit4]   2> 127 T360 oaz.ClientCnxn$SendThread.startConnect Opening socket connection to server /127.0.0.1:26973
[junit4:junit4]   2> 127 T352 oascc.ConnectionManager.waitForConnected Waiting for client to connect to ZooKeeper
[junit4:junit4]   2> 128 T360 oaz.ClientCnxn$SendThread.primeConnection Socket connection established to localhost/127.0.0.1:26973, initiating session
[junit4:junit4]   2> 128 T354 oazs.NIOServerCnxn$Factory.run Accepted socket connection from /140.211.11.196:57347
[junit4:junit4]   2> 128 T354 oazs.NIOServerCnxn.readConnectRequest Client attempting to establish new session at /140.211.11.196:57347
[junit4:junit4]   2> 130 T356 oazs.NIOServerCnxn.finishSessionInit Established session 0x139d29d6d5c0001 with negotiated timeout 10000 for client /140.211.11.196:57347
[junit4:junit4]   2> 130 T360 oaz.ClientCnxn$SendThread.readConnectResult Session establishment complete on server localhost/127.0.0.1:26973, sessionid = 0x139d29d6d5c0001, negotiated timeout = 10000
[junit4:junit4]   2> 130 T361 oascc.ConnectionManager.process Watcher org.apache.solr.common.cloud.ConnectionManager@5f936fc6 name:ZooKeeperConnection Watcher:127.0.0.1:26973/solr got event WatchedEvent state:SyncConnected type:None path:null path:null type:None
[junit4:junit4]   2> 130 T352 oascc.ConnectionManager.waitForConnected Client is connected to ZooKeeper
[junit4:junit4]   2> 131 T352 oascc.SolrZkClient.makePath makePath: /collections/collection1
[junit4:junit4]   2> 141 T352 oascc.SolrZkClient.makePath makePath: /collections/collection1/shards
[junit4:junit4]   2> 145 T352 oascc.SolrZkClient.makePath makePath: /collections/control_collection
[junit4:junit4]   2> 148 T352 oascc.SolrZkClient.makePath makePath: /collections/control_collection/shards
[junit4:junit4]   2> 151 T352 oasc.AbstractZkTestCase.putConfig put /usr/home/hudson/hudson-slave/workspace/Lucene-Solr-Tests-trunk-Java6/solr/build/solr-core/test-files/solr/collection1/conf/solrconfig.xml to /configs/conf1/solrconfig.xml
[junit4:junit4]   2> 153 T352 oascc.SolrZkClient.makePath makePath: /configs/conf1/solrconfig.xml
[junit4:junit4]   2> 167 T352 oasc.AbstractZkTestCase.putConfig put /usr/home/hudson/hudson-slave/workspace/Lucene-Solr-Tests-trunk-Java6/solr/build/solr-core/test-files/solr/collection1/conf/schema.xml to /configs/conf1/schema.xml
[junit4:junit4]   2> 171 T352 oascc.SolrZkClient.makePath makePath: /configs/conf1/schema.xml
[junit4:junit4]   2> 276 T352 oasc.AbstractZkTestCase.putConfig put /usr/home/hudson/hudson-slave/workspace/Lucene-Solr-Tests-trunk-Java6/solr/build/solr-core/test-files/solr/collection1/conf/solrconfig.xml to /configs/conf1/solrconfig.xml
[junit4:junit4]   2> 277 T352 oascc.SolrZkClient.makePath makePath: /configs/conf1/solrconfig.xml
[junit4:junit4]   2> 280 T352 oasc.AbstractZkTestCase.putConfig put /usr/home/hudson/hudson-slave/workspace/Lucene-Solr-Tests-trunk-Java6/solr/build/solr-core/test-files/solr/collection1/conf/stopwords.txt to /configs/conf1/stopwords.txt
[junit4:junit4]   2> 281 T352 oascc.SolrZkClient.makePath makePath: /configs/conf1/stopwords.txt
[junit4:junit4]   2> 297 T352 oasc.AbstractZkTestCase.putConfig put /usr/home/hudson/hudson-slave/workspace/Lucene-Solr-Tests-trunk-Java6/solr/build/solr-core/test-files/solr/collection1/conf/protwords.txt to /configs/conf1/protwords.txt
[junit4:junit4]   2> 298 T352 oascc.SolrZkClient.makePath makePath: /configs/conf1/protwords.txt
[junit4:junit4]   2> 353 T352 oasc.AbstractZkTestCase.putConfig put /usr/home/hudson/hudson-slave/workspace/Lucene-Solr-Tests-trunk-Java6/solr/build/solr-core/test-files/solr/collection1/conf/currency.xml to /configs/conf1/currency.xml
[junit4:junit4]   2> 354 T352 oascc.SolrZkClient.makePath makePath: /configs/conf1/currency.xml
[junit4:junit4]   2> 365 T352 oasc.AbstractZkTestCase.putConfig put /usr/home/hudson/hudson-slave/workspace/Lucene-Solr-Tests-trunk-Java6/solr/build/solr-core/test-files/solr/collection1/conf/open-exchange-rates.json to /configs/conf1/open-exchange-rates.json
[junit4:junit4]   2> 366 T352 oascc.SolrZkClient.makePath makePath: /configs/conf1/open-exchange-rates.json
[junit4:junit4]   2> 373 T352 oasc.AbstractZkTestCase.putConfig put /usr/home/hudson/hudson-slave/workspace/Lucene-Solr-Tests-trunk-Java6/solr/build/solr-core/test-files/solr/collection1/conf/mapping-ISOLatin1Accent.txt to /configs/conf1/mapping-ISOLatin1Accent.txt
[junit4:junit4]   2> 374 T352 oascc.SolrZkClient.makePath makePath: /configs/conf1/mapping-ISOLatin1Accent.txt
[junit4:junit4]   2> 384 T352 oasc.AbstractZkTestCase.putConfig put /usr/home/hudson/hudson-slave/workspace/Lucene-Solr-Tests-trunk-Java6/solr/build/solr-core/test-files/solr/collection1/conf/old_synonyms.txt to /configs/conf1/old_synonyms.txt
[junit4:junit4]   2> 385 T352 oascc.SolrZkClient.makePath makePath: /configs/conf1/old_synonyms.txt
[junit4:junit4]   2> 392 T352 oasc.AbstractZkTestCase.putConfig put /usr/home/hudson/hudson-slave/workspace/Lucene-Solr-Tests-trunk-Java6/solr/build/solr-core/test-files/solr/collection1/conf/synonyms.txt to /configs/conf1/synonyms.txt
[junit4:junit4]   2> 393 T352 oascc.SolrZkClient.makePath makePath: /configs/conf1/synonyms.txt
[junit4:junit4]   2> 402 T357 oazs.PrepRequestProcessor.pRequest Processed session termination for sessionid: 0x139d29d6d5c0001
[junit4:junit4]   2> 413 T361 oaz.ClientCnxn$EventThread.run EventThread shut down
[junit4:junit4]   2> 413 T352 oaz.ZooKeeper.close Session: 0x139d29d6d5c0001 closed
[junit4:junit4]   2> 413 T354 oazs.NIOServerCnxn.closeSock Closed socket connection for client /140.211.11.196:57347 which had sessionid 0x139d29d6d5c0001
[junit4:junit4]   2> 415 T352 oejs.Server.doStart jetty-8.1.2.v20120308
[junit4:junit4]   2> 417 T352 oejs.AbstractConnector.doStart Started SocketConnector@0.0.0.0:45657
[junit4:junit4]   2> 417 T352 oasc.SolrResourceLoader.locateSolrHome JNDI not configured for solr (NoInitialContextEx)
[junit4:junit4]   2> 418 T352 oasc.SolrResourceLoader.locateSolrHome using system property solr.solr.home: /usr/home/hudson/hudson-slave/workspace/Lucene-Solr-Tests-trunk-Java6/solr/build/solr-core/test-files/solr
[junit4:junit4]   2> 418 T352 oasc.SolrResourceLoader.<init> new SolrResourceLoader for deduced Solr Home: '/usr/home/hudson/hudson-slave/workspace/Lucene-Solr-Tests-trunk-Java6/solr/build/solr-core/test-files/solr/'
[junit4:junit4]   2> 440 T352 oass.SolrDispatchFilter.init SolrDispatchFilter.init()
[junit4:junit4]   2> 441 T352 oasc.SolrResourceLoader.locateSolrHome JNDI not configured for solr (NoInitialContextEx)
[junit4:junit4]   2> 441 T352 oasc.SolrResourceLoader.locateSolrHome using system property solr.solr.home: /usr/home/hudson/hudson-slave/workspace/Lucene-Solr-Tests-trunk-Java6/solr/build/solr-core/test-files/solr
[junit4:junit4]   2> 441 T352 oasc.CoreContainer$Initializer.initialize looking for solr.xml: /usr/home/hudson/hudson-slave/workspace/Lucene-Solr-Tests-trunk-Java6/solr/build/solr-core/test-files/solr/solr.xml
[junit4:junit4]   2> 442 T352 oasc.CoreContainer.<init> New CoreContainer 1816670827
[junit4:junit4]   2> 442 T352 oasc.CoreContainer.load Loading CoreContainer using Solr Home: '/usr/home/hudson/hudson-slave/workspace/Lucene-Solr-Tests-trunk-Java6/solr/build/solr-core/test-files/solr/'
[junit4:junit4]   2> 442 T352 oasc.SolrResourceLoader.<init> new SolrResourceLoader for directory: '/usr/home/hudson/hudson-slave/workspace/Lucene-Solr-Tests-trunk-Java6/solr/build/solr-core/test-files/solr/'
[junit4:junit4]   2> 459 T352 oasc.CoreContainer.load Registering Log Listener
[junit4:junit4]   2> 471 T352 oasc.CoreContainer.initZooKeeper Zookeeper client=127.0.0.1:26973/solr
[junit4:junit4]   2> 472 T352 oaz.ZooKeeper.<init> Initiating client connection, connectString=127.0.0.1:26973/solr sessionTimeout=5000 watcher=org.apache.solr.common.cloud.ConnectionManager@2f13f599
[junit4:junit4]   2> 473 T371 oaz.ClientCnxn$SendThread.startConnect Opening socket connection to server /127.0.0.1:26973
[junit4:junit4]   2> 473 T352 oascc.ConnectionManager.waitForConnected Waiting for client to connect to ZooKeeper
[junit4:junit4]   2> 474 T371 oaz.ClientCnxn$SendThread.primeConnection Socket connection established to localhost/127.0.0.1:26973, initiating session
[junit4:junit4]   2> 474 T354 oazs.NIOServerCnxn$Factory.run Accepted socket connection from /140.211.11.196:13102
[junit4:junit4]   2> 474 T354 oazs.NIOServerCnxn.readConnectRequest Client attempting to establish new session at /140.211.11.196:13102
[junit4:junit4]   2> 476 T356 oazs.NIOServerCnxn.finishSessionInit Established session 0x139d29d6d5c0002 with negotiated timeout 5000 for client /140.211.11.196:13102
[junit4:junit4]   2> 476 T371 oaz.ClientCnxn$SendThread.readConnectResult Session establishment complete on server localhost/127.0.0.1:26973, sessionid = 0x139d29d6d5c0002, negotiated timeout = 5000
[junit4:junit4]   2> 477 T372 oascc.ConnectionManager.process Watcher org.apache.solr.common.cloud.ConnectionManager@2f13f599 name:ZooKeeperConnection Watcher:127.0.0.1:26973/solr got event WatchedEvent state:SyncConnected type:None path:null path:null type:None
[junit4:junit4]   2> 477 T352 oascc.ConnectionManager.waitForConnected Client is connected to ZooKeeper
[junit4:junit4]   2> 483 T357 oazs.PrepRequestProcessor.pRequest Got user-level KeeperException when processing sessionid:0x139d29d6d5c0002 type:create cxid:0x2 zxid:0xfffffffffffffffe txntype:unknown reqpath:n/a Error Path:/solr/overseer Error:KeeperErrorCode = NodeExists for /solr/overseer
[junit4:junit4]   2> 489 T352 oascc.SolrZkClient.makePath makePath: /live_nodes
[junit4:junit4]   2> 491 T352 oasc.ZkController.createEphemeralLiveNode Register node as live in ZooKeeper:/live_nodes/127.0.0.1:45657_solr
[junit4:junit4]   2> 491 T357 oazs.PrepRequestProcessor.pRequest Got user-level KeeperException when processing sessionid:0x139d29d6d5c0002 type:delete cxid:0x7 zxid:0xfffffffffffffffe txntype:unknown reqpath:n/a Error Path:/solr/live_nodes/127.0.0.1:45657_solr Error:KeeperErrorCode = NoNode for /solr/live_nodes/127.0.0.1:45657_solr
[junit4:junit4]   2> 493 T352 oascc.SolrZkClient.makePath makePath: /live_nodes/127.0.0.1:45657_solr
[junit4:junit4]   2> 496 T352 oashc.HttpShardHandlerFactory.getParameter Setting socketTimeout to: 0
[junit4:junit4]   2> 496 T352 oashc.HttpShardHandlerFactory.getParameter Setting urlScheme to: http://
[junit4:junit4]   2> 496 T352 oashc.HttpShardHandlerFactory.getParameter Setting connTimeout to: 0
[junit4:junit4]   2> 497 T352 oashc.HttpShardHandlerFactory.getParameter Setting maxConnectionsPerHost to: 20
[junit4:junit4]   2> 497 T352 oashc.HttpShardHandlerFactory.getParameter Setting corePoolSize to: 0
[junit4:junit4]   2> 497 T352 oashc.HttpShardHandlerFactory.getParameter Setting maximumPoolSize to: 2147483647
[junit4:junit4]   2> 498 T352 oashc.HttpShardHandlerFactory.getParameter Setting maxThreadIdleTime to: 5
[junit4:junit4]   2> 498 T352 oashc.HttpShardHandlerFactory.getParameter Setting sizeOfQueue to: -1
[junit4:junit4]   2> 498 T352 oashc.HttpShardHandlerFactory.getParameter Setting fairnessPolicy to: false
[junit4:junit4]   2> 499 T352 oascsi.HttpClientUtil.createClient Creating new http client, config:maxConnectionsPerHost=20&maxConnections=10000&socketTimeout=0&connTimeout=0&retry=false
[junit4:junit4]   2> 512 T352 oascc.SolrZkClient.makePath makePath: /overseer_elect/election
[junit4:junit4]   2> 526 T357 oazs.PrepRequestProcessor.pRequest Got user-level KeeperException when processing sessionid:0x139d29d6d5c0002 type:delete cxid:0x15 zxid:0xfffffffffffffffe txntype:unknown reqpath:n/a Error Path:/solr/overseer_elect/leader Error:KeeperErrorCode = NoNode for /solr/overseer_elect/leader
[junit4:junit4]   2> 527 T352 oascc.SolrZkClient.makePath makePath: /overseer_elect/leader
[junit4:junit4]   2> 529 T352 oasc.Overseer.start Overseer (id=88333241296879618-127.0.0.1:45657_solr-n_0000000000) starting
[junit4:junit4]   2> 530 T357 oazs.PrepRequestProcessor.pRequest Got user-level KeeperException when processing sessionid:0x139d29d6d5c0002 type:create cxid:0x1a zxid:0xfffffffffffffffe txntype:unknown reqpath:n/a Error Path:/solr/overseer Error:KeeperErrorCode = NodeExists for /solr/overseer
[junit4:junit4]   2> 532 T357 oazs.PrepRequestProcessor.pRequest Got user-level KeeperException when processing sessionid:0x139d29d6d5c0002 type:create cxid:0x1b zxid:0xfffffffffffffffe txntype:unknown reqpath:n/a Error Path:/solr/overseer Error:KeeperErrorCode = NodeExists for /solr/overseer
[junit4:junit4]   2> 539 T357 oazs.PrepRequestProcessor.pRequest Got user-level KeeperException when processing sessionid:0x139d29d6d5c0002 type:create cxid:0x1c zxid:0xfffffffffffffffe txntype:unknown reqpath:n/a Error Path:/solr/overseer Error:KeeperErrorCode = NodeExists for /solr/overseer
[junit4:junit4]   2> 541 T357 oazs.PrepRequestProcessor.pRequest Got user-level KeeperException when processing sessionid:0x139d29d6d5c0002 type:create cxid:0x1d zxid:0xfffffffffffffffe txntype:unknown reqpath:n/a Error Path:/solr/overseer Error:KeeperErrorCode = NodeExists for /solr/overseer
[junit4:junit4]   2> 542 T374 oasc.OverseerCollectionProcessor.run Process current queue of collection creations
[junit4:junit4]   2> 543 T352 oascc.SolrZkClient.makePath makePath: /clusterstate.json
[junit4:junit4]   2> 553 T352 oascc.ZkStateReader.createClusterStateWatchersAndUpdate Updating cluster state from ZooKeeper... 
[junit4:junit4]   2> 554 T373 oasc.Overseer$ClusterStateUpdater.run Starting to work on the main queue
[junit4:junit4]   2> 558 T352 oasc.CoreContainer.create Creating SolrCore 'collection1' using instanceDir: /usr/home/hudson/hudson-slave/workspace/Lucene-Solr-Tests-trunk-Java6/solr/build/solr-core/test-files/solr/collection1
[junit4:junit4]   2> 558 T352 oasc.ZkController.createCollectionZkNode Check for collection zkNode:control_collection
[junit4:junit4]   2> 558 T352 oasc.ZkController.createCollectionZkNode Collection zkNode exists
[junit4:junit4]   2> 559 T352 oasc.ZkController.readConfigName Load collection config from:/collections/control_collection
[junit4:junit4]   2> 560 T352 oasc.SolrResourceLoader.<init> new SolrResourceLoader for directory: '/usr/home/hudson/hudson-slave/workspace/Lucene-Solr-Tests-trunk-Java6/solr/build/solr-core/test-files/solr/collection1/'
[junit4:junit4]   2> 561 T352 oasc.SolrResourceLoader.replaceClassLoader Adding 'file:/usr/home/hudson/hudson-slave/workspace/Lucene-Solr-Tests-trunk-Java6/solr/build/solr-core/test-files/solr/collection1/lib/README' to classloader
[junit4:junit4]   2> 562 T352 oasc.SolrResourceLoader.replaceClassLoader Adding 'file:/usr/home/hudson/hudson-slave/workspace/Lucene-Solr-Tests-trunk-Java6/solr/build/solr-core/test-files/solr/collection1/lib/classes/' to classloader
[junit4:junit4]   2> 693 T352 oasc.SolrConfig.<init> Using Lucene MatchVersion: LUCENE_50
[junit4:junit4]   2> 803 T352 oasc.SolrConfig.<init> Loaded SolrConfig: solrconfig.xml
[junit4:junit4]   2> 905 T352 oass.IndexSchema.readSchema Reading Solr Schema
[junit4:junit4]   2> 913 T352 oass.IndexSchema.readSchema Schema name=test
[junit4:junit4]   2> 1573 T352 oass.OpenExchangeRatesOrgProvider.init Initialized with rates=open-exchange-rates.json, refreshInterval=1440.
[junit4:junit4]   2> 1581 T352 oass.IndexSchema.readSchema default search field in schema is text
[junit4:junit4]   2> 1584 T352 oass.IndexSchema.readSchema unique key field: id
[junit4:junit4]   2> 1597 T352 oass.FileExchangeRateProvider.reload Reloading exchange rates from file currency.xml
[junit4:junit4]   2> 1601 T352 oass.FileExchangeRateProvider.reload Reloading exchange rates from file currency.xml
[junit4:junit4]   2> 1604 T352 oass.OpenExchangeRatesOrgProvider.reload Reloading exchange rates from open-exchange-rates.json
[junit4:junit4]   2> 1605 T352 oass.OpenExchangeRatesOrgProvider.reload Reloading exchange rates from open-exchange-rates.json
[junit4:junit4]   2> 1607 T352 oasc.SolrCore.<init> [collection1] Opening new SolrCore at /usr/home/hudson/hudson-slave/workspace/Lucene-Solr-Tests-trunk-Java6/solr/build/solr-core/test-files/solr/collection1/, dataDir=./org.apache.solr.cloud.BasicDistributedZk2Test-1347858296150/control/data/
[junit4:junit4]   2> 1607 T352 oasc.JmxMonitoredMap.<init> JMX monitoring is enabled. Adding Solr mbeans to JMX Server: com.sun.jmx.mbeanserver.JmxMBeanServer@151ff451
[junit4:junit4]   2> 1608 T352 oasc.SolrCore.getNewIndexDir WARNING New index directory detected: old=null new=./org.apache.solr.cloud.BasicDistributedZk2Test-1347858296150/control/data/index/
[junit4:junit4]   2> 1609 T352 oasc.SolrCore.initIndex WARNING [collection1] Solr index directory './org.apache.solr.cloud.BasicDistributedZk2Test-1347858296150/control/data/index' doesn't exist. Creating new index...
[junit4:junit4]   2> 1610 T352 oasc.CachingDirectoryFactory.get return new directory for /usr/home/hudson/hudson-slave/workspace/Lucene-Solr-Tests-trunk-Java6/solr/build/solr-core/test/J1/./org.apache.solr.cloud.BasicDistributedZk2Test-1347858296150/control/data/index forceNew:false
[junit4:junit4]   2> 1615 T352 oasc.SolrDeletionPolicy.onCommit SolrDeletionPolicy.onCommit: commits:num=1
[junit4:junit4]   2> 		commit{dir=NRTCachingDirectory(org.apache.lucene.store.NIOFSDirectory@/usr/home/hudson/hudson-slave/workspace/Lucene-Solr-Tests-trunk-Java6/solr/build/solr-core/test/J1/org.apache.solr.cloud.BasicDistributedZk2Test-1347858296150/control/data/index lockFactory=org.apache.lucene.store.NativeFSLockFactory@502438db; maxCacheMB=48.0 maxMergeSizeMB=4.0),segFN=segments_1,generation=1,filenames=[segments_1]
[junit4:junit4]   2> 1615 T352 oasc.SolrDeletionPolicy.updateCommits newest commit = 1
[junit4:junit4]   2> 1616 T352 oasc.SolrCore.initWriters created xml: solr.XMLResponseWriter
[junit4:junit4]   2> 1618 T352 oasup.UpdateRequestProcessorChain.init inserting DistributedUpdateProcessorFactory into updateRequestProcessorChain "dedupe"
[junit4:junit4]   2> 1618 T352 oasup.UpdateRequestProcessorChain.init inserting DistributedUpdateProcessorFactory into updateRequestProcessorChain "dedupe-allfields"
[junit4:junit4]   2> 1619 T352 oasup.UpdateRequestProcessorChain.init inserting DistributedUpdateProcessorFactory into updateRequestProcessorChain "stored_sig"
[junit4:junit4]   2> 1619 T352 oasup.UpdateRequestProcessorChain.init inserting DistributedUpdateProcessorFactory into updateRequestProcessorChain "uniq-fields"
[junit4:junit4]   2> 1620 T352 oasup.UpdateRequestProcessorChain.init inserting DistributedUpdateProcessorFactory into updateRequestProcessorChain "distrib-dup-test-chain-implicit"
[junit4:junit4]   2> 1620 T352 oasc.RequestHandlers.initHandlersFromConfig adding lazy requestHandler: solr.ReplicationHandler
[junit4:junit4]   2> 1621 T352 oasc.RequestHandlers.initHandlersFromConfig created /replication: solr.ReplicationHandler
[junit4:junit4]   2> 1621 T352 oasc.RequestHandlers.initHandlersFromConfig created standard: solr.StandardRequestHandler
[junit4:junit4]   2> 1622 T352 oasc.RequestHandlers.initHandlersFromConfig created /get: solr.RealTimeGetHandler
[junit4:junit4]   2> 1622 T352 oasc.RequestHandlers.initHandlersFromConfig created dismax: solr.SearchHandler
[junit4:junit4]   2> 1623 T352 oasc.RequestHandlers.initHandlersFromConfig created mock: org.apache.solr.core.MockQuerySenderListenerReqHandler
[junit4:junit4]   2> 1623 T352 oasc.RequestHandlers.initHandlersFromConfig created /admin/: org.apache.solr.handler.admin.AdminHandlers
[junit4:junit4]   2> 1624 T352 oasc.RequestHandlers.initHandlersFromConfig created defaults: solr.StandardRequestHandler
[junit4:junit4]   2> 1624 T352 oasc.RequestHandlers.initHandlersFromConfig adding lazy requestHandler: solr.StandardRequestHandler
[junit4:junit4]   2> 1624 T352 oasc.RequestHandlers.initHandlersFromConfig created lazy: solr.StandardRequestHandler
[junit4:junit4]   2> 1625 T352 oasc.RequestHandlers.initHandlersFromConfig created /update: solr.UpdateRequestHandler
[junit4:junit4]   2> 1625 T352 oasc.RequestHandlers.initHandlersFromConfig created /terms: org.apache.solr.handler.component.SearchHandler
[junit4:junit4]   2> 1626 T352 oasc.RequestHandlers.initHandlersFromConfig created spellCheckCompRH: org.apache.solr.handler.component.SearchHandler
[junit4:junit4]   2> 1626 T352 oasc.RequestHandlers.initHandlersFromConfig created spellCheckCompRH_Direct: org.apache.solr.handler.component.SearchHandler
[junit4:junit4]   2> 1627 T352 oasc.RequestHandlers.initHandlersFromConfig created spellCheckWithWordbreak: org.apache.solr.handler.component.SearchHandler
[junit4:junit4]   2> 1627 T352 oasc.RequestHandlers.initHandlersFromConfig created spellCheckWithWordbreak_Direct: org.apache.solr.handler.component.SearchHandler
[junit4:junit4]   2> 1628 T352 oasc.RequestHandlers.initHandlersFromConfig created spellCheckCompRH1: org.apache.solr.handler.component.SearchHandler
[junit4:junit4]   2> 1628 T352 oasc.RequestHandlers.initHandlersFromConfig created tvrh: org.apache.solr.handler.component.SearchHandler
[junit4:junit4]   2> 1628 T352 oasc.RequestHandlers.initHandlersFromConfig created /mlt: solr.MoreLikeThisHandler
[junit4:junit4]   2> 1629 T352 oasc.RequestHandlers.initHandlersFromConfig created /debug/dump: solr.DumpRequestHandler
[junit4:junit4]   2> 1631 T352 oashl.XMLLoader.init xsltCacheLifetimeSeconds=60
[junit4:junit4]   2> 1635 T352 oasc.SolrCore.initDeprecatedSupport WARNING solrconfig.xml uses deprecated <admin/gettableFiles>, Please update your config to use the ShowFileRequestHandler.
[junit4:junit4]   2> 1636 T352 oasc.SolrCore.initDeprecatedSupport WARNING adding ShowFileRequestHandler with hidden files: [SCHEMA.XML, OLD_SYNONYMS.TXT, STOPWORDS.TXT, PROTWORDS.TXT, OPEN-EXCHANGE-RATES.JSON, SYNONYMS.TXT, CURRENCY.XML, MAPPING-ISOLATIN1ACCENT.TXT]
[junit4:junit4]   2> 1639 T352 oass.SolrIndexSearcher.<init> Opening Searcher@27ad0ff8 main
[junit4:junit4]   2> 1640 T352 oasu.CommitTracker.<init> Hard AutoCommit: disabled
[junit4:junit4]   2> 1641 T352 oasu.CommitTracker.<init> Soft AutoCommit: disabled
[junit4:junit4]   2> 1641 T352 oashc.SpellCheckComponent.inform Initializing spell checkers
[junit4:junit4]   2> 1655 T352 oass.DirectSolrSpellChecker.init init: {name=direct,classname=DirectSolrSpellChecker,field=lowerfilt,minQueryLength=3}
[junit4:junit4]   2> 1747 T375 oasc.SolrCore.registerSearcher [collection1] Registered new searcher Searcher@27ad0ff8 main{StandardDirectoryReader(segments_1:1)}
[junit4:junit4]   2> 1751 T357 oazs.PrepRequestProcessor.pRequest Got user-level KeeperException when processing sessionid:0x139d29d6d5c0002 type:create cxid:0x56 zxid:0xfffffffffffffffe txntype:unknown reqpath:n/a Error Path:/solr/overseer/queue Error:KeeperErrorCode = NoNode for /solr/overseer/queue
[junit4:junit4]   2> 1776 T352 oasc.CoreContainer.register registering core: collection1
[junit4:junit4]   2> 1776 T352 oasc.ZkController.register Register shard - core:collection1 address:http://127.0.0.1:45657/solr shardId:control_shard
[junit4:junit4]   2> 1777 T352 oascc.SolrZkClient.makePath makePath: /collections/control_collection/leader_elect/control_shard/election
[junit4:junit4]   2> 1801 T357 oazs.PrepRequestProcessor.pRequest Got user-level KeeperException when processing sessionid:0x139d29d6d5c0002 type:delete cxid:0x65 zxid:0xfffffffffffffffe txntype:unknown reqpath:n/a Error Path:/solr/collections/control_collection/leaders Error:KeeperErrorCode = NoNode for /solr/collections/control_collection/leaders
[junit4:junit4]   2> 1803 T352 oasc.ShardLeaderElectionContext.runLeaderProcess Running the leader process.
[junit4:junit4]   2> 1803 T357 oazs.PrepRequestProcessor.pRequest Got user-level KeeperException when processing sessionid:0x139d29d6d5c0002 type:create cxid:0x66 zxid:0xfffffffffffffffe txntype:unknown reqpath:n/a Error Path:/solr/overseer Error:KeeperErrorCode = NodeExists for /solr/overseer
[junit4:junit4]   2> 2063 T373 oascc.ZkStateReader.updateClusterState Updating cloud state from ZooKeeper... 
[junit4:junit4]   2> 2064 T357 oazs.PrepRequestProcessor.pRequest Got user-level KeeperException when processing sessionid:0x139d29d6d5c0002 type:create cxid:0x6d zxid:0xfffffffffffffffe txntype:unknown reqpath:n/a Error Path:/solr/overseer/queue-work Error:KeeperErrorCode = NoNode for /solr/overseer/queue-work
[junit4:junit4]   2> 2120 T372 oascc.ZkStateReader$2.process A cluster state change has occurred - updating...
[junit4:junit4]   2> 2314 T352 oasc.ShardLeaderElectionContext.waitForReplicasToComeUp Enough replicas found to continue.
[junit4:junit4]   2> 2315 T352 oasc.ShardLeaderElectionContext.runLeaderProcess I may be the new leader - try and sync
[junit4:junit4]   2> 2316 T352 oasc.SyncStrategy.sync Sync replicas to http://127.0.0.1:45657/solr/collection1/
[junit4:junit4]   2> 2316 T352 oasc.SyncStrategy.syncReplicas Sync Success - now sync replicas to me
[junit4:junit4]   2> 2317 T352 oasc.SyncStrategy.syncToMe http://127.0.0.1:45657/solr/collection1/ has no replicas
[junit4:junit4]   2> 2317 T352 oasc.ShardLeaderElectionContext.runLeaderProcess I am the new leader: http://127.0.0.1:45657/solr/collection1/
[junit4:junit4]   2> 2318 T352 oascc.SolrZkClient.makePath makePath: /collections/control_collection/leaders/control_shard
[junit4:junit4]   2> 2337 T357 oazs.PrepRequestProcessor.pRequest Got user-level KeeperException when processing sessionid:0x139d29d6d5c0002 type:create cxid:0x8b zxid:0xfffffffffffffffe txntype:unknown reqpath:n/a Error Path:/solr/overseer Error:KeeperErrorCode = NodeExists for /solr/overseer
[junit4:junit4]   2> 2646 T373 oascc.ZkStateReader.updateClusterState Updating cloud state from ZooKeeper... 
[junit4:junit4]   2> 2681 T372 oascc.ZkStateReader$2.process A cluster state change has occurred - updating...
[junit4:junit4]   2> 2708 T352 oasc.ZkController.register We are http://127.0.0.1:45657/solr/collection1/ and leader is http://127.0.0.1:45657/solr/collection1/
[junit4:junit4]   2> 2708 T352 oasc.ZkController.register No LogReplay needed for core=collection1 baseURL=http://127.0.0.1:45657/solr
[junit4:junit4]   2> 2709 T352 oasc.ZkController.checkRecovery I am the leader, no recovery necessary
[junit4:junit4]   2> 2711 T352 oascc.ZkStateReader.updateClusterState Updating cloud state from ZooKeeper... 
[junit4:junit4]   2> 2712 T352 oass.SolrDispatchFilter.init user.dir=/usr/home/hudson/hudson-slave/workspace/Lucene-Solr-Tests-trunk-Java6/solr/build/solr-core/test/J1
[junit4:junit4]   2> 2712 T352 oass.SolrDispatchFilter.init SolrDispatchFilter.init() done
[junit4:junit4]   2> 2713 T352 oascsi.HttpClientUtil.createClient Creating new http client, config:maxConnections=128&maxConnectionsPerHost=32&followRedirects=false
[junit4:junit4]   2> 2932 T352 oejs.Server.doStart jetty-8.1.2.v20120308
[junit4:junit4]   2> 2935 T352 oejs.AbstractConnector.doStart Started SocketConnector@0.0.0.0:44526
[junit4:junit4]   2> 2936 T352 oasc.SolrResourceLoader.locateSolrHome JNDI not configured for solr (NoInitialContextEx)
[junit4:junit4]   2> 2936 T352 oasc.SolrResourceLoader.locateSolrHome using system property solr.solr.home: /usr/home/hudson/hudson-slave/workspace/Lucene-Solr-Tests-trunk-Java6/solr/build/solr-core/test/J1/./solrtest-jetty1-1347858298874
[junit4:junit4]   2> 2937 T352 oasc.SolrResourceLoader.<init> new SolrResourceLoader for deduced Solr Home: '/usr/home/hudson/hudson-slave/workspace/Lucene-Solr-Tests-trunk-Java6/solr/build/solr-core/test/J1/./solrtest-jetty1-1347858298874/'
[junit4:junit4]   2> 2980 T352 oass.SolrDispatchFilter.init SolrDispatchFilter.init()
[junit4:junit4]   2> 2981 T352 oasc.SolrResourceLoader.locateSolrHome JNDI not configured for solr (NoInitialContextEx)
[junit4:junit4]   2> 2981 T352 oasc.SolrResourceLoader.locateSolrHome using system property solr.solr.home: /usr/home/hudson/hudson-slave/workspace/Lucene-Solr-Tests-trunk-Java6/solr/build/solr-core/test/J1/./solrtest-jetty1-1347858298874
[junit4:junit4]   2> 2982 T352 oasc.CoreContainer$Initializer.initialize looking for solr.xml: /usr/home/hudson/hudson-slave/workspace/Lucene-Solr-Tests-trunk-Java6/solr/build/solr-core/test/J1/./solrtest-jetty1-1347858298874/solr.xml
[junit4:junit4]   2> 2982 T352 oasc.CoreContainer.<init> New CoreContainer 219829048
[junit4:junit4]   2> 2983 T352 oasc.CoreContainer.load Loading CoreContainer using Solr Home: '/usr/home/hudson/hudson-slave/workspace/Lucene-Solr-Tests-trunk-Java6/solr/build/solr-core/test/J1/./solrtest-jetty1-1347858298874/'
[junit4:junit4]   2> 2983 T352 oasc.SolrResourceLoader.<init> new SolrResourceLoader for directory: '/usr/home/hudson/hudson-slave/workspace/Lucene-Solr-Tests-trunk-Java6/solr/build/solr-core/test/J1/./solrtest-jetty1-1347858298874/'
[junit4:junit4]   2> 3009 T352 oasc.CoreContainer.load Registering Log Listener
[junit4:junit4]   2> 3024 T352 oasc.CoreContainer.initZooKeeper Zookeeper client=127.0.0.1:26973/solr
[junit4:junit4]   2> 3025 T352 oaz.ZooKeeper.<init> Initiating client connection, connectString=127.0.0.1:26973/solr sessionTimeout=5000 watcher=org.apache.solr.common.cloud.ConnectionManager@5f2c402a
[junit4:junit4]   2> 3026 T385 oaz.ClientCnxn$SendThread.startConnect Opening socket connection to server /127.0.0.1:26973
[junit4:junit4]   2> 3026 T352 oascc.ConnectionManager.waitForConnected Waiting for client to connect to ZooKeeper
[junit4:junit4]   2> 3027 T385 oaz.ClientCnxn$SendThread.primeConnection Socket connection established to localhost/127.0.0.1:26973, initiating session
[junit4:junit4]   2> 3027 T354 oazs.NIOServerCnxn$Factory.run Accepted socket connection from /140.211.11.196:50315
[junit4:junit4]   2> 3028 T354 oazs.NIOServerCnxn.readConnectRequest Client attempting to establish new session at /140.211.11.196:50315
[junit4:junit4]   2> 3032 T356 oazs.NIOServerCnxn.finishSessionInit Established session 0x139d29d6d5c0003 with negotiated timeout 5000 for client /140.211.11.196:50315
[junit4:junit4]   2> 3032 T385 oaz.ClientCnxn$SendThread.readConnectResult Session establishment complete on server localhost/127.0.0.1:26973, sessionid = 0x139d29d6d5c0003, negotiated timeout = 5000
[junit4:junit4]   2> 3033 T386 oascc.ConnectionManager.process Watcher org.apache.solr.common.cloud.ConnectionManager@5f2c402a name:ZooKeeperConnection Watcher:127.0.0.1:26973/solr got event WatchedEvent state:SyncConnected type:None path:null path:null type:None
[junit4:junit4]   2> 3033 T352 oascc.ConnectionManager.waitForConnected Client is connected to ZooKeeper
[junit4:junit4]   2> 3034 T357 oazs.PrepRequestProcessor.pRequest Got user-level KeeperException when processing sessionid:0x139d29d6d5c0003 type:create cxid:0x1 zxid:0xfffffffffffffffe txntype:unknown reqpath:n/a Error Path:/solr/overseer Error:KeeperErrorCode = NodeExists for /solr/overseer
[junit4:junit4]   2> 3043 T357 oazs.PrepRequestProcessor.pRequest Got user-level KeeperException when processing sessionid:0x139d29d6d5c0003 type:create cxid:0x2 zxid:0xfffffffffffffffe txntype:unknown reqpath:n/a Error Path:/solr/overseer Error:KeeperErrorCode = NodeExists for /solr/overseer
[junit4:junit4]   2> 3052 T352 oasc.ZkController.createEphemeralLiveNode Register node as live in ZooKeeper:/live_nodes/127.0.0.1:44526_solr
[junit4:junit4]   2> 3053 T357 oazs.PrepRequestProcessor.pRequest Got user-level KeeperException when processing sessionid:0x139d29d6d5c0003 type:delete cxid:0x4 zxid:0xfffffffffffffffe txntype:unknown reqpath:n/a Error Path:/solr/live_nodes/127.0.0.1:44526_solr Error:KeeperErrorCode = NoNode for /solr/live_nodes/127.0.0.1:44526_solr
[junit4:junit4]   2> 3062 T352 oascc.SolrZkClient.makePath makePath: /live_nodes/127.0.0.1:44526_solr
[junit4:junit4]   2> 3064 T372 oascc.ZkStateReader$3.process Updating live nodes
[junit4:junit4]   2> 3065 T352 oashc.HttpShardHandlerFactory.getParameter Setting socketTimeout to: 0
[junit4:junit4]   2> 3066 T352 oashc.HttpShardHandlerFactory.getParameter Setting urlScheme to: http://
[junit4:junit4]   2> 3066 T352 oashc.HttpShardHandlerFactory.getParameter Setting connTimeout to: 0
[junit4:junit4]   2> 3067 T352 oashc.HttpShardHandlerFactory.getParameter Setting maxConnectionsPerHost to: 20
[junit4:junit4]   2> 3067 T352 oashc.HttpShardHandlerFactory.getParameter Setting corePoolSize to: 0
[junit4:junit4]   2> 3068 T352 oashc.HttpShardHandlerFactory.getParameter Setting maximumPoolSize to: 2147483647
[junit4:junit4]   2> 3068 T352 oashc.HttpShardHandlerFactory.getParameter Setting maxThreadIdleTime to: 5
[junit4:junit4]   2> 3069 T352 oashc.HttpShardHandlerFactory.getParameter Setting sizeOfQueue to: -1
[junit4:junit4]   2> 3069 T352 oashc.HttpShardHandlerFactory.getParameter Setting fairnessPolicy to: false
[junit4:junit4]   2> 3070 T352 oascsi.HttpClientUtil.createClient Creating new http client, config:maxConnectionsPerHost=20&maxConnections=10000&socketTimeout=0&connTimeout=0&retry=false
[junit4:junit4]   2> 3089 T352 oascc.ZkStateReader.createClusterStateWatchersAndUpdate Updating cluster state from ZooKeeper... 
[junit4:junit4]   2> 3096 T352 oasc.CoreContainer.create Creating SolrCore 'collection1' using instanceDir: /usr/home/hudson/hudson-slave/workspace/Lucene-Solr-Tests-trunk-Java6/solr/build/solr-core/test/J1/./solrtest-jetty1-1347858298874/collection1
[junit4:junit4]   2> 3097 T352 oasc.ZkController.createCollectionZkNode Check for collection zkNode:collection1
[junit4:junit4]   2> 3098 T352 oasc.ZkController.createCollectionZkNode Collection zkNode exists
[junit4:junit4]   2> 3098 T352 oasc.ZkController.readConfigName Load collection config from:/collections/collection1
[junit4:junit4]   2> 3100 T352 oasc.SolrResourceLoader.<init> new SolrResourceLoader for directory: '/usr/home/hudson/hudson-slave/workspace/Lucene-Solr-Tests-trunk-Java6/solr/build/solr-core/test/J1/./solrtest-jetty1-1347858298874/collection1/'
[junit4:junit4]   2> 3101 T352 oasc.SolrResourceLoader.replaceClassLoader Adding 'file:/usr/home/hudson/hudson-slave/workspace/Lucene-Solr-Tests-trunk-Java6/solr/build/solr-core/test/J1/solrtest-jetty1-1347858298874/collection1/lib/README' to classloader
[junit4:junit4]   2> 3102 T352 oasc.SolrResourceLoader.replaceClassLoader Adding 'file:/usr/home/hudson/hudson-slave/workspace/Lucene-Solr-Tests-trunk-Java6/solr/build/solr-core/test/J1/solrtest-jetty1-1347858298874/collection1/lib/classes/' to classloader
[junit4:junit4]   2> 3175 T352 oasc.SolrConfig.<init> Using Lucene MatchVersion: LUCENE_50
[junit4:junit4]   2> 3186 T373 oascc.ZkStateReader.updateClusterState Updating cloud state from ZooKeeper... 
[junit4:junit4]   2> 3214 T372 oascc.ZkStateReader$2.process A cluster state change has occurred - updating...
[junit4:junit4]   2> 3214 T386 oascc.ZkStateReader$2.process A cluster state change has occurred - updating...
[junit4:junit4]   2> 3248 T352 oasc.SolrConfig.<init> Loaded SolrConfig: solrconfig.xml
[junit4:junit4]   2> 3349 T352 oass.IndexSchema.readSchema Reading Solr Schema
[junit4:junit4]   2> 3357 T352 oass.IndexSchema.readSchema Schema name=test
[junit4:junit4]   2> 4067 T352 oass.OpenExchangeRatesOrgProvider.init Initialized with rates=open-exchange-rates.json, refreshInterval=1440.
[junit4:junit4]   2> 4075 T352 oass.IndexSchema.readSchema default search field in schema is text
[junit4:junit4]   2> 4078 T352 oass.IndexSchema.readSchema unique key field: id
[junit4:junit4]   2> 4093 T352 oass.FileExchangeRateProvider.reload Reloading exchange rates from file currency.xml
[junit4:junit4]   2> 4097 T352 oass.FileExchangeRateProvider.reload Reloading exchange rates from file currency.xml
[junit4:junit4]   2> 4101 T352 oass.OpenExchangeRatesOrgProvider.reload Reloading exchange rates from open-exchange-rates.json
[junit4:junit4]   2> 4102 T352 oass.OpenExchangeRatesOrgProvider.reload Reloading exchange rates from open-exchange-rates.json
[junit4:junit4]   2> 4104 T352 oasc.SolrCore.<init> [collection1] Opening new SolrCore at /usr/home/hudson/hudson-slave/workspace/Lucene-Solr-Tests-trunk-Java6/solr/build/solr-core/test/J1/./solrtest-jetty1-1347858298874/collection1/, dataDir=./org.apache.solr.cloud.BasicDistributedZk2Test-1347858296150/jetty1/
[junit4:junit4]   2> 4104 T352 oasc.JmxMonitoredMap.<init> JMX monitoring is enabled. Adding Solr mbeans to JMX Server: com.sun.jmx.mbeanserver.JmxMBeanServer@151ff451
[junit4:junit4]   2> 4105 T352 oasc.SolrCore.getNewIndexDir WARNING New index directory detected: old=null new=./org.apache.solr.cloud.BasicDistributedZk2Test-1347858296150/jetty1/index/
[junit4:junit4]   2> 4106 T352 oasc.SolrCore.initIndex WARNING [collection1] Solr index directory './org.apache.solr.cloud.BasicDistributedZk2Test-1347858296150/jetty1/index' doesn't exist. Creating new index...
[junit4:junit4]   2> 4107 T352 oasc.CachingDirectoryFactory.get return new directory for /usr/home/hudson/hudson-slave/workspace/Lucene-Solr-Tests-trunk-Java6/solr/build/solr-core/test/J1/./org.apache.solr.cloud.BasicDistributedZk2Test-1347858296150/jetty1/index forceNew:false
[junit4:junit4]   2> 4125 T352 oasc.SolrDeletionPolicy.onCommit SolrDeletionPolicy.onCommit: commits:num=1
[junit4:junit4]   2> 		commit{dir=NRTCachingDirectory(org.apache.lucene.store.NIOFSDirectory@/usr/home/hudson/hudson-slave/workspace/Lucene-Solr-Tests-trunk-Java6/solr/build/solr-core/test/J1/org.apache.solr.cloud.BasicDistributedZk2Test-1347858296150/jetty1/index lockFactory=org.apache.lucene.store.NativeFSLockFactory@2f72c80f; maxCacheMB=48.0 maxMergeSizeMB=4.0),segFN=segments_1,generation=1,filenames=[segments_1]
[junit4:junit4]   2> 4126 T352 oasc.SolrDeletionPolicy.updateCommits newest commit = 1
[junit4:junit4]   2> 4127 T352 oasc.SolrCore.initWriters created xml: solr.XMLResponseWriter
[junit4:junit4]   2> 4129 T352 oasup.UpdateRequestProcessorChain.init inserting DistributedUpdateProcessorFactory into updateRequestProcessorChain "dedupe"
[junit4:junit4]   2> 4129 T352 oasup.UpdateRequestProcessorChain.init inserting DistributedUpdateProcessorFactory into updateRequestProcessorChain "dedupe-allfields"
[junit4:junit4]   2> 4129 T352 oasup.UpdateRequestProcessorChain.init inserting DistributedUpdateProcessorFactory into updateRequestProcessorChain "stored_sig"
[junit4:junit4]   2> 4130 T352 oasup.UpdateRequestProcessorChain.init inserting DistributedUpdateProcessorFactory into updateRequestProcessorChain "uniq-fields"
[junit4:junit4]   2> 4130 T352 oasup.UpdateRequestProcessorChain.init inserting DistributedUpdateProcessorFactory into updateRequestProcessorChain "distrib-dup-test-chain-implicit"
[junit4:junit4]   2> 4131 T352 oasc.RequestHandlers.initHandlersFromConfig adding lazy requestHandler: solr.ReplicationHandler
[junit4:junit4]   2> 4131 T352 oasc.RequestHandlers.initHandlersFromConfig created /replication: solr.ReplicationHandler
[junit4:junit4]   2> 4132 T352 oasc.RequestHandlers.initHandlersFromConfig created standard: solr.StandardRequestHandler
[junit4:junit4]   2> 4132 T352 oasc.RequestHandlers.initHandlersFromConfig created /get: solr.RealTimeGetHandler
[junit4:junit4]   2> 4133 T352 oasc.RequestHandlers.initHandlersFromConfig created dismax: solr.SearchHandler
[junit4:junit4]   2> 4133 T352 oasc.RequestHandlers.initHandlersFromConfig created mock: org.apache.solr.core.MockQuerySenderListenerReqHandler
[junit4:junit4]   2> 4134 T352 oasc.RequestHandlers.initHandlersFromConfig created /admin/: org.apache.solr.handler.admin.AdminHandlers
[junit4:junit4]   2> 4134 T352 oasc.RequestHandlers.initHandlersFromConfig created defaults: solr.StandardRequestHandler
[junit4:junit4]   2> 4135 T352 oasc.RequestHandlers.initHandlersFromConfig adding lazy requestHandler: solr.StandardRequestHandler
[junit4:junit4]   2> 4135 T352 oasc.RequestHandlers.initHandlersFromConfig created lazy: solr.StandardRequestHandler
[junit4:junit4]   2> 4136 T352 oasc.RequestHandlers.initHandlersFromConfig created /update: solr.UpdateRequestHandler
[junit4:junit4]   2> 4136 T352 oasc.RequestHandlers.initHandlersFromConfig created /terms: org.apache.solr.handler.component.SearchHandler
[junit4:junit4]   2> 4137 T352 oasc.RequestHandlers.initHandlersFromConfig created spellCheckCompRH: org.apache.solr.handler.component.SearchHandler
[junit4:junit4]   2> 4138 T352 oasc.RequestHandlers.initHandlersFromConfig created spellCheckCompRH_Direct: org.apache.solr.handler.component.SearchHandler
[junit4:junit4]   2> 4138 T352 oasc.RequestHandlers.initHandlersFromConfig created spellCheckWithWordbreak: org.apache.solr.handler.component.SearchHandler
[junit4:junit4]   2> 4139 T352 oasc.RequestHandlers.initHandlersFromConfig created spellCheckWithWordbreak_Direct: org.apache.solr.handler.component.SearchHandler
[junit4:junit4]   2> 4139 T352 oasc.RequestHandlers.initHandlersFromConfig created spellCheckCompRH1: org.apache.solr.handler.component.SearchHandler
[junit4:junit4]   2> 4140 T352 oasc.RequestHandlers.initHandlersFromConfig created tvrh: org.apache.solr.handler.component.SearchHandler
[junit4:junit4]   2> 4140 T352 oasc.RequestHandlers.initHandlersFromConfig created /mlt: solr.MoreLikeThisHandler
[junit4:junit4]   2> 4141 T352 oasc.RequestHandlers.initHandlersFromConfig created /debug/dump: solr.DumpRequestHandler
[junit4:junit4]   2> 4143 T352 oashl.XMLLoader.init xsltCacheLifetimeSeconds=60
[junit4:junit4]   2> 4147 T352 oasc.SolrCore.initDeprecatedSupport WARNING solrconfig.xml uses deprecated <admin/gettableFiles>, Please update your config to use the ShowFileRequestHandler.
[junit4:junit4]   2> 4148 T352 oasc.SolrCore.initDeprecatedSupport WARNING adding ShowFileRequestHandler with hidden files: [SCHEMA.XML, OLD_SYNONYMS.TXT, STOPWORDS.TXT, PROTWORDS.TXT, OPEN-EXCHANGE-RATES.JSON, SYNONYMS.TXT, CURRENCY.XML, MAPPING-ISOLATIN1ACCENT.TXT]
[junit4:junit4]   2> 4151 T352 oass.SolrIndexSearcher.<init> Opening Searcher@734ee775 main
[junit4:junit4]   2> 4152 T352 oasu.CommitTracker.<init> Hard AutoCommit: disabled
[junit4:junit4]   2> 4152 T352 oasu.CommitTracker.<init> Soft AutoCommit: disabled
[junit4:junit4]   2> 4152 T352 oashc.SpellCheckComponent.inform Initializing spell checkers
[junit4:junit4]   2> 4166 T352 oass.DirectSolrSpellChecker.init init: {name=direct,classname=DirectSolrSpellChecker,field=lowerfilt,minQueryLength=3}
[junit4:junit4]   2> 4220 T387 oasc.SolrCore.registerSearcher [collection1] Registered new searcher Searcher@734ee775 main{StandardDirectoryReader(segments_1:1)}
[junit4:junit4]   2> 4226 T373 oascc.ZkStateReader.updateClusterState Updating cloud state from ZooKeeper... 
[junit4:junit4]   2> 4239 T386 oascc.ZkStateReader$2.process A cluster state change has occurred - updating...
[junit4:junit4]   2> 4239 T372 oascc.ZkStateReader$2.process A cluster state change has occurred - updating...
[junit4:junit4]   2> 4725 T352 oasc.CoreContainer.register registering core: collection1
[junit4:junit4]   2> 4725 T352 oasc.ZkController.register Register shard - core:collection1 address:http://127.0.0.1:44526/solr shardId:shard1
[junit4:junit4]   2> 4727 T352 oascc.SolrZkClient.makePath makePath: /collections/collection1/leader_elect/shard1/election
[junit4:junit4]   2> 4759 T357 oazs.PrepRequestProcessor.pRequest Got user-level KeeperException when processing sessionid:0x139d29d6d5c0003 type:delete cxid:0x43 zxid:0xfffffffffffffffe txntype:unknown reqpath:n/a Error Path:/solr/collections/collection1/leaders Error:KeeperErrorCode = NoNode for /solr/collections/collection1/leaders
[junit4:junit4]   2> 4767 T352 oasc.ShardLeaderElectionContext.runLeaderProcess Running the leader process.
[junit4:junit4]   2> 4768 T357 oazs.PrepRequestProcessor.pRequest Got user-level KeeperException when processing sessionid:0x139d29d6d5c0003 type:create cxid:0x44 zxid:0xfffffffffffffffe txntype:unknown reqpath:n/a Error Path:/solr/overseer Error:KeeperErrorCode = NodeExists for /solr/overseer
[junit4:junit4]   2> 4786 T352 oasc.ShardLeaderElectionContext.waitForReplicasToComeUp Enough replicas found to continue.
[junit4:junit4]   2> 4787 T352 oasc.ShardLeaderElectionContext.runLeaderProcess I may be the new leader - try and sync
[junit4:junit4]   2> 4787 T352 oasc.SyncStrategy.sync Sync replicas to http://127.0.0.1:44526/solr/collection1/
[junit4:junit4]   2> 4788 T352 oasc.SyncStrategy.syncReplicas Sync Success - now sync replicas to me
[junit4:junit4]   2> 4788 T352 oasc.SyncStrategy.syncToMe http://127.0.0.1:44526/solr/collection1/ has no replicas
[junit4:junit4]   2> 4789 T352 oasc.ShardLeaderElectionContext.runLeaderProcess I am the new leader: http://127.0.0.1:44526/solr/collection1/
[junit4:junit4]   2> 4789 T352 oascc.SolrZkClient.makePath makePath: /collections/collection1/leaders/shard1
[junit4:junit4]   2> 4809 T357 oazs.PrepRequestProcessor.pRequest Got user-level KeeperException when processing sessionid:0x139d29d6d5c0003 type:create cxid:0x4e zxid:0xfffffffffffffffe txntype:unknown reqpath:n/a Error Path:/solr/overseer Error:KeeperErrorCode = NodeExists for /solr/overseer
[junit4:junit4]   2> 5262 T373 oascc.ZkStateReader.updateClusterState Updating cloud state from ZooKeeper... 
[junit4:junit4]   2> 5293 T372 oascc.ZkStateReader$2.process A cluster state change has occurred - updating...
[junit4:junit4]   2> 5293 T386 oascc.ZkStateReader$2.process A cluster state change has occurred - updating...
[junit4:junit4]   2> 5338 T352 oasc.ZkController.register We are http://127.0.0.1:44526/solr/collection1/ and leader is http://127.0.0.1:44526/solr/collection1/
[junit4:junit4]   2> 5338 T352 oasc.ZkController.register No LogReplay needed for core=collection1 baseURL=http://127.0.0.1:44526/solr
[junit4:junit4]   2> 5339 T352 oasc.ZkController.checkRecovery I am the leader, no recovery necessary
[junit4:junit4]   2> 5341 T352 oascc.ZkStateReader.updateClusterState Updating cloud state from ZooKeeper... 
[junit4:junit4]   2> 5343 T352 oass.SolrDispatchFilter.init user.dir=/usr/home/hudson/hudson-slave/workspace/Lucene-Solr-Tests-trunk-Java6/solr/build/solr-core/test/J1
[junit4:junit4]   2> 5343 T352 oass.SolrDispatchFilter.init SolrDispatchFilter.init() done
[junit4:junit4]   2> 5344 T352 oascsi.HttpClientUtil.createClient Creating new http client, config:maxConnections=128&maxConnectionsPerHost=32&followRedirects=false
[junit4:junit4]   2> 5540 T352 oejs.Server.doStart jetty-8.1.2.v20120308
[junit4:junit4]   2> 5543 T352 oejs.AbstractConnector.doStart Started SocketConnector@0.0.0.0:63596
[junit4:junit4]   2> 5544 T352 oasc.SolrResourceLoader.locateSolrHome JNDI not configured for solr (NoInitialContextEx)
[junit4:junit4]   2> 5544 T352 oasc.SolrResourceLoader.locateSolrHome using system property solr.solr.home: /usr/home/hudson/hudson-slave/workspace/Lucene-Solr-Tests-trunk-Java6/solr/build/solr-core/test/J1/./solrtest-jetty2-1347858301506
[junit4:junit4]   2> 5545 T352 oasc.SolrResourceLoader.<init> new SolrResourceLoader for deduced Solr Home: '/usr/home/hudson/hudson-slave/workspace/Lucene-Solr-Tests-trunk-Java6/solr/build/solr-core/test/J1/./solrtest-jetty2-1347858301506/'
[junit4:junit4]   2> 5581 T352 oass.SolrDispatchFilter.init SolrDispatchFilter.init()
[junit4:junit4]   2> 5582 T352 oasc.SolrResourceLoader.locateSolrHome JNDI not configured for solr (NoInitialContextEx)
[junit4:junit4]   2> 5583 T352 oasc.SolrResourceLoader.locateSolrHome using system property solr.solr.home: /usr/home/hudson/hudson-slave/workspace/Lucene-Solr-Tests-trunk-Java6/solr/build/solr-core/test/J1/./solrtest-jetty2-1347858301506
[junit4:junit4]   2> 5583 T352 oasc.CoreContainer$Initializer.initialize looking for solr.xml: /usr/home/hudson/hudson-slave/workspace/Lucene-Solr-Tests-trunk-Java6/solr/build/solr-core/test/J1/./solrtest-jetty2-1347858301506/solr.xml
[junit4:junit4]   2> 5583 T352 oasc.CoreContainer.<init> New CoreContainer 779896587
[junit4:junit4]   2> 5584 T352 oasc.CoreContainer.load Loading CoreContainer using Solr Home: '/usr/home/hudson/hudson-slave/workspace/Lucene-Solr-Tests-trunk-Java6/solr/build/solr-core/test/J1/./solrtest-jetty2-1347858301506/'
[junit4:junit4]   2> 5585 T352 oasc.SolrResourceLoader.<init> new SolrResourceLoader for directory: '/usr/home/hudson/hudson-slave/workspace/Lucene-Solr-Tests-trunk-Java6/solr/build/solr-core/test/J1/./solrtest-jetty2-1347858301506/'
[junit4:junit4]   2> 5613 T352 oasc.CoreContainer.load Registering Log Listener
[junit4:junit4]   2> 5631 T352 oasc.CoreContainer.initZooKeeper Zookeeper client=127.0.0.1:26973/solr
[junit4:junit4]   2> 5632 T352 oaz.ZooKeeper.<init> Initiating client connection, connectString=127.0.0.1:26973/solr sessionTimeout=5000 watcher=org.apache.solr.common.cloud.ConnectionManager@466b56b
[junit4:junit4]   2> 5633 T397 oaz.ClientCnxn$SendThread.startConnect Opening socket connection to server /127.0.0.1:26973
[junit4:junit4]   2> 5633 T352 oascc.ConnectionManager.waitForConnected Waiting for client to connect to ZooKeeper
[junit4:junit4]   2> 5634 T397 oaz.ClientCnxn$SendThread.primeConnection Socket connection established to localhost/127.0.0.1:26973, initiating session
[junit4:junit4]   2> 5634 T354 oazs.NIOServerCnxn$Factory.run Accepted socket connection from /140.211.11.196:47510
[junit4:junit4]   2> 5635 T354 oazs.NIOServerCnxn.readConnectRequest Client attempting to establish new session at /140.211.11.196:47510
[junit4:junit4]   2> 5637 T356 oazs.NIOServerCnxn.finishSessionInit Established session 0x139d29d6d5c0004 with negotiated timeout 5000 for client /140.211.11.196:47510
[junit4:junit4]   2> 5637 T397 oaz.ClientCnxn$SendThread.readConnectResult Session establishment complete on server localhost/127.0.0.1:26973, sessionid = 0x139d29d6d5c0004, negotiated timeout = 5000
[junit4:junit4]   2> 5637 T398 oascc.ConnectionManager.process Watcher org.apache.solr.common.cloud.ConnectionManager@466b56b name:ZooKeeperConnection Watcher:127.0.0.1:26973/solr got event WatchedEvent state:SyncConnected type:None path:null path:null type:None
[junit4:junit4]   2> 5638 T352 oascc.ConnectionManager.waitForConnected Client is connected to ZooKeeper
[junit4:junit4]   2> 5639 T357 oazs.PrepRequestProcessor.pRequest Got user-level KeeperException when processing sessionid:0x139d29d6d5c0004 type:create cxid:0x1 zxid:0xfffffffffffffffe txntype:unknown reqpath:n/a Error Path:/solr/overseer Error:KeeperErrorCode = NodeExists for /solr/overseer
[junit4:junit4]   2> 5648 T357 oazs.PrepRequestProcessor.pRequest Got user-level KeeperException when processing sessionid:0x139d29d6d5c0004 type:create cxid:0x2 zxid:0xfffffffffffffffe txntype:unknown reqpath:n/a Error Path:/solr/overseer Error:KeeperErrorCode = NodeExists for /solr/overseer
[junit4:junit4]   2> 5649 T352 oasc.ZkController.createEphemeralLiveNode Register node as live in ZooKeeper:/live_nodes/127.0.0.1:63596_solr
[junit4:junit4]   2> 5650 T357 oazs.PrepRequestProcessor.pRequest Got user-level KeeperException when processing sessionid:0x139d29d6d5c0004 type:delete cxid:0x4 zxid:0xfffffffffffffffe txntype:unknown reqpath:n/a Error Path:/solr/live_nodes/127.0.0.1:63596_solr Error:KeeperErrorCode = NoNode for /solr/live_nodes/127.0.0.1:63596_solr
[junit4:junit4]   2> 5651 T352 oascc.SolrZkClient.makePath makePath: /live_nodes/127.0.0.1:63596_solr
[junit4:junit4]   2> 5660 T372 oascc.ZkStateReader$3.process Updating live nodes
[junit4:junit4]   2> 5660 T386 oascc.ZkStateReader$3.process Updating live nodes
[junit4:junit4]   2> 5661 T352 oashc.HttpShardHandlerFactory.getParameter Setting socketTimeout to: 0
[junit4:junit4]   2> 5661 T352 oashc.HttpShardHandlerFactory.getParameter Setting urlScheme to: http://
[junit4:junit4]   2> 5662 T352 oashc.HttpShardHandlerFactory.getParameter Setting connTimeout to: 0
[junit4:junit4]   2> 5662 T352 oashc.HttpShardHandlerFactory.getParameter Setting maxConnectionsPerHost to: 20
[junit4:junit4]   2> 5663 T352 oashc.HttpShardHandlerFactory.getParameter Setting corePoolSize to: 0
[junit4:junit4]   2> 5663 T352 oashc.HttpShardHandlerFactory.getParameter Setting maximumPoolSize to: 2147483647
[junit4:junit4]   2> 5664 T352 oashc.HttpShardHandlerFactory.getParameter Setting maxThreadIdleTime to: 5
[junit4:junit4]   2> 5664 T352 oashc.HttpShardHandlerFactory.getParameter Setting sizeOfQueue to: -1
[junit4:junit4]   2> 5665 T352 oashc.HttpShardHandlerFactory.getParameter Setting fairnessPolicy to: false
[junit4:junit4]   2> 5665 T352 oascsi.HttpClientUtil.createClient Creating new http client, config:maxConnectionsPerHost=20&maxConnections=10000&socketTimeout=0&connTimeout=0&retry=false
[junit4:junit4]   2> 5687 T352 oascc.ZkStateReader.createClusterStateWatchersAndUpdate Updating cluster state from ZooKeeper... 
[junit4:junit4]   2> 5694 T352 oasc.CoreContainer.create Creating SolrCore 'collection1' using instanceDir: /usr/home/hudson/hudson-slave/workspace/Lucene-Solr-Tests-trunk-Java6/solr/build/solr-core/test/J1/./solrtest-jetty2-1347858301506/collection1
[junit4:junit4]   2> 5695 T352 oasc.ZkController.createCollectionZkNode Check for collection zkNode:collection1
[junit4:junit4]   2> 5696 T352 oasc.ZkController.createCollectionZkNode Collection zkNode exists
[junit4:junit4]   2> 5696 T352 oasc.ZkController.readConfigName Load collection config from:/collections/collection1
[junit4:junit4]   2> 5698 T352 oasc.SolrResourceLoader.<init> new SolrResourceLoader for directory: '/usr/home/hudson/hudson-slave/workspace/Lucene-Solr-Tests-trunk-Java6/solr/build/solr-core/test/J1/./solrtest-jetty2-1347858301506/collection1/'
[junit4:junit4]   2> 5699 T352 oasc.SolrResourceLoader.replaceClassLoader Adding 'file:/usr/home/hudson/hudson-slave/workspace/Lucene-Solr-Tests-trunk-Java6/solr/build/solr-core/test/J1/solrtest-jetty2-1347858301506/collection1/lib/README' to classloader
[junit4:junit4]   2> 5700 T352 oasc.SolrResourceLoader.replaceClassLoader Adding 'file:/usr/home/hudson/hudson-slave/workspace/Lucene-Solr-Tests-trunk-Java6/solr/build/solr-core/test/J1/solrtest-jetty2-1347858301506/collection1/lib/classes/' to classloader
[junit4:junit4]   2> 5751 T352 oasc.SolrConfig.<init> Using Lucene MatchVersion: LUCENE_50
[junit4:junit4]   2> 5809 T373 oascc.ZkStateReader.updateClusterState Updating cloud state from ZooKeeper... 
[junit4:junit4]   2> 5819 T352 oasc.SolrConfig.<init> Loaded SolrConfig: solrconfig.xml
[junit4:junit4]   2> 5840 T372 oascc.ZkStateReader$2.process A cluster state change has occurred - updating...
[junit4:junit4]   2> 5840 T386 oascc.ZkStateReader$2.process A cluster state change has occurred - updating...
[junit4:junit4]   2> 5921 T398 oascc.ZkStateReader$2.process A cluster state change has occurred - updating...
[junit4:junit4]   2> 5921 T352 oass.IndexSchema.readSchema Reading Solr Schema
[junit4:junit4]   2> 5929 T352 oass.IndexSchema.readSchema Schema name=test
[junit4:junit4]   2> 6565 T352 oass.OpenExchangeRatesOrgProvider.init Initialized with rates=open-exchange-rates.json, refreshInterval=1440.
[junit4:junit4]   2> 6575 T352 oass.IndexSchema.readSchema default search field in schema is text
[junit4:junit4]   2> 6578 T352 oass.IndexSchema.readSchema unique key field: id
[junit4:junit4]   2> 6590 T352 oass.FileExchangeRateProvider.reload Reloading exchange rates from file currency.xml
[junit4:junit4]   2> 6596 T352 oass.FileExchangeRateProvider.reload Reloading exchange rates from file currency.xml
[junit4:junit4]   2> 6600 T352 oass.OpenExchangeRatesOrgProvider.reload Reloading exchange rates from open-exchange-rates.json
[junit4:junit4]   2> 6601 T352 oass.OpenExchangeRatesOrgProvider.reload Reloading exchange rates from open-exchange-rates.json
[junit4:junit4]   2> 6603 T352 oasc.SolrCore.<init> [collection1] Opening new SolrCore at /usr/home/hudson/hudson-slave/workspace/Lucene-Solr-Tests-trunk-Java6/solr/build/solr-core/test/J1/./solrtest-jetty2-1347858301506/collection1/, dataDir=./org.apache.solr.cloud.BasicDistributedZk2Test-1347858296150/jetty2/
[junit4:junit4]   2> 6603 T352 oasc.JmxMonitoredMap.<init> JMX monitoring is enabled. Adding Solr mbeans to JMX Server: com.sun.jmx.mbeanserver.JmxMBeanServer@151ff451
[junit4:junit4]   2> 6604 T352 oasc.SolrCore.getNewIndexDir WARNING New index directory detected: old=null new=./org.apache.solr.cloud.BasicDistributedZk2Test-1347858296150/jetty2/index/
[junit4:junit4]   2> 6605 T352 oasc.SolrCore.initIndex WARNING [collection1] Solr index directory './org.apache.solr.cloud.BasicDistributedZk2Test-1347858296150/jetty2/index' doesn't exist. Creating new index...
[junit4:junit4]   2> 6606 T352 oasc.CachingDirectoryFactory.get return new directory for /usr/home/hudson/hudson-slave/workspace/Lucene-Solr-Tests-trunk-Java6/solr/build/solr-core/test/J1/./org.apache.solr.cloud.BasicDistributedZk2Test-1347858296150/jetty2/index forceNew:false
[junit4:junit4]   2> 6613 T352 oasc.SolrDeletionPolicy.onCommit SolrDeletionPolicy.onCommit: commits:num=1
[junit4:junit4]   2> 		commit{dir=NRTCachingDirectory(org.apache.lucene.store.NIOFSDirectory@/usr/home/hudson/hudson-slave/workspace/Lucene-Solr-Tests-trunk-Java6/solr/build/solr-core/test/J1/org.apache.solr.cloud.BasicDistributedZk2Test-1347858296150/jetty2/index lockFactory=org.apache.lucene.store.NativeFSLockFactory@7fe360a5; maxCacheMB=48.0 maxMergeSizeMB=4.0),segFN=segments_1,generation=1,filenames=[segments_1]
[junit4:junit4]   2> 6614 T352 oasc.SolrDeletionPolicy.updateCommits newest commit = 1
[junit4:junit4]   2> 6615 T352 oasc.SolrCore.initWriters created xml: solr.XMLResponseWriter
[junit4:junit4]   2> 6618 T352 oasup.UpdateRequestProcessorChain.init inserting DistributedUpdateProcessorFactory into updateRequestProcessorChain "dedupe"
[junit4:junit4]   2> 6618 T352 oasup.UpdateRequestProcessorChain.init inserting DistributedUpdateProcessorFactory into updateRequestProcessorChain "dedupe-allfields"
[junit4:junit4]   2> 6619 T352 oasup.UpdateRequestProcessorChain.init inserting DistributedUpdateProcessorFactory into updateRequestProcessorChain "stored_sig"
[junit4:junit4]   2> 6620 T352 oasup.UpdateRequestProcessorChain.init inserting DistributedUpdateProcessorFactory into updateRequestProcessorChain "uniq-fields"
[junit4:junit4]   2> 6620 T352 oasup.UpdateRequestProcessorChain.init inserting DistributedUpdateProcessorFactory into updateRequestProcessorChain "distrib-dup-test-chain-implicit"
[junit4:junit4]   2> 6621 T352 oasc.RequestHandlers.initHandlersFromConfig adding lazy requestHandler: solr.ReplicationHandler
[junit4:junit4]   2> 6622 T352 oasc.RequestHandlers.initHandlersFromConfig created /replication: solr.ReplicationHandler
[junit4:junit4]   2> 6622 T352 oasc.RequestHandlers.initHandlersFromConfig created standard: solr.StandardRequestHandler
[junit4:junit4]   2> 6623 T352 oasc.RequestHandlers.initHandlersFromConfig created /get: solr.RealTimeGetHandler
[junit4:junit4]   2> 6624 T352 oasc.RequestHandlers.initHandlersFromConfig created dismax: solr.SearchHandler
[junit4:junit4]   2> 6625 T352 oasc.RequestHandlers.initHandlersFromConfig created mock: org.apache.solr.core.MockQuerySenderListenerReqHandler
[junit4:junit4]   2> 6626 T352 oasc.RequestHandlers.initHandlersFromConfig created /admin/: org.apache.solr.handler.admin.AdminHandlers
[junit4:junit4]   2> 6626 T352 oasc.RequestHandlers.initHandlersFromConfig created defaults: solr.StandardRequestHandler
[junit4:junit4]   2> 6627 T352 oasc.RequestHandlers.initHandlersFromConfig adding lazy requestHandler: solr.StandardRequestHandler
[junit4:junit4]   2> 6628 T352 oasc.RequestHandlers.initHandlersFromConfig created lazy: solr.StandardRequestHandler
[junit4:junit4]   2> 6628 T352 oasc.RequestHandlers.initHandlersFromConfig created /update: solr.UpdateRequestHandler
[junit4:junit4]   2> 6629 T352 oasc.RequestHandlers.initHandlersFromConfig created /terms: org.apache.solr.handler.component.SearchHandler
[junit4:junit4]   2> 6630 T352 oasc.RequestHandlers.initHandlersFromConfig created spellCheckCompRH: org.apache.solr.handler.component.SearchHandler
[junit4:junit4]   2> 6631 T352 oasc.RequestHandlers.initHandlersFromConfig created spellCheckCompRH_Direct: org.apache.solr.handler.component.SearchHandler
[junit4:junit4]   2> 6631 T352 oasc.RequestHandlers.initHandlersFromConfig created spellCheckWithWordbreak: org.apache.solr.handler.component.SearchHandler
[junit4:junit4]   2> 6632 T352 oasc.RequestHandlers.initHandlersFromConfig created spellCheckWithWordbreak_Direct: org.apache.solr.handler.component.SearchHandler
[junit4:junit4]   2> 6633 T352 oasc.RequestHandlers.initHandlersFromConfig created spellCheckCompRH1: org.apache.solr.handler.component.SearchHandler
[junit4:junit4]   2> 6634 T352 oasc.RequestHandlers.initHandlersFromConfig created tvrh: org.apache.solr.handler.component.SearchHandler
[junit4:junit4]   2> 6635 T352 oasc.RequestHandlers.initHandlersFromConfig created /mlt: solr.MoreLikeThisHandler
[junit4:junit4]   2> 6635 T352 oasc.RequestHandlers.initHandlersFromConfig created /debug/dump: solr.DumpRequestHandler
[junit4:junit4]   2> 6640 T352 oashl.XMLLoader.init xsltCacheLifetimeSeconds=60
[junit4:junit4]   2> 6645 T352 oasc.SolrCore.initDeprecatedSupport WARNING solrconfig.xml uses deprecated <admin/gettableFiles>, Please update your config to use the ShowFileRequestHandler.
[junit4:junit4]   2> 6647 T352 oasc.SolrCore.initDeprecatedSupport WARNING adding ShowFileRequestHandler with hidden files: [SCHEMA.XML, OLD_SYNONYMS.TXT, STOPWORDS.TXT, PROTWORDS.TXT, OPEN-EXCHANGE-RATES.JSON, SYNONYMS.TXT, CURRENCY.XML, MAPPING-ISOLATIN1ACCENT.TXT]
[junit4:junit4]   2> 6651 T352 oass.SolrIndexSearcher.<init> Opening Searcher@2e60639b main
[junit4:junit4]   2> 6653 T352 oasu.CommitTracker.<init> Hard AutoCommit: disabled
[junit4:junit4]   2> 6653 T352 oasu.CommitTracker.<init> Soft AutoCommit: disabled
[junit4:junit4]   2> 6654 T352 oashc.SpellCheckComponent.inform Initializing spell checkers
[junit4:junit4]   2> 6662 T352 oass.DirectSolrSpellChecker.init init: {name=direct,classname=DirectSolrSpellChecker,field=lowerfilt,minQueryLength=3}
[junit4:junit4]   2> 6725 T399 oasc.SolrCore.registerSearcher [collection1] Registered new searcher Searcher@2e60639b main{StandardDirectoryReader(segments_1:1)}
[junit4:junit4]   2> 6857 T373 oascc.ZkStateReader.updateClusterState Updating cloud state from ZooKeeper... 
[junit4:junit4]   2> 6878 T372 oascc.ZkStateReader$2.process A cluster state change has occurred - updating...
[junit4:junit4]   2> 6878 T386 oascc.ZkStateReader$2.process A cluster state change has occurred - updating...
[junit4:junit4]   2> 6878 T398 oascc.ZkStateReader$2.process A cluster state change has occurred - updating...
[junit4:junit4]   2> 7243 T352 oasc.CoreContainer.register registering core: collection1
[junit4:junit4]   2> 7243 T352 oasc.ZkController.register Register shard - core:collection1 address:http://127.0.0.1:63596/solr shardId:shard2
[junit4:junit4]   2> 7244 T352 oascc.SolrZkClient.makePath makePath: /collections/collection1/leader_elect/shard2/election
[junit4:junit4]   2> 7266 T357 oazs.PrepRequestProcessor.pRequest Got user-level KeeperException when processing sessionid:0x139d29d6d5c0004 type:delete cxid:0x42 zxid:0xfffffffffffffffe txntype:unknown reqpath:n/a Error Path:/solr/collections/collection1/leaders/shard2 Error:KeeperErrorCode = NoNode for /solr/collections/collection1/leaders/shard2
[junit4:junit4]   2> 7273 T352 oasc.ShardLeaderElectionContext.runLeaderProcess Running the leader process.
[junit4:junit4]   2> 7274 T357 oazs.PrepRequestProcessor.pRequest Got user-level KeeperException when processing sessionid:0x139d29d6d5c0004 type:create cxid:0x43 zxid:0xfffffffffffffffe txntype:unknown reqpath:n/a Error Path:/solr/overseer Error:KeeperErrorCode = NodeExists for /solr/overseer
[junit4:junit4]   2> 7285 T352 oasc.ShardLeaderElectionContext.waitForReplicasToComeUp Enough replicas found to continue.
[junit4:junit4]   2> 7286 T352 oasc.ShardLeaderElectionContext.runLeaderProcess I may be the new leader - try and sync
[junit4:junit4]   2> 7286 T352 oasc.SyncStrategy.sync Sync replicas to http://127.0.0.1:63596/solr/collection1/
[junit4:junit4]   2> 7286 T352 oasc.SyncStrategy.syncReplicas Sync Success - now sync replicas to me
[junit4:junit4]   2> 7287 T352 oasc.SyncStrategy.syncToMe http://127.0.0.1:63596/solr/collection1/ has no replicas
[junit4:junit4]   2> 7287 T352 oasc.ShardLeaderElectionContext.runLeaderProcess I am the new leader: http://127.0.0.1:63596/solr/collection1/
[junit4:junit4]   2> 7287 T352 oascc.SolrZkClient.makePath makePath: /collections/collection1/leaders/shard2
[junit4:junit4]   2> 7299 T357 oazs.PrepRequestProcessor.pRequest Got user-level KeeperException when processing sessionid:0x139d29d6d5c0004 type:create cxid:0x4c zxid:0xfffffffffffffffe txntype:unknown reqpath:n/a Error Path:/solr/overseer Error:KeeperErrorCode = NodeExists for /solr/overseer
[junit4:junit4]   2> 7391 T373 oascc.ZkStateReader.updateClusterState Updating cloud state from ZooKeeper... 
[junit4:junit4]   2> 7537 T372 oascc.ZkStateReader$2.process A cluster state change has occurred - updating...
[junit4:junit4]   2> 7537 T386 oascc.ZkStateReader$2.process A cluster state change has occurred - updating...
[junit4:junit4]   2> 7537 T398 oascc.ZkStateReader$2.process A cluster state change has occurred - updating...
[junit4:junit4]   2> 7571 T352 oasc.ZkController.register We are http://127.0.0.1:63596/solr/collection1/ and leader is http://127.0.0.1:63596/solr/collection1/
[junit4:junit4]   2> 7571 T352 oasc.ZkController.register No LogReplay needed for core=collection1 baseURL=http://127.0.0.1:63596/solr
[junit4:junit4]   2> 7572 T352 oasc.ZkController.checkRecovery I am the leader, no recovery necessary
[junit4:junit4]   2> 7605 T352 oascc.ZkStateReader.updateClusterState Updating cloud state from ZooKeeper... 
[junit4:junit4]   2> 7653 T352 oass.SolrDispatchFilter.init user.dir=/usr/home/hudson/hudson-slave/workspace/Lucene-Solr-Tests-trunk-Java6/solr/build/solr-core/test/J1
[junit4:junit4]   2> 7654 T352 oass.SolrDispatchFilter.init SolrDispatchFilter.init() done
[junit4:junit4]   2> 7655 T352 oascsi.HttpClientUtil.createClient Creating new http client, config:maxConnections=128&maxConnectionsPerHost=32&followRedirects=false
[junit4:junit4]   2> 7833 T352 oejs.Server.doStart jetty-8.1.2.v20120308
[junit4:junit4]   2> 7836 T352 oejs.AbstractConnector.doStart Started SocketConnector@0.0.0.0:23727
[junit4:junit4]   2> 7837 T352 oasc.SolrResourceLoader.locateSolrHome JNDI not configured for solr (NoInitialContextEx)
[junit4:junit4]   2> 7837 T352 oasc.SolrResourceLoader.locateSolrHome using system property solr.solr.home: /usr/home/hudson/hudson-slave/workspace/Lucene-Solr-Tests-trunk-Java6/solr/build/solr-core/test/J1/./solrtest-jetty3-1347858303814
[junit4:junit4]   2> 7838 T352 oasc.SolrResourceLoader.<init> new SolrResourceLoader for deduced Solr Home: '/usr/home/hudson/hudson-slave/workspace/Lucene-Solr-Tests-trunk-Java6/solr/build/solr-core/test/J1/./solrtest-jetty3-1347858303814/'
[junit4:junit4]   2> 7874 T352 oass.SolrDispatchFilter.init SolrDispatchFilter.init()
[junit4:junit4]   2> 7875 T352 oasc.SolrResourceLoader.locateSolrHome JNDI not configured for solr (NoInitialContextEx)
[junit4:junit4]   2> 7875 T352 oasc.SolrResourceLoader.locateSolrHome using system property solr.solr.home: /usr/home/hudson/hudson-slave/workspace/Lucene-Solr-Tests-trunk-Java6/solr/build/solr-core/test/J1/./solrtest-jetty3-1347858303814
[junit4:junit4]   2> 7876 T352 oasc.CoreContainer$Initializer.initialize looking for solr.xml: /usr/home/hudson/hudson-slave/workspace/Lucene-Solr-Tests-trunk-Java6/solr/build/solr-core/test/J1/./solrtest-jetty3-1347858303814/solr.xml
[junit4:junit4]   2> 7876 T352 oasc.CoreContainer.<init> New CoreContainer 1164732230
[junit4:junit4]   2> 7877 T352 oasc.CoreContainer.load Loading CoreContainer using Solr Home: '/usr/home/hudson/hudson-slave/workspace/Lucene-Solr-Tests-trunk-Java6/solr/build/solr-core/test/J1/./solrtest-jetty3-1347858303814/'
[junit4:junit4]   2> 7877 T352 oasc.SolrResourceLoader.<init> new SolrResourceLoader for directory: '/usr/home/hudson/hudson-slave/workspace/Lucene-Solr-Tests-trunk-Java6/solr/build/solr-core/test/J1/./solrtest-jetty3-1347858303814/'
[junit4:junit4]   2> 7901 T352 oasc.CoreContainer.load Registering Log Listener
[junit4:junit4]   2> 7916 T352 oasc.CoreContainer.initZooKeeper Zookeeper client=127.0.0.1:26973/solr
[junit4:junit4]   2> 7917 T352 oaz.ZooKeeper.<init> Initiating client connection, connectString=127.0.0.1:26973/solr sessionTimeout=5000 watcher=org.apache.solr.common.cloud.ConnectionManager@2818d303
[junit4:junit4]   2> 7918 T409 oaz.ClientCnxn$SendThread.startConnect Opening socket connection to server /127.0.0.1:26973
[junit4:junit4]   2> 7918 T352 oascc.ConnectionManager.waitForConnected Waiting for client to connect to ZooKeeper
[junit4:junit4]   2> 7919 T409 oaz.ClientCnxn$SendThread.primeConnection Socket connection established to localhost/127.0.0.1:26973, initiating session
[junit4:junit4]   2> 7919 T354 oazs.NIOServerCnxn$Factory.run Accepted socket connection from /140.211.11.196:42524
[junit4:junit4]   2> 7920 T354 oazs.NIOServerCnxn.readConnectRequest Client attempting to establish new session at /140.211.11.196:42524
[junit4:junit4]   2> 7926 T356 oazs.NIOServerCnxn.finishSessionInit Established session 0x139d29d6d5c0005 with negotiated timeout 5000 for client /140.211.11.196:42524
[junit4:junit4]   2> 7926 T409 oaz.ClientCnxn$SendThread.readConnectResult Session establishment complete on server localhost/127.0.0.1:26973, sessionid = 0x139d29d6d5c0005, negotiated timeout = 5000
[junit4:junit4]   2> 7926 T410 oascc.ConnectionManager.process Watcher org.apache.solr.common.cloud.ConnectionManager@2818d303 name:ZooKeeperConnection Watcher:127.0.0.1:26973/solr got event WatchedEvent state:SyncConnected type:None path:null path:null type:None
[junit4:junit4]   2> 7927 T352 oascc.ConnectionManager.waitForConnected Client is connected to ZooKeeper
[junit4:junit4]   2> 7928 T357 oazs.PrepRequestProcessor.pRequest Got user-level KeeperException when processing sessionid:0x139d29d6d5c0005 type:create cxid:0x1 zxid:0xfffffffffffffffe txntype:unknown reqpath:n/a Error Path:/solr/overseer Error:KeeperErrorCode = NodeExists for /solr/overseer
[junit4:junit4]   2> 7937 T357 oazs.PrepRequestProcessor.pRequest Got user-level KeeperException when processing sessionid:0x139d29d6d5c0005 type:create cxid:0x2 zxid:0xfffffffffffffffe txntype:unknown reqpath:n/a Error Path:/solr/overseer Error:KeeperErrorCode = NodeExists for /solr/overseer
[junit4:junit4]   2> 7949 T352 oasc.ZkController.createEphemeralLiveNode Register node as live in ZooKeeper:/live_nodes/127.0.0.1:23727_solr
[junit4:junit4]   2> 7950 T357 oazs.PrepRequestProcessor.pRequest Got user-level KeeperException when processing sessionid:0x139d29d6d5c0005 type:delete cxid:0x4 zxid:0xfffffffffffffffe txntype:unknown reqpath:n/a Error Path:/solr/live_nodes/127.0.0.1:23727_solr Error:KeeperErrorCode = NoNode for /solr/live_nodes/127.0.0.1:23727_solr
[junit4:junit4]   2> 7951 T352 oascc.SolrZkClient.makePath makePath: /live_nodes/127.0.0.1:23727_solr
[junit4:junit4]   2> 7953 T372 oascc.ZkStateReader$3.process Updating live nodes
[junit4:junit4]   2> 7953 T386 oascc.ZkStateReader$3.process Updating live nodes
[junit4:junit4]   2> 7953 T398 oascc.ZkStateReader$3.process Updating live nodes
[junit4:junit4]   2> 7955 T352 oashc.HttpShardHandlerFactory.getParameter Setting socketTimeout to: 0
[junit4:junit4]   2> 7956 T352 oashc.HttpShardHandlerFactory.getParameter Setting urlScheme to: http://
[junit4:junit4]   2> 7956 T352 oashc.HttpShardHandlerFactory.getParameter Setting connTimeout to: 0
[junit4:junit4]   2> 7956 T352 oashc.HttpShardHandlerFactory.getParameter Setting maxConnectionsPerHost to: 20
[junit4:junit4]   2> 7957 T352 oashc.HttpShardHandlerFactory.getParameter Setting corePoolSize to: 0
[junit4:junit4]   2> 7957 T352 oashc.HttpShardHandlerFactory.getParameter Setting maximumPoolSize to: 2147483647
[junit4:junit4]   2> 7958 T352 oashc.HttpShardHandlerFactory.getParameter Setting maxThreadIdleTime to: 5
[junit4:junit4]   2> 7958 T352 oashc.HttpShardHandlerFactory.getParameter Setting sizeOfQueue to: -1
[junit4:junit4]   2> 7959 T352 oashc.HttpShardHandlerFactory.getParameter Setting fairnessPolicy to: false
[junit4:junit4]   2> 7959 T352 oascsi.HttpClientUtil.createClient Creating new http client, config:maxConnectionsPerHost=20&maxConnections=10000&socketTimeout=0&connTimeout=0&retry=false
[junit4:junit4]   2> 7978 T352 oascc.ZkStateReader.createClusterStateWatchersAndUpdate Updating cluster state from ZooKeeper... 
[junit4:junit4]   2> 7984 T352 oasc.CoreContainer.create Creating SolrCore 'collection1' using instanceDir: /usr/home/hudson/hudson-slave/workspace/Lucene-Solr-Tests-trunk-Java6/solr/build/solr-core/test/J1/./solrtest-jetty3-1347858303814/collection1
[junit4:junit4]   2> 7985 T352 oasc.ZkController.createCollectionZkNode Check for collection zkNode:collection1
[junit4:junit4]   2> 7986 T352 oasc.ZkController.createCollectionZkNode Collection zkNode exists
[junit4:junit4]   2> 7986 T352 oasc.ZkController.readConfigName Load collection config from:/collections/collection1
[junit4:junit4]   2> 7988 T352 oasc.SolrResourceLoader.<init> new SolrResourceLoader for directory: '/usr/home/hudson/hudson-slave/workspace/Lucene-Solr-Tests-trunk-Java6/solr/build/solr-core/test/J1/./solrtest-jetty3-1347858303814/collection1/'
[junit4:junit4]   2> 7989 T352 oasc.SolrResourceLoader.replaceClassLoader Adding 'file:/usr/home/hudson/hudson-slave/workspace/Lucene-Solr-Tests-trunk-Java6/solr/build/solr-core/test/J1/solrtest-jetty3-1347858303814/collection1/lib/classes/' to classloader
[junit4:junit4]   2> 7990 T352 oasc.SolrResourceLoader.replaceClassLoader Adding 'file:/usr/home/hudson/hudson-slave/workspace/Lucene-Solr-Tests-trunk-Java6/solr/build/solr-core/test/J1/solrtest-jetty3-1347858303814/collection1/lib/README' to classloader
[junit4:junit4]   2> 8049 T352 oasc.SolrConfig.<init> Using Lucene MatchVersion: LUCENE_50
[junit4:junit4]   2> 8119 T352 oasc.SolrConfig.<init> Loaded SolrConfig: solrconfig.xml
[junit4:junit4]   2> 8156 T373 oascc.ZkStateReader.updateClusterState Updating cloud state from ZooKeeper... 
[junit4:junit4]   2> 8181 T372 oascc.ZkStateReader$2.process A cluster state change has occurred - updating...
[junit4:junit4]   2> 8181 T398 oascc.ZkStateReader$2.process A cluster state change has occurred - updating...
[junit4:junit4]   2> 8181 T386 oascc.ZkStateReader$2.process A cluster state change has occurred - updating...
[junit4:junit4]   2> 8220 T410 oascc.ZkStateReader$2.process A cluster state change has occurred - updating...
[junit4:junit4]   2> 8220 T352 oass.IndexSchema.readSchema Reading Solr Schema
[junit4:junit4]   2> 8228 T352 oass.IndexSchema.readSchema Schema name=test
[junit4:junit4]   2> 9009 T352 oass.OpenExchangeRatesOrgProvider.init Initialized with rates=open-exchange-rates.json, refreshInterval=1440.
[junit4:junit4]   2> 9021 T352 oass.IndexSchema.readSchema default search field in schema is text
[junit4:junit4]   2> 9026 T352 oass.IndexSchema.readSchema unique key field: id
[junit4:junit4]   2> 9042 T352 oass.FileExchangeRateProvider.reload Reloading exchange rates from file currency.xml
[junit4:junit4]   2> 9048 T352 oass.FileExchangeRateProvider.reload Reloading exchange rates from file currency.xml
[junit4:junit4]   2> 9054 T352 oass.OpenExchangeRatesOrgProvider.reload Reloading exchange rates from open-exchange-rates.json
[junit4:junit4]   2> 9055 T352 oass.OpenExchangeRatesOrgProvider.reload Reloading exchange rates from open-exchange-rates.json
[junit4:junit4]   2> 9057 T352 oasc.SolrCore.<init> [collection1] Opening new SolrCore at /usr/home/hudson/hudson-slave/workspace/Lucene-Solr-Tests-trunk-Java6/solr/build/solr-core/test/J1/./solrtest-jetty3-1347858303814/collection1/, dataDir=./org.apache.solr.cloud.BasicDistributedZk2Test-1347858296150/jetty3/
[junit4:junit4]   2> 9058 T352 oasc.JmxMonitoredMap.<init> JMX monitoring is enabled. Adding Solr mbeans to JMX Server: com.sun.jmx.mbeanserver.JmxMBeanServer@151ff451
[junit4:junit4]   2> 9059 T352 oasc.SolrCore.getNewIndexDir WARNING New index directory detected: old=null new=./org.apache.solr.cloud.BasicDistributedZk2Test-1347858296150/jetty3/index/
[junit4:junit4]   2> 9060 T352 oasc.SolrCore.initIndex WARNING [collection1] Solr index directory './org.apache.solr.cloud.BasicDistributedZk2Test-1347858296150/jetty3/index' doesn't exist. Creating new index...
[junit4:junit4]   2> 9061 T352 oasc.CachingDirectoryFactory.get return new directory for /usr/home/hudson/hudson-slave/workspace/Lucene-Solr-Tests-trunk-Java6/solr/build/solr-core/test/J1/./org.apache.solr.cloud.BasicDistributedZk2Test-1347858296150/jetty3/index forceNew:false
[junit4:junit4]   2> 9077 T352 oasc.SolrDeletionPolicy.onCommit SolrDeletionPolicy.onCommit: commits:num=1
[junit4:junit4]   2> 		commit{dir=NRTCachingDirectory(org.apache.lucene.store.NIOFSDirectory@/usr/home/hudson/hudson-slave/workspace/Lucene-Solr-Tests-trunk-Java6/solr/build/solr-core/test/J1/org.apache.solr.cloud.BasicDistributedZk2Test-1347858296150/jetty3/index lockFactory=org.apache.lucene.store.NativeFSLockFactory@6af7de45; maxCacheMB=48.0 maxMergeSizeMB=4.0),segFN=segments_1,generation=1,filenames=[segments_1]
[junit4:junit4]   2> 9077 T352 oasc.SolrDeletionPolicy.updateCommits newest commit = 1
[junit4:junit4]   2> 9078 T352 oasc.SolrCore.initWriters created xml: solr.XMLResponseWriter
[junit4:junit4]   2> 9081 T352 oasup.UpdateRequestProcessorChain.init inserting DistributedUpdateProcessorFactory into updateRequestProcessorChain "dedupe"
[junit4:junit4]   2> 9081 T352 oasup.UpdateRequestProcessorChain.init inserting DistributedUpdateProcessorFactory into updateRequestProcessorChain "dedupe-allfields"
[junit4:junit4]   2> 9082 T352 oasup.UpdateRequestProcessorChain.init inserting DistributedUpdateProcessorFactory into updateRequestProcessorChain "stored_sig"
[junit4:junit4]   2> 9083 T352 oasup.UpdateRequestProcessorChain.init inserting DistributedUpdateProcessorFactory into updateRequestProcessorChain "uniq-fields"
[junit4:junit4]   2> 9083 T352 oasup.UpdateRequestProcessorChain.init inserting DistributedUpdateProcessorFactory into updateRequestProcessorChain "distrib-dup-test-chain-implicit"
[junit4:junit4]   2> 9084 T352 oasc.RequestHandlers.initHandlersFromConfig adding lazy requestHandler: solr.ReplicationHandler
[junit4:junit4]   2> 9084 T352 oasc.RequestHandlers.initHandlersFromConfig created /replication: solr.ReplicationHandler
[junit4:junit4]   2> 9085 T352 oasc.RequestHandlers.initHandlersFromConfig created standard: solr.StandardRequestHandler
[junit4:junit4]   2> 9086 T352 oasc.RequestHandlers.initHandlersFromConfig created /get: solr.RealTimeGetHandler
[junit4:junit4]   2> 9087 T352 oasc.RequestHandlers.initHandlersFromConfig created dismax: solr.SearchHandler
[junit4:junit4]   2> 9087 T352 oasc.RequestHandlers.initHandlersFromConfig created mock: org.apache.solr.core.MockQuerySenderListenerReqHandler
[junit4:junit4]   2> 9090 T352 oasc.RequestHandlers.initHandlersFromConfig created /admin/: org.apache.solr.handler.admin.AdminHandlers
[junit4:junit4]   2> 9091 T352 oasc.RequestHandlers.initHandlersFromConfig created defaults: solr.StandardRequestHandler
[junit4:junit4]   2> 9091 T352 oasc.RequestHandlers.initHandlersFromConfig adding lazy requestHandler: solr.StandardRequestHandler
[junit4:junit4]   2> 9092 T352 oasc.RequestHandlers.initHandlersFromConfig created lazy: solr.StandardRequestHandler
[junit4:junit4]   2> 9093 T352 oasc.RequestHandlers.initHandlersFromConfig created /update: solr.UpdateRequestHandler
[junit4:junit4]   2> 9094 T352 oasc.RequestHandlers.initHandlersFromConfig created /terms: org.apache.solr.handler.component.SearchHandler
[junit4:junit4]   2> 9094 T352 oasc.RequestHandlers.initHandlersFromConfig created spellCheckCompRH: org.apache.solr.handler.component.SearchHandler
[junit4:junit4]   2> 9095 T352 oasc.RequestHandlers.initHandlersFromConfig created spellCheckCompRH_Direct: org.apache.solr.handler.component.SearchHandler
[junit4:junit4]   2> 9096 T352 oasc.RequestHandlers.initHandlersFromConfig created spellCheckWithWordbreak: org.apache.solr.handler.component.SearchHandler
[junit4:junit4]   2> 9096 T352 oasc.RequestHandlers.initHandlersFromConfig created spellCheckWithWordbreak_Direct: org.apache.solr.handler.component.SearchHandler
[junit4:junit4]   2> 9097 T352 oasc.RequestHandlers.initHandlersFromConfig created spellCheckCompRH1: org.apache.solr.handler.component.SearchHandler
[junit4:junit4]   2> 9098 T352 oasc.RequestHandlers.initHandlersFromConfig created tvrh: org.apache.solr.handler.component.SearchHandler
[junit4:junit4]   2> 9099 T352 oasc.RequestHandlers.initHandlersFromConfig created /mlt: solr.MoreLikeThisHandler
[junit4:junit4]   2> 9099 T352 oasc.RequestHandlers.initHandlersFromConfig created /debug/dump: solr.DumpRequestHandler
[junit4:junit4]   2> 9104 T352 oashl.XMLLoader.init xsltCacheLifetimeSeconds=60
[junit4:junit4]   2> 9110 T352 oasc.SolrCore.initDeprecatedSupport WARNING solrconfig.xml uses deprecated <admin/gettableFiles>, Please update your config to use the ShowFileRequestHandler.
[junit4:junit4]   2> 9111 T352 oasc.SolrCore.initDeprecatedSupport WARNING adding ShowFileRequestHandler with hidden files: [SCHEMA.XML, OLD_SYNONYMS.TXT, STOPWORDS.TXT, PROTWORDS.TXT, OPEN-EXCHANGE-RATES.JSON, SYNONYMS.TXT, CURRENCY.XML, MAPPING-ISOLATIN1ACCENT.TXT]
[junit4:junit4]   2> 9116 T352 oass.SolrIndexSearcher.<init> Opening Searcher@3b25b88c main
[junit4:junit4]   2> 9117 T352 oasu.CommitTracker.<init> Hard AutoCommit: disabled
[junit4:junit4]   2> 9118 T352 oasu.CommitTracker.<init> Soft AutoCommit: disabled
[junit4:junit4]   2> 9118 T352 oashc.SpellCheckComponent.inform Initializing spell checkers
[junit4:junit4]   2> 9140 T352 oass.DirectSolrSpellChecker.init init: {name=direct,classname=DirectSolrSpellChecker,field=lowerfilt,minQueryLength=3}
[junit4:junit4]   2> 9218 T411 oasc.SolrCore.registerSearcher [collection1] Registered new searcher Searcher@3b25b88c main{StandardDirectoryReader(segments_1:1)}
[junit4:junit4]   2> 9705 T373 oascc.ZkStateReader.updateClusterState Updating cloud state from ZooKeeper... 
[junit4:junit4]   2> 9726 T372 oascc.ZkStateReader$2.process A cluster state change has occurred - updating...
[junit4:junit4]   2> 9726 T386 oascc.ZkStateReader$2.process A cluster state change has occurred - updating...
[junit4:junit4]   2> 9726 T398 oascc.ZkStateReader$2.process A cluster state change has occurred - updating...
[junit4:junit4]   2> 9726 T410 oascc.ZkStateReader$2.process A cluster state change has occurred - updating...
[junit4:junit4]   2> 10228 T352 oasc.CoreContainer.register registering core: collection1
[junit4:junit4]   2> 10228 T352 oasc.ZkController.register Register shard - core:collection1 address:http://127.0.0.1:23727/solr shardId:shard1
[junit4:junit4]   2> 10236 T352 oasc.ZkController.register We are http://127.0.0.1:23727/solr/collection1/ and leader is http://127.0.0.1:44526/solr/collection1/
[junit4:junit4]   2> 10236 T352 oasc.ZkController.register No LogReplay needed for core=collection1 baseURL=http://127.0.0.1:23727/solr
[junit4:junit4]   2> 10237 T352 oasc.ZkController.checkRecovery Core needs to recover:collection1
[junit4:junit4]   2> 10237 T352 oasu.DefaultSolrCoreState.doRecovery Running recovery - first canceling any ongoing recovery
[junit4:junit4]   2> ASYNC  NEW_CORE C40 name=collection1 org.apache.solr.core.SolrCore@2bc609cd url=http://127.0.0.1:23727/solr/collection1 node=127.0.0.1:23727_solr
[junit4:junit4]   2> 10239 T412 C40 P23727 oasc.RecoveryStrategy.run Starting recovery process.  core=collection1 recoveringAfterStartup=true
[junit4:junit4]   2> 10239 T412 C40 P23727 oasc.RecoveryStrategy.doRecovery ###### startupVersions=[]
[junit4:junit4]   2> 10239 T352 oascc.ZkStateReader.updateClusterState Updating cloud state from ZooKeeper... 
[junit4:junit4]   2> 10241 T412 C40 P23727 oasc.RecoveryStrategy.doRecovery Attempting to PeerSync from http://127.0.0.1:44526/solr/collection1/ core=collection1 - recoveringAfterStartup=true
[junit4:junit4]   2> 10241 T412 C40 P23727 oasu.PeerSync.sync PeerSync: core=collection1 url=http://127.0.0.1:23727/solr START replicas=[http://127.0.0.1:44526/solr/collection1/] nUpdates=100
[junit4:junit4]   2> 10241 T352 oass.SolrDispatchFilter.init user.dir=/usr/home/hudson/hudson-slave/workspace/Lucene-Solr-Tests-trunk-Java6/solr/build/solr-core/test/J1
[junit4:junit4]   2> 10242 T412 C40 P23727 oasu.PeerSync.sync WARNING no frame of reference to tell of we've missed updates
[junit4:junit4]   2> 10242 T352 oass.SolrDispatchFilter.init SolrDispatchFilter.init() done
[junit4:junit4]   2> 10243 T412 C40 P23727 oasc.RecoveryStrategy.doRecovery PeerSync Recovery was not successful - trying replication. core=collection1
[junit4:junit4]   2> 10243 T412 C40 P23727 oasc.RecoveryStrategy.doRecovery Starting Replication Recovery. core=collection1
[junit4:junit4]   2> 10243 T352 oascsi.HttpClientUtil.createClient Creating new http client, config:maxConnections=128&maxConnectionsPerHost=32&followRedirects=false
[junit4:junit4]   2> 10244 T412 C40 P23727 oascsi.HttpClientUtil.createClient Creating new http client, config:maxConnections=128&maxConnectionsPerHost=32&followRedirects=false
[junit4:junit4]   2> ASYNC  NEW_CORE C41 name=collection1 org.apache.solr.core.SolrCore@4ee95a23 url=http://127.0.0.1:44526/solr/collection1 node=127.0.0.1:44526_solr
[junit4:junit4]   2> 10257 T378 C41 P44526 REQ /get {distrib=false&qt=/get&wt=javabin&version=2&getVersions=100} status=0 QTime=0 
[junit4:junit4]   2> 10428 T352 oejs.Server.doStart jetty-8.1.2.v20120308
[junit4:junit4]   2> 10430 T352 oejs.AbstractConnector.doStart Started SocketConnector@0.0.0.0:54247
[junit4:junit4]   2> 10431 T352 oasc.SolrResourceLoader.locateSolrHome JNDI not configured for solr (NoInitialContextEx)
[junit4:junit4]   2> 10432 T352 oasc.SolrResourceLoader.locateSolrHome using system property solr.solr.home: /usr/home/hudson/hudson-slave/workspace/Lucene-Solr-Tests-trunk-Java6/solr/build/solr-core/test/J1/./solrtest-jetty4-1347858306410
[junit4:junit4]   2> 10432 T352 oasc.SolrResourceLoader.<init> new SolrResourceLoader for deduced Solr Home: '/usr/home/hudson/hudson-slave/workspace/Lucene-Solr-Tests-trunk-Java6/solr/build/solr-core/test/J1/./solrtest-jetty4-1347858306410/'
[junit4:junit4]   2> 10466 T352 oass.SolrDispatchFilter.init SolrDispatchFilter.init()
[junit4:junit4]   2> 10466 T352 oasc.SolrResourceLoader.locateSolrHome JNDI not configured for solr (NoInitialContextEx)
[junit4:junit4]   2> 10467 T352 oasc.SolrResourceLoader.locateSolrHome using system property solr.solr.home: /usr/home/hudson/hudson-slave/workspace/Lucene-Solr-Tests-trunk-Java6/solr/build/solr-core/test/J1/./solrtest-jetty4-1347858306410
[junit4:junit4]   2> 10467 T352 oasc.CoreContainer$Initializer.initialize looking for solr.xml: /usr/home/hudson/hudson-slave/workspace/Lucene-Solr-Tests-trunk-Java6/solr/build/solr-core/test/J1/./solrtest-jetty4-1347858306410/solr.xml
[junit4:junit4]   2> 10467 T352 oasc.CoreContainer.<init> New CoreContainer 2028837385
[junit4:junit4]   2> 10468 T352 oasc.CoreContainer.load Loading CoreContainer using Solr Home: '/usr/home/hudson/hudson-slave/workspace/Lucene-Solr-Tests-trunk-Java6/solr/build/solr-core/test/J1/./solrtest-jetty4-1347858306410/'
[junit4:junit4]   2> 10469 T352 oasc.SolrResourceLoader.<init> new SolrResourceLoader for directory: '/usr/home/hudson/hudson-slave/workspace/Lucene-Solr-Tests-trunk-Java6/solr/build/solr-core/test/J1/./solrtest-jetty4-1347858306410/'
[junit4:junit4]   2> 10493 T352 oasc.CoreContainer.load Registering Log Listener
[junit4:junit4]   2> 10507 T352 oasc.CoreContainer.initZooKeeper Zookeeper client=127.0.0.1:26973/solr
[junit4:junit4]   2> 10508 T352 oaz.ZooKeeper.<init> Initiating client connection, connectString=127.0.0.1:26973/solr sessionTimeout=5000 watcher=org.apache.solr.common.cloud.ConnectionManager@7cb45826
[junit4:junit4]   2> 10509 T423 oaz.ClientCnxn$SendThread.startConnect Opening socket connection to server /127.0.0.1:26973
[junit4:junit4]   2> 10509 T352 oascc.ConnectionManager.waitForConnected Waiting for client to connect to ZooKeeper
[junit4:junit4]   2> 10511 T423 oaz.ClientCnxn$SendThread.primeConnection Socket connection established to localhost/127.0.0.1:26973, initiating session
[junit4:junit4]   2> 10511 T354 oazs.NIOServerCnxn$Factory.run Accepted socket connection from /140.211.11.196:58912
[junit4:junit4]   2> 10512 T354 oazs.NIOServerCnxn.readConnectRequest Client attempting to establish new session at /140.211.11.196:58912
[junit4:junit4]   2> 10516 T356 oazs.NIOServerCnxn.finishSessionInit Established session 0x139d29d6d5c0006 with negotiated timeout 5000 for client /140.211.11.196:58912
[junit4:junit4]   2> 10516 T423 oaz.ClientCnxn$SendThread.readConnectResult Session establishment complete on server localhost/127.0.0.1:26973, sessionid = 0x139d29d6d5c0006, negotiated timeout = 5000
[junit4:junit4]   2> 10516 T424 oascc.ConnectionManager.process Watcher org.apache.solr.common.cloud.ConnectionManager@7cb45826 name:ZooKeeperConnection Watcher:127.0.0.1:26973/solr got event WatchedEvent state:SyncConnected type:None path:null path:null type:None
[junit4:junit4]   2> 10517 T352 oascc.ConnectionManager.waitForConnected Client is connected to ZooKeeper
[junit4:junit4]   2> 10518 T357 oazs.PrepRequestProcessor.pRequest Got user-level KeeperException when processing sessionid:0x139d29d6d5c0006 type:create cxid:0x1 zxid:0xfffffffffffffffe txntype:unknown reqpath:n/a Error Path:/solr/overseer Error:KeeperErrorCode = NodeExists for /solr/overseer
[junit4:junit4]   2> 10526 T357 oazs.PrepRequestProcessor.pRequest Got user-level KeeperException when processing sessionid:0x139d29d6d5c0006 type:create cxid:0x2 zxid:0xfffffffffffffffe txntype:unknown reqpath:n/a Error Path:/solr/overseer Error:KeeperErrorCode = NodeExists for /solr/overseer
[junit4:junit4]   2> 10527 T352 oasc.ZkController.createEphemeralLiveNode Register node as live in ZooKeeper:/live_nodes/127.0.0.1:54247_solr
[junit4:junit4]   2> 10528 T357 oazs.PrepRequestProcessor.pRequest Got user-level KeeperException when processing sessionid:0x139d29d6d5c0006 type:delete cxid:0x4 zxid:0xfffffffffffffffe txntype:unknown reqpath:n/a Error Path:/solr/live_nodes/127.0.0.1:54247_solr Error:KeeperErrorCode = NoNode for /solr/live_nodes/127.0.0.1:54247_solr
[junit4:junit4]   2> 10529 T352 oascc.SolrZkClient.makePath makePath: /live_nodes/127.0.0.1:54247_solr
[junit4:junit4]   2> 10532 T372 oascc.ZkStateReader$3.process Updating live nodes
[junit4:junit4]   2> 10532 T398 oascc.ZkStateReader$3.process Updating live nodes
[junit4:junit4]   2> 10532 T386 oascc.ZkStateReader$3.process Updating live nodes
[junit4:junit4]   2> 10532 T410 oascc.ZkStateReader$3.process Updating live nodes
[junit4:junit4]   2> 10534 T352 oashc.HttpShardHandlerFactory.getParameter Setting socketTimeout to: 0
[junit4:junit4]   2> 10534 T352 oashc.HttpShardHandlerFactory.getParameter Setting urlScheme to: http://
[junit4:junit4]   2> 10535 T352 oashc.HttpShardHandlerFactory.getParameter Setting connTimeout to: 0
[junit4:junit4]   2> 10535 T352 oashc.HttpShardHandlerFactory.getParameter Setting maxConnectionsPerHost to: 20
[junit4:junit4]   2> 10536 T352 oashc.HttpShardHandlerFactory.getParameter Setting corePoolSize to: 0
[junit4:junit4]   2> 10536 T352 oashc.HttpShardHandlerFactory.getParameter Setting maximumPoolSize to: 2147483647
[junit4:junit4]   2> 10537 T352 oashc.HttpShardHandlerFactory.getParameter Setting maxThreadIdleTime to: 5
[junit4:junit4]   2> 10537 T352 oashc.HttpShardHandlerFactory.getParameter Setting sizeOfQueue to: -1
[junit4:junit4]   2> 10538 T352 oashc.HttpShardHandlerFactory.getParameter Setting fairnessPolicy to: false
[junit4:junit4]   2> 10538 T352 oascsi.HttpClientUtil.createClient Creating new http client, config:maxConnectionsPerHost=20&maxConnections=10000&socketTimeout=0&connTimeout=0&retry=false
[junit4:junit4]   2> 10557 T352 oascc.ZkStateReader.createClusterStateWatchersAndUpdate Updating cluster state from ZooKeeper... 
[junit4:junit4]   2> 10564 T352 oasc.CoreContainer.create Creating SolrCore 'collection1' using instanceDir: /usr/home/hudson/hudson-slave/workspace/Lucene-Solr-Tests-trunk-Java6/solr/build/solr-core/test/J1/./solrtest-jetty4-1347858306410/collection1
[junit4:junit4]   2> 10565 T352 oasc.ZkController.createCollectionZkNode Check for collection zkNode:collection1
[junit4:junit4]   2> 10566 T352 oasc.ZkController.createCollectionZkNode Collection zkNode exists
[junit4:junit4]   2> 10566 T352 oasc.ZkController.readConfigName Load collection config from:/collections/collection1
[junit4:junit4]   2> 10568 T352 oasc.SolrResourceLoader.<init> new SolrResourceLoader for directory: '/usr/home/hudson/hudson-slave/workspace/Lucene-Solr-Tests-trunk-Java6/solr/build/solr-core/test/J1/./solrtest-jetty4-1347858306410/collection1/'
[junit4:junit4]   2> 10570 T352 oasc.SolrResourceLoader.replaceClassLoader Adding 'file:/usr/home/hudson/hudson-slave/workspace/Lucene-Solr-Tests-trunk-Java6/solr/build/solr-core/test/J1/solrtest-jetty4-1347858306410/collection1/lib/classes/' to classloader
[junit4:junit4]   2> 10570 T352 oasc.SolrResourceLoader.replaceClassLoader Adding 'file:/usr/home/hudson/hudson-slave/workspace/Lucene-Solr-Tests-trunk-Java6/solr/build/solr-core/test/J1/solrtest-jetty4-1347858306410/collection1/lib/README' to classloader
[junit4:junit4]   2> 10622 T352 oasc.SolrConfig.<init> Using Lucene MatchVersion: LUCENE_50
[junit4:junit4]   2> 10698 T352 oasc.SolrConfig.<init> Loaded SolrConfig: solrconfig.xml
[junit4:junit4]   2> 10739 T373 oascc.ZkStateReader.updateClusterState Updating cloud state from ZooKeeper... 
[junit4:junit4]   2> 10764 T372 oascc.ZkStateReader$2.process A cluster state change has occurred - updating...
[junit4:junit4]   2> 10764 T386 oascc.ZkStateReader$2.process A cluster state change has occurred - updating...
[junit4:junit4]   2> 10764 T410 oascc.ZkStateReader$2.process A cluster state change has occurred - updating...
[junit4:junit4]   2> 10764 T398 oascc.ZkStateReader$2.process A cluster state change has occurred - updating...
[junit4:junit4]   2> 10799 T424 oascc.ZkStateReader$2.process A cluster state change has occurred - updating...
[junit4:junit4]   2> 10799 T352 oass.IndexSchema.readSchema Reading Solr Schema
[junit4:junit4]   2> 10807 T352 oass.IndexSchema.readSchema Schema name=test
[junit4:junit4]   2> 11438 T352 oass.OpenExchangeRatesOrgProvider.init Initialized with rates=open-exchange-rates.json, refreshInterval=1440.
[junit4:junit4]   2> 11450 T352 oass.IndexSchema.readSchema default search field in schema is text
[junit4:junit4]   2> 11455 T352 oass.IndexSchema.readSchema unique key field: id
[junit4:junit4]   2> 11472 T352 oass.FileExchangeRateProvider.reload Reloading exchange rates from file currency.xml
[junit4:junit4]   2> 11477 T352 oass.FileExchangeRateProvider.reload Reloading exchange rates from file currency.xml
[junit4:junit4]   2> 11482 T352 oass.OpenExchangeRatesOrgProvider.reload Reloading exchange rates from open-exchange-rates.json
[junit4:junit4]   2> 11484 T352 oass.OpenExchangeRatesOrgProvider.reload Reloading exchange rates from open-exchange-rates.json
[junit4:junit4]   2> 11486 T352 oasc.SolrCore.<init> [collection1] Opening new SolrCore at /usr/home/hudson/hudson-slave/workspace/Lucene-Solr-Tests-trunk-Java6/solr/build/solr-core/test/J1/./solrtest-jetty4-1347858306410/collection1/, dataDir=./org.apache.solr.cloud.BasicDistributedZk2Test-1347858296150/jetty4/
[junit4:junit4]   2> 11486 T352 oasc.JmxMonitoredMap.<init> JMX monitoring is enabled. Adding Solr mbeans to JMX Server: com.sun.jmx.mbeanserver.JmxMBeanServer@151ff451
[junit4:junit4]   2> 11488 T352 oasc.SolrCore.getNewIndexDir WARNING New index directory detected: old=null new=./org.apache.solr.cloud.BasicDistributedZk2Test-1347858296150/jetty4/index/
[junit4:junit4]   2> 11489 T352 oasc.SolrCore.initIndex WARNING [collection1] Solr index directory './org.apache.solr.cloud.BasicDistributedZk2Test-1347858296150/jetty4/index' doesn't exist. Creating new index...
[junit4:junit4]   2> 11490 T352 oasc.CachingDirectoryFactory.get return new directory for /usr/home/hudson/hudson-slave/workspace/Lucene-Solr-Tests-trunk-Java6/solr/build/solr-core/test/J1/./org.apache.solr.cloud.BasicDistributedZk2Test-1347858296150/jetty4/index forceNew:false
[junit4:junit4]   2> 11517 T352 oasc.SolrDeletionPolicy.onCommit SolrDeletionPolicy.onCommit: commits:num=1
[junit4:junit4]   2> 		commit{dir=NRTCachingDirectory(org.apache.lucene.store.NIOFSDirectory@/usr/home/hudson/hudson-slave/workspace/Lucene-Solr-Tests-trunk-Java6/solr/build/solr-core/test/J1/org.apache.solr.cloud.BasicDistributedZk2Test-1347858296150/jetty4/index lockFactory=org.apache.lucene.store.NativeFSLockFactory@1d8f59e3; maxCacheMB=48.0 maxMergeSizeMB=4.0),segFN=segments_1,generation=1,filenames=[segments_1]
[junit4:junit4]   2> 11518 T352 oasc.SolrDeletionPolicy.updateCommits newest commit = 1
[junit4:junit4]   2> 11519 T352 oasc.SolrCore.initWriters created xml: solr.XMLResponseWriter
[junit4:junit4]   2> 11522 T352 oasup.UpdateRequestProcessorChain.init inserting DistributedUpdateProcessorFactory into updateRequestProcessorChain "dedupe"
[junit4:junit4]   2> 11522 T352 oasup.UpdateRequestProcessorChain.init inserting DistributedUpdateProcessorFactory into updateRequestProcessorChain "dedupe-allfields"
[junit4:junit4]   2> 11523 T352 oasup.UpdateRequestProcessorChain.init inserting DistributedUpdateProcessorFactory into updateRequestProcessorChain "stored_sig"
[junit4:junit4]   2> 11524 T352 oasup.UpdateRequestProcessorChain.init inserting DistributedUpdateProcessorFactory into updateRequestProcessorChain "uniq-fields"
[junit4:junit4]   2> 11524 T352 oasup.UpdateRequestProcessorChain.init inserting DistributedUpdateProcessorFactory into updateRequestProcessorChain "distrib-dup-test-chain-implicit"
[junit4:junit4]   2> 11525 T352 oasc.RequestHandlers.initHandlersFromConfig adding lazy requestHandler: solr.ReplicationHandler
[junit4:junit4]   2> 11526 T352 oasc.RequestHandlers.initHandlersFromConfig created /replication: solr.ReplicationHandler
[junit4:junit4]   2> 11526 T352 oasc.RequestHandlers.initHandlersFromConfig created standard: solr.StandardRequestHandler
[junit4:junit4]   2> 11527 T352 oasc.RequestHandlers.initHandlersFromConfig created /get: solr.RealTimeGetHandler
[junit4:junit4]   2> 11528 T352 oasc.RequestHandlers.initHandlersFromConfig created dismax: solr.SearchHandler
[junit4:junit4]   2> 11529 T352 oasc.RequestHandlers.initHandlersFromConfig created mock: org.apache.solr.core.MockQuerySenderListenerReqHandler
[junit4:junit4]   2> 11530 T352 oasc.RequestHandlers.initHandlersFromConfig created /admin/: org.apache.solr.handler.admin.AdminHandlers
[junit4:junit4]   2> 11530 T352 oasc.RequestHandlers.initHandlersFromConfig created defaults: solr.StandardRequestHandler
[junit4:junit4]   2> 11531 T352 oasc.RequestHandlers.initHandlersFromConfig adding lazy requestHandler: solr.StandardRequestHandler
[junit4:junit4]   2> 11532 T352 oasc.RequestHandlers.initHandlersFromConfig created lazy: solr.StandardRequestHandler
[junit4:junit4]   2> 11532 T352 oasc.RequestHandlers.initHandlersFromConfig created /update: solr.UpdateRequestHandler
[junit4:junit4]   2> 11533 T352 oasc.RequestHandlers.initHandlersFromConfig created /terms: org.apache.solr.handler.component.SearchHandler
[junit4:junit4]   2> 11534 T352 oasc.RequestHandlers.initHandlersFromConfig created spellCheckCompRH: org.apache.solr.handler.component.SearchHandler
[junit4:junit4]   2> 11535 T352 oasc.RequestHandlers.initHandlersFromConfig created spellCheckCompRH_Direct: org.apache.solr.handler.component.SearchHandler
[junit4:junit4]   2> 11535 T352 oasc.RequestHandlers.initHandlersFromConfig created spellCheckWithWordbreak: org.apache.solr.handler.component.SearchHandler
[junit4:junit4]   2> 11536 T352 oasc.RequestHandlers.initHandlersFromConfig created spellCheckWithWordbreak_Direct: org.apache.solr.handler.component.SearchHandler
[junit4:junit4]   2> 11537 T352 oasc.RequestHandlers.initHandlersFromConfig created spellCheckCompRH1: org.apache.solr.handler.component.SearchHandler
[junit4:junit4]   2> 11538 T352 oasc.RequestHandlers.initHandlersFromConfig created tvrh: org.apache.solr.handler.component.SearchHandler
[junit4:junit4]   2> 11539 T352 oasc.RequestHandlers.initHandlersFromConfig created /mlt: solr.MoreLikeThisHandler
[junit4:junit4]   2> 11540 T352 oasc.RequestHandlers.initHandlersFromConfig created /debug/dump: solr.DumpRequestHandler
[junit4:junit4]   2> 11543 T352 oashl.XMLLoader.init xsltCacheLifetimeSeconds=60
[junit4:junit4]   2> 11548 T352 oasc.SolrCore.initDeprecatedSupport WARNING solrconfig.xml uses deprecated <admin/gettableFiles>, Please update your config to use the ShowFileRequestHandler.
[junit4:junit4]   2> 11549 T352 oasc.SolrCore.initDeprecatedSupport WARNING adding ShowFileRequestHandler with hidden files: [SCHEMA.XML, OLD_SYNONYMS.TXT, STOPWORDS.TXT, PROTWORDS.TXT, OPEN-EXCHANGE-RATES.JSON, SYNONYMS.TXT, CURRENCY.XML, MAPPING-ISOLATIN1ACCENT.TXT]
[junit4:junit4]   2> 11554 T352 oass.SolrIndexSearcher.<init> Opening Searcher@7763f2fb main
[junit4:junit4]   2> 11555 T352 oasu.CommitTracker.<init> Hard AutoCommit: disabled
[junit4:junit4]   2> 11556 T352 oasu.CommitTracker.<init> Soft AutoCommit: disabled
[junit4:junit4]   2> 11556 T352 oashc.SpellCheckComponent.inform Initializing spell checkers
[junit4:junit4]   2> 11576 T352 oass.DirectSolrSpellChecker.init init: {name=direct,classname=DirectSolrSpellChecker,field=lowerfilt,minQueryLength=3}
[junit4:junit4]   2> 11655 T425 oasc.SolrCore.registerSearcher [collection1] Registered new searcher Searcher@7763f2fb main{StandardDirectoryReader(segments_1:1)}
[junit4:junit4]   2> 11777 T373 oascc.ZkStateReader.updateClusterState Updating cloud state from ZooKeeper... 
[junit4:junit4]   2> 11795 T372 oascc.ZkStateReader$2.process A cluster state change has occurred - updating...
[junit4:junit4]   2> 11795 T410 oascc.ZkStateReader$2.process A cluster state change has occurred - updating...
[junit4:junit4]   2> 11795 T398 oascc.ZkStateReader$2.process A cluster state change has occurred - updating...
[junit4:junit4]   2> 11795 T424 oascc.ZkStateReader$2.process A cluster state change has occurred - updating...
[junit4:junit4]   2> 11795 T386 oascc.ZkStateReader$2.process A cluster state change has occurred - updating...
[junit4:junit4]   2> 12165 T352 oasc.CoreContainer.register registering core: collection1
[junit4:junit4]   2> 12165 T352 oasc.ZkController.register Register shard - core:collection1 address:http://127.0.0.1:54247/solr shardId:shard2
[junit4:junit4]   2> 12170 T352 oasc.ZkController.register We are http://127.0.0.1:54247/solr/collection1/ and leader is http://127.0.0.1:63596/solr/collection1/
[junit4:junit4]   2> 12170 T352 oasc.ZkController.register No LogReplay needed for core=collection1 baseURL=http://127.0.0.1:54247/solr
[junit4:junit4]   2> 12171 T352 oasc.ZkController.checkRecovery Core needs to recover:collection1
[junit4:junit4]   2> 12171 T352 oasu.DefaultSolrCoreState.doRecovery Running recovery - first canceling any ongoing recovery
[junit4:junit4]   2> ASYNC  NEW_CORE C42 name=collection1 org.apache.solr.core.SolrCore@34e029ed url=http://127.0.0.1:54247/solr/collection1 node=127.0.0.1:54247_solr
[junit4:junit4]   2> 12173 T426 C42 P54247 oasc.RecoveryStrategy.run Starting recovery process.  core=collection1 recoveringAfterStartup=true
[junit4:junit4]   2> 12173 T426 C42 P54247 oasc.RecoveryStrategy.doRecovery ###### startupVersions=[]
[junit4:junit4]   2> 12173 T352 oascc.ZkStateReader.updateClusterState Updating cloud state from ZooKeeper... 
[junit4:junit4]   2> 12175 T426 C42 P54247 oasc.RecoveryStrategy.doRecovery Attempting to PeerSync from http://127.0.0.1:63596/solr/collection1/ core=collection1 - recoveringAfterStartup=true
[junit4:junit4]   2> 12175 T426 C42 P54247 oasu.PeerSync.sync PeerSync: core=collection1 url=http://127.0.0.1:54247/solr START replicas=[http://127.0.0.1:63596/solr/collection1/] nUpdates=100
[junit4:junit4]   2> 12175 T352 oass.SolrDispatchFilter.init user.dir=/usr/home/hudson/hudson-slave/workspace/Lucene-Solr-Tests-trunk-Java6/solr/build/solr-core/test/J1
[junit4:junit4]   2> 12175 T426 C42 P54247 oasu.PeerSync.sync WARNING no frame of reference to tell of we've missed updates
[junit4:junit4]   2> 12175 T352 oass.SolrDispatchFilter.init SolrDispatchFilter.init() done
[junit4:junit4]   2> 12176 T426 C42 P54247 oasc.RecoveryStrategy.doRecovery PeerSync Recovery was not successful - trying replication. core=collection1
[junit4:junit4]   2> 12176 T352 oascsi.HttpClientUtil.createClient Creating new http client, config:maxConnections=128&maxConnectionsPerHost=32&followRedirects=false
[junit4:junit4]   2> 12177 T426 C42 P54247 oasc.RecoveryStrategy.doRecovery Starting Replication Recovery. core=collection1
[junit4:junit4]   2> 12177 T426 C42 P54247 oascsi.HttpClientUtil.createClient Creating new http client, config:maxConnections=128&maxConnectionsPerHost=32&followRedirects=false
[junit4:junit4]   2> ASYNC  NEW_CORE C43 name=collection1 org.apache.solr.core.SolrCore@7595e705 url=http://127.0.0.1:63596/solr/collection1 node=127.0.0.1:63596_solr
[junit4:junit4]   2> 12185 T390 C43 P63596 REQ /get {distrib=false&qt=/get&wt=javabin&version=2&getVersions=100} status=0 QTime=0 
[junit4:junit4]   2> 12198 T352 oaz.ZooKeeper.<init> Initiating client connection, connectString=127.0.0.1:26973/solr sessionTimeout=10000 watcher=org.apache.solr.common.cloud.ConnectionManager@3784f000
[junit4:junit4]   2> 12200 T428 oaz.ClientCnxn$SendThread.startConnect Opening socket connection to server /127.0.0.1:26973
[junit4:junit4]   2> 12200 T352 oascc.ConnectionManager.waitForConnected Waiting for client to connect to ZooKeeper
[junit4:junit4]   2> 12201 T428 oaz.ClientCnxn$SendThread.primeConnection Socket connection established to localhost/127.0.0.1:26973, initiating session
[junit4:junit4]   2> 12201 T354 oazs.NIOServerCnxn$Factory.run Accepted socket connection from /140.211.11.196:10342
[junit4:junit4]   2> 12201 T354 oazs.NIOServerCnxn.readConnectRequest Client attempting to establish new session at /140.211.11.196:10342
[junit4:junit4]   2> 12203 T356 oazs.NIOServerCnxn.finishSessionInit Established session 0x139d29d6d5c0007 with negotiated timeout 10000 for client /140.211.11.196:10342
[junit4:junit4]   2> 12203 T428 oaz.ClientCnxn$SendThread.readConnectResult Session establishment complete on server localhost/127.0.0.1:26973, sessionid = 0x139d29d6d5c0007, negotiated timeout = 10000
[junit4:junit4]   2> 12203 T429 oascc.ConnectionManager.process Watcher org.apache.solr.common.cloud.ConnectionManager@3784f000 name:ZooKeeperConnection Watcher:127.0.0.1:26973/solr got event WatchedEvent state:SyncConnected type:None path:null path:null type:None
[junit4:junit4]   2> 12204 T352 oascc.ConnectionManager.waitForConnected Client is connected to ZooKeeper
[junit4:junit4]   2> 12205 T352 oascc.ZkStateReader.createClusterStateWatchersAndUpdate Updating cluster state from ZooKeeper... 
[junit4:junit4]   2> 12207 T352 oasc.ChaosMonkey.monkeyLog monkey: init - expire sessions:true cause connection loss:true
[junit4:junit4]   2> 12207 T352 oascsi.HttpClientUtil.createClient Creating new http client, config:
[junit4:junit4]   2> 12217 T352 oascc.ZkStateReader.updateClusterState Updating cloud state from ZooKeeper... 
[junit4:junit4]   2> ASYNC  NEW_CORE C44 name=collection1 org.apache.solr.core.SolrCore@1d489e0e url=http://127.0.0.1:45657/solr/collection1 node=127.0.0.1:45657_solr
[junit4:junit4]   2> 12232 T364 C44 P45657 oasc.SolrDeletionPolicy.onInit SolrDeletionPolicy.onInit: commits:num=1
[junit4:junit4]   2> 		commit{dir=NRTCachingDirectory(org.apache.lucene.store.NIOFSDirectory@/usr/home/hudson/hudson-slave/workspace/Lucene-Solr-Tests-trunk-Java6/solr/build/solr-core/test/J1/org.apache.solr.cloud.BasicDistributedZk2Test-1347858296150/control/data/index lockFactory=org.apache.lucene.store.NativeFSLockFactory@502438db; maxCacheMB=48.0 maxMergeSizeMB=4.0),segFN=segments_1,generation=1,filenames=[segments_1]
[junit4:junit4]   2> 12233 T364 C44 P45657 oasc.SolrDeletionPolicy.updateCommits newest commit = 1
[junit4:junit4]   2> 12239 T364 C44 P45657 /update {wt=javabin&version=2} {add=[1 (1413331873560526848)]} 0 13
[junit4:junit4]   2> 12240 T352 oaz.ZooKeeper.<init> Initiating client connection, connectString=127.0.0.1:26973/solr sessionTimeout=10000 watcher=org.apache.solr.common.cloud.ConnectionManager@649ebbfd
[junit4:junit4]   2> 12241 T430 oaz.ClientCnxn$SendThread.startConnect Opening socket connection to server /127.0.0.1:26973
[junit4:junit4]   2> 12241 T352 oascc.ConnectionManager.waitForConnected Waiting for client to connect to ZooKeeper
[junit4:junit4]   2> 12242 T430 oaz.ClientCnxn$SendThread.primeConnection Socket connection established to localhost/127.0.0.1:26973, initiating session
[junit4:junit4]   2> 12242 T354 oazs.NIOServerCnxn$Factory.run Accepted socket connection from /140.211.11.196:46187
[junit4:junit4]   2> 12242 T354 oazs.NIOServerCnxn.readConnectRequest Client attempting to establish new session at /140.211.11.196:46187
[junit4:junit4]   2> 12249 T356 oazs.NIOServerCnxn.finishSessionInit Established session 0x139d29d6d5c0008 with negotiated timeout 10000 for client /140.211.11.196:46187
[junit4:junit4]   2> 12249 T430 oaz.ClientCnxn$SendThread.readConnectResult Session establishment complete on server localhost/127.0.0.1:26973, sessionid = 0x139d29d6d5c0008, negotiated timeout = 10000
[junit4:junit4]   2> 12250 T431 oascc.ConnectionManager.process Watcher org.apache.solr.common.cloud.ConnectionManager@649ebbfd name:ZooKeeperConnection Watcher:127.0.0.1:26973/solr got event WatchedEvent state:SyncConnected type:None path:null path:null type:None
[junit4:junit4]   2> 12250 T352 oascc.ConnectionManager.waitForConnected Client is connected to ZooKeeper
[junit4:junit4]   2> 12251 T352 oascc.ZkStateReader.createClusterStateWatchersAndUpdate Updating cluster state from ZooKeeper... 
[junit4:junit4]   2> 12261 T380 C41 P44526 oasc.SolrDeletionPolicy.onInit SolrDeletionPolicy.onInit: commits:num=1
[junit4:junit4]   2> 		commit{dir=NRTCachingDirectory(org.apache.lucene.store.NIOFSDirectory@/usr/home/hudson/hudson-slave/workspace/Lucene-Solr-Tests-trunk-Java6/solr/build/solr-core/test/J1/org.apache.solr.cloud.BasicDistributedZk2Test-1347858296150/jetty1/index lockFactory=org.apache.lucene.store.NativeFSLockFactory@2f72c80f; maxCacheMB=48.0 maxMergeSizeMB=4.0),segFN=segments_1,generation=1,filenames=[segments_1]
[junit4:junit4]   2> 12262 T380 C41 P44526 oasc.SolrDeletionPolicy.updateCommits newest commit = 1
[junit4:junit4]   2>  C40_STATE=coll:collection1 core:collection1 props:{shard=shard1, roles=null, state=recovering, core=collection1, collection=collection1, node_name=127.0.0.1:23727_solr, base_url=http://127.0.0.1:23727/solr}
[junit4:junit4]   2> 12280 T402 C40 P23727 oasc.SolrDeletionPolicy.onInit SolrDeletionPolicy.onInit: commits:num=1
[junit4:junit4]   2> 		commit{dir=NRTCachingDirectory(org.apache.lucene.store.NIOFSDirectory@/usr/home/hudson/hudson-slave/workspace/Lucene-Solr-Tests-trunk-Java6/solr/build/solr-core/test/J1/org.apache.solr.cloud.BasicDistributedZk2Test-1347858296150/jetty3/index lockFactory=org.apache.lucene.store.NativeFSLockFactory@6af7de45; maxCacheMB=48.0 maxMergeSizeMB=4.0),segFN=segments_1,generation=1,filenames=[segments_1]
[junit4:junit4]   2> 12281 T402 C40 P23727 oasc.SolrDeletionPolicy.updateCommits newest commit = 1
[junit4:junit4]   2> 12286 T402 C40 P23727 REQ /update {update.distrib=FROMLEADER&distrib.from=http://127.0.0.1:44526/solr/collection1/&wt=javabin&version=2} status=0 QTime=10 
[junit4:junit4]   2> 12287 T380 C41 P44526 REQ /update {distrib.from=http://127.0.0.1:63596/solr/collection1/&update.distrib=TOLEADER&wt=javabin&version=2} status=0 QTime=30 
[junit4:junit4]   2> 12288 T392 C43 P63596 /update {wt=javabin&version=2} {add=[1]} 0 34
[junit4:junit4]   2> 12289 T352 oasc.AbstractDistribZkTestBase.waitForRecoveriesToFinish Wait for recoveries to finish - collection: collection1 failOnTimeout:true timeout (sec):1800
[junit4:junit4]   2> 12290 T352 oascc.ZkStateReader.updateClusterState Updating cloud state from ZooKeeper... 
[junit4:junit4]   2> 12304 T373 oascc.ZkStateReader.updateClusterState Updating cloud state from ZooKeeper... 
[junit4:junit4]   2> 12320 T372 oascc.ZkStateReader$2.process A cluster state change has occurred - updating...
[junit4:junit4]   2> 12320 T410 oascc.ZkStateReader$2.process A cluster state change has occurred - updating...
[junit4:junit4]   2> 12320 T431 oascc.ZkStateReader$2.process A cluster state change has occurred - updating...
[junit4:junit4]   2> 12320 T424 oascc.ZkStateReader$2.process A cluster state change has occurred - updating...
[junit4:junit4]   2> 12320 T386 oascc.ZkStateReader$2.process A cluster state change has occurred - updating...
[junit4:junit4]   2> 12320 T398 oascc.ZkStateReader$2.process A cluster state change has occurred - updating...
[junit4:junit4]   2> 12320 T429 oascc.ZkStateReader$2.process A cluster state change has occurred - updating...
[junit4:junit4]   2> 13267 T412 C40 P23727 oasc.RecoveryStrategy.doRecovery Begin buffering updates. core=collection1
[junit4:junit4]   2> 13267 T412 C40 P23727 oasu.UpdateLog.bufferUpdates Starting to buffer updates. FSUpdateLog{state=ACTIVE, tlog=tlog{file=./org.apache.solr.cloud.BasicDistributedZk2Test-1347858296150/jetty3/tlog/tlog.0000000000000000000 refcount=1}}
[junit4:junit4]   2> 13268 T412 C40 P23727 oasc.RecoveryStrategy.replicate Attempting to replicate from http://127.0.0.1:44526/solr/collection1/. core=collection1
[junit4:junit4]   2> 13268 T412 C40 P23727 oascsi.HttpClientUtil.createClient Creating new http client, config:maxConnections=128&maxConnectionsPerHost=32&followRedirects=false
[junit4:junit4]   2> 13283 T381 C41 P44526 oasu.DirectUpdateHandler2.commit start commit{flags=0,_version_=0,optimize=false,openSearcher=true,waitSearcher=true,expungeDeletes=false,softCommit=false}
[junit4:junit4]   2> 13292 T352 oascc.ZkStateReader.updateClusterState Updating cloud state from ZooKeeper... 
[junit4:junit4]   2> 13384 T381 C41 P44526 oasc.SolrDeletionPolicy.onCommit SolrDeletionPolicy.onCommit: commits:num=2
[junit4:junit4]   2> 		commit{dir=NRTCachingDirectory(org.apache.lucene.store.NIOFSDirectory@/usr/home/hudson/hudson-slave/workspace/Lucene-Solr-Tests-trunk-Java6/solr/build/solr-core/test/J1/org.apache.solr.cloud.BasicDistributedZk2Test-1347858296150/jetty1/index lockFactory=org.apache.lucene.store.NativeFSLockFactory@2f72c80f; maxCacheMB=48.0 maxMergeSizeMB=4.0),segFN=segments_1,generation=1,filenames=[segments_1]
[junit4:junit4]   2> 		commit{dir=NRTCachingDirectory(org.apache.lucene.store.NIOFSDirectory@/usr/home/hudson/hudson-slave/workspace/Lucene-Solr-Tests-trunk-Java6/solr/build/solr-core/test/J1/org.apache.solr.cloud.BasicDistributedZk2Test-1347858296150/jetty1/index lockFactory=org.apache.lucene.store.NativeFSLockFactory@2f72c80f; maxCacheMB=48.0 maxMergeSizeMB=4.0),segFN=segments_2,generation=2,filenames=[_0_Asserting_0.tim, _0_Lucene40_0.tim, _0.fnm, _0_Asserting_0.tip, _0_Memory_0.ram, _0_nrm.cfs, _0_Lucene40_0.prx, _0_Lucene40_0.tip, _0_Asserting_0.prx, _0_Asserting_0.frq, _0_Lucene40WithOrds_0.tii, _0_Lucene40WithOrds_0.frq, _0_Lucene40_0.frq, _0_nrm.cfe, segments_2, _0.fdx, _0_Lucene40WithOrds_0.prx, _0.si, _0_Lucene40WithOrds_0.tib, _0.fdt]
[junit4:junit4]   2> 13385 T381 C41 P44526 oasc.SolrDeletionPolicy.updateCommits newest commit = 2
[junit4:junit4]   2> 13403 T381 C41 P44526 oass.SolrIndexSearcher.<init> Opening Searcher@703c1a5 main
[junit4:junit4]   2> 13404 T381 C41 P44526 oasu.DirectUpdateHandler2.commit end_commit_flush
[junit4:junit4]   2> 13406 T387 oasc.SolrCore.registerSearcher [collection1] Registered new searcher Searcher@703c1a5 main{StandardDirectoryReader(segments_2:3 _0(5.0):C1)}
[junit4:junit4]   2> 13406 T381 C41 P44526 /update {waitSearcher=true&commit=true&commit_end_point=true&wt=javabin&softCommit=false&version=2} {commit=} 0 123
[junit4:junit4]   2> 13408 T412 C40 P23727 oash.ReplicationHandler.inform Commits will be reserved for  10000
[junit4:junit4]   2> 13408 T412 C40 P23727 oash.SnapPuller.<init>  No value set for 'pollInterval'. Timer Task not started.
[junit4:junit4]   2> 13410 T382 C41 P44526 oash.ReplicationHandler.inform Commits will be reserved for  10000
[junit4:junit4]   2> 13410 T382 C41 P44526 REQ /replication {command=indexversion&wt=javabin&qt=/replication&version=2} status=0 QTime=1 
[junit4:junit4]   2> 13411 T412 C40 P23727 oash.SnapPuller.fetchLatestIndex Master's generation: 2
[junit4:junit4]   2> 13411 T412 C40 P23727 oash.SnapPuller.fetchLatestIndex Slave's generation: 1
[junit4:junit4]   2> 13412 T412 C40 P23727 oash.SnapPuller.fetchLatestIndex Starting replication process
[junit4:junit4]   2> 13417 T382 C41 P44526 REQ /replication {command=filelist&generation=2&wt=javabin&qt=/replication&version=2} status=0 QTime=3 
[junit4:junit4]   2> 13418 T412 C40 P23727 oash.SnapPuller.fetchLatestIndex Number of files in latest index in master: 20
[junit4:junit4]   2> 13426 T412 C40 P23727 oash.SnapPuller.fetchLatestIndex Starting download to ./org.apache.solr.cloud.BasicDistributedZk2Test-1347858296150/jetty3/index.20120917010509564 fullCopy=true
[junit4:junit4]   2> 13441 T382 C41 P44526 REQ /replication {file=_0_Asserting_0.tim&command=filecontent&checksum=true&generation=2&qt=/replication&wt=filestream} status=0 QTime=5 
[junit4:junit4]   2> 13459 T382 C41 P44526 REQ /replication {file=_0_Lucene40_0.tim&command=filecontent&checksum=true&generation=2&qt=/replication&wt=filestream} status=0 QTime=0 
[junit4:junit4]   2> 13464 T382 C41 P44526 REQ /replication {file=_0.fnm&command=filecontent&checksum=true&generation=2&qt=/replication&wt=filestream} status=0 QTime=0 
[junit4:junit4]   2> 13476 T382 C41 P44526 REQ /replication {file=_0_Asserting_0.tip&command=filecontent&checksum=true&generation=2&qt=/replication&wt=filestream} status=0 QTime=0 
[junit4:junit4]   2> 13481 T382 C41 P44526 REQ /replication {file=_0_Memory_0.ram&command=filecontent&checksum=true&generation=2&qt=/replication&wt=filestream} status=0 QTime=0 
[junit4:junit4]   2> 13485 T382 C41 P44526 REQ /replication {file=_0_nrm.cfs&command=filecontent&checksum=true&generation=2&qt=/replication&wt=filestream} status=0 QTime=0 
[junit4:junit4]   2> 13489 T382 C41 P44526 REQ /replication {file=_0_Lucene40_0.prx&command=filecontent&checksum=true&generation=2&qt=/replication&wt=filestream} status=0 QTime=0 
[junit4:junit4]   2> 13494 T382 C41 P44526 REQ /replication {file=_0_Lucene40_0.tip&command=filecontent&checksum=true&generation=2&qt=/replication&wt=filestream} status=0 QTime=0 
[junit4:junit4]   2> 13498 T382 C41 P44526 REQ /replication {file=_0_Asserting_0.prx&command=filecontent&checksum=true&generation=2&qt=/replication&wt=filestream} status=0 QTime=0 
[junit4:junit4]   2> 13502 T382 C41 P44526 REQ /replication {file=_0_Lucene40WithOrds_0.tii&command=filecontent&checksum=true&generation=2&qt=/replication&wt=filestream} status=0 QTime=0 
[junit4:junit4]   2> 13507 T382 C41 P44526 REQ /replication {file=_0_Asserting_0.frq&command=filecontent&checksum=true&generation=2&qt=/replication&wt=filestream} status=0 QTime=0 
[junit4:junit4]   2> 13511 T382 C41 P44526 REQ /replication {file=_0_Lucene40_0.frq&command=filecontent&checksum=true&generation=2&qt=/replication&wt=filestream} status=0 QTime=0 
[junit4:junit4]   2> 13515 T382 C41 P44526 REQ /replication {file=_0_Lucene40WithOrds_0.frq&command=filecontent&checksum=true&generation=2&qt=/replication&wt=filestream} status=0 QTime=0 
[junit4:junit4]   2> 13519 T382 C41 P44526 REQ /replication {file=_0_nrm.cfe&command=filecontent&checksum=true&generation=2&qt=/replication&wt=filestream} status=0 QTime=0 
[junit4:junit4]   2> 13524 T382 C41 P44526 REQ /replication {file=segments_2&command=filecontent&checksum=true&generation=2&qt=/replication&wt=filestream} status=0 QTime=0 
[junit4:junit4]   2> 13529 T382 C41 P44526 REQ /replication {file=_0.fdx&command=filecontent&checksum=true&generation=2&qt=/replication&wt=filestream} status=0 QTime=0 
[junit4:junit4]   2> 13533 T382 C41 P44526 REQ /replication {file=_0_Lucene40WithOrds_0.prx&command=filecontent&checksum=true&generation=2&qt=/replication&wt=filestream} status=0 QTime=0 
[junit4:junit4]   2> 13537 T382 C41 P44526 REQ /replication {file=_0.si&command=filecontent&checksum=true&generation=2&qt=/replication&wt=filestream} status=0 QTime=0 
[junit4:junit4]   2> 13541 T382 C41 P44526 REQ /replication {file=_0_Lucene40WithOrds_0.tib&command=filecontent&checksum=true&generation=2&qt=/replication&wt=filestream} status=0 QTime=0 
[junit4:junit4]   2> 13545 T382 C41 P44526 REQ /replication {file=_0.fdt&command=filecontent&checksum=true&generation=2&qt=/replication&wt=filestream} status=0 QTime=0 
[junit4:junit4]   2> 13547 T412 C40 P23727 oash.SnapPuller.fetchLatestIndex Total time taken for download : 0 secs
[junit4:junit4]   2> 13579 T412 C40 P23727 oash.SnapPuller.modifyIndexProps New index installed. Updating index properties... index=index.20120917010509564
[junit4:junit4]   2> 13592 T412 C40 P23727 oasu.DefaultSolrCoreState.newIndexWriter Creating new IndexWriter...
[junit4:junit4]   2> 13592 T412 C40 P23727 oasu.DefaultSolrCoreState.newIndexWriter Waiting until IndexWriter is unused... core=collection1
[junit4:junit4]   2> 13592 T412 C40 P23727 oasu.DefaultSolrCoreState.newIndexWriter Rollback old IndexWriter... core=collection1
[junit4:junit4]   2> 13597 T412 C40 P23727 oasc.SolrCore.getNewIndexDir WARNING New index directory detected: old=./org.apache.solr.cloud.BasicDistributedZk2Test-1347858296150/jetty3/index/ new=./org.apache.solr.cloud.BasicDistributedZk2Test-1347858296150/jetty3/index.20120917010509564
[junit4:junit4]   2> 13598 T412 C40 P23727 oasc.CachingDirectoryFactory.get return new directory for /usr/home/hudson/hudson-slave/workspace/Lucene-Solr-Tests-trunk-Java6/solr/build/solr-core/test/J1/./org.apache.solr.cloud.BasicDistributedZk2Test-1347858296150/jetty3/index.20120917010509564 forceNew:true
[junit4:junit4]   2> 13608 T412 C40 P23727 oasc.SolrDeletionPolicy.onInit SolrDeletionPolicy.onInit: commits:num=1
[junit4:junit4]   2> 		commit{dir=NRTCachingDirectory(org.apache.lucene.store.NIOFSDirectory@/usr/home/hudson/hudson-slave/workspace/Lucene-Solr-Tests-trunk-Java6/solr/build/solr-core/test/J1/org.apache.solr.cloud.BasicDistributedZk2Test-1347858296150/jetty3/index.20120917010509564 lockFactory=org.apache.lucene.store.NativeFSLockFactory@7dc999c4; maxCacheMB=48.0 maxMergeSizeMB=4.0),segFN=segments_2,generation=2,filenames=[_0_Asserting_0.tim, _0_Lucene40_0.tim, _0.fnm, _0_Asserting_0.tip, _0_Memory_0.ram, _0_nrm.cfs, _0_Lucene40_0.prx, _0_Lucene40_0.tip, _0_Asserting_0.prx, _0_Asserting_0.frq, _0_Lucene40WithOrds_0.tii, _0_Lucene40WithOrds_0.frq, _0_Lucene40_0.frq, _0_nrm.cfe, segments_2, _0.fdx, _0_Lucene40WithOrds_0.prx, _0.si, _0_Lucene40WithOrds_0.tib, _0.fdt]
[junit4:junit4]   2> 13608 T412 C40 P23727 oasc.SolrDeletionPolicy.updateCommits newest commit = 2
[junit4:junit4]   2> 13608 T412 C40 P23727 oasu.DefaultSolrCoreState.newIndexWriter New IndexWriter is ready to be used.
[junit4:junit4]   2> 13613 T412 C40 P23727 oass.SolrIndexSearcher.<init> Opening Searcher@14235ed5 main
[junit4:junit4]   2> 13615 T411 oasc.SolrCore.registerSearcher [collection1] Registered new searcher Searcher@14235ed5 main{StandardDirectoryReader(segments_2:3:nrt _0(5.0):C1)}
[junit4:junit4]   2> 13616 T411 oasc.CachingDirectoryFactory.close Closing directory:/usr/home/hudson/hudson-slave/workspace/Lucene-Solr-Tests-trunk-Java6/solr/build/solr-core/test/J1/./org.apache.solr.cloud.BasicDistributedZk2Test-1347858296150/jetty3/index
[junit4:junit4]   2> 13616 T411 oash.SnapPuller$2.onClose removing old index directory ./org.apache.solr.cloud.BasicDistributedZk2Test-1347858296150/jetty3/index
[junit4:junit4]   2> 13618 T412 C40 P23727 oasu.DirectUpdateHandler2.commit start commit{flags=0,_version_=0,optimize=false,openSearcher=false,waitSearcher=false,expungeDeletes=false,softCommit=false}
[junit4:junit4]   2> 13620 T412 C40 P23727 oasu.DirectUpdateHandler2.commit end_commit_flush
[junit4:junit4]   2> 13620 T412 C40 P23727 oasc.RecoveryStrategy.replay Replaying buffered documents. core=collection1
[junit4:junit4]   2> 13620 T435 C40 P23727 oasu.UpdateLog$LogReplayer.doReplay WARNING Starting log replay tlog{file=./org.apache.solr.cloud.BasicDistributedZk2Test-1347858296150/jetty3/tlog/tlog.0000000000000000000 refcount=2} active=true starting pos=436
[junit4:junit4]   2> 13621 T435 C40 P23727 oasu.DirectUpdateHandler2.commit start commit{flags=2,_version_=0,optimize=false,openSearcher=true,waitSearcher=true,expungeDeletes=false,softCommit=false}
[junit4:junit4]   2> 13622 T435 C40 P23727 oass.SolrIndexSearcher.<init> Opening Searcher@29a260e7 main
[junit4:junit4]   2> 13623 T435 C40 P23727 oasu.DirectUpdateHandler2.commit end_commit_flush
[junit4:junit4]   2> 13624 T411 oasc.SolrCore.registerSearcher [collection1] Registered new searcher Searcher@29a260e7 main{StandardDirectoryReader(segments_2:3:nrt _0(5.0):C1)}
[junit4:junit4]   2> 13625 T435 C40 P23727 oasu.UpdateLog$LogReplayer.run WARNING Log replay finished. recoveryInfo=RecoveryInfo{adds=0 deletes=0 deleteByQuery=0 errors=0 positionOfStart=436}
[junit4:junit4]   2> 13625 T412 C40 P23727 oasc.RecoveryStrategy.doRecovery Replication Recovery was successful - registering as Active. core=collection1
[junit4:junit4]   2> 13628 T412 C40 P23727 oasc.RecoveryStrategy.doRecovery Finished recovery process. core=collection1
[junit4:junit4]   2> 13833 T373 oascc.ZkStateReader.updateClusterState Updating cloud state from ZooKeeper... 
[junit4:junit4]   2> 13854 T429 oascc.ZkStateReader$2.process A cluster state change has occurred - updating...
[junit4:junit4]   2> 13854 T431 oascc.ZkStateReader$2.process A cluster state change has occurred - updating...
[junit4:junit4]   2> 13854 T424 oascc.ZkStateReader$2.process A cluster state change has occurred - updating...
[junit4:junit4]   2> 13854 T386 oascc.ZkStateReader$2.process A cluster state change has occurred - updating...
[junit4:junit4]   2> 13854 T410 oascc.ZkStateReader$2.process A cluster state change has occurred - updating...
[junit4:junit4]   2> 13854 T398 oascc.ZkStateReader$2.process A cluster state change has occurred - updating...
[junit4:junit4]   2> 13854 T372 oascc.ZkStateReader$2.process A cluster state change has occurred - updating...
[junit4:junit4]   2> 14294 T352 oascc.ZkStateReader.updateClusterState Updating cloud state from ZooKeeper... 
[junit4:junit4]   2>  C42_STATE=coll:collection1 core:collection1 props:{shard=shard2, roles=null, state=recovering, core=collection1, collection=collection1, node_name=127.0.0.1:54247_solr, base_url=http://127.0.0.1:54247/solr}
[junit4:junit4]   2> 15202 T426 C42 P54247 oasc.RecoveryStrategy.doRecovery Begin buffering updates. core=collection1
[junit4:junit4]   2> 15202 T426 C42 P54247 oasu.UpdateLog.bufferUpdates Starting to buffer updates. FSUpdateLog{state=ACTIVE, tlog=null}
[junit4:junit4]   2> 15202 T426 C42 P54247 oasc.RecoveryStrategy.replicate Attempting to replicate from http://127.0.0.1:63596/solr/collection1/. core=collection1
[junit4:junit4]   2> 15203 T426 C42 P54247 oascsi.HttpClientUtil.createClient Creating new http client, config:maxConnections=128&maxConnectionsPerHost=32&followRedirects=false
[junit4:junit4]   2> 15219 T393 C43 P63596 oasu.DirectUpdateHandler2.commit start commit{flags=0,_version_=0,optimize=false,openSearcher=true,waitSearcher=true,expungeDeletes=false,softCommit=false}
[junit4:junit4]   2> 15225 T393 C43 P63596 oasc.SolrDeletionPolicy.onInit SolrDeletionPolicy.onInit: commits:num=1
[junit4:junit4]   2> 		commit{dir=NRTCachingDirectory(org.apache.lucene.store.NIOFSDirectory@/usr/home/hudson/hudson-slave/workspace/Lucene-Solr-Tests-trunk-Java6/solr/build/solr-core/test/J1/org.apache.solr.cloud.BasicDistributedZk2Test-1347858296150/jetty2/index lockFactory=org.apache.lucene.store.NativeFSLockFactory@7fe360a5; maxCacheMB=48.0 maxMergeSizeMB=4.0),segFN=segments_1,generation=1,filenames=[segments_1]
[junit4:junit4]   2> 15226 T393 C43 P63596 oasc.SolrDeletionPolicy.updateCommits newest commit = 1
[junit4:junit4]   2> 15227 T393 C43 P63596 oass.SolrIndexSearcher.<init> Opening Searcher@66d6f833 main
[junit4:junit4]   2> 15228 T393 C43 P63596 oasu.DirectUpdateHandler2.commit end_commit_flush
[junit4:junit4]   2> 15230 T399 oasc.SolrCore.registerSearcher [collection1] Registered new searcher Searcher@66d6f833 main{StandardDirectoryReader(segments_1:1)}
[junit4:junit4]   2> 15231 T393 C43 P63596 /update {waitSearcher=true&commit=true&commit_end_point=true&wt=javabin&softCommit=false&version=2} {commit=} 0 12
[junit4:junit4]   2> 15232 T426 C42 P54247 oash.ReplicationHandler.inform Commits will be reserved for  10000
[junit4:junit4]   2> 15232 T426 C42 P54247 oash.SnapPuller.<init>  No value set for 'pollInterval'. Timer Task not started.
[junit4:junit4]   2> 15234 T394 C43 P63596 oash.ReplicationHandler.inform Commits will be reserved for  10000
[junit4:junit4]   2> 15235 T394 C43 P63596 REQ /replication {command=indexversion&wt=javabin&qt=/replication&version=2} status=0 QTime=1 
[junit4:junit4]   2> 15240 T426 C42 P54247 oasc.SolrDeletionPolicy.onInit SolrDeletionPolicy.onInit: commits:num=1
[junit4:junit4]   2> 		commit{dir=NRTCachingDirectory(org.apache.lucene.store.NIOFSDirectory@/usr/home/hudson/hudson-slave/workspace/Lucene-Solr-Tests-trunk-Java6/solr/build/solr-core/test/J1/org.apache.solr.cloud.BasicDistributedZk2Test-1347858296150/jetty4/index lockFactory=org.apache.lucene.store.NativeFSLockFactory@1d8f59e3; maxCacheMB=48.0 maxMergeSizeMB=4.0),segFN=segments_1,generation=1,filenames=[segments_1]
[junit4:junit4]   2> 15240 T426 C42 P54247 oasc.SolrDeletionPolicy.updateCommits newest commit = 1
[junit4:junit4]   2> 15241 T426 C42 P54247 oasu.DirectUpdateHandler2.commit start commit{flags=0,_version_=0,optimize=false,openSearcher=true,waitSearcher=true,expungeDeletes=false,softCommit=false}
[junit4:junit4]   2> 15257 T426 C42 P54247 oasc.SolrDeletionPolicy.onCommit SolrDeletionPolicy.onCommit: commits:num=2
[junit4:junit4]   2> 		commit{dir=NRTCachingDirectory(org.apache.lucene.store.NIOFSDirectory@/usr/home/hudson/hudson-slave/workspace/Lucene-Solr-Tests-trunk-Java6/solr/build/solr-core/test/J1/org.apache.solr.cloud.BasicDistributedZk2Test-1347858296150/jetty4/index lockFactory=org.apache.lucene.store.NativeFSLockFactory@1d8f59e3; maxCacheMB=48.0 maxMergeSizeMB=4.0),segFN=segments_1,generation=1,filenames=[segments_1]
[junit4:junit4]   2> 		commit{dir=NRTCachingDirectory(org.apache.lucene.store.NIOFSDirectory@/usr/home/hudson/hudson-slave/workspace/Lucene-Solr-Tests-trunk-Java6/solr/build/solr-core/test/J1/org.apache.solr.cloud.BasicDistributedZk2Test-1347858296150/jetty4/index lockFactory=org.apache.lucene.store.NativeFSLockFactory@1d8f59e3; maxCacheMB=48.0 maxMergeSizeMB=4.0),segFN=segments_2,generation=2,filenames=[segments_2]
[junit4:junit4]   2> 15257 T426 C42 P54247 oasc.SolrDeletionPolicy.updateCommits newest commit = 2
[junit4:junit4]   2> 15262 T426 C42 P54247 oass.SolrIndexSearcher.<init> Opening Searcher@6303ddfd main
[junit4:junit4]   2> 15262 T426 C42 P54247 oasu.DirectUpdateHandler2.commit end_commit_flush
[junit4:junit4]   2> 15264 T425 oasc.SolrCore.registerSearcher [collection1] Registered new searcher Searcher@6303ddfd main{StandardDirectoryReader(segments_2:2)}
[junit4:junit4]   2> 15265 T426 C42 P54247 oasc.RecoveryStrategy.replay No replay needed. core=collection1
[junit4:junit4]   2> 15265 T426 C42 P54247 oasc.RecoveryStrategy.doRecovery Replication Recovery was successful - registering as Active. core=collection1
[junit4:junit4]   2> 15267 T426 C42 P54247 oasc.RecoveryStrategy.doRecovery Finished recovery process. core=collection1
[junit4:junit4]   2> 15296 T352 oascc.ZkStateReader.updateClusterState Updating cloud state from ZooKeeper... 
[junit4:junit4]   2> 15364 T373 oascc.ZkStateReader.updateClusterState Updating cloud state from ZooKeeper... 
[junit4:junit4]   2> 15389 T429 oascc.ZkStateReader$2.process A cluster state change has occurred - updating...
[junit4:junit4]   2> 15389 T372 oascc.ZkStateReader$2.process A cluster state change has occurred - updating...
[junit4:junit4]   2> 15390 T431 oascc.ZkStateReader$2.process A cluster state change has occurred - updating...
[junit4:junit4]   2> 15389 T424 oascc.ZkStateReader$2.process A cluster state change has occurred - updating...
[junit4:junit4]   2> 15389 T386 oascc.ZkStateReader$2.process A cluster state change has occurred - updating...
[junit4:junit4]   2> 15389 T410 oascc.ZkStateReader$2.process A cluster state change has occurred - updating...
[junit4:junit4]   2> 15389 T398 oascc.ZkStateReader$2.process A cluster state change has occurred - updating...
[junit4:junit4]   2> 16298 T352 oascc.ZkStateReader.updateClusterState Updating cloud state from ZooKeeper... 
[junit4:junit4]   2> 16302 T364 C44 P45657 oasu.DirectUpdateHandler2.commit start commit{flags=0,_version_=0,optimize=false,openSearcher=true,waitSearcher=true,expungeDeletes=false,softCommit=false}
[junit4:junit4]   2> 16410 T364 C44 P45657 oasc.SolrDeletionPolicy.onCommit SolrDeletionPolicy.onCommit: commits:num=2
[junit4:junit4]   2> 		commit{dir=NRTCachingDirectory(org.apache.lucene.store.NIOFSDirectory@/usr/home/hudson/hudson-slave/workspace/Lucene-Solr-Tests-trunk-Java6/solr/build/solr-core/test/J1/org.apache.solr.cloud.BasicDistributedZk2Test-1347858296150/control/data/index lockFactory=org.apache.lucene.store.NativeFSLockFactory@502438db; maxCacheMB=48.0 maxMergeSizeMB=4.0),segFN=segments_1,generation=1,filenames=[segments_1]
[junit4:junit4]   2> 		commit{dir=NRTCachingDirectory(org.apache.lucene.store.NIOFSDirectory@/usr/home/hudson/hudson-slave/workspace/Lucene-Solr-Tests-trunk-Java6/solr/build/solr-core/test/J1/org.apache.solr.cloud.BasicDistributedZk2Test-1347858296150/control/data/index lockFactory=org.apache.lucene.store.NativeFSLockFactory@502438db; maxCacheMB=48.0 maxMergeSizeMB=4.0),segFN=segments_2,generation=2,filenames=[_0_Asserting_0.tim, _0_Lucene40_0.tim, _0.fnm, _0_Asserting_0.tip, _0_Memory_0.ram, _0_nrm.cfs, _0_Lucene40_0.prx, _0_Lucene40_0.tip, _0_Asserting_0.prx, _0_Asserting_0.frq, _0_Lucene40WithOrds_0.tii, _0_Lucene40WithOrds_0.frq, _0_Lucene40_0.frq, _0_nrm.cfe, segments_2, _0.fdx, _0_Lucene40WithOrds_0.prx, _0.si, _0_Lucene40WithOrds_0.tib, _0.fdt]
[junit4:junit4]   2> 16411 T364 C44 P45657 oasc.SolrDeletionPolicy.updateCommits newest commit = 2
[junit4:junit4]   2> 16426 T364 C44 P45657 oass.SolrIndexSearcher.<init> Opening Searcher@5c5e3f6d main
[junit4:junit4]   2> 16427 T364 C44 P45657 oasu.DirectUpdateHandler2.commit end_commit_flush
[junit4:junit4]   2> 16428 T375 oasc.SolrCore.registerSearcher [collection1] Registered new searcher Searcher@5c5e3f6d main{StandardDirectoryReader(segments_2:3 _0(5.0):C1)}
[junit4:junit4]   2> 16429 T364 C44 P45657 /update {waitSearcher=true&wt=javabin&commit=true&softCommit=false&version=2} {commit=} 0 127
[junit4:junit4]   2> 16431 T383 C41 P44526 oasu.DirectUpdateHandler2.commit start commit{flags=0,_version_=0,optimize=false,openSearcher=true,waitSearcher=true,expungeDeletes=false,softCommit=false}
[junit4:junit4]   2> 16443 T383 C41 P44526 oass.SolrIndexSearcher.<init> Opening Searcher@62d67b4 main
[junit4:junit4]   2> 16444 T383 C41 P44526 oasu.DirectUpdateHandler2.commit end_commit_flush
[junit4:junit4]   2> 16445 T387 oasc.SolrCore.registerSearcher [collection1] Registered new searcher Searcher@62d67b4 main{StandardDirectoryReader(segments_2:3 _0(5.0):C1)}
[junit4:junit4]   2> 16446 T383 C41 P44526 oasu.SolrCmdDistributor.distribCommit Distrib commit to:[StdNode: http://127.0.0.1:23727/solr/collection1/, StdNode: http://127.0.0.1:63596/solr/collection1/, StdNode: http://127.0.0.1:54247/solr/collection1/]
[junit4:junit4]   2> 16448 T395 C43 P63596 oasu.DirectUpdateHandler2.commit start commit{flags=0,_version_=0,optimize=false,openSearcher=true,waitSearcher=true,expungeDeletes=false,softCommit=false}
[junit4:junit4]   2>  C40_STATE=coll:collection1 core:collection1 props:{shard=shard1, roles=null, state=active, core=collection1, collection=collection1, node_name=127.0.0.1:23727_solr, base_url=http://127.0.0.1:23727/solr}
[junit4:junit4]   2> 16450 T402 C40 P23727 oasu.DirectUpdateHandler2.commit start commit{flags=0,_version_=0,optimize=false,openSearcher=true,waitSearcher=true,expungeDeletes=false,softCommit=false}
[junit4:junit4]   2> 16452 T402 C40 P23727 oass.SolrIndexSearcher.<init> Opening Searcher@657430d3 main
[junit4:junit4]   2> 16453 T395 C43 P63596 oass.SolrIndexSearcher.<init> Opening Searcher@632c17b6 main
[junit4:junit4]   2> 16454 T402 C40 P23727 oasu.DirectUpdateHandler2.commit end_commit_flush
[junit4:junit4]   2> 16454 T395 C43 P63596 oasu.DirectUpdateHandler2.commit end_commit_flush
[junit4:junit4]   2> 16454 T399 oasc.JmxMonitoredMap.put WARNING Failed to register info bean: searcher javax.management.InstanceAlreadyExistsException: solr/collection1:type=searcher,id=org.apache.solr.search.SolrIndexSearcher
[junit4:junit4]   2> 	at com.sun.jmx.mbeanserver.Repository.addMBean(Repository.java:467)
[junit4:junit4]   2> 	at com.sun.jmx.interceptor.DefaultMBeanServerInterceptor.internal_addObject(DefaultMBeanServerInterceptor.java:1520)
[junit4:junit4]   2> 	at com.sun.jmx.interceptor.DefaultMBeanServerInterceptor.registerDynamicMBean(DefaultMBeanServerInterceptor.java:986)
[junit4:junit4]   2> 	at com.sun.jmx.interceptor.DefaultMBeanServerInterceptor.registerObject(DefaultMBeanServerInterceptor.java:938)
[junit4:junit4]   2> 	at com.sun.jmx.interceptor.DefaultMBeanServerInterceptor.registerMBean(DefaultMBeanServerInterceptor.java:330)
[junit4:junit4]   2> 	at com.sun.jmx.mbeanserver.JmxMBeanServer.registerMBean(JmxMBeanServer.java:516)
[junit4:junit4]   2> 	at org.apache.solr.core.JmxMonitoredMap.put(JmxMonitoredMap.java:140)
[junit4:junit4]   2> 	at org.apache.solr.core.JmxMonitoredMap.put(JmxMonitoredMap.java:51)
[junit4:junit4]   2> 	at org.apache.solr.search.SolrIndexSearcher.register(SolrIndexSearcher.java:242)
[junit4:junit4]   2> 	at org.apache.solr.core.SolrCore.registerSearcher(SolrCore.java:1642)
[junit4:junit4]   2> 	at org.apache.solr.core.SolrCore.access$000(SolrCore.java:121)
[junit4:junit4]   2> 	at org.apache.solr.core.SolrCore$7.call(SolrCore.java:1519)
[junit4:junit4]   2> 	at java.util.concurrent.FutureTask$Sync.innerRun(FutureTask.java:334)
[junit4:junit4]   2> 	at java.util.concurrent.FutureTask.run(FutureTask.java:166)
[junit4:junit4]   2> 	at java.util.concurrent.ThreadPoolExecutor.runWorker(ThreadPoolExecutor.java:1110)
[junit4:junit4]   2> 	at java.util.concurrent.ThreadPoolExecutor$Worker.run(ThreadPoolExecutor.java:603)
[junit4:junit4]   2> 	at java.lang.Thread.run(Thread.java:679)
[junit4:junit4]   2> 
[junit4:junit4]   2> 16455 T411 oasc.SolrCore.registerSearcher [collection1] Registered new searcher Searcher@657430d3 main{StandardDirectoryReader(segments_2:3:nrt _0(5.0):C1)}
[junit4:junit4]   2> 16456 T402 C40 P23727 /update {waitSearcher=true&commit=true&wt=javabin&commit_end_point=true&expungeDeletes=false&softCommit=false&version=2} {commit=} 0 6
[junit4:junit4]   2> 16456 T399 oasc.SolrCore.registerSearcher [collection1] Registered new searcher Searcher@632c17b6 main{StandardDirectoryReader(segments_1:1)}
[junit4:junit4]   2> 16457 T395 C43 P63596 /update {waitSearcher=true&commit=true&wt=javabin&commit_end_point=true&expungeDeletes=false&softCommit=false&version=2} {commit=} 0 9
[junit4:junit4]   2>  C42_STATE=coll:collection1 core:collection1 props:{shard=shard2, roles=null, state=active, core=collection1, collection=collection1, node_name=127.0.0.1:54247_solr, base_url=http://127.0.0.1:54247/solr}
[junit4:junit4]   2> 16459 T416 C42 P54247 oasu.DirectUpdateHandler2.commit start commit{flags=0,_version_=0,optimize=false,openSearcher=true,waitSearcher=true,expungeDeletes=false,softCommit=false}
[junit4:junit4]   2> 16463 T416 C42 P54247 oass.SolrIndexSearcher.<init> Opening Searcher@61935511 main
[junit4:junit4]   2> 16464 T416 C42 P54247 oasu.DirectUpdateHandler2.commit end_commit_flush
[junit4:junit4]   2> 16465 T425 oasc.SolrCore.registerSearcher [collection1] Registered new searcher Searcher@61935511 main{StandardDirectoryReader(segments_2:2)}
[junit4:junit4]   2> 16466 T416 C42 P54247 /update {waitSearcher=true&commit=true&wt=javabin&commit_end_point=true&expungeDeletes=false&softCommit=false&version=2} {commit=} 0 7
[junit4:junit4]   2> 16467 T383 C41 P44526 /update {waitSearcher=true&wt=javabin&commit=true&softCommit=false&version=2} {commit=} 0 36
[junit4:junit4]   2> 16473 T365 C44 P45657 REQ /select {fl=id,score&shard.url=127.0.0.1:45657/solr/collection1/&NOW=1347858312615&start=0&q=*:*&distrib=false&isShard=true&wt=javabin&fsv=true&rows=10&version=2} hits=1 status=0 QTime=1 
[junit4:junit4]   2> 16476 T365 C44 P45657 REQ /select {shard.url=127.0.0.1:45657/solr/collection1/&NOW=1347858312615&q=*:*&ids=1&distrib=false&isShard=true&wt=javabin&version=2} status=0 QTime=0 
[junit4:junit4]   2> 16477 T364 C44 P45657 REQ /select {wt=javabin&q=*:*&version=2} hits=1 status=0 QTime=8 
[junit4:junit4]   2> 16478 T352 oaz.ZooKeeper.<init> Initiating client connection, connectString=127.0.0.1:26973/solr sessionTimeout=10000 watcher=org.apache.solr.common.cloud.ConnectionManager@1fde3a4e
[junit4:junit4]   2> 16479 T439 oaz.ClientCnxn$SendThread.startConnect Opening socket connection to server /127.0.0.1:26973
[junit4:junit4]   2> 16479 T352 oascc.ConnectionManager.waitForConnected Waiting for client to connect to ZooKeeper
[junit4:junit4]   2> 16481 T439 oaz.ClientCnxn$SendThread.primeConnection Socket connection established to localhost/127.0.0.1:26973, initiating session
[junit4:junit4]   2> 16481 T354 oazs.NIOServerCnxn$Factory.run Accepted socket connection from /140.211.11.196:24946
[junit4:junit4]   2> 16481 T354 oazs.NIOServerCnxn.readConnectRequest Client attempting to establish new session at /140.211.11.196:24946
[junit4:junit4]   2> 16488 T356 oazs.NIOServerCnxn.finishSessionInit Established session 0x139d29d6d5c0009 with negotiated timeout 10000 for client /140.211.11.196:24946
[junit4:junit4]   2> 16488 T439 oaz.ClientCnxn$SendThread.readConnectResult Session establishment complete on server localhost/127.0.0.1:26973, sessionid = 0x139d29d6d5c0009, negotiated timeout = 10000
[junit4:junit4]   2> 16488 T440 oascc.ConnectionManager.process Watcher org.apache.solr.common.cloud.ConnectionManager@1fde3a4e name:ZooKeeperConnection Watcher:127.0.0.1:26973/solr got event WatchedEvent state:SyncConnected type:None path:null path:null type:None
[junit4:junit4]   2> 16488 T352 oascc.ConnectionManager.waitForConnected Client is connected to ZooKeeper
[junit4:junit4]   2> 16489 T352 oascc.ZkStateReader.createClusterStateWatchersAndUpdate Updating cluster state from ZooKeeper... 
[junit4:junit4]   2> 16491 T357 oazs.PrepRequestProcessor.pRequest Processed session termination for sessionid: 0x139d29d6d5c0009
[junit4:junit4]   2> 16493 T440 oaz.ClientCnxn$EventThread.run EventThread shut down
[junit4:junit4]   2> 16493 T352 oaz.ZooKeeper.close Session: 0x139d29d6d5c0009 closed
[junit4:junit4]   2> 16493 T354 oazs.NIOServerCnxn.closeSock Closed socket connection for client /140.211.11.196:24946 which had sessionid 0x139d29d6d5c0009
[junit4:junit4]   2> 16495 T384 C41 P44526 REQ /select {distrib=false&wt=javabin&q=*:*&version=2} hits=1 status=0 QTime=0 
[junit4:junit4]   2> 16498 T396 C43 P63596 REQ /select {distrib=false&wt=javabin&q=*:*&version=2} hits=0 status=0 QTime=0 
[junit4:junit4]   2> 16505 T379 C41 P44526 REQ /select {fl=id,score&shard.url=127.0.0.1:44526/solr/collection1/|127.0.0.1:23727/solr/collection1/&NOW=1347858312648&start=0&q=*:*&distrib=false&isShard=true&wt=javabin&fsv=true&rows=10&version=2} hits=1 status=0 QTime=1 
[junit4:junit4]   2> 16505 T391 C43 P63596 REQ /select {fl=id,score&shard.url=127.0.0.1:63596/solr/collection1/|127.0.0.1:54247/solr/collection1/&NOW=1347858312648&start=0&q=*:*&distrib=false&isShard=true&wt=javabin&fsv=true&rows=10&version=2} hits=0 status=0 QTime=0 
[junit4:junit4]   2> 16508 T379 C41 P44526 REQ /select {shard.url=127.0.0.1:44526/solr/collection1/|127.0.0.1:23727/solr/collection1/&NOW=1347858312648&q=*:*&ids=1&distrib=false&isShard=true&wt=javabin&version=2} status=0 QTime=0 
[junit4:junit4]   2> 16509 T417 C42 P54247 REQ /select {wt=javabin&q=*:*&version=2} hits=1 status=0 QTime=7 
[junit4:junit4]   2> 16519 T364 C44 P45657 /update {wt=javabin&version=2} {add=[2 (1413331878055772160)]} 0 6
[junit4:junit4]   2> 16536 T416 C42 P54247 REQ /update {distrib.from=http://127.0.0.1:63596/solr/collection1/&update.distrib=FROMLEADER&wt=javabin&version=2} status=0 QTime=6 
[junit4:junit4]   2> 16537 T392 C43 P63596 /update {wt=javabin&version=2} {add=[2 (1413331878065209344)]} 0 15
[junit4:junit4]   2> 16545 T364 C44 P45657 /update {wt=javabin&version=2} {add=[3 (1413331878084083712)]} 0 5
[junit4:junit4]   2> 16556 T416 C42 P54247 REQ /update {distrib.from=http://127.0.0.1:63596/solr/collection1/&update.distrib=FROMLEADER&wt=javabin&version=2} status=0 QTime=3 
[junit4:junit4]   2> 16557 T392 C43 P63596 /update {wt=javabin&version=2} {add=[3 (1413331878092472320)]} 0 9
[junit4:junit4]   2> 16565 T364 C44 P45657 /update {wt=javabin&version=2} {add=[4 (1413331878105055232)]} 0 5
[junit4:junit4]   2> 16583 T402 C40 P23727 REQ /update {distrib.from=http://127.0.0.1:44526/solr/collection1/&update.distrib=FROMLEADER&wt=javabin&version=2} status=0 QTime=6 
[junit4:junit4]   2> 16584 T383 C41 P44526 /update {wt=javabin&version=2} {add=[4 (1413331878114492416)]} 0 15
[junit4:junit4]   2> 16592 T364 C44 P45657 /update {wt=javabin&version=2} {add=[5 (1413331878133366784)]} 0 5
[junit4:junit4]   2> 16607 T416 C42 P54247 REQ /update {update.distrib=FROMLEADER&distrib.from=http://127.0.0.1:63596/solr/collection1/&wt=javabin&version=2} status=0 QTime=3 
[junit4:junit4]   2> 16608 T395 C43 P63596 REQ /update {distrib.from=http://127.0.0.1:44526/solr/collection1/&update.distrib=TOLEADER&wt=javabin&version=2} status=0 QTime=10 
[junit4:junit4]   2> 16609 T383 C41 P44526 /update {wt=javabin&version=2} {add=[5]} 0 14
[junit4:junit4]   2> 16616 T364 C44 P45657 /update {wt=javabin&version=2} {add=[6 (1413331878159581184)]} 0 4
[junit4:junit4]   2> 16627 T416 C42 P54247 REQ /update {distrib.from=http://127.0.0.1:63596/solr/collection1/&update.distrib=FROMLEADER&wt=javabin&version=2} status=0 QTime=3 
[junit4:junit4]   2> 16628 T392 C43 P63596 /update {wt=javabin&version=2} {add=[6 (1413331878166921216)]} 0 9
[junit4:junit4]   2> 16635 T364 C44 P45657 /update {wt=javabin&version=2} {add=[7 (1413331878179504128)]} 0 4
[junit4:junit4]   2> 16646 T416 C42 P54247 REQ /update {distrib.from=http://127.0.0.1:63596/solr/collection1/&update.distrib=FROMLEADER&wt=javabin&version=2} status=0 QTime=3 
[junit4:junit4]   2> 16647 T392 C43 P63596 /update {wt=javabin&version=2} {add=[7 (1413331878186844160)]} 0 9
[junit4:junit4]   2> 16653 T364 C44 P45657 /update {wt=javabin&version=2} {add=[8 (1413331878199427072)]} 0 3
[junit4:junit4]   2> 16664 T402 C40 P23727 REQ /update {distrib.from=http://127.0.0.1:44526/solr/collection1/&update.distrib=FROMLEADER&wt=javabin&version=2} status=0 QTime=3 
[junit4:junit4]   2> 16665 T383 C41 P44526 /update {wt=javabin&version=2} {add=[8 (1413331878205718528)]} 0 9
[junit4:junit4]   2> 16671 T364 C44 P45657 /update {wt=javabin&version=2} {add=[9 (1413331878218301440)]} 0 3
[junit4:junit4]   2> 16685 T416 C42 P54247 REQ /update {update.distrib=FROMLEADER&distrib.from=http://127.0.0.1:63596/solr/collection1/&wt=javabin&version=2} status=0 QTime=3 
[junit4:junit4]   2> 16685 T395 C43 P63596 REQ /update {distrib.from=http://127.0.0.1:44526/solr/collection1/&update.distrib=TOLEADER&wt=javabin&version=2} status=0 QTime=8 
[junit4:junit4]   2> 16686 T383 C41 P44526 /update {wt=javabin&version=2} {add=[9]} 0 12
[junit4:junit4]   2> 16692 T364 C44 P45657 /update {wt=javabin&version=2} {add=[10 (1413331878240321536)]} 0 3
[junit4:junit4]   2> 16706 T402 C40 P23727 REQ /update {update.distrib=FROMLEADER&distrib.from=http://127.0.0.1:44526/solr/collection1/&wt=javabin&version=2} status=0 QTime=3 
[junit4:junit4]   2> 16706 T380 C41 P44526 REQ /update {distrib.from=http://127.0.0.1:63596/solr/collection1/&update.distrib=TOLEADER&wt=javabin&version=2} status=0 QTime=8 
[junit4:junit4]   2> 16707 T392 C43 P63596 /update {wt=javabin&version=2} {add=[10]} 0 12
[junit4:junit4]   2> 16736 T364 C44 P45657 /update {wt=javabin&version=2} {add=[11 (1413331878262341632)]} 0 26
[junit4:junit4]   2> 16749 T402 C40 P23727 REQ /update {distrib.from=http://127.0.0.1:44526/solr/collection1/&update.distrib=FROMLEADER&wt=javabin&version=2} status=0 QTime=3 
[junit4:junit4]   2> 16750 T383 C41 P44526 /update {wt=javabin&version=2} {add=[11 (1413331878292750336)]} 0 11
[junit4:junit4]   2> 16758 T364 C44 P45657 /update {wt=javabin&version=2} {add=[12 (1413331878308478976)]} 0 4
[junit4:junit4]   2> 16771 T402 C40 P23727 REQ /update {distrib.from=http://127.0.0.1:44526/solr/collection1/&update.distrib=FROMLEADER&wt=javabin&version=2} status=0 QTime=5 
[junit4:junit4]   2> 16772 T383 C41 P44526 /update {wt=javabin&version=2} {add=[12 (1413331878315819008)]} 0 11
[junit4:junit4]   2> 16780 T364 C44 P45657 /update {wt=javabin&version=2} {add=[13 (1413331878330499072)]} 0 5
[junit4:junit4]   2> 16796 T402 C40 P23727 REQ /update {update.distrib=FROMLEADER&distrib.from=http://127.0.0.1:44526/solr/collection1/&wt=javabin&version=2} status=0 QTime=4 
[junit4:junit4]   2> 16798 T380 C41 P44526 REQ /update {distrib.from=http://127.0.0.1:63596/solr/collection1/&update.distrib=TOLEADER&wt=javabin&version=2} status=0 QTime=12 
[junit4:junit4]   2> 16798 T392 C43 P63596 /update {wt=javabin&version=2} {add=[13]} 0 15
[junit4:junit4]   2> 16806 T364 C44 P45657 /update {wt=javabin&version=2} {add=[14 (1413331878358810624)]} 0 4
[junit4:junit4]   2> 16823 T402 C40 P23727 REQ /update {update.distrib=FROMLEADER&distrib.from=http://127.0.0.1:44526/solr/collection1/&wt=javabin&version=2} status=0 QTime=4 
[junit4:junit4]   2> 16824 T380 C41 P44526 REQ /update {distrib.from=http://127.0.0.1:63596/solr/collection1/&update.distrib=TOLEADER&wt=javabin&version=2} status=0 QTime=11 
[junit4:junit4]   2> 16825 T392 C43 P63596 /update {wt=javabin&version=2} {add=[14]} 0 15
[junit4:junit4]   2> 16832 T364 C44 P45657 /update {wt=javabin&version=2} {add=[15 (1413331878386073600)]} 0 4
[junit4:junit4]   2> 16847 T402 C40 P23727 REQ /update {update.distrib=FROMLEADER&distrib.from=http://127.0.0.1:44526/solr/collection1/&wt=javabin&version=2} status=0 QTime=3 
[junit4:junit4]   2> 16848 T380 C41 P44526 REQ /update {distrib.from=http://127.0.0.1:63596/solr/collection1/&update.distrib=TOLEADER&wt=javabin&version=2} status=0 QTime=9 
[junit4:junit4]   2> 16849 T392 C43 P63596 /update {wt=javabin&version=2} {add=[15]} 0 13
[junit4:junit4]   2> 16855 T364 C44 P45657 /update {wt=javabin&version=2} {add=[16 (1413331878411239424)]} 0 3
[junit4:junit4]   2> 16869 T402 C40 P23727 REQ /update {update.distrib=FROMLEADER&distrib.from=http://127.0.0.1:44526/solr/collection1/&wt=javabin&version=2} status=0 QTime=3 
[junit4:junit4]   2> 16870 T380 C41 P44526 REQ /update {distrib.from=http://127.0.0.1:63596/solr/collection1/&update.distrib=TOLEADER&wt=javabin&version=2} status=0 QTime=9 
[junit4:junit4]   2> 16870 T392 C43 P63596 /update {wt=javabin&version=2} {add=[16]} 0 12
[junit4:junit4]   2> 16887 T364 C44 P45657 /update {wt=javabin&version=2} {add=[17 (1413331878438502400)]} 0 12
[junit4:junit4]   2> 16910 T416 C42 P54247 REQ /update {distrib.from=http://127.0.0.1:63596/solr/collection1/&update.distrib=FROMLEADER&wt=javabin&version=2} status=0 QTime=8 
[junit4:junit4]   2> 16911 T392 C43 P63596 /update {wt=javabin&version=2} {add=[17 (1413331878454231040)]} 0 20
[junit4:junit4]   2> 16918 T364 C44 P45657 /update {wt=javabin&version=2} {add=[100 (1413331878476251136)]} 0 4
[junit4:junit4]   2> 16978 T402 C40 P23727 REQ /update {distrib.from=http://127.0.0.1:44526/solr/collection1/&update.distrib=FROMLEADER&wt=javabin&version=2} status=0 QTime=25 
[junit4:junit4]   2> 16979 T383 C41 P44526 /update {wt=javabin&version=2} {add=[100 (1413331878483591168)]} 0 58
[junit4:junit4]   2> 16986 T364 C44 P45657 /update {wt=javabin&version=2} {add=[101 (1413331878547554304)]} 0 4
[junit4:junit4]   2> 16999 T402 C40 P23727 REQ /update {distrib.from=http://127.0.0.1:44526/solr/collection1/&update.distrib=FROMLEADER&wt=javabin&version=2} status=0 QTime=4 
[junit4:junit4]   2> 17000 T383 C41 P44526 /update {wt=javabin&version=2} {add=[101 (1413331878554894336)]} 0 11
[junit4:junit4]   2> 17007 T364 C44 P45657 /update {wt=javabin&version=2} {add=[102 (1413331878569574400)]} 0 4
[junit4:junit4]   2> 17018 T402 C40 P23727 REQ /update {distrib.from=http://127.0.0.1:44526/solr/collection1/&update.distrib=FROMLEADER&wt=javabin&version=2} status=0 QTime=3 
[junit4:junit4]   2> 17019 T383 C41 P44526 /update {wt=javabin&version=2} {add=[102 (1413331878576914432)]} 0 9
[junit4:junit4]   2> 17060 T364 C44 P45657 /update {wt=javabin&version=2} {add=[103 (1413331878589497344)]} 0 38
[junit4:junit4]   2> 17073 T416 C42 P54247 REQ /update {update.distrib=FROMLEADER&distrib.from=http://127.0.0.1:63596/solr/collection1/&wt=javabin&version=2} status=0 QTime=2 
[junit4:junit4]   2> 17074 T395 C43 P63596 REQ /update {distrib.from=http://127.0.0.1:44526/solr/collection1/&update.distrib=TOLEADER&wt=javabin&version=2} status=0 QTime=8 
[junit4:junit4]   2> 17075 T383 C41 P44526 /update {wt=javabin&version=2} {add=[103]} 0 12
[junit4:junit4]   2> 17084 T364 C44 P45657 /update {wt=javabin&version=2} {add=[104 (1413331878648217600)]} 0 6
[junit4:junit4]   2> 17097 T416 C42 P54247 REQ /update {distrib.from=http://127.0.0.1:63596/solr/collection1/&update.distrib=FROMLEADER&wt=javabin&version=2} status=0 QTime=4 
[junit4:junit4]   2> 17098 T392 C43 P63596 /update {wt=javabin&version=2} {add=[104 (1413331878658703360)]} 0 10
[junit4:junit4]   2> 17106 T364 C44 P45657 /update {wt=javabin&version=2} {add=[105 (1413331878673383424)]} 0 3
[junit4:junit4]   2> 17165 T416 C42 P54247 REQ /update {distrib.from=http://127.0.0.1:63596/solr/collection1/&update.distrib=FROMLEADER&wt=javabin&version=2} status=0 QTime=30 
[junit4:junit4]   2> 17166 T392 C43 P63596 /update {wt=javabin&version=2} {add=[105 (1413331878681772032)]} 0 56
[junit4:junit4]   2> 17173 T364 C44 P45657 /update {wt=javabin&version=2} {add=[106 (1413331878743638016)]} 0 3
[junit4:junit4]   2> 17193 T416 C42 P54247 REQ /update {update.distrib=FROMLEADER&distrib.from=http://127.0.0.1:63596/solr/collection1/&wt=javabin&version=2} status=0 QTime=5 
[junit4:junit4]   2> 17194 T395 C43 P63596 REQ /update {distrib.from=http://127.0.0.1:44526/solr/collection1/&update.distrib=TOLEADER&wt=javabin&version=2} status=0 QTime=15 
[junit4:junit4]   2> 17194 T383 C41 P44526 /update {wt=javabin&version=2} {add=[106]} 0 18
[junit4:junit4]   2> 17204 T364 C44 P45657 /update {wt=javabin&version=2} {add=[107 (1413331878774046720)]} 0 6
[junit4:junit4]   2> 17217 T402 C40 P23727 REQ /update {update.distrib=FROMLEADER&distrib.from=http://127.0.0.1:44526/solr/collection1/&wt=javabin&version=2} status=0 QTime=3 
[junit4:junit4]   2> 17217 T380 C41 P44526 REQ /update {distrib.from=http://127.0.0.1:63596/solr/collection1/&update.distrib=TOLEADER&wt=javabin&version=2} status=0 QTime=7 
[junit4:junit4]   2> 17218 T392 C43 P63596 /update {wt=javabin&version=2} {add=[107]} 0 11
[junit4:junit4]   2> 17223 T364 C44 P45657 /update {wt=javabin&version=2} {add=[108 (1413331878798163968)]} 0 2
[junit4:junit4]   2> 17233 T402 C40 P23727 REQ /update {distrib.from=http://127.0.0.1:44526/solr/collection1/&update.distrib=FROMLEADER&wt=javabin&version=2} status=0 QTime=2 
[junit4:junit4]   2> 17234 T383 C41 P44526 /update {wt=javabin&version=2} {add=[108 (1413331878803406848)]} 0 8
[junit4:junit4]   2> 17240 T364 C44 P45657 /update {wt=javabin&version=2} {add=[109 (1413331878814941184)]} 0 3
[junit4:junit4]   2> 17249 T402 C40 P23727 REQ /update {distrib.from=http://127.0.0.1:44526/solr/collection1/&update.distrib=FROMLEADER&wt=javabin&version=2} status=0 QTime=2 
[junit4:junit4]   2> 17251 T383 C41 P44526 /update {wt=javabin&version=2} {add=[109 (1413331878821232640)]} 0 7
[junit4:junit4]   2> 17257 T364 C44 P45657 /update {wt=javabin&version=2} {add=[110 (1413331878833815552)]} 0 2
[junit4:junit4]   2> 17269 T402 C40 P23727 REQ /update {update.distrib=FROMLEADER&distrib.from=http://127.0.0.1:44526/solr/collection1/&wt=javabin&version=2} status=0 QTime=2 
[junit4:junit4]   2> 17270 T380 C41 P44526 REQ /update {distrib.from=http://127.0.0.1:63596/solr/collection1/&update.distrib=TOLEADER&wt=javabin&version=2} status=0 QTime=7 
[junit4:junit4]   2> 17271 T392 C43 P63596 /update {wt=javabin&version=2} {add=[110]} 0 10
[junit4:junit4]   2> 17276 T364 C44 P45657 /update {wt=javabin&version=2} {add=[111 (1413331878853738496)]} 0 2
[junit4:junit4]   2> 17286 T402 C40 P23727 REQ /update {distrib.from=http://127.0.0.1:44526/solr/collection1/&update.distrib=FROMLEADER&wt=javabin&version=2} status=0 QTime=2 
[junit4:junit4]   2> 17286 T383 C41 P44526 /update {wt=javabin&version=2} {add=[111 (1413331878858981376)]} 0 7
[junit4:junit4]   2> 17291 T364 C44 P45657 /update {wt=javabin&version=2} {add=[112 (1413331878869467136)]} 0 2
[junit4:junit4]   2> 17300 T416 C42 P54247 REQ /update {distrib.from=http://127.0.0.1:63596/solr/collection1/&update.distrib=FROMLEADER&wt=javabin&version=2} status=0 QTime=2 
[junit4:junit4]   2> 17301 T392 C43 P63596 /update {wt=javabin&version=2} {add=[112 (1413331878874710016)]} 0 7
[junit4:junit4]   2> 17319 T364 C44 P45657 /update {wt=javabin&version=2} {add=[113 (1413331878885195776)]} 0 15
[junit4:junit4]   2> 17331 T402 C40 P23727 REQ /update {update.distrib=FROMLEADER&distrib.from=http://127.0.0.1:44526/solr/collection1/&wt=javabin&version=2} status=0 QTime=2 
[junit4:junit4]   2> 17332 T380 C41 P44526 REQ /update {distrib.from=http://127.0.0.1:63596/solr/collection1/&update.distrib=TOLEADER&wt=javabin&version=2} status=0 QTime=7 
[junit4:junit4]   2> 17333 T392 C43 P63596 /update {wt=javabin&version=2} {add=[113]} 0 11
[junit4:junit4]   2> 17339 T364 C44 P45657 /update {wt=javabin&version=2} {add=[114 (1413331878918750208)]} 0 3
[junit4:junit4]   2> 17348 T402 C40 P23727 REQ /update {distrib.from=http://127.0.0.1:44526/solr/collection1/&update.distrib=FROMLEADER&wt=javabin&version=2} status=0 QTime=2 
[junit4:junit4]   2> 17349 T383 C41 P44526 /update {wt=javabin&version=2} {add=[114 (1413331878925041664)]} 0 7
[junit4:junit4]   2> 17354 T364 C44 P45657 /update {wt=javabin&version=2} {add=[115 (1413331878935527424)]} 0 2
[junit4:junit4]   2> 17374 T416 C42 P54247 REQ /update {update.distrib=FROMLEADER&distrib.from=http://127.0.0.1:63596/solr/collection1/&wt=javabin&version=2} status=0 QTime=2 
[junit4:junit4]   2> 17375 T395 C43 P63596 REQ /update {distrib.from=http://127.0.0.1:44526/solr/collection1/&update.distrib=TOLEADER&wt=javabin&version=2} status=0 QTime=8 
[junit4:junit4]   2> 17376 T383 C41 P44526 /update {wt=javabin&version=2} {add=[115]} 0 13
[junit4:junit4]   2> 17383 T364 C44 P45657 /update {wt=javabin&version=2} {add=[116 (1413331878964887552)]} 0 3
[junit4:junit4]   2> 17393 T416 C42 P54247 REQ /update {distrib.from=http://127.0.0.1:63596/solr/collection1/&update.distrib=FROMLEADER&wt=javabin&version=2} status=0 QTime=2 
[junit4:junit4]   2> 17394 T392 C43 P63596 /update {wt=javabin&version=2} {add=[116 (1413331878971179008)]} 0 8
[junit4:junit4]   2> 17399 T364 C44 P45657 /update {wt=javabin&version=2} {add=[117 (1413331878982713344)]} 0 2
[junit4:junit4]   2> 17409 T416 C42 P54247 REQ /update {distrib.from=http://127.0.0.1:63596/solr/collection1/&update.distrib=FROMLEADER&wt=javabin&version=2} status=0 QTime=2 
[junit4:junit4]   2> 17410 T392 C43 P63596 /update {wt=javabin&version=2} {add=[117 (1413331878987956224)]} 0 8
[junit4:junit4]   2> 17415 T364 C44 P45657 /update {wt=javabin&version=2} {add=[118 (1413331878999490560)]} 0 2
[junit4:junit4]   2> 17458 T402 C40 P23727 REQ /update {distrib.from=http://127.0.0.1:44526/solr/collection1/&update.distrib=FROMLEADER&wt=javabin&version=2} status=0 QTime=14 
[junit4:junit4]   2> 17459 T383 C41 P44526 /update {wt=javabin&version=2} {add=[118 (1413331879004733440)]} 0 41
[junit4:junit4]   2> 17464 T364 C44 P45657 /update {wt=javabin&version=2} {add=[119 (1413331879050870784)]} 0 2
[junit4:junit4]   2> 17473 T416 C42 P54247 REQ /update {distrib.from=http://127.0.0.1:63596/solr/collection1/&update.distrib=FROMLEADER&wt=javabin&version=2} status=0 QTime=2 
[junit4:junit4]   2> 17474 T392 C43 P63596 /update {wt=javabin&version=2} {add=[119 (1413331879056113664)]} 0 7
[junit4:junit4]   2> 17479 T364 C44 P45657 /update {wt=javabin&version=2} {add=[120 (1413331879066599424)]} 0 2
[junit4:junit4]   2> 17491 T416 C42 P54247 REQ /update {update.distrib=FROMLEADER&distrib.from=http://127.0.0.1:63596/solr/collection1/&wt=javabin&version=2} status=0 QTime=2 
[junit4:junit4]   2> 17492 T395 C43 P63596 REQ /update {distrib.from=http://127.0.0.1:44526/solr/collection1/&update.distrib=TOLEADER&wt=javabin&version=2} status=0 QTime=7 
[junit4:junit4]   2> 17493 T383 C41 P44526 /update {wt=javabin&version=2} {add=[120]} 0 11
[junit4:junit4]   2> 17498 T364 C44 P45657 /update {wt=javabin&version=2} {add=[121 (1413331879086522368)]} 0 2
[junit4:junit4]   2> 17507 T416 C42 P54247 REQ /update {distrib.from=http://127.0.0.1:63596/solr/collection1/&update.distrib=FROMLEADER&wt=javabin&version=2} status=0 QTime=2 
[junit4:junit4]   2> 17508 T392 C43 P63596 /update {wt=javabin&version=2} {add=[121 (1413331879091765248)]} 0 7
[junit4:junit4]   2> 17513 T364 C44 P45657 /update {wt=javabin&version=2} {add=[122 (1413331879102251008)]} 0 2
[junit4:junit4]   2> 17524 T402 C40 P23727 REQ /update {distrib.from=http://127.0.0.1:44526/solr/collection1/&update.distrib=FROMLEADER&wt=javabin&version=2} status=0 QTime=3 
[junit4:junit4]   2> 17525 T383 C41 P44526 /update {wt=javabin&version=2} {add=[122 (1413331879107493888)]} 0 9
[junit4:junit4]   2> 17542 T364 C44 P45657 /update {wt=javabin&version=2} {add=[123 (1413331879120076800)]} 0 14
[junit4:junit4]   2> 17554 T402 C40 P23727 REQ /update {update.distrib=FROMLEADER&distrib.from=http://127.0.0.1:44526/solr/collection1/&wt=javabin&version=2} status=0 QTime=2 
[junit4:junit4]   2> 17555 T380 C41 P44526 REQ /update {distrib.from=http://127.0.0.1:63596/solr/collection1/&update.distrib=TOLEADER&wt=javabin&version=2} status=0 QTime=7 
[junit4:junit4]   2> 17556 T392 C43 P63596 /update {wt=javabin&version=2} {add=[123]} 0 11
[junit4:junit4]   2> 17562 T364 C44 P45657 /update {wt=javabin&version=2} {add=[124 (1413331879152582656)]} 0 3
[junit4:junit4]   2> 17572 T402 C40 P23727 REQ /update {distrib.from=http://127.0.0.1:44526/solr/collection1/&update.distrib=FROMLEADER&wt=javabin&version=2} status=0 QTime=2 
[junit4:junit4]   2> 17573 T383 C41 P44526 /update {wt=javabin&version=2} {add=[124 (1413331879158874112)]} 0 8
[junit4:junit4]   2> 17578 T364 C44 P45657 /update {wt=javabin&version=2} {add=[125 (1413331879170408448)]} 0 2
[junit4:junit4]   2> 17590 T402 C40 P23727 REQ /update {update.distrib=FROMLEADER&distrib.from=http://127.0.0.1:44526/solr/collection1/&wt=javabin&version=2} status=0 QTime=2 
[junit4:junit4]   2> 17591 T380 C41 P44526 REQ /update {distrib.from=http://127.0.0.1:63596/solr/collection1/&update.distrib=TOLEADER&wt=javabin&version=2} status=0 QTime=7 
[junit4:junit4]   2> 17592 T392 C43 P63596 /update {wt=javabin&version=2} {add=[125]} 0 11
[junit4:junit4]   2> 17597 T364 C44 P45657 /update {wt=javabin&version=2} {add=[126 (1413331879190331392)]} 0 2
[junit4:junit4]   2> 17606 T416 C42 P54247 REQ /update {distrib.from=http://127.0.0.1:63596/solr/collection1/&update.distrib=FROMLEADER&wt=javabin&version=2} status=0 QTime=2 
[junit4:junit4]   2> 17607 T392 C43 P63596 /update {wt=javabin&version=2} {add=[126 (1413331879195574272)]} 0 7
[junit4:junit4]   2> 17612 T364 C44 P45657 /update {wt=javabin&version=2} {add=[127 (1413331879206060032)]} 0 2
[junit4:junit4]   2> 17645 T416 C42 P54247 REQ /update {distrib.from=http://127.0.0.1:63596/solr/collection1/&update.distrib=FROMLEADER&wt=javabin&version=2} status=0 QTime=14 
[junit4:junit4]   2> 17646 T392 C43 P63596 /update {wt=javabin&version=2} {add=[127 (1413331879211302912)]} 0 31
[junit4:junit4]   2> 17651 T364 C44 P45657 /update {wt=javabin&version=2} {add=[128 (1413331879246954496)]} 0 2
[junit4:junit4]   2> 17663 T416 C42 P54247 REQ /update {distrib.from=http://127.0.0.1:63596/solr/collection1/&update.distrib=FROMLEADER&wt=javabin&version=2} status=0 QTime=3 
[junit4:junit4]   2> 17664 T392 C43 P63596 /update {wt=javabin&version=2} {add=[128 (1413331879252197376)]} 0 10
[junit4:junit4]   2> 17669 T364 C44 P45657 /update {wt=javabin&version=2} {add=[129 (1413331879264780288)]} 0 2
[junit4:junit4]   2> 17678 T402 C40 P23727 REQ /update {distrib.from=http://127.0.0.1:44526/solr/collection1/&update.distrib=FROMLEADER&wt=javabin&version=2} status=0 QTime=2 
[junit4:junit4]   2> 17679 T383 C41 P44526 /update {wt=javabin&version=2} {add=[129 (1413331879271071744)]} 0 7
[junit4:junit4]   2> 17684 T364 C44 P45657 /update {wt=javabin&version=2} {add=[130 (1413331879281557504)]} 0 2
[junit4:junit4]   2> 17693 T416 C42 P54247 REQ /update {distrib.from=http://127.0.0.1:63596/solr/collection1/&update.distrib=FROMLEADER&wt=javabin&version=2} status=0 QTime=2 
[junit4:junit4]   2> 17694 T392 C43 P63596 /update {wt=javabin&version=2} {add=[130 (1413331879285751808)]} 0 7
[junit4:junit4]   2> 17699 T364 C44 P45657 /update {wt=javabin&version=2} {add=[131 (1413331879296237568)]} 0 2
[junit4:junit4]   2> 17708 T416 C42 P54247 REQ /update {distrib.from=http://127.0.0.1:63596/solr/collection1/&update.distrib=FROMLEADER&wt=javabin&version=2} status=0 QTime=2 
[junit4:junit4]   2> 17716 T392 C43 P63596 /update {wt=javabin&version=2} {add=[131 (1413331879301480448)]} 0 14
[junit4:junit4]   2> 17722 T364 C44 P45657 /update {wt=javabin&version=2} {add=[132 (1413331879321403392)]} 0 2
[junit4:junit4]   2> 17734 T402 C40 P23727 REQ /update {update.distrib=FROMLEADER&distrib.from=http://127.0.0.1:44526/solr/collection1/&wt=javabin&version=2} status=0 QTime=2 
[junit4:junit4]   2> 17735 T380 C41 P44526 REQ /update {distrib.from=http://127.0.0.1:63596/solr/collection1/&update.distrib=TOLEADER&wt=javabin&version=2} status=0 QTime=7 
[junit4:junit4]   2> 17735 T392 C43 P63596 /update {wt=javabin&version=2} {add=[132]} 0 10
[junit4:junit4]   2> 17753 T364 C44 P45657 /update {wt=javabin&version=2} {add=[133 (1413331879339229184)]} 0 15
[junit4:junit4]   2> 17765 T402 C40 P23727 REQ /update {update.distrib=FROMLEADER&distrib.from=http://127.0.0.1:44526/solr/collection1/&wt=javabin&version=2} status=0 QTime=2 
[junit4:junit4]   2> 17766 T380 C41 P44526 REQ /update {distrib.from=http://127.0.0.1:63596/solr/collection1/&update.distrib=TOLEADER&wt=javabin&version=2} status=0 QTime=7 
[junit4:junit4]   2> 17766 T392 C43 P63596 /update {wt=javabin&version=2} {add=[133]} 0 10
[junit4:junit4]   2> 17774 T364 C44 P45657 /update {wt=javabin&version=2} {add=[134 (1413331879372783616)]} 0 5
[junit4:junit4]   2> 17786 T416 C42 P54247 REQ /update {update.distrib=FROMLEADER&distrib.from=http://127.0.0.1:63596/solr/collection1/&wt=javabin&version=2} status=0 QTime=2 
[junit4:junit4]   2> 17787 T395 C43 P63596 REQ /update {distrib.from=http://127.0.0.1:44526/solr/collection1/&update.distrib=TOLEADER&wt=javabin&version=2} status=0 QTime=7 
[junit4:junit4]   2> 17788 T383 C41 P44526 /update {wt=javabin&version=2} {add=[134]} 0 11
[junit4:junit4]   2> 17793 T364 C44 P45657 /update {wt=javabin&version=2} {add=[135 (1413331879394803712)]} 0 2
[junit4:junit4]   2> 17805 T402 C40 P23727 REQ /update {update.distrib=FROMLEADER&distrib.from=http://127.0.0.1:44526/solr/collection1/&wt=javabin&version=2} status=0 QTime=2 
[junit4:junit4]   2> 17806 T380 C41 P44526 REQ /update {distrib.from=http://127.0.0.1:63596/solr/collection1/&update.distrib=TOLEADER&wt=javabin&version=2} status=0 QTime=7 
[junit4:junit4]   2> 17807 T392 C43 P63596 /update {wt=javabin&version=2} {add=[135]} 0 11
[junit4:junit4]   2> 17813 T364 C44 P45657 /update {wt=javabin&version=2} {add=[136 (1413331879415775232)]} 0 3
[junit4:junit4]   2> 17823 T416 C42 P54247 REQ /update {distrib.from=http://127.0.0.1:63596/solr/collection1/&update.distrib=FROMLEADER&wt=javabin&version=2} status=0 QTime=2 
[junit4:junit4]   2> 17824 T392 C43 P63596 /update {wt=javabin&version=2} {add=[136 (1413331879422066688)]} 0 8
[junit4:junit4]   2> 17829 T364 C44 P45657 /update {wt=javabin&version=2} {add=[137 (1413331879432552448)]} 0 2
[junit4:junit4]   2> 17839 T416 C42 P54247 REQ /update {distrib.from=http://127.0.0.1:63596/solr/collection1/&update.distrib=FROMLEADER&wt=javabin&version=2} status=0 QTime=2 
[junit4:junit4]   2> 17840 T392 C43 P63596 /update {wt=javabin&version=2} {add=[137 (1413331879438843904)]} 0 8
[junit4:junit4]   2> 17845 T364 C44 P45657 /update {wt=javabin&version=2} {add=[138 (1413331879449329664)]} 0 2
[junit4:junit4]   2> 17855 T402 C40 P23727 REQ /update {distrib.from=http://127.0.0.1:44526/solr/collection1/&update.distrib=FROMLEADER&wt=javabin&version=2} status=0 QTime=2 
[junit4:junit4]   2> 17856 T383 C41 P44526 /update {wt=javabin&version=2} {add=[138 (1413331879454572544)]} 0 8
[junit4:junit4]   2> 17862 T364 C44 P45657 /update {wt=javabin&version=2} {add=[139 (1413331879467155456)]} 0 3
[junit4:junit4]   2> 17874 T416 C42 P54247 REQ /update {update.distrib=FROMLEADER&distrib.from=http://127.0.0.1:63596/solr/collection1/&wt=javabin&version=2} status=0 QTime=2 
[junit4:junit4]   2> 17875 T395 C43 P63596 REQ /update {distrib.from=http://127.0.0.1:44526/solr/collection1/&update.distrib=TOLEADER&wt=javabin&version=2} status=0 QTime=7 
[junit4:junit4]   2> 17876 T383 C41 P44526 /update {wt=javabin&version=2} {add=[139]} 0 10
[junit4:junit4]   2> 17882 T364 C44 P45657 /update {wt=javabin&version=2} {add=[140 (1413331879488126976)]} 0 3
[junit4:junit4]   2> 17891 T416 C42 P54247 REQ /update {distrib.from=http://127.0.0.1:63596/solr/collection1/&update.distrib=FROMLEADER&wt=javabin&version=2} status=0 QTime=2 
[junit4:junit4]   2> 17891 T392 C43 P63596 /update {wt=javabin&version=2} {add=[140 (1413331879493369856)]} 0 6
[junit4:junit4]   2> 17896 T364 C44 P45657 /update {wt=javabin&version=2} {add=[141 (1413331879503855616)]} 0 2
[junit4:junit4]   2> 17910 T416 C42 P54247 REQ /update {update.distrib=FROMLEADER&distrib.from=http://127.0.0.1:63596/solr/collection1/&wt=javabin&version=2} status=0 QTime=2 
[junit4:junit4]   2> 17911 T395 C43 P63596 REQ /update {distrib.from=http://127.0.0.1:44526/solr/collection1/&update.distrib=TOLEADER&wt=javabin&version=2} status=0 QTime=8 
[junit4:junit4]   2> 17911 T383 C41 P44526 /update {wt=javabin&version=2} {add=[141]} 0 11
[junit4:junit4]   2> 17918 T364 C44 P45657 /update {wt=javabin&version=2} {add=[142 (1413331879525875712)]} 0 3
[junit4:junit4]   2> 17963 T416 C42 P54247 REQ /update {update.distrib=FROMLEADER&distrib.from=http://127.0.0.1:63596/solr/collection1/&wt=javabin&version=2} status=0 QTime=20 
[junit4:junit4]   2> 17964 T395 C43 P63596 REQ /update {distrib.from=http://127.0.0.1:44526/solr/collection1/&update.distrib=TOLEADER&wt=javabin&version=2} status=0 QTime=40 
[junit4:junit4]   2> 17965 T383 C41 P44526 /update {wt=javabin&version=2} {add=[142]} 0 44
[junit4:junit4]   2> 17981 T364 C44 P45657 /update {wt=javabin&version=2} {add=[143 (1413331879581450240)]} 0 13
[junit4:junit4]   2> 17997 T416 C42 P54247 REQ /update {update.distrib=FROMLEADER&distrib.from=http://127.0.0.1:63596/solr/collection1/&wt=javabin&version=2} status=0 QTime=3 
[junit4:junit4]   2> 17998 T395 C43 P63596 REQ /update {distrib.from=http://127.0.0.1:44526/solr/collection1/&update.distrib=TOLEADER&wt=javabin&version=2} status=0 QTime=11 
[junit4:junit4]   2> 17999 T383 C41 P44526 /update {wt=javabin&version=2} {add=[143]} 0 15
[junit4:junit4]   2> 18005 T364 C44 P45657 /update {wt=javabin&version=2} {add=[144 (1413331879617101824)]} 0 3
[junit4:junit4]   2> 18014 T416 C42 P54247 REQ /update {distrib.from=http://127.0.0.1:63596/solr/collection1/&update.distrib=FROMLEADER&wt=javabin&version=2} status=0 QTime=2 
[junit4:junit4]   2> 18015 T392 C43 P63596 /update {wt=javabin&version=2} {add=[144 (1413331879623393280)]} 0 7
[junit4:junit4]   2> 18020 T364 C44 P45657 /update {wt=javabin&version=2} {add=[145 (1413331879632830464)]} 0 2
[junit4:junit4]   2> 18029 T416 C42 P54247 REQ /update {distrib.from=http://127.0.0.1:63596/solr/collection1/&update.distrib=FROMLEADER&wt=javabin&version=2} status=0 QTime=2 
[junit4:junit4]   2> 18030 T392 C43 P63596 /update {wt=javabin&version=2} {add=[145 (1413331879638073344)]} 0 7
[junit4:junit4]   2> 18036 T364 C44 P45657 /update {wt=javabin&version=2} {add=[146 (1413331879649607680)]} 0 2
[junit4:junit4]   2> 18072 T402 C40 P23727 REQ /update {update.distrib=FROMLEADER&distrib.from=http://127.0.0.1:44526/solr/collection1/&wt=javabin&version=2} status=0 QTime=14 
[junit4:junit4]   2> 18073 T380 C41 P44526 REQ /update {distrib.from=http://127.0.0.1:63596/solr/collection1/&update.distrib=TOLEADER&wt=javabin&version=2} status=0 QTime=31 
[junit4:junit4]   2> 18075 T392 C43 P63596 /update {wt=javabin&version=2} {add=[146]} 0 36
[junit4:junit4]   2> 18080 T364 C44 P45657 /update {wt=javabin&version=2} {add=[147 (1413331879696793600)]} 0 2
[junit4:junit4]   2> 18094 T416 C42 P54247 REQ /update {update.distrib=FROMLEADER&distrib.from=http://127.0.0.1:63596/solr/collection1/&wt=javabin&version=2} status=0 QTime=2 
[junit4:junit4]   2> 18095 T395 C43 P63596 REQ /update {distrib.from=http://127.0.0.1:44526/solr/collection1/&update.distrib=TOLEADER&wt=javabin&version=2} status=0 QTime=8 
[junit4:junit4]   2> 18096 T383 C41 P44526 /update {wt=javabin&version=2} {add=[147]} 0 13
[junit4:junit4]   2> 18101 T364 C44 P45657 /update {wt=javabin&version=2} {add=[148 (1413331879717765120)]} 0 2
[junit4:junit4]   2> 18117 T402 C40 P23727 REQ /update {update.distrib=FROMLEADER&distrib.from=http://127.0.0.1:44526/solr/collection1/&wt=javabin&version=2} status=0 QTime=5 
[junit4:junit4]   2> 18118 T380 C41 P44526 REQ /update {distrib.from=http://127.0.0.1:63596/solr/collection1/&update.distrib=TOLEADER&wt=javabin&version=2} status=0 QTime=11 
[junit4:junit4]   2> 18118 T392 C43 P63596 /update {wt=javabin&version=2} {add=[148]} 0 14
[junit4:junit4]   2> 18124 T364 C44 P45657 /update {wt=javabin&version=2} {add=[149 (1413331879742930944)]} 0 2
[junit4:junit4]   2> 18134 T416 C42 P54247 REQ /update {distrib.from=http://127.0.0.1:63596/solr/collection1/&update.distrib=FROMLEADER&wt=javabin&version=2} status=0 QTime=2 
[junit4:junit4]   2> 18135 T392 C43 P63596 /update {wt=javabin&version=2} {add=[149 (1413331879748173824)]} 0 8
[junit4:junit4]   2> 18135 T352 oasc.AbstractDistribZkTestBase.waitForRecoveriesToFinish Wait for recoveries to finish - collection: collection1 failOnTimeout:true timeout (sec):1800
[junit4:junit4]   2> 18136 T352 oascc.ZkStateReader.updateClusterState Updating cloud state from ZooKeeper... 
[junit4:junit4]   2> 18140 T364 C44 P45657 oasu.DirectUpdateHandler2.commit start commit{flags=0,_version_=0,optimize=false,openSearcher=true,waitSearcher=true,expungeDeletes=false,softCommit=false}
[junit4:junit4]   2> 18626 T364 C44 P45657 oasc.SolrDeletionPolicy.onCommit SolrDeletionPolicy.onCommit: commits:num=2
[junit4:junit4]   2> 		commit{dir=NRTCachingDirectory(org.apache.lucene.store.NIOFSDirectory@/usr/home/hudson/hudson-slave/workspace/Lucene-Solr-Tests-trunk-Java6/solr/build/solr-core/test/J1/org.apache.solr.cloud.BasicDistributedZk2Test-1347858296150/control/data/index lockFactory=org.apache.lucene.store.NativeFSLockFactory@502438db; maxCacheMB=48.0 maxMergeSizeMB=4.0),segFN=segments_2,generation=2,filenames=[_0_Asserting_0.tim, _0_Lucene40_0.tim, _0.fnm, _0_Asserting_0.tip, _0_Memory_0.ram, _0_nrm.cfs, _0_Lucene40_0.prx, _0_Lucene40_0.tip, _0_Asserting_0.prx, _0_Asserting_0.frq, _0_Lucene40WithOrds_0.tii, _0_Lucene40WithOrds_0.frq, _0_Lucene40_0.frq, _0_nrm.cfe, segments_2, _0.fdx, _0_Lucene40WithOrds_0.prx, _0.si, _0_Lucene40WithOrds_0.tib, _0.fdt]
[junit4:junit4]   2> 		commit{dir=NRTCachingDirectory(org.apache.lucene.store.NIOFSDirectory@/usr/home/hudson/hudson-slave/workspace/Lucene-Solr-Tests-trunk-Java6/solr/build/solr-core/test/J1/org.apache.solr.cloud.BasicDistributedZk2Test-1347858296150/control/data/index lockFactory=org.apache.lucene.store.NativeFSLockFactory@502438db; maxCacheMB=48.0 maxMergeSizeMB=4.0),segFN=segments_3,generation=3,filenames=[_5_nrm.cfe, _5_Memory_0.ram, _6_Asserting_0.frq, _7.si, _3.fdt, _0_Lucene40_0.prx, _7_Memory_0.ram, _7.fnm, _1_Asserting_0.tim, _0_Lucene40WithOrds_0.tii, _3_Lucene40_0.frq, _0_Lucene40WithOrds_0.frq, _1_Lucene40WithOrds_0.tib, _1_Asserting_0.tip,

[...truncated too long message...]


[junit4:junit4]   2> 139006 T753 C78 P14380 oasc.SolrDeletionPolicy.onCommit SolrDeletionPolicy.onCommit: commits:num=2
[junit4:junit4]   2> 		commit{dir=/usr/home/hudson/hudson-slave/workspace/Lucene-Solr-Tests-trunk-Java6/solr/build/solr-core/test/J1/org.apache.solr.cloud.SyncSliceTest-1347858669033/jetty4/index,segFN=segments_3,generation=3,filenames=[_0_1.len, _0_6.len, _0_7.len, _0_11.len, _0.pst, _0.fld, _0_8.len, _0_4.len, _0_10.len, _0_3.len, _0.inf, _0.si, segments_3]
[junit4:junit4]   2> 		commit{dir=/usr/home/hudson/hudson-slave/workspace/Lucene-Solr-Tests-trunk-Java6/solr/build/solr-core/test/J1/org.apache.solr.cloud.SyncSliceTest-1347858669033/jetty4/index,segFN=segments_4,generation=4,filenames=[_1_1.len, _1.fld, _0_1.len, _1_11.len, _0_7.len, _1.inf, _1_4.len, _1.pst, _0_10.len, _0.si, _0_6.len, _0_11.len, _1_10.len, _0.pst, _0.fld, _0_8.len, _0_4.len, _0_3.len, _1_3.len, _1_6.len, _1.si, _0.inf, _1_8.len, _1_7.len, segments_4]
[junit4:junit4]   2> 139007 T753 C78 P14380 oasc.SolrDeletionPolicy.updateCommits newest commit = 4
[junit4:junit4]   2> 139009 T753 oasu.DefaultSolrCoreState.decref Closing SolrCoreState - canceling any ongoing recovery
[junit4:junit4]   2> 140208 T826 oaz.ClientCnxn$SendThread.startConnect Opening socket connection to server localhost/127.0.0.1:14355
[junit4:junit4]   2> 143984 T827 oaz.ClientCnxn$EventThread.run EventThread shut down
[junit4:junit4]   2> 143984 T753 oaz.ZooKeeper.close Session: 0x139d2a31df40006 closed
[junit4:junit4]   2> 143985 T753 oejsh.ContextHandler.doStop stopped o.e.j.s.ServletContextHandler{/solr,null}
[junit4:junit4]   2> 144155 T753 oas.SolrTestCaseJ4.tearDown ###Ending testDistribSearch
[junit4:junit4]   2> NOTE: reproduce with: ant test  -Dtestcase=SyncSliceTest -Dtests.method=testDistribSearch -Dtests.seed=3AC9AD776862ECF7 -Dtests.multiplier=3 -Dtests.slow=true -Dtests.locale=es_AR -Dtests.timezone=America/Mazatlan -Dtests.file.encoding=ISO-8859-1
[junit4:junit4] FAILURE  144s J1 | SyncSliceTest.testDistribSearch <<<
[junit4:junit4]    > Throwable #1: java.lang.AssertionError: There are still nodes recoverying
[junit4:junit4]    > 	at __randomizedtesting.SeedInfo.seed([3AC9AD776862ECF7:BB2F236F1F3D8CCB]:0)
[junit4:junit4]    > 	at org.junit.Assert.fail(Assert.java:93)
[junit4:junit4]    > 	at org.apache.solr.cloud.AbstractDistribZkTestBase.waitForRecoveriesToFinish(AbstractDistribZkTestBase.java:154)
[junit4:junit4]    > 	at org.apache.solr.cloud.AbstractFullDistribZkTestBase.waitForRecoveriesToFinish(AbstractFullDistribZkTestBase.java:560)
[junit4:junit4]    > 	at org.apache.solr.cloud.AbstractFullDistribZkTestBase.waitForThingsToLevelOut(AbstractFullDistribZkTestBase.java:1135)
[junit4:junit4]    > 	at org.apache.solr.cloud.SyncSliceTest.doTest(SyncSliceTest.java:162)
[junit4:junit4]    > 	at org.apache.solr.BaseDistributedSearchTestCase.testDistribSearch(BaseDistributedSearchTestCase.java:695)
[junit4:junit4]    > 	at sun.reflect.NativeMethodAccessorImpl.invoke0(Native Method)
[junit4:junit4]    > 	at sun.reflect.NativeMethodAccessorImpl.invoke(NativeMethodAccessorImpl.java:57)
[junit4:junit4]    > 	at sun.reflect.DelegatingMethodAccessorImpl.invoke(DelegatingMethodAccessorImpl.java:43)
[junit4:junit4]    > 	at java.lang.reflect.Method.invoke(Method.java:616)
[junit4:junit4]    > 	at com.carrotsearch.randomizedtesting.RandomizedRunner.invoke(RandomizedRunner.java:1559)
[junit4:junit4]    > 	at com.carrotsearch.randomizedtesting.RandomizedRunner.access$600(RandomizedRunner.java:79)
[junit4:junit4]    > 	at com.carrotsearch.randomizedtesting.RandomizedRunner$6.evaluate(RandomizedRunner.java:737)
[junit4:junit4]    > 	at com.carrotsearch.randomizedtesting.RandomizedRunner$7.evaluate(RandomizedRunner.java:773)
[junit4:junit4]    > 	at com.carrotsearch.randomizedtesting.RandomizedRunner$8.evaluate(RandomizedRunner.java:787)
[junit4:junit4]    > 	at com.carrotsearch.randomizedtesting.rules.SystemPropertiesRestoreRule$1.evaluate(SystemPropertiesRestoreRule.java:53)
[junit4:junit4]    > 	at org.apache.lucene.util.TestRuleSetupTeardownChained$1.evaluate(TestRuleSetupTeardownChained.java:50)
[junit4:junit4]    > 	at org.apache.lucene.util.TestRuleFieldCacheSanity$1.evaluate(TestRuleFieldCacheSanity.java:51)
[junit4:junit4]    > 	at org.apache.lucene.util.AbstractBeforeAfterRule$1.evaluate(AbstractBeforeAfterRule.java:45)
[junit4:junit4]    > 	at com.carrotsearch.randomizedtesting.rules.SystemPropertiesInvariantRule$1.evaluate(SystemPropertiesInvariantRule.java:55)
[junit4:junit4]    > 	at org.apache.lucene.util.TestRuleThreadAndTestName$1.evaluate(TestRuleThreadAndTestName.java:48)
[junit4:junit4]    > 	at org.apache.lucene.util.TestRuleIgnoreAfterMaxFailures$1.evaluate(TestRuleIgnoreAfterMaxFailures.java:70)
[junit4:junit4]    > 	at org.apache.lucene.util.TestRuleMarkFailure$1.evaluate(TestRuleMarkFailure.java:48)
[junit4:junit4]    > 	at com.carrotsearch.randomizedtesting.rules.StatementAdapter.evaluate(StatementAdapter.java:36)
[junit4:junit4]    > 	at com.carrotsearch.randomizedtesting.ThreadLeakControl$StatementRunner.run(ThreadLeakControl.java:358)
[junit4:junit4]    > 	at com.carrotsearch.randomizedtesting.ThreadLeakControl.forkTimeoutingTask(ThreadLeakControl.java:782)
[junit4:junit4]    > 	at com.carrotsearch.randomizedtesting.ThreadLeakControl$3.evaluate(ThreadLeakControl.java:442)
[junit4:junit4]    > 	at com.carrotsearch.randomizedtesting.RandomizedRunner.runSingleTest(RandomizedRunner.java:746)
[junit4:junit4]    > 	at com.carrotsearch.randomizedtesting.RandomizedRunner$3.evaluate(RandomizedRunner.java:648)
[junit4:junit4]    > 	at com.carrotsearch.randomizedtesting.RandomizedRunner$4.evaluate(RandomizedRunner.java:682)
[junit4:junit4]    > 	at com.carrotsearch.randomizedtesting.RandomizedRunner$5.evaluate(RandomizedRunner.java:693)
[junit4:junit4]    > 	at com.carrotsearch.randomizedtesting.rules.StatementAdapter.evaluate(StatementAdapter.java:36)
[junit4:junit4]    > 	at com.carrotsearch.randomizedtesting.rules.SystemPropertiesRestoreRule$1.evaluate(SystemPropertiesRestoreRule.java:53)
[junit4:junit4]    > 	at org.apache.lucene.util.AbstractBeforeAfterRule$1.evaluate(AbstractBeforeAfterRule.java:45)
[junit4:junit4]    > 	at org.apache.lucene.util.TestRuleStoreClassName$1.evaluate(TestRuleStoreClassName.java:42)
[junit4:junit4]    > 	at com.carrotsearch.randomizedtesting.rules.SystemPropertiesInvariantRule$1.evaluate(SystemPropertiesInvariantRule.java:55)
[junit4:junit4]    > 	at com.carrotsearch.randomizedtesting.rules.NoShadowingOrOverridesOnMethodsRule$1.evaluate(NoShadowingOrOverridesOnMethodsRule.java:39)
[junit4:junit4]    > 	at com.carrotsearch.randomizedtesting.rules.NoShadowingOrOverridesOnMethodsRule$1.evaluate(NoShadowingOrOverridesOnMethodsRule.java:39)
[junit4:junit4]    > 	at com.carrotsearch.randomizedtesting.rules.StatementAdapter.evaluate(StatementAdapter.java:36)
[junit4:junit4]    > 	at org.apache.lucene.util.TestRuleAssertionsRequired$1.evaluate(TestRuleAssertionsRequired.java:43)
[junit4:junit4]    > 	at org.apache.lucene.util.TestRuleMarkFailure$1.evaluate(TestRuleMarkFailure.java:48)
[junit4:junit4]    > 	at org.apache.lucene.util.TestRuleIgnoreAfterMaxFailures$1.evaluate(TestRuleIgnoreAfterMaxFailures.java:70)
[junit4:junit4]    > 	at org.apache.lucene.util.TestRuleIgnoreTestSuites$1.evaluate(TestRuleIgnoreTestSuites.java:55)
[junit4:junit4]    > 	at com.carrotsearch.randomizedtesting.rules.StatementAdapter.evaluate(StatementAdapter.java:36)
[junit4:junit4]    > 	at com.carrotsearch.randomizedtesting.ThreadLeakControl$StatementRunner.run(ThreadLeakControl.java:358)
[junit4:junit4]    > 	at java.lang.Thread.run(Thread.java:679)
[junit4:junit4]   2> 144161 T753 oas.SolrTestCaseJ4.deleteCore ###deleteCore
[junit4:junit4]   2> NOTE: test params are: codec=SimpleText, sim=DefaultSimilarity, locale=es_AR, timezone=America/Mazatlan
[junit4:junit4]   2> NOTE: FreeBSD 9.0-RELEASE amd64/Sun Microsystems Inc. 1.6.0_32 (64-bit)/cpus=16,threads=1,free=126226336,total=261619712
[junit4:junit4]   2> NOTE: All tests run in this JVM: [DistributedQueryElevationComponentTest, TestUpdate, TestRecovery, XsltUpdateRequestHandlerTest, TestWriterPerf, ZkNodePropsTest, TermVectorComponentDistributedTest, FullSolrCloudDistribCmdsTest, SignatureUpdateProcessorFactoryTest, TestCharFilters, BasicDistributedZk2Test, TestSolrDeletionPolicy2, TestPluginEnable, IndexSchemaRuntimeFieldTest, SolrIndexConfigTest, StatsComponentTest, QueryEqualityTest, SoftAutoCommitTest, TestDocumentBuilder, ReturnFieldsTest, TestDistributedGrouping, TestCodecSupport, TestBinaryField, DirectSolrSpellCheckerTest, URLClassifyProcessorTest, XmlUpdateRequestHandlerTest, ZkSolrClientTest, QueryParsingTest, SuggesterTSTTest, SpellingQueryConverterTest, IndexSchemaTest, TestFoldingMultitermQuery, OutputWriterTest, TestBM25SimilarityFactory, TestPhraseSuggestions, TestStressLucene, MultiTermTest, SyncSliceTest]
[junit4:junit4] Completed on J1 in 144.19s, 1 test, 1 failure <<< FAILURES!

[...truncated 386 lines...]
BUILD FAILED
/usr/home/hudson/hudson-slave/workspace/Lucene-Solr-Tests-trunk-Java6/build.xml:32: The following error occurred while executing this line:
/usr/home/hudson/hudson-slave/workspace/Lucene-Solr-Tests-trunk-Java6/solr/build.xml:146: The following error occurred while executing this line:
/usr/home/hudson/hudson-slave/workspace/Lucene-Solr-Tests-trunk-Java6/lucene/module-build.xml:63: The following error occurred while executing this line:
/usr/home/hudson/hudson-slave/workspace/Lucene-Solr-Tests-trunk-Java6/lucene/common-build.xml:1133: The following error occurred while executing this line:
/usr/home/hudson/hudson-slave/workspace/Lucene-Solr-Tests-trunk-Java6/lucene/common-build.xml:810: There were test failures: 229 suites, 947 tests, 2 failures, 7 ignored (2 assumptions)

Total time: 28 minutes 57 seconds
Build step 'Invoke Ant' marked build as failure
Recording test results
Email was triggered for: Failure
Sending email for trigger: Failure



Mime
View raw message