lucene-dev mailing list archives

Site index · List index
Message view « Date » · « Thread »
Top « Date » · « Thread »
From Apache Jenkins Server <jenk...@builds.apache.org>
Subject [JENKINS] Lucene-Solr-Tests-trunk-Java6 - Build # 15287 - Still Failing
Date Sat, 22 Sep 2012 22:39:52 GMT
Build: https://builds.apache.org/job/Lucene-Solr-Tests-trunk-Java6/15287/

2 tests failed.
REGRESSION:  org.apache.solr.cloud.SyncSliceTest.testDistribSearch

Error Message:
No live SolrServers available to handle this request

Stack Trace:
org.apache.solr.client.solrj.SolrServerException: No live SolrServers available to handle this request
	at __randomizedtesting.SeedInfo.seed([85FAE23449DCED29:41C6C2C3E838D15]:0)
	at org.apache.solr.client.solrj.impl.LBHttpSolrServer.request(LBHttpSolrServer.java:323)
	at org.apache.solr.client.solrj.impl.CloudSolrServer.request(CloudSolrServer.java:257)
	at org.apache.solr.client.solrj.request.QueryRequest.process(QueryRequest.java:90)
	at org.apache.solr.client.solrj.SolrServer.query(SolrServer.java:324)
	at org.apache.solr.cloud.AbstractFullDistribZkTestBase.checkShardConsistency(AbstractFullDistribZkTestBase.java:914)
	at org.apache.solr.cloud.SyncSliceTest.doTest(SyncSliceTest.java:226)
	at org.apache.solr.BaseDistributedSearchTestCase.testDistribSearch(BaseDistributedSearchTestCase.java:695)
	at sun.reflect.NativeMethodAccessorImpl.invoke0(Native Method)
	at sun.reflect.NativeMethodAccessorImpl.invoke(NativeMethodAccessorImpl.java:57)
	at sun.reflect.DelegatingMethodAccessorImpl.invoke(DelegatingMethodAccessorImpl.java:43)
	at java.lang.reflect.Method.invoke(Method.java:616)
	at com.carrotsearch.randomizedtesting.RandomizedRunner.invoke(RandomizedRunner.java:1559)
	at com.carrotsearch.randomizedtesting.RandomizedRunner.access$600(RandomizedRunner.java:79)
	at com.carrotsearch.randomizedtesting.RandomizedRunner$6.evaluate(RandomizedRunner.java:737)
	at com.carrotsearch.randomizedtesting.RandomizedRunner$7.evaluate(RandomizedRunner.java:773)
	at com.carrotsearch.randomizedtesting.RandomizedRunner$8.evaluate(RandomizedRunner.java:787)
	at com.carrotsearch.randomizedtesting.rules.SystemPropertiesRestoreRule$1.evaluate(SystemPropertiesRestoreRule.java:53)
	at org.apache.lucene.util.TestRuleSetupTeardownChained$1.evaluate(TestRuleSetupTeardownChained.java:50)
	at org.apache.lucene.util.TestRuleFieldCacheSanity$1.evaluate(TestRuleFieldCacheSanity.java:51)
	at org.apache.lucene.util.AbstractBeforeAfterRule$1.evaluate(AbstractBeforeAfterRule.java:45)
	at com.carrotsearch.randomizedtesting.rules.SystemPropertiesInvariantRule$1.evaluate(SystemPropertiesInvariantRule.java:55)
	at org.apache.lucene.util.TestRuleThreadAndTestName$1.evaluate(TestRuleThreadAndTestName.java:48)
	at org.apache.lucene.util.TestRuleIgnoreAfterMaxFailures$1.evaluate(TestRuleIgnoreAfterMaxFailures.java:70)
	at org.apache.lucene.util.TestRuleMarkFailure$1.evaluate(TestRuleMarkFailure.java:48)
	at com.carrotsearch.randomizedtesting.rules.StatementAdapter.evaluate(StatementAdapter.java:36)
	at com.carrotsearch.randomizedtesting.ThreadLeakControl$StatementRunner.run(ThreadLeakControl.java:358)
	at com.carrotsearch.randomizedtesting.ThreadLeakControl.forkTimeoutingTask(ThreadLeakControl.java:782)
	at com.carrotsearch.randomizedtesting.ThreadLeakControl$3.evaluate(ThreadLeakControl.java:442)
	at com.carrotsearch.randomizedtesting.RandomizedRunner.runSingleTest(RandomizedRunner.java:746)
	at com.carrotsearch.randomizedtesting.RandomizedRunner$3.evaluate(RandomizedRunner.java:648)
	at com.carrotsearch.randomizedtesting.RandomizedRunner$4.evaluate(RandomizedRunner.java:682)
	at com.carrotsearch.randomizedtesting.RandomizedRunner$5.evaluate(RandomizedRunner.java:693)
	at com.carrotsearch.randomizedtesting.rules.StatementAdapter.evaluate(StatementAdapter.java:36)
	at com.carrotsearch.randomizedtesting.rules.SystemPropertiesRestoreRule$1.evaluate(SystemPropertiesRestoreRule.java:53)
	at org.apache.lucene.util.AbstractBeforeAfterRule$1.evaluate(AbstractBeforeAfterRule.java:45)
	at org.apache.lucene.util.TestRuleStoreClassName$1.evaluate(TestRuleStoreClassName.java:42)
	at com.carrotsearch.randomizedtesting.rules.SystemPropertiesInvariantRule$1.evaluate(SystemPropertiesInvariantRule.java:55)
	at com.carrotsearch.randomizedtesting.rules.NoShadowingOrOverridesOnMethodsRule$1.evaluate(NoShadowingOrOverridesOnMethodsRule.java:39)
	at com.carrotsearch.randomizedtesting.rules.NoShadowingOrOverridesOnMethodsRule$1.evaluate(NoShadowingOrOverridesOnMethodsRule.java:39)
	at com.carrotsearch.randomizedtesting.rules.StatementAdapter.evaluate(StatementAdapter.java:36)
	at org.apache.lucene.util.TestRuleAssertionsRequired$1.evaluate(TestRuleAssertionsRequired.java:43)
	at org.apache.lucene.util.TestRuleMarkFailure$1.evaluate(TestRuleMarkFailure.java:48)
	at org.apache.lucene.util.TestRuleIgnoreAfterMaxFailures$1.evaluate(TestRuleIgnoreAfterMaxFailures.java:70)
	at org.apache.lucene.util.TestRuleIgnoreTestSuites$1.evaluate(TestRuleIgnoreTestSuites.java:55)
	at com.carrotsearch.randomizedtesting.rules.StatementAdapter.evaluate(StatementAdapter.java:36)
	at com.carrotsearch.randomizedtesting.ThreadLeakControl$StatementRunner.run(ThreadLeakControl.java:358)
	at java.lang.Thread.run(Thread.java:679)


FAILED:  org.apache.solr.cloud.BasicDistributedZk2Test.testDistribSearch

Error Message:
Shard still reported as live in zk

Stack Trace:
java.lang.AssertionError: Shard still reported as live in zk
	at __randomizedtesting.SeedInfo.seed([85FAE23449DCED29:41C6C2C3E838D15]:0)
	at org.junit.Assert.fail(Assert.java:93)
	at org.apache.solr.cloud.AbstractFullDistribZkTestBase.waitToSeeNotLive(AbstractFullDistribZkTestBase.java:1225)
	at org.apache.solr.cloud.BasicDistributedZk2Test.brindDownShardIndexSomeDocsAndRecover(BasicDistributedZk2Test.java:190)
	at org.apache.solr.cloud.BasicDistributedZk2Test.doTest(BasicDistributedZk2Test.java:83)
	at org.apache.solr.BaseDistributedSearchTestCase.testDistribSearch(BaseDistributedSearchTestCase.java:695)
	at sun.reflect.NativeMethodAccessorImpl.invoke0(Native Method)
	at sun.reflect.NativeMethodAccessorImpl.invoke(NativeMethodAccessorImpl.java:57)
	at sun.reflect.DelegatingMethodAccessorImpl.invoke(DelegatingMethodAccessorImpl.java:43)
	at java.lang.reflect.Method.invoke(Method.java:616)
	at com.carrotsearch.randomizedtesting.RandomizedRunner.invoke(RandomizedRunner.java:1559)
	at com.carrotsearch.randomizedtesting.RandomizedRunner.access$600(RandomizedRunner.java:79)
	at com.carrotsearch.randomizedtesting.RandomizedRunner$6.evaluate(RandomizedRunner.java:737)
	at com.carrotsearch.randomizedtesting.RandomizedRunner$7.evaluate(RandomizedRunner.java:773)
	at com.carrotsearch.randomizedtesting.RandomizedRunner$8.evaluate(RandomizedRunner.java:787)
	at com.carrotsearch.randomizedtesting.rules.SystemPropertiesRestoreRule$1.evaluate(SystemPropertiesRestoreRule.java:53)
	at org.apache.lucene.util.TestRuleSetupTeardownChained$1.evaluate(TestRuleSetupTeardownChained.java:50)
	at org.apache.lucene.util.TestRuleFieldCacheSanity$1.evaluate(TestRuleFieldCacheSanity.java:51)
	at org.apache.lucene.util.AbstractBeforeAfterRule$1.evaluate(AbstractBeforeAfterRule.java:45)
	at com.carrotsearch.randomizedtesting.rules.SystemPropertiesInvariantRule$1.evaluate(SystemPropertiesInvariantRule.java:55)
	at org.apache.lucene.util.TestRuleThreadAndTestName$1.evaluate(TestRuleThreadAndTestName.java:48)
	at org.apache.lucene.util.TestRuleIgnoreAfterMaxFailures$1.evaluate(TestRuleIgnoreAfterMaxFailures.java:70)
	at org.apache.lucene.util.TestRuleMarkFailure$1.evaluate(TestRuleMarkFailure.java:48)
	at com.carrotsearch.randomizedtesting.rules.StatementAdapter.evaluate(StatementAdapter.java:36)
	at com.carrotsearch.randomizedtesting.ThreadLeakControl$StatementRunner.run(ThreadLeakControl.java:358)
	at com.carrotsearch.randomizedtesting.ThreadLeakControl.forkTimeoutingTask(ThreadLeakControl.java:782)
	at com.carrotsearch.randomizedtesting.ThreadLeakControl$3.evaluate(ThreadLeakControl.java:442)
	at com.carrotsearch.randomizedtesting.RandomizedRunner.runSingleTest(RandomizedRunner.java:746)
	at com.carrotsearch.randomizedtesting.RandomizedRunner$3.evaluate(RandomizedRunner.java:648)
	at com.carrotsearch.randomizedtesting.RandomizedRunner$4.evaluate(RandomizedRunner.java:682)
	at com.carrotsearch.randomizedtesting.RandomizedRunner$5.evaluate(RandomizedRunner.java:693)
	at com.carrotsearch.randomizedtesting.rules.StatementAdapter.evaluate(StatementAdapter.java:36)
	at com.carrotsearch.randomizedtesting.rules.SystemPropertiesRestoreRule$1.evaluate(SystemPropertiesRestoreRule.java:53)
	at org.apache.lucene.util.AbstractBeforeAfterRule$1.evaluate(AbstractBeforeAfterRule.java:45)
	at org.apache.lucene.util.TestRuleStoreClassName$1.evaluate(TestRuleStoreClassName.java:42)
	at com.carrotsearch.randomizedtesting.rules.SystemPropertiesInvariantRule$1.evaluate(SystemPropertiesInvariantRule.java:55)
	at com.carrotsearch.randomizedtesting.rules.NoShadowingOrOverridesOnMethodsRule$1.evaluate(NoShadowingOrOverridesOnMethodsRule.java:39)
	at com.carrotsearch.randomizedtesting.rules.NoShadowingOrOverridesOnMethodsRule$1.evaluate(NoShadowingOrOverridesOnMethodsRule.java:39)
	at com.carrotsearch.randomizedtesting.rules.StatementAdapter.evaluate(StatementAdapter.java:36)
	at org.apache.lucene.util.TestRuleAssertionsRequired$1.evaluate(TestRuleAssertionsRequired.java:43)
	at org.apache.lucene.util.TestRuleMarkFailure$1.evaluate(TestRuleMarkFailure.java:48)
	at org.apache.lucene.util.TestRuleIgnoreAfterMaxFailures$1.evaluate(TestRuleIgnoreAfterMaxFailures.java:70)
	at org.apache.lucene.util.TestRuleIgnoreTestSuites$1.evaluate(TestRuleIgnoreTestSuites.java:55)
	at com.carrotsearch.randomizedtesting.rules.StatementAdapter.evaluate(StatementAdapter.java:36)
	at com.carrotsearch.randomizedtesting.ThreadLeakControl$StatementRunner.run(ThreadLeakControl.java:358)
	at java.lang.Thread.run(Thread.java:679)




Build Log:
[...truncated 7048 lines...]
[junit4:junit4] Suite: org.apache.solr.cloud.SyncSliceTest
[junit4:junit4]   2> 4 T260 oas.SolrTestCaseJ4.setUp ###Starting testDistribSearch
[junit4:junit4]   2> Creating dataDir: /usr/home/hudson/hudson-slave/workspace/Lucene-Solr-Tests-trunk-Java6/solr/build/solr-core/test/J1/./solrtest-SyncSliceTest-1348352728005
[junit4:junit4]   2> 10 T260 oasc.ZkTestServer.run STARTING ZK TEST SERVER
[junit4:junit4]   2> 144 T261 oaz.Environment.logEnv Server environment:zookeeper.version=3.3.6-1366786, built on 07/29/2012 06:22 GMT
[junit4:junit4]   2> 144 T261 oaz.Environment.logEnv Server environment:host.name=lucene.zones.apache.org
[junit4:junit4]   2> 145 T261 oaz.Environment.logEnv Server environment:java.version=1.6.0_32
[junit4:junit4]   2> 145 T261 oaz.Environment.logEnv Server environment:java.vendor=Sun Microsystems Inc.
[junit4:junit4]   2> 145 T261 oaz.Environment.logEnv Server environment:java.home=/usr/local/openjdk6/jre
[junit4:junit4]   2> 145 T261 oaz.Environment.logEnv Server environment:java.class.path=/usr/home/hudson/hudson-slave/workspace/Lucene-Solr-Tests-trunk-Java6/solr/build/solr-core/classes/test:/usr/home/hudson/hudson-slave/workspace/Lucene-Solr-Tests-trunk-Java6/solr/build/solr-test-framework/classes/java:/usr/home/hudson/hudson-slave/workspace/Lucene-Solr-Tests-trunk-Java6/solr/build/solr-core/test-files:/usr/home/hudson/hudson-slave/workspace/Lucene-Solr-Tests-trunk-Java6/lucene/build/codecs/classes/java:/usr/home/hudson/hudson-slave/workspace/Lucene-Solr-Tests-trunk-Java6/lucene/build/test-framework/classes/java:/usr/home/hudson/hudson-slave/workspace/Lucene-Solr-Tests-trunk-Java6/solr/build/solr-solrj/classes/java:/usr/home/hudson/hudson-slave/workspace/Lucene-Solr-Tests-trunk-Java6/solr/build/solr-core/classes/java:/usr/home/hudson/hudson-slave/workspace/Lucene-Solr-Tests-trunk-Java6/lucene/build/analysis/common/lucene-analyzers-common-5.0-SNAPSHOT.jar:/usr/home/hudson/hudson-slave/workspace/Lucene-Solr-Tests-trunk-Java6/lucene/build/analysis/kuromoji/lucene-analyzers-kuromoji-5.0-SNAPSHOT.jar:/usr/home/hudson/hudson-slave/workspace/Lucene-Solr-Tests-trunk-Java6/lucene/build/analysis/phonetic/lucene-analyzers-phonetic-5.0-SNAPSHOT.jar:/usr/home/hudson/hudson-slave/workspace/Lucene-Solr-Tests-trunk-Java6/lucene/build/highlighter/lucene-highlighter-5.0-SNAPSHOT.jar:/usr/home/hudson/hudson-slave/workspace/Lucene-Solr-Tests-trunk-Java6/lucene/build/memory/lucene-memory-5.0-SNAPSHOT.jar:/usr/home/hudson/hudson-slave/workspace/Lucene-Solr-Tests-trunk-Java6/lucene/build/misc/lucene-misc-5.0-SNAPSHOT.jar:/usr/home/hudson/hudson-slave/workspace/Lucene-Solr-Tests-trunk-Java6/lucene/build/spatial/lucene-spatial-5.0-SNAPSHOT.jar:/usr/home/hudson/hudson-slave/workspace/Lucene-Solr-Tests-trunk-Java6/lucene/build/suggest/lucene-suggest-5.0-SNAPSHOT.jar:/usr/home/hudson/hudson-slave/workspace/Lucene-Solr-Tests-trunk-Java6/lucene/build/grouping/lucene-grouping-5.0-SNAPSHOT.jar:/usr/home/hudson/hudson-slave/workspace/Lucene-Solr-Tests-trunk-Java6/lucene/build/queries/lucene-queries-5.0-SNAPSHOT.jar:/usr/home/hudson/hudson-slave/workspace/Lucene-Solr-Tests-trunk-Java6/lucene/build/queryparser/lucene-queryparser-5.0-SNAPSHOT.jar:/usr/home/hudson/hudson-slave/workspace/Lucene-Solr-Tests-trunk-Java6/solr/core/lib/commons-cli-1.2.jar:/usr/home/hudson/hudson-slave/workspace/Lucene-Solr-Tests-trunk-Java6/solr/core/lib/commons-codec-1.7.jar:/usr/home/hudson/hudson-slave/workspace/Lucene-Solr-Tests-trunk-Java6/solr/core/lib/commons-fileupload-1.2.1.jar:/usr/home/hudson/hudson-slave/workspace/Lucene-Solr-Tests-trunk-Java6/solr/core/lib/commons-lang-2.6.jar:/usr/home/hudson/hudson-slave/workspace/Lucene-Solr-Tests-trunk-Java6/solr/core/lib/easymock-2.2.jar:/usr/home/hudson/hudson-slave/workspace/Lucene-Solr-Tests-trunk-Java6/solr/core/lib/guava-r05.jar:/usr/home/hudson/hudson-slave/workspace/Lucene-Solr-Tests-trunk-Java6/solr/core/lib/javax.servlet-api-3.0.1.jar:/usr/home/hudson/hudson-slave/workspace/Lucene-Solr-Tests-trunk-Java6/solr/core/lib/spatial4j-0.3.jar:/usr/home/hudson/hudson-slave/workspace/Lucene-Solr-Tests-trunk-Java6/solr/solrj/lib/commons-io-2.1.jar:/usr/home/hudson/hudson-slave/workspace/Lucene-Solr-Tests-trunk-Java6/solr/solrj/lib/httpclient-4.1.3.jar:/usr/home/hudson/hudson-slave/workspace/Lucene-Solr-Tests-trunk-Java6/solr/solrj/lib/httpcore-4.1.4.jar:/usr/home/hudson/hudson-slave/workspace/Lucene-Solr-Tests-trunk-Java6/solr/solrj/lib/httpmime-4.1.3.jar:/usr/home/hudson/hudson-slave/workspace/Lucene-Solr-Tests-trunk-Java6/solr/solrj/lib/jcl-over-slf4j-1.6.4.jar:/usr/home/hudson/hudson-slave/workspace/Lucene-Solr-Tests-trunk-Java6/solr/solrj/lib/log4j-over-slf4j-1.6.4.jar:/usr/home/hudson/hudson-slave/workspace/Lucene-Solr-Tests-trunk-Java6/solr/solrj/lib/slf4j-api-1.6.4.jar:/usr/home/hudson/hudson-slave/workspace/Lucene-Solr-Tests-trunk-Java6/solr/solrj/lib/slf4j-jdk14-1.6.4.jar:/usr/home/hudson/hudson-slave/workspace/Lucene-Solr-Tests-trunk-Java6/solr/solrj/lib/wstx-asl-3.2.7.jar:/usr/home/hudson/hudson-slave/workspace/Lucene-Solr-Tests-trunk-Java6/solr/solrj/lib/zookeeper-3.3.6.jar:/usr/home/hudson/hudson-slave/workspace/Lucene-Solr-Tests-trunk-Java6/solr/example/lib/jetty-continuation-8.1.2.v20120308.jar:/usr/home/hudson/hudson-slave/workspace/Lucene-Solr-Tests-trunk-Java6/solr/example/lib/jetty-deploy-8.1.2.v20120308.jar:/usr/home/hudson/hudson-slave/workspace/Lucene-Solr-Tests-trunk-Java6/solr/example/lib/jetty-http-8.1.2.v20120308.jar:/usr/home/hudson/hudson-slave/workspace/Lucene-Solr-Tests-trunk-Java6/solr/example/lib/jetty-io-8.1.2.v20120308.jar:/usr/home/hudson/hudson-slave/workspace/Lucene-Solr-Tests-trunk-Java6/solr/example/lib/jetty-jmx-8.1.2.v20120308.jar:/usr/home/hudson/hudson-slave/workspace/Lucene-Solr-Tests-trunk-Java6/solr/example/lib/jetty-security-8.1.2.v20120308.jar:/usr/home/hudson/hudson-slave/workspace/Lucene-Solr-Tests-trunk-Java6/solr/example/lib/jetty-server-8.1.2.v20120308.jar:/usr/home/hudson/hudson-slave/workspace/Lucene-Solr-Tests-trunk-Java6/solr/example/lib/jetty-servlet-8.1.2.v20120308.jar:/usr/home/hudson/hudson-slave/workspace/Lucene-Solr-Tests-trunk-Java6/solr/example/lib/jetty-util-8.1.2.v20120308.jar:/usr/home/hudson/hudson-slave/workspace/Lucene-Solr-Tests-trunk-Java6/solr/example/lib/jetty-webapp-8.1.2.v20120308.jar:/usr/home/hudson/hudson-slave/workspace/Lucene-Solr-Tests-trunk-Java6/solr/example/lib/jetty-xml-8.1.2.v20120308.jar:/usr/home/hudson/hudson-slave/workspace/Lucene-Solr-Tests-trunk-Java6/solr/example/lib/servlet-api-3.0.jar:/usr/home/hudson/hudson-slave/workspace/Lucene-Solr-Tests-trunk-Java6/solr/example/example-DIH/solr/db/lib/hsqldb-1.8.0.10.jar:/usr/home/hudson/hudson-slave/workspace/Lucene-Solr-Tests-trunk-Java6/lucene/build/core/classes/java:/usr/home/hudson/hudson-slave/workspace/Lucene-Solr-Tests-trunk-Java6/lucene/test-framework/lib/junit-4.10.jar:/usr/home/hudson/hudson-slave/workspace/Lucene-Solr-Tests-trunk-Java6/lucene/test-framework/lib/randomizedtesting-runner-2.0.1.jar:/home/hudson/hudson-slave/tools/Ant/ant-1.8.2/lib/ant-launcher.jar:/home/hudson/.ant/lib/ivy-2.2.0.jar:/home/hudson/hudson-slave/tools/Ant/ant-1.8.2/lib/ant-apache-regexp.jar:/home/hudson/hudson-slave/tools/Ant/ant-1.8.2/lib/ant-junit.jar:/home/hudson/hudson-slave/tools/Ant/ant-1.8.2/lib/ant-apache-bsf.jar:/home/hudson/hudson-slave/tools/Ant/ant-1.8.2/lib/ant-commons-net.jar:/home/hudson/hudson-slave/tools/Ant/ant-1.8.2/lib/ant-antlr.jar:/home/hudson/hudson-slave/tools/Ant/ant-1.8.2/lib/ant-apache-log4j.jar:/home/hudson/hudson-slave/tools/Ant/ant-1.8.2/lib/ant-commons-logging.jar:/home/hudson/hudson-slave/tools/Ant/ant-1.8.2/lib/ant-apache-xalan2.jar:/home/hudson/hudson-slave/tools/Ant/ant-1.8.2/lib/ant-apache-oro.jar:/home/hudson/hudson-slave/tools/Ant/ant-1.8.2/lib/ant-junit4.jar:/home/hudson/hudson-slave/tools/Ant/ant-1.8.2/lib/ant-netrexx.jar:/home/hudson/hudson-slave/tools/Ant/ant-1.8.2/lib/ant-swing.jar:/home/hudson/hudson-slave/tools/Ant/ant-1.8.2/lib/ant-javamail.jar:/home/hudson/hudson-slave/tools/Ant/ant-1.8.2/lib/ant-jsch.jar:/home/hudson/hudson-slave/tools/Ant/ant-1.8.2/lib/ant-jmf.jar:/home/hudson/hudson-slave/tools/Ant/ant-1.8.2/lib/ant.jar:/home/hudson/hudson-slave/tools/Ant/ant-1.8.2/lib/ant-apache-bcel.jar:/home/hudson/hudson-slave/tools/Ant/ant-1.8.2/lib/ant-jai.jar:/home/hudson/hudson-slave/tools/Ant/ant-1.8.2/lib/ant-testutil.jar:/home/hudson/hudson-slave/tools/Ant/ant-1.8.2/lib/ant-apache-resolver.jar:/home/hudson/hudson-slave/tools/Ant/ant-1.8.2/lib/ant-jdepend.jar:/usr/local/openjdk6/lib/tools.jar:/home/hudson/.ivy2/cache/com.carrotsearch.randomizedtesting/junit4-ant/jars/junit4-ant-2.0.1.jar
[junit4:junit4]   2> 147 T261 oaz.Environment.logEnv Server environment:java.library.path=/usr/local/openjdk6/jre/lib/amd64/server:/usr/local/openjdk6/jre/lib/amd64:/usr/local/openjdk6/jre/../lib/amd64:/usr/java/packages/lib/amd64:/lib:/usr/lib:/usr/local/lib
[junit4:junit4]   2> 147 T261 oaz.Environment.logEnv Server environment:java.io.tmpdir=.
[junit4:junit4]   2> 148 T261 oaz.Environment.logEnv Server environment:java.compiler=<NA>
[junit4:junit4]   2> 148 T261 oaz.Environment.logEnv Server environment:os.name=FreeBSD
[junit4:junit4]   2> 148 T261 oaz.Environment.logEnv Server environment:os.arch=amd64
[junit4:junit4]   2> 148 T261 oaz.Environment.logEnv Server environment:os.version=9.0-RELEASE
[junit4:junit4]   2> 149 T261 oaz.Environment.logEnv Server environment:user.name=hudson
[junit4:junit4]   2> 149 T261 oaz.Environment.logEnv Server environment:user.home=/home/hudson
[junit4:junit4]   2> 149 T261 oaz.Environment.logEnv Server environment:user.dir=/usr/home/hudson/hudson-slave/workspace/Lucene-Solr-Tests-trunk-Java6/solr/build/solr-core/test/J1
[junit4:junit4]   2> 216 T261 oazs.ZooKeeperServer.setTickTime tickTime set to 1000
[junit4:junit4]   2> 256 T261 oazs.NIOServerCnxn$Factory.<init> binding to port 0.0.0.0/0.0.0.0:0
[junit4:junit4]   2> 317 T260 oasc.ZkTestServer.run start zk server on port:29756
[junit4:junit4]   2> 401 T261 oazsp.FileTxnSnapLog.save Snapshotting: 0
[junit4:junit4]   2> 508 T260 oaz.Environment.logEnv Client environment:zookeeper.version=3.3.6-1366786, built on 07/29/2012 06:22 GMT
[junit4:junit4]   2> 509 T260 oaz.Environment.logEnv Client environment:host.name=lucene.zones.apache.org
[junit4:junit4]   2> 509 T260 oaz.Environment.logEnv Client environment:java.version=1.6.0_32
[junit4:junit4]   2> 510 T260 oaz.Environment.logEnv Client environment:java.vendor=Sun Microsystems Inc.
[junit4:junit4]   2> 510 T260 oaz.Environment.logEnv Client environment:java.home=/usr/local/openjdk6/jre
[junit4:junit4]   2> 511 T260 oaz.Environment.logEnv Client environment:java.class.path=/usr/home/hudson/hudson-slave/workspace/Lucene-Solr-Tests-trunk-Java6/solr/build/solr-core/classes/test:/usr/home/hudson/hudson-slave/workspace/Lucene-Solr-Tests-trunk-Java6/solr/build/solr-test-framework/classes/java:/usr/home/hudson/hudson-slave/workspace/Lucene-Solr-Tests-trunk-Java6/solr/build/solr-core/test-files:/usr/home/hudson/hudson-slave/workspace/Lucene-Solr-Tests-trunk-Java6/lucene/build/codecs/classes/java:/usr/home/hudson/hudson-slave/workspace/Lucene-Solr-Tests-trunk-Java6/lucene/build/test-framework/classes/java:/usr/home/hudson/hudson-slave/workspace/Lucene-Solr-Tests-trunk-Java6/solr/build/solr-solrj/classes/java:/usr/home/hudson/hudson-slave/workspace/Lucene-Solr-Tests-trunk-Java6/solr/build/solr-core/classes/java:/usr/home/hudson/hudson-slave/workspace/Lucene-Solr-Tests-trunk-Java6/lucene/build/analysis/common/lucene-analyzers-common-5.0-SNAPSHOT.jar:/usr/home/hudson/hudson-slave/workspace/Lucene-Solr-Tests-trunk-Java6/lucene/build/analysis/kuromoji/lucene-analyzers-kuromoji-5.0-SNAPSHOT.jar:/usr/home/hudson/hudson-slave/workspace/Lucene-Solr-Tests-trunk-Java6/lucene/build/analysis/phonetic/lucene-analyzers-phonetic-5.0-SNAPSHOT.jar:/usr/home/hudson/hudson-slave/workspace/Lucene-Solr-Tests-trunk-Java6/lucene/build/highlighter/lucene-highlighter-5.0-SNAPSHOT.jar:/usr/home/hudson/hudson-slave/workspace/Lucene-Solr-Tests-trunk-Java6/lucene/build/memory/lucene-memory-5.0-SNAPSHOT.jar:/usr/home/hudson/hudson-slave/workspace/Lucene-Solr-Tests-trunk-Java6/lucene/build/misc/lucene-misc-5.0-SNAPSHOT.jar:/usr/home/hudson/hudson-slave/workspace/Lucene-Solr-Tests-trunk-Java6/lucene/build/spatial/lucene-spatial-5.0-SNAPSHOT.jar:/usr/home/hudson/hudson-slave/workspace/Lucene-Solr-Tests-trunk-Java6/lucene/build/suggest/lucene-suggest-5.0-SNAPSHOT.jar:/usr/home/hudson/hudson-slave/workspace/Lucene-Solr-Tests-trunk-Java6/lucene/build/grouping/lucene-grouping-5.0-SNAPSHOT.jar:/usr/home/hudson/hudson-slave/workspace/Lucene-Solr-Tests-trunk-Java6/lucene/build/queries/lucene-queries-5.0-SNAPSHOT.jar:/usr/home/hudson/hudson-slave/workspace/Lucene-Solr-Tests-trunk-Java6/lucene/build/queryparser/lucene-queryparser-5.0-SNAPSHOT.jar:/usr/home/hudson/hudson-slave/workspace/Lucene-Solr-Tests-trunk-Java6/solr/core/lib/commons-cli-1.2.jar:/usr/home/hudson/hudson-slave/workspace/Lucene-Solr-Tests-trunk-Java6/solr/core/lib/commons-codec-1.7.jar:/usr/home/hudson/hudson-slave/workspace/Lucene-Solr-Tests-trunk-Java6/solr/core/lib/commons-fileupload-1.2.1.jar:/usr/home/hudson/hudson-slave/workspace/Lucene-Solr-Tests-trunk-Java6/solr/core/lib/commons-lang-2.6.jar:/usr/home/hudson/hudson-slave/workspace/Lucene-Solr-Tests-trunk-Java6/solr/core/lib/easymock-2.2.jar:/usr/home/hudson/hudson-slave/workspace/Lucene-Solr-Tests-trunk-Java6/solr/core/lib/guava-r05.jar:/usr/home/hudson/hudson-slave/workspace/Lucene-Solr-Tests-trunk-Java6/solr/core/lib/javax.servlet-api-3.0.1.jar:/usr/home/hudson/hudson-slave/workspace/Lucene-Solr-Tests-trunk-Java6/solr/core/lib/spatial4j-0.3.jar:/usr/home/hudson/hudson-slave/workspace/Lucene-Solr-Tests-trunk-Java6/solr/solrj/lib/commons-io-2.1.jar:/usr/home/hudson/hudson-slave/workspace/Lucene-Solr-Tests-trunk-Java6/solr/solrj/lib/httpclient-4.1.3.jar:/usr/home/hudson/hudson-slave/workspace/Lucene-Solr-Tests-trunk-Java6/solr/solrj/lib/httpcore-4.1.4.jar:/usr/home/hudson/hudson-slave/workspace/Lucene-Solr-Tests-trunk-Java6/solr/solrj/lib/httpmime-4.1.3.jar:/usr/home/hudson/hudson-slave/workspace/Lucene-Solr-Tests-trunk-Java6/solr/solrj/lib/jcl-over-slf4j-1.6.4.jar:/usr/home/hudson/hudson-slave/workspace/Lucene-Solr-Tests-trunk-Java6/solr/solrj/lib/log4j-over-slf4j-1.6.4.jar:/usr/home/hudson/hudson-slave/workspace/Lucene-Solr-Tests-trunk-Java6/solr/solrj/lib/slf4j-api-1.6.4.jar:/usr/home/hudson/hudson-slave/workspace/Lucene-Solr-Tests-trunk-Java6/solr/solrj/lib/slf4j-jdk14-1.6.4.jar:/usr/home/hudson/hudson-slave/workspace/Lucene-Solr-Tests-trunk-Java6/solr/solrj/lib/wstx-asl-3.2.7.jar:/usr/home/hudson/hudson-slave/workspace/Lucene-Solr-Tests-trunk-Java6/solr/solrj/lib/zookeeper-3.3.6.jar:/usr/home/hudson/hudson-slave/workspace/Lucene-Solr-Tests-trunk-Java6/solr/example/lib/jetty-continuation-8.1.2.v20120308.jar:/usr/home/hudson/hudson-slave/workspace/Lucene-Solr-Tests-trunk-Java6/solr/example/lib/jetty-deploy-8.1.2.v20120308.jar:/usr/home/hudson/hudson-slave/workspace/Lucene-Solr-Tests-trunk-Java6/solr/example/lib/jetty-http-8.1.2.v20120308.jar:/usr/home/hudson/hudson-slave/workspace/Lucene-Solr-Tests-trunk-Java6/solr/example/lib/jetty-io-8.1.2.v20120308.jar:/usr/home/hudson/hudson-slave/workspace/Lucene-Solr-Tests-trunk-Java6/solr/example/lib/jetty-jmx-8.1.2.v20120308.jar:/usr/home/hudson/hudson-slave/workspace/Lucene-Solr-Tests-trunk-Java6/solr/example/lib/jetty-security-8.1.2.v20120308.jar:/usr/home/hudson/hudson-slave/workspace/Lucene-Solr-Tests-trunk-Java6/solr/example/lib/jetty-server-8.1.2.v20120308.jar:/usr/home/hudson/hudson-slave/workspace/Lucene-Solr-Tests-trunk-Java6/solr/example/lib/jetty-servlet-8.1.2.v20120308.jar:/usr/home/hudson/hudson-slave/workspace/Lucene-Solr-Tests-trunk-Java6/solr/example/lib/jetty-util-8.1.2.v20120308.jar:/usr/home/hudson/hudson-slave/workspace/Lucene-Solr-Tests-trunk-Java6/solr/example/lib/jetty-webapp-8.1.2.v20120308.jar:/usr/home/hudson/hudson-slave/workspace/Lucene-Solr-Tests-trunk-Java6/solr/example/lib/jetty-xml-8.1.2.v20120308.jar:/usr/home/hudson/hudson-slave/workspace/Lucene-Solr-Tests-trunk-Java6/solr/example/lib/servlet-api-3.0.jar:/usr/home/hudson/hudson-slave/workspace/Lucene-Solr-Tests-trunk-Java6/solr/example/example-DIH/solr/db/lib/hsqldb-1.8.0.10.jar:/usr/home/hudson/hudson-slave/workspace/Lucene-Solr-Tests-trunk-Java6/lucene/build/core/classes/java:/usr/home/hudson/hudson-slave/workspace/Lucene-Solr-Tests-trunk-Java6/lucene/test-framework/lib/junit-4.10.jar:/usr/home/hudson/hudson-slave/workspace/Lucene-Solr-Tests-trunk-Java6/lucene/test-framework/lib/randomizedtesting-runner-2.0.1.jar:/home/hudson/hudson-slave/tools/Ant/ant-1.8.2/lib/ant-launcher.jar:/home/hudson/.ant/lib/ivy-2.2.0.jar:/home/hudson/hudson-slave/tools/Ant/ant-1.8.2/lib/ant-apache-regexp.jar:/home/hudson/hudson-slave/tools/Ant/ant-1.8.2/lib/ant-junit.jar:/home/hudson/hudson-slave/tools/Ant/ant-1.8.2/lib/ant-apache-bsf.jar:/home/hudson/hudson-slave/tools/Ant/ant-1.8.2/lib/ant-commons-net.jar:/home/hudson/hudson-slave/tools/Ant/ant-1.8.2/lib/ant-antlr.jar:/home/hudson/hudson-slave/tools/Ant/ant-1.8.2/lib/ant-apache-log4j.jar:/home/hudson/hudson-slave/tools/Ant/ant-1.8.2/lib/ant-commons-logging.jar:/home/hudson/hudson-slave/tools/Ant/ant-1.8.2/lib/ant-apache-xalan2.jar:/home/hudson/hudson-slave/tools/Ant/ant-1.8.2/lib/ant-apache-oro.jar:/home/hudson/hudson-slave/tools/Ant/ant-1.8.2/lib/ant-junit4.jar:/home/hudson/hudson-slave/tools/Ant/ant-1.8.2/lib/ant-netrexx.jar:/home/hudson/hudson-slave/tools/Ant/ant-1.8.2/lib/ant-swing.jar:/home/hudson/hudson-slave/tools/Ant/ant-1.8.2/lib/ant-javamail.jar:/home/hudson/hudson-slave/tools/Ant/ant-1.8.2/lib/ant-jsch.jar:/home/hudson/hudson-slave/tools/Ant/ant-1.8.2/lib/ant-jmf.jar:/home/hudson/hudson-slave/tools/Ant/ant-1.8.2/lib/ant.jar:/home/hudson/hudson-slave/tools/Ant/ant-1.8.2/lib/ant-apache-bcel.jar:/home/hudson/hudson-slave/tools/Ant/ant-1.8.2/lib/ant-jai.jar:/home/hudson/hudson-slave/tools/Ant/ant-1.8.2/lib/ant-testutil.jar:/home/hudson/hudson-slave/tools/Ant/ant-1.8.2/lib/ant-apache-resolver.jar:/home/hudson/hudson-slave/tools/Ant/ant-1.8.2/lib/ant-jdepend.jar:/usr/local/openjdk6/lib/tools.jar:/home/hudson/.ivy2/cache/com.carrotsearch.randomizedtesting/junit4-ant/jars/junit4-ant-2.0.1.jar
[junit4:junit4]   2> 512 T260 oaz.Environment.logEnv Client environment:java.library.path=/usr/local/openjdk6/jre/lib/amd64/server:/usr/local/openjdk6/jre/lib/amd64:/usr/local/openjdk6/jre/../lib/amd64:/usr/java/packages/lib/amd64:/lib:/usr/lib:/usr/local/lib
[junit4:junit4]   2> 513 T260 oaz.Environment.logEnv Client environment:java.io.tmpdir=.
[junit4:junit4]   2> 513 T260 oaz.Environment.logEnv Client environment:java.compiler=<NA>
[junit4:junit4]   2> 514 T260 oaz.Environment.logEnv Client environment:os.name=FreeBSD
[junit4:junit4]   2> 514 T260 oaz.Environment.logEnv Client environment:os.arch=amd64
[junit4:junit4]   2> 515 T260 oaz.Environment.logEnv Client environment:os.version=9.0-RELEASE
[junit4:junit4]   2> 515 T260 oaz.Environment.logEnv Client environment:user.name=hudson
[junit4:junit4]   2> 516 T260 oaz.Environment.logEnv Client environment:user.home=/home/hudson
[junit4:junit4]   2> 516 T260 oaz.Environment.logEnv Client environment:user.dir=/usr/home/hudson/hudson-slave/workspace/Lucene-Solr-Tests-trunk-Java6/solr/build/solr-core/test/J1
[junit4:junit4]   2> 524 T260 oaz.ZooKeeper.<init> Initiating client connection, connectString=127.0.0.1:29756 sessionTimeout=10000 watcher=org.apache.solr.common.cloud.ConnectionManager@2d03e677
[junit4:junit4]   2> 643 T265 oaz.ClientCnxn$SendThread.startConnect Opening socket connection to server /127.0.0.1:29756
[junit4:junit4]   2> 644 T260 oascc.ConnectionManager.waitForConnected Waiting for client to connect to ZooKeeper
[junit4:junit4]   2> 661 T265 oaz.ClientCnxn$SendThread.primeConnection Socket connection established to localhost/127.0.0.1:29756, initiating session
[junit4:junit4]   2> 661 T262 oazs.NIOServerCnxn$Factory.run Accepted socket connection from /140.211.11.196:29757
[junit4:junit4]   2> 684 T262 oazs.NIOServerCnxn.readConnectRequest Client attempting to establish new session at /140.211.11.196:29757
[junit4:junit4]   2> 700 T264 oazsp.FileTxnLog.append Creating new log file: log.1
[junit4:junit4]   2> 758 T264 oazs.NIOServerCnxn.finishSessionInit Established session 0x139f015dda50000 with negotiated timeout 10000 for client /140.211.11.196:29757
[junit4:junit4]   2> 758 T265 oaz.ClientCnxn$SendThread.readConnectResult Session establishment complete on server localhost/127.0.0.1:29756, sessionid = 0x139f015dda50000, negotiated timeout = 10000
[junit4:junit4]   2> 771 T267 oascc.ConnectionManager.process Watcher org.apache.solr.common.cloud.ConnectionManager@2d03e677 name:ZooKeeperConnection Watcher:127.0.0.1:29756 got event WatchedEvent state:SyncConnected type:None path:null path:null type:None
[junit4:junit4]   2> 771 T260 oascc.ConnectionManager.waitForConnected Client is connected to ZooKeeper
[junit4:junit4]   2> 775 T260 oascc.SolrZkClient.makePath makePath: /solr
[junit4:junit4]   2> 866 T266 oazs.PrepRequestProcessor.pRequest Processed session termination for sessionid: 0x139f015dda50000
[junit4:junit4]   2> 906 T267 oaz.ClientCnxn$EventThread.run EventThread shut down
[junit4:junit4]   2> 906 T260 oaz.ZooKeeper.close Session: 0x139f015dda50000 closed
[junit4:junit4]   2> 907 T260 oaz.ZooKeeper.<init> Initiating client connection, connectString=127.0.0.1:29756/solr sessionTimeout=10000 watcher=org.apache.solr.common.cloud.ConnectionManager@515f9553
[junit4:junit4]   2> 908 T262 oazs.NIOServerCnxn.closeSock Closed socket connection for client /140.211.11.196:29757 which had sessionid 0x139f015dda50000
[junit4:junit4]   2> 908 T268 oaz.ClientCnxn$SendThread.startConnect Opening socket connection to server /127.0.0.1:29756
[junit4:junit4]   2> 908 T260 oascc.ConnectionManager.waitForConnected Waiting for client to connect to ZooKeeper
[junit4:junit4]   2> 909 T268 oaz.ClientCnxn$SendThread.primeConnection Socket connection established to localhost/127.0.0.1:29756, initiating session
[junit4:junit4]   2> 910 T262 oazs.NIOServerCnxn$Factory.run Accepted socket connection from /140.211.11.196:29758
[junit4:junit4]   2> 910 T262 oazs.NIOServerCnxn.readConnectRequest Client attempting to establish new session at /140.211.11.196:29758
[junit4:junit4]   2> 942 T264 oazs.NIOServerCnxn.finishSessionInit Established session 0x139f015dda50001 with negotiated timeout 10000 for client /140.211.11.196:29758
[junit4:junit4]   2> 942 T268 oaz.ClientCnxn$SendThread.readConnectResult Session establishment complete on server localhost/127.0.0.1:29756, sessionid = 0x139f015dda50001, negotiated timeout = 10000
[junit4:junit4]   2> 943 T269 oascc.ConnectionManager.process Watcher org.apache.solr.common.cloud.ConnectionManager@515f9553 name:ZooKeeperConnection Watcher:127.0.0.1:29756/solr got event WatchedEvent state:SyncConnected type:None path:null path:null type:None
[junit4:junit4]   2> 943 T260 oascc.ConnectionManager.waitForConnected Client is connected to ZooKeeper
[junit4:junit4]   2> 949 T260 oascc.SolrZkClient.makePath makePath: /collections/collection1
[junit4:junit4]   2> 974 T260 oascc.SolrZkClient.makePath makePath: /collections/collection1/shards
[junit4:junit4]   2> 988 T260 oascc.SolrZkClient.makePath makePath: /collections/control_collection
[junit4:junit4]   2> 992 T260 oascc.SolrZkClient.makePath makePath: /collections/control_collection/shards
[junit4:junit4]   2> 1004 T260 oasc.AbstractZkTestCase.putConfig put /usr/home/hudson/hudson-slave/workspace/Lucene-Solr-Tests-trunk-Java6/solr/build/solr-core/test-files/solr/collection1/conf/solrconfig.xml to /configs/conf1/solrconfig.xml
[junit4:junit4]   2> 1005 T260 oascc.SolrZkClient.makePath makePath: /configs/conf1/solrconfig.xml
[junit4:junit4]   2> 1019 T260 oasc.AbstractZkTestCase.putConfig put /usr/home/hudson/hudson-slave/workspace/Lucene-Solr-Tests-trunk-Java6/solr/build/solr-core/test-files/solr/collection1/conf/schema.xml to /configs/conf1/schema.xml
[junit4:junit4]   2> 1020 T260 oascc.SolrZkClient.makePath makePath: /configs/conf1/schema.xml
[junit4:junit4]   2> 1128 T260 oasc.AbstractZkTestCase.putConfig put /usr/home/hudson/hudson-slave/workspace/Lucene-Solr-Tests-trunk-Java6/solr/build/solr-core/test-files/solr/collection1/conf/solrconfig.xml to /configs/conf1/solrconfig.xml
[junit4:junit4]   2> 1129 T260 oascc.SolrZkClient.makePath makePath: /configs/conf1/solrconfig.xml
[junit4:junit4]   2> 1145 T260 oasc.AbstractZkTestCase.putConfig put /usr/home/hudson/hudson-slave/workspace/Lucene-Solr-Tests-trunk-Java6/solr/build/solr-core/test-files/solr/collection1/conf/stopwords.txt to /configs/conf1/stopwords.txt
[junit4:junit4]   2> 1146 T260 oascc.SolrZkClient.makePath makePath: /configs/conf1/stopwords.txt
[junit4:junit4]   2> 1155 T260 oasc.AbstractZkTestCase.putConfig put /usr/home/hudson/hudson-slave/workspace/Lucene-Solr-Tests-trunk-Java6/solr/build/solr-core/test-files/solr/collection1/conf/protwords.txt to /configs/conf1/protwords.txt
[junit4:junit4]   2> 1156 T260 oascc.SolrZkClient.makePath makePath: /configs/conf1/protwords.txt
[junit4:junit4]   2> 1169 T260 oasc.AbstractZkTestCase.putConfig put /usr/home/hudson/hudson-slave/workspace/Lucene-Solr-Tests-trunk-Java6/solr/build/solr-core/test-files/solr/collection1/conf/currency.xml to /configs/conf1/currency.xml
[junit4:junit4]   2> 1170 T260 oascc.SolrZkClient.makePath makePath: /configs/conf1/currency.xml
[junit4:junit4]   2> 1174 T260 oasc.AbstractZkTestCase.putConfig put /usr/home/hudson/hudson-slave/workspace/Lucene-Solr-Tests-trunk-Java6/solr/build/solr-core/test-files/solr/collection1/conf/open-exchange-rates.json to /configs/conf1/open-exchange-rates.json
[junit4:junit4]   2> 1175 T260 oascc.SolrZkClient.makePath makePath: /configs/conf1/open-exchange-rates.json
[junit4:junit4]   2> 1179 T260 oasc.AbstractZkTestCase.putConfig put /usr/home/hudson/hudson-slave/workspace/Lucene-Solr-Tests-trunk-Java6/solr/build/solr-core/test-files/solr/collection1/conf/mapping-ISOLatin1Accent.txt to /configs/conf1/mapping-ISOLatin1Accent.txt
[junit4:junit4]   2> 1180 T260 oascc.SolrZkClient.makePath makePath: /configs/conf1/mapping-ISOLatin1Accent.txt
[junit4:junit4]   2> 1185 T260 oasc.AbstractZkTestCase.putConfig put /usr/home/hudson/hudson-slave/workspace/Lucene-Solr-Tests-trunk-Java6/solr/build/solr-core/test-files/solr/collection1/conf/old_synonyms.txt to /configs/conf1/old_synonyms.txt
[junit4:junit4]   2> 1185 T260 oascc.SolrZkClient.makePath makePath: /configs/conf1/old_synonyms.txt
[junit4:junit4]   2> 1190 T260 oasc.AbstractZkTestCase.putConfig put /usr/home/hudson/hudson-slave/workspace/Lucene-Solr-Tests-trunk-Java6/solr/build/solr-core/test-files/solr/collection1/conf/synonyms.txt to /configs/conf1/synonyms.txt
[junit4:junit4]   2> 1191 T260 oascc.SolrZkClient.makePath makePath: /configs/conf1/synonyms.txt
[junit4:junit4]   2> 1195 T266 oazs.PrepRequestProcessor.pRequest Processed session termination for sessionid: 0x139f015dda50001
[junit4:junit4]   2> 1196 T269 oaz.ClientCnxn$EventThread.run EventThread shut down
[junit4:junit4]   2> 1196 T260 oaz.ZooKeeper.close Session: 0x139f015dda50001 closed
[junit4:junit4]   2> 1196 T262 oazs.NIOServerCnxn.closeSock Closed socket connection for client /140.211.11.196:29758 which had sessionid 0x139f015dda50001
[junit4:junit4]   2> 1354 T260 oejs.Server.doStart jetty-8.1.2.v20120308
[junit4:junit4]   2> 1357 T260 oejs.AbstractConnector.doStart Started SocketConnector@0.0.0.0:29760
[junit4:junit4]   2> 1358 T260 oasc.SolrResourceLoader.locateSolrHome JNDI not configured for solr (NoInitialContextEx)
[junit4:junit4]   2> 1359 T260 oasc.SolrResourceLoader.locateSolrHome using system property solr.solr.home: /usr/home/hudson/hudson-slave/workspace/Lucene-Solr-Tests-trunk-Java6/solr/build/solr-core/test/J1/./org.apache.solr.cloud.SyncSliceTest-controljetty-1348352729198
[junit4:junit4]   2> 1359 T260 oasc.SolrResourceLoader.<init> new SolrResourceLoader for deduced Solr Home: '/usr/home/hudson/hudson-slave/workspace/Lucene-Solr-Tests-trunk-Java6/solr/build/solr-core/test/J1/./org.apache.solr.cloud.SyncSliceTest-controljetty-1348352729198/'
[junit4:junit4]   2> 1415 T260 oass.SolrDispatchFilter.init SolrDispatchFilter.init()
[junit4:junit4]   2> 1416 T260 oasc.SolrResourceLoader.locateSolrHome JNDI not configured for solr (NoInitialContextEx)
[junit4:junit4]   2> 1416 T260 oasc.SolrResourceLoader.locateSolrHome using system property solr.solr.home: /usr/home/hudson/hudson-slave/workspace/Lucene-Solr-Tests-trunk-Java6/solr/build/solr-core/test/J1/./org.apache.solr.cloud.SyncSliceTest-controljetty-1348352729198
[junit4:junit4]   2> 1417 T260 oasc.CoreContainer$Initializer.initialize looking for solr.xml: /usr/home/hudson/hudson-slave/workspace/Lucene-Solr-Tests-trunk-Java6/solr/build/solr-core/test/J1/./org.apache.solr.cloud.SyncSliceTest-controljetty-1348352729198/solr.xml
[junit4:junit4]   2> 1418 T260 oasc.CoreContainer.<init> New CoreContainer 147591426
[junit4:junit4]   2> 1419 T260 oasc.CoreContainer.load Loading CoreContainer using Solr Home: '/usr/home/hudson/hudson-slave/workspace/Lucene-Solr-Tests-trunk-Java6/solr/build/solr-core/test/J1/./org.apache.solr.cloud.SyncSliceTest-controljetty-1348352729198/'
[junit4:junit4]   2> 1419 T260 oasc.SolrResourceLoader.<init> new SolrResourceLoader for directory: '/usr/home/hudson/hudson-slave/workspace/Lucene-Solr-Tests-trunk-Java6/solr/build/solr-core/test/J1/./org.apache.solr.cloud.SyncSliceTest-controljetty-1348352729198/'
[junit4:junit4]   2> 1461 T260 oasc.CoreContainer.load Registering Log Listener
[junit4:junit4]   2> 1478 T260 oasc.CoreContainer.initZooKeeper Zookeeper client=127.0.0.1:29756/solr
[junit4:junit4]   2> 1510 T260 oaz.ZooKeeper.<init> Initiating client connection, connectString=127.0.0.1:29756/solr sessionTimeout=5000 watcher=org.apache.solr.common.cloud.ConnectionManager@3ecef542
[junit4:junit4]   2> 1512 T279 oaz.ClientCnxn$SendThread.startConnect Opening socket connection to server /127.0.0.1:29756
[junit4:junit4]   2> 1512 T260 oascc.ConnectionManager.waitForConnected Waiting for client to connect to ZooKeeper
[junit4:junit4]   2> 1513 T279 oaz.ClientCnxn$SendThread.primeConnection Socket connection established to localhost/127.0.0.1:29756, initiating session
[junit4:junit4]   2> 1513 T262 oazs.NIOServerCnxn$Factory.run Accepted socket connection from /140.211.11.196:29761
[junit4:junit4]   2> 1513 T262 oazs.NIOServerCnxn.readConnectRequest Client attempting to establish new session at /140.211.11.196:29761
[junit4:junit4]   2> 1517 T264 oazs.NIOServerCnxn.finishSessionInit Established session 0x139f015dda50002 with negotiated timeout 5000 for client /140.211.11.196:29761
[junit4:junit4]   2> 1517 T279 oaz.ClientCnxn$SendThread.readConnectResult Session establishment complete on server localhost/127.0.0.1:29756, sessionid = 0x139f015dda50002, negotiated timeout = 5000
[junit4:junit4]   2> 1517 T280 oascc.ConnectionManager.process Watcher org.apache.solr.common.cloud.ConnectionManager@3ecef542 name:ZooKeeperConnection Watcher:127.0.0.1:29756/solr got event WatchedEvent state:SyncConnected type:None path:null path:null type:None
[junit4:junit4]   2> 1517 T260 oascc.ConnectionManager.waitForConnected Client is connected to ZooKeeper
[junit4:junit4]   2> 1546 T266 oazs.PrepRequestProcessor.pRequest Got user-level KeeperException when processing sessionid:0x139f015dda50002 type:create cxid:0x2 zxid:0xfffffffffffffffe txntype:unknown reqpath:n/a Error Path:/solr/overseer Error:KeeperErrorCode = NodeExists for /solr/overseer
[junit4:junit4]   2> 1559 T260 oascc.SolrZkClient.makePath makePath: /live_nodes
[junit4:junit4]   2> 1562 T260 oasc.ZkController.createEphemeralLiveNode Register node as live in ZooKeeper:/live_nodes/127.0.0.1:29760_solr
[junit4:junit4]   2> 1567 T266 oazs.PrepRequestProcessor.pRequest Got user-level KeeperException when processing sessionid:0x139f015dda50002 type:delete cxid:0x7 zxid:0xfffffffffffffffe txntype:unknown reqpath:n/a Error Path:/solr/live_nodes/127.0.0.1:29760_solr Error:KeeperErrorCode = NoNode for /solr/live_nodes/127.0.0.1:29760_solr
[junit4:junit4]   2> 1568 T260 oascc.SolrZkClient.makePath makePath: /live_nodes/127.0.0.1:29760_solr
[junit4:junit4]   2> 1572 T260 oashc.HttpShardHandlerFactory.getParameter Setting socketTimeout to: 0
[junit4:junit4]   2> 1572 T260 oashc.HttpShardHandlerFactory.getParameter Setting urlScheme to: http://
[junit4:junit4]   2> 1572 T260 oashc.HttpShardHandlerFactory.getParameter Setting connTimeout to: 0
[junit4:junit4]   2> 1572 T260 oashc.HttpShardHandlerFactory.getParameter Setting maxConnectionsPerHost to: 20
[junit4:junit4]   2> 1573 T260 oashc.HttpShardHandlerFactory.getParameter Setting corePoolSize to: 0
[junit4:junit4]   2> 1573 T260 oashc.HttpShardHandlerFactory.getParameter Setting maximumPoolSize to: 2147483647
[junit4:junit4]   2> 1573 T260 oashc.HttpShardHandlerFactory.getParameter Setting maxThreadIdleTime to: 5
[junit4:junit4]   2> 1573 T260 oashc.HttpShardHandlerFactory.getParameter Setting sizeOfQueue to: -1
[junit4:junit4]   2> 1574 T260 oashc.HttpShardHandlerFactory.getParameter Setting fairnessPolicy to: false
[junit4:junit4]   2> 1574 T260 oascsi.HttpClientUtil.createClient Creating new http client, config:maxConnectionsPerHost=20&maxConnections=10000&socketTimeout=0&connTimeout=0&retry=false
[junit4:junit4]   2> 1586 T260 oascc.SolrZkClient.makePath makePath: /overseer_elect/election
[junit4:junit4]   2> 1615 T266 oazs.PrepRequestProcessor.pRequest Got user-level KeeperException when processing sessionid:0x139f015dda50002 type:delete cxid:0x15 zxid:0xfffffffffffffffe txntype:unknown reqpath:n/a Error Path:/solr/overseer_elect/leader Error:KeeperErrorCode = NoNode for /solr/overseer_elect/leader
[junit4:junit4]   2> 1616 T260 oascc.SolrZkClient.makePath makePath: /overseer_elect/leader
[junit4:junit4]   2> 1620 T260 oasc.Overseer.start Overseer (id=88365644413992962-127.0.0.1:29760_solr-n_0000000000) starting
[junit4:junit4]   2> 1620 T266 oazs.PrepRequestProcessor.pRequest Got user-level KeeperException when processing sessionid:0x139f015dda50002 type:create cxid:0x1a zxid:0xfffffffffffffffe txntype:unknown reqpath:n/a Error Path:/solr/overseer Error:KeeperErrorCode = NodeExists for /solr/overseer
[junit4:junit4]   2> 1641 T266 oazs.PrepRequestProcessor.pRequest Got user-level KeeperException when processing sessionid:0x139f015dda50002 type:create cxid:0x1b zxid:0xfffffffffffffffe txntype:unknown reqpath:n/a Error Path:/solr/overseer Error:KeeperErrorCode = NodeExists for /solr/overseer
[junit4:junit4]   2> 1642 T266 oazs.PrepRequestProcessor.pRequest Got user-level KeeperException when processing sessionid:0x139f015dda50002 type:create cxid:0x1c zxid:0xfffffffffffffffe txntype:unknown reqpath:n/a Error Path:/solr/overseer Error:KeeperErrorCode = NodeExists for /solr/overseer
[junit4:junit4]   2> 1648 T266 oazs.PrepRequestProcessor.pRequest Got user-level KeeperException when processing sessionid:0x139f015dda50002 type:create cxid:0x1d zxid:0xfffffffffffffffe txntype:unknown reqpath:n/a Error Path:/solr/overseer Error:KeeperErrorCode = NodeExists for /solr/overseer
[junit4:junit4]   2> 1649 T282 oasc.OverseerCollectionProcessor.run Process current queue of collection creations
[junit4:junit4]   2> 1651 T260 oascc.SolrZkClient.makePath makePath: /clusterstate.json
[junit4:junit4]   2> 1658 T260 oascc.ZkStateReader.createClusterStateWatchersAndUpdate Updating cluster state from ZooKeeper... 
[junit4:junit4]   2> 1681 T281 oasc.Overseer$ClusterStateUpdater.run Starting to work on the main queue
[junit4:junit4]   2> 1688 T260 oasc.CoreContainer.create Creating SolrCore 'collection1' using instanceDir: /usr/home/hudson/hudson-slave/workspace/Lucene-Solr-Tests-trunk-Java6/solr/build/solr-core/test/J1/./org.apache.solr.cloud.SyncSliceTest-controljetty-1348352729198/collection1
[junit4:junit4]   2> 1688 T260 oasc.ZkController.createCollectionZkNode Check for collection zkNode:control_collection
[junit4:junit4]   2> 1689 T260 oasc.ZkController.createCollectionZkNode Collection zkNode exists
[junit4:junit4]   2> 1689 T260 oasc.ZkController.readConfigName Load collection config from:/collections/control_collection
[junit4:junit4]   2> 1691 T260 oasc.SolrResourceLoader.<init> new SolrResourceLoader for directory: '/usr/home/hudson/hudson-slave/workspace/Lucene-Solr-Tests-trunk-Java6/solr/build/solr-core/test/J1/./org.apache.solr.cloud.SyncSliceTest-controljetty-1348352729198/collection1/'
[junit4:junit4]   2> 1692 T260 oasc.SolrResourceLoader.replaceClassLoader Adding 'file:/usr/home/hudson/hudson-slave/workspace/Lucene-Solr-Tests-trunk-Java6/solr/build/solr-core/test/J1/org.apache.solr.cloud.SyncSliceTest-controljetty-1348352729198/collection1/lib/classes/' to classloader
[junit4:junit4]   2> 1693 T260 oasc.SolrResourceLoader.replaceClassLoader Adding 'file:/usr/home/hudson/hudson-slave/workspace/Lucene-Solr-Tests-trunk-Java6/solr/build/solr-core/test/J1/org.apache.solr.cloud.SyncSliceTest-controljetty-1348352729198/collection1/lib/README' to classloader
[junit4:junit4]   2> 1751 T260 oasc.SolrConfig.<init> Using Lucene MatchVersion: LUCENE_50
[junit4:junit4]   2> 1812 T260 oasc.SolrConfig.<init> Loaded SolrConfig: solrconfig.xml
[junit4:junit4]   2> 1913 T260 oass.IndexSchema.readSchema Reading Solr Schema
[junit4:junit4]   2> 1921 T260 oass.IndexSchema.readSchema Schema name=test
[junit4:junit4]   2> 2562 T260 oass.OpenExchangeRatesOrgProvider.init Initialized with rates=open-exchange-rates.json, refreshInterval=1440.
[junit4:junit4]   2> 2574 T260 oass.IndexSchema.readSchema default search field in schema is text
[junit4:junit4]   2> 2579 T260 oass.IndexSchema.readSchema unique key field: id
[junit4:junit4]   2> 2601 T260 oass.FileExchangeRateProvider.reload Reloading exchange rates from file currency.xml
[junit4:junit4]   2> 2609 T260 oass.FileExchangeRateProvider.reload Reloading exchange rates from file currency.xml
[junit4:junit4]   2> 2615 T260 oass.OpenExchangeRatesOrgProvider.reload Reloading exchange rates from open-exchange-rates.json
[junit4:junit4]   2> 2617 T260 oass.OpenExchangeRatesOrgProvider.reload Reloading exchange rates from open-exchange-rates.json
[junit4:junit4]   2> 2619 T260 oasc.SolrCore.<init> [collection1] Opening new SolrCore at /usr/home/hudson/hudson-slave/workspace/Lucene-Solr-Tests-trunk-Java6/solr/build/solr-core/test/J1/./org.apache.solr.cloud.SyncSliceTest-controljetty-1348352729198/collection1/, dataDir=./org.apache.solr.cloud.SyncSliceTest-1348352728005/control/data/
[junit4:junit4]   2> 2620 T260 oasc.JmxMonitoredMap.<init> JMX monitoring is enabled. Adding Solr mbeans to JMX Server: com.sun.jmx.mbeanserver.JmxMBeanServer@5a92668c
[junit4:junit4]   2> 2655 T260 oasc.SolrCore.getNewIndexDir WARNING New index directory detected: old=null new=./org.apache.solr.cloud.SyncSliceTest-1348352728005/control/data/index/
[junit4:junit4]   2> 2656 T260 oasc.SolrCore.initIndex WARNING [collection1] Solr index directory './org.apache.solr.cloud.SyncSliceTest-1348352728005/control/data/index' doesn't exist. Creating new index...
[junit4:junit4]   2> 2657 T260 oasc.CachingDirectoryFactory.get return new directory for /usr/home/hudson/hudson-slave/workspace/Lucene-Solr-Tests-trunk-Java6/solr/build/solr-core/test/J1/./org.apache.solr.cloud.SyncSliceTest-1348352728005/control/data/index forceNew:false
[junit4:junit4]   2> 2671 T260 oasc.SolrDeletionPolicy.onCommit SolrDeletionPolicy.onCommit: commits:num=1
[junit4:junit4]   2> 		commit{dir=/usr/home/hudson/hudson-slave/workspace/Lucene-Solr-Tests-trunk-Java6/solr/build/solr-core/test/J1/org.apache.solr.cloud.SyncSliceTest-1348352728005/control/data/index,segFN=segments_1,generation=1,filenames=[segments_1]
[junit4:junit4]   2> 2672 T260 oasc.SolrDeletionPolicy.updateCommits newest commit = 1
[junit4:junit4]   2> 2673 T260 oasc.SolrCore.initWriters created xml: solr.XMLResponseWriter
[junit4:junit4]   2> 2676 T260 oasup.UpdateRequestProcessorChain.init inserting DistributedUpdateProcessorFactory into updateRequestProcessorChain "dedupe"
[junit4:junit4]   2> 2677 T260 oasup.UpdateRequestProcessorChain.init inserting DistributedUpdateProcessorFactory into updateRequestProcessorChain "dedupe-allfields"
[junit4:junit4]   2> 2678 T260 oasup.UpdateRequestProcessorChain.init inserting DistributedUpdateProcessorFactory into updateRequestProcessorChain "stored_sig"
[junit4:junit4]   2> 2679 T260 oasup.UpdateRequestProcessorChain.init inserting DistributedUpdateProcessorFactory into updateRequestProcessorChain "uniq-fields"
[junit4:junit4]   2> 2680 T260 oasup.UpdateRequestProcessorChain.init inserting DistributedUpdateProcessorFactory into updateRequestProcessorChain "distrib-dup-test-chain-implicit"
[junit4:junit4]   2> 2681 T260 oasc.RequestHandlers.initHandlersFromConfig adding lazy requestHandler: solr.ReplicationHandler
[junit4:junit4]   2> 2682 T260 oasc.RequestHandlers.initHandlersFromConfig created /replication: solr.ReplicationHandler
[junit4:junit4]   2> 2683 T260 oasc.RequestHandlers.initHandlersFromConfig created standard: solr.StandardRequestHandler
[junit4:junit4]   2> 2684 T260 oasc.RequestHandlers.initHandlersFromConfig created /get: solr.RealTimeGetHandler
[junit4:junit4]   2> 2685 T260 oasc.RequestHandlers.initHandlersFromConfig created dismax: solr.SearchHandler
[junit4:junit4]   2> 2686 T260 oasc.RequestHandlers.initHandlersFromConfig created mock: org.apache.solr.core.MockQuerySenderListenerReqHandler
[junit4:junit4]   2> 2687 T260 oasc.RequestHandlers.initHandlersFromConfig created /admin/: org.apache.solr.handler.admin.AdminHandlers
[junit4:junit4]   2> 2688 T260 oasc.RequestHandlers.initHandlersFromConfig created defaults: solr.StandardRequestHandler
[junit4:junit4]   2> 2688 T260 oasc.RequestHandlers.initHandlersFromConfig adding lazy requestHandler: solr.StandardRequestHandler
[junit4:junit4]   2> 2689 T260 oasc.RequestHandlers.initHandlersFromConfig created lazy: solr.StandardRequestHandler
[junit4:junit4]   2> 2690 T260 oasc.RequestHandlers.initHandlersFromConfig created /update: solr.UpdateRequestHandler
[junit4:junit4]   2> 2691 T260 oasc.RequestHandlers.initHandlersFromConfig created /terms: org.apache.solr.handler.component.SearchHandler
[junit4:junit4]   2> 2692 T260 oasc.RequestHandlers.initHandlersFromConfig created spellCheckCompRH: org.apache.solr.handler.component.SearchHandler
[junit4:junit4]   2> 2693 T260 oasc.RequestHandlers.initHandlersFromConfig created spellCheckCompRH_Direct: org.apache.solr.handler.component.SearchHandler
[junit4:junit4]   2> 2694 T260 oasc.RequestHandlers.initHandlersFromConfig created spellCheckWithWordbreak: org.apache.solr.handler.component.SearchHandler
[junit4:junit4]   2> 2695 T260 oasc.RequestHandlers.initHandlersFromConfig created spellCheckWithWordbreak_Direct: org.apache.solr.handler.component.SearchHandler
[junit4:junit4]   2> 2696 T260 oasc.RequestHandlers.initHandlersFromConfig created spellCheckCompRH1: org.apache.solr.handler.component.SearchHandler
[junit4:junit4]   2> 2697 T260 oasc.RequestHandlers.initHandlersFromConfig created tvrh: org.apache.solr.handler.component.SearchHandler
[junit4:junit4]   2> 2698 T260 oasc.RequestHandlers.initHandlersFromConfig created /mlt: solr.MoreLikeThisHandler
[junit4:junit4]   2> 2699 T260 oasc.RequestHandlers.initHandlersFromConfig created /debug/dump: solr.DumpRequestHandler
[junit4:junit4]   2> 2705 T260 oashl.XMLLoader.init xsltCacheLifetimeSeconds=60
[junit4:junit4]   2> 2713 T260 oasc.SolrCore.initDeprecatedSupport WARNING solrconfig.xml uses deprecated <admin/gettableFiles>, Please update your config to use the ShowFileRequestHandler.
[junit4:junit4]   2> 2715 T260 oasc.SolrCore.initDeprecatedSupport WARNING adding ShowFileRequestHandler with hidden files: [SCHEMA.XML, OLD_SYNONYMS.TXT, STOPWORDS.TXT, PROTWORDS.TXT, OPEN-EXCHANGE-RATES.JSON, SYNONYMS.TXT, CURRENCY.XML, MAPPING-ISOLATIN1ACCENT.TXT]
[junit4:junit4]   2> 2723 T260 oass.SolrIndexSearcher.<init> Opening Searcher@51527a1e main
[junit4:junit4]   2> 2725 T260 oasu.CommitTracker.<init> Hard AutoCommit: disabled
[junit4:junit4]   2> 2726 T260 oasu.CommitTracker.<init> Soft AutoCommit: disabled
[junit4:junit4]   2> 2727 T260 oashc.SpellCheckComponent.inform Initializing spell checkers
[junit4:junit4]   2> 2744 T260 oass.DirectSolrSpellChecker.init init: {name=direct,classname=DirectSolrSpellChecker,field=lowerfilt,minQueryLength=3}
[junit4:junit4]   2> 2802 T283 oasc.SolrCore.registerSearcher [collection1] Registered new searcher Searcher@51527a1e main{StandardDirectoryReader(segments_1:1)}
[junit4:junit4]   2> 2809 T266 oazs.PrepRequestProcessor.pRequest Got user-level KeeperException when processing sessionid:0x139f015dda50002 type:create cxid:0x56 zxid:0xfffffffffffffffe txntype:unknown reqpath:n/a Error Path:/solr/overseer/queue Error:KeeperErrorCode = NoNode for /solr/overseer/queue
[junit4:junit4]   2> 2826 T260 oasc.CoreContainer.register registering core: collection1
[junit4:junit4]   2> 2827 T260 oasc.ZkController.register Register shard - core:collection1 address:http://127.0.0.1:29760/solr shardId:control_shard
[junit4:junit4]   2> 2840 T260 oascsi.HttpClientUtil.createClient Creating new http client, config:maxConnections=10000&maxConnectionsPerHost=20&connTimeout=30000&socketTimeout=30000&retry=false
[junit4:junit4]   2> 2856 T260 oascc.SolrZkClient.makePath makePath: /collections/control_collection/leader_elect/control_shard/election
[junit4:junit4]   2> 2887 T266 oazs.PrepRequestProcessor.pRequest Got user-level KeeperException when processing sessionid:0x139f015dda50002 type:delete cxid:0x65 zxid:0xfffffffffffffffe txntype:unknown reqpath:n/a Error Path:/solr/collections/control_collection/leaders Error:KeeperErrorCode = NoNode for /solr/collections/control_collection/leaders
[junit4:junit4]   2> 2888 T260 oasc.ShardLeaderElectionContext.runLeaderProcess Running the leader process.
[junit4:junit4]   2> 2889 T266 oazs.PrepRequestProcessor.pRequest Got user-level KeeperException when processing sessionid:0x139f015dda50002 type:create cxid:0x66 zxid:0xfffffffffffffffe txntype:unknown reqpath:n/a Error Path:/solr/overseer Error:KeeperErrorCode = NodeExists for /solr/overseer
[junit4:junit4]   2> 3193 T281 oascc.ZkStateReader.updateClusterState Updating cloud state from ZooKeeper... 
[junit4:junit4]   2> 3209 T266 oazs.PrepRequestProcessor.pRequest Got user-level KeeperException when processing sessionid:0x139f015dda50002 type:create cxid:0x6d zxid:0xfffffffffffffffe txntype:unknown reqpath:n/a Error Path:/solr/overseer/queue-work Error:KeeperErrorCode = NoNode for /solr/overseer/queue-work
[junit4:junit4]   2> 3285 T280 oascc.ZkStateReader$2.process A cluster state change has occurred - updating...
[junit4:junit4]   2> 3408 T260 oasc.ShardLeaderElectionContext.waitForReplicasToComeUp Enough replicas found to continue.
[junit4:junit4]   2> 3409 T260 oasc.ShardLeaderElectionContext.runLeaderProcess I may be the new leader - try and sync
[junit4:junit4]   2> 3410 T260 oasc.SyncStrategy.sync Sync replicas to http://127.0.0.1:29760/solr/collection1/
[junit4:junit4]   2> 3410 T260 oasc.SyncStrategy.syncReplicas Sync Success - now sync replicas to me
[junit4:junit4]   2> 3411 T260 oasc.SyncStrategy.syncToMe http://127.0.0.1:29760/solr/collection1/ has no replicas
[junit4:junit4]   2> 3411 T260 oasc.ShardLeaderElectionContext.runLeaderProcess I am the new leader: http://127.0.0.1:29760/solr/collection1/
[junit4:junit4]   2> 3412 T260 oascc.SolrZkClient.makePath makePath: /collections/control_collection/leaders/control_shard
[junit4:junit4]   2> 3432 T266 oazs.PrepRequestProcessor.pRequest Got user-level KeeperException when processing sessionid:0x139f015dda50002 type:create cxid:0x8b zxid:0xfffffffffffffffe txntype:unknown reqpath:n/a Error Path:/solr/overseer Error:KeeperErrorCode = NodeExists for /solr/overseer
[junit4:junit4]   2> 3821 T281 oascc.ZkStateReader.updateClusterState Updating cloud state from ZooKeeper... 
[junit4:junit4]   2> 3840 T280 oascc.ZkStateReader$2.process A cluster state change has occurred - updating...
[junit4:junit4]   2> 3856 T260 oasc.ZkController.register We are http://127.0.0.1:29760/solr/collection1/ and leader is http://127.0.0.1:29760/solr/collection1/
[junit4:junit4]   2> 3856 T260 oasc.ZkController.register No LogReplay needed for core=collection1 baseURL=http://127.0.0.1:29760/solr
[junit4:junit4]   2> 3857 T260 oasc.ZkController.checkRecovery I am the leader, no recovery necessary
[junit4:junit4]   2> 3860 T260 oascc.ZkStateReader.updateClusterState Updating cloud state from ZooKeeper... 
[junit4:junit4]   2> 3861 T260 oass.SolrDispatchFilter.init user.dir=/usr/home/hudson/hudson-slave/workspace/Lucene-Solr-Tests-trunk-Java6/solr/build/solr-core/test/J1
[junit4:junit4]   2> 3861 T260 oass.SolrDispatchFilter.init SolrDispatchFilter.init() done
[junit4:junit4]   2> 3862 T260 oascsi.HttpClientUtil.createClient Creating new http client, config:maxConnections=128&maxConnectionsPerHost=32&followRedirects=false
[junit4:junit4]   2> 4032 T260 oejs.Server.doStart jetty-8.1.2.v20120308
[junit4:junit4]   2> 4034 T260 oejs.AbstractConnector.doStart Started SocketConnector@0.0.0.0:29763
[junit4:junit4]   2> 4035 T260 oasc.SolrResourceLoader.locateSolrHome JNDI not configured for solr (NoInitialContextEx)
[junit4:junit4]   2> 4035 T260 oasc.SolrResourceLoader.locateSolrHome using system property solr.solr.home: /usr/home/hudson/hudson-slave/workspace/Lucene-Solr-Tests-trunk-Java6/solr/build/solr-core/test/J1/./org.apache.solr.cloud.SyncSliceTest-jetty1-1348352731873
[junit4:junit4]   2> 4036 T260 oasc.SolrResourceLoader.<init> new SolrResourceLoader for deduced Solr Home: '/usr/home/hudson/hudson-slave/workspace/Lucene-Solr-Tests-trunk-Java6/solr/build/solr-core/test/J1/./org.apache.solr.cloud.SyncSliceTest-jetty1-1348352731873/'
[junit4:junit4]   2> 4079 T260 oass.SolrDispatchFilter.init SolrDispatchFilter.init()
[junit4:junit4]   2> 4080 T260 oasc.SolrResourceLoader.locateSolrHome JNDI not configured for solr (NoInitialContextEx)
[junit4:junit4]   2> 4080 T260 oasc.SolrResourceLoader.locateSolrHome using system property solr.solr.home: /usr/home/hudson/hudson-slave/workspace/Lucene-Solr-Tests-trunk-Java6/solr/build/solr-core/test/J1/./org.apache.solr.cloud.SyncSliceTest-jetty1-1348352731873
[junit4:junit4]   2> 4080 T260 oasc.CoreContainer$Initializer.initialize looking for solr.xml: /usr/home/hudson/hudson-slave/workspace/Lucene-Solr-Tests-trunk-Java6/solr/build/solr-core/test/J1/./org.apache.solr.cloud.SyncSliceTest-jetty1-1348352731873/solr.xml
[junit4:junit4]   2> 4081 T260 oasc.CoreContainer.<init> New CoreContainer 1966818831
[junit4:junit4]   2> 4081 T260 oasc.CoreContainer.load Loading CoreContainer using Solr Home: '/usr/home/hudson/hudson-slave/workspace/Lucene-Solr-Tests-trunk-Java6/solr/build/solr-core/test/J1/./org.apache.solr.cloud.SyncSliceTest-jetty1-1348352731873/'
[junit4:junit4]   2> 4082 T260 oasc.SolrResourceLoader.<init> new SolrResourceLoader for directory: '/usr/home/hudson/hudson-slave/workspace/Lucene-Solr-Tests-trunk-Java6/solr/build/solr-core/test/J1/./org.apache.solr.cloud.SyncSliceTest-jetty1-1348352731873/'
[junit4:junit4]   2> 4106 T260 oasc.CoreContainer.load Registering Log Listener
[junit4:junit4]   2> 4120 T260 oasc.CoreContainer.initZooKeeper Zookeeper client=127.0.0.1:29756/solr
[junit4:junit4]   2> 4121 T260 oaz.ZooKeeper.<init> Initiating client connection, connectString=127.0.0.1:29756/solr sessionTimeout=5000 watcher=org.apache.solr.common.cloud.ConnectionManager@5aa1f7f5
[junit4:junit4]   2> 4122 T293 oaz.ClientCnxn$SendThread.startConnect Opening socket connection to server /127.0.0.1:29756
[junit4:junit4]   2> 4122 T260 oascc.ConnectionManager.waitForConnected Waiting for client to connect to ZooKeeper
[junit4:junit4]   2> 4123 T293 oaz.ClientCnxn$SendThread.primeConnection Socket connection established to localhost/127.0.0.1:29756, initiating session
[junit4:junit4]   2> 4124 T262 oazs.NIOServerCnxn$Factory.run Accepted socket connection from /140.211.11.196:29765
[junit4:junit4]   2> 4124 T262 oazs.NIOServerCnxn.readConnectRequest Client attempting to establish new session at /140.211.11.196:29765
[junit4:junit4]   2> 4128 T264 oazs.NIOServerCnxn.finishSessionInit Established session 0x139f015dda50003 with negotiated timeout 5000 for client /140.211.11.196:29765
[junit4:junit4]   2> 4129 T293 oaz.ClientCnxn$SendThread.readConnectResult Session establishment complete on server localhost/127.0.0.1:29756, sessionid = 0x139f015dda50003, negotiated timeout = 5000
[junit4:junit4]   2> 4129 T294 oascc.ConnectionManager.process Watcher org.apache.solr.common.cloud.ConnectionManager@5aa1f7f5 name:ZooKeeperConnection Watcher:127.0.0.1:29756/solr got event WatchedEvent state:SyncConnected type:None path:null path:null type:None
[junit4:junit4]   2> 4129 T260 oascc.ConnectionManager.waitForConnected Client is connected to ZooKeeper
[junit4:junit4]   2> 4130 T266 oazs.PrepRequestProcessor.pRequest Got user-level KeeperException when processing sessionid:0x139f015dda50003 type:create cxid:0x1 zxid:0xfffffffffffffffe txntype:unknown reqpath:n/a Error Path:/solr/overseer Error:KeeperErrorCode = NodeExists for /solr/overseer
[junit4:junit4]   2> 4137 T266 oazs.PrepRequestProcessor.pRequest Got user-level KeeperException when processing sessionid:0x139f015dda50003 type:create cxid:0x2 zxid:0xfffffffffffffffe txntype:unknown reqpath:n/a Error Path:/solr/overseer Error:KeeperErrorCode = NodeExists for /solr/overseer
[junit4:junit4]   2> 4145 T260 oasc.ZkController.createEphemeralLiveNode Register node as live in ZooKeeper:/live_nodes/127.0.0.1:29763_solr
[junit4:junit4]   2> 4146 T266 oazs.PrepRequestProcessor.pRequest Got user-level KeeperException when processing sessionid:0x139f015dda50003 type:delete cxid:0x4 zxid:0xfffffffffffffffe txntype:unknown reqpath:n/a Error Path:/solr/live_nodes/127.0.0.1:29763_solr Error:KeeperErrorCode = NoNode for /solr/live_nodes/127.0.0.1:29763_solr
[junit4:junit4]   2> 4153 T260 oascc.SolrZkClient.makePath makePath: /live_nodes/127.0.0.1:29763_solr
[junit4:junit4]   2> 4164 T280 oascc.ZkStateReader$3.process Updating live nodes
[junit4:junit4]   2> 4165 T260 oashc.HttpShardHandlerFactory.getParameter Setting socketTimeout to: 0
[junit4:junit4]   2> 4166 T260 oashc.HttpShardHandlerFactory.getParameter Setting urlScheme to: http://
[junit4:junit4]   2> 4166 T260 oashc.HttpShardHandlerFactory.getParameter Setting connTimeout to: 0
[junit4:junit4]   2> 4167 T260 oashc.HttpShardHandlerFactory.getParameter Setting maxConnectionsPerHost to: 20
[junit4:junit4]   2> 4167 T260 oashc.HttpShardHandlerFactory.getParameter Setting corePoolSize to: 0
[junit4:junit4]   2> 4167 T260 oashc.HttpShardHandlerFactory.getParameter Setting maximumPoolSize to: 2147483647
[junit4:junit4]   2> 4168 T260 oashc.HttpShardHandlerFactory.getParameter Setting maxThreadIdleTime to: 5
[junit4:junit4]   2> 4168 T260 oashc.HttpShardHandlerFactory.getParameter Setting sizeOfQueue to: -1
[junit4:junit4]   2> 4169 T260 oashc.HttpShardHandlerFactory.getParameter Setting fairnessPolicy to: false
[junit4:junit4]   2> 4169 T260 oascsi.HttpClientUtil.createClient Creating new http client, config:maxConnectionsPerHost=20&maxConnections=10000&socketTimeout=0&connTimeout=0&retry=false
[junit4:junit4]   2> 4194 T260 oascc.ZkStateReader.createClusterStateWatchersAndUpdate Updating cluster state from ZooKeeper... 
[junit4:junit4]   2> 4201 T260 oasc.CoreContainer.create Creating SolrCore 'collection1' using instanceDir: /usr/home/hudson/hudson-slave/workspace/Lucene-Solr-Tests-trunk-Java6/solr/build/solr-core/test/J1/./org.apache.solr.cloud.SyncSliceTest-jetty1-1348352731873/collection1
[junit4:junit4]   2> 4202 T260 oasc.ZkController.createCollectionZkNode Check for collection zkNode:collection1
[junit4:junit4]   2> 4203 T260 oasc.ZkController.createCollectionZkNode Collection zkNode exists
[junit4:junit4]   2> 4203 T260 oasc.ZkController.readConfigName Load collection config from:/collections/collection1
[junit4:junit4]   2> 4205 T260 oasc.SolrResourceLoader.<init> new SolrResourceLoader for directory: '/usr/home/hudson/hudson-slave/workspace/Lucene-Solr-Tests-trunk-Java6/solr/build/solr-core/test/J1/./org.apache.solr.cloud.SyncSliceTest-jetty1-1348352731873/collection1/'
[junit4:junit4]   2> 4207 T260 oasc.SolrResourceLoader.replaceClassLoader Adding 'file:/usr/home/hudson/hudson-slave/workspace/Lucene-Solr-Tests-trunk-Java6/solr/build/solr-core/test/J1/org.apache.solr.cloud.SyncSliceTest-jetty1-1348352731873/collection1/lib/README' to classloader
[junit4:junit4]   2> 4208 T260 oasc.SolrResourceLoader.replaceClassLoader Adding 'file:/usr/home/hudson/hudson-slave/workspace/Lucene-Solr-Tests-trunk-Java6/solr/build/solr-core/test/J1/org.apache.solr.cloud.SyncSliceTest-jetty1-1348352731873/collection1/lib/classes/' to classloader
[junit4:junit4]   2> 4261 T260 oasc.SolrConfig.<init> Using Lucene MatchVersion: LUCENE_50
[junit4:junit4]   2> 4333 T260 oasc.SolrConfig.<init> Loaded SolrConfig: solrconfig.xml
[junit4:junit4]   2> 4346 T281 oascc.ZkStateReader.updateClusterState Updating cloud state from ZooKeeper... 
[junit4:junit4]   2> 4359 T280 oascc.ZkStateReader$2.process A cluster state change has occurred - updating...
[junit4:junit4]   2> 4434 T294 oascc.ZkStateReader$2.process A cluster state change has occurred - updating...
[junit4:junit4]   2> 4434 T260 oass.IndexSchema.readSchema Reading Solr Schema
[junit4:junit4]   2> 4443 T260 oass.IndexSchema.readSchema Schema name=test
[junit4:junit4]   2> 5082 T260 oass.OpenExchangeRatesOrgProvider.init Initialized with rates=open-exchange-rates.json, refreshInterval=1440.
[junit4:junit4]   2> 5095 T260 oass.IndexSchema.readSchema default search field in schema is text
[junit4:junit4]   2> 5099 T260 oass.IndexSchema.readSchema unique key field: id
[junit4:junit4]   2> 5119 T260 oass.FileExchangeRateProvider.reload Reloading exchange rates from file currency.xml
[junit4:junit4]   2> 5125 T260 oass.FileExchangeRateProvider.reload Reloading exchange rates from file currency.xml
[junit4:junit4]   2> 5130 T260 oass.OpenExchangeRatesOrgProvider.reload Reloading exchange rates from open-exchange-rates.json
[junit4:junit4]   2> 5132 T260 oass.OpenExchangeRatesOrgProvider.reload Reloading exchange rates from open-exchange-rates.json
[junit4:junit4]   2> 5134 T260 oasc.SolrCore.<init> [collection1] Opening new SolrCore at /usr/home/hudson/hudson-slave/workspace/Lucene-Solr-Tests-trunk-Java6/solr/build/solr-core/test/J1/./org.apache.solr.cloud.SyncSliceTest-jetty1-1348352731873/collection1/, dataDir=./org.apache.solr.cloud.SyncSliceTest-1348352728005/jetty1/
[junit4:junit4]   2> 5134 T260 oasc.JmxMonitoredMap.<init> JMX monitoring is enabled. Adding Solr mbeans to JMX Server: com.sun.jmx.mbeanserver.JmxMBeanServer@5a92668c
[junit4:junit4]   2> 5136 T260 oasc.SolrCore.getNewIndexDir WARNING New index directory detected: old=null new=./org.apache.solr.cloud.SyncSliceTest-1348352728005/jetty1/index/
[junit4:junit4]   2> 5137 T260 oasc.SolrCore.initIndex WARNING [collection1] Solr index directory './org.apache.solr.cloud.SyncSliceTest-1348352728005/jetty1/index' doesn't exist. Creating new index...
[junit4:junit4]   2> 5137 T260 oasc.CachingDirectoryFactory.get return new directory for /usr/home/hudson/hudson-slave/workspace/Lucene-Solr-Tests-trunk-Java6/solr/build/solr-core/test/J1/./org.apache.solr.cloud.SyncSliceTest-1348352728005/jetty1/index forceNew:false
[junit4:junit4]   2> 5152 T260 oasc.SolrDeletionPolicy.onCommit SolrDeletionPolicy.onCommit: commits:num=1
[junit4:junit4]   2> 		commit{dir=/usr/home/hudson/hudson-slave/workspace/Lucene-Solr-Tests-trunk-Java6/solr/build/solr-core/test/J1/org.apache.solr.cloud.SyncSliceTest-1348352728005/jetty1/index,segFN=segments_1,generation=1,filenames=[segments_1]
[junit4:junit4]   2> 5152 T260 oasc.SolrDeletionPolicy.updateCommits newest commit = 1
[junit4:junit4]   2> 5153 T260 oasc.SolrCore.initWriters created xml: solr.XMLResponseWriter
[junit4:junit4]   2> 5155 T260 oasup.UpdateRequestProcessorChain.init inserting DistributedUpdateProcessorFactory into updateRequestProcessorChain "dedupe"
[junit4:junit4]   2> 5156 T260 oasup.UpdateRequestProcessorChain.init inserting DistributedUpdateProcessorFactory into updateRequestProcessorChain "dedupe-allfields"
[junit4:junit4]   2> 5156 T260 oasup.UpdateRequestProcessorChain.init inserting DistributedUpdateProcessorFactory into updateRequestProcessorChain "stored_sig"
[junit4:junit4]   2> 5157 T260 oasup.UpdateRequestProcessorChain.init inserting DistributedUpdateProcessorFactory into updateRequestProcessorChain "uniq-fields"
[junit4:junit4]   2> 5158 T260 oasup.UpdateRequestProcessorChain.init inserting DistributedUpdateProcessorFactory into updateRequestProcessorChain "distrib-dup-test-chain-implicit"
[junit4:junit4]   2> 5158 T260 oasc.RequestHandlers.initHandlersFromConfig adding lazy requestHandler: solr.ReplicationHandler
[junit4:junit4]   2> 5159 T260 oasc.RequestHandlers.initHandlersFromConfig created /replication: solr.ReplicationHandler
[junit4:junit4]   2> 5160 T260 oasc.RequestHandlers.initHandlersFromConfig created standard: solr.StandardRequestHandler
[junit4:junit4]   2> 5161 T260 oasc.RequestHandlers.initHandlersFromConfig created /get: solr.RealTimeGetHandler
[junit4:junit4]   2> 5161 T260 oasc.RequestHandlers.initHandlersFromConfig created dismax: solr.SearchHandler
[junit4:junit4]   2> 5162 T260 oasc.RequestHandlers.initHandlersFromConfig created mock: org.apache.solr.core.MockQuerySenderListenerReqHandler
[junit4:junit4]   2> 5163 T260 oasc.RequestHandlers.initHandlersFromConfig created /admin/: org.apache.solr.handler.admin.AdminHandlers
[junit4:junit4]   2> 5164 T260 oasc.RequestHandlers.initHandlersFromConfig created defaults: solr.StandardRequestHandler
[junit4:junit4]   2> 5164 T260 oasc.RequestHandlers.initHandlersFromConfig adding lazy requestHandler: solr.StandardRequestHandler
[junit4:junit4]   2> 5165 T260 oasc.RequestHandlers.initHandlersFromConfig created lazy: solr.StandardRequestHandler
[junit4:junit4]   2> 5165 T260 oasc.RequestHandlers.initHandlersFromConfig created /update: solr.UpdateRequestHandler
[junit4:junit4]   2> 5166 T260 oasc.RequestHandlers.initHandlersFromConfig created /terms: org.apache.solr.handler.component.SearchHandler
[junit4:junit4]   2> 5167 T260 oasc.RequestHandlers.initHandlersFromConfig created spellCheckCompRH: org.apache.solr.handler.component.SearchHandler
[junit4:junit4]   2> 5168 T260 oasc.RequestHandlers.initHandlersFromConfig created spellCheckCompRH_Direct: org.apache.solr.handler.component.SearchHandler
[junit4:junit4]   2> 5168 T260 oasc.RequestHandlers.initHandlersFromConfig created spellCheckWithWordbreak: org.apache.solr.handler.component.SearchHandler
[junit4:junit4]   2> 5169 T260 oasc.RequestHandlers.initHandlersFromConfig created spellCheckWithWordbreak_Direct: org.apache.solr.handler.component.SearchHandler
[junit4:junit4]   2> 5170 T260 oasc.RequestHandlers.initHandlersFromConfig created spellCheckCompRH1: org.apache.solr.handler.component.SearchHandler
[junit4:junit4]   2> 5171 T260 oasc.RequestHandlers.initHandlersFromConfig created tvrh: org.apache.solr.handler.component.SearchHandler
[junit4:junit4]   2> 5171 T260 oasc.RequestHandlers.initHandlersFromConfig created /mlt: solr.MoreLikeThisHandler
[junit4:junit4]   2> 5172 T260 oasc.RequestHandlers.initHandlersFromConfig created /debug/dump: solr.DumpRequestHandler
[junit4:junit4]   2> 5176 T260 oashl.XMLLoader.init xsltCacheLifetimeSeconds=60
[junit4:junit4]   2> 5180 T260 oasc.SolrCore.initDeprecatedSupport WARNING solrconfig.xml uses deprecated <admin/gettableFiles>, Please update your config to use the ShowFileRequestHandler.
[junit4:junit4]   2> 5182 T260 oasc.SolrCore.initDeprecatedSupport WARNING adding ShowFileRequestHandler with hidden files: [SCHEMA.XML, OLD_SYNONYMS.TXT, STOPWORDS.TXT, PROTWORDS.TXT, OPEN-EXCHANGE-RATES.JSON, SYNONYMS.TXT, CURRENCY.XML, MAPPING-ISOLATIN1ACCENT.TXT]
[junit4:junit4]   2> 5186 T260 oass.SolrIndexSearcher.<init> Opening Searcher@65a09e0b main
[junit4:junit4]   2> 5187 T260 oasu.CommitTracker.<init> Hard AutoCommit: disabled
[junit4:junit4]   2> 5188 T260 oasu.CommitTracker.<init> Soft AutoCommit: disabled
[junit4:junit4]   2> 5189 T260 oashc.SpellCheckComponent.inform Initializing spell checkers
[junit4:junit4]   2> 5209 T260 oass.DirectSolrSpellChecker.init init: {name=direct,classname=DirectSolrSpellChecker,field=lowerfilt,minQueryLength=3}
[junit4:junit4]   2> 5269 T295 oasc.SolrCore.registerSearcher [collection1] Registered new searcher Searcher@65a09e0b main{StandardDirectoryReader(segments_1:1)}
[junit4:junit4]   2> 5374 T281 oascc.ZkStateReader.updateClusterState Updating cloud state from ZooKeeper... 
[junit4:junit4]   2> 5397 T280 oascc.ZkStateReader$2.process A cluster state change has occurred - updating...
[junit4:junit4]   2> 5397 T294 oascc.ZkStateReader$2.process A cluster state change has occurred - updating...
[junit4:junit4]   2> 5777 T260 oasc.CoreContainer.register registering core: collection1
[junit4:junit4]   2> 5777 T260 oasc.ZkController.register Register shard - core:collection1 address:http://127.0.0.1:29763/solr shardId:shard1
[junit4:junit4]   2> 5779 T260 oascc.SolrZkClient.makePath makePath: /collections/collection1/leader_elect/shard1/election
[junit4:junit4]   2> 5963 T266 oazs.PrepRequestProcessor.pRequest Got user-level KeeperException when processing sessionid:0x139f015dda50003 type:delete cxid:0x43 zxid:0xfffffffffffffffe txntype:unknown reqpath:n/a Error Path:/solr/collections/collection1/leaders Error:KeeperErrorCode = NoNode for /solr/collections/collection1/leaders
[junit4:junit4]   2> 5997 T260 oasc.ShardLeaderElectionContext.runLeaderProcess Running the leader process.
[junit4:junit4]   2> 5997 T266 oazs.PrepRequestProcessor.pRequest Got user-level KeeperException when processing sessionid:0x139f015dda50003 type:create cxid:0x44 zxid:0xfffffffffffffffe txntype:unknown reqpath:n/a Error Path:/solr/overseer Error:KeeperErrorCode = NodeExists for /solr/overseer
[junit4:junit4]   2> 6001 T260 oasc.ShardLeaderElectionContext.waitForReplicasToComeUp Enough replicas found to continue.
[junit4:junit4]   2> 6001 T260 oasc.ShardLeaderElectionContext.runLeaderProcess I may be the new leader - try and sync
[junit4:junit4]   2> 6002 T260 oasc.SyncStrategy.sync Sync replicas to http://127.0.0.1:29763/solr/collection1/
[junit4:junit4]   2> 6002 T260 oasc.SyncStrategy.syncReplicas Sync Success - now sync replicas to me
[junit4:junit4]   2> 6003 T260 oasc.SyncStrategy.syncToMe http://127.0.0.1:29763/solr/collection1/ has no replicas
[junit4:junit4]   2> 6003 T260 oasc.ShardLeaderElectionContext.runLeaderProcess I am the new leader: http://127.0.0.1:29763/solr/collection1/
[junit4:junit4]   2> 6003 T260 oascc.SolrZkClient.makePath makePath: /collections/collection1/leaders/shard1
[junit4:junit4]   2> 6015 T266 oazs.PrepRequestProcessor.pRequest Got user-level KeeperException when processing sessionid:0x139f015dda50003 type:create cxid:0x4e zxid:0xfffffffffffffffe txntype:unknown reqpath:n/a Error Path:/solr/overseer Error:KeeperErrorCode = NodeExists for /solr/overseer
[junit4:junit4]   2> 6465 T281 oascc.ZkStateReader.updateClusterState Updating cloud state from ZooKeeper... 
[junit4:junit4]   2> 6501 T280 oascc.ZkStateReader$2.process A cluster state change has occurred - updating...
[junit4:junit4]   2> 6501 T294 oascc.ZkStateReader$2.process A cluster state change has occurred - updating...
[junit4:junit4]   2> 6527 T260 oasc.ZkController.register We are http://127.0.0.1:29763/solr/collection1/ and leader is http://127.0.0.1:29763/solr/collection1/
[junit4:junit4]   2> 6527 T260 oasc.ZkController.register No LogReplay needed for core=collection1 baseURL=http://127.0.0.1:29763/solr
[junit4:junit4]   2> 6528 T260 oasc.ZkController.checkRecovery I am the leader, no recovery necessary
[junit4:junit4]   2> 6530 T260 oascc.ZkStateReader.updateClusterState Updating cloud state from ZooKeeper... 
[junit4:junit4]   2> 6531 T260 oass.SolrDispatchFilter.init user.dir=/usr/home/hudson/hudson-slave/workspace/Lucene-Solr-Tests-trunk-Java6/solr/build/solr-core/test/J1
[junit4:junit4]   2> 6532 T260 oass.SolrDispatchFilter.init SolrDispatchFilter.init() done
[junit4:junit4]   2> 6532 T260 oascsi.HttpClientUtil.createClient Creating new http client, config:maxConnections=128&maxConnectionsPerHost=32&followRedirects=false
[junit4:junit4]   2> 6712 T260 oejs.Server.doStart jetty-8.1.2.v20120308
[junit4:junit4]   2> 6715 T260 oejs.AbstractConnector.doStart Started SocketConnector@0.0.0.0:29766
[junit4:junit4]   2> 6715 T260 oasc.SolrResourceLoader.locateSolrHome JNDI not configured for solr (NoInitialContextEx)
[junit4:junit4]   2> 6716 T260 oasc.SolrResourceLoader.locateSolrHome using system property solr.solr.home: /usr/home/hudson/hudson-slave/workspace/Lucene-Solr-Tests-trunk-Java6/solr/build/solr-core/test/J1/./org.apache.solr.cloud.SyncSliceTest-jetty2-1348352734548
[junit4:junit4]   2> 6716 T260 oasc.SolrResourceLoader.<init> new SolrResourceLoader for deduced Solr Home: '/usr/home/hudson/hudson-slave/workspace/Lucene-Solr-Tests-trunk-Java6/solr/build/solr-core/test/J1/./org.apache.solr.cloud.SyncSliceTest-jetty2-1348352734548/'
[junit4:junit4]   2> 6751 T260 oass.SolrDispatchFilter.init SolrDispatchFilter.init()
[junit4:junit4]   2> 6752 T260 oasc.SolrResourceLoader.locateSolrHome JNDI not configured for solr (NoInitialContextEx)
[junit4:junit4]   2> 6752 T260 oasc.SolrResourceLoader.locateSolrHome using system property solr.solr.home: /usr/home/hudson/hudson-slave/workspace/Lucene-Solr-Tests-trunk-Java6/solr/build/solr-core/test/J1/./org.apache.solr.cloud.SyncSliceTest-jetty2-1348352734548
[junit4:junit4]   2> 6753 T260 oasc.CoreContainer$Initializer.initialize looking for solr.xml: /usr/home/hudson/hudson-slave/workspace/Lucene-Solr-Tests-trunk-Java6/solr/build/solr-core/test/J1/./org.apache.solr.cloud.SyncSliceTest-jetty2-1348352734548/solr.xml
[junit4:junit4]   2> 6753 T260 oasc.CoreContainer.<init> New CoreContainer 1170890362
[junit4:junit4]   2> 6754 T260 oasc.CoreContainer.load Loading CoreContainer using Solr Home: '/usr/home/hudson/hudson-slave/workspace/Lucene-Solr-Tests-trunk-Java6/solr/build/solr-core/test/J1/./org.apache.solr.cloud.SyncSliceTest-jetty2-1348352734548/'
[junit4:junit4]   2> 6754 T260 oasc.SolrResourceLoader.<init> new SolrResourceLoader for directory: '/usr/home/hudson/hudson-slave/workspace/Lucene-Solr-Tests-trunk-Java6/solr/build/solr-core/test/J1/./org.apache.solr.cloud.SyncSliceTest-jetty2-1348352734548/'
[junit4:junit4]   2> 6778 T260 oasc.CoreContainer.load Registering Log Listener
[junit4:junit4]   2> 6794 T260 oasc.CoreContainer.initZooKeeper Zookeeper client=127.0.0.1:29756/solr
[junit4:junit4]   2> 6795 T260 oaz.ZooKeeper.<init> Initiating client connection, connectString=127.0.0.1:29756/solr sessionTimeout=5000 watcher=org.apache.solr.common.cloud.ConnectionManager@3014af22
[junit4:junit4]   2> 6796 T305 oaz.ClientCnxn$SendThread.startConnect Opening socket connection to server /127.0.0.1:29756
[junit4:junit4]   2> 6796 T260 oascc.ConnectionManager.waitForConnected Waiting for client to connect to ZooKeeper
[junit4:junit4]   2> 6797 T305 oaz.ClientCnxn$SendThread.primeConnection Socket connection established to localhost/127.0.0.1:29756, initiating session
[junit4:junit4]   2> 6797 T262 oazs.NIOServerCnxn$Factory.run Accepted socket connection from /140.211.11.196:29767
[junit4:junit4]   2> 6798 T262 oazs.NIOServerCnxn.readConnectRequest Client attempting to establish new session at /140.211.11.196:29767
[junit4:junit4]   2> 6809 T264 oazs.NIOServerCnxn.finishSessionInit Established session 0x139f015dda50004 with negotiated timeout 5000 for client /140.211.11.196:29767
[junit4:junit4]   2> 6809 T305 oaz.ClientCnxn$SendThread.readConnectResult Session establishment complete on server localhost/127.0.0.1:29756, sessionid = 0x139f015dda50004, negotiated timeout = 5000
[junit4:junit4]   2> 6809 T306 oascc.ConnectionManager.process Watcher org.apache.solr.common.cloud.ConnectionManager@3014af22 name:ZooKeeperConnection Watcher:127.0.0.1:29756/solr got event WatchedEvent state:SyncConnected type:None path:null path:null type:None
[junit4:junit4]   2> 6809 T260 oascc.ConnectionManager.waitForConnected Client is connected to ZooKeeper
[junit4:junit4]   2> 6810 T266 oazs.PrepRequestProcessor.pRequest Got user-level KeeperException when processing sessionid:0x139f015dda50004 type:create cxid:0x1 zxid:0xfffffffffffffffe txntype:unknown reqpath:n/a Error Path:/solr/overseer Error:KeeperErrorCode = NodeExists for /solr/overseer
[junit4:junit4]   2> 6819 T266 oazs.PrepRequestProcessor.pRequest Got user-level KeeperException when processing sessionid:0x139f015dda50004 type:create cxid:0x2 zxid:0xfffffffffffffffe txntype:unknown reqpath:n/a Error Path:/solr/overseer Error:KeeperErrorCode = NodeExists for /solr/overseer
[junit4:junit4]   2> 6821 T260 oasc.ZkController.createEphemeralLiveNode Register node as live in ZooKeeper:/live_nodes/127.0.0.1:29766_solr
[junit4:junit4]   2> 6822 T266 oazs.PrepRequestProcessor.pRequest Got user-level KeeperException when processing sessionid:0x139f015dda50004 type:delete cxid:0x4 zxid:0xfffffffffffffffe txntype:unknown reqpath:n/a Error Path:/solr/live_nodes/127.0.0.1:29766_solr Error:KeeperErrorCode = NoNode for /solr/live_nodes/127.0.0.1:29766_solr
[junit4:junit4]   2> 6827 T260 oascc.SolrZkClient.makePath makePath: /live_nodes/127.0.0.1:29766_solr
[junit4:junit4]   2> 6829 T294 oascc.ZkStateReader$3.process Updating live nodes
[junit4:junit4]   2> 6829 T280 oascc.ZkStateReader$3.process Updating live nodes
[junit4:junit4]   2> 6831 T260 oashc.HttpShardHandlerFactory.getParameter Setting socketTimeout to: 0
[junit4:junit4]   2> 6831 T260 oashc.HttpShardHandlerFactory.getParameter Setting urlScheme to: http://
[junit4:junit4]   2> 6832 T260 oashc.HttpShardHandlerFactory.getParameter Setting connTimeout to: 0
[junit4:junit4]   2> 6832 T260 oashc.HttpShardHandlerFactory.getParameter Setting maxConnectionsPerHost to: 20
[junit4:junit4]   2> 6832 T260 oashc.HttpShardHandlerFactory.getParameter Setting corePoolSize to: 0
[junit4:junit4]   2> 6833 T260 oashc.HttpShardHandlerFactory.getParameter Setting maximumPoolSize to: 2147483647
[junit4:junit4]   2> 6833 T260 oashc.HttpShardHandlerFactory.getParameter Setting maxThreadIdleTime to: 5
[junit4:junit4]   2> 6834 T260 oashc.HttpShardHandlerFactory.getParameter Setting sizeOfQueue to: -1
[junit4:junit4]   2> 6834 T260 oashc.HttpShardHandlerFactory.getParameter Setting fairnessPolicy to: false
[junit4:junit4]   2> 6835 T260 oascsi.HttpClientUtil.createClient Creating new http client, config:maxConnectionsPerHost=20&maxConnections=10000&socketTimeout=0&connTimeout=0&retry=false
[junit4:junit4]   2> 6855 T260 oascc.ZkStateReader.createClusterStateWatchersAndUpdate Updating cluster state from ZooKeeper... 
[junit4:junit4]   2> 6863 T260 oasc.CoreContainer.create Creating SolrCore 'collection1' using instanceDir: /usr/home/hudson/hudson-slave/workspace/Lucene-Solr-Tests-trunk-Java6/solr/build/solr-core/test/J1/./org.apache.solr.cloud.SyncSliceTest-jetty2-1348352734548/collection1
[junit4:junit4]   2> 6863 T260 oasc.ZkController.createCollectionZkNode Check for collection zkNode:collection1
[junit4:junit4]   2> 6864 T260 oasc.ZkController.createCollectionZkNode Collection zkNode exists
[junit4:junit4]   2> 6864 T260 oasc.ZkController.readConfigName Load collection config from:/collections/collection1
[junit4:junit4]   2> 6866 T260 oasc.SolrResourceLoader.<init> new SolrResourceLoader for directory: '/usr/home/hudson/hudson-slave/workspace/Lucene-Solr-Tests-trunk-Java6/solr/build/solr-core/test/J1/./org.apache.solr.cloud.SyncSliceTest-jetty2-1348352734548/collection1/'
[junit4:junit4]   2> 6868 T260 oasc.SolrResourceLoader.replaceClassLoader Adding 'file:/usr/home/hudson/hudson-slave/workspace/Lucene-Solr-Tests-trunk-Java6/solr/build/solr-core/test/J1/org.apache.solr.cloud.SyncSliceTest-jetty2-1348352734548/collection1/lib/classes/' to classloader
[junit4:junit4]   2> 6869 T260 oasc.SolrResourceLoader.replaceClassLoader Adding 'file:/usr/home/hudson/hudson-slave/workspace/Lucene-Solr-Tests-trunk-Java6/solr/build/solr-core/test/J1/org.apache.solr.cloud.SyncSliceTest-jetty2-1348352734548/collection1/lib/README' to classloader
[junit4:junit4]   2> 6923 T260 oasc.SolrConfig.<init> Using Lucene MatchVersion: LUCENE_50
[junit4:junit4]   2> 7004 T260 oasc.SolrConfig.<init> Loaded SolrConfig: solrconfig.xml
[junit4:junit4]   2> 7020 T281 oascc.ZkStateReader.updateClusterState Updating cloud state from ZooKeeper... 
[junit4:junit4]   2> 7047 T280 oascc.ZkStateReader$2.process A cluster state change has occurred - updating...
[junit4:junit4]   2> 7047 T294 oascc.ZkStateReader$2.process A cluster state change has occurred - updating...
[junit4:junit4]   2> 7105 T306 oascc.ZkStateReader$2.process A cluster state change has occurred - updating...
[junit4:junit4]   2> 7105 T260 oass.IndexSchema.readSchema Reading Solr Schema
[junit4:junit4]   2> 7114 T260 oass.IndexSchema.readSchema Schema name=test
[junit4:junit4]   2> 7732 T260 oass.OpenExchangeRatesOrgProvider.init Initialized with rates=open-exchange-rates.json, refreshInterval=1440.
[junit4:junit4]   2> 7744 T260 oass.IndexSchema.readSchema default search field in schema is text
[junit4:junit4]   2> 7747 T260 oass.IndexSchema.readSchema unique key field: id
[junit4:junit4]   2> 7763 T260 oass.FileExchangeRateProvider.reload Reloading exchange rates from file currency.xml
[junit4:junit4]   2> 7767 T260 oass.FileExchangeRateProvider.reload Reloading exchange rates from file currency.xml
[junit4:junit4]   2> 7771 T260 oass.OpenExchangeRatesOrgProvider.reload Reloading exchange rates from open-exchange-rates.json
[junit4:junit4]   2> 7772 T260 oass.OpenExchangeRatesOrgProvider.reload Reloading exchange rates from open-exchange-rates.json
[junit4:junit4]   2> 7774 T260 oasc.SolrCore.<init> [collection1] Opening new SolrCore at /usr/home/hudson/hudson-slave/workspace/Lucene-Solr-Tests-trunk-Java6/solr/build/solr-core/test/J1/./org.apache.solr.cloud.SyncSliceTest-jetty2-1348352734548/collection1/, dataDir=./org.apache.solr.cloud.SyncSliceTest-1348352728005/jetty2/
[junit4:junit4]   2> 7774 T260 oasc.JmxMonitoredMap.<init> JMX monitoring is enabled. Adding Solr mbeans to JMX Server: com.sun.jmx.mbeanserver.JmxMBeanServer@5a92668c
[junit4:junit4]   2> 7775 T260 oasc.SolrCore.getNewIndexDir WARNING New index directory detected: old=null new=./org.apache.solr.cloud.SyncSliceTest-1348352728005/jetty2/index/
[junit4:junit4]   2> 7776 T260 oasc.SolrCore.initIndex WARNING [collection1] Solr index directory './org.apache.solr.cloud.SyncSliceTest-1348352728005/jetty2/index' doesn't exist. Creating new index...
[junit4:junit4]   2> 7776 T260 oasc.CachingDirectoryFactory.get return new directory for /usr/home/hudson/hudson-slave/workspace/Lucene-Solr-Tests-trunk-Java6/solr/build/solr-core/test/J1/./org.apache.solr.cloud.SyncSliceTest-1348352728005/jetty2/index forceNew:false
[junit4:junit4]   2> 7795 T260 oasc.SolrDeletionPolicy.onCommit SolrDeletionPolicy.onCommit: commits:num=1
[junit4:junit4]   2> 		commit{dir=/usr/home/hudson/hudson-slave/workspace/Lucene-Solr-Tests-trunk-Java6/solr/build/solr-core/test/J1/org.apache.solr.cloud.SyncSliceTest-1348352728005/jetty2/index,segFN=segments_1,generation=1,filenames=[segments_1]
[junit4:junit4]   2> 7795 T260 oasc.SolrDeletionPolicy.updateCommits newest commit = 1
[junit4:junit4]   2> 7796 T260 oasc.SolrCore.initWriters created xml: solr.XMLResponseWriter
[junit4:junit4]   2> 7798 T260 oasup.UpdateRequestProcessorChain.init inserting DistributedUpdateProcessorFactory into updateRequestProcessorChain "dedupe"
[junit4:junit4]   2> 7798 T260 oasup.UpdateRequestProcessorChain.init inserting DistributedUpdateProcessorFactory into updateRequestProcessorChain "dedupe-allfields"
[junit4:junit4]   2> 7798 T260 oasup.UpdateRequestProcessorChain.init inserting DistributedUpdateProcessorFactory into updateRequestProcessorChain "stored_sig"
[junit4:junit4]   2> 7799 T260 oasup.UpdateRequestProcessorChain.init inserting DistributedUpdateProcessorFactory into updateRequestProcessorChain "uniq-fields"
[junit4:junit4]   2> 7799 T260 oasup.UpdateRequestProcessorChain.init inserting DistributedUpdateProcessorFactory into updateRequestProcessorChain "distrib-dup-test-chain-implicit"
[junit4:junit4]   2> 7800 T260 oasc.RequestHandlers.initHandlersFromConfig adding lazy requestHandler: solr.ReplicationHandler
[junit4:junit4]   2> 7800 T260 oasc.RequestHandlers.initHandlersFromConfig created /replication: solr.ReplicationHandler
[junit4:junit4]   2> 7800 T260 oasc.RequestHandlers.initHandlersFromConfig created standard: solr.StandardRequestHandler
[junit4:junit4]   2> 7801 T260 oasc.RequestHandlers.initHandlersFromConfig created /get: solr.RealTimeGetHandler
[junit4:junit4]   2> 7801 T260 oasc.RequestHandlers.initHandlersFromConfig created dismax: solr.SearchHandler
[junit4:junit4]   2> 7802 T260 oasc.RequestHandlers.initHandlersFromConfig created mock: org.apache.solr.core.MockQuerySenderListenerReqHandler
[junit4:junit4]   2> 7802 T260 oasc.RequestHandlers.initHandlersFromConfig created /admin/: org.apache.solr.handler.admin.AdminHandlers
[junit4:junit4]   2> 7803 T260 oasc.RequestHandlers.initHandlersFromConfig created defaults: solr.StandardRequestHandler
[junit4:junit4]   2> 7803 T260 oasc.RequestHandlers.initHandlersFromConfig adding lazy requestHandler: solr.StandardRequestHandler
[junit4:junit4]   2> 7803 T260 oasc.RequestHandlers.initHandlersFromConfig created lazy: solr.StandardRequestHandler
[junit4:junit4]   2> 7804 T260 oasc.RequestHandlers.initHandlersFromConfig created /update: solr.UpdateRequestHandler
[junit4:junit4]   2> 7804 T260 oasc.RequestHandlers.initHandlersFromConfig created /terms: org.apache.solr.handler.component.SearchHandler
[junit4:junit4]   2> 7805 T260 oasc.RequestHandlers.initHandlersFromConfig created spellCheckCompRH: org.apache.solr.handler.component.SearchHandler
[junit4:junit4]   2> 7805 T260 oasc.RequestHandlers.initHandlersFromConfig created spellCheckCompRH_Direct: org.apache.solr.handler.component.SearchHandler
[junit4:junit4]   2> 7806 T260 oasc.RequestHandlers.initHandlersFromConfig created spellCheckWithWordbreak: org.apache.solr.handler.component.SearchHandler
[junit4:junit4]   2> 7806 T260 oasc.RequestHandlers.initHandlersFromConfig created spellCheckWithWordbreak_Direct: org.apache.solr.handler.component.SearchHandler
[junit4:junit4]   2> 7807 T260 oasc.RequestHandlers.initHandlersFromConfig created spellCheckCompRH1: org.apache.solr.handler.component.SearchHandler
[junit4:junit4]   2> 7807 T260 oasc.RequestHandlers.initHandlersFromConfig created tvrh: org.apache.solr.handler.component.SearchHandler
[junit4:junit4]   2> 7808 T260 oasc.RequestHandlers.initHandlersFromConfig created /mlt: solr.MoreLikeThisHandler
[junit4:junit4]   2> 7808 T260 oasc.RequestHandlers.initHandlersFromConfig created /debug/dump: solr.DumpRequestHandler
[junit4:junit4]   2> 7811 T260 oashl.XMLLoader.init xsltCacheLifetimeSeconds=60
[junit4:junit4]   2> 7814 T260 oasc.SolrCore.initDeprecatedSupport WARNING solrconfig.xml uses deprecated <admin/gettableFiles>, Please update your config to use the ShowFileRequestHandler.
[junit4:junit4]   2> 7815 T260 oasc.SolrCore.initDeprecatedSupport WARNING adding ShowFileRequestHandler with hidden files: [SCHEMA.XML, OLD_SYNONYMS.TXT, STOPWORDS.TXT, PROTWORDS.TXT, OPEN-EXCHANGE-RATES.JSON, SYNONYMS.TXT, CURRENCY.XML, MAPPING-ISOLATIN1ACCENT.TXT]
[junit4:junit4]   2> 7818 T260 oass.SolrIndexSearcher.<init> Opening Searcher@5375e9db main
[junit4:junit4]   2> 7819 T260 oasu.CommitTracker.<init> Hard AutoCommit: disabled
[junit4:junit4]   2> 7819 T260 oasu.CommitTracker.<init> Soft AutoCommit: disabled
[junit4:junit4]   2> 7820 T260 oashc.SpellCheckComponent.inform Initializing spell checkers
[junit4:junit4]   2> 7825 T260 oass.DirectSolrSpellChecker.init init: {name=direct,classname=DirectSolrSpellChecker,field=lowerfilt,minQueryLength=3}
[junit4:junit4]   2> 7893 T307 oasc.SolrCore.registerSearcher [collection1] Registered new searcher Searcher@5375e9db main{StandardDirectoryReader(segments_1:1)}
[junit4:junit4]   2> 8060 T281 oascc.ZkStateReader.updateClusterState Updating cloud state from ZooKeeper... 
[junit4:junit4]   2> 8073 T280 oascc.ZkStateReader$2.process A cluster state change has occurred - updating...
[junit4:junit4]   2> 8073 T306 oascc.ZkStateReader$2.process A cluster state change has occurred - updating...
[junit4:junit4]   2> 8073 T294 oascc.ZkStateReader$2.process A cluster state change has occurred - updating...
[junit4:junit4]   2> 8399 T260 oasc.CoreContainer.register registering core: collection1
[junit4:junit4]   2> 8399 T260 oasc.ZkController.register Register shard - core:collection1 address:http://127.0.0.1:29766/solr shardId:shard1
[junit4:junit4]   2> 8404 T260 oasc.ZkController.register We are http://127.0.0.1:29766/solr/collection1/ and leader is http://127.0.0.1:29763/solr/collection1/
[junit4:junit4]   2> 8404 T260 oasc.ZkController.register No LogReplay needed for core=collection1 baseURL=http://127.0.0.1:29766/solr
[junit4:junit4]   2> 8405 T260 oasc.ZkController.checkRecovery Core needs to recover:collection1
[junit4:junit4]   2> 8405 T260 oasu.DefaultSolrCoreState.doRecovery Running recovery - first canceling any ongoing recovery
[junit4:junit4]   2> ASYNC  NEW_CORE C25 name=collection1 org.apache.solr.core.SolrCore@73ff0102 url=http://127.0.0.1:29766/solr/collection1 node=127.0.0.1:29766_solr
[junit4:junit4]   2> 8412 T308 C25 P29766 oasc.RecoveryStrategy.run Starting recovery process.  core=collection1 recoveringAfterStartup=true
[junit4:junit4]   2> 8412 T308 C25 P29766 oasc.RecoveryStrategy.doRecovery ###### startupVersions=[]
[junit4:junit4]   2> 8412 T260 oascc.ZkStateReader.updateClusterState Updating cloud state from ZooKeeper... 
[junit4:junit4]   2> 8417 T308 C25 P29766 oasc.RecoveryStrategy.doRecovery Attempting to PeerSync from http://127.0.0.1:29763/solr/collection1/ core=collection1 - recoveringAfterStartup=true
[junit4:junit4]   2> 8418 T260 oass.SolrDispatchFilter.init user.dir=/usr/home/hudson/hudson-slave/workspace/Lucene-Solr-Tests-trunk-Java6/solr/build/solr-core/test/J1
[junit4:junit4]   2> 8418 T260 oass.SolrDispatchFilter.init SolrDispatchFilter.init() done
[junit4:junit4]   2> 8419 T260 oascsi.HttpClientUtil.createClient Creating new http client, config:maxConnections=128&maxConnectionsPerHost=32&followRedirects=false
[junit4:junit4]   2> 8424 T308 C25 P29766 oascsi.HttpClientUtil.createClient Creating new http client, config:maxConnectionsPerHost=20&maxConnections=10000&connTimeout=30000&socketTimeout=30000&retry=false
[junit4:junit4]   2> 8444 T308 C25 P29766 oasu.PeerSync.sync PeerSync: core=collection1 url=http://127.0.0.1:29766/solr START replicas=[http://127.0.0.1:29763/solr/collection1/] nUpdates=100
[junit4:junit4]   2> 8444 T308 C25 P29766 oasu.PeerSync.sync WARNING no frame of reference to tell of we've missed updates
[junit4:junit4]   2> 8445 T308 C25 P29766 oasc.RecoveryStrategy.doRecovery PeerSync Recovery was not successful - trying replication. core=collection1
[junit4:junit4]   2> 8445 T308 C25 P29766 oasc.RecoveryStrategy.doRecovery Starting Replication Recovery. core=collection1
[junit4:junit4]   2> 8445 T308 C25 P29766 oascsi.HttpClientUtil.createClient Creating new http client, config:maxConnections=128&maxConnectionsPerHost=32&followRedirects=false
[junit4:junit4]   2> ASYNC  NEW_CORE C26 name=collection1 org.apache.solr.core.SolrCore@674c8c6e url=http://127.0.0.1:29763/solr/collection1 node=127.0.0.1:29763_solr
[junit4:junit4]   2> 8463 T286 C26 P29763 REQ /get {distrib=false&qt=/get&wt=javabin&version=2&getVersions=100} status=0 QTime=1 
[junit4:junit4]   2> 8578 T281 oascc.ZkStateReader.updateClusterState Updating cloud state from ZooKeeper... 
[junit4:junit4]   2> 8590 T280 oascc.ZkStateReader$2.process A cluster state change has occurred - updating...
[junit4:junit4]   2> 8590 T294 oascc.ZkStateReader$2.process A cluster state change has occurred - updating...
[junit4:junit4]   2> 8590 T306 oascc.ZkStateReader$2.process A cluster state change has occurred - updating...
[junit4:junit4]   2> 8617 T260 oejs.Server.doStart jetty-8.1.2.v20120308
[junit4:junit4]   2> 8620 T260 oejs.AbstractConnector.doStart Started SocketConnector@0.0.0.0:29770
[junit4:junit4]   2> 8620 T260 oasc.SolrResourceLoader.locateSolrHome JNDI not configured for solr (NoInitialContextEx)
[junit4:junit4]   2> 8621 T260 oasc.SolrResourceLoader.locateSolrHome using system property solr.solr.home: /usr/home/hudson/hudson-slave/workspace/Lucene-Solr-Tests-trunk-Java6/solr/build/solr-core/test/J1/./org.apache.solr.cloud.SyncSliceTest-jetty3-1348352736437
[junit4:junit4]   2> 8621 T260 oasc.SolrResourceLoader.<init> new SolrResourceLoader for deduced Solr Home: '/usr/home/hudson/hudson-slave/workspace/Lucene-Solr-Tests-trunk-Java6/solr/build/solr-core/test/J1/./org.apache.solr.cloud.SyncSliceTest-jetty3-1348352736437/'
[junit4:junit4]   2> 8666 T260 oass.SolrDispatchFilter.init SolrDispatchFilter.init()
[junit4:junit4]   2> 8666 T260 oasc.SolrResourceLoader.locateSolrHome JNDI not configured for solr (NoInitialContextEx)
[junit4:junit4]   2> 8667 T260 oasc.SolrResourceLoader.locateSolrHome using system property solr.solr.home: /usr/home/hudson/hudson-slave/workspace/Lucene-Solr-Tests-trunk-Java6/solr/build/solr-core/test/J1/./org.apache.solr.cloud.SyncSliceTest-jetty3-1348352736437
[junit4:junit4]   2> 8667 T260 oasc.CoreContainer$Initializer.initialize looking for solr.xml: /usr/home/hudson/hudson-slave/workspace/Lucene-Solr-Tests-trunk-Java6/solr/build/solr-core/test/J1/./org.apache.solr.cloud.SyncSliceTest-jetty3-1348352736437/solr.xml
[junit4:junit4]   2> 8668 T260 oasc.CoreContainer.<init> New CoreContainer 2032185280
[junit4:junit4]   2> 8668 T260 oasc.CoreContainer.load Loading CoreContainer using Solr Home: '/usr/home/hudson/hudson-slave/workspace/Lucene-Solr-Tests-trunk-Java6/solr/build/solr-core/test/J1/./org.apache.solr.cloud.SyncSliceTest-jetty3-1348352736437/'
[junit4:junit4]   2> 8669 T260 oasc.SolrResourceLoader.<init> new SolrResourceLoader for directory: '/usr/home/hudson/hudson-slave/workspace/Lucene-Solr-Tests-trunk-Java6/solr/build/solr-core/test/J1/./org.apache.solr.cloud.SyncSliceTest-jetty3-1348352736437/'
[junit4:junit4]   2> 8695 T260 oasc.CoreContainer.load Registering Log Listener
[junit4:junit4]   2> 8713 T260 oasc.CoreContainer.initZooKeeper Zookeeper client=127.0.0.1:29756/solr
[junit4:junit4]   2> 8714 T260 oaz.ZooKeeper.<init> Initiating client connection, connectString=127.0.0.1:29756/solr sessionTimeout=5000 watcher=org.apache.solr.common.cloud.ConnectionManager@35a21149
[junit4:junit4]   2> 8715 T319 oaz.ClientCnxn$SendThread.startConnect Opening socket connection to server /127.0.0.1:29756
[junit4:junit4]   2> 8715 T260 oascc.ConnectionManager.waitForConnected Waiting for client to connect to ZooKeeper
[junit4:junit4]   2> 8716 T319 oaz.ClientCnxn$SendThread.primeConnection Socket connection established to localhost/127.0.0.1:29756, initiating session
[junit4:junit4]   2> 8716 T262 oazs.NIOServerCnxn$Factory.run Accepted socket connection from /140.211.11.196:29771
[junit4:junit4]   2> 8717 T262 oazs.NIOServerCnxn.readConnectRequest Client attempting to establish new session at /140.211.11.196:29771
[junit4:junit4]   2> 8721 T264 oazs.NIOServerCnxn.finishSessionInit Established session 0x139f015dda50005 with negotiated timeout 5000 for client /140.211.11.196:29771
[junit4:junit4]   2> 8721 T319 oaz.ClientCnxn$SendThread.readConnectResult Session establishment complete on server localhost/127.0.0.1:29756, sessionid = 0x139f015dda50005, negotiated timeout = 5000
[junit4:junit4]   2> 8721 T320 oascc.ConnectionManager.process Watcher org.apache.solr.common.cloud.ConnectionManager@35a21149 name:ZooKeeperConnection Watcher:127.0.0.1:29756/solr got event WatchedEvent state:SyncConnected type:None path:null path:null type:None
[junit4:junit4]   2> 8722 T260 oascc.ConnectionManager.waitForConnected Client is connected to ZooKeeper
[junit4:junit4]   2> 8722 T266 oazs.PrepRequestProcessor.pRequest Got user-level KeeperException when processing sessionid:0x139f015dda50005 type:create cxid:0x1 zxid:0xfffffffffffffffe txntype:unknown reqpath:n/a Error Path:/solr/overseer Error:KeeperErrorCode = NodeExists for /solr/overseer
[junit4:junit4]   2> 8729 T266 oazs.PrepRequestProcessor.pRequest Got user-level KeeperException when processing sessionid:0x139f015dda50005 type:create cxid:0x2 zxid:0xfffffffffffffffe txntype:unknown reqpath:n/a Error Path:/solr/overseer Error:KeeperErrorCode = NodeExists for /solr/overseer
[junit4:junit4]   2> 8737 T260 oasc.ZkController.createEphemeralLiveNode Register node as live in ZooKeeper:/live_nodes/127.0.0.1:29770_solr
[junit4:junit4]   2> 8737 T266 oazs.PrepRequestProcessor.pRequest Got user-level KeeperException when processing sessionid:0x139f015dda50005 type:delete cxid:0x4 zxid:0xfffffffffffffffe txntype:unknown reqpath:n/a Error Path:/solr/live_nodes/127.0.0.1:29770_solr Error:KeeperErrorCode = NoNode for /solr/live_nodes/127.0.0.1:29770_solr
[junit4:junit4]   2> 8747 T260 oascc.SolrZkClient.makePath makePath: /live_nodes/127.0.0.1:29770_solr
[junit4:junit4]   2> 8755 T306 oascc.ZkStateReader$3.process Updating live nodes
[junit4:junit4]   2> 8755 T294 oascc.ZkStateReader$3.process Updating live nodes
[junit4:junit4]   2> 8755 T280 oascc.ZkStateReader$3.process Updating live nodes
[junit4:junit4]   2> 8756 T260 oashc.HttpShardHandlerFactory.getParameter Setting socketTimeout to: 0
[junit4:junit4]   2> 8757 T260 oashc.HttpShardHandlerFactory.getParameter Setting urlScheme to: http://
[junit4:junit4]   2> 8757 T260 oashc.HttpShardHandlerFactory.getParameter Setting connTimeout to: 0
[junit4:junit4]   2> 8758 T260 oashc.HttpShardHandlerFactory.getParameter Setting maxConnectionsPerHost to: 20
[junit4:junit4]   2> 8758 T260 oashc.HttpShardHandlerFactory.getParameter Setting corePoolSize to: 0
[junit4:junit4]   2> 8759 T260 oashc.HttpShardHandlerFactory.getParameter Setting maximumPoolSize to: 2147483647
[junit4:junit4]   2> 8759 T260 oashc.HttpShardHandlerFactory.getParameter Setting maxThreadIdleTime to: 5
[junit4:junit4]   2> 8759 T260 oashc.HttpShardHandlerFactory.getParameter Setting sizeOfQueue to: -1
[junit4:junit4]   2> 8760 T260 oashc.HttpShardHandlerFactory.getParameter Setting fairnessPolicy to: false
[junit4:junit4]   2> 8760 T260 oascsi.HttpClientUtil.createClient Creating new http client, config:maxConnectionsPerHost=20&maxConnections=10000&socketTimeout=0&connTimeout=0&retry=false
[junit4:junit4]   2> 8783 T260 oascc.ZkStateReader.createClusterStateWatchersAndUpdate Updating cluster state from ZooKeeper... 
[junit4:junit4]   2> 8790 T260 oasc.CoreContainer.create Creating SolrCore 'collection1' using instanceDir: /usr/home/hudson/hudson-slave/workspace/Lucene-Solr-Tests-trunk-Java6/solr/build/solr-core/test/J1/./org.apache.solr.cloud.SyncSliceTest-jetty3-1348352736437/collection1
[junit4:junit4]   2> 8790 T260 oasc.ZkController.createCollectionZkNode Check for collection zkNode:collection1
[junit4:junit4]   2> 8791 T260 oasc.ZkController.createCollectionZkNode Collection zkNode exists
[junit4:junit4]   2> 8792 T260 oasc.ZkController.readConfigName Load collection config from:/collections/collection1
[junit4:junit4]   2> 8793 T260 oasc.SolrResourceLoader.<init> new SolrResourceLoader for directory: '/usr/home/hudson/hudson-slave/workspace/Lucene-Solr-Tests-trunk-Java6/solr/build/solr-core/test/J1/./org.apache.solr.cloud.SyncSliceTest-jetty3-1348352736437/collection1/'
[junit4:junit4]   2> 8794 T260 oasc.SolrResourceLoader.replaceClassLoader Adding 'file:/usr/home/hudson/hudson-slave/workspace/Lucene-Solr-Tests-trunk-Java6/solr/build/solr-core/test/J1/org.apache.solr.cloud.SyncSliceTest-jetty3-1348352736437/collection1/lib/classes/' to classloader
[junit4:junit4]   2> 8795 T260 oasc.SolrResourceLoader.replaceClassLoader Adding 'file:/usr/home/hudson/hudson-slave/workspace/Lucene-Solr-Tests-trunk-Java6/solr/build/solr-core/test/J1/org.apache.solr.cloud.SyncSliceTest-jetty3-1348352736437/collection1/lib/README' to classloader
[junit4:junit4]   2> 8845 T260 oasc.SolrConfig.<init> Using Lucene MatchVersion: LUCENE_50
[junit4:junit4]   2> 8916 T260 oasc.SolrConfig.<init> Loaded SolrConfig: solrconfig.xml
[junit4:junit4]   2> 9017 T260 oass.IndexSchema.readSchema Reading Solr Schema
[junit4:junit4]   2> 9025 T260 oass.IndexSchema.readSchema Schema name=test
[junit4:junit4]   2> 9656 T260 oass.OpenExchangeRatesOrgProvider.init Initialized with rates=open-exchange-rates.json, refreshInterval=1440.
[junit4:junit4]   2> 9669 T260 oass.IndexSchema.readSchema default search field in schema is text
[junit4:junit4]   2> 9673 T260 oass.IndexSchema.readSchema unique key field: id
[junit4:junit4]   2> 9693 T260 oass.FileExchangeRateProvider.reload Reloading exchange rates from file currency.xml
[junit4:junit4]   2> 9698 T260 oass.FileExchangeRateProvider.reload Reloading exchange rates from file currency.xml
[junit4:junit4]   2> 9703 T260 oass.OpenExchangeRatesOrgProvider.reload Reloading exchange rates from open-exchange-rates.json
[junit4:junit4]   2> 9705 T260 oass.OpenExchangeRatesOrgProvider.reload Reloading exchange rates from open-exchange-rates.json
[junit4:junit4]   2> 9707 T260 oasc.SolrCore.<init> [collection1] Opening new SolrCore at /usr/home/hudson/hudson-slave/workspace/Lucene-Solr-Tests-trunk-Java6/solr/build/solr-core/test/J1/./org.apache.solr.cloud.SyncSliceTest-jetty3-1348352736437/collection1/, dataDir=./org.apache.solr.cloud.SyncSliceTest-1348352728005/jetty3/
[junit4:junit4]   2> 9707 T260 oasc.JmxMonitoredMap.<init> JMX monitoring is enabled. Adding Solr mbeans to JMX Server: com.sun.jmx.mbeanserver.JmxMBeanServer@5a92668c
[junit4:junit4]   2> 9708 T260 oasc.SolrCore.getNewIndexDir WARNING New index directory detected: old=null new=./org.apache.solr.cloud.SyncSliceTest-1348352728005/jetty3/index/
[junit4:junit4]   2> 9709 T260 oasc.SolrCore.initIndex WARNING [collection1] Solr index directory './org.apache.solr.cloud.SyncSliceTest-1348352728005/jetty3/index' doesn't exist. Creating new index...
[junit4:junit4]   2> 9710 T260 oasc.CachingDirectoryFactory.get return new directory for /usr/home/hudson/hudson-slave/workspace/Lucene-Solr-Tests-trunk-Java6/solr/build/solr-core/test/J1/./org.apache.solr.cloud.SyncSliceTest-1348352728005/jetty3/index forceNew:false
[junit4:junit4]   2> 9732 T260 oasc.SolrDeletionPolicy.onCommit SolrDeletionPolicy.onCommit: commits:num=1
[junit4:junit4]   2> 		commit{dir=/usr/home/hudson/hudson-slave/workspace/Lucene-Solr-Tests-trunk-Java6/solr/build/solr-core/test/J1/org.apache.solr.cloud.SyncSliceTest-1348352728005/jetty3/index,segFN=segments_1,generation=1,filenames=[segments_1]
[junit4:junit4]   2> 9732 T260 oasc.SolrDeletionPolicy.updateCommits newest commit = 1
[junit4:junit4]   2> 9733 T260 oasc.SolrCore.initWriters created xml: solr.XMLResponseWriter
[junit4:junit4]   2> 9735 T260 oasup.UpdateRequestProcessorChain.init inserting DistributedUpdateProcessorFactory into updateRequestProcessorChain "dedupe"
[junit4:junit4]   2> 9736 T260 oasup.UpdateRequestProcessorChain.init inserting DistributedUpdateProcessorFactory into updateRequestProcessorChain "dedupe-allfields"
[junit4:junit4]   2> 9736 T260 oasup.UpdateRequestProcessorChain.init inserting DistributedUpdateProcessorFactory into updateRequestProcessorChain "stored_sig"
[junit4:junit4]   2> 9737 T260 oasup.UpdateRequestProcessorChain.init inserting DistributedUpdateProcessorFactory into updateRequestProcessorChain "uniq-fields"
[junit4:junit4]   2> 9738 T260 oasup.UpdateRequestProcessorChain.init inserting DistributedUpdateProcessorFactory into updateRequestProcessorChain "distrib-dup-test-chain-implicit"
[junit4:junit4]   2> 9738 T260 oasc.RequestHandlers.initHandlersFromConfig adding lazy requestHandler: solr.ReplicationHandler
[junit4:junit4]   2> 9739 T260 oasc.RequestHandlers.initHandlersFromConfig created /replication: solr.ReplicationHandler
[junit4:junit4]   2> 9739 T260 oasc.RequestHandlers.initHandlersFromConfig created standard: solr.StandardRequestHandler
[junit4:junit4]   2> 9740 T260 oasc.RequestHandlers.initHandlersFromConfig created /get: solr.RealTimeGetHandler
[junit4:junit4]   2> 9741 T260 oasc.RequestHandlers.initHandlersFromConfig created dismax: solr.SearchHandler
[junit4:junit4]   2> 9741 T260 oasc.RequestHandlers.initHandlersFromConfig created mock: org.apache.solr.core.MockQuerySenderListenerReqHandler
[junit4:junit4]   2> 9742 T260 oasc.RequestHandlers.initHandlersFromConfig created /admin/: org.apache.solr.handler.admin.AdminHandlers
[junit4:junit4]   2> 9743 T260 oasc.RequestHandlers.initHandlersFromConfig created defaults: solr.StandardRequestHandler
[junit4:junit4]   2> 9743 T260 oasc.RequestHandlers.initHandlersFromConfig adding lazy requestHandler: solr.StandardRequestHandler
[junit4:junit4]   2> 9744 T260 oasc.RequestHandlers.initHandlersFromConfig created lazy: solr.StandardRequestHandler
[junit4:junit4]   2> 9744 T260 oasc.RequestHandlers.initHandlersFromConfig created /update: solr.UpdateRequestHandler
[junit4:junit4]   2> 9745 T260 oasc.RequestHandlers.initHandlersFromConfig created /terms: org.apache.solr.handler.component.SearchHandler
[junit4:junit4]   2> 9746 T260 oasc.RequestHandlers.initHandlersFromConfig created spellCheckCompRH: org.apache.solr.handler.component.SearchHandler
[junit4:junit4]   2> 9746 T260 oasc.RequestHandlers.initHandlersFromConfig created spellCheckCompRH_Direct: org.apache.solr.handler.component.SearchHandler
[junit4:junit4]   2> 9747 T260 oasc.RequestHandlers.initHandlersFromConfig created spellCheckWithWordbreak: org.apache.solr.handler.component.SearchHandler
[junit4:junit4]   2> 9748 T260 oasc.RequestHandlers.initHandlersFromConfig created spellCheckWithWordbreak_Direct: org.apache.solr.handler.component.SearchHandler
[junit4:junit4]   2> 9749 T260 oasc.RequestHandlers.initHandlersFromConfig created spellCheckCompRH1: org.apache.solr.handler.component.SearchHandler
[junit4:junit4]   2> 9749 T260 oasc.RequestHandlers.initHandlersFromConfig created tvrh: org.apache.solr.handler.component.SearchHandler
[junit4:junit4]   2> 9750 T260 oasc.RequestHandlers.initHandlersFromConfig created /mlt: solr.MoreLikeThisHandler
[junit4:junit4]   2> 9751 T260 oasc.RequestHandlers.initHandlersFromConfig created /debug/dump: solr.DumpRequestHandler
[junit4:junit4]   2> 9754 T260 oashl.XMLLoader.init xsltCacheLifetimeSeconds=60
[junit4:junit4]   2> 9758 T260 oasc.SolrCore.initDeprecatedSupport WARNING solrconfig.xml uses deprecated <admin/gettableFiles>, Please update your config to use the ShowFileRequestHandler.
[junit4:junit4]   2> 9760 T260 oasc.SolrCore.initDeprecatedSupport WARNING adding ShowFileRequestHandler with hidden files: [SCHEMA.XML, OLD_SYNONYMS.TXT, STOPWORDS.TXT, PROTWORDS.TXT, OPEN-EXCHANGE-RATES.JSON, SYNONYMS.TXT, CURRENCY.XML, MAPPING-ISOLATIN1ACCENT.TXT]
[junit4:junit4]   2> 9766 T260 oass.SolrIndexSearcher.<init> Opening Searcher@28ab0e22 main
[junit4:junit4]   2> 9767 T260 oasu.CommitTracker.<init> Hard AutoCommit: disabled
[junit4:junit4]   2> 9767 T260 oasu.CommitTracker.<init> Soft AutoCommit: disabled
[junit4:junit4]   2> 9768 T260 oashc.SpellCheckComponent.inform Initializing spell checkers
[junit4:junit4]   2> 9784 T260 oass.DirectSolrSpellChecker.init init: {name=direct,classname=DirectSolrSpellChecker,field=lowerfilt,minQueryLength=3}
[junit4:junit4]   2> 9853 T321 oasc.SolrCore.registerSearcher [collection1] Registered new searcher Searcher@28ab0e22 main{StandardDirectoryReader(segments_1:1)}
[junit4:junit4]   2> 10099 T281 oascc.ZkStateReader.updateClusterState Updating cloud state from ZooKeeper... 
[junit4:junit4]   2> 10112 T320 oascc.ZkStateReader$2.process A cluster state change has occurred - updating...
[junit4:junit4]   2> 10112 T294 oascc.ZkStateReader$2.process A cluster state change has occurred - updating...
[junit4:junit4]   2> 10112 T306 oascc.ZkStateReader$2.process A cluster state change has occurred - updating...
[junit4:junit4]   2> 10112 T280 oascc.ZkStateReader$2.process A cluster state change has occurred - updating...
[junit4:junit4]   2> 10361 T260 oasc.CoreContainer.register registering core: collection1
[junit4:junit4]   2> 10361 T260 oasc.ZkController.register Register shard - core:collection1 address:http://127.0.0.1:29770/solr shardId:shard1
[junit4:junit4]   2> 10366 T260 oasc.ZkController.register We are http://127.0.0.1:29770/solr/collection1/ and leader is http://127.0.0.1:29763/solr/collection1/
[junit4:junit4]   2> 10367 T260 oasc.ZkController.register No LogReplay needed for core=collection1 baseURL=http://127.0.0.1:29770/solr
[junit4:junit4]   2> 10367 T260 oasc.ZkController.checkRecovery Core needs to recover:collection1
[junit4:junit4]   2> 10368 T260 oasu.DefaultSolrCoreState.doRecovery Running recovery - first canceling any ongoing recovery
[junit4:junit4]   2> ASYNC  NEW_CORE C27 name=collection1 org.apache.solr.core.SolrCore@51e52bfd url=http://127.0.0.1:29770/solr/collection1 node=127.0.0.1:29770_solr
[junit4:junit4]   2> 10369 T322 C27 P29770 oasc.RecoveryStrategy.run Starting recovery process.  core=collection1 recoveringAfterStartup=true
[junit4:junit4]   2> 10369 T322 C27 P29770 oasc.RecoveryStrategy.doRecovery ###### startupVersions=[]
[junit4:junit4]   2> 10369 T260 oascc.ZkStateReader.updateClusterState Updating cloud state from ZooKeeper... 
[junit4:junit4]   2> 10371 T322 C27 P29770 oasc.RecoveryStrategy.doRecovery Attempting to PeerSync from http://127.0.0.1:29763/solr/collection1/ core=collection1 - recoveringAfterStartup=true
[junit4:junit4]   2> 10371 T322 C27 P29770 oasu.PeerSync.sync PeerSync: core=collection1 url=http://127.0.0.1:29770/solr START replicas=[http://127.0.0.1:29763/solr/collection1/] nUpdates=100
[junit4:junit4]   2> 10371 T260 oass.SolrDispatchFilter.init user.dir=/usr/home/hudson/hudson-slave/workspace/Lucene-Solr-Tests-trunk-Java6/solr/build/solr-core/test/J1
[junit4:junit4]   2> 10372 T322 C27 P29770 oasu.PeerSync.sync WARNING no frame of reference to tell of we've missed updates
[junit4:junit4]   2> 10372 T260 oass.SolrDispatchFilter.init SolrDispatchFilter.init() done
[junit4:junit4]   2> 10373 T322 C27 P29770 oasc.RecoveryStrategy.doRecovery PeerSync Recovery was not successful - trying replication. core=collection1
[junit4:junit4]   2> 10373 T322 C27 P29770 oasc.RecoveryStrategy.doRecovery Starting Replication Recovery. core=collection1
[junit4:junit4]   2> 10373 T260 oascsi.HttpClientUtil.createClient Creating new http client, config:maxConnections=128&maxConnectionsPerHost=32&followRedirects=false
[junit4:junit4]   2> 10373 T322 C27 P29770 oascsi.HttpClientUtil.createClient Creating new http client, config:maxConnections=128&maxConnectionsPerHost=32&followRedirects=false
[junit4:junit4]   2> 10375 T286 C26 P29763 REQ /get {distrib=false&qt=/get&wt=javabin&version=2&getVersions=100} status=0 QTime=0 
[junit4:junit4]   2> 10560 T260 oejs.Server.doStart jetty-8.1.2.v20120308
[junit4:junit4]   2> 10563 T260 oejs.AbstractConnector.doStart Started SocketConnector@0.0.0.0:29775
[junit4:junit4]   2> 10563 T260 oasc.SolrResourceLoader.locateSolrHome JNDI not configured for solr (NoInitialContextEx)
[junit4:junit4]   2> 10564 T260 oasc.SolrResourceLoader.locateSolrHome using system property solr.solr.home: /usr/home/hudson/hudson-slave/workspace/Lucene-Solr-Tests-trunk-Java6/solr/build/solr-core/test/J1/./org.apache.solr.cloud.SyncSliceTest-jetty4-1348352738396
[junit4:junit4]   2> 10564 T260 oasc.SolrResourceLoader.<init> new SolrResourceLoader for deduced Solr Home: '/usr/home/hudson/hudson-slave/workspace/Lucene-Solr-Tests-trunk-Java6/solr/build/solr-core/test/J1/./org.apache.solr.cloud.SyncSliceTest-jetty4-1348352738396/'
[junit4:junit4]   2> 10608 T260 oass.SolrDispatchFilter.init SolrDispatchFilter.init()
[junit4:junit4]   2> 10609 T260 oasc.SolrResourceLoader.locateSolrHome JNDI not configured for solr (NoInitialContextEx)
[junit4:junit4]   2> 10609 T260 oasc.SolrResourceLoader.locateSolrHome using system property solr.solr.home: /usr/home/hudson/hudson-slave/workspace/Lucene-Solr-Tests-trunk-Java6/solr/build/solr-core/test/J1/./org.apache.solr.cloud.SyncSliceTest-jetty4-1348352738396
[junit4:junit4]   2> 10610 T260 oasc.CoreContainer$Initializer.initialize looking for solr.xml: /usr/home/hudson/hudson-slave/workspace/Lucene-Solr-Tests-trunk-Java6/solr/build/solr-core/test/J1/./org.apache.solr.cloud.SyncSliceTest-jetty4-1348352738396/solr.xml
[junit4:junit4]   2> 10610 T260 oasc.CoreContainer.<init> New CoreContainer 744066701
[junit4:junit4]   2> 10611 T260 oasc.CoreContainer.load Loading CoreContainer using Solr Home: '/usr/home/hudson/hudson-slave/workspace/Lucene-Solr-Tests-trunk-Java6/solr/build/solr-core/test/J1/./org.apache.solr.cloud.SyncSliceTest-jetty4-1348352738396/'
[junit4:junit4]   2> 10611 T260 oasc.SolrResourceLoader.<init> new SolrResourceLoader for directory: '/usr/home/hudson/hudson-slave/workspace/Lucene-Solr-Tests-trunk-Java6/solr/build/solr-core/test/J1/./org.apache.solr.cloud.SyncSliceTest-jetty4-1348352738396/'
[junit4:junit4]   2> 10619 T281 oascc.ZkStateReader.updateClusterState Updating cloud state from ZooKeeper... 
[junit4:junit4]   2> 10635 T260 oasc.CoreContainer.load Registering Log Listener
[junit4:junit4]   2> 10644 T320 oascc.ZkStateReader$2.process A cluster state change has occurred - updating...
[junit4:junit4]   2> 10644 T280 oascc.ZkStateReader$2.process A cluster state change has occurred - updating...
[junit4:junit4]   2> 10644 T306 oascc.ZkStateReader$2.process A cluster state change has occurred - updating...
[junit4:junit4]   2> 10644 T294 oascc.ZkStateReader$2.process A cluster state change has occurred - updating...
[junit4:junit4]   2> 10650 T260 oasc.CoreContainer.initZooKeeper Zookeeper client=127.0.0.1:29756/solr
[junit4:junit4]   2> 10651 T260 oaz.ZooKeeper.<init> Initiating client connection, connectString=127.0.0.1:29756/solr sessionTimeout=5000 watcher=org.apache.solr.common.cloud.ConnectionManager@31799ca4
[junit4:junit4]   2> 10652 T333 oaz.ClientCnxn$SendThread.startConnect Opening socket connection to server /127.0.0.1:29756
[junit4:junit4]   2> 10652 T260 oascc.ConnectionManager.waitForConnected Waiting for client to connect to ZooKeeper
[junit4:junit4]   2> 10653 T333 oaz.ClientCnxn$SendThread.primeConnection Socket connection established to localhost/127.0.0.1:29756, initiating session
[junit4:junit4]   2> 10653 T262 oazs.NIOServerCnxn$Factory.run Accepted socket connection from /140.211.11.196:29776
[junit4:junit4]   2> 10654 T262 oazs.NIOServerCnxn.readConnectRequest Client attempting to establish new session at /140.211.11.196:29776
[junit4:junit4]   2> 10732 T264 oazs.NIOServerCnxn.finishSessionInit Established session 0x139f015dda50006 with negotiated timeout 5000 for client /140.211.11.196:29776
[junit4:junit4]   2> 10732 T333 oaz.ClientCnxn$SendThread.readConnectResult Session establishment complete on server localhost/127.0.0.1:29756, sessionid = 0x139f015dda50006, negotiated timeout = 5000
[junit4:junit4]   2> 10733 T334 oascc.ConnectionManager.process Watcher org.apache.solr.common.cloud.ConnectionManager@31799ca4 name:ZooKeeperConnection Watcher:127.0.0.1:29756/solr got event WatchedEvent state:SyncConnected type:None path:null path:null type:None
[junit4:junit4]   2> 10733 T260 oascc.ConnectionManager.waitForConnected Client is connected to ZooKeeper
[junit4:junit4]   2> 10734 T266 oazs.PrepRequestProcessor.pRequest Got user-level KeeperException when processing sessionid:0x139f015dda50006 type:create cxid:0x1 zxid:0xfffffffffffffffe txntype:unknown reqpath:n/a Error Path:/solr/overseer Error:KeeperErrorCode = NodeExists for /solr/overseer
[junit4:junit4]   2> 10743 T266 oazs.PrepRequestProcessor.pRequest Got user-level KeeperException when processing sessionid:0x139f015dda50006 type:create cxid:0x2 zxid:0xfffffffffffffffe txntype:unknown reqpath:n/a Error Path:/solr/overseer Error:KeeperErrorCode = NodeExists for /solr/overseer
[junit4:junit4]   2> 10751 T260 oasc.ZkController.createEphemeralLiveNode Register node as live in ZooKeeper:/live_nodes/127.0.0.1:29775_solr
[junit4:junit4]   2> 10751 T266 oazs.PrepRequestProcessor.pRequest Got user-level KeeperException when processing sessionid:0x139f015dda50006 type:delete cxid:0x4 zxid:0xfffffffffffffffe txntype:unknown reqpath:n/a Error Path:/solr/live_nodes/127.0.0.1:29775_solr Error:KeeperErrorCode = NoNode for /solr/live_nodes/127.0.0.1:29775_solr
[junit4:junit4]   2> 10778 T260 oascc.SolrZkClient.makePath makePath: /live_nodes/127.0.0.1:29775_solr
[junit4:junit4]   2> 10809 T320 oascc.ZkStateReader$3.process Updating live nodes
[junit4:junit4]   2> 10809 T294 oascc.ZkStateReader$3.process Updating live nodes
[junit4:junit4]   2> 10810 T306 oascc.ZkStateReader$3.process Updating live nodes
[junit4:junit4]   2> 10810 T280 oascc.ZkStateReader$3.process Updating live nodes
[junit4:junit4]   2> 10811 T260 oashc.HttpShardHandlerFactory.getParameter Setting socketTimeout to: 0
[junit4:junit4]   2> 10811 T260 oashc.HttpShardHandlerFactory.getParameter Setting urlScheme to: http://
[junit4:junit4]   2> 10812 T260 oashc.HttpShardHandlerFactory.getParameter Setting connTimeout to: 0
[junit4:junit4]   2> 10812 T260 oashc.HttpShardHandlerFactory.getParameter Setting maxConnectionsPerHost to: 20
[junit4:junit4]   2> 10813 T260 oashc.HttpShardHandlerFactory.getParameter Setting corePoolSize to: 0
[junit4:junit4]   2> 10813 T260 oashc.HttpShardHandlerFactory.getParameter Setting maximumPoolSize to: 2147483647
[junit4:junit4]   2> 10813 T260 oashc.HttpShardHandlerFactory.getParameter Setting maxThreadIdleTime to: 5
[junit4:junit4]   2> 10814 T260 oashc.HttpShardHandlerFactory.getParameter Setting sizeOfQueue to: -1
[junit4:junit4]   2> 10814 T260 oashc.HttpShardHandlerFactory.getParameter Setting fairnessPolicy to: false
[junit4:junit4]   2> 10815 T260 oascsi.HttpClientUtil.createClient Creating new http client, config:maxConnectionsPerHost=20&maxConnections=10000&socketTimeout=0&connTimeout=0&retry=false
[junit4:junit4]   2> 10863 T260 oascc.ZkStateReader.createClusterStateWatchersAndUpdate Updating cluster state from ZooKeeper... 
[junit4:junit4]   2> 10869 T260 oasc.CoreContainer.create Creating SolrCore 'collection1' using instanceDir: /usr/home/hudson/hudson-slave/workspace/Lucene-Solr-Tests-trunk-Java6/solr/build/solr-core/test/J1/./org.apache.solr.cloud.SyncSliceTest-jetty4-1348352738396/collection1
[junit4:junit4]   2> 10870 T260 oasc.ZkController.createCollectionZkNode Check for collection zkNode:collection1
[junit4:junit4]   2> 10871 T260 oasc.ZkController.createCollectionZkNode Collection zkNode exists
[junit4:junit4]   2> 10871 T260 oasc.ZkController.readConfigName Load collection config from:/collections/collection1
[junit4:junit4]   2> 10873 T260 oasc.SolrResourceLoader.<init> new SolrResourceLoader for directory: '/usr/home/hudson/hudson-slave/workspace/Lucene-Solr-Tests-trunk-Java6/solr/build/solr-core/test/J1/./org.apache.solr.cloud.SyncSliceTest-jetty4-1348352738396/collection1/'
[junit4:junit4]   2> 10874 T260 oasc.SolrResourceLoader.replaceClassLoader Adding 'file:/usr/home/hudson/hudson-slave/workspace/Lucene-Solr-Tests-trunk-Java6/solr/build/solr-core/test/J1/org.apache.solr.cloud.SyncSliceTest-jetty4-1348352738396/collection1/lib/README' to classloader
[junit4:junit4]   2> 10875 T260 oasc.SolrResourceLoader.replaceClassLoader Adding 'file:/usr/home/hudson/hudson-slave/workspace/Lucene-Solr-Tests-trunk-Java6/solr/build/solr-core/test/J1/org.apache.solr.cloud.SyncSliceTest-jetty4-1348352738396/collection1/lib/classes/' to classloader
[junit4:junit4]   2> 10926 T260 oasc.SolrConfig.<init> Using Lucene MatchVersion: LUCENE_50
[junit4:junit4]   2> 10995 T260 oasc.SolrConfig.<init> Loaded SolrConfig: solrconfig.xml
[junit4:junit4]   2> 11096 T260 oass.IndexSchema.readSchema Reading Solr Schema
[junit4:junit4]   2> 11107 T260 oass.IndexSchema.readSchema Schema name=test
[junit4:junit4]   2>  C25_STATE=coll:collection1 core:collection1 props:{shard=shard1, roles=null, state=recovering, core=collection1, collection=collection1, node_name=127.0.0.1:29766_solr, base_url=http://127.0.0.1:29766/solr}
[junit4:junit4]   2> 11472 T308 C25 P29766 oasc.RecoveryStrategy.doRecovery Begin buffering updates. core=collection1
[junit4:junit4]   2> 11472 T308 C25 P29766 oasu.UpdateLog.bufferUpdates Starting to buffer updates. FSUpdateLog{state=ACTIVE, tlog=null}
[junit4:junit4]   2> 11472 T308 C25 P29766 oasc.RecoveryStrategy.replicate Attempting to replicate from http://127.0.0.1:29763/solr/collection1/. core=collection1
[junit4:junit4]   2> 11472 T308 C25 P29766 oascsi.HttpClientUtil.createClient Creating new http client, config:maxConnections=128&maxConnectionsPerHost=32&followRedirects=false
[junit4:junit4]   2> 11499 T289 C26 P29763 oascsi.HttpClientUtil.createClient Creating new http client, config:maxConnections=500&maxConnectionsPerHost=16
[junit4:junit4]   2> 11512 T289 C26 P29763 oasu.DirectUpdateHandler2.commit start commit{flags=0,_version_=0,optimize=false,openSearcher=true,waitSearcher=true,expungeDeletes=false,softCommit=false}
[junit4:junit4]   2> 11517 T289 C26 P29763 oasc.SolrDeletionPolicy.onInit SolrDeletionPolicy.onInit: commits:num=1
[junit4:junit4]   2> 		commit{dir=/usr/home/hudson/hudson-slave/workspace/Lucene-Solr-Tests-trunk-Java6/solr/build/solr-core/test/J1/org.apache.solr.cloud.SyncSliceTest-1348352728005/jetty1/index,segFN=segments_1,generation=1,filenames=[segments_1]
[junit4:junit4]   2> 11518 T289 C26 P29763 oasc.SolrDeletionPolicy.updateCommits newest commit = 1
[junit4:junit4]   2> 11519 T289 C26 P29763 oass.SolrIndexSearcher.<init> Opening Searcher@ca5bc81 main
[junit4:junit4]   2> 11520 T289 C26 P29763 oasu.DirectUpdateHandler2.commit end_commit_flush
[junit4:junit4]   2> 11522 T295 oasc.SolrCore.registerSearcher [collection1] Registered new searcher Searcher@ca5bc81 main{StandardDirectoryReader(segments_1:1)}
[junit4:junit4]   2> 11522 T289 C26 P29763 /update {waitSearcher=true&commit=true&commit_end_point=true&wt=javabin&softCommit=false&version=2} {commit=} 0 38
[junit4:junit4]   2> 11577 T308 C25 P29766 oash.ReplicationHandler.inform Commits will be reserved for  10000
[junit4:junit4]   2> 11578 T308 C25 P29766 oascsi.HttpClientUtil.createClient Creating new http client, config:connTimeout=5000&socketTimeout=20000&allowCompression=false&maxConnections=10000&maxConnectionsPerHost=10000
[junit4:junit4]   2> 11599 T308 C25 P29766 oash.SnapPuller.<init>  No value set for 'pollInterval'. Timer Task not started.
[junit4:junit4]   2> 11602 T290 C26 P29763 oash.ReplicationHandler.inform Commits will be reserved for  10000
[junit4:junit4]   2> 11602 T290 C26 P29763 REQ /replication {command=indexversion&wt=javabin&qt=/replication&version=2} status=0 QTime=1 
[junit4:junit4]   2> 11607 T308 C25 P29766 oasc.SolrDeletionPolicy.onInit SolrDeletionPolicy.onInit: commits:num=1
[junit4:junit4]   2> 		commit{dir=/usr/home/hudson/hudson-slave/workspace/Lucene-Solr-Tests-trunk-Java6/solr/build/solr-core/test/J1/org.apache.solr.cloud.SyncSliceTest-1348352728005/jetty2/index,segFN=segments_1,generation=1,filenames=[segments_1]
[junit4:junit4]   2> 11608 T308 C25 P29766 oasc.SolrDeletionPolicy.updateCommits newest commit = 1
[junit4:junit4]   2> 11608 T308 C25 P29766 oasu.DirectUpdateHandler2.commit start commit{flags=0,_version_=0,optimize=false,openSearcher=true,waitSearcher=true,expungeDeletes=false,softCommit=false}
[junit4:junit4]   2> 11621 T308 C25 P29766 oasc.SolrDeletionPolicy.onCommit SolrDeletionPolicy.onCommit: commits:num=2
[junit4:junit4]   2> 		commit{dir=/usr/home/hudson/hudson-slave/workspace/Lucene-Solr-Tests-trunk-Java6/solr/build/solr-core/test/J1/org.apache.solr.cloud.SyncSliceTest-1348352728005/jetty2/index,segFN=segments_1,generation=1,filenames=[segments_1]
[junit4:junit4]   2> 		commit{dir=/usr/home/hudson/hudson-slave/workspace/Lucene-Solr-Tests-trunk-Java6/solr/build/solr-core/test/J1/org.apache.solr.cloud.SyncSliceTest-1348352728005/jetty2/index,segFN=segments_2,generation=2,filenames=[segments_2]
[junit4:junit4]   2> 11621 T308 C25 P29766 oasc.SolrDeletionPolicy.updateCommits newest commit = 2
[junit4:junit4]   2> 11628 T308 C25 P29766 oass.SolrIndexSearcher.<init> Opening Searcher@3c7c5dfc main
[junit4:junit4]   2> 11628 T308 C25 P29766 oasu.DirectUpdateHandler2.commit end_commit_flush
[junit4:junit4]   2> 11630 T307 oasc.SolrCore.registerSearcher [collection1] Registered new searcher Searcher@3c7c5dfc main{StandardDirectoryReader(segments_2:2)}
[junit4:junit4]   2> 11631 T308 C25 P29766 oasc.RecoveryStrategy.replay No replay needed. core=collection1
[junit4:junit4]   2> 11631 T308 C25 P29766 oasc.RecoveryStrategy.doRecovery Replication Recovery was successful - registering as Active. core=collection1
[junit4:junit4]   2> 11640 T308 C25 P29766 oasc.RecoveryStrategy.doRecovery Finished recovery process. core=collection1
[junit4:junit4]   2> 11659 T281 oascc.ZkStateReader.updateClusterState Updating cloud state from ZooKeeper... 
[junit4:junit4]   2> 11683 T294 oascc.ZkStateReader$2.process A cluster state change has occurred - updating...
[junit4:junit4]   2> 11683 T320 oascc.ZkStateReader$2.process A cluster state change has occurred - updating...
[junit4:junit4]   2> 11683 T334 oascc.ZkStateReader$2.process A cluster state change has occurred - updating...
[junit4:junit4]   2> 11683 T306 oascc.ZkStateReader$2.process A cluster state change has occurred - updating...
[junit4:junit4]   2> 11683 T280 oascc.ZkStateReader$2.process A cluster state change has occurred - updating...
[junit4:junit4]   2> 11811 T260 oass.OpenExchangeRatesOrgProvider.init Initialized with rates=open-exchange-rates.json, refreshInterval=1440.
[junit4:junit4]   2> 11823 T260 oass.IndexSchema.readSchema default search field in schema is text
[junit4:junit4]   2> 11827 T260 oass.IndexSchema.readSchema unique key field: id
[junit4:junit4]   2> 11845 T260 oass.FileExchangeRateProvider.reload Reloading exchange rates from file currency.xml
[junit4:junit4]   2> 11856 T260 oass.FileExchangeRateProvider.reload Reloading exchange rates from file currency.xml
[junit4:junit4]   2> 11860 T260 oass.OpenExchangeRatesOrgProvider.reload Reloading exchange rates from open-exchange-rates.json
[junit4:junit4]   2> 11864 T260 oass.OpenExchangeRatesOrgProvider.reload Reloading exchange rates from open-exchange-rates.json
[junit4:junit4]   2> 11866 T260 oasc.SolrCore.<init> [collection1] Opening new SolrCore at /usr/home/hudson/hudson-slave/workspace/Lucene-Solr-Tests-trunk-Java6/solr/build/solr-core/test/J1/./org.apache.solr.cloud.SyncSliceTest-jetty4-1348352738396/collection1/, dataDir=./org.apache.solr.cloud.SyncSliceTest-1348352728005/jetty4/
[junit4:junit4]   2> 11867 T260 oasc.JmxMonitoredMap.<init> JMX monitoring is enabled. Adding Solr mbeans to JMX Server: com.sun.jmx.mbeanserver.JmxMBeanServer@5a92668c
[junit4:junit4]   2> 11868 T260 oasc.SolrCore.getNewIndexDir WARNING New index directory detected: old=null new=./org.apache.solr.cloud.SyncSliceTest-1348352728005/jetty4/index/
[junit4:junit4]   2> 11869 T260 oasc.SolrCore.initIndex WARNING [collection1] Solr index directory './org.apache.solr.cloud.SyncSliceTest-1348352728005/jetty4/index' doesn't exist. Creating new index...
[junit4:junit4]   2> 11870 T260 oasc.CachingDirectoryFactory.get return new directory for /usr/home/hudson/hudson-slave/workspace/Lucene-Solr-Tests-trunk-Java6/solr/build/solr-core/test/J1/./org.apache.solr.cloud.SyncSliceTest-1348352728005/jetty4/index forceNew:false
[junit4:junit4]   2> 11876 T260 oasc.SolrDeletionPolicy.onCommit SolrDeletionPolicy.onCommit: commits:num=1
[junit4:junit4]   2> 		commit{dir=/usr/home/hudson/hudson-slave/workspace/Lucene-Solr-Tests-trunk-Java6/solr/build/solr-core/test/J1/org.apache.solr.cloud.SyncSliceTest-1348352728005/jetty4/index,segFN=segments_1,generation=1,filenames=[segments_1]
[junit4:junit4]   2> 11876 T260 oasc.SolrDeletionPolicy.updateCommits newest commit = 1
[junit4:junit4]   2> 11877 T260 oasc.SolrCore.initWriters created xml: solr.XMLResponseWriter
[junit4:junit4]   2> 11880 T260 oasup.UpdateRequestProcessorChain.init inserting DistributedUpdateProcessorFactory into updateRequestProcessorChain "dedupe"
[junit4:junit4]   2> 11880 T260 oasup.UpdateRequestProcessorChain.init inserting DistributedUpdateProcessorFactory into updateRequestProcessorChain "dedupe-allfields"
[junit4:junit4]   2> 11881 T260 oasup.UpdateRequestProcessorChain.init inserting DistributedUpdateProcessorFactory into updateRequestProcessorChain "stored_sig"
[junit4:junit4]   2> 11881 T260 oasup.UpdateRequestProcessorChain.init inserting DistributedUpdateProcessorFactory into updateRequestProcessorChain "uniq-fields"
[junit4:junit4]   2> 11882 T260 oasup.UpdateRequestProcessorChain.init inserting DistributedUpdateProcessorFactory into updateRequestProcessorChain "distrib-dup-test-chain-implicit"
[junit4:junit4]   2> 11883 T260 oasc.RequestHandlers.initHandlersFromConfig adding lazy requestHandler: solr.ReplicationHandler
[junit4:junit4]   2> 11883 T260 oasc.RequestHandlers.initHandlersFromConfig created /replication: solr.ReplicationHandler
[junit4:junit4]   2> 11884 T260 oasc.RequestHandlers.initHandlersFromConfig created standard: solr.StandardRequestHandler
[junit4:junit4]   2> 11885 T260 oasc.RequestHandlers.initHandlersFromConfig created /get: solr.RealTimeGetHandler
[junit4:junit4]   2> 11885 T260 oasc.RequestHandlers.initHandlersFromConfig created dismax: solr.SearchHandler
[junit4:junit4]   2> 11886 T260 oasc.RequestHandlers.initHandlersFromConfig created mock: org.apache.solr.core.MockQuerySenderListenerReqHandler
[junit4:junit4]   2> 11887 T260 oasc.RequestHandlers.initHandlersFromConfig created /admin/: org.apache.solr.handler.admin.AdminHandlers
[junit4:junit4]   2> 11888 T260 oasc.RequestHandlers.initHandlersFromConfig created defaults: solr.StandardRequestHandler
[junit4:junit4]   2> 11888 T260 oasc.RequestHandlers.initHandlersFromConfig adding lazy requestHandler: solr.StandardRequestHandler
[junit4:junit4]   2> 11889 T260 oasc.RequestHandlers.initHandlersFromConfig created lazy: solr.StandardRequestHandler
[junit4:junit4]   2> 11889 T260 oasc.RequestHandlers.initHandlersFromConfig created /update: solr.UpdateRequestHandler
[junit4:junit4]   2> 11890 T260 oasc.RequestHandlers.initHandlersFromConfig created /terms: org.apache.solr.handler.component.SearchHandler
[junit4:junit4]   2> 11891 T260 oasc.RequestHandlers.initHandlersFromConfig created spellCheckCompRH: org.apache.solr.handler.component.SearchHandler
[junit4:junit4]   2> 11891 T260 oasc.RequestHandlers.initHandlersFromConfig created spellCheckCompRH_Direct: org.apache.solr.handler.component.SearchHandler
[junit4:junit4]   2> 11892 T260 oasc.RequestHandlers.initHandlersFromConfig created spellCheckWithWordbreak: org.apache.solr.handler.component.SearchHandler
[junit4:junit4]   2> 11893 T260 oasc.RequestHandlers.initHandlersFromConfig created spellCheckWithWordbreak_Direct: org.apache.solr.handler.component.SearchHandler
[junit4:junit4]   2> 11894 T260 oasc.RequestHandlers.initHandlersFromConfig created spellCheckCompRH1: org.apache.solr.handler.component.SearchHandler
[junit4:junit4]   2> 11894 T260 oasc.RequestHandlers.initHandlersFromConfig created tvrh: org.apache.solr.handler.component.SearchHandler
[junit4:junit4]   2> 11895 T260 oasc.RequestHandlers.initHandlersFromConfig created /mlt: solr.MoreLikeThisHandler
[junit4:junit4]   2> 11896 T260 oasc.RequestHandlers.initHandlersFromConfig created /debug/dump: solr.DumpRequestHandler
[junit4:junit4]   2> 11900 T260 oashl.XMLLoader.init xsltCacheLifetimeSeconds=60
[junit4:junit4]   2> 11907 T260 oasc.SolrCore.initDeprecatedSupport WARNING solrconfig.xml uses deprecated <admin/gettableFiles>, Please update your config to use the ShowFileRequestHandler.
[junit4:junit4]   2> 11908 T260 oasc.SolrCore.initDeprecatedSupport WARNING adding ShowFileRequestHandler with hidden files: [SCHEMA.XML, OLD_SYNONYMS.TXT, STOPWORDS.TXT, PROTWORDS.TXT, OPEN-EXCHANGE-RATES.JSON, SYNONYMS.TXT, CURRENCY.XML, MAPPING-ISOLATIN1ACCENT.TXT]
[junit4:junit4]   2> 11912 T260 oass.SolrIndexSearcher.<init> Opening Searcher@458a2ccf main
[junit4:junit4]   2> 11914 T260 oasu.CommitTracker.<init> Hard AutoCommit: disabled
[junit4:junit4]   2> 11914 T260 oasu.CommitTracker.<init> Soft AutoCommit: disabled
[junit4:junit4]   2> 11915 T260 oashc.SpellCheckComponent.inform Initializing spell checkers
[junit4:junit4]   2> 11924 T260 oass.DirectSolrSpellChecker.init init: {name=direct,classname=DirectSolrSpellChecker,field=lowerfilt,minQueryLength=3}
[junit4:junit4]   2> 11984 T335 oasc.SolrCore.registerSearcher [collection1] Registered new searcher Searcher@458a2ccf main{StandardDirectoryReader(segments_1:1)}
[junit4:junit4]   2> 12194 T281 oascc.ZkStateReader.updateClusterState Updating cloud state from ZooKeeper... 
[junit4:junit4]   2> 12209 T320 oascc.ZkStateReader$2.process A cluster state change has occurred - updating...
[junit4:junit4]   2> 12209 T280 oascc.ZkStateReader$2.process A cluster state change has occurred - updating...
[junit4:junit4]   2> 12209 T306 oascc.ZkStateReader$2.process A cluster state change has occurred - updating...
[junit4:junit4]   2> 12209 T334 oascc.ZkStateReader$2.process A cluster state change has occurred - updating...
[junit4:junit4]   2> 12209 T294 oascc.ZkStateReader$2.process A cluster state change has occurred - updating...
[junit4:junit4]   2> 12498 T260 oasc.CoreContainer.register registering core: collection1
[junit4:junit4]   2> 12498 T260 oasc.ZkController.register Register shard - core:collection1 address:http://127.0.0.1:29775/solr shardId:shard1
[junit4:junit4]   2> 12507 T260 oasc.ZkController.register We are http://127.0.0.1:29775/solr/collection1/ and leader is http://127.0.0.1:29763/solr/collection1/
[junit4:junit4]   2> 12508 T260 oasc.ZkController.register No LogReplay needed for core=collection1 baseURL=http://127.0.0.1:29775/solr
[junit4:junit4]   2> 12508 T260 oasc.ZkController.checkRecovery Core needs to recover:collection1
[junit4:junit4]   2> 12508 T260 oasu.DefaultSolrCoreState.doRecovery Running recovery - first canceling any ongoing recovery
[junit4:junit4]   2> ASYNC  NEW_CORE C28 name=collection1 org.apache.solr.core.SolrCore@224b1370 url=http://127.0.0.1:29775/solr/collection1 node=127.0.0.1:29775_solr
[junit4:junit4]   2> 12509 T336 C28 P29775 oasc.RecoveryStrategy.run Starting recovery process.  core=collection1 recoveringAfterStartup=true
[junit4:junit4]   2> 12510 T336 C28 P29775 oasc.RecoveryStrategy.doRecovery ###### startupVersions=[]
[junit4:junit4]   2> 12510 T260 oascc.ZkStateReader.updateClusterState Updating cloud state from ZooKeeper... 
[junit4:junit4]   2> 12516 T336 C28 P29775 oasc.RecoveryStrategy.doRecovery Attempting to PeerSync from http://127.0.0.1:29763/solr/collection1/ core=collection1 - recoveringAfterStartup=true
[junit4:junit4]   2> 12516 T336 C28 P29775 oasu.PeerSync.sync PeerSync: core=collection1 url=http://127.0.0.1:29775/solr START replicas=[http://127.0.0.1:29763/solr/collection1/] nUpdates=100
[junit4:junit4]   2> 12516 T260 oass.SolrDispatchFilter.init user.dir=/usr/home/hudson/hudson-slave/workspace/Lucene-Solr-Tests-trunk-Java6/solr/build/solr-core/test/J1
[junit4:junit4]   2> 12517 T336 C28 P29775 oasu.PeerSync.sync WARNING no frame of reference to tell of we've missed updates
[junit4:junit4]   2> 12517 T260 oass.SolrDispatchFilter.init SolrDispatchFilter.init() done
[junit4:junit4]   2> 12517 T336 C28 P29775 oasc.RecoveryStrategy.doRecovery PeerSync Recovery was not successful - trying replication. core=collection1
[junit4:junit4]   2> 12518 T336 C28 P29775 oasc.RecoveryStrategy.doRecovery Starting Replication Recovery. core=collection1
[junit4:junit4]   2> 12518 T260 oascsi.HttpClientUtil.createClient Creating new http client, config:maxConnections=128&maxConnectionsPerHost=32&followRedirects=false
[junit4:junit4]   2> 12518 T336 C28 P29775 oascsi.HttpClientUtil.createClient Creating new http client, config:maxConnections=128&maxConnectionsPerHost=32&followRedirects=false
[junit4:junit4]   2> 12519 T286 C26 P29763 REQ /get {distrib=false&qt=/get&wt=javabin&version=2&getVersions=100} status=0 QTime=0 
[junit4:junit4]   2> 12544 T260 oaz.ZooKeeper.<init> Initiating client connection, connectString=127.0.0.1:29756/solr sessionTimeout=10000 watcher=org.apache.solr.common.cloud.ConnectionManager@109c4289
[junit4:junit4]   2> 12545 T338 oaz.ClientCnxn$SendThread.startConnect Opening socket connection to server /127.0.0.1:29756
[junit4:junit4]   2> 12545 T260 oascc.ConnectionManager.waitForConnected Waiting for client to connect to ZooKeeper
[junit4:junit4]   2> 12546 T338 oaz.ClientCnxn$SendThread.primeConnection Socket connection established to localhost/127.0.0.1:29756, initiating session
[junit4:junit4]   2> 12546 T262 oazs.NIOServerCnxn$Factory.run Accepted socket connection from /140.211.11.196:29781
[junit4:junit4]   2> 12547 T262 oazs.NIOServerCnxn.readConnectRequest Client attempting to establish new session at /140.211.11.196:29781
[junit4:junit4]   2> 12562 T264 oazs.NIOServerCnxn.finishSessionInit Established session 0x139f015dda50007 with negotiated timeout 10000 for client /140.211.11.196:29781
[junit4:junit4]   2> 12563 T338 oaz.ClientCnxn$SendThread.readConnectResult Session establishment complete on server localhost/127.0.0.1:29756, sessionid = 0x139f015dda50007, negotiated timeout = 10000
[junit4:junit4]   2> 12563 T339 oascc.ConnectionManager.process Watcher org.apache.solr.common.cloud.ConnectionManager@109c4289 name:ZooKeeperConnection Watcher:127.0.0.1:29756/solr got event WatchedEvent state:SyncConnected type:None path:null path:null type:None
[junit4:junit4]   2> 12563 T260 oascc.ConnectionManager.waitForConnected Client is connected to ZooKeeper
[junit4:junit4]   2> 12565 T260 oascc.ZkStateReader.createClusterStateWatchersAndUpdate Updating cluster state from ZooKeeper... 
[junit4:junit4]   2> 12567 T260 oasc.ChaosMonkey.monkeyLog monkey: init - expire sessions:true cause connection loss:true
[junit4:junit4]   2> 12568 T260 oascsi.HttpClientUtil.createClient Creating new http client, config:
[junit4:junit4]   2> 12585 T260 oascc.ZkStateReader.updateClusterState Updating cloud state from ZooKeeper... 
[junit4:junit4]   2> 12588 T260 oasc.AbstractFullDistribZkTestBase.waitForThingsToLevelOut Wait for recoveries to finish - wait 15 for each attempt
[junit4:junit4]   2> 12588 T260 oasc.AbstractDistribZkTestBase.waitForRecoveriesToFinish Wait for recoveries to finish - collection: collection1 failOnTimeout:true timeout (sec):15
[junit4:junit4]   2> 12590 T260 oascc.ZkStateReader.updateClusterState Updating cloud state from ZooKeeper... 
[junit4:junit4]   2> 12715 T281 oascc.ZkStateReader.updateClusterState Updating cloud state from ZooKeeper... 
[junit4:junit4]   2> 12725 T320 oascc.ZkStateReader$2.process A cluster state change has occurred - updating...
[junit4:junit4]   2> 12725 T339 oascc.ZkStateReader$2.process A cluster state change has occurred - updating...
[junit4:junit4]   2> 12725 T334 oascc.ZkStateReader$2.process A cluster state change has occurred - updating...
[junit4:junit4]   2> 12725 T306 oascc.ZkStateReader$2.process A cluster state change has occurred - updating...
[junit4:junit4]   2> 12725 T294 oascc.ZkStateReader$2.process A cluster state change has occurred - updating...
[junit4:junit4]   2> 12725 T280 oascc.ZkStateReader$2.process A cluster state change has occurred - updating...
[junit4:junit4]   2>  C27_STATE=coll:collection1 core:collection1 props:{shard=shard1, roles=null, state=recovering, core=collection1, collection=collection1, node_name=127.0.0.1:29770_solr, base_url=http://127.0.0.1:29770/solr}
[junit4:junit4]   2> 13398 T322 C27 P29770 oasc.RecoveryStrategy.doRecovery Begin buffering updates. core=collection1
[junit4:junit4]   2> 13398 T322 C27 P29770 oasu.UpdateLog.bufferUpdates Starting to buffer updates. FSUpdateLog{state=ACTIVE, tlog=null}
[junit4:junit4]   2> 13399 T322 C27 P29770 oasc.RecoveryStrategy.replicate Attempting to replicate from http://127.0.0.1:29763/solr/collection1/. core=collection1
[junit4:junit4]   2> 13399 T322 C27 P29770 oascsi.HttpClientUtil.createClient Creating new http client, config:maxConnections=128&maxConnectionsPerHost=32&followRedirects=false
[junit4:junit4]   2> 13411 T292 C26 P29763 oasu.DirectUpdateHandler2.commit start commit{flags=0,_version_=0,optimize=false,openSearcher=true,waitSearcher=true,expungeDeletes=false,softCommit=false}
[junit4:junit4]   2> 13414 T292 C26 P29763 oass.SolrIndexSearcher.<init> Opening Searcher@41480ec1 main
[junit4:junit4]   2> 13415 T292 C26 P29763 oasu.DirectUpdateHandler2.commit end_commit_flush
[junit4:junit4]   2> 13416 T295 oasc.SolrCore.registerSearcher [collection1] Registered new searcher Searcher@41480ec1 main{StandardDirectoryReader(segments_1:1)}
[junit4:junit4]   2> 13417 T292 C26 P29763 /update {waitSearcher=true&commit=true&commit_end_point=true&wt=javabin&softCommit=false&version=2} {commit=} 0 7
[junit4:junit4]   2> 13418 T322 C27 P29770 oash.ReplicationHandler.inform Commits will be reserved for  10000
[junit4:junit4]   2> 13418 T322 C27 P29770 oash.SnapPuller.<init>  No value set for 'pollInterval'. Timer Task not started.
[junit4:junit4]   2> 13421 T290 C26 P29763 REQ /replication {command=indexversion&wt=javabin&qt=/replication&version=2} status=0 QTime=0 
[junit4:junit4]   2> 13427 T322 C27 P29770 oasc.SolrDeletionPolicy.onInit SolrDeletionPolicy.onInit: commits:num=1
[junit4:junit4]   2> 		commit{dir=/usr/home/hudson/hudson-slave/workspace/Lucene-Solr-Tests-trunk-Java6/solr/build/solr-core/test/J1/org.apache.solr.cloud.SyncSliceTest-1348352728005/jetty3/index,segFN=segments_1,generation=1,filenames=[segments_1]
[junit4:junit4]   2> 13427 T322 C27 P29770 oasc.SolrDeletionPolicy.updateCommits newest commit = 1
[junit4:junit4]   2> 13428 T322 C27 P29770 oasu.DirectUpdateHandler2.commit start commit{flags=0,_version_=0,optimize=false,openSearcher=true,waitSearcher=true,expungeDeletes=false,softCommit=false}
[junit4:junit4]   2> 13446 T322 C27 P29770 oasc.SolrDeletionPolicy.onCommit SolrDeletionPolicy.onCommit: commits:num=2
[junit4:junit4]   2> 		commit{dir=/usr/home/hudson/hudson-slave/workspace/Lucene-Solr-Tests-trunk-Java6/solr/build/solr-core/test/J1/org.apache.solr.cloud.SyncSliceTest-1348352728005/jetty3/index,segFN=segments_1,generation=1,filenames=[segments_1]
[junit4:junit4]   2> 		commit{dir=/usr/home/hudson/hudson-slave/workspace/Lucene-Solr-Tests-trunk-Java6/solr/build/solr-core/test/J1/org.apache.solr.cloud.SyncSliceTest-1348352728005/jetty3/index,segFN=segments_2,generation=2,filenames=[segments_2]
[junit4:junit4]   2> 13446 T322 C27 P29770 oasc.SolrDeletionPolicy.updateCommits newest commit = 2
[junit4:junit4]   2> 13449 T322 C27 P29770 oass.SolrIndexSearcher.<init> Opening Searcher@5a2a7673 main
[junit4:junit4]   2> 13450 T322 C27 P29770 oasu.DirectUpdateHandler2.commit end_commit_flush
[junit4:junit4]   2> 13452 T321 oasc.SolrCore.registerSearcher [collection1] Registered new searcher Searcher@5a2a7673 main{StandardDirectoryReader(segments_2:2)}
[junit4:junit4]   2> 13452 T322 C27 P29770 oasc.RecoveryStrategy.replay No replay needed. core=collection1
[junit4:junit4]   2> 13452 T322 C27 P29770 oasc.RecoveryStrategy.doRecovery Replication Recovery was successful - registering as Active. core=collection1
[junit4:junit4]   2> 13454 T322 C27 P29770 oasc.RecoveryStrategy.doRecovery Finished recovery process. core=collection1
[junit4:junit4]   2> 13592 T260 oascc.ZkStateReader.updateClusterState Updating cloud state from ZooKeeper... 
[junit4:junit4]   2> 13733 T281 oascc.ZkStateReader.updateClusterState Updating cloud state from ZooKeeper... 
[junit4:junit4]   2> 13762 T339 oascc.ZkStateReader$2.process A cluster state change has occurred - updating...
[junit4:junit4]   2> 13763 T306 oascc.ZkStateReader$2.process A cluster state change has occurred - updating...
[junit4:junit4]   2> 13763 T334 oascc.ZkStateReader$2.process A cluster state change has occurred - updating...
[junit4:junit4]   2> 13763 T280 oascc.ZkStateReader$2.process A cluster state change has occurred - updating...
[junit4:junit4]   2> 13762 T320 oascc.ZkStateReader$2.process A cluster state change has occurred - updating...
[junit4:junit4]   2> 13762 T294 oascc.ZkStateReader$2.process A cluster state change has occurred - updating...
[junit4:junit4]   2> 14595 T260 oascc.ZkStateReader.updateClusterState Updating cloud state from ZooKeeper... 
[junit4:junit4]   2>  C28_STATE=coll:collection1 core:collection1 props:{shard=shard1, roles=null, state=recovering, core=collection1, collection=collection1, node_name=127.0.0.1:29775_solr, base_url=http://127.0.0.1:29775/solr}
[junit4:junit4]   2> 15543 T336 C28 P29775 oasc.RecoveryStrategy.doRecovery Begin buffering updates. core=collection1
[junit4:junit4]   2> 15543 T336 C28 P29775 oasu.UpdateLog.bufferUpdates Starting to buffer updates. FSUpdateLog{state=ACTIVE, tlog=null}
[junit4:junit4]   2> 15543 T336 C28 P29775 oasc.RecoveryStrategy.replicate Attempting to replicate from http://127.0.0.1:29763/solr/collection1/. core=collection1
[junit4:junit4]   2> 15543 T336 C28 P29775 oascsi.HttpClientUtil.createClient Creating new http client, config:maxConnections=128&maxConnectionsPerHost=32&followRedirects=false
[junit4:junit4]   2> 15561 T287 C26 P29763 oasu.DirectUpdateHandler2.commit start commit{flags=0,_version_=0,optimize=false,openSearcher=true,waitSearcher=true,expungeDeletes=false,softCommit=false}
[junit4:junit4]   2> 15564 T287 C26 P29763 oass.SolrIndexSearcher.<init> Opening Searcher@73927025 main
[junit4:junit4]   2> 15565 T287 C26 P29763 oasu.DirectUpdateHandler2.commit end_commit_flush
[junit4:junit4]   2> 15567 T295 oasc.SolrCore.registerSearcher [collection1] Registered new searcher Searcher@73927025 main{StandardDirectoryReader(segments_1:1)}
[junit4:junit4]   2> 15567 T287 C26 P29763 /update {waitSearcher=true&commit=true&commit_end_point=true&wt=javabin&softCommit=false&version=2} {commit=} 0 6
[junit4:junit4]   2> 15568 T336 C28 P29775 oash.ReplicationHandler.inform Commits will be reserved for  10000
[junit4:junit4]   2> 15568 T336 C28 P29775 oash.SnapPuller.<init>  No value set for 'pollInterval'. Timer Task not started.
[junit4:junit4]   2> 15571 T290 C26 P29763 REQ /replication {command=indexversion&wt=javabin&qt=/replication&version=2} status=0 QTime=0 
[junit4:junit4]   2> 15576 T336 C28 P29775 oasc.SolrDeletionPolicy.onInit SolrDeletionPolicy.onInit: commits:num=1
[junit4:junit4]   2> 		commit{dir=/usr/home/hudson/hudson-slave/workspace/Lucene-Solr-Tests-trunk-Java6/solr/build/solr-core/test/J1/org.apache.solr.cloud.SyncSliceTest-1348352728005/jetty4/index,segFN=segments_1,generation=1,filenames=[segments_1]
[junit4:junit4]   2> 15576 T336 C28 P29775 oasc.SolrDeletionPolicy.updateCommits newest commit = 1
[junit4:junit4]   2> 15577 T336 C28 P29775 oasu.DirectUpdateHandler2.commit start commit{flags=0,_version_=0,optimize=false,openSearcher=true,waitSearcher=true,expungeDeletes=false,softCommit=false}
[junit4:junit4]   2> 15581 T336 C28 P29775 oasc.SolrDeletionPolicy.onCommit SolrDeletionPolicy.onCommit: commits:num=2
[junit4:junit4]   2> 		commit{dir=/usr/home/hudson/hudson-slave/workspace/Lucene-Solr-Tests-trunk-Java6/solr/build/solr-core/test/J1/org.apache.solr.cloud.SyncSliceTest-1348352728005/jetty4/index,segFN=segments_1,generation=1,filenames=[segments_1]
[junit4:junit4]   2> 		commit{dir=/usr/home/hudson/hudson-slave/workspace/Lucene-Solr-Tests-trunk-Java6/solr/build/solr-core/test/J1/org.apache.solr.cloud.SyncSliceTest-1348352728005/jetty4/index,segFN=segments_2,generation=2,filenames=[segments_2]
[junit4:junit4]   2> 15581 T336 C28 P29775 oasc.SolrDeletionPolicy.updateCommits newest commit = 2
[junit4:junit4]   2> 15585 T336 C28 P29775 oass.SolrIndexSearcher.<init> Opening Searcher@672f151d main
[junit4:junit4]   2> 15585 T336 C28 P29775 oasu.DirectUpdateHandler2.commit end_commit_flush
[junit4:junit4]   2> 15587 T335 oasc.SolrCore.registerSearcher [collection1] Registered new searcher Searcher@672f151d main{StandardDirectoryReader(segments_2:2)}
[junit4:junit4]   2> 15587 T336 C28 P29775 oasc.RecoveryStrategy.replay No replay needed. core=collection1
[junit4:junit4]   2> 15588 T336 C28 P29775 oasc.RecoveryStrategy.doRecovery Replication Recovery was successful - registering as Active. core=collection1
[junit4:junit4]   2> 15590 T336 C28 P29775 oasc.RecoveryStrategy.doRecovery Finished recovery process. core=collection1
[junit4:junit4]   2> 15598 T260 oascc.ZkStateReader.updateClusterState Updating cloud state from ZooKeeper... 
[junit4:junit4]   2> 15779 T281 oascc.ZkStateReader.updateClusterState Updating cloud state from ZooKeeper... 
[junit4:junit4]   2> 15863 T339 oascc.ZkStateReader$2.process A cluster state change has occurred - updating...
[junit4:junit4]   2> 15864 T294 oascc.ZkStateReader$2.process A cluster state change has occurred - updating...
[junit4:junit4]   2> 15864 T306 oascc.ZkStateReader$2.process A cluster state change has occurred - updating...
[junit4:junit4]   2> 15864 T334 oascc.ZkStateReader$2.process A cluster state change has occurred - updating...
[junit4:junit4]   2> 15864 T280 oascc.ZkStateReader$2.process A cluster state change has occurred - updating...
[junit4:junit4]   2> 15864 T320 oascc.ZkStateReader$2.process A cluster state change has occurred - updating...
[junit4:junit4]   2> 16600 T260 oascc.ZkStateReader.updateClusterState Updating cloud state from ZooKeeper... 
[junit4:junit4]   2> ASYNC  NEW_CORE C29 name=collection1 org.apache.solr.core.SolrCore@2c6749fe url=http://127.0.0.1:29760/solr/collection1 node=127.0.0.1:29760_solr
[junit4:junit4]   2> 16613 T272 C29 P29760 oasu.DirectUpdateHandler2.commit start commit{flags=0,_version_=0,optimize=false,openSearcher=true,waitSearcher=true,expungeDeletes=false,softCommit=false}
[junit4:junit4]   2> 16618 T272 C29 P29760 oasc.SolrDeletionPolicy.onInit SolrDeletionPolicy.onInit: commits:num=1
[junit4:junit4]   2> 		commit{dir=/usr/home/hudson/hudson-slave/workspace/Lucene-Solr-Tests-trunk-Java6/solr/build/solr-core/test/J1/org.apache.solr.cloud.SyncSliceTest-1348352728005/control/data/index,segFN=segments_1,generation=1,filenames=[segments_1]
[junit4:junit4]   2> 16618 T272 C29 P29760 oasc.SolrDeletionPolicy.updateCommits newest commit = 1
[junit4:junit4]   2> 16620 T272 C29 P29760 oass.SolrIndexSearcher.<init> Opening Searcher@40829a81 main
[junit4:junit4]   2> 16620 T272 C29 P29760 oasu.DirectUpdateHandler2.commit end_commit_flush
[junit4:junit4]   2> 16622 T283 oasc.SolrCore.registerSearcher [collection1] Registered new searcher Searcher@40829a81 main{StandardDirectoryReader(segments_1:1)}
[junit4:junit4]   2> 16623 T272 C29 P29760 /update {waitSearcher=true&wt=javabin&commit=true&softCommit=false&version=2} {commit=} 0 11
[junit4:junit4]   2> 16623 T260 oaz.ZooKeeper.<init> Initiating client connection, connectString=127.0.0.1:29756/solr sessionTimeout=10000 watcher=org.apache.solr.common.cloud.ConnectionManager@3e6dac3d
[junit4:junit4]   2> 16624 T340 oaz.ClientCnxn$SendThread.startConnect Opening socket connection to server /127.0.0.1:29756
[junit4:junit4]   2> 16624 T260 oascc.ConnectionManager.waitForConnected Waiting for client to connect to ZooKeeper
[junit4:junit4]   2> 16625 T340 oaz.ClientCnxn$SendThread.primeConnection Socket connection established to localhost/127.0.0.1:29756, initiating session
[junit4:junit4]   2> 16625 T262 oazs.NIOServerCnxn$Factory.run Accepted socket connection from /140.211.11.196:29787
[junit4:junit4]   2> 16626 T262 oazs.NIOServerCnxn.readConnectRequest Client attempting to establish new session at /140.211.11.196:29787
[junit4:junit4]   2> 16628 T264 oazs.NIOServerCnxn.finishSessionInit Established session 0x139f015dda50008 with negotiated timeout 10000 for client /140.211.11.196:29787
[junit4:junit4]   2> 16628 T340 oaz.ClientCnxn$SendThread.readConnectResult Session establishment complete on server localhost/127.0.0.1:29756, sessionid = 0x139f015dda50008, negotiated timeout = 10000
[junit4:junit4]   2> 16628 T341 oascc.ConnectionManager.process Watcher org.apache.solr.common.cloud.ConnectionManager@3e6dac3d name:ZooKeeperConnection Watcher:127.0.0.1:29756/solr got event WatchedEvent state:SyncConnected type:None path:null path:null type:None
[junit4:junit4]   2> 16629 T260 oascc.ConnectionManager.waitForConnected Client is connected to ZooKeeper
[junit4:junit4]   2> 16630 T260 oascc.ZkStateReader.createClusterStateWatchersAndUpdate Updating cluster state from ZooKeeper... 
[junit4:junit4]   2> 16633 T288 C26 P29763 oasu.DirectUpdateHandler2.commit start commit{flags=0,_version_=0,optimize=false,openSearcher=true,waitSearcher=true,expungeDeletes=false,softCommit=false}
[junit4:junit4]   2> 16637 T288 C26 P29763 oass.SolrIndexSearcher.<init> Opening Searcher@a8af4b4 main
[junit4:junit4]   2> 16638 T288 C26 P29763 oasu.DirectUpdateHandler2.commit end_commit_flush
[junit4:junit4]   2> 16639 T295 oasc.SolrCore.registerSearcher [collection1] Registered new searcher Searcher@a8af4b4 main{StandardDirectoryReader(segments_1:1)}
[junit4:junit4]   2> 16663 T288 C26 P29763 oasu.SolrCmdDistributor.distribCommit Distrib commit to:[StdNode: http://127.0.0.1:29766/solr/collection1/, StdNode: http://127.0.0.1:29770/solr/collection1/, StdNode: http://127.0.0.1:29775/solr/collection1/]
[junit4:junit4]   2>  C27_STATE=coll:collection1 core:collection1 props:{shard=shard1, roles=null, state=active, core=collection1, collection=collection1, node_name=127.0.0.1:29770_solr, base_url=http://127.0.0.1:29770/solr}
[junit4:junit4]   2> 16698 T312 C27 P29770 oasu.DirectUpdateHandler2.commit start commit{flags=0,_version_=0,optimize=false,openSearcher=true,waitSearcher=true,expungeDeletes=false,softCommit=false}
[junit4:junit4]   2>  C28_STATE=coll:collection1 core:collection1 props:{shard=shard1, roles=null, state=active, core=collection1, collection=collection1, node_name=127.0.0.1:29775_solr, base_url=http://127.0.0.1:29775/solr}
[junit4:junit4]   2> 16698 T326 C28 P29775 oasu.DirectUpdateHandler2.commit start commit{flags=0,_version_=0,optimize=false,openSearcher=true,waitSearcher=true,expungeDeletes=false,softCommit=false}
[junit4:junit4]   2>  C25_STATE=coll:collection1 core:collection1 props:{shard=shard1, roles=null, state=active, core=collection1, collection=collection1, node_name=127.0.0.1:29766_solr, base_url=http://127.0.0.1:29766/solr}
[junit4:junit4]   2> 16698 T298 C25 P29766 oasu.DirectUpdateHandler2.commit start commit{flags=0,_version_=0,optimize=false,openSearcher=true,waitSearcher=true,expungeDeletes=false,softCommit=false}
[junit4:junit4]   2> 16701 T326 C28 P29775 oass.SolrIndexSearcher.<init> Opening Searcher@49f4493e main
[junit4:junit4]   2> 16702 T326 C28 P29775 oasu.DirectUpdateHandler2.commit end_commit_flush
[junit4:junit4]   2> 16702 T312 C27 P29770 oass.SolrIndexSearcher.<init> Opening Searcher@1b1f4efe main
[junit4:junit4]   2> 16703 T312 C27 P29770 oasu.DirectUpdateHandler2.commit end_commit_flush
[junit4:junit4]   2> 16703 T335 oasc.SolrCore.registerSearcher [collection1] Registered new searcher Searcher@49f4493e main{StandardDirectoryReader(segments_2:2)}
[junit4:junit4]   2> 16704 T298 C25 P29766 oass.SolrIndexSearcher.<init> Opening Searcher@c4437d3 main
[junit4:junit4]   2> 16704 T326 C28 P29775 /update {waitSearcher=true&commit=true&wt=javabin&commit_end_point=true&expungeDeletes=false&softCommit=false&version=2} {commit=} 0 6
[junit4:junit4]   2> 16704 T298 C25 P29766 oasu.DirectUpdateHandler2.commit end_commit_flush
[junit4:junit4]   2> 16704 T321 oasc.SolrCore.registerSearcher [collection1] Registered new searcher Searcher@1b1f4efe main{StandardDirectoryReader(segments_2:2)}
[junit4:junit4]   2> 16705 T312 C27 P29770 /update {waitSearcher=true&commit=true&wt=javabin&commit_end_point=true&expungeDeletes=false&softCommit=false&version=2} {commit=} 0 8
[junit4:junit4]   2> 16706 T307 oasc.SolrCore.registerSearcher [collection1] Registered new searcher Searcher@c4437d3 main{StandardDirectoryReader(segments_2:2)}
[junit4:junit4]   2> 16706 T298 C25 P29766 /update {waitSearcher=true&commit=true&wt=javabin&commit_end_point=true&expungeDeletes=false&softCommit=false&version=2} {commit=} 0 8
[junit4:junit4]   2> 16707 T288 C26 P29763 /update {waitSearcher=true&wt=javabin&commit=true&softCommit=false&version=2} {commit=} 0 74
[junit4:junit4]   2> 16708 T260 oascc.ZkStateReader.updateClusterState Updating cloud state from ZooKeeper... 
[junit4:junit4]   2> 16711 T289 C26 P29763 REQ /select {distrib=false&wt=javabin&q=*:*&version=2} hits=0 status=0 QTime=0 
[junit4:junit4]   2> 16714 T299 C25 P29766 REQ /select {distrib=false&wt=javabin&q=*:*&version=2} hits=0 status=0 QTime=1 
[junit4:junit4]   2> 16716 T313 C27 P29770 REQ /select {distrib=false&wt=javabin&q=*:*&version=2} hits=0 status=0 QTime=1 
[junit4:junit4]   2> 16719 T327 C28 P29775 REQ /select {distrib=false&wt=javabin&q=*:*&version=2} hits=0 status=0 QTime=1 
[junit4:junit4]   2> 18790 T272 C29 P29760 oass.SolrIndexSearcher.<init> Opening Searcher@13197df2 realtime
[junit4:junit4]   2> 18794 T272 C29 P29760 /update {wt=javabin&version=2} {deleteByQuery=*:* (-1413850329755156480)} 0 72
[junit4:junit4]   2> 18799 T288 C26 P29763 oass.SolrIndexSearcher.<init> Opening Searcher@2c578bfa realtime
[junit4:junit4]   2> 18808 T326 C28 P29775 oass.SolrIndexSearcher.<init> Opening Searcher@2609990d realtime
[junit4:junit4]   2> 18808 T312 C27 P29770 oass.SolrIndexSearcher.<init> Opening Searcher@4194e3ee realtime
[junit4:junit4]   2> 18809 T326 C28 P29775 REQ /update {update.distrib=FROMLEADER&_version_=-1413850329826459648&update.from=http://127.0.0.1:29763/solr/collection1/&wt=javabin&version=2} status=0 QTime=2 
[junit4:junit4]   2> 18809 T312 C27 P29770 REQ /update {update.distrib=FROMLEADER&_version_=-1413850329826459648&update.from=http://127.0.0.1:29763/solr/collection1/&wt=javabin&version=2} status=0 QTime=2 
[junit4:junit4]   2> 18809 T298 C25 P29766 oass.SolrIndexSearcher.<init> Opening Searcher@6a62deab realtime
[junit4:junit4]   2> 18810 T298 C25 P29766 REQ /update {update.distrib=FROMLEADER&_version_=-1413850329826459648&update.from=http://127.0.0.1:29763/solr/collection1/&wt=javabin&version=2} status=0 QTime=2 
[junit4:junit4]   2> 18810 T288 C26 P29763 /update {wt=javabin&version=2} {deleteByQuery=*:* (-1413850329826459648)} 0 13
[junit4:junit4]   2> 18821 T272 C29 P29760 /update {wt=javabin&version=2} {add=[0 (1413850329848479744)]} 0 8
[junit4:junit4]   2> 18842 T312 C27 P29770 REQ /update {distrib.from=http://127.0.0.1:29763/solr/collection1/&update.distrib=FROMLEADER&wt=javabin&version=2} status=0 QTime=4 
[junit4:junit4]   2> 18842 T326 C28 P29775 REQ /update {distrib.from=http://127.0.0.1:29763/solr/collection1/&update.distrib=FROMLEADER&wt=javabin&version=2} status=0 QTime=4 
[junit4:junit4]   2> 18843 T298 C25 P29766 REQ /update {distrib.from=http://127.0.0.1:29763/solr/collection1/&update.distrib=FROMLEADER&wt=javabin&version=2} status=0 QTime=4 
[junit4:junit4]   2> 18843 T288 C26 P29763 /update {wt=javabin&version=2} {add=[0 (1413850329854771200)]} 0 19
[junit4:junit4]   2> 18847 T272 C29 P29760 /update {wt=javabin&version=2} {add=[1 (1413850329877839872)]} 0 1
[junit4:junit4]   2> 18854 T312 C27 P29770 REQ /update {distrib.from=http://127.0.0.1:29763/solr/collection1/&update.distrib=FROMLEADER&wt=javabin&version=2} status=0 QTime=1 
[junit4:junit4]   2> 18855 T298 C25 P29766 REQ /update {distrib.from=http://127.0.0.1:29763/solr/collection1/&update.distrib=FROMLEADER&wt=javabin&version=2} status=0 QTime=2 
[junit4:junit4]   2> 18855 T326 C28 P29775 REQ /update {distrib.from=http://127.0.0.1:29763/solr/collection1/&update.distrib=FROMLEADER&wt=javabin&version=2} status=0 QTime=1 
[junit4:junit4]   2> 18856 T288 C26 P29763 /update {wt=javabin&version=2} {add=[1 (1413850329882034176)]} 0 6
[junit4:junit4]   2> 18860 T272 C29 P29760 /update {wt=javabin&version=2} {add=[2 (1413850329891471360)]} 0 1
[junit4:junit4]   2> 18867 T312 C27 P29770 REQ /update {distrib.from=http://127.0.0.1:29763/solr/collection1/&update.distrib=FROMLEADER&test.distrib.skip.servers=http://127.0.0.1:29766/solr/collection1/&wt=javabin&version=2} status=0 QTime=1 
[junit4:junit4]   2> 18867 T326 C28 P29775 REQ /update {distrib.from=http://127.0.0.1:29763/solr/collection1/&update.distrib=FROMLEADER&test.distrib.skip.servers=http://127.0.0.1:29766/solr/collection1/&wt=javabin&version=2} status=0 QTime=1 
[junit4:junit4]   2> 18868 T288 C26 P29763 /update {test.distrib.skip.servers=http://127.0.0.1:29766/solr/collection1/&wt=javabin&version=2} {add=[2 (1413850329895665664)]} 0 5
[junit4:junit4]   2> 18872 T272 C29 P29760 /update {wt=javabin&version=2} {add=[3 (1413850329904054272)]} 0 1
[junit4:junit4]   2> 18879 T326 C28 P29775 REQ /update {distrib.from=http://127.0.0.1:29763/solr/collection1/&update.distrib=FROMLEADER&test.distrib.skip.servers=http://127.0.0.1:29766/solr/collection1/&test.distrib.skip.servers=http://127.0.0.1:29770/solr/collection1/&wt=javabin&version=2} status=0 QTime=1 
[junit4:junit4]   2> 18880 T288 C26 P29763 /update {test.distrib.skip.servers=http://127.0.0.1:29766/solr/collection1/&test.distrib.skip.servers=http://127.0.0.1:29770/solr/collection1/&wt=javabin&version=2} {add=[3 (1413850329908248576)]} 0 5
[junit4:junit4]   2> 18883 T272 C29 P29760 oasu.DirectUpdateHandler2.commit start commit{flags=0,_version_=0,optimize=false,openSearcher=true,waitSearcher=true,expungeDeletes=false,softCommit=false}
[junit4:junit4]   2> 18998 T272 C29 P29760 oasc.SolrDeletionPolicy.onCommit SolrDeletionPolicy.onCommit: commits:num=2
[junit4:junit4]   2> 		commit{dir=/usr/home/hudson/hudson-slave/workspace/Lucene-Solr-Tests-trunk-Java6/solr/build/solr-core/test/J1/org.apache.solr.cloud.SyncSliceTest-1348352728005/control/data/index,segFN=segments_1,generation=1,filenames=[segments_1]
[junit4:junit4]   2> 		commit{dir=/usr/home/hudson/hudson-slave/workspace/Lucene-Solr-Tests-trunk-Java6/solr/build/solr-core/test/J1/org.apache.solr.cloud.SyncSliceTest-1348352728005/control/data/index,segFN=segments_2,generation=2,filenames=[_0_Lucene40_0.tim, _0.fnm, _0_Pulsing40_0.tim, _0_nrm.cfs, _0_Pulsing40_0.prx, _0_Lucene40_0.prx, _0_Pulsing40_1.prx, _0_Pulsing40_0.frq, _0_Lucene40_0.tip, _0_Lucene40_0.frq, _0_Pulsing40_1.tip, _0_Pulsing40_1.frq, _0_Pulsing40_1.tim, _0_SimpleText_0.pst, _0_nrm.cfe, _0_Pulsing40_0.tip, segments_2, _0.fdx, _0.si, _0.fdt]
[junit4:junit4]   2> 18999 T272 C29 P29760 oasc.SolrDeletionPolicy.updateCommits newest commit = 2
[junit4:junit4]   2> 19010 T272 C29 P29760 oass.SolrIndexSearcher.<init> Opening Searcher@68fa8cf9 main
[junit4:junit4]   2> 19011 T272 C29 P29760 oasu.DirectUpdateHandler2.commit end_commit_flush
[junit4:junit4]   2> 19012 T283 oasc.SolrCore.registerSearcher [collection1] Registered new searcher Searcher@68fa8cf9 main{StandardDirectoryReader(segments_2:3:nrt _0(5.0):C4)}
[junit4:junit4]   2> 19013 T272 C29 P29760 /update {waitSearcher=true&wt=javabin&commit=true&softCommit=false&version=2} {commit=} 0 130
[junit4:junit4]   2> 19016 T288 C26 P29763 oasu.DirectUpdateHandler2.commit start commit{flags=0,_version_=0,optimize=false,openSearcher=true,waitSearcher=true,expungeDeletes=false,softCommit=false}
[junit4:junit4]   2> 19145 T288 C26 P29763 oasc.SolrDeletionPolicy.onCommit SolrDeletionPolicy.onCommit: commits:num=2
[junit4:junit4]   2> 		commit{dir=/usr/home/hudson/hudson-slave/workspace/Lucene-Solr-Tests-trunk-Java6/solr/build/solr-core/test/J1/org.apache.solr.cloud.SyncSliceTest-1348352728005/jetty1/index,segFN=segments_1,generation=1,filenames=[segments_1]
[junit4:junit4]   2> 		commit{dir=/usr/home/hudson/hudson-slave/workspace/Lucene-Solr-Tests-trunk-Java6/solr/build/solr-core/test/J1/org.apache.solr.cloud.SyncSliceTest-1348352728005/jetty1/index,segFN=segments_2,generation=2,filenames=[_0_Lucene40_0.tim, _0.fnm, _0_Pulsing40_0.tim, _0_nrm.cfs, _0_Pulsing40_0.prx, _0_Lucene40_0.prx, _0_Pulsing40_1.prx, _0_Pulsing40_0.frq, _0_Lucene40_0.tip, _0_Lucene40_0.frq, _0_Pulsing40_1.tip, _0_Pulsing40_1.frq, _0_Pulsing40_1.tim, _0_SimpleText_0.pst, _0_nrm.cfe, _0_Pulsing40_0.tip, segments_2, _0.fdx, _0.si, _0.fdt]
[junit4:junit4]   2> 19146 T288 C26 P29763 oasc.SolrDeletionPolicy.updateCommits newest commit = 2
[junit4:junit4]   2> 19156 T288 C26 P29763 oass.SolrIndexSearcher.<init> Opening Searcher@5c59782b main
[junit4:junit4]   2> 19157 T288 C26 P29763 oasu.DirectUpdateHandler2.commit end_commit_flush
[junit4:junit4]   2> 19158 T295 oasc.SolrCore.registerSearcher [collection1] Registered new searcher Searcher@5c59782b main{StandardDirectoryReader(segments_2:3:nrt _0(5.0):C4)}
[junit4:junit4]   2> 19159 T288 C26 P29763 oasu.SolrCmdDistributor.distribCommit Distrib commit to:[StdNode: http://127.0.0.1:29766/solr/collection1/, StdNode: http://127.0.0.1:29770/solr/collection1/, StdNode: http://127.0.0.1:29775/solr/collection1/]
[junit4:junit4]   2> 19162 T312 C27 P29770 oasu.DirectUpdateHandler2.commit start commit{flags=0,_version_=0,optimize=false,openSearcher=true,waitSearcher=true,expungeDeletes=false,softCommit=false}
[junit4:junit4]   2> 19162 T326 C28 P29775 oasu.DirectUpdateHandler2.commit start commit{flags=0,_version_=0,optimize=false,openSearcher=true,waitSearcher=true,expungeDeletes=false,softCommit=false}
[junit4:junit4]   2> 19162 T298 C25 P29766 oasu.DirectUpdateHandler2.commit start commit{flags=0,_version_=0,optimize=false,openSearcher=true,waitSearcher=true,expungeDeletes=false,softCommit=false}
[junit4:junit4]   2> 19277 T312 C27 P29770 oasc.SolrDeletionPolicy.onCommit SolrDeletionPolicy.onCommit: commits:num=2
[junit4:junit4]   2> 		commit{dir=/usr/home/hudson/hudson-slave/workspace/Lucene-Solr-Tests-trunk-Java6/solr/build/solr-core/test/J1/org.apache.solr.cloud.SyncSliceTest-1348352728005/jetty3/index,segFN=segments_2,generation=2,filenames=[segments_2]
[junit4:junit4]   2> 		commit{dir=/usr/home/hudson/hudson-slave/workspace/Lucene-Solr-Tests-trunk-Java6/solr/build/solr-core/test/J1/org.apache.solr.cloud.SyncSliceTest-1348352728005/jetty3/index,segFN=segments_3,generation=3,filenames=[_0_Lucene40_0.tim, _0.fnm, _0_Pulsing40_0.tim, _0_nrm.cfs, _0_Pulsing40_0.prx, _0_Lucene40_0.prx, _0_Pulsing40_1.prx, _0_Pulsing40_0.frq, _0_Lucene40_0.tip, _0_Lucene40_0.frq, _0_Pulsing40_1.tip, _0_Pulsing40_1.frq, _0_Pulsing40_1.tim, _0_SimpleText_0.pst, _0_nrm.cfe, _0_Pulsing40_0.tip, _0.fdx, _0.si, _0.fdt, segments_3]
[junit4:junit4]   2> 19277 T312 C27 P29770 oasc.SolrDeletionPolicy.updateCommits newest commit = 3
[junit4:junit4]   2> 19286 T312 C27 P29770 oass.SolrIndexSearcher.<init> Opening Searcher@2d7e51a9 main
[junit4:junit4]   2> 19287 T312 C27 P29770 oasu.DirectUpdateHandler2.commit end_commit_flush
[junit4:junit4]   2> 19289 T321 oasc.SolrCore.registerSearcher [collection1] Registered new searcher Searcher@2d7e51a9 main{StandardDirectoryReader(segments_3:4:nrt _0(5.0):C3)}
[junit4:junit4]   2> 19289 T312 C27 P29770 /update {waitSearcher=true&commit=true&wt=javabin&commit_end_point=true&expungeDeletes=false&softCommit=false&version=2} {commit=} 0 127
[junit4:junit4]   2> 19290 T298 C25 P29766 oasc.SolrDeletionPolicy.onCommit SolrDeletionPolicy.onCommit: commits:num=2
[junit4:junit4]   2> 		commit{dir=/usr/home/hudson/hudson-slave/workspace/Lucene-Solr-Tests-trunk-Java6/solr/build/solr-core/test/J1/org.apache.solr.cloud.SyncSliceTest-1348352728005/jetty2/index,segFN=segments_2,generation=2,filenames=[segments_2]
[junit4:junit4]   2> 		commit{dir=/usr/home/hudson/hudson-slave/workspace/Lucene-Solr-Tests-trunk-Java6/solr/build/solr-core/test/J1/org.apache.solr.cloud.SyncSliceTest-1348352728005/jetty2/index,segFN=segments_3,generation=3,filenames=[_0_Lucene40_0.tim, _0.fnm, _0_Pulsing40_0.tim, _0_nrm.cfs, _0_Pulsing40_0.prx, _0_Lucene40_0.prx, _0_Pulsing40_1.prx, _0_Pulsing40_0.frq, _0_Lucene40_0.tip, _0_Lucene40_0.frq, _0_Pulsing40_1.tip, _0_Pulsing40_1.frq, _0_Pulsing40_1.tim, _0_SimpleText_0.pst, _0_nrm.cfe, _0_Pulsing40_0.tip, _0.fdx, _0.si, _0.fdt, segments_3]
[junit4:junit4]   2> 19290 T298 C25 P29766 oasc.SolrDeletionPolicy.updateCommits newest commit = 3
[junit4:junit4]   2> 19299 T298 C25 P29766 oass.SolrIndexSearcher.<init> Opening Searcher@511fc987 main
[junit4:junit4]   2> 19300 T298 C25 P29766 oasu.DirectUpdateHandler2.commit end_commit_flush
[junit4:junit4]   2> 19301 T326 C28 P29775 oasc.SolrDeletionPolicy.onCommit SolrDeletionPolicy.onCommit: commits:num=2
[junit4:junit4]   2> 		commit{dir=/usr/home/hudson/hudson-slave/workspace/Lucene-Solr-Tests-trunk-Java6/solr/build/solr-core/test/J1/org.apache.solr.cloud.SyncSliceTest-1348352728005/jetty4/index,segFN=segments_2,generation=2,filenames=[segments_2]
[junit4:junit4]   2> 		commit{dir=/usr/home/hudson/hudson-slave/workspace/Lucene-Solr-Tests-trunk-Java6/solr/build/solr-core/test/J1/org.apache.solr.cloud.SyncSliceTest-1348352728005/jetty4/index,segFN=segments_3,generation=3,filenames=[_0_Lucene40_0.tim, _0.fnm, _0_Pulsing40_0.tim, _0_nrm.cfs, _0_Pulsing40_0.prx, _0_Lucene40_0.prx, _0_Pulsing40_1.prx, _0_Pulsing40_0.frq, _0_Lucene40_0.tip, _0_Lucene40_0.frq, _0_Pulsing40_1.tip, _0_Pulsing40_1.frq, _0_Pulsing40_1.tim, _0_SimpleText_0.pst, _0_nrm.cfe, _0_Pulsing40_0.tip, _0.fdx, _0.si, _0.fdt, segments_3]
[junit4:junit4]   2> 19301 T326 C28 P29775 oasc.SolrDeletionPolicy.updateCommits newest commit = 3
[junit4:junit4]   2> 19302 T307 oasc.SolrCore.registerSearcher [collection1] Registered new searcher Searcher@511fc987 main{StandardDirectoryReader(segments_3:4:nrt _0(5.0):C2)}
[junit4:junit4]   2> 19302 T298 C25 P29766 /update {waitSearcher=true&commit=true&wt=javabin&commit_end_point=true&expungeDeletes=false&softCommit=false&version=2} {commit=} 0 140
[junit4:junit4]   2> 19312 T326 C28 P29775 oass.SolrIndexSearcher.<init> Opening Searcher@c25c793 main
[junit4:junit4]   2> 19313 T326 C28 P29775 oasu.DirectUpdateHandler2.commit end_commit_flush
[junit4:junit4]   2> 19314 T335 oasc.SolrCore.registerSearcher [collection1] Registered new searcher Searcher@c25c793 main{StandardDirectoryReader(segments_3:4:nrt _0(5.0):C4)}
[junit4:junit4]   2> 19315 T326 C28 P29775 /update {waitSearcher=true&commit=true&wt=javabin&commit_end_point=true&expungeDeletes=false&softCommit=false&version=2} {commit=} 0 153
[junit4:junit4]   2> 19315 T288 C26 P29763 /update {waitSearcher=true&wt=javabin&commit=true&softCommit=false&version=2} {commit=} 0 299
[junit4:junit4]   2> 19316 T260 oasc.AbstractDistribZkTestBase.waitForRecoveriesToFinish Wait for recoveries to finish - collection: collection1 failOnTimeout:true timeout (sec):1800
[junit4:junit4]   2> 19317 T260 oascc.ZkStateReader.updateClusterState Updating cloud state from ZooKeeper... 
[junit4:junit4]   2> check const of shard1
[junit4:junit4]   2> client0
[junit4:junit4]   2> PROPS:127.0.0.1:29763_solr_collection1:{"shard":"shard1","roles":null,"state":"active","core":"collection1","collection":"collection1","node_name":"127.0.0.1:29763_solr","base_url":"http://127.0.0.1:29763/solr","leader":"true"}
[junit4:junit4]   2> 19320 T289 C26 P29763 REQ /select {distrib=false&wt=javabin&q=*:*&version=2} hits=4 status=0 QTime=0 
[junit4:junit4]   2>  live:true
[junit4:junit4]   2>  num:4
[junit4:junit4]   2> 
[junit4:junit4]   2> client1
[junit4:junit4]   2> PROPS:127.0.0.1:29766_solr_collection1:{"shard":"shard1","roles":null,"state":"active","core":"collection1","collection":"collection1","node_name":"127.0.0.1:29766_solr","base_url":"http://127.0.0.1:29766/solr"}
[junit4:junit4]   2> 19324 T299 C25 P29766 REQ /select {distrib=false&wt=javabin&q=*:*&version=2} hits=2 status=0 QTime=0 
[junit4:junit4]   2>  live:true
[junit4:junit4]   2>  num:2
[junit4:junit4]   2> 
[junit4:junit4]   2> ######shard1 is not consistent.  Got 4 from http://127.0.0.1:29763/solr/collection1lastClient and got 2 from http://127.0.0.1:29766/solr/collection1
[junit4:junit4]   2> 19328 T289 C26 P29763 REQ /select {fl=id,_version_&sort=id+asc&q=*:*&distrib=false&wt=javabin&rows=1000&version=2} hits=4 status=0 QTime=1 
[junit4:junit4]   2> 19330 T299 C25 P29766 REQ /select {fl=id,_version_&sort=id+asc&q=*:*&distrib=false&wt=javabin&rows=1000&version=2} hits=2 status=0 QTime=0 
[junit4:junit4]   2> ######http://127.0.0.1:29763/solr/collection1: {numFound=4,start=0,docs=[SolrDocument{id=0, _version_=1413850329854771200}, SolrDocument{id=1, _version_=1413850329882034176}, SolrDocument{id=2, _version_=1413850329895665664}, SolrDocument{id=3, _version_=1413850329908248576}]}
[junit4:junit4]   2> ######http://127.0.0.1:29766/solr/collection1: {numFound=2,start=0,docs=[SolrDocument{id=0, _version_=1413850329854771200}, SolrDocument{id=1, _version_=1413850329882034176}]}
[junit4:junit4]   2> ###### sizes=4,2
[junit4:junit4]   2> ###### Only in http://127.0.0.1:29763/solr/collection1: [{id=3, _version_=1413850329908248576}, {id=2, _version_=1413850329895665664}]
[junit4:junit4]   2> client2
[junit4:junit4]   2> PROPS:127.0.0.1:29770_solr_collection1:{"shard":"shard1","roles":null,"state":"active","core":"collection1","collection":"collection1","node_name":"127.0.0.1:29770_solr","base_url":"http://127.0.0.1:29770/solr"}
[junit4:junit4]   2> 19334 T313 C27 P29770 REQ /select {distrib=false&wt=javabin&q=*:*&version=2} hits=3 status=0 QTime=0 
[junit4:junit4]   2>  live:true
[junit4:junit4]   2>  num:3
[junit4:junit4]   2> 
[junit4:junit4]   2> client3
[junit4:junit4]   2> PROPS:127.0.0.1:29775_solr_collection1:{"shard":"shard1","roles":null,"state":"active","core":"collection1","collection":"collection1","node_name":"127.0.0.1:29775_solr","base_url":"http://127.0.0.1:29775/solr"}
[junit4:junit4]   2> 19338 T327 C28 P29775 REQ /select {distrib=false&wt=javabin&q=*:*&version=2} hits=4 status=0 QTime=0 
[junit4:junit4]   2>  live:true
[junit4:junit4]   2>  num:4
[junit4:junit4]   2> 
[junit4:junit4]   2> 19345 T260 oascsi.HttpClientUtil.createClient Creating new http client, config:maxConnections=128&maxConnectionsPerHost=32&followRedirects=false
[junit4:junit4]   2> 19374 T314 oasha.CollectionsHandler.handleSyncShardAction Syncing shard : action=SYNCSHARD&collection=collection1&shard=shard1&wt=javabin&version=2
[junit4:junit4]   2> 19375 T314 oascsi.HttpClientUtil.createClient Creating new http client, config:maxConnections=128&maxConnectionsPerHost=32&followRedirects=false
[junit4:junit4]   2> 19396 T292 oasha.CoreAdminHandler.handleRequestSyncAction I have been requested to sync up my shard
[junit4:junit4]   2> 19397 T292 oasc.SyncStrategy.sync Sync replicas to http://127.0.0.1:29763/solr/collection1/
[junit4:junit4]   2> 19397 T292 oasu.PeerSync.sync PeerSync: core=collection1 url=http://127.0.0.1:29763/solr START replicas=[http://127.0.0.1:29766/solr/collection1/, http://127.0.0.1:29770/solr/collection1/, http://127.0.0.1:29775/solr/collection1/] nUpdates=100
[junit4:junit4]   2> 19418 T315 C27 P29770 REQ /get {distrib=false&qt=/get&wt=javabin&version=2&getVersions=100} status=0 QTime=18 
[junit4:junit4]   2> 19418 T328 C28 P29775 REQ /get {distrib=false&qt=/get&wt=javabin&version=2&getVersions=100} status=0 QTime=18 
[junit4:junit4]   2> 19418 T300 C25 P29766 REQ /get {distrib=false&qt=/get&wt=javabin&version=2&getVersions=100} status=0 QTime=18 
[junit4:junit4]   2> 19419 T292 oasu.PeerSync.handleVersions PeerSync: core=collection1 url=http://127.0.0.1:29763/solr  Received 4 versions from 127.0.0.1:29770/solr/collection1/
[junit4:junit4]   2> 19419 T292 oasu.PeerSync.handleVersions PeerSync: core=collection1 url=http://127.0.0.1:29763/solr  Our versions are newer. ourLowThreshold=1413850329826459648 otherHigh=1413850329895665664
[junit4:junit4]   2> 19419 T292 oasu.PeerSync.handleVersions PeerSync: core=collection1 url=http://127.0.0.1:29763/solr  Received 5 versions from 127.0.0.1:29775/solr/collection1/
[junit4:junit4]   2> 19420 T292 oasu.PeerSync.handleVersions PeerSync: core=collection1 url=http://127.0.0.1:29763/solr  Our versions are newer. ourLowThreshold=1413850329826459648 otherHigh=1413850329895665664
[junit4:junit4]   2> 19420 T292 oasu.PeerSync.handleVersions PeerSync: core=collection1 url=http://127.0.0.1:29763/solr  Received 3 versions from 127.0.0.1:29766/solr/collection1/
[junit4:junit4]   2> 19420 T292 oasu.PeerSync.handleVersions PeerSync: core=collection1 url=http://127.0.0.1:29763/solr  Our versions are newer. ourLowThreshold=1413850329826459648 otherHigh=1413850329882034176
[junit4:junit4]   2> 19421 T292 oasu.PeerSync.sync PeerSync: core=collection1 url=http://127.0.0.1:29763/solr DONE. sync succeeded
[junit4:junit4]   2> 19421 T292 oasc.SyncStrategy.syncReplicas Sync Success - now sync replicas to me
[junit4:junit4]   2> 19421 T292 oasc.SyncStrategy.syncToMe http://127.0.0.1:29763/solr/collection1/: try and ask http://127.0.0.1:29766/solr/collection1/ to sync
[junit4:junit4]   2> 19422 T292 oasc.SyncStrategy.syncToMe http://127.0.0.1:29763/solr/collection1/: try and ask http://127.0.0.1:29770/solr/collection1/ to sync
[junit4:junit4]   2> 19423 T292 oasc.SyncStrategy.syncToMe http://127.0.0.1:29763/solr/collection1/: try and ask http://127.0.0.1:29775/solr/collection1/ to sync
[junit4:junit4]   2> 19424 T301 C25 P29766 oasu.PeerSync.sync PeerSync: core=collection1 url=http://127.0.0.1:29766/solr START replicas=[http://127.0.0.1:29763/solr/collection1/] nUpdates=100
[junit4:junit4]   2> 19425 T316 C27 P29770 oasu.PeerSync.sync PeerSync: core=collection1 url=http://127.0.0.1:29770/solr START replicas=[http://127.0.0.1:29763/solr/collection1/] nUpdates=100
[junit4:junit4]   2> 19425 T329 C28 P29775 oasu.PeerSync.sync PeerSync: core=collection1 url=http://127.0.0.1:29775/solr START replicas=[http://127.0.0.1:29763/solr/collection1/] nUpdates=100
[junit4:junit4]   2> 19427 T291 C26 P29763 REQ /get {distrib=false&qt=/get&wt=javabin&version=2&getVersions=100} status=0 QTime=0 
[junit4:junit4]   2> 19428 T286 C26 P29763 REQ /get {distrib=false&qt=/get&wt=javabin&version=2&getVersions=100} status=0 QTime=1 
[junit4:junit4]   2> 19428 T287 C26 P29763 REQ /get {distrib=false&qt=/get&wt=javabin&version=2&getVersions=100} status=0 QTime=1 
[junit4:junit4]   2> 19428 T316 C27 P29770 oasu.PeerSync.handleVersions PeerSync: core=collection1 url=http://127.0.0.1:29770/solr  Received 5 versions from 127.0.0.1:29763/solr/collection1/
[junit4:junit4]   2> 19429 T329 C28 P29775 oasu.PeerSync.handleVersions PeerSync: core=collection1 url=http://127.0.0.1:29775/solr  Received 5 versions from 127.0.0.1:29763/solr/collection1/
[junit4:junit4]   2> 19429 T316 C27 P29770 oasu.PeerSync.requestUpdates PeerSync: core=collection1 url=http://127.0.0.1:29770/solr Requesting updates from 127.0.0.1:29763/solr/collection1/n=1 versions=[1413850329908248576]
[junit4:junit4]   2> 19429 T329 C28 P29775 oasu.PeerSync.handleVersions PeerSync: core=collection1 url=http://127.0.0.1:29775/solr  Our versions are newer. ourLowThreshold=1413850329826459648 otherHigh=1413850329895665664
[junit4:junit4]   2> 19429 T301 C25 P29766 oasu.PeerSync.handleVersions PeerSync: core=collection1 url=http://127.0.0.1:29766/solr  Received 5 versions from 127.0.0.1:29763/solr/collection1/
[junit4:junit4]   2> 19429 T329 C28 P29775 oasu.PeerSync.sync PeerSync: core=collection1 url=http://127.0.0.1:29775/solr DONE. sync succeeded
[junit4:junit4]   2> 19430 T301 C25 P29766 oasu.PeerSync.requestUpdates PeerSync: core=collection1 url=http://127.0.0.1:29766/solr Requesting updates from 127.0.0.1:29763/solr/collection1/n=2 versions=[1413850329908248576, 1413850329895665664]
[junit4:junit4]   2> 19430 T329 C28 P29775 REQ /get {sync=http://127.0.0.1:29763/solr/collection1/&getVersions=100&distrib=false&qt=/get&wt=javabin&version=2} status=0 QTime=5 
[junit4:junit4]   2> 19431 T292 oasc.SyncStrategy.syncToMe http://127.0.0.1:29763/solr/collection1/:  sync completed with http://127.0.0.1:29775/solr/collection1/
[junit4:junit4]   2> 19431 T286 C26 P29763 REQ /get {distrib=false&getUpdates=1413850329908248576&qt=/get&wt=javabin&version=2} status=0 QTime=0 
[junit4:junit4]   2> 19432 T287 C26 P29763 REQ /get {distrib=false&getUpdates=1413850329908248576,1413850329895665664&qt=/get&wt=javabin&version=2} status=0 QTime=0 
[junit4:junit4]   2> 19438 T316 C27 P29770 oasu.PeerSync.sync PeerSync: core=collection1 url=http://127.0.0.1:29770/solr DONE. sync succeeded
[junit4:junit4]   2> 19438 T316 C27 P29770 REQ /get {sync=http://127.0.0.1:29763/solr/collection1/&getVersions=100&distrib=false&qt=/get&wt=javabin&version=2} status=0 QTime=13 
[junit4:junit4]   2> 19439 T301 C25 P29766 oasu.PeerSync.sync PeerSync: core=collection1 url=http://127.0.0.1:29766/solr DONE. sync succeeded
[junit4:junit4]   2> 19439 T292 oasc.SyncStrategy.syncToMe http://127.0.0.1:29763/solr/collection1/:  sync completed with http://127.0.0.1:29770/solr/collection1/
[junit4:junit4]   2> 19439 T301 C25 P29766 REQ /get {sync=http://127.0.0.1:29763/solr/collection1/&getVersions=100&distrib=false&qt=/get&wt=javabin&version=2} status=0 QTime=15 
[junit4:junit4]   2> 19440 T292 oasc.SyncStrategy.syncToMe http://127.0.0.1:29763/solr/collection1/:  sync completed with http://127.0.0.1:29766/solr/collection1/
[junit4:junit4]   2> 19441 T260 oasc.AbstractFullDistribZkTestBase.waitForThingsToLevelOut Wait for recoveries to finish - wait 15 for each attempt
[junit4:junit4]   2> 19441 T260 oasc.AbstractDistribZkTestBase.waitForRecoveriesToFinish Wait for recoveries to finish - collection: collection1 failOnTimeout:true timeout (sec):15
[junit4:junit4]   2> 19442 T260 oascc.ZkStateReader.updateClusterState Updating cloud state from ZooKeeper... 
[junit4:junit4]   2> 19445 T272 C29 P29760 oasu.DirectUpdateHandler2.commit start commit{flags=0,_version_=0,optimize=false,openSearcher=true,waitSearcher=true,expungeDeletes=false,softCommit=false}
[junit4:junit4]   2> 19447 T272 C29 P29760 oass.SolrIndexSearcher.<init> Opening Searcher@74c4ff15 main
[junit4:junit4]   2> 19448 T272 C29 P29760 oasu.DirectUpdateHandler2.commit end_commit_flush
[junit4:junit4]   2> 19449 T283 oasc.SolrCore.registerSearcher [collection1] Registered new searcher Searcher@74c4ff15 main{StandardDirectoryReader(segments_2:3:nrt _0(5.0):C4)}
[junit4:junit4]   2> 19450 T272 C29 P29760 /update {waitSearcher=true&wt=javabin&commit=true&softCommit=false&version=2} {commit=} 0 5
[junit4:junit4]   2> 19453 T288 C26 P29763 oasu.DirectUpdateHandler2.commit start commit{flags=0,_version_=0,optimize=false,openSearcher=true,waitSearcher=true,expungeDeletes=false,softCommit=false}
[junit4:junit4]   2> 19455 T288 C26 P29763 oass.SolrIndexSearcher.<init> Opening Searcher@669ca370 main
[junit4:junit4]   2> 19455 T288 C26 P29763 oasu.DirectUpdateHandler2.commit end_commit_flush
[junit4:junit4]   2> 19457 T295 oasc.SolrCore.registerSearcher [collection1] Registered new searcher Searcher@669ca370 main{StandardDirectoryReader(segments_2:3:nrt _0(5.0):C4)}
[junit4:junit4]   2> 19461 T288 C26 P29763 oasu.SolrCmdDistributor.distribCommit Distrib commit to:[StdNode: http://127.0.0.1:29766/solr/collection1/, StdNode: http://127.0.0.1:29770/solr/collection1/, StdNode: http://127.0.0.1:29775/solr/collection1/]
[junit4:junit4]   2> 19464 T312 C27 P29770 oasu.DirectUpdateHandler2.commit start commit{flags=0,_version_=0,optimize=false,openSearcher=true,waitSearcher=true,expungeDeletes=false,softCommit=false}
[junit4:junit4]   2> 19464 T298 C25 P29766 oasu.DirectUpdateHandler2.commit start commit{flags=0,_version_=0,optimize=false,openSearcher=true,waitSearcher=true,expungeDeletes=false,softCommit=false}
[junit4:junit4]   2> 19464 T326 C28 P29775 oasu.DirectUpdateHandler2.commit start commit{flags=0,_version_=0,optimize=false,openSearcher=true,waitSearcher=true,expungeDele

[...truncated too long message...]

ndler.getStatistics(ReplicationHandler.java:525)
[junit4:junit4]   2> 	at org.apache.solr.core.RequestHandlers$LazyRequestHandlerWrapper.getStatistics(RequestHandlers.java:310)
[junit4:junit4]   2> 	at org.apache.solr.core.JmxMonitoredMap$SolrDynamicMBean.getMBeanInfo(JmxMonitoredMap.java:231)
[junit4:junit4]   2> 	at com.sun.jmx.interceptor.DefaultMBeanServerInterceptor.getClassName(DefaultMBeanServerInterceptor.java:1824)
[junit4:junit4]   2> 	at com.sun.jmx.interceptor.DefaultMBeanServerInterceptor.safeGetClassName(DefaultMBeanServerInterceptor.java:1661)
[junit4:junit4]   2> 	at com.sun.jmx.interceptor.DefaultMBeanServerInterceptor.checkMBeanPermission(DefaultMBeanServerInterceptor.java:1833)
[junit4:junit4]   2> 	at com.sun.jmx.interceptor.DefaultMBeanServerInterceptor.getAttribute(DefaultMBeanServerInterceptor.java:680)
[junit4:junit4]   2> 	at com.sun.jmx.mbeanserver.JmxMBeanServer.getAttribute(JmxMBeanServer.java:672)
[junit4:junit4]   2> 	at org.apache.solr.core.JmxMonitoredMap.unregister(JmxMonitoredMap.java:174)
[junit4:junit4]   2> 	at org.apache.solr.core.JmxMonitoredMap.clear(JmxMonitoredMap.java:116)
[junit4:junit4]   2> 	at org.apache.solr.core.SolrCore.close(SolrCore.java:864)
[junit4:junit4]   2> 	at org.apache.solr.cloud.ShardLeaderElectionContext.runLeaderProcess(ElectionContext.java:213)
[junit4:junit4]   2> 	at org.apache.solr.cloud.LeaderElector.runIamLeaderProcess(LeaderElector.java:158)
[junit4:junit4]   2> 	at org.apache.solr.cloud.LeaderElector.checkIfIamLeader(LeaderElector.java:102)
[junit4:junit4]   2> 	at org.apache.solr.cloud.LeaderElector.access$000(LeaderElector.java:56)
[junit4:junit4]   2> 	at org.apache.solr.cloud.LeaderElector$1.process(LeaderElector.java:131)
[junit4:junit4]   2> 	at org.apache.zookeeper.ClientCnxn$EventThread.processEvent(ClientCnxn.java:526)
[junit4:junit4]   2> 	at org.apache.zookeeper.ClientCnxn$EventThread.run(ClientCnxn.java:502)
[junit4:junit4]   2> 
[junit4:junit4]   2> 307514 T2598 oasc.JmxMonitoredMap$SolrDynamicMBean.getMBeanInfo WARNING Could not getStatistics on info bean Lazy[solr.ReplicationHandler] java.lang.IllegalArgumentException: /usr/home/hudson/hudson-slave/workspace/Lucene-Solr-Tests-trunk-Java6/solr/build/solr-core/test/J1/org.apache.solr.cloud.BasicDistributedZk2Test-1348353278465/jetty4/index does not exist
[junit4:junit4]   2> 	at org.apache.commons.io.FileUtils.sizeOfDirectory(FileUtils.java:2074)
[junit4:junit4]   2> 	at org.apache.solr.handler.ReplicationHandler.getIndexSize(ReplicationHandler.java:477)
[junit4:junit4]   2> 	at org.apache.solr.handler.ReplicationHandler.getStatistics(ReplicationHandler.java:525)
[junit4:junit4]   2> 	at org.apache.solr.core.RequestHandlers$LazyRequestHandlerWrapper.getStatistics(RequestHandlers.java:310)
[junit4:junit4]   2> 	at org.apache.solr.core.JmxMonitoredMap$SolrDynamicMBean.getMBeanInfo(JmxMonitoredMap.java:231)
[junit4:junit4]   2> 	at com.sun.jmx.interceptor.DefaultMBeanServerInterceptor.getClassName(DefaultMBeanServerInterceptor.java:1824)
[junit4:junit4]   2> 	at com.sun.jmx.interceptor.DefaultMBeanServerInterceptor.safeGetClassName(DefaultMBeanServerInterceptor.java:1661)
[junit4:junit4]   2> 	at com.sun.jmx.interceptor.DefaultMBeanServerInterceptor.checkMBeanPermission(DefaultMBeanServerInterceptor.java:1833)
[junit4:junit4]   2> 	at com.sun.jmx.interceptor.DefaultMBeanServerInterceptor.exclusiveUnregisterMBean(DefaultMBeanServerInterceptor.java:436)
[junit4:junit4]   2> 	at com.sun.jmx.interceptor.DefaultMBeanServerInterceptor.unregisterMBean(DefaultMBeanServerInterceptor.java:421)
[junit4:junit4]   2> 	at com.sun.jmx.mbeanserver.JmxMBeanServer.unregisterMBean(JmxMBeanServer.java:540)
[junit4:junit4]   2> 	at org.apache.solr.core.JmxMonitoredMap.unregister(JmxMonitoredMap.java:175)
[junit4:junit4]   2> 	at org.apache.solr.core.JmxMonitoredMap.clear(JmxMonitoredMap.java:116)
[junit4:junit4]   2> 	at org.apache.solr.core.SolrCore.close(SolrCore.java:864)
[junit4:junit4]   2> 	at org.apache.solr.cloud.ShardLeaderElectionContext.runLeaderProcess(ElectionContext.java:213)
[junit4:junit4]   2> 	at org.apache.solr.cloud.LeaderElector.runIamLeaderProcess(LeaderElector.java:158)
[junit4:junit4]   2> 	at org.apache.solr.cloud.LeaderElector.checkIfIamLeader(LeaderElector.java:102)
[junit4:junit4]   2> 	at org.apache.solr.cloud.LeaderElector.access$000(LeaderElector.java:56)
[junit4:junit4]   2> 	at org.apache.solr.cloud.LeaderElector$1.process(LeaderElector.java:131)
[junit4:junit4]   2> 	at org.apache.zookeeper.ClientCnxn$EventThread.processEvent(ClientCnxn.java:526)
[junit4:junit4]   2> 	at org.apache.zookeeper.ClientCnxn$EventThread.run(ClientCnxn.java:502)
[junit4:junit4]   2> 
[junit4:junit4]   2> 307519 T2598 oasc.SolrCore.closeSearcher [collection1] Closing main searcher on request.
[junit4:junit4]   2> 307522 T2598 oasu.DirectUpdateHandler2.close closing DirectUpdateHandler2{commits=5,autocommits=0,soft autocommits=0,optimizes=0,rollbacks=0,expungeDeletes=0,docsPending=0,adds=0,deletesById=0,deletesByQuery=0,errors=0,cumulative_adds=35,cumulative_deletesById=0,cumulative_deletesByQuery=0,cumulative_errors=0}
[junit4:junit4]   2> 307522 T2598 oasu.DefaultSolrCoreState.decref SolrCoreState ref count has reached 0 - closing IndexWriter
[junit4:junit4]   2> 307524 T2598 oasu.DefaultSolrCoreState.decref Closing SolrCoreState - canceling any ongoing recovery
[junit4:junit4]   2> 307525 T2598 oascc.ZkStateReader$3.process Updating live nodes
[junit4:junit4]   2> 307525 T2598 oascc.ZkStateReader$3.process WARNING ZooKeeper watch triggered, but Solr cannot talk to ZK
[junit4:junit4]   2> 307525 T2598 oascc.ZkStateReader$2.process A cluster state change has occurred - updating...
[junit4:junit4]   2> 307525 T2598 oascc.ZkStateReader$2.process WARNING ZooKeeper watch triggered, but Solr cannot talk to ZK
[junit4:junit4]   2> 307525 T2598 oascc.ConnectionManager.process Watcher org.apache.solr.common.cloud.ConnectionManager@5dd1f624 name:ZooKeeperConnection Watcher:127.0.0.1:58258/solr got event WatchedEvent state:Disconnected type:None path:null path:null type:None
[junit4:junit4]   2> 307526 T2598 oascc.ConnectionManager.process Client->ZooKeeper status change trigger but we are already closed
[junit4:junit4]   2> 307526 T2598 oaz.ClientCnxn$EventThread.run EventThread shut down
[junit4:junit4]   2> NOTE: test params are: codec=SimpleText, sim=DefaultSimilarity, locale=it, timezone=America/Cordoba
[junit4:junit4]   2> NOTE: FreeBSD 9.0-RELEASE amd64/Sun Microsystems Inc. 1.6.0_32 (64-bit)/cpus=16,threads=2,free=141107040,total=222363648
[junit4:junit4]   2> NOTE: All tests run in this JVM: [TestStressRecovery, TestPropInject, DistributedQueryElevationComponentTest, TestQuerySenderListener, TimeZoneUtilsTest, LegacyHTMLStripCharFilterTest, PingRequestHandlerTest, FileUtilsTest, StatsComponentTest, UpdateParamsTest, ReturnFieldsTest, TestDistributedSearch, TestOmitPositions, TestRemoteStreaming, SyncSliceTest, TestReplicationHandler, TestCSVResponseWriter, TestUpdate, TestSolrXMLSerializer, PathHierarchyTokenizerFactoryTest, TestCSVLoader, TestDistributedGrouping, TermVectorComponentTest, TestSolrCoreProperties, BasicFunctionalityTest, DOMUtilTest, OverseerTest, ScriptEngineTest, XmlUpdateRequestHandlerTest, TestBM25SimilarityFactory, TestReload, TestSort, MultiTermTest, TestArbitraryIndexDir, LukeRequestHandlerTest, LeaderElectionTest, TermVectorComponentDistributedTest, TestQueryUtils, FieldMutatingUpdateProcessorTest, SignatureUpdateProcessorFactoryTest, SolrCoreTest, DocumentBuilderTest, ZkNodePropsTest, SuggesterTSTTest, HighlighterTest, TestSolrDeletionPolicy1, RAMDirectoryFactoryTest, ClusterStateUpdateTest, RecoveryZkTest, TestHashPartitioner, ConvertedLegacyTest, TestFunctionQuery, DebugComponentTest, ShowFileRequestHandlerTest, TestCodecSupport, DisMaxRequestHandlerTest, LeaderElectionIntegrationTest, ZkControllerTest, TestExtendedDismaxParser, BasicZkTest, DistributedTermsComponentTest, TestRecovery, DirectSolrSpellCheckerTest, PeerSyncTest, SortByFunctionTest, TestBinaryResponseWriter, CoreAdminHandlerTest, SolrRequestParserTest, CacheHeaderTest, PolyFieldTest, MBeansHandlerTest, QueryParsingTest, TermsComponentTest, XsltUpdateRequestHandlerTest, StandardRequestHandlerTest, JsonLoaderTest, DocumentAnalysisRequestHandlerTest, IndexSchemaRuntimeFieldTest, FastVectorHighlighterTest, RequestHandlersTest, RequiredFieldsTest, SolrCmdDistributorTest, TestFoldingMultitermQuery, SolrCoreCheckLockOnStartupTest, TestWriterPerf, AlternateDirectoryTest, HighlighterConfigTest, TestPropInjectDefaults, TestMergePolicyConfig, TestCollationField, TestQuerySenderNoQuery, OutputWriterTest, SpellPossibilityIteratorTest, TestPhraseSuggestions, TestDefaultSimilarityFactory, TestFastLRUCache, URLClassifyProcessorTest, SpellingQueryConverterTest, TestLRUCache, UUIDFieldTest, PreAnalyzedFieldTest, TestDocumentBuilder, BasicDistributedZk2Test]
[junit4:junit4] Completed on J1 in 307.90s, 1 test, 1 failure <<< FAILURES!

[...truncated 11 lines...]
BUILD FAILED
/usr/home/hudson/hudson-slave/workspace/Lucene-Solr-Tests-trunk-Java6/build.xml:32: The following error occurred while executing this line:
/usr/home/hudson/hudson-slave/workspace/Lucene-Solr-Tests-trunk-Java6/solr/build.xml:179: The following error occurred while executing this line:
/usr/home/hudson/hudson-slave/workspace/Lucene-Solr-Tests-trunk-Java6/lucene/module-build.xml:63: The following error occurred while executing this line:
/usr/home/hudson/hudson-slave/workspace/Lucene-Solr-Tests-trunk-Java6/lucene/common-build.xml:1141: The following error occurred while executing this line:
/usr/home/hudson/hudson-slave/workspace/Lucene-Solr-Tests-trunk-Java6/lucene/common-build.xml:814: There were test failures: 230 suites, 950 tests, 1 error, 1 failure, 21 ignored (3 assumptions)

Total time: 35 minutes 37 seconds
Build step 'Invoke Ant' marked build as failure
Recording test results
Email was triggered for: Failure
Sending email for trigger: Failure



Mime
View raw message