lucene-dev mailing list archives

Site index · List index
Message view « Date » · « Thread »
Top « Date » · « Thread »
From Apache Jenkins Server <jenk...@builds.apache.org>
Subject [JENKINS] Lucene-Solr-Tests-4.x-java7 - Build # 439 - Failure
Date Thu, 13 Sep 2012 12:02:53 GMT
Build: https://builds.apache.org/job/Lucene-Solr-Tests-4.x-java7/439/

1 tests failed.
REGRESSION:  org.apache.solr.cloud.BasicDistributedZk2Test.testDistribSearch

Error Message:
Timeout occured while waiting response from server at: http://localhost:52822/solr/collection1

Stack Trace:
org.apache.solr.client.solrj.SolrServerException: Timeout occured while waiting response from server at: http://localhost:52822/solr/collection1
	at __randomizedtesting.SeedInfo.seed([2BD0FFAE020B5BB6:AA3671B675543B8A]:0)
	at org.apache.solr.client.solrj.impl.HttpSolrServer.request(HttpSolrServer.java:410)
	at org.apache.solr.client.solrj.impl.HttpSolrServer.request(HttpSolrServer.java:182)
	at org.apache.solr.client.solrj.request.AbstractUpdateRequest.process(AbstractUpdateRequest.java:117)
	at org.apache.solr.cloud.AbstractFullDistribZkTestBase.index_specific(AbstractFullDistribZkTestBase.java:516)
	at org.apache.solr.cloud.AbstractFullDistribZkTestBase.checkQueries(AbstractFullDistribZkTestBase.java:688)
	at org.apache.solr.cloud.BasicDistributedZk2Test.doTest(BasicDistributedZk2Test.java:77)
	at org.apache.solr.BaseDistributedSearchTestCase.testDistribSearch(BaseDistributedSearchTestCase.java:691)
	at sun.reflect.NativeMethodAccessorImpl.invoke0(Native Method)
	at sun.reflect.NativeMethodAccessorImpl.invoke(NativeMethodAccessorImpl.java:57)
	at sun.reflect.DelegatingMethodAccessorImpl.invoke(DelegatingMethodAccessorImpl.java:43)
	at java.lang.reflect.Method.invoke(Method.java:601)
	at com.carrotsearch.randomizedtesting.RandomizedRunner.invoke(RandomizedRunner.java:1559)
	at com.carrotsearch.randomizedtesting.RandomizedRunner.access$600(RandomizedRunner.java:79)
	at com.carrotsearch.randomizedtesting.RandomizedRunner$6.evaluate(RandomizedRunner.java:737)
	at com.carrotsearch.randomizedtesting.RandomizedRunner$7.evaluate(RandomizedRunner.java:773)
	at com.carrotsearch.randomizedtesting.RandomizedRunner$8.evaluate(RandomizedRunner.java:787)
	at com.carrotsearch.randomizedtesting.rules.SystemPropertiesRestoreRule$1.evaluate(SystemPropertiesRestoreRule.java:53)
	at org.apache.lucene.util.TestRuleSetupTeardownChained$1.evaluate(TestRuleSetupTeardownChained.java:50)
	at org.apache.lucene.util.TestRuleFieldCacheSanity$1.evaluate(TestRuleFieldCacheSanity.java:51)
	at org.apache.lucene.util.AbstractBeforeAfterRule$1.evaluate(AbstractBeforeAfterRule.java:45)
	at com.carrotsearch.randomizedtesting.rules.SystemPropertiesInvariantRule$1.evaluate(SystemPropertiesInvariantRule.java:55)
	at org.apache.lucene.util.TestRuleThreadAndTestName$1.evaluate(TestRuleThreadAndTestName.java:48)
	at org.apache.lucene.util.TestRuleIgnoreAfterMaxFailures$1.evaluate(TestRuleIgnoreAfterMaxFailures.java:70)
	at org.apache.lucene.util.TestRuleMarkFailure$1.evaluate(TestRuleMarkFailure.java:48)
	at com.carrotsearch.randomizedtesting.rules.StatementAdapter.evaluate(StatementAdapter.java:36)
	at com.carrotsearch.randomizedtesting.ThreadLeakControl$StatementRunner.run(ThreadLeakControl.java:358)
	at com.carrotsearch.randomizedtesting.ThreadLeakControl.forkTimeoutingTask(ThreadLeakControl.java:782)
	at com.carrotsearch.randomizedtesting.ThreadLeakControl$3.evaluate(ThreadLeakControl.java:442)
	at com.carrotsearch.randomizedtesting.RandomizedRunner.runSingleTest(RandomizedRunner.java:746)
	at com.carrotsearch.randomizedtesting.RandomizedRunner$3.evaluate(RandomizedRunner.java:648)
	at com.carrotsearch.randomizedtesting.RandomizedRunner$4.evaluate(RandomizedRunner.java:682)
	at com.carrotsearch.randomizedtesting.RandomizedRunner$5.evaluate(RandomizedRunner.java:693)
	at com.carrotsearch.randomizedtesting.rules.StatementAdapter.evaluate(StatementAdapter.java:36)
	at com.carrotsearch.randomizedtesting.rules.SystemPropertiesRestoreRule$1.evaluate(SystemPropertiesRestoreRule.java:53)
	at org.apache.lucene.util.AbstractBeforeAfterRule$1.evaluate(AbstractBeforeAfterRule.java:45)
	at org.apache.lucene.util.TestRuleStoreClassName$1.evaluate(TestRuleStoreClassName.java:42)
	at com.carrotsearch.randomizedtesting.rules.SystemPropertiesInvariantRule$1.evaluate(SystemPropertiesInvariantRule.java:55)
	at com.carrotsearch.randomizedtesting.rules.NoShadowingOrOverridesOnMethodsRule$1.evaluate(NoShadowingOrOverridesOnMethodsRule.java:39)
	at com.carrotsearch.randomizedtesting.rules.NoShadowingOrOverridesOnMethodsRule$1.evaluate(NoShadowingOrOverridesOnMethodsRule.java:39)
	at com.carrotsearch.randomizedtesting.rules.StatementAdapter.evaluate(StatementAdapter.java:36)
	at org.apache.lucene.util.TestRuleAssertionsRequired$1.evaluate(TestRuleAssertionsRequired.java:43)
	at org.apache.lucene.util.TestRuleMarkFailure$1.evaluate(TestRuleMarkFailure.java:48)
	at org.apache.lucene.util.TestRuleIgnoreAfterMaxFailures$1.evaluate(TestRuleIgnoreAfterMaxFailures.java:70)
	at org.apache.lucene.util.TestRuleIgnoreTestSuites$1.evaluate(TestRuleIgnoreTestSuites.java:55)
	at com.carrotsearch.randomizedtesting.rules.StatementAdapter.evaluate(StatementAdapter.java:36)
	at com.carrotsearch.randomizedtesting.ThreadLeakControl$StatementRunner.run(ThreadLeakControl.java:358)
	at java.lang.Thread.run(Thread.java:722)
Caused by: java.net.SocketTimeoutException: Read timed out
	at java.net.SocketInputStream.socketRead0(Native Method)
	at java.net.SocketInputStream.read(SocketInputStream.java:150)
	at java.net.SocketInputStream.read(SocketInputStream.java:121)
	at org.apache.http.impl.io.AbstractSessionInputBuffer.fillBuffer(AbstractSessionInputBuffer.java:149)
	at org.apache.http.impl.io.SocketInputBuffer.fillBuffer(SocketInputBuffer.java:111)
	at org.apache.http.impl.io.AbstractSessionInputBuffer.readLine(AbstractSessionInputBuffer.java:264)
	at org.apache.http.impl.conn.DefaultResponseParser.parseHead(DefaultResponseParser.java:98)
	at org.apache.http.impl.io.AbstractMessageParser.parse(AbstractMessageParser.java:252)
	at org.apache.http.impl.AbstractHttpClientConnection.receiveResponseHeader(AbstractHttpClientConnection.java:282)
	at org.apache.http.impl.conn.DefaultClientConnection.receiveResponseHeader(DefaultClientConnection.java:247)
	at org.apache.http.impl.conn.AbstractClientConnAdapter.receiveResponseHeader(AbstractClientConnAdapter.java:216)
	at org.apache.http.protocol.HttpRequestExecutor.doReceiveResponse(HttpRequestExecutor.java:298)
	at org.apache.http.protocol.HttpRequestExecutor.execute(HttpRequestExecutor.java:125)
	at org.apache.http.impl.client.DefaultRequestDirector.tryExecute(DefaultRequestDirector.java:647)
	at org.apache.http.impl.client.DefaultRequestDirector.execute(DefaultRequestDirector.java:464)
	at org.apache.http.impl.client.AbstractHttpClient.execute(AbstractHttpClient.java:820)
	at org.apache.http.impl.client.AbstractHttpClient.execute(AbstractHttpClient.java:754)
	at org.apache.http.impl.client.AbstractHttpClient.execute(AbstractHttpClient.java:732)
	at org.apache.solr.client.solrj.impl.HttpSolrServer.request(HttpSolrServer.java:353)
	... 46 more




Build Log:
[...truncated 8263 lines...]
[junit4:junit4] Suite: org.apache.solr.cloud.BasicDistributedZk2Test
[junit4:junit4]   2> 4 T1914 oas.SolrTestCaseJ4.setUp ###Starting testDistribSearch
[junit4:junit4]   2> Creating dataDir: /usr/home/hudson/hudson-slave/workspace/Lucene-Solr-Tests-4.x-java7/solr/build/solr-core/test/J0/./solrtest-BasicDistributedZk2Test-1347537692860
[junit4:junit4]   2> 5 T1914 oasc.ZkTestServer.run STARTING ZK TEST SERVER
[junit4:junit4]   2> 8 T1915 oazs.ZooKeeperServer.setTickTime tickTime set to 3000
[junit4:junit4]   2> 8 T1915 oazs.NIOServerCnxn$Factory.<init> binding to port 0.0.0.0/0.0.0.0:0
[junit4:junit4]   2> 9 T1915 oazsp.FileTxnSnapLog.save Snapshotting: 0
[junit4:junit4]   2> 106 T1914 oasc.ZkTestServer.run start zk server on port:52727
[junit4:junit4]   2> 106 T1914 oaz.ZooKeeper.<init> Initiating client connection, connectString=127.0.0.1:52727 sessionTimeout=10000 watcher=org.apache.solr.common.cloud.ConnectionManager@117ac4f
[junit4:junit4]   2> 107 T1920 oaz.ClientCnxn$SendThread.startConnect Opening socket connection to server /127.0.0.1:52727
[junit4:junit4]   2> 107 T1914 oascc.ConnectionManager.waitForConnected Waiting for client to connect to ZooKeeper
[junit4:junit4]   2> 108 T1920 oaz.ClientCnxn$SendThread.primeConnection Socket connection established to localhost/127.0.0.1:52727, initiating session
[junit4:junit4]   2> 109 T1916 oazs.NIOServerCnxn$Factory.run Accepted socket connection from /140.211.11.196:52728
[junit4:junit4]   2> 109 T1916 oazs.NIOServerCnxn.readConnectRequest Client attempting to establish new session at /140.211.11.196:52728
[junit4:junit4]   2> 109 T1918 oazsp.FileTxnLog.append Creating new log file: log.1
[junit4:junit4]   2> 115 T1918 oazs.NIOServerCnxn.finishSessionInit Established session 0x139bf8168c10000 with negotiated timeout 10000 for client /140.211.11.196:52728
[junit4:junit4]   2> 115 T1920 oaz.ClientCnxn$SendThread.readConnectResult Session establishment complete on server localhost/127.0.0.1:52727, sessionid = 0x139bf8168c10000, negotiated timeout = 10000
[junit4:junit4]   2> 115 T1921 oascc.ConnectionManager.process Watcher org.apache.solr.common.cloud.ConnectionManager@117ac4f name:ZooKeeperConnection Watcher:127.0.0.1:52727 got event WatchedEvent state:SyncConnected type:None path:null path:null type:None
[junit4:junit4]   2> 115 T1914 oascc.ConnectionManager.waitForConnected Client is connected to ZooKeeper
[junit4:junit4]   2> 116 T1914 oascc.SolrZkClient.makePath makePath: /solr
[junit4:junit4]   2> 131 T1919 oazs.PrepRequestProcessor.pRequest Processed session termination for sessionid: 0x139bf8168c10000
[junit4:junit4]   2> 132 T1921 oaz.ClientCnxn$EventThread.run EventThread shut down
[junit4:junit4]   2> 132 T1914 oaz.ZooKeeper.close Session: 0x139bf8168c10000 closed
[junit4:junit4]   2> 133 T1916 oazs.NIOServerCnxn.closeSock Closed socket connection for client /140.211.11.196:52728 which had sessionid 0x139bf8168c10000
[junit4:junit4]   2> 133 T1914 oaz.ZooKeeper.<init> Initiating client connection, connectString=127.0.0.1:52727/solr sessionTimeout=10000 watcher=org.apache.solr.common.cloud.ConnectionManager@41d1c5ea
[junit4:junit4]   2> 134 T1922 oaz.ClientCnxn$SendThread.startConnect Opening socket connection to server /127.0.0.1:52727
[junit4:junit4]   2> 134 T1914 oascc.ConnectionManager.waitForConnected Waiting for client to connect to ZooKeeper
[junit4:junit4]   2> 135 T1922 oaz.ClientCnxn$SendThread.primeConnection Socket connection established to localhost/127.0.0.1:52727, initiating session
[junit4:junit4]   2> 135 T1916 oazs.NIOServerCnxn$Factory.run Accepted socket connection from /140.211.11.196:52729
[junit4:junit4]   2> 135 T1916 oazs.NIOServerCnxn.readConnectRequest Client attempting to establish new session at /140.211.11.196:52729
[junit4:junit4]   2> 136 T1918 oazs.NIOServerCnxn.finishSessionInit Established session 0x139bf8168c10001 with negotiated timeout 10000 for client /140.211.11.196:52729
[junit4:junit4]   2> 136 T1922 oaz.ClientCnxn$SendThread.readConnectResult Session establishment complete on server localhost/127.0.0.1:52727, sessionid = 0x139bf8168c10001, negotiated timeout = 10000
[junit4:junit4]   2> 137 T1923 oascc.ConnectionManager.process Watcher org.apache.solr.common.cloud.ConnectionManager@41d1c5ea name:ZooKeeperConnection Watcher:127.0.0.1:52727/solr got event WatchedEvent state:SyncConnected type:None path:null path:null type:None
[junit4:junit4]   2> 137 T1914 oascc.ConnectionManager.waitForConnected Client is connected to ZooKeeper
[junit4:junit4]   2> 137 T1914 oascc.SolrZkClient.makePath makePath: /collections/collection1
[junit4:junit4]   2> 147 T1914 oascc.SolrZkClient.makePath makePath: /collections/collection1/shards
[junit4:junit4]   2> 150 T1914 oascc.SolrZkClient.makePath makePath: /collections/control_collection
[junit4:junit4]   2> 170 T1914 oascc.SolrZkClient.makePath makePath: /collections/control_collection/shards
[junit4:junit4]   2> 173 T1914 oasc.AbstractZkTestCase.putConfig put /usr/home/hudson/hudson-slave/workspace/Lucene-Solr-Tests-4.x-java7/solr/build/solr-core/test-files/solr/collection1/conf/solrconfig.xml to /configs/conf1/solrconfig.xml
[junit4:junit4]   2> 174 T1914 oascc.SolrZkClient.makePath makePath: /configs/conf1/solrconfig.xml
[junit4:junit4]   2> 179 T1914 oasc.AbstractZkTestCase.putConfig put /usr/home/hudson/hudson-slave/workspace/Lucene-Solr-Tests-4.x-java7/solr/build/solr-core/test-files/solr/collection1/conf/schema.xml to /configs/conf1/schema.xml
[junit4:junit4]   2> 180 T1914 oascc.SolrZkClient.makePath makePath: /configs/conf1/schema.xml
[junit4:junit4]   2> 283 T1914 oasc.AbstractZkTestCase.putConfig put /usr/home/hudson/hudson-slave/workspace/Lucene-Solr-Tests-4.x-java7/solr/build/solr-core/test-files/solr/collection1/conf/solrconfig.xml to /configs/conf1/solrconfig.xml
[junit4:junit4]   2> 284 T1914 oascc.SolrZkClient.makePath makePath: /configs/conf1/solrconfig.xml
[junit4:junit4]   2> 287 T1914 oasc.AbstractZkTestCase.putConfig put /usr/home/hudson/hudson-slave/workspace/Lucene-Solr-Tests-4.x-java7/solr/build/solr-core/test-files/solr/collection1/conf/stopwords.txt to /configs/conf1/stopwords.txt
[junit4:junit4]   2> 288 T1914 oascc.SolrZkClient.makePath makePath: /configs/conf1/stopwords.txt
[junit4:junit4]   2> 298 T1914 oasc.AbstractZkTestCase.putConfig put /usr/home/hudson/hudson-slave/workspace/Lucene-Solr-Tests-4.x-java7/solr/build/solr-core/test-files/solr/collection1/conf/protwords.txt to /configs/conf1/protwords.txt
[junit4:junit4]   2> 299 T1914 oascc.SolrZkClient.makePath makePath: /configs/conf1/protwords.txt
[junit4:junit4]   2> 302 T1914 oasc.AbstractZkTestCase.putConfig put /usr/home/hudson/hudson-slave/workspace/Lucene-Solr-Tests-4.x-java7/solr/build/solr-core/test-files/solr/collection1/conf/currency.xml to /configs/conf1/currency.xml
[junit4:junit4]   2> 302 T1914 oascc.SolrZkClient.makePath makePath: /configs/conf1/currency.xml
[junit4:junit4]   2> 306 T1914 oasc.AbstractZkTestCase.putConfig put /usr/home/hudson/hudson-slave/workspace/Lucene-Solr-Tests-4.x-java7/solr/build/solr-core/test-files/solr/collection1/conf/open-exchange-rates.json to /configs/conf1/open-exchange-rates.json
[junit4:junit4]   2> 306 T1914 oascc.SolrZkClient.makePath makePath: /configs/conf1/open-exchange-rates.json
[junit4:junit4]   2> 309 T1914 oasc.AbstractZkTestCase.putConfig put /usr/home/hudson/hudson-slave/workspace/Lucene-Solr-Tests-4.x-java7/solr/build/solr-core/test-files/solr/collection1/conf/mapping-ISOLatin1Accent.txt to /configs/conf1/mapping-ISOLatin1Accent.txt
[junit4:junit4]   2> 310 T1914 oascc.SolrZkClient.makePath makePath: /configs/conf1/mapping-ISOLatin1Accent.txt
[junit4:junit4]   2> 313 T1914 oasc.AbstractZkTestCase.putConfig put /usr/home/hudson/hudson-slave/workspace/Lucene-Solr-Tests-4.x-java7/solr/build/solr-core/test-files/solr/collection1/conf/old_synonyms.txt to /configs/conf1/old_synonyms.txt
[junit4:junit4]   2> 313 T1914 oascc.SolrZkClient.makePath makePath: /configs/conf1/old_synonyms.txt
[junit4:junit4]   2> 320 T1914 oasc.AbstractZkTestCase.putConfig put /usr/home/hudson/hudson-slave/workspace/Lucene-Solr-Tests-4.x-java7/solr/build/solr-core/test-files/solr/collection1/conf/synonyms.txt to /configs/conf1/synonyms.txt
[junit4:junit4]   2> 321 T1914 oascc.SolrZkClient.makePath makePath: /configs/conf1/synonyms.txt
[junit4:junit4]   2> 324 T1919 oazs.PrepRequestProcessor.pRequest Processed session termination for sessionid: 0x139bf8168c10001
[junit4:junit4]   2> 325 T1923 oaz.ClientCnxn$EventThread.run EventThread shut down
[junit4:junit4]   2> 325 T1916 oazs.NIOServerCnxn.closeSock Closed socket connection for client /140.211.11.196:52729 which had sessionid 0x139bf8168c10001
[junit4:junit4]   2> 325 T1914 oaz.ZooKeeper.close Session: 0x139bf8168c10001 closed
[junit4:junit4]   2> 328 T1914 oejs.Server.doStart jetty-8.1.2.v20120308
[junit4:junit4]   2> 335 T1914 oejs.AbstractConnector.doStart Started SocketConnector@0.0.0.0:52735
[junit4:junit4]   2> 336 T1914 oasc.SolrResourceLoader.locateSolrHome JNDI not configured for solr (NoInitialContextEx)
[junit4:junit4]   2> 336 T1914 oasc.SolrResourceLoader.locateSolrHome using system property solr.solr.home: /usr/home/hudson/hudson-slave/workspace/Lucene-Solr-Tests-4.x-java7/solr/build/solr-core/test-files/solr
[junit4:junit4]   2> 337 T1914 oasc.SolrResourceLoader.<init> new SolrResourceLoader for deduced Solr Home: '/usr/home/hudson/hudson-slave/workspace/Lucene-Solr-Tests-4.x-java7/solr/build/solr-core/test-files/solr/'
[junit4:junit4]   2> 393 T1914 oass.SolrDispatchFilter.init SolrDispatchFilter.init()
[junit4:junit4]   2> 394 T1914 oasc.SolrResourceLoader.locateSolrHome JNDI not configured for solr (NoInitialContextEx)
[junit4:junit4]   2> 394 T1914 oasc.SolrResourceLoader.locateSolrHome using system property solr.solr.home: /usr/home/hudson/hudson-slave/workspace/Lucene-Solr-Tests-4.x-java7/solr/build/solr-core/test-files/solr
[junit4:junit4]   2> 395 T1914 oasc.CoreContainer$Initializer.initialize looking for solr.xml: /usr/home/hudson/hudson-slave/workspace/Lucene-Solr-Tests-4.x-java7/solr/build/solr-core/test-files/solr/solr.xml
[junit4:junit4]   2> 395 T1914 oasc.CoreContainer.<init> New CoreContainer 1027231222
[junit4:junit4]   2> 396 T1914 oasc.CoreContainer.load Loading CoreContainer using Solr Home: '/usr/home/hudson/hudson-slave/workspace/Lucene-Solr-Tests-4.x-java7/solr/build/solr-core/test-files/solr/'
[junit4:junit4]   2> 397 T1914 oasc.SolrResourceLoader.<init> new SolrResourceLoader for directory: '/usr/home/hudson/hudson-slave/workspace/Lucene-Solr-Tests-4.x-java7/solr/build/solr-core/test-files/solr/'
[junit4:junit4]   2> 433 T1914 oasc.CoreContainer.load Registering Log Listener
[junit4:junit4]   2> 450 T1914 oasc.CoreContainer.initZooKeeper Zookeeper client=127.0.0.1:52727/solr
[junit4:junit4]   2> 451 T1914 oaz.ZooKeeper.<init> Initiating client connection, connectString=127.0.0.1:52727/solr sessionTimeout=8000 watcher=org.apache.solr.common.cloud.ConnectionManager@725827da
[junit4:junit4]   2> 452 T1933 oaz.ClientCnxn$SendThread.startConnect Opening socket connection to server /127.0.0.1:52727
[junit4:junit4]   2> 452 T1914 oascc.ConnectionManager.waitForConnected Waiting for client to connect to ZooKeeper
[junit4:junit4]   2> 453 T1933 oaz.ClientCnxn$SendThread.primeConnection Socket connection established to localhost/127.0.0.1:52727, initiating session
[junit4:junit4]   2> 453 T1916 oazs.NIOServerCnxn$Factory.run Accepted socket connection from /140.211.11.196:52736
[junit4:junit4]   2> 454 T1916 oazs.NIOServerCnxn.readConnectRequest Client attempting to establish new session at /140.211.11.196:52736
[junit4:junit4]   2> 455 T1918 oazs.NIOServerCnxn.finishSessionInit Established session 0x139bf8168c10002 with negotiated timeout 8000 for client /140.211.11.196:52736
[junit4:junit4]   2> 455 T1933 oaz.ClientCnxn$SendThread.readConnectResult Session establishment complete on server localhost/127.0.0.1:52727, sessionid = 0x139bf8168c10002, negotiated timeout = 8000
[junit4:junit4]   2> 456 T1934 oascc.ConnectionManager.process Watcher org.apache.solr.common.cloud.ConnectionManager@725827da name:ZooKeeperConnection Watcher:127.0.0.1:52727/solr got event WatchedEvent state:SyncConnected type:None path:null path:null type:None
[junit4:junit4]   2> 456 T1914 oascc.ConnectionManager.waitForConnected Client is connected to ZooKeeper
[junit4:junit4]   2> 458 T1919 oazs.PrepRequestProcessor.pRequest Got user-level KeeperException when processing sessionid:0x139bf8168c10002 type:create cxid:0x2 zxid:0xfffffffffffffffe txntype:unknown reqpath:n/a Error Path:/solr/overseer Error:KeeperErrorCode = NodeExists for /solr/overseer
[junit4:junit4]   2> 467 T1914 oascc.SolrZkClient.makePath makePath: /live_nodes
[junit4:junit4]   2> 470 T1914 oasc.ZkController.createEphemeralLiveNode Register node as live in ZooKeeper:/live_nodes/127.0.0.1:52735_solr
[junit4:junit4]   2> 470 T1919 oazs.PrepRequestProcessor.pRequest Got user-level KeeperException when processing sessionid:0x139bf8168c10002 type:delete cxid:0x7 zxid:0xfffffffffffffffe txntype:unknown reqpath:n/a Error Path:/solr/live_nodes/127.0.0.1:52735_solr Error:KeeperErrorCode = NoNode for /solr/live_nodes/127.0.0.1:52735_solr
[junit4:junit4]   2> 472 T1914 oascc.SolrZkClient.makePath makePath: /live_nodes/127.0.0.1:52735_solr
[junit4:junit4]   2> 474 T1914 oashc.HttpShardHandlerFactory.getParameter Setting socketTimeout to: 0
[junit4:junit4]   2> 475 T1914 oashc.HttpShardHandlerFactory.getParameter Setting urlScheme to: http://
[junit4:junit4]   2> 475 T1914 oashc.HttpShardHandlerFactory.getParameter Setting connTimeout to: 0
[junit4:junit4]   2> 476 T1914 oashc.HttpShardHandlerFactory.getParameter Setting maxConnectionsPerHost to: 20
[junit4:junit4]   2> 476 T1914 oashc.HttpShardHandlerFactory.getParameter Setting corePoolSize to: 0
[junit4:junit4]   2> 477 T1914 oashc.HttpShardHandlerFactory.getParameter Setting maximumPoolSize to: 2147483647
[junit4:junit4]   2> 477 T1914 oashc.HttpShardHandlerFactory.getParameter Setting maxThreadIdleTime to: 5
[junit4:junit4]   2> 478 T1914 oashc.HttpShardHandlerFactory.getParameter Setting sizeOfQueue to: -1
[junit4:junit4]   2> 478 T1914 oashc.HttpShardHandlerFactory.getParameter Setting fairnessPolicy to: false
[junit4:junit4]   2> 479 T1914 oascsi.HttpClientUtil.createClient Creating new http client, config:maxConnectionsPerHost=20&maxConnections=10000&socketTimeout=0&connTimeout=0&retry=false
[junit4:junit4]   2> 495 T1914 oascc.SolrZkClient.makePath makePath: /overseer_elect/election
[junit4:junit4]   2> 508 T1919 oazs.PrepRequestProcessor.pRequest Got user-level KeeperException when processing sessionid:0x139bf8168c10002 type:delete cxid:0x15 zxid:0xfffffffffffffffe txntype:unknown reqpath:n/a Error Path:/solr/overseer_elect/leader Error:KeeperErrorCode = NoNode for /solr/overseer_elect/leader
[junit4:junit4]   2> 509 T1914 oascc.SolrZkClient.makePath makePath: /overseer_elect/leader
[junit4:junit4]   2> 512 T1914 oasc.Overseer.start Overseer (id=88312230239600642-127.0.0.1:52735_solr-n_0000000000) starting
[junit4:junit4]   2> 513 T1919 oazs.PrepRequestProcessor.pRequest Got user-level KeeperException when processing sessionid:0x139bf8168c10002 type:create cxid:0x1a zxid:0xfffffffffffffffe txntype:unknown reqpath:n/a Error Path:/solr/overseer Error:KeeperErrorCode = NodeExists for /solr/overseer
[junit4:junit4]   2> 521 T1919 oazs.PrepRequestProcessor.pRequest Got user-level KeeperException when processing sessionid:0x139bf8168c10002 type:create cxid:0x1b zxid:0xfffffffffffffffe txntype:unknown reqpath:n/a Error Path:/solr/overseer Error:KeeperErrorCode = NodeExists for /solr/overseer
[junit4:junit4]   2> 522 T1919 oazs.PrepRequestProcessor.pRequest Got user-level KeeperException when processing sessionid:0x139bf8168c10002 type:create cxid:0x1c zxid:0xfffffffffffffffe txntype:unknown reqpath:n/a Error Path:/solr/overseer Error:KeeperErrorCode = NodeExists for /solr/overseer
[junit4:junit4]   2> 523 T1919 oazs.PrepRequestProcessor.pRequest Got user-level KeeperException when processing sessionid:0x139bf8168c10002 type:create cxid:0x1d zxid:0xfffffffffffffffe txntype:unknown reqpath:n/a Error Path:/solr/overseer Error:KeeperErrorCode = NodeExists for /solr/overseer
[junit4:junit4]   2> 534 T1936 oasc.OverseerCollectionProcessor.run Process current queue of collection creations
[junit4:junit4]   2> 534 T1914 oascc.SolrZkClient.makePath makePath: /clusterstate.json
[junit4:junit4]   2> 541 T1914 oascc.ZkStateReader.createClusterStateWatchersAndUpdate Updating cluster state from ZooKeeper... 
[junit4:junit4]   2> 543 T1935 oasc.Overseer$ClusterStateUpdater.run Starting to work on the main queue
[junit4:junit4]   2> 548 T1914 oasc.CoreContainer.create Creating SolrCore 'collection1' using instanceDir: /usr/home/hudson/hudson-slave/workspace/Lucene-Solr-Tests-4.x-java7/solr/build/solr-core/test-files/solr/collection1
[junit4:junit4]   2> 549 T1914 oasc.ZkController.createCollectionZkNode Check for collection zkNode:control_collection
[junit4:junit4]   2> 550 T1914 oasc.ZkController.createCollectionZkNode Collection zkNode exists
[junit4:junit4]   2> 550 T1914 oasc.ZkController.readConfigName Load collection config from:/collections/control_collection
[junit4:junit4]   2> 552 T1914 oasc.SolrResourceLoader.<init> new SolrResourceLoader for directory: '/usr/home/hudson/hudson-slave/workspace/Lucene-Solr-Tests-4.x-java7/solr/build/solr-core/test-files/solr/collection1/'
[junit4:junit4]   2> 553 T1914 oasc.SolrResourceLoader.replaceClassLoader Adding 'file:/usr/home/hudson/hudson-slave/workspace/Lucene-Solr-Tests-4.x-java7/solr/build/solr-core/test-files/solr/collection1/lib/classes/' to classloader
[junit4:junit4]   2> 554 T1914 oasc.SolrResourceLoader.replaceClassLoader Adding 'file:/usr/home/hudson/hudson-slave/workspace/Lucene-Solr-Tests-4.x-java7/solr/build/solr-core/test-files/solr/collection1/lib/README' to classloader
[junit4:junit4]   2> 611 T1914 oasc.SolrConfig.<init> Using Lucene MatchVersion: LUCENE_40
[junit4:junit4]   2> 686 T1914 oasc.SolrConfig.<init> Loaded SolrConfig: solrconfig.xml
[junit4:junit4]   2> 788 T1914 oass.IndexSchema.readSchema Reading Solr Schema
[junit4:junit4]   2> 799 T1914 oass.IndexSchema.readSchema Schema name=test
[junit4:junit4]   2> 1492 T1914 oass.OpenExchangeRatesOrgProvider.init Initialized with rates=open-exchange-rates.json, refreshInterval=1440.
[junit4:junit4]   2> 1506 T1914 oass.IndexSchema.readSchema default search field in schema is text
[junit4:junit4]   2> 1511 T1914 oass.IndexSchema.readSchema unique key field: id
[junit4:junit4]   2> 1524 T1914 oass.FileExchangeRateProvider.reload Reloading exchange rates from file currency.xml
[junit4:junit4]   2> 1530 T1914 oass.FileExchangeRateProvider.reload Reloading exchange rates from file currency.xml
[junit4:junit4]   2> 1534 T1914 oass.OpenExchangeRatesOrgProvider.reload Reloading exchange rates from open-exchange-rates.json
[junit4:junit4]   2> 1536 T1914 oass.OpenExchangeRatesOrgProvider.reload Reloading exchange rates from open-exchange-rates.json
[junit4:junit4]   2> 1537 T1914 oasc.SolrCore.<init> [collection1] Opening new SolrCore at /usr/home/hudson/hudson-slave/workspace/Lucene-Solr-Tests-4.x-java7/solr/build/solr-core/test-files/solr/collection1/, dataDir=./org.apache.solr.cloud.BasicDistributedZk2Test-1347537692859/control/data/
[junit4:junit4]   2> 1538 T1914 oasc.JmxMonitoredMap.<init> JMX monitoring is enabled. Adding Solr mbeans to JMX Server: com.sun.jmx.mbeanserver.JmxMBeanServer@676825b5
[junit4:junit4]   2> 1574 T1914 oasc.SolrCore.getNewIndexDir WARNING New index directory detected: old=null new=./org.apache.solr.cloud.BasicDistributedZk2Test-1347537692859/control/data/index/
[junit4:junit4]   2> 1575 T1914 oasc.SolrCore.initIndex WARNING [collection1] Solr index directory './org.apache.solr.cloud.BasicDistributedZk2Test-1347537692859/control/data/index' doesn't exist. Creating new index...
[junit4:junit4]   2> 1576 T1914 oasc.CachingDirectoryFactory.get return new directory for /usr/home/hudson/hudson-slave/workspace/Lucene-Solr-Tests-4.x-java7/solr/build/solr-core/test/J0/./org.apache.solr.cloud.BasicDistributedZk2Test-1347537692859/control/data/index forceNew:false
[junit4:junit4]   2> 1617 T1914 oasc.SolrDeletionPolicy.onCommit SolrDeletionPolicy.onCommit: commits:num=1
[junit4:junit4]   2> 		commit{dir=NRTCachingDirectory(org.apache.lucene.store.NIOFSDirectory@/usr/home/hudson/hudson-slave/workspace/Lucene-Solr-Tests-4.x-java7/solr/build/solr-core/test/J0/org.apache.solr.cloud.BasicDistributedZk2Test-1347537692859/control/data/index lockFactory=org.apache.lucene.store.NativeFSLockFactory@4367e139; maxCacheMB=48.0 maxMergeSizeMB=4.0),segFN=segments_1,generation=1,filenames=[segments_1]
[junit4:junit4]   2> 1618 T1914 oasc.SolrDeletionPolicy.updateCommits newest commit = 1
[junit4:junit4]   2> 1620 T1914 oasc.SolrCore.initWriters created xml: solr.XMLResponseWriter
[junit4:junit4]   2> 1622 T1914 oasup.UpdateRequestProcessorChain.init inserting DistributedUpdateProcessorFactory into updateRequestProcessorChain "dedupe"
[junit4:junit4]   2> 1623 T1914 oasup.UpdateRequestProcessorChain.init inserting DistributedUpdateProcessorFactory into updateRequestProcessorChain "dedupe-allfields"
[junit4:junit4]   2> 1624 T1914 oasup.UpdateRequestProcessorChain.init inserting DistributedUpdateProcessorFactory into updateRequestProcessorChain "stored_sig"
[junit4:junit4]   2> 1624 T1914 oasup.UpdateRequestProcessorChain.init inserting DistributedUpdateProcessorFactory into updateRequestProcessorChain "uniq-fields"
[junit4:junit4]   2> 1625 T1914 oasup.UpdateRequestProcessorChain.init inserting DistributedUpdateProcessorFactory into updateRequestProcessorChain "distrib-dup-test-chain-implicit"
[junit4:junit4]   2> 1626 T1914 oasc.RequestHandlers.initHandlersFromConfig adding lazy requestHandler: solr.ReplicationHandler
[junit4:junit4]   2> 1627 T1914 oasc.RequestHandlers.initHandlersFromConfig created /replication: solr.ReplicationHandler
[junit4:junit4]   2> 1627 T1914 oasc.RequestHandlers.initHandlersFromConfig created standard: solr.StandardRequestHandler
[junit4:junit4]   2> 1628 T1914 oasc.RequestHandlers.initHandlersFromConfig created /get: solr.RealTimeGetHandler
[junit4:junit4]   2> 1629 T1914 oasc.RequestHandlers.initHandlersFromConfig created dismax: solr.SearchHandler
[junit4:junit4]   2> 1630 T1914 oasc.RequestHandlers.initHandlersFromConfig created mock: org.apache.solr.core.MockQuerySenderListenerReqHandler
[junit4:junit4]   2> 1630 T1914 oasc.RequestHandlers.initHandlersFromConfig created /admin/: org.apache.solr.handler.admin.AdminHandlers
[junit4:junit4]   2> 1631 T1914 oasc.RequestHandlers.initHandlersFromConfig created defaults: solr.StandardRequestHandler
[junit4:junit4]   2> 1632 T1914 oasc.RequestHandlers.initHandlersFromConfig adding lazy requestHandler: solr.StandardRequestHandler
[junit4:junit4]   2> 1632 T1914 oasc.RequestHandlers.initHandlersFromConfig created lazy: solr.StandardRequestHandler
[junit4:junit4]   2> 1633 T1914 oasc.RequestHandlers.initHandlersFromConfig created /update: solr.UpdateRequestHandler
[junit4:junit4]   2> 1634 T1914 oasc.RequestHandlers.initHandlersFromConfig created /terms: org.apache.solr.handler.component.SearchHandler
[junit4:junit4]   2> 1635 T1914 oasc.RequestHandlers.initHandlersFromConfig created spellCheckCompRH: org.apache.solr.handler.component.SearchHandler
[junit4:junit4]   2> 1636 T1914 oasc.RequestHandlers.initHandlersFromConfig created spellCheckCompRH_Direct: org.apache.solr.handler.component.SearchHandler
[junit4:junit4]   2> 1636 T1914 oasc.RequestHandlers.initHandlersFromConfig created spellCheckWithWordbreak: org.apache.solr.handler.component.SearchHandler
[junit4:junit4]   2> 1637 T1914 oasc.RequestHandlers.initHandlersFromConfig created spellCheckWithWordbreak_Direct: org.apache.solr.handler.component.SearchHandler
[junit4:junit4]   2> 1638 T1914 oasc.RequestHandlers.initHandlersFromConfig created spellCheckCompRH1: org.apache.solr.handler.component.SearchHandler
[junit4:junit4]   2> 1639 T1914 oasc.RequestHandlers.initHandlersFromConfig created tvrh: org.apache.solr.handler.component.SearchHandler
[junit4:junit4]   2> 1639 T1914 oasc.RequestHandlers.initHandlersFromConfig created /mlt: solr.MoreLikeThisHandler
[junit4:junit4]   2> 1640 T1914 oasc.RequestHandlers.initHandlersFromConfig created /debug/dump: solr.DumpRequestHandler
[junit4:junit4]   2> 1645 T1914 oashl.XMLLoader.init xsltCacheLifetimeSeconds=60
[junit4:junit4]   2> 1651 T1914 oasc.SolrCore.initDeprecatedSupport WARNING solrconfig.xml uses deprecated <admin/gettableFiles>, Please update your config to use the ShowFileRequestHandler.
[junit4:junit4]   2> 1652 T1914 oasc.SolrCore.initDeprecatedSupport WARNING adding ShowFileRequestHandler with hidden files: [SCHEMA.XML, OLD_SYNONYMS.TXT, STOPWORDS.TXT, PROTWORDS.TXT, OPEN-EXCHANGE-RATES.JSON, SYNONYMS.TXT, CURRENCY.XML, MAPPING-ISOLATIN1ACCENT.TXT]
[junit4:junit4]   2> 1657 T1914 oass.SolrIndexSearcher.<init> Opening Searcher@400de02d main
[junit4:junit4]   2> 1658 T1914 oasu.CommitTracker.<init> Hard AutoCommit: disabled
[junit4:junit4]   2> 1659 T1914 oasu.CommitTracker.<init> Soft AutoCommit: disabled
[junit4:junit4]   2> 1660 T1914 oashc.SpellCheckComponent.inform Initializing spell checkers
[junit4:junit4]   2> 1697 T1914 oass.DirectSolrSpellChecker.init init: {name=direct,classname=DirectSolrSpellChecker,field=lowerfilt,minQueryLength=3}
[junit4:junit4]   2> 1946 T1937 oasc.SolrCore.registerSearcher [collection1] Registered new searcher Searcher@400de02d main{StandardDirectoryReader(segments_1:1)}
[junit4:junit4]   2> 1951 T1919 oazs.PrepRequestProcessor.pRequest Got user-level KeeperException when processing sessionid:0x139bf8168c10002 type:create cxid:0x56 zxid:0xfffffffffffffffe txntype:unknown reqpath:n/a Error Path:/solr/overseer/queue Error:KeeperErrorCode = NoNode for /solr/overseer/queue
[junit4:junit4]   2> 1973 T1914 oasc.CoreContainer.register registering core: collection1
[junit4:junit4]   2> 1974 T1914 oasc.ZkController.register Register shard - core:collection1 address:http://127.0.0.1:52735/solr shardId:control_shard
[junit4:junit4]   2> 1975 T1914 oascc.SolrZkClient.makePath makePath: /collections/control_collection/leader_elect/control_shard/election
[junit4:junit4]   2> 1992 T1919 oazs.PrepRequestProcessor.pRequest Got user-level KeeperException when processing sessionid:0x139bf8168c10002 type:delete cxid:0x65 zxid:0xfffffffffffffffe txntype:unknown reqpath:n/a Error Path:/solr/collections/control_collection/leaders Error:KeeperErrorCode = NoNode for /solr/collections/control_collection/leaders
[junit4:junit4]   2> 1993 T1914 oasc.ShardLeaderElectionContext.runLeaderProcess Running the leader process. afterExpiration=false
[junit4:junit4]   2> 1994 T1919 oazs.PrepRequestProcessor.pRequest Got user-level KeeperException when processing sessionid:0x139bf8168c10002 type:create cxid:0x66 zxid:0xfffffffffffffffe txntype:unknown reqpath:n/a Error Path:/solr/overseer Error:KeeperErrorCode = NodeExists for /solr/overseer
[junit4:junit4]   2> 2004 T1914 oasc.ShardLeaderElectionContext.runLeaderProcess I am the new leader: http://127.0.0.1:52735/solr/collection1/
[junit4:junit4]   2> 2005 T1914 oascc.SolrZkClient.makePath makePath: /collections/control_collection/leaders/control_shard
[junit4:junit4]   2> 2009 T1919 oazs.PrepRequestProcessor.pRequest Got user-level KeeperException when processing sessionid:0x139bf8168c10002 type:create cxid:0x6f zxid:0xfffffffffffffffe txntype:unknown reqpath:n/a Error Path:/solr/overseer Error:KeeperErrorCode = NodeExists for /solr/overseer
[junit4:junit4]   2> 2051 T1935 oascc.ZkStateReader.updateClusterState Updating cloud state from ZooKeeper... 
[junit4:junit4]   2> 2052 T1919 oazs.PrepRequestProcessor.pRequest Got user-level KeeperException when processing sessionid:0x139bf8168c10002 type:create cxid:0x77 zxid:0xfffffffffffffffe txntype:unknown reqpath:n/a Error Path:/solr/overseer/queue-work Error:KeeperErrorCode = NoNode for /solr/overseer/queue-work
[junit4:junit4]   2> 2072 T1934 oascc.ZkStateReader$2.process A cluster state change has occurred - updating...
[junit4:junit4]   2> 2120 T1914 oasc.ZkController.register We are http://127.0.0.1:52735/solr/collection1/ and leader is http://127.0.0.1:52735/solr/collection1/
[junit4:junit4]   2> 2121 T1914 oasc.ZkController.register No LogReplay needed for core=collection1 baseURL=http://127.0.0.1:52735/solr
[junit4:junit4]   2> 2121 T1914 oasc.ZkController.checkRecovery I am the leader, no recovery necessary
[junit4:junit4]   2> 2124 T1914 oascc.ZkStateReader.updateClusterState Updating cloud state from ZooKeeper... 
[junit4:junit4]   2> 2125 T1914 oass.SolrDispatchFilter.init user.dir=/usr/home/hudson/hudson-slave/workspace/Lucene-Solr-Tests-4.x-java7/solr/build/solr-core/test/J0
[junit4:junit4]   2> 2126 T1914 oass.SolrDispatchFilter.init SolrDispatchFilter.init() done
[junit4:junit4]   2> 2126 T1914 oascsi.HttpClientUtil.createClient Creating new http client, config:maxConnections=128&maxConnectionsPerHost=32&followRedirects=false
[junit4:junit4]   2> 2143 T1914 oejs.Server.doStart jetty-8.1.2.v20120308
[junit4:junit4]   2> 2147 T1914 oejs.AbstractConnector.doStart Started SocketConnector@0.0.0.0:52760
[junit4:junit4]   2> 2147 T1914 oasc.SolrResourceLoader.locateSolrHome JNDI not configured for solr (NoInitialContextEx)
[junit4:junit4]   2> 2148 T1914 oasc.SolrResourceLoader.locateSolrHome using system property solr.solr.home: /usr/home/hudson/hudson-slave/workspace/Lucene-Solr-Tests-4.x-java7/solr/build/solr-core/test-files/solr
[junit4:junit4]   2> 2148 T1914 oasc.SolrResourceLoader.<init> new SolrResourceLoader for deduced Solr Home: '/usr/home/hudson/hudson-slave/workspace/Lucene-Solr-Tests-4.x-java7/solr/build/solr-core/test-files/solr/'
[junit4:junit4]   2> 2199 T1914 oass.SolrDispatchFilter.init SolrDispatchFilter.init()
[junit4:junit4]   2> 2200 T1914 oasc.SolrResourceLoader.locateSolrHome JNDI not configured for solr (NoInitialContextEx)
[junit4:junit4]   2> 2200 T1914 oasc.SolrResourceLoader.locateSolrHome using system property solr.solr.home: /usr/home/hudson/hudson-slave/workspace/Lucene-Solr-Tests-4.x-java7/solr/build/solr-core/test-files/solr
[junit4:junit4]   2> 2201 T1914 oasc.CoreContainer$Initializer.initialize looking for solr.xml: /usr/home/hudson/hudson-slave/workspace/Lucene-Solr-Tests-4.x-java7/solr/build/solr-core/test-files/solr/solr.xml
[junit4:junit4]   2> 2201 T1914 oasc.CoreContainer.<init> New CoreContainer 570289251
[junit4:junit4]   2> 2202 T1914 oasc.CoreContainer.load Loading CoreContainer using Solr Home: '/usr/home/hudson/hudson-slave/workspace/Lucene-Solr-Tests-4.x-java7/solr/build/solr-core/test-files/solr/'
[junit4:junit4]   2> 2203 T1914 oasc.SolrResourceLoader.<init> new SolrResourceLoader for directory: '/usr/home/hudson/hudson-slave/workspace/Lucene-Solr-Tests-4.x-java7/solr/build/solr-core/test-files/solr/'
[junit4:junit4]   2> 2260 T1914 oasc.CoreContainer.load Registering Log Listener
[junit4:junit4]   2> 2277 T1914 oasc.CoreContainer.initZooKeeper Zookeeper client=127.0.0.1:52727/solr
[junit4:junit4]   2> 2278 T1914 oaz.ZooKeeper.<init> Initiating client connection, connectString=127.0.0.1:52727/solr sessionTimeout=8000 watcher=org.apache.solr.common.cloud.ConnectionManager@540c0adc
[junit4:junit4]   2> 2279 T1947 oaz.ClientCnxn$SendThread.startConnect Opening socket connection to server /127.0.0.1:52727
[junit4:junit4]   2> 2279 T1914 oascc.ConnectionManager.waitForConnected Waiting for client to connect to ZooKeeper
[junit4:junit4]   2> 2280 T1947 oaz.ClientCnxn$SendThread.primeConnection Socket connection established to localhost/127.0.0.1:52727, initiating session
[junit4:junit4]   2> 2280 T1916 oazs.NIOServerCnxn$Factory.run Accepted socket connection from /140.211.11.196:52761
[junit4:junit4]   2> 2280 T1916 oazs.NIOServerCnxn.readConnectRequest Client attempting to establish new session at /140.211.11.196:52761
[junit4:junit4]   2> 2285 T1918 oazs.NIOServerCnxn.finishSessionInit Established session 0x139bf8168c10003 with negotiated timeout 8000 for client /140.211.11.196:52761
[junit4:junit4]   2> 2285 T1947 oaz.ClientCnxn$SendThread.readConnectResult Session establishment complete on server localhost/127.0.0.1:52727, sessionid = 0x139bf8168c10003, negotiated timeout = 8000
[junit4:junit4]   2> 2286 T1948 oascc.ConnectionManager.process Watcher org.apache.solr.common.cloud.ConnectionManager@540c0adc name:ZooKeeperConnection Watcher:127.0.0.1:52727/solr got event WatchedEvent state:SyncConnected type:None path:null path:null type:None
[junit4:junit4]   2> 2286 T1914 oascc.ConnectionManager.waitForConnected Client is connected to ZooKeeper
[junit4:junit4]   2> 2287 T1919 oazs.PrepRequestProcessor.pRequest Got user-level KeeperException when processing sessionid:0x139bf8168c10003 type:create cxid:0x1 zxid:0xfffffffffffffffe txntype:unknown reqpath:n/a Error Path:/solr/overseer Error:KeeperErrorCode = NodeExists for /solr/overseer
[junit4:junit4]   2> 2296 T1919 oazs.PrepRequestProcessor.pRequest Got user-level KeeperException when processing sessionid:0x139bf8168c10003 type:create cxid:0x2 zxid:0xfffffffffffffffe txntype:unknown reqpath:n/a Error Path:/solr/overseer Error:KeeperErrorCode = NodeExists for /solr/overseer
[junit4:junit4]   2> 2297 T1914 oasc.ZkController.createEphemeralLiveNode Register node as live in ZooKeeper:/live_nodes/127.0.0.1:52760_solr
[junit4:junit4]   2> 2298 T1919 oazs.PrepRequestProcessor.pRequest Got user-level KeeperException when processing sessionid:0x139bf8168c10003 type:delete cxid:0x4 zxid:0xfffffffffffffffe txntype:unknown reqpath:n/a Error Path:/solr/live_nodes/127.0.0.1:52760_solr Error:KeeperErrorCode = NoNode for /solr/live_nodes/127.0.0.1:52760_solr
[junit4:junit4]   2> 2299 T1914 oascc.SolrZkClient.makePath makePath: /live_nodes/127.0.0.1:52760_solr
[junit4:junit4]   2> 2300 T1934 oascc.ZkStateReader$3.process Updating live nodes
[junit4:junit4]   2> 2301 T1914 oashc.HttpShardHandlerFactory.getParameter Setting socketTimeout to: 0
[junit4:junit4]   2> 2302 T1914 oashc.HttpShardHandlerFactory.getParameter Setting urlScheme to: http://
[junit4:junit4]   2> 2302 T1914 oashc.HttpShardHandlerFactory.getParameter Setting connTimeout to: 0
[junit4:junit4]   2> 2303 T1914 oashc.HttpShardHandlerFactory.getParameter Setting maxConnectionsPerHost to: 20
[junit4:junit4]   2> 2303 T1914 oashc.HttpShardHandlerFactory.getParameter Setting corePoolSize to: 0
[junit4:junit4]   2> 2304 T1914 oashc.HttpShardHandlerFactory.getParameter Setting maximumPoolSize to: 2147483647
[junit4:junit4]   2> 2304 T1914 oashc.HttpShardHandlerFactory.getParameter Setting maxThreadIdleTime to: 5
[junit4:junit4]   2> 2305 T1914 oashc.HttpShardHandlerFactory.getParameter Setting sizeOfQueue to: -1
[junit4:junit4]   2> 2305 T1914 oashc.HttpShardHandlerFactory.getParameter Setting fairnessPolicy to: false
[junit4:junit4]   2> 2306 T1914 oascsi.HttpClientUtil.createClient Creating new http client, config:maxConnectionsPerHost=20&maxConnections=10000&socketTimeout=0&connTimeout=0&retry=false
[junit4:junit4]   2> 2331 T1914 oascc.ZkStateReader.createClusterStateWatchersAndUpdate Updating cluster state from ZooKeeper... 
[junit4:junit4]   2> 2338 T1914 oasc.CoreContainer.create Creating SolrCore 'collection1' using instanceDir: /usr/home/hudson/hudson-slave/workspace/Lucene-Solr-Tests-4.x-java7/solr/build/solr-core/test-files/solr/collection1
[junit4:junit4]   2> 2338 T1914 oasc.ZkController.createCollectionZkNode Check for collection zkNode:collection1
[junit4:junit4]   2> 2339 T1914 oasc.ZkController.createCollectionZkNode Collection zkNode exists
[junit4:junit4]   2> 2340 T1914 oasc.ZkController.readConfigName Load collection config from:/collections/collection1
[junit4:junit4]   2> 2341 T1914 oasc.SolrResourceLoader.<init> new SolrResourceLoader for directory: '/usr/home/hudson/hudson-slave/workspace/Lucene-Solr-Tests-4.x-java7/solr/build/solr-core/test-files/solr/collection1/'
[junit4:junit4]   2> 2342 T1914 oasc.SolrResourceLoader.replaceClassLoader Adding 'file:/usr/home/hudson/hudson-slave/workspace/Lucene-Solr-Tests-4.x-java7/solr/build/solr-core/test-files/solr/collection1/lib/classes/' to classloader
[junit4:junit4]   2> 2343 T1914 oasc.SolrResourceLoader.replaceClassLoader Adding 'file:/usr/home/hudson/hudson-slave/workspace/Lucene-Solr-Tests-4.x-java7/solr/build/solr-core/test-files/solr/collection1/lib/README' to classloader
[junit4:junit4]   2> 2400 T1914 oasc.SolrConfig.<init> Using Lucene MatchVersion: LUCENE_40
[junit4:junit4]   2> 2475 T1914 oasc.SolrConfig.<init> Loaded SolrConfig: solrconfig.xml
[junit4:junit4]   2> 2577 T1935 oascc.ZkStateReader.updateClusterState Updating cloud state from ZooKeeper... 
[junit4:junit4]   2> 2577 T1914 oass.IndexSchema.readSchema Reading Solr Schema
[junit4:junit4]   2> 2587 T1914 oass.IndexSchema.readSchema Schema name=test
[junit4:junit4]   2> 2635 T1934 oascc.ZkStateReader$2.process A cluster state change has occurred - updating...
[junit4:junit4]   2> 2636 T1948 oascc.ZkStateReader$2.process A cluster state change has occurred - updating...
[junit4:junit4]   2> 3292 T1914 oass.OpenExchangeRatesOrgProvider.init Initialized with rates=open-exchange-rates.json, refreshInterval=1440.
[junit4:junit4]   2> 3304 T1914 oass.IndexSchema.readSchema default search field in schema is text
[junit4:junit4]   2> 3308 T1914 oass.IndexSchema.readSchema unique key field: id
[junit4:junit4]   2> 3320 T1914 oass.FileExchangeRateProvider.reload Reloading exchange rates from file currency.xml
[junit4:junit4]   2> 3325 T1914 oass.FileExchangeRateProvider.reload Reloading exchange rates from file currency.xml
[junit4:junit4]   2> 3330 T1914 oass.OpenExchangeRatesOrgProvider.reload Reloading exchange rates from open-exchange-rates.json
[junit4:junit4]   2> 3331 T1914 oass.OpenExchangeRatesOrgProvider.reload Reloading exchange rates from open-exchange-rates.json
[junit4:junit4]   2> 3332 T1914 oasc.SolrCore.<init> [collection1] Opening new SolrCore at /usr/home/hudson/hudson-slave/workspace/Lucene-Solr-Tests-4.x-java7/solr/build/solr-core/test-files/solr/collection1/, dataDir=./org.apache.solr.cloud.BasicDistributedZk2Test-1347537692859/jetty1/
[junit4:junit4]   2> 3333 T1914 oasc.JmxMonitoredMap.<init> JMX monitoring is enabled. Adding Solr mbeans to JMX Server: com.sun.jmx.mbeanserver.JmxMBeanServer@676825b5
[junit4:junit4]   2> 3334 T1914 oasc.SolrCore.getNewIndexDir WARNING New index directory detected: old=null new=./org.apache.solr.cloud.BasicDistributedZk2Test-1347537692859/jetty1/index/
[junit4:junit4]   2> 3335 T1914 oasc.SolrCore.initIndex WARNING [collection1] Solr index directory './org.apache.solr.cloud.BasicDistributedZk2Test-1347537692859/jetty1/index' doesn't exist. Creating new index...
[junit4:junit4]   2> 3336 T1914 oasc.CachingDirectoryFactory.get return new directory for /usr/home/hudson/hudson-slave/workspace/Lucene-Solr-Tests-4.x-java7/solr/build/solr-core/test/J0/./org.apache.solr.cloud.BasicDistributedZk2Test-1347537692859/jetty1/index forceNew:false
[junit4:junit4]   2> 3343 T1914 oasc.SolrDeletionPolicy.onCommit SolrDeletionPolicy.onCommit: commits:num=1
[junit4:junit4]   2> 		commit{dir=NRTCachingDirectory(org.apache.lucene.store.NIOFSDirectory@/usr/home/hudson/hudson-slave/workspace/Lucene-Solr-Tests-4.x-java7/solr/build/solr-core/test/J0/org.apache.solr.cloud.BasicDistributedZk2Test-1347537692859/jetty1/index lockFactory=org.apache.lucene.store.NativeFSLockFactory@6aab7fa9; maxCacheMB=48.0 maxMergeSizeMB=4.0),segFN=segments_1,generation=1,filenames=[segments_1]
[junit4:junit4]   2> 3343 T1914 oasc.SolrDeletionPolicy.updateCommits newest commit = 1
[junit4:junit4]   2> 3344 T1914 oasc.SolrCore.initWriters created xml: solr.XMLResponseWriter
[junit4:junit4]   2> 3347 T1914 oasup.UpdateRequestProcessorChain.init inserting DistributedUpdateProcessorFactory into updateRequestProcessorChain "dedupe"
[junit4:junit4]   2> 3347 T1914 oasup.UpdateRequestProcessorChain.init inserting DistributedUpdateProcessorFactory into updateRequestProcessorChain "dedupe-allfields"
[junit4:junit4]   2> 3348 T1914 oasup.UpdateRequestProcessorChain.init inserting DistributedUpdateProcessorFactory into updateRequestProcessorChain "stored_sig"
[junit4:junit4]   2> 3349 T1914 oasup.UpdateRequestProcessorChain.init inserting DistributedUpdateProcessorFactory into updateRequestProcessorChain "uniq-fields"
[junit4:junit4]   2> 3350 T1914 oasup.UpdateRequestProcessorChain.init inserting DistributedUpdateProcessorFactory into updateRequestProcessorChain "distrib-dup-test-chain-implicit"
[junit4:junit4]   2> 3350 T1914 oasc.RequestHandlers.initHandlersFromConfig adding lazy requestHandler: solr.ReplicationHandler
[junit4:junit4]   2> 3351 T1914 oasc.RequestHandlers.initHandlersFromConfig created /replication: solr.ReplicationHandler
[junit4:junit4]   2> 3352 T1914 oasc.RequestHandlers.initHandlersFromConfig created standard: solr.StandardRequestHandler
[junit4:junit4]   2> 3352 T1914 oasc.RequestHandlers.initHandlersFromConfig created /get: solr.RealTimeGetHandler
[junit4:junit4]   2> 3353 T1914 oasc.RequestHandlers.initHandlersFromConfig created dismax: solr.SearchHandler
[junit4:junit4]   2> 3354 T1914 oasc.RequestHandlers.initHandlersFromConfig created mock: org.apache.solr.core.MockQuerySenderListenerReqHandler
[junit4:junit4]   2> 3355 T1914 oasc.RequestHandlers.initHandlersFromConfig created /admin/: org.apache.solr.handler.admin.AdminHandlers
[junit4:junit4]   2> 3356 T1914 oasc.RequestHandlers.initHandlersFromConfig created defaults: solr.StandardRequestHandler
[junit4:junit4]   2> 3356 T1914 oasc.RequestHandlers.initHandlersFromConfig adding lazy requestHandler: solr.StandardRequestHandler
[junit4:junit4]   2> 3357 T1914 oasc.RequestHandlers.initHandlersFromConfig created lazy: solr.StandardRequestHandler
[junit4:junit4]   2> 3358 T1914 oasc.RequestHandlers.initHandlersFromConfig created /update: solr.UpdateRequestHandler
[junit4:junit4]   2> 3359 T1914 oasc.RequestHandlers.initHandlersFromConfig created /terms: org.apache.solr.handler.component.SearchHandler
[junit4:junit4]   2> 3359 T1914 oasc.RequestHandlers.initHandlersFromConfig created spellCheckCompRH: org.apache.solr.handler.component.SearchHandler
[junit4:junit4]   2> 3360 T1914 oasc.RequestHandlers.initHandlersFromConfig created spellCheckCompRH_Direct: org.apache.solr.handler.component.SearchHandler
[junit4:junit4]   2> 3361 T1914 oasc.RequestHandlers.initHandlersFromConfig created spellCheckWithWordbreak: org.apache.solr.handler.component.SearchHandler
[junit4:junit4]   2> 3362 T1914 oasc.RequestHandlers.initHandlersFromConfig created spellCheckWithWordbreak_Direct: org.apache.solr.handler.component.SearchHandler
[junit4:junit4]   2> 3362 T1914 oasc.RequestHandlers.initHandlersFromConfig created spellCheckCompRH1: org.apache.solr.handler.component.SearchHandler
[junit4:junit4]   2> 3363 T1914 oasc.RequestHandlers.initHandlersFromConfig created tvrh: org.apache.solr.handler.component.SearchHandler
[junit4:junit4]   2> 3364 T1914 oasc.RequestHandlers.initHandlersFromConfig created /mlt: solr.MoreLikeThisHandler
[junit4:junit4]   2> 3365 T1914 oasc.RequestHandlers.initHandlersFromConfig created /debug/dump: solr.DumpRequestHandler
[junit4:junit4]   2> 3369 T1914 oashl.XMLLoader.init xsltCacheLifetimeSeconds=60
[junit4:junit4]   2> 3373 T1914 oasc.SolrCore.initDeprecatedSupport WARNING solrconfig.xml uses deprecated <admin/gettableFiles>, Please update your config to use the ShowFileRequestHandler.
[junit4:junit4]   2> 3374 T1914 oasc.SolrCore.initDeprecatedSupport WARNING adding ShowFileRequestHandler with hidden files: [SCHEMA.XML, OLD_SYNONYMS.TXT, STOPWORDS.TXT, PROTWORDS.TXT, OPEN-EXCHANGE-RATES.JSON, SYNONYMS.TXT, CURRENCY.XML, MAPPING-ISOLATIN1ACCENT.TXT]
[junit4:junit4]   2> 3379 T1914 oass.SolrIndexSearcher.<init> Opening Searcher@37759e1a main
[junit4:junit4]   2> 3381 T1914 oasu.CommitTracker.<init> Hard AutoCommit: disabled
[junit4:junit4]   2> 3382 T1914 oasu.CommitTracker.<init> Soft AutoCommit: disabled
[junit4:junit4]   2> 3384 T1914 oashc.SpellCheckComponent.inform Initializing spell checkers
[junit4:junit4]   2> 3403 T1914 oass.DirectSolrSpellChecker.init init: {name=direct,classname=DirectSolrSpellChecker,field=lowerfilt,minQueryLength=3}
[junit4:junit4]   2> 3469 T1949 oasc.SolrCore.registerSearcher [collection1] Registered new searcher Searcher@37759e1a main{StandardDirectoryReader(segments_1:1)}
[junit4:junit4]   2> 3642 T1935 oascc.ZkStateReader.updateClusterState Updating cloud state from ZooKeeper... 
[junit4:junit4]   2> 3657 T1934 oascc.ZkStateReader$2.process A cluster state change has occurred - updating...
[junit4:junit4]   2> 3657 T1948 oascc.ZkStateReader$2.process A cluster state change has occurred - updating...
[junit4:junit4]   2> 3981 T1914 oasc.CoreContainer.register registering core: collection1
[junit4:junit4]   2> 3982 T1914 oasc.ZkController.register Register shard - core:collection1 address:http://127.0.0.1:52760/solr shardId:shard1
[junit4:junit4]   2> 3983 T1914 oascc.SolrZkClient.makePath makePath: /collections/collection1/leader_elect/shard1/election
[junit4:junit4]   2> 3999 T1919 oazs.PrepRequestProcessor.pRequest Got user-level KeeperException when processing sessionid:0x139bf8168c10003 type:delete cxid:0x43 zxid:0xfffffffffffffffe txntype:unknown reqpath:n/a Error Path:/solr/collections/collection1/leaders Error:KeeperErrorCode = NoNode for /solr/collections/collection1/leaders
[junit4:junit4]   2> 4000 T1914 oasc.ShardLeaderElectionContext.runLeaderProcess Running the leader process. afterExpiration=false
[junit4:junit4]   2> 4001 T1919 oazs.PrepRequestProcessor.pRequest Got user-level KeeperException when processing sessionid:0x139bf8168c10003 type:create cxid:0x44 zxid:0xfffffffffffffffe txntype:unknown reqpath:n/a Error Path:/solr/overseer Error:KeeperErrorCode = NodeExists for /solr/overseer
[junit4:junit4]   2> 4009 T1914 oasc.ShardLeaderElectionContext.runLeaderProcess I am the new leader: http://127.0.0.1:52760/solr/collection1/
[junit4:junit4]   2> 4010 T1914 oascc.SolrZkClient.makePath makePath: /collections/collection1/leaders/shard1
[junit4:junit4]   2> 4014 T1919 oazs.PrepRequestProcessor.pRequest Got user-level KeeperException when processing sessionid:0x139bf8168c10003 type:create cxid:0x4d zxid:0xfffffffffffffffe txntype:unknown reqpath:n/a Error Path:/solr/overseer Error:KeeperErrorCode = NodeExists for /solr/overseer
[junit4:junit4]   2> 4167 T1935 oascc.ZkStateReader.updateClusterState Updating cloud state from ZooKeeper... 
[junit4:junit4]   2> 4185 T1934 oascc.ZkStateReader$2.process A cluster state change has occurred - updating...
[junit4:junit4]   2> 4185 T1948 oascc.ZkStateReader$2.process A cluster state change has occurred - updating...
[junit4:junit4]   2> 4230 T1914 oasc.ZkController.register We are http://127.0.0.1:52760/solr/collection1/ and leader is http://127.0.0.1:52760/solr/collection1/
[junit4:junit4]   2> 4230 T1914 oasc.ZkController.register No LogReplay needed for core=collection1 baseURL=http://127.0.0.1:52760/solr
[junit4:junit4]   2> 4231 T1914 oasc.ZkController.checkRecovery I am the leader, no recovery necessary
[junit4:junit4]   2> 4233 T1914 oascc.ZkStateReader.updateClusterState Updating cloud state from ZooKeeper... 
[junit4:junit4]   2> 4234 T1914 oass.SolrDispatchFilter.init user.dir=/usr/home/hudson/hudson-slave/workspace/Lucene-Solr-Tests-4.x-java7/solr/build/solr-core/test/J0
[junit4:junit4]   2> 4234 T1914 oass.SolrDispatchFilter.init SolrDispatchFilter.init() done
[junit4:junit4]   2> 4235 T1914 oascsi.HttpClientUtil.createClient Creating new http client, config:maxConnections=128&maxConnectionsPerHost=32&followRedirects=false
[junit4:junit4]   2> 4250 T1914 oejs.Server.doStart jetty-8.1.2.v20120308
[junit4:junit4]   2> 4253 T1914 oejs.AbstractConnector.doStart Started SocketConnector@0.0.0.0:52788
[junit4:junit4]   2> 4254 T1914 oasc.SolrResourceLoader.locateSolrHome JNDI not configured for solr (NoInitialContextEx)
[junit4:junit4]   2> 4255 T1914 oasc.SolrResourceLoader.locateSolrHome using system property solr.solr.home: /usr/home/hudson/hudson-slave/workspace/Lucene-Solr-Tests-4.x-java7/solr/build/solr-core/test-files/solr
[junit4:junit4]   2> 4255 T1914 oasc.SolrResourceLoader.<init> new SolrResourceLoader for deduced Solr Home: '/usr/home/hudson/hudson-slave/workspace/Lucene-Solr-Tests-4.x-java7/solr/build/solr-core/test-files/solr/'
[junit4:junit4]   2> 4300 T1914 oass.SolrDispatchFilter.init SolrDispatchFilter.init()
[junit4:junit4]   2> 4301 T1914 oasc.SolrResourceLoader.locateSolrHome JNDI not configured for solr (NoInitialContextEx)
[junit4:junit4]   2> 4301 T1914 oasc.SolrResourceLoader.locateSolrHome using system property solr.solr.home: /usr/home/hudson/hudson-slave/workspace/Lucene-Solr-Tests-4.x-java7/solr/build/solr-core/test-files/solr
[junit4:junit4]   2> 4302 T1914 oasc.CoreContainer$Initializer.initialize looking for solr.xml: /usr/home/hudson/hudson-slave/workspace/Lucene-Solr-Tests-4.x-java7/solr/build/solr-core/test-files/solr/solr.xml
[junit4:junit4]   2> 4302 T1914 oasc.CoreContainer.<init> New CoreContainer 350955628
[junit4:junit4]   2> 4303 T1914 oasc.CoreContainer.load Loading CoreContainer using Solr Home: '/usr/home/hudson/hudson-slave/workspace/Lucene-Solr-Tests-4.x-java7/solr/build/solr-core/test-files/solr/'
[junit4:junit4]   2> 4303 T1914 oasc.SolrResourceLoader.<init> new SolrResourceLoader for directory: '/usr/home/hudson/hudson-slave/workspace/Lucene-Solr-Tests-4.x-java7/solr/build/solr-core/test-files/solr/'
[junit4:junit4]   2> 4341 T1914 oasc.CoreContainer.load Registering Log Listener
[junit4:junit4]   2> 4357 T1914 oasc.CoreContainer.initZooKeeper Zookeeper client=127.0.0.1:52727/solr
[junit4:junit4]   2> 4358 T1914 oaz.ZooKeeper.<init> Initiating client connection, connectString=127.0.0.1:52727/solr sessionTimeout=8000 watcher=org.apache.solr.common.cloud.ConnectionManager@780ac4
[junit4:junit4]   2> 4359 T1959 oaz.ClientCnxn$SendThread.startConnect Opening socket connection to server /127.0.0.1:52727
[junit4:junit4]   2> 4359 T1914 oascc.ConnectionManager.waitForConnected Waiting for client to connect to ZooKeeper
[junit4:junit4]   2> 4360 T1959 oaz.ClientCnxn$SendThread.primeConnection Socket connection established to localhost/127.0.0.1:52727, initiating session
[junit4:junit4]   2> 4361 T1916 oazs.NIOServerCnxn$Factory.run Accepted socket connection from /140.211.11.196:52789
[junit4:junit4]   2> 4361 T1916 oazs.NIOServerCnxn.readConnectRequest Client attempting to establish new session at /140.211.11.196:52789
[junit4:junit4]   2> 4363 T1918 oazs.NIOServerCnxn.finishSessionInit Established session 0x139bf8168c10004 with negotiated timeout 8000 for client /140.211.11.196:52789
[junit4:junit4]   2> 4363 T1959 oaz.ClientCnxn$SendThread.readConnectResult Session establishment complete on server localhost/127.0.0.1:52727, sessionid = 0x139bf8168c10004, negotiated timeout = 8000
[junit4:junit4]   2> 4363 T1960 oascc.ConnectionManager.process Watcher org.apache.solr.common.cloud.ConnectionManager@780ac4 name:ZooKeeperConnection Watcher:127.0.0.1:52727/solr got event WatchedEvent state:SyncConnected type:None path:null path:null type:None
[junit4:junit4]   2> 4363 T1914 oascc.ConnectionManager.waitForConnected Client is connected to ZooKeeper
[junit4:junit4]   2> 4364 T1919 oazs.PrepRequestProcessor.pRequest Got user-level KeeperException when processing sessionid:0x139bf8168c10004 type:create cxid:0x1 zxid:0xfffffffffffffffe txntype:unknown reqpath:n/a Error Path:/solr/overseer Error:KeeperErrorCode = NodeExists for /solr/overseer
[junit4:junit4]   2> 4374 T1919 oazs.PrepRequestProcessor.pRequest Got user-level KeeperException when processing sessionid:0x139bf8168c10004 type:create cxid:0x2 zxid:0xfffffffffffffffe txntype:unknown reqpath:n/a Error Path:/solr/overseer Error:KeeperErrorCode = NodeExists for /solr/overseer
[junit4:junit4]   2> 4375 T1914 oasc.ZkController.createEphemeralLiveNode Register node as live in ZooKeeper:/live_nodes/127.0.0.1:52788_solr
[junit4:junit4]   2> 4376 T1919 oazs.PrepRequestProcessor.pRequest Got user-level KeeperException when processing sessionid:0x139bf8168c10004 type:delete cxid:0x4 zxid:0xfffffffffffffffe txntype:unknown reqpath:n/a Error Path:/solr/live_nodes/127.0.0.1:52788_solr Error:KeeperErrorCode = NoNode for /solr/live_nodes/127.0.0.1:52788_solr
[junit4:junit4]   2> 4377 T1914 oascc.SolrZkClient.makePath makePath: /live_nodes/127.0.0.1:52788_solr
[junit4:junit4]   2> 4384 T1934 oascc.ZkStateReader$3.process Updating live nodes
[junit4:junit4]   2> 4384 T1948 oascc.ZkStateReader$3.process Updating live nodes
[junit4:junit4]   2> 4385 T1914 oashc.HttpShardHandlerFactory.getParameter Setting socketTimeout to: 0
[junit4:junit4]   2> 4385 T1914 oashc.HttpShardHandlerFactory.getParameter Setting urlScheme to: http://
[junit4:junit4]   2> 4386 T1914 oashc.HttpShardHandlerFactory.getParameter Setting connTimeout to: 0
[junit4:junit4]   2> 4386 T1914 oashc.HttpShardHandlerFactory.getParameter Setting maxConnectionsPerHost to: 20
[junit4:junit4]   2> 4387 T1914 oashc.HttpShardHandlerFactory.getParameter Setting corePoolSize to: 0
[junit4:junit4]   2> 4387 T1914 oashc.HttpShardHandlerFactory.getParameter Setting maximumPoolSize to: 2147483647
[junit4:junit4]   2> 4388 T1914 oashc.HttpShardHandlerFactory.getParameter Setting maxThreadIdleTime to: 5
[junit4:junit4]   2> 4388 T1914 oashc.HttpShardHandlerFactory.getParameter Setting sizeOfQueue to: -1
[junit4:junit4]   2> 4389 T1914 oashc.HttpShardHandlerFactory.getParameter Setting fairnessPolicy to: false
[junit4:junit4]   2> 4389 T1914 oascsi.HttpClientUtil.createClient Creating new http client, config:maxConnectionsPerHost=20&maxConnections=10000&socketTimeout=0&connTimeout=0&retry=false
[junit4:junit4]   2> 4401 T1914 oascc.ZkStateReader.createClusterStateWatchersAndUpdate Updating cluster state from ZooKeeper... 
[junit4:junit4]   2> 4408 T1914 oasc.CoreContainer.create Creating SolrCore 'collection1' using instanceDir: /usr/home/hudson/hudson-slave/workspace/Lucene-Solr-Tests-4.x-java7/solr/build/solr-core/test-files/solr/collection1
[junit4:junit4]   2> 4408 T1914 oasc.ZkController.createCollectionZkNode Check for collection zkNode:collection1
[junit4:junit4]   2> 4409 T1914 oasc.ZkController.createCollectionZkNode Collection zkNode exists
[junit4:junit4]   2> 4410 T1914 oasc.ZkController.readConfigName Load collection config from:/collections/collection1
[junit4:junit4]   2> 4411 T1914 oasc.SolrResourceLoader.<init> new SolrResourceLoader for directory: '/usr/home/hudson/hudson-slave/workspace/Lucene-Solr-Tests-4.x-java7/solr/build/solr-core/test-files/solr/collection1/'
[junit4:junit4]   2> 4412 T1914 oasc.SolrResourceLoader.replaceClassLoader Adding 'file:/usr/home/hudson/hudson-slave/workspace/Lucene-Solr-Tests-4.x-java7/solr/build/solr-core/test-files/solr/collection1/lib/classes/' to classloader
[junit4:junit4]   2> 4413 T1914 oasc.SolrResourceLoader.replaceClassLoader Adding 'file:/usr/home/hudson/hudson-slave/workspace/Lucene-Solr-Tests-4.x-java7/solr/build/solr-core/test-files/solr/collection1/lib/README' to classloader
[junit4:junit4]   2> 4468 T1914 oasc.SolrConfig.<init> Using Lucene MatchVersion: LUCENE_40
[junit4:junit4]   2> 4537 T1914 oasc.SolrConfig.<init> Loaded SolrConfig: solrconfig.xml
[junit4:junit4]   2> 4639 T1914 oass.IndexSchema.readSchema Reading Solr Schema
[junit4:junit4]   2> 4648 T1914 oass.IndexSchema.readSchema Schema name=test
[junit4:junit4]   2> 4697 T1935 oascc.ZkStateReader.updateClusterState Updating cloud state from ZooKeeper... 
[junit4:junit4]   2> 4711 T1960 oascc.ZkStateReader$2.process A cluster state change has occurred - updating...
[junit4:junit4]   2> 4711 T1934 oascc.ZkStateReader$2.process A cluster state change has occurred - updating...
[junit4:junit4]   2> 4711 T1948 oascc.ZkStateReader$2.process A cluster state change has occurred - updating...
[junit4:junit4]   2> 5335 T1914 oass.OpenExchangeRatesOrgProvider.init Initialized with rates=open-exchange-rates.json, refreshInterval=1440.
[junit4:junit4]   2> 5348 T1914 oass.IndexSchema.readSchema default search field in schema is text
[junit4:junit4]   2> 5353 T1914 oass.IndexSchema.readSchema unique key field: id
[junit4:junit4]   2> 5367 T1914 oass.FileExchangeRateProvider.reload Reloading exchange rates from file currency.xml
[junit4:junit4]   2> 5372 T1914 oass.FileExchangeRateProvider.reload Reloading exchange rates from file currency.xml
[junit4:junit4]   2> 5378 T1914 oass.OpenExchangeRatesOrgProvider.reload Reloading exchange rates from open-exchange-rates.json
[junit4:junit4]   2> 5379 T1914 oass.OpenExchangeRatesOrgProvider.reload Reloading exchange rates from open-exchange-rates.json
[junit4:junit4]   2> 5381 T1914 oasc.SolrCore.<init> [collection1] Opening new SolrCore at /usr/home/hudson/hudson-slave/workspace/Lucene-Solr-Tests-4.x-java7/solr/build/solr-core/test-files/solr/collection1/, dataDir=./org.apache.solr.cloud.BasicDistributedZk2Test-1347537692859/jetty2/
[junit4:junit4]   2> 5381 T1914 oasc.JmxMonitoredMap.<init> JMX monitoring is enabled. Adding Solr mbeans to JMX Server: com.sun.jmx.mbeanserver.JmxMBeanServer@676825b5
[junit4:junit4]   2> 5383 T1914 oasc.SolrCore.getNewIndexDir WARNING New index directory detected: old=null new=./org.apache.solr.cloud.BasicDistributedZk2Test-1347537692859/jetty2/index/
[junit4:junit4]   2> 5384 T1914 oasc.SolrCore.initIndex WARNING [collection1] Solr index directory './org.apache.solr.cloud.BasicDistributedZk2Test-1347537692859/jetty2/index' doesn't exist. Creating new index...
[junit4:junit4]   2> 5385 T1914 oasc.CachingDirectoryFactory.get return new directory for /usr/home/hudson/hudson-slave/workspace/Lucene-Solr-Tests-4.x-java7/solr/build/solr-core/test/J0/./org.apache.solr.cloud.BasicDistributedZk2Test-1347537692859/jetty2/index forceNew:false
[junit4:junit4]   2> 5392 T1914 oasc.SolrDeletionPolicy.onCommit SolrDeletionPolicy.onCommit: commits:num=1
[junit4:junit4]   2> 		commit{dir=NRTCachingDirectory(org.apache.lucene.store.NIOFSDirectory@/usr/home/hudson/hudson-slave/workspace/Lucene-Solr-Tests-4.x-java7/solr/build/solr-core/test/J0/org.apache.solr.cloud.BasicDistributedZk2Test-1347537692859/jetty2/index lockFactory=org.apache.lucene.store.NativeFSLockFactory@3137db95; maxCacheMB=48.0 maxMergeSizeMB=4.0),segFN=segments_1,generation=1,filenames=[segments_1]
[junit4:junit4]   2> 5393 T1914 oasc.SolrDeletionPolicy.updateCommits newest commit = 1
[junit4:junit4]   2> 5394 T1914 oasc.SolrCore.initWriters created xml: solr.XMLResponseWriter
[junit4:junit4]   2> 5397 T1914 oasup.UpdateRequestProcessorChain.init inserting DistributedUpdateProcessorFactory into updateRequestProcessorChain "dedupe"
[junit4:junit4]   2> 5397 T1914 oasup.UpdateRequestProcessorChain.init inserting DistributedUpdateProcessorFactory into updateRequestProcessorChain "dedupe-allfields"
[junit4:junit4]   2> 5398 T1914 oasup.UpdateRequestProcessorChain.init inserting DistributedUpdateProcessorFactory into updateRequestProcessorChain "stored_sig"
[junit4:junit4]   2> 5399 T1914 oasup.UpdateRequestProcessorChain.init inserting DistributedUpdateProcessorFactory into updateRequestProcessorChain "uniq-fields"
[junit4:junit4]   2> 5400 T1914 oasup.UpdateRequestProcessorChain.init inserting DistributedUpdateProcessorFactory into updateRequestProcessorChain "distrib-dup-test-chain-implicit"
[junit4:junit4]   2> 5400 T1914 oasc.RequestHandlers.initHandlersFromConfig adding lazy requestHandler: solr.ReplicationHandler
[junit4:junit4]   2> 5401 T1914 oasc.RequestHandlers.initHandlersFromConfig created /replication: solr.ReplicationHandler
[junit4:junit4]   2> 5402 T1914 oasc.RequestHandlers.initHandlersFromConfig created standard: solr.StandardRequestHandler
[junit4:junit4]   2> 5403 T1914 oasc.RequestHandlers.initHandlersFromConfig created /get: solr.RealTimeGetHandler
[junit4:junit4]   2> 5404 T1914 oasc.RequestHandlers.initHandlersFromConfig created dismax: solr.SearchHandler
[junit4:junit4]   2> 5404 T1914 oasc.RequestHandlers.initHandlersFromConfig created mock: org.apache.solr.core.MockQuerySenderListenerReqHandler
[junit4:junit4]   2> 5405 T1914 oasc.RequestHandlers.initHandlersFromConfig created /admin/: org.apache.solr.handler.admin.AdminHandlers
[junit4:junit4]   2> 5406 T1914 oasc.RequestHandlers.initHandlersFromConfig created defaults: solr.StandardRequestHandler
[junit4:junit4]   2> 5406 T1914 oasc.RequestHandlers.initHandlersFromConfig adding lazy requestHandler: solr.StandardRequestHandler
[junit4:junit4]   2> 5407 T1914 oasc.RequestHandlers.initHandlersFromConfig created lazy: solr.StandardRequestHandler
[junit4:junit4]   2> 5408 T1914 oasc.RequestHandlers.initHandlersFromConfig created /update: solr.UpdateRequestHandler
[junit4:junit4]   2> 5409 T1914 oasc.RequestHandlers.initHandlersFromConfig created /terms: org.apache.solr.handler.component.SearchHandler
[junit4:junit4]   2> 5409 T1914 oasc.RequestHandlers.initHandlersFromConfig created spellCheckCompRH: org.apache.solr.handler.component.SearchHandler
[junit4:junit4]   2> 5410 T1914 oasc.RequestHandlers.initHandlersFromConfig created spellCheckCompRH_Direct: org.apache.solr.handler.component.SearchHandler
[junit4:junit4]   2> 5411 T1914 oasc.RequestHandlers.initHandlersFromConfig created spellCheckWithWordbreak: org.apache.solr.handler.component.SearchHandler
[junit4:junit4]   2> 5412 T1914 oasc.RequestHandlers.initHandlersFromConfig created spellCheckWithWordbreak_Direct: org.apache.solr.handler.component.SearchHandler
[junit4:junit4]   2> 5412 T1914 oasc.RequestHandlers.initHandlersFromConfig created spellCheckCompRH1: org.apache.solr.handler.component.SearchHandler
[junit4:junit4]   2> 5413 T1914 oasc.RequestHandlers.initHandlersFromConfig created tvrh: org.apache.solr.handler.component.SearchHandler
[junit4:junit4]   2> 5414 T1914 oasc.RequestHandlers.initHandlersFromConfig created /mlt: solr.MoreLikeThisHandler
[junit4:junit4]   2> 5415 T1914 oasc.RequestHandlers.initHandlersFromConfig created /debug/dump: solr.DumpRequestHandler
[junit4:junit4]   2> 5419 T1914 oashl.XMLLoader.init xsltCacheLifetimeSeconds=60
[junit4:junit4]   2> 5424 T1914 oasc.SolrCore.initDeprecatedSupport WARNING solrconfig.xml uses deprecated <admin/gettableFiles>, Please update your config to use the ShowFileRequestHandler.
[junit4:junit4]   2> 5426 T1914 oasc.SolrCore.initDeprecatedSupport WARNING adding ShowFileRequestHandler with hidden files: [SCHEMA.XML, OLD_SYNONYMS.TXT, STOPWORDS.TXT, PROTWORDS.TXT, OPEN-EXCHANGE-RATES.JSON, SYNONYMS.TXT, CURRENCY.XML, MAPPING-ISOLATIN1ACCENT.TXT]
[junit4:junit4]   2> 5430 T1914 oass.SolrIndexSearcher.<init> Opening Searcher@3d3bbddf main
[junit4:junit4]   2> 5431 T1914 oasu.CommitTracker.<init> Hard AutoCommit: disabled
[junit4:junit4]   2> 5432 T1914 oasu.CommitTracker.<init> Soft AutoCommit: disabled
[junit4:junit4]   2> 5433 T1914 oashc.SpellCheckComponent.inform Initializing spell checkers
[junit4:junit4]   2> 5441 T1914 oass.DirectSolrSpellChecker.init init: {name=direct,classname=DirectSolrSpellChecker,field=lowerfilt,minQueryLength=3}
[junit4:junit4]   2> 5509 T1961 oasc.SolrCore.registerSearcher [collection1] Registered new searcher Searcher@3d3bbddf main{StandardDirectoryReader(segments_1:1)}
[junit4:junit4]   2> 5717 T1935 oascc.ZkStateReader.updateClusterState Updating cloud state from ZooKeeper... 
[junit4:junit4]   2> 5731 T1948 oascc.ZkStateReader$2.process A cluster state change has occurred - updating...
[junit4:junit4]   2> 5731 T1934 oascc.ZkStateReader$2.process A cluster state change has occurred - updating...
[junit4:junit4]   2> 5731 T1960 oascc.ZkStateReader$2.process A cluster state change has occurred - updating...
[junit4:junit4]   2> 6015 T1914 oasc.CoreContainer.register registering core: collection1
[junit4:junit4]   2> 6016 T1914 oasc.ZkController.register Register shard - core:collection1 address:http://127.0.0.1:52788/solr shardId:shard2
[junit4:junit4]   2> 6025 T1914 oascc.SolrZkClient.makePath makePath: /collections/collection1/leader_elect/shard2/election
[junit4:junit4]   2> 6042 T1919 oazs.PrepRequestProcessor.pRequest Got user-level KeeperException when processing sessionid:0x139bf8168c10004 type:delete cxid:0x42 zxid:0xfffffffffffffffe txntype:unknown reqpath:n/a Error Path:/solr/collections/collection1/leaders/shard2 Error:KeeperErrorCode = NoNode for /solr/collections/collection1/leaders/shard2
[junit4:junit4]   2> 6043 T1914 oasc.ShardLeaderElectionContext.runLeaderProcess Running the leader process. afterExpiration=false
[junit4:junit4]   2> 6044 T1919 oazs.PrepRequestProcessor.pRequest Got user-level KeeperException when processing sessionid:0x139bf8168c10004 type:create cxid:0x43 zxid:0xfffffffffffffffe txntype:unknown reqpath:n/a Error Path:/solr/overseer Error:KeeperErrorCode = NodeExists for /solr/overseer
[junit4:junit4]   2> 6053 T1914 oasc.ShardLeaderElectionContext.runLeaderProcess I am the new leader: http://127.0.0.1:52788/solr/collection1/
[junit4:junit4]   2> 6054 T1914 oascc.SolrZkClient.makePath makePath: /collections/collection1/leaders/shard2
[junit4:junit4]   2> 6057 T1919 oazs.PrepRequestProcessor.pRequest Got user-level KeeperException when processing sessionid:0x139bf8168c10004 type:create cxid:0x4b zxid:0xfffffffffffffffe txntype:unknown reqpath:n/a Error Path:/solr/overseer Error:KeeperErrorCode = NodeExists for /solr/overseer
[junit4:junit4]   2> 6235 T1935 oascc.ZkStateReader.updateClusterState Updating cloud state from ZooKeeper... 
[junit4:junit4]   2> 6255 T1960 oascc.ZkStateReader$2.process A cluster state change has occurred - updating...
[junit4:junit4]   2> 6255 T1934 oascc.ZkStateReader$2.process A cluster state change has occurred - updating...
[junit4:junit4]   2> 6255 T1948 oascc.ZkStateReader$2.process A cluster state change has occurred - updating...
[junit4:junit4]   2> 6263 T1914 oasc.ZkController.register We are http://127.0.0.1:52788/solr/collection1/ and leader is http://127.0.0.1:52788/solr/collection1/
[junit4:junit4]   2> 6263 T1914 oasc.ZkController.register No LogReplay needed for core=collection1 baseURL=http://127.0.0.1:52788/solr
[junit4:junit4]   2> 6264 T1914 oasc.ZkController.checkRecovery I am the leader, no recovery necessary
[junit4:junit4]   2> 6265 T1914 oascc.ZkStateReader.updateClusterState Updating cloud state from ZooKeeper... 
[junit4:junit4]   2> 6266 T1914 oass.SolrDispatchFilter.init user.dir=/usr/home/hudson/hudson-slave/workspace/Lucene-Solr-Tests-4.x-java7/solr/build/solr-core/test/J0
[junit4:junit4]   2> 6266 T1914 oass.SolrDispatchFilter.init SolrDispatchFilter.init() done
[junit4:junit4]   2> 6267 T1914 oascsi.HttpClientUtil.createClient Creating new http client, config:maxConnections=128&maxConnectionsPerHost=32&followRedirects=false
[junit4:junit4]   2> 6278 T1914 oejs.Server.doStart jetty-8.1.2.v20120308
[junit4:junit4]   2> 6281 T1914 oejs.AbstractConnector.doStart Started SocketConnector@0.0.0.0:52804
[junit4:junit4]   2> 6282 T1914 oasc.SolrResourceLoader.locateSolrHome JNDI not configured for solr (NoInitialContextEx)
[junit4:junit4]   2> 6282 T1914 oasc.SolrResourceLoader.locateSolrHome using system property solr.solr.home: /usr/home/hudson/hudson-slave/workspace/Lucene-Solr-Tests-4.x-java7/solr/build/solr-core/test-files/solr
[junit4:junit4]   2> 6282 T1914 oasc.SolrResourceLoader.<init> new SolrResourceLoader for deduced Solr Home: '/usr/home/hudson/hudson-slave/workspace/Lucene-Solr-Tests-4.x-java7/solr/build/solr-core/test-files/solr/'
[junit4:junit4]   2> 6312 T1914 oass.SolrDispatchFilter.init SolrDispatchFilter.init()
[junit4:junit4]   2> 6313 T1914 oasc.SolrResourceLoader.locateSolrHome JNDI not configured for solr (NoInitialContextEx)
[junit4:junit4]   2> 6313 T1914 oasc.SolrResourceLoader.locateSolrHome using system property solr.solr.home: /usr/home/hudson/hudson-slave/workspace/Lucene-Solr-Tests-4.x-java7/solr/build/solr-core/test-files/solr
[junit4:junit4]   2> 6313 T1914 oasc.CoreContainer$Initializer.initialize looking for solr.xml: /usr/home/hudson/hudson-slave/workspace/Lucene-Solr-Tests-4.x-java7/solr/build/solr-core/test-files/solr/solr.xml
[junit4:junit4]   2> 6314 T1914 oasc.CoreContainer.<init> New CoreContainer 1090906166
[junit4:junit4]   2> 6314 T1914 oasc.CoreContainer.load Loading CoreContainer using Solr Home: '/usr/home/hudson/hudson-slave/workspace/Lucene-Solr-Tests-4.x-java7/solr/build/solr-core/test-files/solr/'
[junit4:junit4]   2> 6315 T1914 oasc.SolrResourceLoader.<init> new SolrResourceLoader for directory: '/usr/home/hudson/hudson-slave/workspace/Lucene-Solr-Tests-4.x-java7/solr/build/solr-core/test-files/solr/'
[junit4:junit4]   2> 6338 T1914 oasc.CoreContainer.load Registering Log Listener
[junit4:junit4]   2> 6350 T1914 oasc.CoreContainer.initZooKeeper Zookeeper client=127.0.0.1:52727/solr
[junit4:junit4]   2> 6351 T1914 oaz.ZooKeeper.<init> Initiating client connection, connectString=127.0.0.1:52727/solr sessionTimeout=8000 watcher=org.apache.solr.common.cloud.ConnectionManager@5365811
[junit4:junit4]   2> 6352 T1971 oaz.ClientCnxn$SendThread.startConnect Opening socket connection to server /127.0.0.1:52727
[junit4:junit4]   2> 6352 T1914 oascc.ConnectionManager.waitForConnected Waiting for client to connect to ZooKeeper
[junit4:junit4]   2> 6353 T1971 oaz.ClientCnxn$SendThread.primeConnection Socket connection established to localhost/127.0.0.1:52727, initiating session
[junit4:junit4]   2> 6353 T1916 oazs.NIOServerCnxn$Factory.run Accepted socket connection from /140.211.11.196:52805
[junit4:junit4]   2> 6354 T1916 oazs.NIOServerCnxn.readConnectRequest Client attempting to establish new session at /140.211.11.196:52805
[junit4:junit4]   2> 6355 T1918 oazs.NIOServerCnxn.finishSessionInit Established session 0x139bf8168c10005 with negotiated timeout 8000 for client /140.211.11.196:52805
[junit4:junit4]   2> 6355 T1971 oaz.ClientCnxn$SendThread.readConnectResult Session establishment complete on server localhost/127.0.0.1:52727, sessionid = 0x139bf8168c10005, negotiated timeout = 8000
[junit4:junit4]   2> 6356 T1972 oascc.ConnectionManager.process Watcher org.apache.solr.common.cloud.ConnectionManager@5365811 name:ZooKeeperConnection Watcher:127.0.0.1:52727/solr got event WatchedEvent state:SyncConnected type:None path:null path:null type:None
[junit4:junit4]   2> 6356 T1914 oascc.ConnectionManager.waitForConnected Client is connected to ZooKeeper
[junit4:junit4]   2> 6356 T1919 oazs.PrepRequestProcessor.pRequest Got user-level KeeperException when processing sessionid:0x139bf8168c10005 type:create cxid:0x1 zxid:0xfffffffffffffffe txntype:unknown reqpath:n/a Error Path:/solr/overseer Error:KeeperErrorCode = NodeExists for /solr/overseer
[junit4:junit4]   2> 6358 T1919 oazs.PrepRequestProcessor.pRequest Got user-level KeeperException when processing sessionid:0x139bf8168c10005 type:create cxid:0x2 zxid:0xfffffffffffffffe txntype:unknown reqpath:n/a Error Path:/solr/overseer Error:KeeperErrorCode = NodeExists for /solr/overseer
[junit4:junit4]   2> 6366 T1914 oasc.ZkController.createEphemeralLiveNode Register node as live in ZooKeeper:/live_nodes/127.0.0.1:52804_solr
[junit4:junit4]   2> 6367 T1919 oazs.PrepRequestProcessor.pRequest Got user-level KeeperException when processing sessionid:0x139bf8168c10005 type:delete cxid:0x4 zxid:0xfffffffffffffffe txntype:unknown reqpath:n/a Error Path:/solr/live_nodes/127.0.0.1:52804_solr Error:KeeperErrorCode = NoNode for /solr/live_nodes/127.0.0.1:52804_solr
[junit4:junit4]   2> 6368 T1914 oascc.SolrZkClient.makePath makePath: /live_nodes/127.0.0.1:52804_solr
[junit4:junit4]   2> 6370 T1960 oascc.ZkStateReader$3.process Updating live nodes
[junit4:junit4]   2> 6370 T1934 oascc.ZkStateReader$3.process Updating live nodes
[junit4:junit4]   2> 6370 T1948 oascc.ZkStateReader$3.process Updating live nodes
[junit4:junit4]   2> 6370 T1914 oashc.HttpShardHandlerFactory.getParameter Setting socketTimeout to: 0
[junit4:junit4]   2> 6371 T1914 oashc.HttpShardHandlerFactory.getParameter Setting urlScheme to: http://
[junit4:junit4]   2> 6371 T1914 oashc.HttpShardHandlerFactory.getParameter Setting connTimeout to: 0
[junit4:junit4]   2> 6372 T1914 oashc.HttpShardHandlerFactory.getParameter Setting maxConnectionsPerHost to: 20
[junit4:junit4]   2> 6372 T1914 oashc.HttpShardHandlerFactory.getParameter Setting corePoolSize to: 0
[junit4:junit4]   2> 6372 T1914 oashc.HttpShardHandlerFactory.getParameter Setting maximumPoolSize to: 2147483647
[junit4:junit4]   2> 6373 T1914 oashc.HttpShardHandlerFactory.getParameter Setting maxThreadIdleTime to: 5
[junit4:junit4]   2> 6373 T1914 oashc.HttpShardHandlerFactory.getParameter Setting sizeOfQueue to: -1
[junit4:junit4]   2> 6373 T1914 oashc.HttpShardHandlerFactory.getParameter Setting fairnessPolicy to: false
[junit4:junit4]   2> 6374 T1914 oascsi.HttpClientUtil.createClient Creating new http client, config:maxConnectionsPerHost=20&maxConnections=10000&socketTimeout=0&connTimeout=0&retry=false
[junit4:junit4]   2> 6384 T1914 oascc.ZkStateReader.createClusterStateWatchersAndUpdate Updating cluster state from ZooKeeper... 
[junit4:junit4]   2> 6389 T1914 oasc.CoreContainer.create Creating SolrCore 'collection1' using instanceDir: /usr/home/hudson/hudson-slave/workspace/Lucene-Solr-Tests-4.x-java7/solr/build/solr-core/test-files/solr/collection1
[junit4:junit4]   2> 6390 T1914 oasc.ZkController.createCollectionZkNode Check for collection zkNode:collection1
[junit4:junit4]   2> 6390 T1914 oasc.ZkController.createCollectionZkNode Collection zkNode exists
[junit4:junit4]   2> 6391 T1914 oasc.ZkController.readConfigName Load collection config from:/collections/collection1
[junit4:junit4]   2> 6392 T1914 oasc.SolrResourceLoader.<init> new SolrResourceLoader for directory: '/usr/home/hudson/hudson-slave/workspace/Lucene-Solr-Tests-4.x-java7/solr/build/solr-core/test-files/solr/collection1/'
[junit4:junit4]   2> 6393 T1914 oasc.SolrResourceLoader.replaceClassLoader Adding 'file:/usr/home/hudson/hudson-slave/workspace/Lucene-Solr-Tests-4.x-java7/solr/build/solr-core/test-files/solr/collection1/lib/classes/' to classloader
[junit4:junit4]   2> 6393 T1914 oasc.SolrResourceLoader.replaceClassLoader Adding 'file:/usr/home/hudson/hudson-slave/workspace/Lucene-Solr-Tests-4.x-java7/solr/build/solr-core/test-files/solr/collection1/lib/README' to classloader
[junit4:junit4]   2> 6443 T1914 oasc.SolrConfig.<init> Using Lucene MatchVersion: LUCENE_40
[junit4:junit4]   2> 6524 T1914 oasc.SolrConfig.<init> Loaded SolrConfig: solrconfig.xml
[junit4:junit4]   2> 6625 T1914 oass.IndexSchema.readSchema Reading Solr Schema
[junit4:junit4]   2> 6631 T1914 oass.IndexSchema.readSchema Schema name=test
[junit4:junit4]   2> 6760 T1935 oascc.ZkStateReader.updateClusterState Updating cloud state from ZooKeeper... 
[junit4:junit4]   2> 6779 T1934 oascc.ZkStateReader$2.process A cluster state change has occurred - updating...
[junit4:junit4]   2> 6779 T1960 oascc.ZkStateReader$2.process A cluster state change has occurred - updating...
[junit4:junit4]   2> 6779 T1972 oascc.ZkStateReader$2.process A cluster state change has occurred - updating...
[junit4:junit4]   2> 6779 T1948 oascc.ZkStateReader$2.process A cluster state change has occurred - updating...
[junit4:junit4]   2> 7114 T1914 oass.OpenExchangeRatesOrgProvider.init Initialized with rates=open-exchange-rates.json, refreshInterval=1440.
[junit4:junit4]   2> 7124 T1914 oass.IndexSchema.readSchema default search field in schema is text
[junit4:junit4]   2> 7128 T1914 oass.IndexSchema.readSchema unique key field: id
[junit4:junit4]   2> 7138 T1914 oass.FileExchangeRateProvider.reload Reloading exchange rates from file currency.xml
[junit4:junit4]   2> 7142 T1914 oass.FileExchangeRateProvider.reload Reloading exchange rates from file currency.xml
[junit4:junit4]   2> 7146 T1914 oass.OpenExchangeRatesOrgProvider.reload Reloading exchange rates from open-exchange-rates.json
[junit4:junit4]   2> 7147 T1914 oass.OpenExchangeRatesOrgProvider.reload Reloading exchange rates from open-exchange-rates.json
[junit4:junit4]   2> 7148 T1914 oasc.SolrCore.<init> [collection1] Opening new SolrCore at /usr/home/hudson/hudson-slave/workspace/Lucene-Solr-Tests-4.x-java7/solr/build/solr-core/test-files/solr/collection1/, dataDir=./org.apache.solr.cloud.BasicDistributedZk2Test-1347537692859/jetty3/
[junit4:junit4]   2> 7149 T1914 oasc.JmxMonitoredMap.<init> JMX monitoring is enabled. Adding Solr mbeans to JMX Server: com.sun.jmx.mbeanserver.JmxMBeanServer@676825b5
[junit4:junit4]   2> 7150 T1914 oasc.SolrCore.getNewIndexDir WARNING New index directory detected: old=null new=./org.apache.solr.cloud.BasicDistributedZk2Test-1347537692859/jetty3/index/
[junit4:junit4]   2> 7151 T1914 oasc.SolrCore.initIndex WARNING [collection1] Solr index directory './org.apache.solr.cloud.BasicDistributedZk2Test-1347537692859/jetty3/index' doesn't exist. Creating new index...
[junit4:junit4]   2> 7152 T1914 oasc.CachingDirectoryFactory.get return new directory for /usr/home/hudson/hudson-slave/workspace/Lucene-Solr-Tests-4.x-java7/solr/build/solr-core/test/J0/./org.apache.solr.cloud.BasicDistributedZk2Test-1347537692859/jetty3/index forceNew:false
[junit4:junit4]   2> 7157 T1914 oasc.SolrDeletionPolicy.onCommit SolrDeletionPolicy.onCommit: commits:num=1
[junit4:junit4]   2> 		commit{dir=NRTCachingDirectory(org.apache.lucene.store.NIOFSDirectory@/usr/home/hudson/hudson-slave/workspace/Lucene-Solr-Tests-4.x-java7/solr/build/solr-core/test/J0/org.apache.solr.cloud.BasicDistributedZk2Test-1347537692859/jetty3/index lockFactory=org.apache.lucene.store.NativeFSLockFactory@3ddfb7d5; maxCacheMB=48.0 maxMergeSizeMB=4.0),segFN=segments_1,generation=1,filenames=[segments_1]
[junit4:junit4]   2> 7157 T1914 oasc.SolrDeletionPolicy.updateCommits newest commit = 1
[junit4:junit4]   2> 7158 T1914 oasc.SolrCore.initWriters created xml: solr.XMLResponseWriter
[junit4:junit4]   2> 7160 T1914 oasup.UpdateRequestProcessorChain.init inserting DistributedUpdateProcessorFactory into updateRequestProcessorChain "dedupe"
[junit4:junit4]   2> 7161 T1914 oasup.UpdateRequestProcessorChain.init inserting DistributedUpdateProcessorFactory into updateRequestProcessorChain "dedupe-allfields"
[junit4:junit4]   2> 7161 T1914 oasup.UpdateRequestProcessorChain.init inserting DistributedUpdateProcessorFactory into updateRequestProcessorChain "stored_sig"
[junit4:junit4]   2> 7162 T1914 oasup.UpdateRequestProcessorChain.init inserting DistributedUpdateProcessorFactory into updateRequestProcessorChain "uniq-fields"
[junit4:junit4]   2> 7162 T1914 oasup.UpdateRequestProcessorChain.init inserting DistributedUpdateProcessorFactory into updateRequestProcessorChain "distrib-dup-test-chain-implicit"
[junit4:junit4]   2> 7163 T1914 oasc.RequestHandlers.initHandlersFromConfig adding lazy requestHandler: solr.ReplicationHandler
[junit4:junit4]   2> 7163 T1914 oasc.RequestHandlers.initHandlersFromConfig created /replication: solr.ReplicationHandler
[junit4:junit4]   2> 7164 T1914 oasc.RequestHandlers.initHandlersFromConfig created standard: solr.StandardRequestHandler
[junit4:junit4]   2> 7164 T1914 oasc.RequestHandlers.initHandlersFromConfig created /get: solr.RealTimeGetHandler
[junit4:junit4]   2> 7165 T1914 oasc.RequestHandlers.initHandlersFromConfig created dismax: solr.SearchHandler
[junit4:junit4]   2> 7166 T1914 oasc.RequestHandlers.initHandlersFromConfig created mock: org.apache.solr.core.MockQuerySenderListenerReqHandler
[junit4:junit4]   2> 7166 T1914 oasc.RequestHandlers.initHandlersFromConfig created /admin/: org.apache.solr.handler.admin.AdminHandlers
[junit4:junit4]   2> 7167 T1914 oasc.RequestHandlers.initHandlersFromConfig created defaults: solr.StandardRequestHandler
[junit4:junit4]   2> 7167 T1914 oasc.RequestHandlers.initHandlersFromConfig adding lazy requestHandler: solr.StandardRequestHandler
[junit4:junit4]   2> 7168 T1914 oasc.RequestHandlers.initHandlersFromConfig created lazy: solr.StandardRequestHandler
[junit4:junit4]   2> 7168 T1914 oasc.RequestHandlers.initHandlersFromConfig created /update: solr.UpdateRequestHandler
[junit4:junit4]   2> 7169 T1914 oasc.RequestHandlers.initHandlersFromConfig created /terms: org.apache.solr.handler.component.SearchHandler
[junit4:junit4]   2> 7169 T1914 oasc.RequestHandlers.initHandlersFromConfig created spellCheckCompRH: org.apache.solr.handler.component.SearchHandler
[junit4:junit4]   2> 7170 T1914 oasc.RequestHandlers.initHandlersFromConfig created spellCheckCompRH_Direct: org.apache.solr.handler.component.SearchHandler
[junit4:junit4]   2> 7170 T1914 oasc.RequestHandlers.initHandlersFromConfig created spellCheckWithWordbreak: org.apache.solr.handler.component.SearchHandler
[junit4:junit4]   2> 7171 T1914 oasc.RequestHandlers.initHandlersFromConfig created spellCheckWithWordbreak_Direct: org.apache.solr.handler.component.SearchHandler
[junit4:junit4]   2> 7171 T1914 oasc.RequestHandlers.initHandlersFromConfig created spellCheckCompRH1: org.apache.solr.handler.component.SearchHandler
[junit4:junit4]   2> 7172 T1914 oasc.RequestHandlers.initHandlersFromConfig created tvrh: org.apache.solr.handler.component.SearchHandler
[junit4:junit4]   2> 7172 T1914 oasc.RequestHandlers.initHandlersFromConfig created /mlt: solr.MoreLikeThisHandler
[junit4:junit4]   2> 7173 T1914 oasc.RequestHandlers.initHandlersFromConfig created /debug/dump: solr.DumpRequestHandler
[junit4:junit4]   2> 7176 T1914 oashl.XMLLoader.init xsltCacheLifetimeSeconds=60
[junit4:junit4]   2> 7180 T1914 oasc.SolrCore.initDeprecatedSupport WARNING solrconfig.xml uses deprecated <admin/gettableFiles>, Please update your config to use the ShowFileRequestHandler.
[junit4:junit4]   2> 7181 T1914 oasc.SolrCore.initDeprecatedSupport WARNING adding ShowFileRequestHandler with hidden files: [SCHEMA.XML, OLD_SYNONYMS.TXT, STOPWORDS.TXT, PROTWORDS.TXT, OPEN-EXCHANGE-RATES.JSON, SYNONYMS.TXT, CURRENCY.XML, MAPPING-ISOLATIN1ACCENT.TXT]
[junit4:junit4]   2> 7184 T1914 oass.SolrIndexSearcher.<init> Opening Searcher@16ce3417 main
[junit4:junit4]   2> 7185 T1914 oasu.CommitTracker.<init> Hard AutoCommit: disabled
[junit4:junit4]   2> 7186 T1914 oasu.CommitTracker.<init> Soft AutoCommit: disabled
[junit4:junit4]   2> 7187 T1914 oashc.SpellCheckComponent.inform Initializing spell checkers
[junit4:junit4]   2> 7193 T1914 oass.DirectSolrSpellChecker.init init: {name=direct,classname=DirectSolrSpellChecker,field=lowerfilt,minQueryLength=3}
[junit4:junit4]   2> 7242 T1973 oasc.SolrCore.registerSearcher [collection1] Registered new searcher Searcher@16ce3417 main{StandardDirectoryReader(segments_1:1)}
[junit4:junit4]   2> 7285 T1935 oascc.ZkStateReader.updateClusterState Updating cloud state from ZooKeeper... 
[junit4:junit4]   2> 7298 T1960 oascc.ZkStateReader$2.process A cluster state change has occurred - updating...
[junit4:junit4]   2> 7298 T1972 oascc.ZkStateReader$2.process A cluster state change has occurred - updating...
[junit4:junit4]   2> 7298 T1948 oascc.ZkStateReader$2.process A cluster state change has occurred - updating...
[junit4:junit4]   2> 7298 T1934 oascc.ZkStateReader$2.process A cluster state change has occurred - updating...
[junit4:junit4]   2> 7747 T1914 oasc.CoreContainer.register registering core: collection1
[junit4:junit4]   2> 7747 T1914 oasc.ZkController.register Register shard - core:collection1 address:http://127.0.0.1:52804/solr shardId:shard1
[junit4:junit4]   2> 7751 T1914 oasc.ZkController.register We are http://127.0.0.1:52804/solr/collection1/ and leader is http://127.0.0.1:52760/solr/collection1/
[junit4:junit4]   2> 7751 T1914 oasc.ZkController.register No LogReplay needed for core=collection1 baseURL=http://127.0.0.1:52804/solr
[junit4:junit4]   2> 7752 T1914 oasc.ZkController.checkRecovery Core needs to recover:collection1
[junit4:junit4]   2> 7752 T1914 oasu.DefaultSolrCoreState.doRecovery Running recovery - first canceling any ongoing recovery
[junit4:junit4]   2> ASYNC  NEW_CORE C222 name=collection1 org.apache.solr.core.SolrCore@385106b0 url=http://127.0.0.1:52804/solr/collection1 node=127.0.0.1:52804_solr
[junit4:junit4]   2> 7754 T1974 C222 P52804 oasc.RecoveryStrategy.run Starting recovery process.  core=collection1 recoveringAfterStartup=true
[junit4:junit4]   2> 7754 T1914 oascc.ZkStateReader.updateClusterState Updating cloud state from ZooKeeper... 
[junit4:junit4]   2> 7754 T1974 C222 P52804 oasc.RecoveryStrategy.doRecovery ###### startupVersions=[]
[junit4:junit4]   2> 7755 T1914 oass.SolrDispatchFilter.init user.dir=/usr/home/hudson/hudson-slave/workspace/Lucene-Solr-Tests-4.x-java7/solr/build/solr-core/test/J0
[junit4:junit4]   2> 7755 T1914 oass.SolrDispatchFilter.init SolrDispatchFilter.init() done
[junit4:junit4]   2> 7756 T1914 oascsi.HttpClientUtil.createClient Creating new http client, config:maxConnections=128&maxConnectionsPerHost=32&followRedirects=false
[junit4:junit4]   2> 7756 T1974 C222 P52804 oascsi.HttpClientUtil.createClient Creating new http client, config:maxConnections=128&maxConnectionsPerHost=32&followRedirects=false
[junit4:junit4]   2> 7772 T1914 oejs.Server.doStart jetty-8.1.2.v20120308
[junit4:junit4]   2> 7775 T1914 oejs.AbstractConnector.doStart Started SocketConnector@0.0.0.0:52822
[junit4:junit4]   2> 7775 T1914 oasc.SolrResourceLoader.locateSolrHome JNDI not configured for solr (NoInitialContextEx)
[junit4:junit4]   2> 7776 T1914 oasc.SolrResourceLoader.locateSolrHome using system property solr.solr.home: /usr/home/hudson/hudson-slave/workspace/Lucene-Solr-Tests-4.x-java7/solr/build/solr-core/test-files/solr
[junit4:junit4]   2> 7776 T1914 oasc.SolrResourceLoader.<init> new SolrResourceLoader for deduced Solr Home: '/usr/home/hudson/hudson-slave/workspace/Lucene-Solr-Tests-4.x-java7/solr/build/solr-core/test-files/solr/'
[junit4:junit4]   2> 7801 T1935 oascc.ZkStateReader.updateClusterState Updating cloud state from ZooKeeper... 
[junit4:junit4]   2> 7809 T1914 oass.SolrDispatchFilter.init SolrDispatchFilter.init()
[junit4:junit4]   2> 7809 T1914 oasc.SolrResourceLoader.locateSolrHome JNDI not configured for solr (NoInitialContextEx)
[junit4:junit4]   2> 7810 T1914 oasc.SolrResourceLoader.locateSolrHome using system property solr.solr.home: /usr/home/hudson/hudson-slave/workspace/Lucene-Solr-Tests-4.x-java7/solr/build/solr-core/test-files/solr
[junit4:junit4]   2> 7810 T1914 oasc.CoreContainer$Initializer.initialize looking for solr.xml: /usr/home/hudson/hudson-slave/workspace/Lucene-Solr-Tests-4.x-java7/solr/build/solr-core/test-files/solr/solr.xml
[junit4:junit4]   2> 7810 T1914 oasc.CoreContainer.<init> New CoreContainer 652009475
[junit4:junit4]   2> 7811 T1914 oasc.CoreContainer.load Loading CoreContainer using Solr Home: '/usr/home/hudson/hudson-slave/workspace/Lucene-Solr-Tests-4.x-java7/solr/build/solr-core/test-files/solr/'
[junit4:junit4]   2> 7811 T1914 oasc.SolrResourceLoader.<init> new SolrResourceLoader for directory: '/usr/home/hudson/hudson-slave/workspace/Lucene-Solr-Tests-4.x-java7/solr/build/solr-core/test-files/solr/'
[junit4:junit4]   2> 7814 T1948 oascc.ZkStateReader$2.process A cluster state change has occurred - updating...
[junit4:junit4]   2> 7814 T1934 oascc.ZkStateReader$2.process A cluster state change has occurred - updating...
[junit4:junit4]   2> 7814 T1960 oascc.ZkStateReader$2.process A cluster state change has occurred - updating...
[junit4:junit4]   2> 7814 T1972 oascc.ZkStateReader$2.process A cluster state change has occurred - updating...
[junit4:junit4]   2> 7837 T1914 oasc.CoreContainer.load Registering Log Listener
[junit4:junit4]   2> 7850 T1914 oasc.CoreContainer.initZooKeeper Zookeeper client=127.0.0.1:52727/solr
[junit4:junit4]   2> 7851 T1914 oaz.ZooKeeper.<init> Initiating client connection, connectString=127.0.0.1:52727/solr sessionTimeout=8000 watcher=org.apache.solr.common.cloud.ConnectionManager@7b5fb19d
[junit4:junit4]   2> 7851 T1984 oaz.ClientCnxn$SendThread.startConnect Opening socket connection to server /127.0.0.1:52727
[junit4:junit4]   2> 7851 T1914 oascc.ConnectionManager.waitForConnected Waiting for client to connect to ZooKeeper
[junit4:junit4]   2> 7852 T1984 oaz.ClientCnxn$SendThread.primeConnection Socket connection established to localhost/127.0.0.1:52727, initiating session
[junit4:junit4]   2> 7852 T1916 oazs.NIOServerCnxn$Factory.run Accepted socket connection from /140.211.11.196:52824
[junit4:junit4]   2> 7853 T1916 oazs.NIOServerCnxn.readConnectRequest Client attempting to establish new session at /140.211.11.196:52824
[junit4:junit4]   2> 7861 T1918 oazs.NIOServerCnxn.finishSessionInit Established session 0x139bf8168c10006 with negotiated timeout 8000 for client /140.211.11.196:52824
[junit4:junit4]   2> 7861 T1984 oaz.ClientCnxn$SendThread.readConnectResult Session establishment complete on server localhost/127.0.0.1:52727, sessionid = 0x139bf8168c10006, negotiated timeout = 8000
[junit4:junit4]   2> 7862 T1985 oascc.ConnectionManager.process Watcher org.apache.solr.common.cloud.ConnectionManager@7b5fb19d name:ZooKeeperConnection Watcher:127.0.0.1:52727/solr got event WatchedEvent state:SyncConnected type:None path:null path:null type:None
[junit4:junit4]   2> 7862 T1914 oascc.ConnectionManager.waitForConnected Client is connected to ZooKeeper
[junit4:junit4]   2> 7863 T1919 oazs.PrepRequestProcessor.pRequest Got user-level KeeperException when processing sessionid:0x139bf8168c10006 type:create cxid:0x1 zxid:0xfffffffffffffffe txntype:unknown reqpath:n/a Error Path:/solr/overseer Error:KeeperErrorCode = NodeExists for /solr/overseer
[junit4:junit4]   2> 7865 T1919 oazs.PrepRequestProcessor.pRequest Got user-level KeeperException when processing sessionid:0x139bf8168c10006 type:create cxid:0x2 zxid:0xfffffffffffffffe txntype:unknown reqpath:n/a Error Path:/solr/overseer Error:KeeperErrorCode = NodeExists for /solr/overseer
[junit4:junit4]   2> 7867 T1914 oasc.ZkController.createEphemeralLiveNode Register node as live in ZooKeeper:/live_nodes/127.0.0.1:52822_solr
[junit4:junit4]   2> 7868 T1919 oazs.PrepRequestProcessor.pRequest Got user-level KeeperException when processing sessionid:0x139bf8168c10006 type:delete cxid:0x4 zxid:0xfffffffffffffffe txntype:unknown reqpath:n/a Error Path:/solr/live_nodes/127.0.0.1:52822_solr Error:KeeperErrorCode = NoNode for /solr/live_nodes/127.0.0.1:52822_solr
[junit4:junit4]   2> 7876 T1914 oascc.SolrZkClient.makePath makePath: /live_nodes/127.0.0.1:52822_solr
[junit4:junit4]   2> 7878 T1960 oascc.ZkStateReader$3.process Updating live nodes
[junit4:junit4]   2> 7878 T1972 oascc.ZkStateReader$3.process Updating live nodes
[junit4:junit4]   2> 7878 T1948 oascc.ZkStateReader$3.process Updating live nodes
[junit4:junit4]   2> 7878 T1934 oascc.ZkStateReader$3.process Updating live nodes
[junit4:junit4]   2> 7878 T1914 oashc.HttpShardHandlerFactory.getParameter Setting socketTimeout to: 0
[junit4:junit4]   2> 7879 T1914 oashc.HttpShardHandlerFactory.getParameter Setting urlScheme to: http://
[junit4:junit4]   2> 7879 T1914 oashc.HttpShardHandlerFactory.getParameter Setting connTimeout to: 0
[junit4:junit4]   2> 7879 T1914 oashc.HttpShardHandlerFactory.getParameter Setting maxConnectionsPerHost to: 20
[junit4:junit4]   2> 7880 T1914 oashc.HttpShardHandlerFactory.getParameter Setting corePoolSize to: 0
[junit4:junit4]   2> 7880 T1914 oashc.HttpShardHandlerFactory.getParameter Setting maximumPoolSize to: 2147483647
[junit4:junit4]   2> 7881 T1914 oashc.HttpShardHandlerFactory.getParameter Setting maxThreadIdleTime to: 5
[junit4:junit4]   2> 7881 T1914 oashc.HttpShardHandlerFactory.getParameter Setting sizeOfQueue to: -1
[junit4:junit4]   2> 7881 T1914 oashc.HttpShardHandlerFactory.getParameter Setting fairnessPolicy to: false
[junit4:junit4]   2> 7882 T1914 oascsi.HttpClientUtil.createClient Creating new http client, config:maxConnectionsPerHost=20&maxConnections=10000&socketTimeout=0&connTimeout=0&retry=false
[junit4:junit4]   2> 7892 T1914 oascc.ZkStateReader.createClusterStateWatchersAndUpdate Updating cluster state from ZooKeeper... 
[junit4:junit4]   2> 7898 T1914 oasc.CoreContainer.create Creating SolrCore 'collection1' using instanceDir: /usr/home/hudson/hudson-slave/workspace/Lucene-Solr-Tests-4.x-java7/solr/build/solr-core/test-files/solr/collection1
[junit4:junit4]   2> 7898 T1914 oasc.ZkController.createCollectionZkNode Check for collection zkNode:collection1
[junit4:junit4]   2> 7899 T1914 oasc.ZkController.createCollectionZkNode Collection zkNode exists
[junit4:junit4]   2> 7899 T1914 oasc.ZkController.readConfigName Load collection config from:/collections/collection1
[junit4:junit4]   2> 7900 T1914 oasc.SolrResourceLoader.<init> new SolrResourceLoader for directory: '/usr/home/hudson/hudson-slave/workspace/Lucene-Solr-Tests-4.x-java7/solr/build/solr-core/test-files/solr/collection1/'
[junit4:junit4]   2> 7901 T1914 oasc.SolrResourceLoader.replaceClassLoader Adding 'file:/usr/home/hudson/hudson-slave/workspace/Lucene-Solr-Tests-4.x-java7/solr/build/solr-core/test-files/solr/collection1/lib/classes/' to classloader
[junit4:junit4]   2> 7902 T1914 oasc.SolrResourceLoader.replaceClassLoader Adding 'file:/usr/home/hudson/hudson-slave/workspace/Lucene-Solr-Tests-4.x-java7/solr/build/solr-core/test-files/solr/collection1/lib/README' to classloader
[junit4:junit4]   2> 7942 T1914 oasc.SolrConfig.<init> Using Lucene MatchVersion: LUCENE_40
[junit4:junit4]   2> 7996 T1914 oasc.SolrConfig.<init> Loaded SolrConfig: solrconfig.xml
[junit4:junit4]   2> 8097 T1914 oass.IndexSchema.readSchema Reading Solr Schema
[junit4:junit4]   2> 8106 T1914 oass.IndexSchema.readSchema Schema name=test
[junit4:junit4]   2> 8837 T1914 oass.OpenExchangeRatesOrgProvider.init Initialized with rates=open-exchange-rates.json, refreshInterval=1440.
[junit4:junit4]   2> 8851 T1914 oass.IndexSchema.readSchema default search field in schema is text
[junit4:junit4]   2> 8856 T1914 oass.IndexSchema.readSchema unique key field: id
[junit4:junit4]   2> 8868 T1914 oass.FileExchangeRateProvider.reload Reloading exchange rates from file currency.xml
[junit4:junit4]   2> 8874 T1914 oass.FileExchangeRateProvider.reload Reloading exchange rates from file currency.xml
[junit4:junit4]   2> 8880 T1914 oass.OpenExchangeRatesOrgProvider.reload Reloading exchange rates from open-exchange-rates.json
[junit4:junit4]   2> 8881 T1914 oass.OpenExchangeRatesOrgProvider.reload Reloading exchange rates from open-exchange-rates.json
[junit4:junit4]   2> 8882 T1914 oasc.SolrCore.<init> [collection1] Opening new SolrCore at /usr/home/hudson/hudson-slave/workspace/Lucene-Solr-Tests-4.x-java7/solr/build/solr-core/test-files/solr/collection1/, dataDir=./org.apache.solr.cloud.BasicDistributedZk2Test-1347537692859/jetty4/
[junit4:junit4]   2> 8883 T1914 oasc.JmxMonitoredMap.<init> JMX monitoring is enabled. Adding Solr mbeans to JMX Server: com.sun.jmx.mbeanserver.JmxMBeanServer@676825b5
[junit4:junit4]   2> 8884 T1914 oasc.SolrCore.getNewIndexDir WARNING New index directory detected: old=null new=./org.apache.solr.cloud.BasicDistributedZk2Test-1347537692859/jetty4/index/
[junit4:junit4]   2> 8885 T1914 oasc.SolrCore.initIndex WARNING [collection1] Solr index directory './org.apache.solr.cloud.BasicDistributedZk2Test-1347537692859/jetty4/index' doesn't exist. Creating new index...
[junit4:junit4]   2> 8887 T1914 oasc.CachingDirectoryFactory.get return new directory for /usr/home/hudson/hudson-slave/workspace/Lucene-Solr-Tests-4.x-java7/solr/build/solr-core/test/J0/./org.apache.solr.cloud.BasicDistributedZk2Test-1347537692859/jetty4/index forceNew:false
[junit4:junit4]   2> 8894 T1914 oasc.SolrDeletionPolicy.onCommit SolrDeletionPolicy.onCommit: commits:num=1
[junit4:junit4]   2> 		commit{dir=NRTCachingDirectory(org.apache.lucene.store.NIOFSDirectory@/usr/home/hudson/hudson-slave/workspace/Lucene-Solr-Tests-4.x-java7/solr/build/solr-core/test/J0/org.apache.solr.cloud.BasicDistributedZk2Test-1347537692859/jetty4/index lockFactory=org.apache.lucene.store.NativeFSLockFactory@13f818c3; maxCacheMB=48.0 maxMergeSizeMB=4.0),segFN=segments_1,generation=1,filenames=[segments_1]
[junit4:junit4]   2> 8895 T1914 oasc.SolrDeletionPolicy.updateCommits newest commit = 1
[junit4:junit4]   2> 8896 T1914 oasc.SolrCore.initWriters created xml: solr.XMLResponseWriter
[junit4:junit4]   2> 8899 T1914 oasup.UpdateRequestProcessorChain.init inserting DistributedUpdateProcessorFactory into updateRequestProcessorChain "dedupe"
[junit4:junit4]   2> 8900 T1914 oasup.UpdateRequestProcessorChain.init inserting DistributedUpdateProcessorFactory into updateRequestProcessorChain "dedupe-allfields"
[junit4:junit4]   2> 8900 T1914 oasup.UpdateRequestProcessorChain.init inserting DistributedUpdateProcessorFactory into updateRequestProcessorChain "stored_sig"
[junit4:junit4]   2> 8901 T1914 oasup.UpdateRequestProcessorChain.init inserting DistributedUpdateProcessorFactory into updateRequestProcessorChain "uniq-fields"
[junit4:junit4]   2> 8902 T1914 oasup.UpdateRequestProcessorChain.init inserting DistributedUpdateProcessorFactory into updateRequestProcessorChain "distrib-dup-test-chain-implicit"
[junit4:junit4]   2> 8902 T1914 oasc.RequestHandlers.initHandlersFromConfig adding lazy requestHandler: solr.ReplicationHandler
[junit4:junit4]   2> 8903 T1914 oasc.RequestHandlers.initHandlersFromConfig created /replication: solr.ReplicationHandler
[junit4:junit4]   2> 8904 T1914 oasc.RequestHandlers.initHandlersFromConfig created standard: solr.StandardRequestHandler
[junit4:junit4]   2> 8905 T1914 oasc.RequestHandlers.initHandlersFromConfig created /get: solr.RealTimeGetHandler
[junit4:junit4]   2> 8905 T1914 oasc.RequestHandlers.initHandlersFromConfig created dismax: solr.SearchHandler
[junit4:junit4]   2> 8906 T1914 oasc.RequestHandlers.initHandlersFromConfig created mock: org.apache.solr.core.MockQuerySenderListenerReqHandler
[junit4:junit4]   2> 8907 T1914 oasc.RequestHandlers.initHandlersFromConfig created /admin/: org.apache.solr.handler.admin.AdminHandlers
[junit4:junit4]   2> 8908 T1914 oasc.RequestHandlers.initHandlersFromConfig created defaults: solr.StandardRequestHandler
[junit4:junit4]   2> 8908 T1914 oasc.RequestHandlers.initHandlersFromConfig adding lazy requestHandler: solr.StandardRequestHandler
[junit4:junit4]   2> 8909 T1914 oasc.RequestHandlers.initHandlersFromConfig created lazy: solr.StandardRequestHandler
[junit4:junit4]   2> 8910 T1914 oasc.RequestHandlers.initHandlersFromConfig created /update: solr.UpdateRequestHandler
[junit4:junit4]   2> 8911 T1914 oasc.RequestHandlers.initHandlersFromConfig created /terms: org.apache.solr.handler.component.SearchHandler
[junit4:junit4]   2> 8911 T1914 oasc.RequestHandlers.initHandlersFromConfig created spellCheckCompRH: org.apache.solr.handler.component.SearchHandler
[junit4:junit4]   2> 8912 T1914 oasc.RequestHandlers.initHandlersFromConfig created spellCheckCompRH_Direct: org.apache.solr.handler.component.SearchHandler
[junit4:junit4]   2> 8913 T1914 oasc.RequestHandlers.initHandlersFromConfig created spellCheckWithWordbreak: org.apache.solr.handler.component.SearchHandler
[junit4:junit4]   2> 8914 T1914 oasc.RequestHandlers.initHandlersFromConfig created spellCheckWithWordbreak_Direct: org.apache.solr.handler.component.SearchHandler
[junit4:junit4]   2> 8914 T1914 oasc.RequestHandlers.initHandlersFromConfig created spellCheckCompRH1: org.apache.solr.handler.component.SearchHandler
[junit4:junit4]   2> 8915 T1914 oasc.RequestHandlers.initHandlersFromConfig created tvrh: org.apache.solr.handler.component.SearchHandler
[junit4:junit4]   2> 8916 T1914 oasc.RequestHandlers.initHandlersFromConfig created /mlt: solr.MoreLikeThisHandler
[junit4:junit4]   2> 8917 T1914 oasc.RequestHandlers.initHandlersFromConfig created /debug/dump: solr.DumpRequestHandler
[junit4:junit4]   2> 8921 T1914 oashl.XMLLoader.init xsltCacheLifetimeSeconds=60
[junit4:junit4]   2> 8927 T1914 oasc.SolrCore.initDeprecatedSupport WARNING solrconfig.xml uses deprecated <admin/gettableFiles>, Please update your config to use the ShowFileRequestHandler.
[junit4:junit4]   2> 8929 T1914 oasc.SolrCore.initDeprecatedSupport WARNING adding ShowFileRequestHandler with hidden files: [SCHEMA.XML, OLD_SYNONYMS.TXT, STOPWORDS.TXT, PROTWORDS.TXT, OPEN-EXCHANGE-RATES.JSON, SYNONYMS.TXT, CURRENCY.XML, MAPPING-ISOLATIN1ACCENT.TXT]
[junit4:junit4]   2> 8933 T1914 oass.SolrIndexSearcher.<init> Opening Searcher@10a91a9b main
[junit4:junit4]   2> 8935 T1914 oasu.CommitTracker.<init> Hard AutoCommit: disabled
[junit4:junit4]   2> 8936 T1914 oasu.CommitTracker.<init> Soft AutoCommit: disabled
[junit4:junit4]   2> 8936 T1914 oashc.SpellCheckComponent.inform Initializing spell checkers
[junit4:junit4]   2> 8945 T1914 oass.DirectSolrSpellChecker.init init: {name=direct,classname=DirectSolrSpellChecker,field=lowerfilt,minQueryLength=3}
[junit4:junit4]   2> 9001 T1986 oasc.SolrCore.registerSearcher [collection1] Registered new searcher Searcher@10a91a9b main{StandardDirectoryReader(segments_1:1)}
[junit4:junit4]   2> 9322 T1935 oascc.ZkStateReader.updateClusterState Updating cloud state from ZooKeeper... 
[junit4:junit4]   2> 9335 T1972 oascc.ZkStateReader$2.process A cluster state change has occurred - updating...
[junit4:junit4]   2> 9335 T1948 oascc.ZkStateReader$2.process A cluster state change has occurred - updating...
[junit4:junit4]   2> 9336 T1934 oascc.ZkStateReader$2.process A cluster state change has occurred - updating...
[junit4:junit4]   2> 9336 T1960 oascc.ZkStateReader$2.process A cluster state change has occurred - updating...
[junit4:junit4]   2> 9335 T1985 oascc.ZkStateReader$2.process A cluster state change has occurred - updating...
[junit4:junit4]   2> 9507 T1914 oasc.CoreContainer.register registering core: collection1
[junit4:junit4]   2> 9508 T1914 oasc.ZkController.register Register shard - core:collection1 address:http://127.0.0.1:52822/solr shardId:shard2
[junit4:junit4]   2> 9511 T1914 oasc.ZkController.register We are http://127.0.0.1:52822/solr/collection1/ and leader is http://127.0.0.1:52788/solr/collection1/
[junit4:junit4]   2> 9511 T1914 oasc.ZkController.register No LogReplay needed for core=collection1 baseURL=http://127.0.0.1:52822/solr
[junit4:junit4]   2> 9512 T1914 oasc.ZkController.checkRecovery Core needs to recover:collection1
[junit4:junit4]   2> 9513 T1914 oasu.DefaultSolrCoreState.doRecovery Running recovery - first canceling any ongoing recovery
[junit4:junit4]   2> ASYNC  NEW_CORE C223 name=collection1 org.apache.solr.core.SolrCore@3cc73bac url=http://127.0.0.1:52822/solr/collection1 node=127.0.0.1:52822_solr
[junit4:junit4]   2> 9514 T1987 C223 P52822 oasc.RecoveryStrategy.run Starting recovery process.  core=collection1 recoveringAfterStartup=true
[junit4:junit4]   2> 9514 T1987 C223 P52822 oasc.RecoveryStrategy.doRecovery ###### startupVersions=[]
[junit4:junit4]   2> 9514 T1914 oascc.ZkStateReader.updateClusterState Updating cloud state from ZooKeeper... 
[junit4:junit4]   2> 9516 T1987 C223 P52822 oascsi.HttpClientUtil.createClient Creating new http client, config:maxConnections=128&maxConnectionsPerHost=32&followRedirects=false
[junit4:junit4]   2> 9516 T1914 oass.SolrDispatchFilter.init user.dir=/usr/home/hudson/hudson-slave/workspace/Lucene-Solr-Tests-4.x-java7/solr/build/solr-core/test/J0
[junit4:junit4]   2> 9517 T1914 oass.SolrDispatchFilter.init SolrDispatchFilter.init() done
[junit4:junit4]   2> 9517 T1914 oascsi.HttpClientUtil.createClient Creating new http client, config:maxConnections=128&maxConnectionsPerHost=32&followRedirects=false
[junit4:junit4]   2> 9535 T1914 oaz.ZooKeeper.<init> Initiating client connection, connectString=127.0.0.1:52727/solr sessionTimeout=10000 watcher=org.apache.solr.common.cloud.ConnectionManager@6b075abc
[junit4:junit4]   2> 9537 T1988 oaz.ClientCnxn$SendThread.startConnect Opening socket connection to server /127.0.0.1:52727
[junit4:junit4]   2> 9537 T1914 oascc.ConnectionManager.waitForConnected Waiting for client to connect to ZooKeeper
[junit4:junit4]   2> 9538 T1988 oaz.ClientCnxn$SendThread.primeConnection Socket connection established to localhost/127.0.0.1:52727, initiating session
[junit4:junit4]   2> 9538 T1916 oazs.NIOServerCnxn$Factory.run Accepted socket connection from /140.211.11.196:52842
[junit4:junit4]   2> 9538 T1916 oazs.NIOServerCnxn.readConnectRequest Client attempting to establish new session at /140.211.11.196:52842
[junit4:junit4]   2> 9540 T1918 oazs.NIOServerCnxn.finishSessionInit Established session 0x139bf8168c10007 with negotiated timeout 10000 for client /140.211.11.196:52842
[junit4:junit4]   2> 9540 T1988 oaz.ClientCnxn$SendThread.readConnectResult Session establishment complete on server localhost/127.0.0.1:52727, sessionid = 0x139bf8168c10007, negotiated timeout = 10000
[junit4:junit4]   2> 9540 T1989 oascc.ConnectionManager.process Watcher org.apache.solr.common.cloud.ConnectionManager@6b075abc name:ZooKeeperConnection Watcher:127.0.0.1:52727/solr got event WatchedEvent state:SyncConnected type:None path:null path:null type:None
[junit4:junit4]   2> 9540 T1914 oascc.ConnectionManager.waitForConnected Client is connected to ZooKeeper
[junit4:junit4]   2> 9541 T1914 oascc.ZkStateReader.createClusterStateWatchersAndUpdate Updating cluster state from ZooKeeper... 
[junit4:junit4]   2> 9545 T1914 oasc.ChaosMonkey.monkeyLog monkey: init - expire sessions:true cause connection loss:true
[junit4:junit4]   2> 9546 T1914 oascsi.HttpClientUtil.createClient Creating new http client, config:
[junit4:junit4]   2> 9557 T1914 oascc.ZkStateReader.updateClusterState Updating cloud state from ZooKeeper... 
[junit4:junit4]   2> ASYNC  NEW_CORE C224 name=collection1 org.apache.solr.core.SolrCore@42c74deb url=http://127.0.0.1:52735/solr/collection1 node=127.0.0.1:52735_solr
[junit4:junit4]   2> 9573 T1926 C224 P52735 oasc.SolrDeletionPolicy.onInit SolrDeletionPolicy.onInit: commits:num=1
[junit4:junit4]   2> 		commit{dir=NRTCachingDirectory(org.apache.lucene.store.NIOFSDirectory@/usr/home/hudson/hudson-slave/workspace/Lucene-Solr-Tests-4.x-java7/solr/build/solr-core/test/J0/org.apache.solr.cloud.BasicDistributedZk2Test-1347537692859/control/data/index lockFactory=org.apache.lucene.store.NativeFSLockFactory@4367e139; maxCacheMB=48.0 maxMergeSizeMB=4.0),segFN=segments_1,generation=1,filenames=[segments_1]
[junit4:junit4]   2> 9574 T1926 C224 P52735 oasc.SolrDeletionPolicy.updateCommits newest commit = 1
[junit4:junit4]   2> 9579 T1926 C224 P52735 /update {wt=javabin&version=2} {add=[1 (1412995693856948224)]} 0 10
[junit4:junit4]   2> 9581 T1914 oaz.ZooKeeper.<init> Initiating client connection, connectString=127.0.0.1:52727/solr sessionTimeout=10000 watcher=org.apache.solr.common.cloud.ConnectionManager@7295ab2e
[junit4:junit4]   2> 9582 T1990 oaz.ClientCnxn$SendThread.startConnect Opening socket connection to server /127.0.0.1:52727
[junit4:junit4]   2> 9582 T1914 oascc.ConnectionManager.waitForConnected Waiting for client to connect to ZooKeeper
[junit4:junit4]   2> 9583 T1990 oaz.ClientCnxn$SendThread.primeConnection Socket connection established to localhost/127.0.0.1:52727, initiating session
[junit4:junit4]   2> 9583 T1916 oazs.NIOServerCnxn$Factory.run Accepted socket connection from /140.211.11.196:52845
[junit4:junit4]   2> 9583 T1916 oazs.NIOServerCnxn.readConnectRequest Client attempting to establish new session at /140.211.11.196:52845
[junit4:junit4]   2> 9584 T1918 oazs.NIOServerCnxn.finishSessionInit Established session 0x139bf8168c10008 with negotiated timeout 10000 for client /140.211.11.196:52845
[junit4:junit4]   2> 9585 T1990 oaz.ClientCnxn$SendThread.readConnectResult Session establishment complete on server localhost/127.0.0.1:52727, sessionid = 0x139bf8168c10008, negotiated timeout = 10000
[junit4:junit4]   2> 9585 T1991 oascc.ConnectionManager.process Watcher org.apache.solr.common.cloud.ConnectionManager@7295ab2e name:ZooKeeperConnection Watcher:127.0.0.1:52727/solr got event WatchedEvent state:SyncConnected type:None path:null path:null type:None
[junit4:junit4]   2> 9585 T1914 oascc.ConnectionManager.waitForConnected Client is connected to ZooKeeper
[junit4:junit4]   2> 9586 T1914 oascc.ZkStateReader.createClusterStateWatchersAndUpdate Updating cluster state from ZooKeeper... 
[junit4:junit4]   2> ASYNC  NEW_CORE C225 name=collection1 org.apache.solr.core.SolrCore@3cb4e502 url=http://127.0.0.1:52760/solr/collection1 node=127.0.0.1:52760_solr
[junit4:junit4]   2> 9607 T1941 C225 P52760 oasc.SolrDeletionPolicy.onInit SolrDeletionPolicy.onInit: commits:num=1
[junit4:junit4]   2> 		commit{dir=NRTCachingDirectory(org.apache.lucene.store.NIOFSDirectory@/usr/home/hudson/hudson-slave/workspace/Lucene-Solr-Tests-4.x-java7/solr/build/solr-core/test/J0/org.apache.solr.cloud.BasicDistributedZk2Test-1347537692859/jetty1/index lockFactory=org.apache.lucene.store.NativeFSLockFactory@6aab7fa9; maxCacheMB=48.0 maxMergeSizeMB=4.0),segFN=segments_1,generation=1,filenames=[segments_1]
[junit4:junit4]   2> 9608 T1941 C225 P52760 oasc.SolrDeletionPolicy.updateCommits newest commit = 1
[junit4:junit4]   2>  C222_STATE=coll:collection1 core:collection1 props:{shard=shard1, roles=null, state=recovering, core=collection1, collection=collection1, node_name=127.0.0.1:52804_solr, base_url=http://127.0.0.1:52804/solr}
[junit4:junit4]   2> 9625 T1964 C222 P52804 oasc.SolrDeletionPolicy.onInit SolrDeletionPolicy.onInit: commits:num=1
[junit4:junit4]   2> 		commit{dir=NRTCachingDirectory(org.apache.lucene.store.NIOFSDirectory@/usr/home/hudson/hudson-slave/workspace/Lucene-Solr-Tests-4.x-java7/solr/build/solr-core/test/J0/org.apache.solr.cloud.BasicDistributedZk2Test-1347537692859/jetty3/index lockFactory=org.apache.lucene.store.NativeFSLockFactory@3ddfb7d5; maxCacheMB=48.0 maxMergeSizeMB=4.0),segFN=segments_1,generation=1,filenames=[segments_1]
[junit4:junit4]   2> 9626 T1964 C222 P52804 oasc.SolrDeletionPolicy.updateCommits newest commit = 1
[junit4:junit4]   2> 9630 T1964 C222 P52804 REQ /update {update.distrib=FROMLEADER&distrib.from=http://127.0.0.1:52760/solr/collection1/&wt=javabin&version=2} status=0 QTime=9 
[junit4:junit4]   2> 9631 T1941 C225 P52760 REQ /update {distrib.from=http://127.0.0.1:52788/solr/collection1/&update.distrib=TOLEADER&wt=javabin&version=2} status=0 QTime=28 
[junit4:junit4]   2> ASYNC  NEW_CORE C226 name=collection1 org.apache.solr.core.SolrCore@3d7220a8 url=http://127.0.0.1:52788/solr/collection1 node=127.0.0.1:52788_solr
[junit4:junit4]   2> 9632 T1953 C226 P52788 /update {wt=javabin&version=2} {add=[1]} 0 36
[junit4:junit4]   2> 9632 T1914 oasc.AbstractDistribZkTestBase.waitForRecoveriesToFinish Wait for recoveries to finish - collection: collection1 failOnTimeout:true timeout (sec):1440
[junit4:junit4]   2> 9633 T1914 oascc.ZkStateReader.updateClusterState Updating cloud state from ZooKeeper... 
[junit4:junit4]   2> 9841 T1935 oascc.ZkStateReader.updateClusterState Updating cloud state from ZooKeeper... 
[junit4:junit4]   2> 9855 T1948 oascc.ZkStateReader$2.process A cluster state change has occurred - updating...
[junit4:junit4]   2> 9855 T1989 oascc.ZkStateReader$2.process A cluster state change has occurred - updating...
[junit4:junit4]   2> 9855 T1985 oascc.ZkStateReader$2.process A cluster state change has occurred - updating...
[junit4:junit4]   2> 9855 T1960 oascc.ZkStateReader$2.process A cluster state change has occurred - updating...
[junit4:junit4]   2> 9855 T1991 oascc.ZkStateReader$2.process A cluster state change has occurred - updating...
[junit4:junit4]   2> 9855 T1934 oascc.ZkStateReader$2.process A cluster state change has occurred - updating...
[junit4:junit4]   2> 9856 T1972 oascc.ZkStateReader$2.process A cluster state change has occurred - updating...
[junit4:junit4]   2> 10635 T1914 oascc.ZkStateReader.updateClusterState Updating cloud state from ZooKeeper... 
[junit4:junit4]   2> 11637 T1914 oascc.ZkStateReader.updateClusterState Updating cloud state from ZooKeeper... 
[junit4:junit4]   2> 12640 T1914 oascc.ZkStateReader.updateClusterState Updating cloud state from ZooKeeper... 
[junit4:junit4]   2> 13642 T1914 oascc.ZkStateReader.updateClusterState Updating cloud state from ZooKeeper... 
[junit4:junit4]   2> 14644 T1914 oascc.ZkStateReader.updateClusterState Updating cloud state from ZooKeeper... 
[junit4:junit4]   2> 14775 T1974 C222 P52804 oasc.RecoveryStrategy.doRecovery Attempting to PeerSync from http://127.0.0.1:52760/solr/collection1/ core=collection1 - recoveringAfterStartup=true
[junit4:junit4]   2> 14776 T1974 C222 P52804 oasu.PeerSync.sync PeerSync: core=collection1 url=http://127.0.0.1:52804/solr START replicas=[http://127.0.0.1:52760/solr/collection1/] nUpdates=100
[junit4:junit4]   2> 14776 T1974 C222 P52804 oasc.RecoveryStrategy.doRecovery PeerSync Recovery was not successful - trying replication. core=collection1
[junit4:junit4]   2> 14777 T1974 C222 P52804 oasc.RecoveryStrategy.doRecovery Starting Replication Recovery. core=collection1
[junit4:junit4]   2> 14777 T1974 C222 P52804 oasc.RecoveryStrategy.doRecovery Begin buffering updates. core=collection1
[junit4:junit4]   2> 14777 T1974 C222 P52804 oasu.UpdateLog.bufferUpdates Starting to buffer updates. FSUpdateLog{state=ACTIVE, tlog=tlog{file=./org.apache.solr.cloud.BasicDistributedZk2Test-1347537692859/jetty3/tlog/tlog.0000000000000000000 refcount=1}}
[junit4:junit4]   2> 14777 T1974 C222 P52804 oasc.RecoveryStrategy.replicate Attempting to replicate from http://127.0.0.1:52760/solr/collection1/. core=collection1
[junit4:junit4]   2> 14777 T1974 C222 P52804 oascsi.HttpClientUtil.createClient Creating new http client, config:maxConnections=128&maxConnectionsPerHost=32&followRedirects=false
[junit4:junit4]   2> 14779 T1942 C225 P52760 REQ /get {distrib=false&qt=/get&wt=javabin&version=2&getVersions=100} status=0 QTime=1 
[junit4:junit4]   2> 14788 T1943 C225 P52760 oasu.DirectUpdateHandler2.commit start commit{flags=0,_version_=0,optimize=false,openSearcher=true,waitSearcher=true,expungeDeletes=false,softCommit=false}
[junit4:junit4]   2> 14899 T1943 C225 P52760 oasc.SolrDeletionPolicy.onCommit SolrDeletionPolicy.onCommit: commits:num=2
[junit4:junit4]   2> 		commit{dir=NRTCachingDirectory(org.apache.lucene.store.NIOFSDirectory@/usr/home/hudson/hudson-slave/workspace/Lucene-Solr-Tests-4.x-java7/solr/build/solr-core/test/J0/org.apache.solr.cloud.BasicDistributedZk2Test-1347537692859/jetty1/index lockFactory=org.apache.lucene.store.NativeFSLockFactory@6aab7fa9; maxCacheMB=48.0 maxMergeSizeMB=4.0),segFN=segments_1,generation=1,filenames=[segments_1]
[junit4:junit4]   2> 		commit{dir=NRTCachingDirectory(org.apache.lucene.store.NIOFSDirectory@/usr/home/hudson/hudson-slave/workspace/Lucene-Solr-Tests-4.x-java7/solr/build/solr-core/test/J0/org.apache.solr.cloud.BasicDistributedZk2Test-1347537692859/jetty1/index lockFactory=org.apache.lucene.store.NativeFSLockFactory@6aab7fa9; maxCacheMB=48.0 maxMergeSizeMB=4.0),segFN=segments_2,generation=2,filenames=[_0_Block_0.tip, _0_Block_0.pos, _0_MockSep_0.pos, _0_Block_0.tim, _0_MockVariableIntBlock_0.doc, _0_MockVariableIntBlock_0.skp, _0_Pulsing40_0.prx, _0_Pulsing40_0.frq, _0_MockVariableIntBlock_0.pyl, _0_MockSep_0.skp, _0_MockVariableIntBlock_0.tib, _0_MockVariableIntBlock_0.pos, _0_Pulsing40_0.tip, _0_MockSep_0.doc, _0.si, _0_MockVariableIntBlock_0.tii, _0.fnm, _0_Pulsing40_0.tim, _0_Block_0.doc, _0_nrm.cfs, _0_MockSep_0.tib, _0_nrm.cfe, _0_MockVariableIntBlock_0.frq, _0_MockSep_0.frq, segments_2, _0.fdx, _0_MockSep_0.tii, _0_MockSep_0.pyl, _0.fdt]
[junit4:junit4]   2> 14900 T1943 C225 P52760 oasc.SolrDeletionPolicy.updateCommits newest commit = 2
[junit4:junit4]   2> 14912 T1943 C225 P52760 oass.SolrIndexSearcher.<init> Opening Searcher@624612fd main
[junit4:junit4]   2> 14913 T1943 C225 P52760 oasu.DirectUpdateHandler2.commit end_commit_flush
[junit4:junit4]   2> 14914 T1949 oasc.SolrCore.registerSearcher [collection1] Registered new searcher Searcher@624612fd main{StandardDirectoryReader(segments_2:3 _0(4.0.0.2):C1)}
[junit4:junit4]   2> 14914 T1943 C225 P52760 /update {waitSearcher=true&commit=true&commit_end_point=true&wt=javabin&softCommit=false&version=2} {commit=} 0 126
[junit4:junit4]   2> 14915 T1974 C222 P52804 oash.ReplicationHandler.inform Commits will be reserved for  10000
[junit4:junit4]   2> 14916 T1974 C222 P52804 oash.SnapPuller.<init>  No value set for 'pollInterval'. Timer Task not started.
[junit4:junit4]   2> 14918 T1944 C225 P52760 oash.ReplicationHandler.inform Commits will be reserved for  10000
[junit4:junit4]   2> 14919 T1944 C225 P52760 REQ /replication {command=indexversion&wt=javabin&qt=/replication&version=2} status=0 QTime=2 
[junit4:junit4]   2> 14919 T1974 C222 P52804 oash.SnapPuller.fetchLatestIndex Master's generation: 2
[junit4:junit4]   2> 14920 T1974 C222 P52804 oash.SnapPuller.fetchLatestIndex Slave's generation: 1
[junit4:junit4]   2> 14920 T1974 C222 P52804 oash.SnapPuller.fetchLatestIndex Starting replication process
[junit4:junit4]   2> 14924 T1944 C225 P52760 REQ /replication {command=filelist&generation=2&wt=javabin&qt=/replication&version=2} status=0 QTime=2 
[junit4:junit4]   2> 14925 T1974 C222 P52804 oash.SnapPuller.fetchLatestIndex Number of files in latest index in master: 29
[junit4:junit4]   2> 14931 T1974 C222 P52804 oash.SnapPuller.fetchLatestIndex Starting download to ./org.apache.solr.cloud.BasicDistributedZk2Test-1347537692859/jetty3/index.20120914000147781 fullCopy=true
[junit4:junit4]   2> 14934 T1944 C225 P52760 REQ /replication {file=_0_Block_0.pos&command=filecontent&checksum=true&generation=2&qt=/replication&wt=filestream} status=0 QTime=0 
[junit4:junit4]   2> 14939 T1944 C225 P52760 REQ /replication {file=_0_Block_0.tip&command=filecontent&checksum=true&generation=2&qt=/replication&wt=filestream} status=0 QTime=0 
[junit4:junit4]   2> 14943 T1944 C225 P52760 REQ /replication {file=_0_MockSep_0.pos&command=filecontent&checksum=true&generation=2&qt=/replication&wt=filestream} status=0 QTime=0 
[junit4:junit4]   2> 14947 T1944 C225 P52760 REQ /replication {file=_0_MockVariableIntBlock_0.doc&command=filecontent&checksum=true&generation=2&qt=/replication&wt=filestream} status=0 QTime=0 
[junit4:junit4]   2> 14951 T1944 C225 P52760 REQ /replication {file=_0_Block_0.tim&command=filecontent&checksum=true&generation=2&qt=/replication&wt=filestream} status=0 QTime=0 
[junit4:junit4]   2> 14955 T1944 C225 P52760 REQ /replication {file=_0_MockVariableIntBlock_0.skp&command=filecontent&checksum=true&generation=2&qt=/replication&wt=filestream} status=0 QTime=0 
[junit4:junit4]   2> 14956 T1974 C222 P52804 oash.SnapPuller$FileFetcher.fetchPackets WARNING No content recieved for file: {name=_0_MockVariableIntBlock_0.skp, lastmodified=1347537707000, size=0}
[junit4:junit4]   2> 14959 T1944 C225 P52760 REQ /replication {file=_0_Pulsing40_0.prx&command=filecontent&checksum=true&generation=2&qt=/replication&wt=filestream} status=0 QTime=0 
[junit4:junit4]   2> 14963 T1944 C225 P52760 REQ /replication {file=_0_Pulsing40_0.frq&command=filecontent&checksum=true&generation=2&qt=/replication&wt=filestream} status=0 QTime=0 
[junit4:junit4]   2> 14967 T1944 C225 P52760 REQ /replication {file=_0_MockVariableIntBlock_0.pyl&command=filecontent&checksum=true&generation=2&qt=/replication&wt=filestream} status=0 QTime=0 
[junit4:junit4]   2> 14969 T1974 C222 P52804 oash.SnapPuller$FileFetcher.fetchPackets WARNING No content recieved for file: {name=_0_MockVariableIntBlock_0.pyl, lastmodified=1347537707000, size=0}
[junit4:junit4]   2> 14972 T1944 C225 P52760 REQ /replication {file=_0_MockVariableIntBlock_0.tib&command=filecontent&checksum=true&generation=2&qt=/replication&wt=filestream} status=0 QTime=0 
[junit4:junit4]   2> 14976 T1944 C225 P52760 REQ /replication {file=_0_MockSep_0.skp&command=filecontent&checksum=true&generation=2&qt=/replication&wt=filestream} status=0 QTime=0 
[junit4:junit4]   2> 14977 T1974 C222 P52804 oash.SnapPuller$FileFetcher.fetchPackets WARNING No content recieved for file: {name=_0_MockSep_0.skp, lastmodified=1347537707000, size=0}
[junit4:junit4]   2> 14980 T1944 C225 P52760 REQ /replication {file=_0_Pulsing40_0.tip&command=filecontent&checksum=true&generation=2&qt=/replication&wt=filestream} status=0 QTime=0 
[junit4:junit4]   2> 14984 T1944 C225 P52760 REQ /replication {file=_0_MockVariableIntBlock_0.pos&command=filecontent&checksum=true&generation=2&qt=/replication&wt=filestream} status=0 QTime=0 
[junit4:junit4]   2> 14988 T1944 C225 P52760 REQ /replication {file=_0.si&command=filecontent&checksum=true&generation=2&qt=/replication&wt=filestream} status=0 QTime=0 
[junit4:junit4]   2> 14992 T1944 C225 P52760 REQ /replication {file=_0_MockSep_0.doc&command=filecontent&checksum=true&generation=2&qt=/replication&wt=filestream} status=0 QTime=0 
[junit4:junit4]   2> 14997 T1944 C225 P52760 REQ /replication {file=_0_MockVariableIntBlock_0.tii&command=filecontent&checksum=true&generation=2&qt=/replication&wt=filestream} status=0 QTime=0 
[junit4:junit4]   2> 15001 T1944 C225 P52760 REQ /replication {file=_0_Block_0.doc&command=filecontent&checksum=true&generation=2&qt=/replication&wt=filestream} status=0 QTime=0 
[junit4:junit4]   2> 15005 T1944 C225 P52760 REQ /replication {file=_0_Pulsing40_0.tim&command=filecontent&checksum=true&generation=2&qt=/replication&wt=filestream} status=0 QTime=0 
[junit4:junit4]   2> 15009 T1944 C225 P52760 REQ /replication {file=_0.fnm&command=filecontent&checksum=true&generation=2&qt=/replication&wt=filestream} status=0 QTime=0 
[junit4:junit4]   2> 15013 T1944 C225 P52760 REQ /replication {file=_0_nrm.cfs&command=filecontent&checksum=true&generation=2&qt=/replication&wt=filestream} status=0 QTime=0 
[junit4:junit4]   2> 15017 T1944 C225 P52760 REQ /replication {file=_0_MockSep_0.tib&command=filecontent&checksum=true&generation=2&qt=/replication&wt=filestream} status=0 QTime=0 
[junit4:junit4]   2> 15021 T1944 C225 P52760 REQ /replication {file=_0_MockVariableIntBlock_0.frq&command=filecontent&checksum=true&generation=2&qt=/replication&wt=filestream} status=0 QTime=0 
[junit4:junit4]   2> 15025 T1944 C225 P52760 REQ /replication {file=_0_nrm.cfe&command=filecontent&checksum=true&generation=2&qt=/replication&wt=filestream} status=0 QTime=0 
[junit4:junit4]   2> 15029 T1944 C225 P52760 REQ /replication {file=segments_2&command=filecontent&checksum=true&generation=2&qt=/replication&wt=filestream} status=0 QTime=0 
[junit4:junit4]   2> 15060 T1944 C225 P52760 REQ /replication {file=_0_MockSep_0.frq&command=filecontent&checksum=true&generation=2&qt=/replication&wt=filestream} status=0 QTime=0 
[junit4:junit4]   2> 15066 T1944 C225 P52760 REQ /replication {file=_0.fdx&command=filecontent&checksum=true&generation=2&qt=/replication&wt=filestream} status=0 QTime=0 
[junit4:junit4]   2> 15072 T1944 C225 P52760 REQ /replication {file=_0_MockSep_0.tii&command=filecontent&checksum=true&generation=2&qt=/replication&wt=filestream} status=0 QTime=0 
[junit4:junit4]   2> 15081 T1944 C225 P52760 REQ /replication {file=_0_MockSep_0.pyl&command=filecontent&checksum=true&generation=2&qt=/replication&wt=filestream} status=0 QTime=0 
[junit4:junit4]   2> 15084 T1974 C222 P52804 oash.SnapPuller$FileFetcher.fetchPackets WARNING No content recieved for file: {name=_0_MockSep_0.pyl, lastmodified=1347537707000, size=0}
[junit4:junit4]   2> 15090 T1944 C225 P52760 REQ /replication {file=_0.fdt&command=filecontent&checksum=true&generation=2&qt=/replication&wt=filestream} status=0 QTime=1 
[junit4:junit4]   2> 15096 T1974 C222 P52804 oash.SnapPuller.fetchLatestIndex Total time taken for download : 0 secs
[junit4:junit4]   2> 15096 T1974 C222 P52804 oash.SnapPuller.modifyIndexProps New index installed. Updating index properties... index=index.20120914000147781
[junit4:junit4]   2> 15099 T1974 C222 P52804 oasu.DefaultSolrCoreState.newIndexWriter Creating new IndexWriter...
[junit4:junit4]   2> 15099 T1974 C222 P52804 oasu.DefaultSolrCoreState.newIndexWriter Waiting until IndexWriter is unused... core=collection1
[junit4:junit4]   2> 15100 T1974 C222 P52804 oasu.DefaultSolrCoreState.newIndexWriter Rollback old IndexWriter... core=collection1
[junit4:junit4]   2> 15105 T1974 C222 P52804 oasc.SolrCore.getNewIndexDir WARNING New index directory detected: old=./org.apache.solr.cloud.BasicDistributedZk2Test-1347537692859/jetty3/index/ new=./org.apache.solr.cloud.BasicDistributedZk2Test-1347537692859/jetty3/index.20120914000147781
[junit4:junit4]   2> 15106 T1974 C222 P52804 oasc.CachingDirectoryFactory.get return new directory for /usr/home/hudson/hudson-slave/workspace/Lucene-Solr-Tests-4.x-java7/solr/build/solr-core/test/J0/./org.apache.solr.cloud.BasicDistributedZk2Test-1347537692859/jetty3/index.20120914000147781 forceNew:true
[junit4:junit4]   2> 15120 T1974 C222 P52804 oasc.SolrDeletionPolicy.onInit SolrDeletionPolicy.onInit: commits:num=1
[junit4:junit4]   2> 		commit{dir=NRTCachingDirectory(org.apache.lucene.store.NIOFSDirectory@/usr/home/hudson/hudson-slave/workspace/Lucene-Solr-Tests-4.x-java7/solr/build/solr-core/test/J0/org.apache.solr.cloud.BasicDistributedZk2Test-1347537692859/jetty3/index.20120914000147781 lockFactory=org.apache.lucene.store.NativeFSLockFactory@4b6785e4; maxCacheMB=48.0 maxMergeSizeMB=4.0),segFN=segments_2,generation=2,filenames=[_0_Block_0.pos, _0_Block_0.tip, _0_MockSep_0.pos, _0_MockVariableIntBlock_0.doc, _0_Block_0.tim, _0_MockVariableIntBlock_0.skp, _0_Pulsing40_0.prx, _0_Pulsing40_0.frq, _0_MockVariableIntBlock_0.pyl, _0_MockVariableIntBlock_0.tib, _0_MockSep_0.skp, _0_MockVariableIntBlock_0.pos, _0_Pulsing40_0.tip, _0_MockSep_0.doc, _0.si, _0_MockVariableIntBlock_0.tii, _0.fnm, _0_Pulsing40_0.tim, _0_Block_0.doc, _0_nrm.cfs, _0_MockSep_0.tib, _0_nrm.cfe, _0_MockVariableIntBlock_0.frq, _0_MockSep_0.frq, segments_2, _0.fdx, _0_MockSep_0.tii, _0_MockSep_0.pyl, _0.fdt]
[junit4:junit4]   2> 15121 T1974 C222 P52804 oasc.SolrDeletionPolicy.updateCommits newest commit = 2
[junit4:junit4]   2> 15121 T1974 C222 P52804 oasu.DefaultSolrCoreState.newIndexWriter New IndexWriter is ready to be used.
[junit4:junit4]   2> 15330 T1974 C222 P52804 oass.SolrIndexSearcher.<init> Opening Searcher@3688e21a main
[junit4:junit4]   2> 15332 T1973 oasc.SolrCore.registerSearcher [collection1] Registered new searcher Searcher@3688e21a main{StandardDirectoryReader(segments_2:3:nrt _0(4.0.0.2):C1)}
[junit4:junit4]   2> 15333 T1973 oasc.CachingDirectoryFactory.close Closing directory:/usr/home/hudson/hudson-slave/workspace/Lucene-Solr-Tests-4.x-java7/solr/build/solr-core/test/J0/./org.apache.solr.cloud.BasicDistributedZk2Test-1347537692859/jetty3/index
[junit4:junit4]   2> 15333 T1973 oash.SnapPuller$2.onClose removing old index directory ./org.apache.solr.cloud.BasicDistributedZk2Test-1347537692859/jetty3/index
[junit4:junit4]   2> 15334 T1974 C222 P52804 oasu.DirectUpdateHandler2.commit start commit{flags=0,_version_=0,optimize=false,openSearcher=true,waitSearcher=true,expungeDeletes=false,softCommit=false}
[junit4:junit4]   2> 15336 T1974 C222 P52804 oass.SolrIndexSearcher.<init> Opening Searcher@2ff20b4 main
[junit4:junit4]   2> 15336 T1974 C222 P52804 oasu.DirectUpdateHandler2.commit end_commit_flush
[junit4:junit4]   2> 15337 T1973 oasc.SolrCore.registerSearcher [collection1] Registered new searcher Searcher@2ff20b4 main{StandardDirectoryReader(segments_2:3:nrt _0(4.0.0.2):C1)}
[junit4:junit4]   2> 15337 T1974 C222 P52804 oasc.RecoveryStrategy.replay Replaying buffered documents. core=collection1
[junit4:junit4]   2> 15338 T1996 C222 P52804 oasu.UpdateLog$LogReplayer.doReplay WARNING Starting log replay tlog{file=./org.apache.solr.cloud.BasicDistributedZk2Test-1347537692859/jetty3/tlog/tlog.0000000000000000000 refcount=2} active=true starting pos=433
[junit4:junit4]   2> 15338 T1996 C222 P52804 oasu.DirectUpdateHandler2.commit start commit{flags=2,_version_=0,optimize=false,openSearcher=true,waitSearcher=true,expungeDeletes=false,softCommit=false}
[junit4:junit4]   2> 15339 T1996 C222 P52804 oass.SolrIndexSearcher.<init> Opening Searcher@55cad87 main
[junit4:junit4]   2> 15340 T1996 C222 P52804 oasu.DirectUpdateHandler2.commit end_commit_flush
[junit4:junit4]   2> 15340 T1973 oasc.SolrCore.registerSearcher [collection1] Registered new searcher Searcher@55cad87 main{StandardDirectoryReader(segments_2:3:nrt _0(4.0.0.2):C1)}
[junit4:junit4]   2> 15341 T1996 C222 P52804 oasu.UpdateLog$LogReplayer.run WARNING Log replay finished. recoveryInfo=RecoveryInfo{adds=0 deletes=0 deleteByQuery=0 errors=0 positionOfStart=433}
[junit4:junit4]   2> 15341 T1974 C222 P52804 oasc.RecoveryStrategy.doRecovery Replication Recovery was successful - registering as Active. core=collection1
[junit4:junit4]   2> 15342 T1974 C222 P52804 oasc.RecoveryStrategy.doRecovery Finished recovery process. core=collection1
[junit4:junit4]   2> 15379 T1935 oascc.ZkStateReader.updateClusterState Updating cloud state from ZooKeeper... 
[junit4:junit4]   2> 15391 T1989 oascc.ZkStateReader$2.process A cluster state change has occurred - updating...
[junit4:junit4]   2> 15391 T1948 oascc.ZkStateReader$2.process A cluster state change has occurred - updating...
[junit4:junit4]   2> 15391 T1991 oascc.ZkStateReader$2.process A cluster state change has occurred - updating...
[junit4:junit4]   2> 15391 T1934 oascc.ZkStateReader$2.process A cluster state change has occurred - updating...
[junit4:junit4]   2> 15391 T1972 oascc.ZkStateReader$2.process A cluster state change has occurred - updating...
[junit4:junit4]   2> 15391 T1985 oascc.ZkStateReader$2.process A cluster state change has occurred - updating...
[junit4:junit4]   2> 15391 T1960 oascc.ZkStateReader$2.process A cluster state change has occurred - updating...
[junit4:junit4]   2> 15646 T1914 oascc.ZkStateReader.updateClusterState Updating cloud state from ZooKeeper... 
[junit4:junit4]   2>  C223_STATE=coll:collection1 core:collection1 props:{shard=shard2, roles=null, state=recovering, core=collection1, collection=collection1, node_name=127.0.0.1:52822_solr, base_url=http://127.0.0.1:52822/solr}
[junit4:junit4]   2> 16539 T1987 C223 P52822 oasc.RecoveryStrategy.doRecovery Attempting to PeerSync from http://127.0.0.1:52788/solr/collection1/ core=collection1 - recoveringAfterStartup=true
[junit4:junit4]   2> 16540 T1987 C223 P52822 oasu.PeerSync.sync PeerSync: core=collection1 url=http://127.0.0.1:52822/solr START replicas=[http://127.0.0.1:52788/solr/collection1/] nUpdates=100
[junit4:junit4]   2> 16540 T1987 C223 P52822 oasc.RecoveryStrategy.doRecovery PeerSync Recovery was not successful - trying replication. core=collection1
[junit4:junit4]   2> 16540 T1987 C223 P52822 oasc.RecoveryStrategy.doRecovery Starting Replication Recovery. core=collection1
[junit4:junit4]   2> 16540 T1987 C223 P52822 oasc.RecoveryStrategy.doRecovery Begin buffering updates. core=collection1
[junit4:junit4]   2> 16540 T1987 C223 P52822 oasu.UpdateLog.bufferUpdates Starting to buffer updates. FSUpdateLog{state=ACTIVE, tlog=null}
[junit4:junit4]   2> 16541 T1987 C223 P52822 oasc.RecoveryStrategy.replicate Attempting to replicate from http://127.0.0.1:52788/solr/collection1/. core=collection1
[junit4:junit4]   2> 16541 T1987 C223 P52822 oascsi.HttpClientUtil.createClient Creating new http client, config:maxConnections=128&maxConnectionsPerHost=32&followRedirects=false
[junit4:junit4]   2> 16543 T1954 C226 P52788 REQ /get {distrib=false&qt=/get&wt=javabin&version=2&getVersions=100} status=0 QTime=2 
[junit4:junit4]   2> 16553 T1955 C226 P52788 oasu.DirectUpdateHandler2.commit start commit{flags=0,_version_=0,optimize=false,openSearcher=true,waitSearcher=true,expungeDeletes=false,softCommit=false}
[junit4:junit4]   2> 16557 T1955 C226 P52788 oasc.SolrDeletionPolicy.onInit SolrDeletionPolicy.onInit: commits:num=1
[junit4:junit4]   2> 		commit{dir=NRTCachingDirectory(org.apache.lucene.store.NIOFSDirectory@/usr/home/hudson/hudson-slave/workspace/Lucene-Solr-Tests-4.x-java7/solr/build/solr-core/test/J0/org.apache.solr.cloud.BasicDistributedZk2Test-1347537692859/jetty2/index lockFactory=org.apache.lucene.store.NativeFSLockFactory@3137db95; maxCacheMB=48.0 maxMergeSizeMB=4.0),segFN=segments_1,generation=1,filenames=[segments_1]
[junit4:junit4]   2> 16559 T1955 C226 P52788 oasc.SolrDeletionPolicy.updateCommits newest commit = 1
[junit4:junit4]   2> 16560 T1955 C226 P52788 oass.SolrIndexSearcher.<init> Opening Searcher@1482b89 main
[junit4:junit4]   2> 16560 T1955 C226 P52788 oasu.DirectUpdateHandler2.commit end_commit_flush
[junit4:junit4]   2> 16561 T1961 oasc.SolrCore.registerSearcher [collection1] Registered new searcher Searcher@1482b89 main{StandardDirectoryReader(segments_1:1)}
[junit4:junit4]   2> 16562 T1955 C226 P52788 /update {waitSearcher=true&commit=true&commit_end_point=true&wt=javabin&softCommit=false&version=2} {commit=} 0 10
[junit4:junit4]   2> 16563 T1987 C223 P52822 oash.ReplicationHandler.inform Commits will be reserved for  10000
[junit4:junit4]   2> 16563 T1987 C223 P52822 oash.SnapPuller.<init>  No value set for 'pollInterval'. Timer Task not started.
[junit4:junit4]   2> 16564 T1956 C226 P52788 oash.ReplicationHandler.inform Commits will be reserved for  10000
[junit4:junit4]   2> 16565 T1956 C226 P52788 REQ /replication {command=indexversion&wt=javabin&qt=/replication&version=2} status=0 QTime=1 
[junit4:junit4]   2> 16568 T1987 C223 P52822 oasc.SolrDeletionPolicy.onInit SolrDeletionPolicy.onInit: commits:num=1
[junit4:junit4]   2> 		commit{dir=NRTCachingDirectory(org.apache.lucene.store.NIOFSDirectory@/usr/home/hudson/hudson-slave/workspace/Lucene-Solr-Tests-4.x-java7/solr/build/solr-core/test/J0/org.apache.solr.cloud.BasicDistributedZk2Test-1347537692859/jetty4/index lockFactory=org.apache.lucene.store.NativeFSLockFactory@13f818c3; maxCacheMB=48.0 maxMergeSizeMB=4.0),segFN=segments_1,generation=1,filenames=[segments_1]
[junit4:junit4]   2> 16568 T1987 C223 P52822 oasc.SolrDeletionPolicy.updateCommits newest commit = 1
[junit4:junit4]   2> 16569 T1987 C223 P52822 oasu.DirectUpdateHandler2.commit start commit{flags=0,_version_=0,optimize=false,openSearcher=true,waitSearcher=true,expungeDeletes=false,softCommit=false}
[junit4:junit4]   2> 16594 T1987 C223 P52822 oasc.SolrDeletionPolicy.onCommit SolrDeletionPolicy.onCommit: commits:num=2
[junit4:junit4]   2> 		commit{dir=NRTCachingDirectory(org.apache.lucene.store.NIOFSDirectory@/usr/home/hudson/hudson-slave/workspace/Lucene-Solr-Tests-4.x-java7/solr/build/solr-core/test/J0/org.apache.solr.cloud.BasicDistributedZk2Test-1347537692859/jetty4/index lockFactory=org.apache.lucene.store.NativeFSLockFactory@13f818c3; maxCacheMB=48.0 maxMergeSizeMB=4.0),segFN=segments_1,generation=1,filenames=[segments_1]
[junit4:junit4]   2> 		commit{dir=NRTCachingDirectory(org.apache.lucene.store.NIOFSDirectory@/usr/home/hudson/hudson-slave/workspace/Lucene-Solr-Tests-4.x-java7/solr/build/solr-core/test/J0/org.apache.solr.cloud.BasicDistributedZk2Test-1347537692859/jetty4/index lockFactory=org.apache.lucene.store.NativeFSLockFactory@13f818c3; maxCacheMB=48.0 maxMergeSizeMB=4.0),segFN=segments_2,generation=2,filenames=[segments_2]
[junit4:junit4]   2> 16595 T1987 C223 P52822 oasc.SolrDeletionPolicy.updateCommits newest commit = 2
[junit4:junit4]   2> 16597 T1987 C223 P52822 oass.SolrIndexSearcher.<init> Opening Searcher@2cc729e2 main
[junit4:junit4]   2> 16598 T1987 C223 P52822 oasu.DirectUpdateHandler2.commit end_commit_flush
[junit4:junit4]   2> 16598 T1986 oasc.SolrCore.registerSearcher [collection1] Registered new searcher Searcher@2cc729e2 main{StandardDirectoryReader(segments_2:2)}
[junit4:junit4]   2> 16599 T1987 C223 P52822 oasc.RecoveryStrategy.replay No replay needed. core=collection1
[junit4:junit4]   2> 16599 T1987 C223 P52822 oasc.RecoveryStrategy.doRecovery Replication Recovery was successful - registering as Active. core=collection1
[junit4:junit4]   2> 16651 T1987 C223 P52822 oasc.RecoveryStrategy.doRecovery Finished recovery process. core=collection1
[junit4:junit4]   2> 16651 T1914 oascc.ZkStateReader.updateClusterState Updating cloud state from ZooKeeper... 
[junit4:junit4]   2> 16909 T1935 oascc.ZkStateReader.updateClusterState Updating cloud state from ZooKeeper... 
[junit4:junit4]   2> 16930 T1934 oascc.ZkStateReader$2.process A cluster state change has occurred - updating...
[junit4:junit4]   2> 16930 T1960 oascc.ZkStateReader$2.process A cluster state change has occurred - updating...
[junit4:junit4]   2> 16930 T1991 oascc.ZkStateReader$2.process A cluster state change has occurred - updating...
[junit4:junit4]   2> 16930 T1989 oascc.ZkStateReader$2.process A cluster state change has occurred - updating...
[junit4:junit4]   2> 16930 T1985 oascc.ZkStateReader$2.process A cluster state change has occurred - updating...
[junit4:junit4]   2> 16930 T1948 oascc.ZkStateReader$2.process A cluster state change has occurred - updating...
[junit4:junit4]   2> 16930 T1972 oascc.ZkStateReader$2.process A cluster state change has occurred - updating...
[junit4:junit4]   2> 17653 T1914 oascc.ZkStateReader.updateClusterState Updating cloud state from ZooKeeper... 
[junit4:junit4]   2> 17657 T1926 C224 P52735 oasu.DirectUpdateHandler2.commit start commit{flags=0,_version_=0,optimize=false,openSearcher=true,waitSearcher=true,expungeDeletes=false,softCommit=false}
[junit4:junit4]   2> 17794 T1926 C224 P52735 oasc.SolrDeletionPolicy.onCommit SolrDeletionPolicy.onCommit: commits:num=2
[junit4:junit4]   2> 		commit{dir=NRTCachingDirectory(org.apache.lucene.store.NIOFSDirectory@/usr/home/hudson/hudson-slave/workspace/Lucene-Solr-Tests-4.x-java7/solr/build/solr-core/test/J0/org.apache.solr.cloud.BasicDistributedZk2Test-1347537692859/control/data/index lockFactory=org.apache.lucene.store.NativeFSLockFactory@4367e139; maxCacheMB=48.0 maxMergeSizeMB=4.0),segFN=segments_1,generation=1,filenames=[segments_1]
[junit4:junit4]   2> 		commit{dir=NRTCachingDirectory(org.apache.lucene.store.NIOFSDirectory@/usr/home/hudson/hudson-slave/workspace/Lucene-Solr-Tests-4.x-java7/solr/build/solr-core/test/J0/org.apache.solr.cloud.BasicDistributedZk2Test-1347537692859/control/data/index lockFactory=org.apache.lucene.store.NativeFSLockFactory@4367e139; maxCacheMB=48.0 maxMergeSizeMB=4.0),segFN=segments_2,generation=2,filenames=[_0_Block_0.tip, _0_Block_0.pos, _0_MockSep_0.pos, _0_Block_0.tim, _0_MockVariableIntBlock_0.doc, _0_MockVariableIntBlock_0.skp, _0_Pulsing40_0.prx, _0_Pulsing40_0.frq, _0_MockVariableIntBlock_0.pyl, _0_MockSep_0.skp, _0_MockVariableIntBlock_0.tib, _0_MockVariableIntBlock_0.pos, _0_Pulsing40_0.tip, _0_MockSep_0.doc, _0.si, _0_MockVariableIntBlock_0.tii, _0.fnm, _0_Pulsing40_0.tim, _0_Block_0.doc, _0_nrm.cfs, _0_MockSep_0.tib, _0_nrm.cfe, _0_MockVariableIntBlock_0.frq, _0_MockSep_0.frq, segments_2, _0.fdx, _0_MockSep_0.tii, _0_MockSep_0.pyl, _0.fdt]
[junit4:junit4]   2> 17795 T1926 C224 P52735 oasc.SolrDeletionPolicy.updateCommits newest commit = 2
[junit4:junit4]   2> 17816 T1926 C224 P52735 oass.SolrIndexSearcher.<init> Opening Searcher@3225a1b main
[junit4:junit4]   2> 17818 T1926 C224 P52735 oasu.DirectUpdateHandler2.commit end_commit_flush
[junit4:junit4]   2> 17819 T1937 oasc.SolrCore.registerSearcher [collection1] Registered new searcher Searcher@3225a1b main{StandardDirectoryReader(segments_2:3 _0(4.0.0.2):C1)}
[junit4:junit4]   2> 17820 T1926 C224 P52735 /update {waitSearcher=true&wt=javabin&commit=true&softCommit=false&version=2} {commit=} 0 163
[junit4:junit4]   2> 17824 T1953 C226 P52788 oasu.DirectUpdateHandler2.commit start commit{flags=0,_version_=0,optimize=false,openSearcher=true,waitSearcher=true,expungeDeletes=false,softCommit=false}
[junit4:junit4]   2> 17829 T1953 C226 P52788 oass.SolrIndexSearcher.<init> Opening Searcher@7f880a07 main
[junit4:junit4]   2> 17830 T1953 C226 P52788 oasu.DirectUpdateHandler2.commit end_commit_flush
[junit4:junit4]   2> 17832 T1961 oasc.SolrCore.registerSearcher [collection1] Registered new searcher Searcher@7f880a07 main{StandardDirectoryReader(segments_1:1)}
[junit4:junit4]   2> 17832 T1953 C226 P52788 oasu.SolrCmdDistributor.distribCommit Distrib commit to:[StdNode: http://127.0.0.1:52760/solr/collection1/, StdNode: http://127.0.0.1:52804/solr/collection1/, StdNode: http://127.0.0.1:52822/solr/collection1/]
[junit4:junit4]   2> 17835 T1941 C225 P52760 oasu.DirectUpdateHandler2.commit start commit{flags=0,_version_=0,optimize=false,openSearcher=true,waitSearcher=true,expungeDeletes=false,softCommit=false}
[junit4:junit4]   2>  C222_STATE=coll:collection1 core:collection1 props:{shard=shard1, roles=null, state=active, core=collection1, collection=collection1, node_name=127.0.0.1:52804_solr, base_url=http://127.0.0.1:52804/solr}
[junit4:junit4]   2> 17835 T1964 C222 P52804 oasu.DirectUpdateHandler2.commit start commit{flags=0,_version_=0,optimize=false,openSearcher=true,waitSearcher=true,expungeDeletes=false,softCommit=false}
[junit4:junit4]   2> 17838 T1964 C222 P52804 oass.SolrIndexSearcher.<init> Opening Searcher@508193b0 main
[junit4:junit4]   2> 17839 T1964 C222 P52804 oasu.DirectUpdateHandler2.commit end_commit_flush
[junit4:junit4]   2> 17840 T1973 oasc.SolrCore.registerSearcher [collection1] Registered new searcher Searcher@508193b0 main{StandardDirectoryReader(segments_2:3:nrt _0(4.0.0.2):C1)}
[junit4:junit4]   2> 17841 T1964 C222 P52804 /update {waitSearcher=true&commit=true&wt=javabin&commit_end_point=true&softCommit=false&version=2} {commit=} 0 6
[junit4:junit4]   2> 17847 T1941 C225 P52760 oass.SolrIndexSearcher.<init> Opening Searcher@2528d8db main
[junit4:junit4]   2> 17848 T1941 C225 P52760 oasu.DirectUpdateHandler2.commit end_commit_flush
[junit4:junit4]   2> 17849 T1949 oasc.SolrCore.registerSearcher [collection1] Registered new searcher Searcher@2528d8db main{StandardDirectoryReader(segments_2:3 _0(4.0.0.2):C1)}
[junit4:junit4]   2>  C223_STATE=coll:collection1 core:collection1 props:{shard=shard2, roles=null, state=active, core=collection1, collection=collection1, node_name=127.0.0.1:52822_solr, base_url=http://127.0.0.1:52822/solr}
[junit4:junit4]   2> 17849 T1977 C223 P52822 oasu.DirectUpdateHandler2.commit start commit{flags=0,_version_=0,optimize=false,openSearcher=true,waitSearcher=true,expungeDeletes=false,softCommit=false}
[junit4:junit4]   2> 17849 T1941 C225 P52760 /update {waitSearcher=true&commit=true&wt=javabin&commit_end_point=true&softCommit=false&version=2} {commit=} 0 14
[junit4:junit4]   2> 17854 T1977 C223 P52822 oass.SolrIndexSearcher.<init> Opening Searcher@12d248c0 main
[junit4:junit4]   2> 17855 T1977 C223 P52822 oasu.DirectUpdateHandler2.commit end_commit_flush
[junit4:junit4]   2> 17856 T1986 oasc.SolrCore.registerSearcher [collection1] Registered new searcher Searcher@12d248c0 main{StandardDirectoryReader(segments_2:2)}
[junit4:junit4]   2> 17857 T1977 C223 P52822 /update {waitSearcher=true&commit=true&wt=javabin&commit_end_point=true&softCommit=false&version=2} {commit=} 0 8
[junit4:junit4]   2> 17858 T1953 C226 P52788 /update {waitSearcher=true&wt=javabin&commit=true&softCommit=false&version=2} {commit=} 0 35
[junit4:junit4]   2> 17866 T1927 C224 P52735 REQ /select {fl=id,score&shard.url=127.0.0.1:52735/solr/collection1/&NOW=1347537710716&start=0&q=*:*&distrib=false&isShard=true&wt=javabin&fsv=true&rows=10&version=2} hits=1 status=0 QTime=0 
[junit4:junit4]   2> 17871 T1927 C224 P52735 REQ /select {shard.url=127.0.0.1:52735/solr/collection1/&NOW=1347537710716&q=*:*&ids=1&distrib=false&isShard=true&wt=javabin&version=2} status=0 QTime=1 
[junit4:junit4]   2> 17872 T1926 C224 P52735 REQ /select {wt=javabin&q=*:*&version=2} hits=1 status=0 QTime=11 
[junit4:junit4]   2> 17873 T1914 oaz.ZooKeeper.<init> Initiating client connection, connectString=127.0.0.1:52727/solr sessionTimeout=10000 watcher=org.apache.solr.common.cloud.ConnectionManager@5efa7f71
[junit4:junit4]   2> 17874 T2002 oaz.ClientCnxn$SendThread.startConnect Opening socket connection to server /127.0.0.1:52727
[junit4:junit4]   2> 17875 T2002 oaz.ClientCnxn$SendThread.primeConnection Socket connection established to localhost/127.0.0.1:52727, initiating session
[junit4:junit4]   2> 17876 T1916 oazs.NIOServerCnxn$Factory.run Accepted socket connection from /140.211.11.196:52905
[junit4:junit4]   2> 17875 T1914 oascc.ConnectionManager.waitForConnected Waiting for client to connect to ZooKeeper
[junit4:junit4]   2> 17876 T1916 oazs.NIOServerCnxn.readConnectRequest Client attempting to establish new session at /140.211.11.196:52905
[junit4:junit4]   2> 17878 T1918 oazs.NIOServerCnxn.finishSessionInit Established session 0x139bf8168c10009 with negotiated timeout 10000 for client /140.211.11.196:52905
[junit4:junit4]   2> 17878 T2002 oaz.ClientCnxn$SendThread.readConnectResult Session establishment complete on server localhost/127.0.0.1:52727, sessionid = 0x139bf8168c10009, negotiated timeout = 10000
[junit4:junit4]   2> 17879 T2003 oascc.ConnectionManager.process Watcher org.apache.solr.common.cloud.ConnectionManager@5efa7f71 name:ZooKeeperConnection Watcher:127.0.0.1:52727/solr got event WatchedEvent state:SyncConnected type:None path:null path:null type:None
[junit4:junit4]   2> 17879 T1914 oascc.ConnectionManager.waitForConnected Client is connected to ZooKeeper
[junit4:junit4]   2> 17880 T1914 oascc.ZkStateReader.createClusterStateWatchersAndUpdate Updating cluster state from ZooKeeper... 
[junit4:junit4]   2> 17882 T1919 oazs.PrepRequestProcessor.pRequest Processed session termination for sessionid: 0x139bf8168c10009
[junit4:junit4]   2> 17883 T2003 oaz.ClientCnxn$EventThread.run EventThread shut down
[junit4:junit4]   2> 17884 T1916 oazs.NIOServerCnxn.closeSock Closed socket connection for client /140.211.11.196:52905 which had sessionid 0x139bf8168c10009
[junit4:junit4]   2> 17883 T1914 oaz.ZooKeeper.close Session: 0x139bf8168c10009 closed
[junit4:junit4]   2> 17887 T1945 C225 P52760 REQ /select {distrib=false&wt=javabin&q=*:*&version=2} hits=1 status=0 QTime=1 
[junit4:junit4]   2> 17890 T1957 C226 P52788 REQ /select {distrib=false&wt=javabin&q=*:*&version=2} hits=0 status=0 QTime=1 
[junit4:junit4]   2> 17895 T1979 C223 P52822 REQ /select {fl=id,score&shard.url=127.0.0.1:52788/solr/collection1/|127.0.0.1:52822/solr/collection1/&NOW=1347537710747&start=0&q=*:*&distrib=false&isShard=true&wt=javabin&fsv=true&rows=10&version=2} hits=0 status=0 QTime=0 
[junit4:junit4]   2> 17895 T1965 C222 P52804 REQ /select {fl=id,score&shard.url=127.0.0.1:52760/solr/collection1/|127.0.0.1:52804/solr/collection1/&NOW=1347537710747&start=0&q=*:*&distrib=false&isShard=true&wt=javabin&fsv=true&rows=10&version=2} hits=1 status=0 QTime=0 
[junit4:junit4]   2> 17898 T1965 C222 P52804 REQ /select {shard.url=127.0.0.1:52760/solr/collection1/|127.0.0.1:52804/solr/collection1/&NOW=1347537710747&q=*:*&ids=1&distrib=false&isShard=true&wt=javabin&version=2} status=0 QTime=0 
[junit4:junit4]   2> 17899 T1978 C223 P52822 REQ /select {wt=javabin&q=*:*&version=2} hits=1 status=0 QTime=7 
[junit4:junit4]   2> 17907 T1926 C224 P52735 /update {wt=javabin&version=2} {add=[2 (1412995702596829184)]} 0 4
[junit4:junit4]   2> 17925 T1977 C223 P52822 REQ /update {update.distrib=FROMLEADER&distrib.from=http://127.0.0.1:52788/solr/collection1/&wt=javabin&version=2} status=0 QTime=6 
[junit4:junit4]   2> 17926 T1958 C226 P52788 REQ /update {distrib.from=http://127.0.0.1:52760/solr/collection1/&update.distrib=TOLEADER&wt=javabin&version=2} status=0 QTime=14 
[junit4:junit4]   2> 17927 T1946 C225 P52760 /update {wt=javabin&version=2} {add=[2]} 0 17
[junit4:junit4]   2> 17933 T1926 C224 P52735 /update {wt=javabin&version=2} {add=[3 (1412995702625140736)]} 0 3
[junit4:junit4]   2> 17947 T1977 C223 P52822 REQ /update {update.distrib=FROMLEADER&distrib.from=http://127.0.0.1:52788/solr/collection1/&wt=javabin&version=2} status=0 QTime=3 
[junit4:junit4]   2> 17948 T1958 C226 P52788 REQ /update {distrib.from=http://127.0.0.1:52760/solr/collection1/&update.distrib=TOLEADER&wt=javabin&version=2} status=0 QTime=9 
[junit4:junit4]   2> 17948 T1946 C225 P52760 /update {wt=javabin&version=2} {add=[3]} 0 12
[junit4:junit4]   2> 17954 T1926 C224 P52735 /update {wt=javabin&version=2} {add=[4 (1412995702647160832)]} 0 3
[junit4:junit4]   2> 17974 T1964 C222 P52804 REQ /update {update.distrib=FROMLEADER&distrib.from=http://127.0.0.1:52760/solr/collection1/&wt=javabin&version=2} status=0 QTime=6 
[junit4:junit4]   2> 17975 T1941 C225 P52760 REQ /update {distrib.from=http://127.0.0.1:52788/solr/collection1/&update.distrib=TOLEADER&wt=javabin&version=2} status=0 QTime=15 
[junit4:junit4]   2> 17976 T1953 C226 P52788 /update {wt=javabin&version=2} {add=[4]} 0 19
[junit4:junit4]   2> 17982 T1926 C224 P52735 /update {wt=javabin&version=2} {add=[5 (1412995702676520960)]} 0 3
[junit4:junit4]   2> 17996 T1977 C223 P52822 REQ /update {update.distrib=FROMLEADER&distrib.from=http://127.0.0.1:52788/solr/collection1/&wt=javabin&version=2} status=0 QTime=3 
[junit4:junit4]   2> 17997 T1958 C226 P52788 REQ /update {distrib.from=http://127.0.0.1:52760/solr/collection1/&update.distrib=TOLEADER&wt=javabin&version=2} status=0 QTime=9 
[junit4:junit4]   2> 17998 T1946 C225 P52760 /update {wt=javabin&version=2} {add=[5]} 0 13
[junit4:junit4]   2> 18003 T1926 C224 P52735 /update {wt=javabin&version=2} {add=[6 (1412995702698541056)]} 0 3
[junit4:junit4]   2> 18016 T1977 C223 P52822 REQ /update {distrib.from=http://127.0.0.1:52788/solr/collection1/&update.distrib=FROMLEADER&wt=javabin&version=2} status=0 QTime=3 
[junit4:junit4]   2> 18018 T1953 C226 P52788 /update {wt=javabin&version=2} {add=[6 (1412995702705881088)]} 0 11
[junit4:junit4]   2> 18025 T1926 C224 P52735 /update {wt=javabin&version=2} {add=[7 (1412995702720561152)]} 0 4
[junit4:junit4]   2> 18045 T1977 C223 P52822 REQ /update {update.distrib=FROMLEADER&distrib.from=http://127.0.0.1:52788/solr/collection1/&wt=javabin&version=2} status=0 QTime=4 
[junit4:junit4]   2> 18047 T1958 C226 P52788 REQ /update {distrib.from=http://127.0.0.1:52760/solr/collection1/&update.distrib=TOLEADER&wt=javabin&version=2} status=0 QTime=13 
[junit4:junit4]   2> 18048 T1946 C225 P52760 /update {wt=javabin&version=2} {add=[7]} 0 19
[junit4:junit4]   2> 18057 T1926 C224 P52735 /update {wt=javabin&version=2} {add=[8 (1412995702752018432)]} 0 6
[junit4:junit4]   2> 18077 T1964 C222 P52804 REQ /update {update.distrib=FROMLEADER&distrib.from=http://127.0.0.1:52760/solr/collection1/&wt=javabin&version=2} status=0 QTime=3 
[junit4:junit4]   2> 18079 T1941 C225 P52760 REQ /update {distrib.from=http://127.0.0.1:52788/solr/collection1/&update.distrib=TOLEADER&wt=javabin&version=2} status=0 QTime=13 
[junit4:junit4]   2> 18080 T1953 C226 P52788 /update {wt=javabin&version=2} {add=[8]} 0 18
[junit4:junit4]   2> 18087 T1926 C224 P52735 /update {wt=javabin&version=2} {add=[9 (1412995702785572864)]} 0 3
[junit4:junit4]   2> 18102 T1977 C223 P52822 REQ /update {update.distrib=FROMLEADER&distrib.from=http://127.0.0.1:52788/solr/collection1/&wt=javabin&version=2} status=0 QTime=2 
[junit4:junit4]   2> 18103 T1958 C226 P52788 REQ /update {distrib.from=http://127.0.0.1:52760/solr/collection1/&update.distrib=TOLEADER&wt=javabin&version=2} status=0 QTime=9 
[junit4:junit4]   2> 18104 T1946 C225 P52760 /update {wt=javabin&version=2} {add=[9]} 0 13
[junit4:junit4]   2> 18110 T1926 C224 P52735 /update {wt=javabin&version=2} {add=[10 (1412995702810738688)]} 0 3
[junit4:junit4]   2> 18126 T1964 C222 P52804 REQ /update {update.distrib=FROMLEADER&distrib.from=http://127.0.0.1:52760/solr/collection1/&wt=javabin&version=2} status=0 QTime=4 
[junit4:junit4]   2> 18127 T1941 C225 P52760 REQ /update {distrib.from=http://127.0.0.1:52788/solr/collection1/&update.distrib=TOLEADER&wt=javabin&version=2} status=0 QTime=11 
[junit4:junit4]   2> 18128 T1953 C226 P52788 /update {wt=javabin&version=2} {add=[10]} 0 15
[junit4:junit4]   2> 18153 T1926 C224 P52735 /update {wt=javabin&version=2} {add=[11 (1412995702835904512)]} 0 22
[junit4:junit4]   2> 18166 T1964 C222 P52804 REQ /update {distrib.from=http://127.0.0.1:52760/solr/collection1/&update.distrib=FROMLEADER&wt=javabin&version=2} status=0 QTime=4 
[junit4:junit4]   2> 18167 T1946 C225 P52760 /update {wt=javabin&version=2} {add=[11 (1412995702862118912)]} 0 11
[junit4:junit4]   2> 18175 T1926 C224 P52735 /update {wt=javabin&version=2} {add=[12 (1412995702877847552)]} 0 4
[junit4:junit4]   2> 18191 T1964 C222 P52804 REQ /update {update.distrib=FROMLEADER&distrib.from=http://127.0.0.1:52760/solr/collection1/&wt=javabin&version=2} status=0 QTime=2 
[junit4:junit4]   2> 18192 T1941 C225 P52760 REQ /update {distrib.from=http://127.0.0.1:52788/solr/collection1/&update.distrib=TOLEADER&wt=javabin&version=2} status=0 QTime=9 
[junit4:junit4]   2> 18193 T1953 C226 P52788 /update {wt=javabin&version=2} {add=[12]} 0 14
[junit4:junit4]   2> 18200 T1926 C224 P52735 /update {wt=javabin&version=2} {add=[13 (1412995702905110528)]} 0 3
[junit4:junit4]   2> 18222 T1964 C222 P52804 REQ /update {update.distrib=FROMLEADER&distrib.from=http://127.0.0.1:52760/solr/collection1/&wt=javabin&version=2} status=0 QTime=4 
[junit4:junit4]   2> 18223 T1941 C225 P52760 REQ /update {distrib.from=http://127.0.0.1:52788/solr/collection1/&update.distrib=TOLEADER&wt=javabin&version=2} status=0 QTime=10 
[junit4:junit4]   2> 18224 T1953 C226 P52788 /update {wt=javabin&version=2} {add=[13]} 0 20
[junit4:junit4]   2> 18231 T1926 C224 P52735 /update {wt=javabin&version=2} {add=[14 (1412995702937616384)]} 0 2
[junit4:junit4]   2> 18246 T1964 C222 P52804 REQ /update {update.distrib=FROMLEADER&distrib.from=http://127.0.0.1:52760/solr/collection1/&wt=javabin&version=2} status=0 QTime=3 
[junit4:junit4]   2> 18248 T1941 C225 P52760 REQ /update {distrib.from=http://127.0.0.1:52788/solr/collection1/&update.distrib=TOLEADER&wt=javabin&version=2} status=0 QTime=9 
[junit4:junit4]   2> 18249 T1953 C226 P52788 /update {wt=javabin&version=2} {add=[14]} 0 14
[junit4:junit4]   2> 18255 T1926 C224 P52735 /update {wt=javabin&version=2} {add=[15 (1412995702962782208)]} 0 3
[junit4:junit4]   2> 18266 T1964 C222 P52804 REQ /update {distrib.from=http://127.0.0.1:52760/solr/collection1/&update.distrib=FROMLEADER&wt=javabin&version=2} status=0 QTime=3 
[junit4:junit4]   2> 18268 T1946 C225 P52760 /update {wt=javabin&version=2} {add=[15 (1412995702970122240)]} 0 9
[junit4:junit4]   2> 18274 T1926 C224 P52735 /update {wt=javabin&version=2} {add=[16 (1412995702982705152)]} 0 3
[junit4:junit4]   2> 18284 T1964 C222 P52804 REQ /update {distrib.from=http://127.0.0.1:52760/solr/collection1/&update.distrib=FROMLEADER&wt=javabin&version=2} status=0 QTime=3 
[junit4:junit4]   2> 18285 T1946 C225 P52760 /update {wt=javabin&version=2} {add=[16 (1412995702988996608)]} 0 8
[junit4:junit4]   2> 18298 T1926 C224 P52735 /update {wt=javabin&version=2} {add=[17 (1412995703003676672)]} 0 9
[junit4:junit4]   2> 18322 T1977 C223 P52822 REQ /update {update.distrib=FROMLEADER&distrib.from=http://127.0.0.1:52788/solr/collection1/&wt=javabin&version=2} status=0 QTime=4 
[junit4:junit4]   2> 18323 T1958 C226 P52788 REQ /update {distrib.from=http://127.0.0.1:52760/solr/collection1/&update.distrib=TOLEADER&wt=javabin&version=2} status=0 QTime=16 
[junit4:junit4]   2> 18324 T1946 C225 P52760 /update {wt=javabin&version=2} {add=[17]} 0 21
[junit4:junit4]   2> 18330 T1926 C224 P52735 /update {wt=javabin&version=2} {add=[100 (1412995703042473984)]} 0 2
[junit4:junit4]   2> 18370 T1964 C222 P52804 REQ /update {distrib.from=http://127.0.0.1:52760/solr/collection1/&update.distrib=FROMLEADER&wt=javabin&version=2} status=0 QTime=20 
[junit4:junit4]   2> 18372 T1946 C225 P52760 /update {wt=javabin&version=2} {add=[100 (1412995703047716864)]} 0 39
[junit4:junit4]   2> 18377 T1926 C224 P52735 /update {wt=javabin&version=2} {add=[101 (1412995703091757056)]} 0 2
[junit4:junit4]   2> 18389 T1964 C222 P52804 REQ /update {distrib.from=http://127.0.0.1:52760/solr/collection1/&update.distrib=FROMLEADER&wt=javabin&version=2} status=0 QTime=4 
[junit4:junit4]   2> 18390 T1946 C225 P52760 /update {wt=javabin&version=2} {add=[101 (1412995703095951360)]} 0 10
[junit4:junit4]   2> 18395 T1926 C224 P52735 /update {wt=javabin&version=2} {add=[102 (1412995703110631424)]} 0 2
[junit4:junit4]   2> 18408 T1964 C222 P52804 REQ /update {update.distrib=FROMLEADER&distrib.from=http://127.0.0.1:52760/solr/collection1/&wt=javabin&version=2} status=0 QTime=3 
[junit4:junit4]   2> 18409 T1941 C225 P52760 REQ /update {distrib.from=http://127.0.0.1:52788/solr/collection1/&update.distrib=TOLEADER&wt=javabin&version=2} status=0 QTime=8 
[junit4:junit4]   2> 18410 T1953 C226 P52788 /update {wt=javabin&version=2} {add=[102]} 0 12
[junit4:junit4]   2> 18437 T1926 C224 P52735 /update {wt=javabin&version=2} {add=[103 (1412995703131602944)]} 0 23
[junit4:junit4]   2> 18446 T1977 C223 P52822 REQ /update {distrib.from=http://127.0.0.1:52788/solr/collection1/&update.distrib=FROMLEADER&wt=javabin&version=2} status=0 QTime=1 
[junit4:junit4]   2> 18447 T1953 C226 P52788 /update {wt=javabin&version=2} {add=[103 (1412995703160963072)]} 0 6
[junit4:junit4]   2> 18452 T1926 C224 P52735 /update {wt=javabin&version=2} {add=[104 (1412995703169351680)]} 0 2
[junit4:junit4]   2> 18464 T1977 C223 P52822 REQ /update {update.distrib=FROMLEADER&distrib.from=http://127.0.0.1:52788/solr/collection1/&wt=javabin&version=2} status=0 QTime=1 
[junit4:junit4]   2> 18465 T1958 C226 P52788 REQ /update {distrib.from=http://127.0.0.1:52760/solr/collection1/&update.distrib=TOLEADER&wt=javabin&version=2} status=0 QTime=7 
[junit4:junit4]   2> 18466 T1946 C225 P52760 /update {wt=javabin&version=2} {add=[104]} 0 11
[junit4:junit4]   2> 18472 T1926 C224 P52735 /update {wt=javabin&version=2} {add=[105 (1412995703191371776)]} 0 2
[junit4:junit4]   2> 18516 T1977 C223 P52822 REQ /update {distrib.from=http://127.0.0.1:52788/solr/collection1/&update.distrib=FROMLEADER&wt=javabin&version=2} status=0 QTime=20 
[junit4:junit4]   2> 18517 T1953 C226 P52788 /update {wt=javabin&version=2} {add=[105 (1412995703196614656)]} 0 42
[junit4:junit4]   2> 18522 T1926 C224 P52735 /update {wt=javabin&version=2} {add=[106 (1412995703243800576)]} 0 2
[junit4:junit4]   2> 18534 T1977 C223 P52822 REQ /update {distrib.from=http://127.0.0.1:52788/solr/collection1/&update.distrib=FROMLEADER&wt=javabin&version=2} status=0 QTime=3 
[junit4:junit4]   2> 18535 T1953 C226 P52788 /update {wt=javabin&version=2} {add=[106 (1412995703249043456)]} 0 10
[junit4:junit4]   2> 18540 T1926 C224 P52735 /update {wt=javabin&version=2} {add=[107 (1412995703262674944)]} 0 2
[junit4:junit4]   2> 18555 T1964 C222 P52804 REQ /update {update.distrib=FROMLEADER&distrib.from=http://127.0.0.1:52760/solr/collection1/&wt=javabin&version=2} status=0 QTime=2 
[junit4:junit4]   2> 18556 T1941 C225 P52760 REQ /update {distrib.from=http://127.0.0.1:52788/solr/collection1/&update.distrib=TOLEADER&wt=javabin&version=2} status=0 QTime=6 
[junit4:junit4]   2> 18557 T1953 C226 P52788 /update {wt=javabin&version=2} {add=[107]} 0 10
[junit4:junit4]   2> 18562 T1926 C224 P52735 /update {wt=javabin&version=2} {add=[108 (1412995703285743616)]} 0 2
[junit4:junit4]   2> 18575 T1964 C222 P52804 REQ /update {update.distrib=FROMLEADER&distrib.from=http://127.0.0.1:52760/solr/collection1/&wt=javabin&version=2} status=0 QTime=2 
[junit4:junit4]   2> 18576 T1941 C225 P52760 REQ /update {distrib.from=http://127.0.0.1:52788/solr/collection1/&update.distrib=TOLEADER&wt=javabin&version=2} status=0 QTime=8 
[junit4:junit4]   2> 18577 T1953 C226 P52788 /update {wt=javabin&version=2} {add=[108]} 0 12
[junit4:junit4]   2> 18582 T1926 C224 P52735 /update {wt=javabin&version=2} {add=[109 (1412995703306715136)]} 0 2
[junit4:junit4]   2> 18594 T1964 C222 P52804 REQ /update {update.distrib=FROMLEADER&distrib.from=http://127.0.0.1:52760/solr/collection1/&wt=javabin&version=2} status=0 QTime=2 
[junit4:junit4]   2> 18595 T1941 C225 P52760 REQ /update {distrib.from=http://127.0.0.1:52788/solr/collection1/&update.distrib=TOLEADER&wt=javabin&version=2} status=0 QTime=7 
[junit4:junit4]   2> 18596 T1953 C226 P52788 /update {wt=javabin&version=2} {add=[109]} 0 11
[junit4:junit4]   2> 18602 T1926 C224 P52735 /update {wt=javabin&version=2} {add=[110 (1412995703327686656)]} 0 2
[junit4:junit4]   2> 18612 T1964 C222 P52804 REQ /update {distrib.from=http://127.0.0.1:52760/solr/collection1/&update.distrib=FROMLEADER&wt=javabin&version=2} status=0 QTime=2 
[junit4:junit4]   2> 18613 T1946 C225 P52760 /update {wt=javabin&version=2} {add=[110 (1412995703333978112)]} 0 7
[junit4:junit4]   2> 18619 T1926 C224 P52735 /update {wt=javabin&version=2} {add=[111 (1412995703345512448)]} 0 2
[junit4:junit4]   2> 18632 T1964 C222 P52804 REQ /update {update.distrib=FROMLEADER&distrib.from=http://127.0.0.1:52760/solr/collection1/&wt=javabin&version=2} status=0 QTime=2 
[junit4:junit4]   2> 18633 T1941 C225 P52760 REQ /update {distrib.from=http://127.0.0.1:52788/solr/collection1/&update.distrib=TOLEADER&wt=javabin&version=2} status=0 QTime=7 
[junit4:junit4]   2> 18634 T1953 C226 P52788 /update {wt=javabin&version=2} {add=[111]} 0 11
[junit4:junit4]   2> 18640 T1926 C224 P52735 /update {wt=javabin&version=2} {add=[112 (1412995703367532544)]} 0 2
[junit4:junit4]   2> 18653 T1977 C223 P52822 REQ /update {update.distrib=FROMLEADER&distrib.from=http://127.0.0.1:52788/solr/collection1/&wt=javabin&version=2} status=0 QTime=2 
[junit4:junit4]   2> 18654 T1958 C226 P52788 REQ /update {distrib.from=http://127.0.0.1:52760/solr/collection1/&update.distrib=TOLEADER&wt=javabin&version=2} status=0 QTime=8 
[junit4:junit4]   2> 18655 T1946 C225 P52760 /update {wt=javabin&version=2} {add=[112]} 0 12
[junit4:junit4]   2> 18676 T1926 C224 P52735 /update {wt=javabin&version=2} {add=[113 (1412995703389552640)]} 0 17
[junit4:junit4]   2> 18688 T1964 C222 P52804 REQ /update {distrib.from=http://127.0.0.1:52760/solr/collection1/&update.distrib=FROMLEADER&wt=javabin&version=2} status=0 QTime=3 
[junit4:junit4]   2> 18689 T1946 C225 P52760 /update {wt=javabin&version=2} {add=[113 (1412995703411572736)]} 0 9
[junit4:junit4]   2> 18696 T1926 C224 P52735 /update {wt=javabin&version=2} {add=[114 (1412995703425204224)]} 0 3
[junit4:junit4]   2> 18707 T1964 C222 P52804 REQ /update {update.distrib=FROMLEADER&distrib.from=http://127.0.0.1:52760/solr/collection1/&wt=javabin&version=2} status=0 QTime=2 
[junit4:junit4]   2> 18708 T1941 C225 P52760 REQ /update {distrib.from=http://127.0.0.1:52788/solr/collection1/&update.distrib=TOLEADER&wt=javabin&version=2} status=0 QTime=7 
[junit4:junit4]   2> 18709 T1953 C226 P52788 /update {wt=javabin&version=2} {add=[114]} 0 11
[junit4:junit4]   2> 18714 T1926 C224 P52735 /update {wt=javabin&version=2} {add=[115 (1412995703445127168)]} 0 2
[junit4:junit4]   2> 18724 T1977 C223 P52822 REQ /update {distrib.from=http://127.0.0.1:52788/solr/collection1/&update.distrib=FROMLEADER&wt=javabin&version=2} status=0 QTime=3 
[junit4:junit4]   2> 18725 T1953 C226 P52788 /update {wt=javabin&version=2} {add=[115 (1412995703449321472)]} 0 8
[junit4:junit4]   2> 18730 T1926 C224 P52735 /update {wt=javabin&version=2} {add=[116 (1412995703461904384)]} 0 2
[junit4:junit4]   2> 18740 T1977 C223 P52822 REQ /update {distrib.from=http://127.0.0.1:52788/solr/collection1/&update.distrib=FROMLEADER&wt=javabin&version=2} status=0 QTime=2 
[junit4:junit4]   2> 18742 T1953 C226 P52788 /update {wt=javabin&version=2} {add=[116 (1412995703467147264)]} 0 9
[junit4:junit4]   2> 18748 T1926 C224 P52735 /update {wt=javabin&version=2} {add=[117 (1412995703479730176)]} 0 3
[junit4:junit4]   2> 18759 T1977 C223 P52822 REQ /update {distrib.from=http://127.0.0.1:52788/solr/collection1/&update.distrib=FROMLEADER&wt=javabin&version=2} status=0 QTime=3 
[junit4:junit4]   2> 18760 T1953 C226 P52788 /update {wt=javabin&version=2} {add=[117 (1412995703486021632)]} 0 9
[junit4:junit4]   2> 18765 T1926 C224 P52735 /update {wt=javabin&version=2} {add=[118 (1412995703498604544)]} 0 2
[junit4:junit4]   2> 18817 T1964 C222 P52804 REQ /update {update.distrib=FROMLEADER&distrib.from=http://127.0.0.1:52760/solr/collection1/&wt=javabin&version=2} status=0 QTime=22 
[junit4:junit4]   2> 18819 T1941 C225 P52760 REQ /update {distrib.from=http://127.0.0.1:52788/solr/collection1/&update.distrib=TOLEADER&wt=javabin&version=2} status=0 QTime=48 
[junit4:junit4]   2> 18820 T1953 C226 P52788 /update {wt=javabin&version=2} {add=[118]} 0 52
[junit4:junit4]   2> 18825 T1926 C224 P52735 /update {wt=javabin&version=2} {add=[119 (1412995703561519104)]} 0 2
[junit4:junit4]   2> 18837 T1977 C223 P52822 REQ /update {distrib.from=http://127.0.0.1:52788/solr/collection1/&update.distrib=FROMLEADER&wt=javabin&version=2} status=0 QTime=2 
[junit4:junit4]   2> 18838 T1953 C226 P52788 /update {wt=javabin&version=2} {add=[119 (1412995703567810560)]} 0 8
[junit4:junit4]   2> 18844 T1926 C224 P52735 /update {wt=javabin&version=2} {add=[120 (1412995703581442048)]} 0 2
[junit4:junit4]   2> 18853 T1977 C223 P52822 REQ /update {distrib.from=http://127.0.0.1:52788/solr/collection1/&update.distrib=FROMLEADER&wt=javabin&version=2} status=0 QTime=2 
[junit4:junit4]   2> 18855 T1953 C226 P52788 /update {wt=javabin&version=2} {add=[120 (1412995703586684928)]} 0 7
[junit4:junit4]   2> 18860 T1926 C224 P52735 /update {wt=javabin&version=2} {add=[121 (1412995703598219264)]} 0 2
[junit4:junit4]   2> 18872 T1977 C223 P52822 REQ /update {update.distrib=FROMLEADER&distrib.from=http://127.0.0.1:52788/solr/collection1/&wt=javabin&version=2} status=0 QTime=2 
[junit4:junit4]   2> 18873 T1958 C226 P52788 REQ /update {distrib.from=http://127.0.0.1:52760/solr/collection1/&update.distrib=TOLEADER&wt=javabin&version=2} status=0 QTime=7 
[junit4:junit4]   2> 18874 T1946 C225 P52760 /update {wt=javabin&version=2} {add=[121]} 0 11
[junit4:junit4]   2> 18879 T1926 C224 P52735 /update {wt=javabin&version=2} {add=[122 (1412995703617093632)]} 0 2
[junit4:junit4]   2> 18893 T1964 C222 P52804 REQ /update {update.distrib=FROMLEADER&distrib.from=http://127.0.0.1:52760/solr/collection1/&wt=javabin&version=2} status=0 QTime=3 
[junit4:junit4]   2> 18894 T1941 C225 P52760 REQ /update {distrib.from=http://127.0.0.1:52788/solr/collection1/&update.distrib=TOLEADER&wt=javabin&version=2} status=0 QTime=9 
[junit4:junit4]   2> 18895 T1953 C226 P52788 /update {wt=javabin&version=2} {add=[122]} 0 13
[junit4:junit4]   2> 18920 T1926 C224 P52735 /update {wt=javabin&version=2} {add=[123 (1412995703640162304)]} 0 22
[junit4:junit4]   2> 18930 T1964 C222 P52804 REQ /update {distrib.from=http://127.0.0.1:52760/solr/collection1/&update.distrib=FROMLEADER&wt=javabin&version=2} status=0 QTime=2 
[junit4:junit4]   2> 18938 T1946 C225 P52760 /update {wt=javabin&version=2} {add=[123 (1412995703667425280)]} 0 14
[junit4:junit4]   2> 18945 T1926 C224 P52735 /update {wt=javabin&version=2} {add=[124 (1412995703686299648)]} 0 3
[junit4:junit4]   2> 18955 T1964 C222 P52804 REQ /update {distrib.from=http://127.0.0.1:52760/solr/collection1/&update.distrib=FROMLEADER&wt=javabin&version=2} status=0 QTime=2 
[junit4:junit4]   2> 18956 T1946 C225 P52760 /update {wt=javabin&version=2} {add=[124 (1412995703693639680)]} 0 7
[junit4:junit4]   2> 18961 T1926 C224 P52735 /update {wt=javabin&version=2} {add=[125 (1412995703704125440)]} 0 2
[junit4:junit4]   2> 18971 T1964 C222 P52804 REQ /update {distrib.from=http://127.0.0.1:52760/solr/collection1/&update.distrib=FROMLEADER&wt=javabin&version=2} status=0 QTime=2 
[junit4:junit4]   2> 18972 T1946 C225 P52760 /update {wt=javabin&version=2} {add=[125 (1412995703710416896)]} 0 7
[junit4:junit4]   2> 18977 T1926 C224 P52735 /update {wt=javabin&version=2} {add=[126 (1412995703720902656)]} 0 2
[junit4:junit4]   2> 18989 T1977 C223 P52822 REQ /update {update.distrib=FROMLEADER&distrib.from=http://127.0.0.1:52788/solr/collection1/&wt=javabin&version=2} status=0 QTime=2 
[junit4:junit4]   2> 18990 T1958 C226 P52788 REQ /update {distrib.from=http://127.0.0.1:52760/solr/collection1/&update.distrib=TOLEADER&wt=javabin&version=2} status=0 QTime=7 
[junit4:junit4]   2> 18991 T1946 C225 P52760 /update {wt=javabin&version=2} {add=[126]} 0 11
[junit4:junit4]   2> 18996 T1926 C224 P52735 /update {wt=javabin&version=2} {add=[127 (1412995703740825600)]} 0 2
[junit4:junit4]   2> 19037 T1977 C223 P52822 REQ /update {distrib.from=http://127.0.0.1:52788/solr/collection1/&update.distrib=FROMLEADER&wt=javabin&version=2} status=0 QTime=17 
[junit4:junit4]   2> 19038 T1953 C226 P52788 /update {wt=javabin&version=2} {add=[127 (1412995703747117056)]} 0 38
[junit4:junit4]   2> 19044 T1926 C224 P52735 /update {wt=javabin&version=2} {add=[128 (1412995703790108672)]} 0 3
[junit4:junit4]   2> 19058 T1977 C223 P52822 REQ /update {update.distrib=FROMLEADER&distrib.from=http://127.0.0.1:52788/solr/collection1/&wt=javabin&version=2} status=0 QTime=3 
[junit4:junit4]   2> 19059 T1958 C226 P52788 REQ /update {distrib.from=http://127.0.0.1:52760/solr/collection1/&update.distrib=TOLEADER&wt=javabin&version=2} status=0 QTime=9 
[junit4:junit4]   2> 19060 T1946 C225 P52760 /update {wt=javabin&version=2} {add=[128]} 0 13
[junit4:junit4]   2> 19066 T1926 C224 P52735 /update {wt=javabin&version=2} {add=[129 (1412995703813177344)]} 0 3
[junit4:junit4]   2> 19075 T1964 C222 P52804 REQ /update {distrib.from=http://127.0.0.1:52760/solr/collection1/&update.distrib=FROMLEADER&wt=javabin&version=2} status=0 QTime=2 
[junit4:junit4]   2> 19076 T1946 C225 P52760 /update {wt=javabin&version=2} {add=[129 (1412995703819468800)]} 0 7
[junit4:junit4]   2> 19081 T1926 C224 P52735 /update {wt=javabin&version=2} {add=[130 (1412995703829954560)]} 0 2
[junit4:junit4]   2> 19090 T1977 C223 P52822 REQ /update {distrib.from=http://127.0.0.1:52788/solr/collection1/&update.distrib=FROMLEADER&wt=javabin&version=2} status=0 QTime=2 
[junit4:junit4]   2> 19091 T1953 C226 P52788 /update {wt=javabin&version=2} {add=[130 (1412995703835197440)]} 0 7
[junit4:junit4]   2> 19096 T1926 C224 P52735 /update {wt=javabin&version=2} {add=[131 (1412995703845683200)]} 0 2
[junit4:junit4]   2> 19109 T1977 C223 P52822 REQ /update {update.distrib=FROMLEADER&distrib.from=http://127.0.0.1:52788/solr/collection1/&wt=javabin&version=2} status=0 QTime=2 
[junit4:junit4]   2> 19110 T1958 C226 P52788 REQ /update {distrib.from=http://127.0.0.1:52760/solr/collection1/&update.distrib=TOLEADER&wt=javabin&version=2} status=0 QTime=8 
[junit4:junit4]   2> 19111 T1946 C225 P52760 /update {wt=javabin&version=2} {add=[131]} 0 12
[junit4:junit4]   2> 19116 T1926 C224 P52735 /update {wt=javabin&version=2} {add=[132 (1412995703866654720)]} 0 2
[junit4:junit4]   2> 19128 T1964 C222 P52804 REQ /update {update.distrib=FROMLEADER&distrib.from=http://127.0.0.1:52760/solr/collection1/&wt=javabin&version=2} status=0 QTime=2 
[junit4:junit4]   2> 19129 T1941 C225 P52760 REQ /update {distrib.from=http://127.0.0.1:52788/solr/collection1/&update.distrib=TOLEADER&wt=javabin&version=2} status=0 QTime=7 
[junit4:junit4]   2> 19129 T1953 C226 P52788 /update {wt=javabin&version=2} {add=[132]} 0 10
[junit4:junit4]   2> 19149 T1926 C224 P52735 /update {wt=javabin&version=2} {add=[133 (1412995703884480512)]} 0 17
[junit4:junit4]   2> 19158 T1964 C222 P52804 REQ /update {distrib.from=http://127.0.0.1:52760/solr/collection1/&update.distrib=FROMLEADER&wt=javabin&version=2} status=0 QTime=2 
[junit4:junit4]   2> 19158 T1946 C225 P52760 /update {wt=javabin&version=2} {add=[133 (1412995703906500608)]} 0 6
[junit4:junit4]   2> 19165 T1926 C224 P52735 /update {wt=javabin&version=2} {add=[134 (1412995703916986368)]} 0 3
[junit4:junit4]   2> 19174 T1977 C223 P52822 REQ /update {distrib.from=http://127.0.0.1:52788/solr/collection1/&update.distrib=FROMLEADER&wt=javabin&version=2} status=0 QTime=2 
[junit4:junit4]   2> 19175 T1953 C226 P52788 /update {wt=javabin&version=2} {add=[134 (1412995703923277824)]} 0 7
[junit4:junit4]   2> 19180 T1926 C224 P52735 /update {wt=javabin&version=2} {add=[135 (1412995703933763584)]} 0 2
[junit4:junit4]   2> 19189 T1964 C222 P52804 REQ /update {distrib.from=http://127.0.0.1:52760/solr/collection1/&update.distrib=FROMLEADER&wt=javabin&version=2} status=0 QTime=2 
[junit4:junit4]   2> 19190 T1946 C225 P52760 /update {wt=javabin&version=2} {add=[135 (1412995703937957888)]} 0 7
[junit4:junit4]   2> 19195 T1926 C224 P52735 /update {wt=javabin&version=2} {add=[136 (1412995703949492224)]} 0 2
[junit4:junit4]   2> 19207 T1977 C223 P52822 REQ /update {update.distrib=FROMLEADER&distrib.from=http://127.0.0.1:52788/solr/collection1/&wt=javabin&version=2} status=0 QTime=2 
[junit4:junit4]   2> 19208 T1958 C226 P52788 REQ /update {distrib.from=http://127.0.0.1:52760/solr/collection1/&update.distrib=TOLEADER&wt=javabin&version=2} status=0 QTime=7 
[junit4:junit4]   2> 19208 T1946 C225 P52760 /update {wt=javabin&version=2} {add=[136]} 0 10
[junit4:junit4]   2> 19214 T1926 C224 P52735 /update {wt=javabin&version=2} {add=[137 (1412995703969415168)]} 0 2
[junit4:junit4]   2> 19223 T1977 C223 P52822 REQ /update {distrib.from=http://127.0.0.1:52788/solr/collection1/&update.distrib=FROMLEADER&wt=javabin&version=2} status=0 QTime=2 
[junit4:junit4]   2> 19224 T1953 C226 P52788 /update {wt=javabin&version=2} {add=[137 (1412995703974658048)]} 0 7
[junit4:junit4]   2> 19229 T1926 C224 P52735 /update {wt=javabin&version=2} {add=[138 (1412995703985143808)]} 0 2
[junit4:junit4]   2> 19241 T1964 C222 P52804 REQ /update {update.distrib=FROMLEADER&distrib.from=http://127.0.0.1:52760/solr/collection1/&wt=javabin&version=2} status=0 QTime=2 
[junit4:junit4]   2> 19242 T1941 C225 P52760 REQ /update {distrib.from=http://127.0.0.1:52788/solr/collection1/&update.distrib=TOLEADER&wt=javabin&version=2} status=0 QTime=7 
[junit4:junit4]   2> 19243 T1953 C226 P52788 /update {wt=javabin&version=2} {add=[138]} 0 11
[junit4:junit4]   2> 19248 T1926 C224 P52735 /update {wt=javabin&version=2} {add=[139 (1412995704005066752)]} 0 2
[junit4:junit4]   2> 19261 T1977 C223 P52822 REQ /update {update.distrib=FROMLEADER&distrib.from=http://127.0.0.1:52788/solr/collection1/&wt=javabin&version=2} status=0 QTime=2 
[junit4:junit4]   2> 19262 T1958 C226 P52788 REQ /update {distrib.from=http://127.0.0.1:52760/solr/collection1/&update.distrib=TOLEADER&wt=javabin&version=2} status=0 QTime=8 
[junit4:junit4]   2> 19263 T1946 C225 P52760 /update {wt=javabin&version=2} {add=[139]} 0 12
[junit4:junit4]   2> 19270 T1926 C224 P52735 /update {wt=javabin&version=2} {add=[140 (1412995704027086848)]} 0 3
[junit4:junit4]   2> 19283 T1977 C223 P52822 REQ /update {update.distrib=FROMLEADER&distrib.from=http://127.0.0.1:52788/solr/collection1/&wt=javabin&version=2} status=0 QTime=2 
[junit4:junit4]   2> 19287 T1958 C226 P52788 REQ /update {distrib.from=http://127.0.0.1:52760/solr/collection1/&update.distrib=TOLEADER&wt=javabin&version=2} status=0 QTime=11 
[junit4:junit4]   2> 19289 T1946 C225 P52760 /update {wt=javabin&version=2} {add=[140]} 0 16
[junit4:junit4]   2> 19294 T1926 C224 P52735 /update {wt=javabin&version=2} {add=[141 (1412995704053301248)]} 0 2
[junit4:junit4]   2> 19304 T1977 C223 P52822 REQ /update {distrib.from=http://127.0.0.1:52788/solr/collection1/&update.distrib=FROMLEADER&wt=javabin&version=2} status=0 QTime=2 
[junit4:junit4]   2> 19305 T1953 C226 P52788 /update {wt=javabin&version=2} {add=[141 (1412995704058544128)]} 0 8
[junit4:junit4]   2> 19311 T1926 C224 P52735 /update {wt=javabin&version=2} {add=[142 (1412995704071127040)]} 0 1
[junit4:junit4]   2> 19366 T1977 C223 P52822 REQ /update {update.distrib=FROMLEADER&distrib.from=http://127.0.0.1:52788/solr/collection1/&wt=javabin&version=2} status=0 QTime=22 
[junit4:junit4]   2> 19367 T1958 C226 P52788 REQ /update {distrib.from=http://127.0.0.1:52760/solr/collection1/&update.distrib=TOLEADER&wt=javabin&version=2} status=0 QTime=48 
[junit4:junit4]   2> 19369 T1946 C225 P52760 /update {wt=javabin&version=2} {add=[142]} 0 54
[junit4:junit4]   2> 19390 T1926 C224 P52735 /update {wt=javabin&version=2} {add=[143 (1412995704137187328)]} 0 18
[junit4:junit4]   2> 19407 T1977 C223 P52822 REQ /update {update.distrib=FROMLEADER&distrib.from=http://127.0.0.1:52788/solr/collection1/&wt=javabin&version=2} status=0 QTime=3 
[junit4:junit4]   2> 19408 T1958 C226 P52788 REQ /update {distrib.from=http://127.0.0.1:52760/solr/collection1/&update.distrib=TOLEADER&wt=javabin&version=2} status=0 QTime=11 
[junit4:junit4]   2> 19409 T1946 C225 P52760 /update {wt=javabin&version=2} {add=[143]} 0 14
[junit4:junit4]   2> 19416 T1926 C224 P52735 /update {wt=javabin&version=2} {add=[144 (1412995704179130368)]} 0 3
[junit4:junit4]   2> 19427 T1977 C223 P52822 REQ /update {distrib.from=http://127.0.0.1:52788/solr/collection1/&update.distrib=FROMLEADER&wt=javabin&version=2} status=0 QTime=2 
[junit4:junit4]   2> 19428 T1953 C226 P52788 /update {wt=javabin&version=2} {add=[144 (1412995704186470400)]} 0 9
[junit4:junit4]   2> 19435 T1926 C224 P52735 /update {wt=javabin&version=2} {add=[145 (1412995704200101888)]} 0 2
[junit4:junit4]   2> 19446 T1977 C223 P52822 REQ /update {distrib.from=http://127.0.0.1:52788/solr/collection1/&update.distrib=FROMLEADER&wt=javabin&version=2} status=0 QTime=2 
[junit4:junit4]   2> 19448 T1953 C226 P52788 /update {wt=javabin&version=2} {add=[145 (1412995704206393344)]} 0 9
[junit4:junit4]   2> 19454 T1926 C224 P52735 /update {wt=javabin&version=2} {add=[146 (1412995704220024832)]} 0 2
[junit4:junit4]   2> 19511 T1964 C222 P52804 REQ /update {update.distrib=FROMLEADER&distrib.from=http://127.0.0.1:52760/solr/collection1/&wt=javabin&version=2} status=0 QTime=20 
[junit4:junit4]   2> 19513 T1941 C225 P52760 REQ /update {distrib.from=http://127.0.0.1:52788/solr/collection1/&update.distrib=TOLEADER&wt=javabin&version=2} status=0 QTime=51 
[junit4:junit4]   2> 19513 T1953 C226 P52788 /update {wt=javabin&version=2} {add=[146]} 0 54
[junit4:junit4]   2> 19520 T1926 C224 P52735 /update {wt=javabin&version=2} {add=[147 (1412995704289230848)]} 0 2
[junit4:junit4]   2> 19532 T1977 C223 P52822 REQ /update {update.distrib=FROMLEADER&distrib.from=http://127.0.0.1:52788/solr/collection1/&wt=javabin&version=2} status=0 QTime=2 
[junit4:junit4]   2> 19534 T1958 C226 P52788 REQ /update {distrib.from=http://127.0.0.1:52760/solr/collection1/&update.distrib=TOLEADER&wt=javabin&version=2} status=0 QTime=8 
[junit4:junit4]   2> 19535 T1946 C225 P52760 /update {wt=javabin&version=2} {add=[147]} 0 12
[junit4:junit4]   2> 19540 T1926 C224 P52735 /update {wt=javabin&version=2} {add=[148 (1412995704311250944)]} 0 2
[junit4:junit4]   2> 19551 T1964 C222 P52804 REQ /update {distrib.from=http://127.0.0.1:52760/solr/collection1/&update.distrib=FROMLEADER&wt=javabin&version=2} status=0 QTime=3 
[junit4:junit4]   2> 19552 T1946 C225 P52760 /update {wt=javabin&version=2} {add=[148 (1412995704316493824)]} 0 9
[junit4:junit4]   2> 19557 T1926 C224 P52735 /update {wt=javabin&version=2} {add=[149 (1412995704329076736)]} 0 2
[junit4:junit4]   2> 19570 T1977 C223 P52822 REQ /update {update.distrib=FROMLEADER&distrib.from=http://127.0.0.1:52788/solr/collection1/&wt=javabin&version=2} status=0 QTime=2 
[junit4:junit4]   2> 19571 T1958 C226 P52788 REQ /update {distrib.from=http://127.0.0.1:52760/solr/collection1/&update.distrib=TOLEADER&wt=javabin&version=2} status=0 QTime=8 
[junit4:junit4]   2> 19572 T1946 C225 P52760 /update {wt=javabin&version=2} {add=[149]} 0 12
[junit4:junit4]   2> 19572 T1914 oasc.AbstractDistribZkTestBase.waitForRecoveriesToFinish Wait for recoveries to finish - collection: collection1 failOnTimeout:true timeout (sec):1440
[junit4:junit4]   2> 19574 T1914 oascc.ZkStateReader.updateClusterState Updating cloud state from ZooKeeper... 
[junit4:junit4]   2> 19577 T1926 C224 P52735 oasu.DirectUpdateHandler2.commit start commit{flags=0,_version_=0,optimize=false,openSearcher=true,waitSearcher=true,expungeDeletes=false,softCommit=false}
[junit4:junit4]   2> 20096 T1926 C224 P52735 oasc.SolrDeletionPolicy.onCommit SolrDeletionPolicy.onCommit: commits:num=2
[junit4:junit4]   2> 		commit{dir=NRTCachingDirectory(org.apache.lucene.store.NIOFSDirectory@/usr/home/hudson/hudson-slave/workspace/Lucene-Solr-Tests-4.x-java7/solr/build/solr-core/test/J0/org.apache.solr.cloud.BasicDistributedZk2Test-1347537692859/control/data/index lockFactory=org.apache.lucene.store.NativeFSLockFactory@4367e139; maxCacheMB=48.0 maxMergeSizeMB=4.0),segFN=segments_2,generation=2,filenames=[_0_Block_0.tip, _0_Block_0.pos, _0_MockSep_0.pos, _0_Block_0.tim, _0_MockVariableIntBlock_0.doc, _0_MockVariableIntBlock_0.skp, _0_Pulsing40_0.prx, _0_Pulsing40_0.frq, _0_MockVariableIntBlock_0.pyl, _0_MockSep_0.skp, _0_MockVariableIntBlock_0.tib, _0_MockVariableIntBlock_0.pos, _0_Pulsing40_0.tip, _0_MockSep_0.doc, _0.si, _0_MockVariableIntBlock_0.tii, _0.fnm, _0_Pulsing40_0.tim, _0_Block_0.doc, _0_nrm.cfs, _0_MockSep_0.tib, _0_nrm.cfe, _0_MockVariableIntBlock_0.frq, _0_MockSep_0.frq, segments_2, _0.fdx, _0_MockSep_0.tii, _0_MockSep_0.pyl, _0.fdt]
[junit4:junit4]   2> 		commit{dir=NRTCachingDirectory(org.apache.lucene.store.NIOFSDirectory@/usr/home/hudson/hudson-slave/workspace/Lucene-Solr-Tests-4.x-java7/solr/build/solr-core/test/J0/org.apache.solr.cloud.BasicDistributedZk2Test-1347537692859/control/data/index lockFactory=org.apache.lucene.store.NativeFSLockFactory@4367e139; maxCacheMB=48.0 maxMergeSizeMB=4.0),segFN=segments_3,generation=3,filenames=[_5_nrm.cfe, _3_MockVariableIntBlock_0.frq, _4_MockSep_0.skp, _3.fdt, _4_MockVariableIntBlock_0.tii, _2_MockSep_0.doc, _7.fnm, _6_Block_0.pos, _6_MockSep_0.doc, _5_MockSep_0.skp, _5_Pulsing40_0.tip, _6_MockSep_0.frq, _7_MockSep_0.tib, _5_Pulsing40_0.tim, _6_MockVariableIntBlock_0.tii, _1_MockSep_0.pyl, _1_Block_0.pos, _0_Pulsing40_0.tim, _6_MockVariableIntBlock_0.tib, _7_MockSep_0.tii, _1_MockSep_0.tib, _1_MockVariableIntBlock_0.tii, _5_MockSep_0.doc, _1_MockSep_0.tii, _1_MockVariableIntBlock_0.tib, _1.fdx, _4_MockVariableIntBlock_0.tib, _1.fdt, _3_MockSep_0.pos, _5_nrm.cfs, _0_MockVariableIntBlock_0.frq, _6.fdt, _3_Pulsing40_0.frq, _2.si, _1_MockVariableIntBlock_0.skp, _2_Pulsing40_0.tim, _7_MockVariableIntBlock_0.pos, _2_Block_0.tim, _0_MockVariableIntBlock_0.doc, _6_MockSep_0.pyl, _2_Pulsing40_0.tip, _2_Block_0.tip, _2_MockSep_0.skp, _6.fdx, _1_MockVariableIntBlock_0.pyl, _5_Block_0.tim, _5_MockSep_0.tii, _3_MockVariableIntBlock_0.tii, _2_nrm.cfe, _5_Pulsing40_0.frq, _0_Pulsing40_0.tip, _0_MockVariableIntBlock_0.pos, _7_MockVariableIntBlock_0.skp, _2_nrm.cfs, _4_Block_0.tip, _4_MockVariableIntBlock_0.frq, _2.fnm, _5_MockVariableIntBlock_0.frq, _7_Pulsing40_0.tim, _3.fdx, _4_Pulsing40_0.tip, _2_MockSep_0.pyl, _4_Pulsing40_0.tim, _1.si, _5_MockSep_0.tib, _3_MockSep_0.skp, _7_Pulsing40_0.tip, _3_MockVariableIntBlock_0.pos, _3_MockSep_0.doc, _3_nrm.cfe, _0_Block_0.tip, _5_MockVariableIntBlock_0.pyl, _0_Block_0.tim, _7_Block_0.tim, _4_nrm.cfe, _7_Block_0.tip, _0_Pulsing40_0.prx, _4.fdx, _1_Pulsing40_0.prx, _7_MockVariableIntBlock_0.tii, _7_MockSep_0.pos, _1_Block_0.doc, _6_MockVari

[...truncated too long message...]

apter.evaluate(StatementAdapter.java:36)
[junit4:junit4]    > 	at com.carrotsearch.randomizedtesting.ThreadLeakControl$StatementRunner.run(ThreadLeakControl.java:358)
[junit4:junit4]    > 	at com.carrotsearch.randomizedtesting.ThreadLeakControl.forkTimeoutingTask(ThreadLeakControl.java:782)
[junit4:junit4]    > 	at com.carrotsearch.randomizedtesting.ThreadLeakControl$3.evaluate(ThreadLeakControl.java:442)
[junit4:junit4]    > 	at com.carrotsearch.randomizedtesting.RandomizedRunner.runSingleTest(RandomizedRunner.java:746)
[junit4:junit4]    > 	at com.carrotsearch.randomizedtesting.RandomizedRunner$3.evaluate(RandomizedRunner.java:648)
[junit4:junit4]    > 	at com.carrotsearch.randomizedtesting.RandomizedRunner$4.evaluate(RandomizedRunner.java:682)
[junit4:junit4]    > 	at com.carrotsearch.randomizedtesting.RandomizedRunner$5.evaluate(RandomizedRunner.java:693)
[junit4:junit4]    > 	at com.carrotsearch.randomizedtesting.rules.StatementAdapter.evaluate(StatementAdapter.java:36)
[junit4:junit4]    > 	at com.carrotsearch.randomizedtesting.rules.SystemPropertiesRestoreRule$1.evaluate(SystemPropertiesRestoreRule.java:53)
[junit4:junit4]    > 	at org.apache.lucene.util.AbstractBeforeAfterRule$1.evaluate(AbstractBeforeAfterRule.java:45)
[junit4:junit4]    > 	at org.apache.lucene.util.TestRuleStoreClassName$1.evaluate(TestRuleStoreClassName.java:42)
[junit4:junit4]    > 	at com.carrotsearch.randomizedtesting.rules.SystemPropertiesInvariantRule$1.evaluate(SystemPropertiesInvariantRule.java:55)
[junit4:junit4]    > 	at com.carrotsearch.randomizedtesting.rules.NoShadowingOrOverridesOnMethodsRule$1.evaluate(NoShadowingOrOverridesOnMethodsRule.java:39)
[junit4:junit4]    > 	at com.carrotsearch.randomizedtesting.rules.NoShadowingOrOverridesOnMethodsRule$1.evaluate(NoShadowingOrOverridesOnMethodsRule.java:39)
[junit4:junit4]    > 	at com.carrotsearch.randomizedtesting.rules.StatementAdapter.evaluate(StatementAdapter.java:36)
[junit4:junit4]    > 	at org.apache.lucene.util.TestRuleAssertionsRequired$1.evaluate(TestRuleAssertionsRequired.java:43)
[junit4:junit4]    > 	at org.apache.lucene.util.TestRuleMarkFailure$1.evaluate(TestRuleMarkFailure.java:48)
[junit4:junit4]    > 	at org.apache.lucene.util.TestRuleIgnoreAfterMaxFailures$1.evaluate(TestRuleIgnoreAfterMaxFailures.java:70)
[junit4:junit4]    > 	at org.apache.lucene.util.TestRuleIgnoreTestSuites$1.evaluate(TestRuleIgnoreTestSuites.java:55)
[junit4:junit4]    > 	at com.carrotsearch.randomizedtesting.rules.StatementAdapter.evaluate(StatementAdapter.java:36)
[junit4:junit4]    > 	at com.carrotsearch.randomizedtesting.ThreadLeakControl$StatementRunner.run(ThreadLeakControl.java:358)
[junit4:junit4]    > 	at java.lang.Thread.run(Thread.java:722)
[junit4:junit4]    > Caused by: java.net.SocketTimeoutException: Read timed out
[junit4:junit4]    > 	at java.net.SocketInputStream.socketRead0(Native Method)
[junit4:junit4]    > 	at java.net.SocketInputStream.read(SocketInputStream.java:150)
[junit4:junit4]    > 	at java.net.SocketInputStream.read(SocketInputStream.java:121)
[junit4:junit4]    > 	at org.apache.http.impl.io.AbstractSessionInputBuffer.fillBuffer(AbstractSessionInputBuffer.java:149)
[junit4:junit4]    > 	at org.apache.http.impl.io.SocketInputBuffer.fillBuffer(SocketInputBuffer.java:111)
[junit4:junit4]    > 	at org.apache.http.impl.io.AbstractSessionInputBuffer.readLine(AbstractSessionInputBuffer.java:264)
[junit4:junit4]    > 	at org.apache.http.impl.conn.DefaultResponseParser.parseHead(DefaultResponseParser.java:98)
[junit4:junit4]    > 	at org.apache.http.impl.io.AbstractMessageParser.parse(AbstractMessageParser.java:252)
[junit4:junit4]    > 	at org.apache.http.impl.AbstractHttpClientConnection.receiveResponseHeader(AbstractHttpClientConnection.java:282)
[junit4:junit4]    > 	at org.apache.http.impl.conn.DefaultClientConnection.receiveResponseHeader(DefaultClientConnection.java:247)
[junit4:junit4]    > 	at org.apache.http.impl.conn.AbstractClientConnAdapter.receiveResponseHeader(AbstractClientConnAdapter.java:216)
[junit4:junit4]    > 	at org.apache.http.protocol.HttpRequestExecutor.doReceiveResponse(HttpRequestExecutor.java:298)
[junit4:junit4]    > 	at org.apache.http.protocol.HttpRequestExecutor.execute(HttpRequestExecutor.java:125)
[junit4:junit4]    > 	at org.apache.http.impl.client.DefaultRequestDirector.tryExecute(DefaultRequestDirector.java:647)
[junit4:junit4]    > 	at org.apache.http.impl.client.DefaultRequestDirector.execute(DefaultRequestDirector.java:464)
[junit4:junit4]    > 	at org.apache.http.impl.client.AbstractHttpClient.execute(AbstractHttpClient.java:820)
[junit4:junit4]    > 	at org.apache.http.impl.client.AbstractHttpClient.execute(AbstractHttpClient.java:754)
[junit4:junit4]    > 	at org.apache.http.impl.client.AbstractHttpClient.execute(AbstractHttpClient.java:732)
[junit4:junit4]    > 	at org.apache.solr.client.solrj.impl.HttpSolrServer.request(HttpSolrServer.java:353)
[junit4:junit4]    > 	... 46 more
[junit4:junit4]   2> 74088 T1914 oas.SolrTestCaseJ4.deleteCore ###deleteCore
[junit4:junit4]   2> NOTE: test params are: codec=Lucene40: {n_f1=PostingsFormat(name=MockSep), foo_b=Pulsing40(freqCutoff=15 minBlockSize=15 maxBlockSize=71), foo_d=Block(blocksize=128), foo_f=Pulsing40(freqCutoff=15 minBlockSize=15 maxBlockSize=71), n_tl1=PostingsFormat(name=MockSep), n_d1=MockVariableIntBlock(baseBlockSize=60), rnd_b=Block(blocksize=128), intDefault=MockVariableIntBlock(baseBlockSize=60), n_td1=PostingsFormat(name=MockSep), timestamp=MockVariableIntBlock(baseBlockSize=60), id=Block(blocksize=128), range_facet_sl=Pulsing40(freqCutoff=15 minBlockSize=15 maxBlockSize=71), range_facet_si=PostingsFormat(name=MockSep), oddField_s=Pulsing40(freqCutoff=15 minBlockSize=15 maxBlockSize=71), multiDefault=PostingsFormat(name=MockSep), n_tf1=MockVariableIntBlock(baseBlockSize=60), n_dt1=PostingsFormat(name=MockSep), n_ti1=Block(blocksize=128), range_facet_l=MockVariableIntBlock(baseBlockSize=60), text=Pulsing40(freqCutoff=15 minBlockSize=15 maxBlockSize=71), _version_=MockVariableIntBlock(baseBlockSize=60), SubjectTerms_mfacet=MockVariableIntBlock(baseBlockSize=60), a_t=MockVariableIntBlock(baseBlockSize=60), n_tdt1=MockVariableIntBlock(baseBlockSize=60), other_tl1=MockVariableIntBlock(baseBlockSize=60), n_l1=MockVariableIntBlock(baseBlockSize=60), a_si=PostingsFormat(name=MockSep)}, sim=DefaultSimilarity, locale=zh_TW, timezone=NZ
[junit4:junit4]   2> NOTE: FreeBSD 9.0-RELEASE amd64/Oracle Corporation 1.7.0_06 (64-bit)/cpus=16,threads=1,free=288745728,total=510656512
[junit4:junit4]   2> NOTE: All tests run in this JVM: [DateMathParserTest, DateFieldTest, TestIBSimilarityFactory, TestReload, TestXIncludeConfig, SolrRequestParserTest, TermVectorComponentDistributedTest, TestWordDelimiterFilterFactory, FastVectorHighlighterTest, PluginInfoTest, BinaryUpdateRequestHandlerTest, TestJoin, TestFiltering, SolrCmdDistributorTest, SolrCoreCheckLockOnStartupTest, NoCacheHeaderTest, LoggingHandlerTest, JsonLoaderTest, SuggesterFSTTest, AutoCommitTest, TestFastLRUCache, DefaultValueUpdateProcessorTest, CSVRequestHandlerTest, SampleTest, TestCoreContainer, SpellPossibilityIteratorTest, UpdateRequestProcessorFactoryTest, CircularListTest, TestElisionMultitermQuery, DistanceFunctionTest, SimplePostToolTest, TestLMDirichletSimilarityFactory, TestLMJelinekMercerSimilarityFactory, TestRandomFaceting, SOLR749Test, JSONWriterTest, ResourceLoaderTest, UniqFieldsUpdateProcessorFactoryTest, BasicDistributedZkTest, DirectSolrConnectionTest, TestLuceneMatchVersion, TestPHPSerializedResponseWriter, TestDefaultSimilarityFactory, SearchHandlerTest, HighlighterConfigTest, SimpleFacetsTest, LeaderElectionIntegrationTest, FileBasedSpellCheckerTest, SolrPluginUtilsTest, DistributedSpellCheckComponentTest, RequestHandlersTest, NotRequiredUniqueKeyTest, TestExtendedDismaxParser, LeaderElectionTest, ZkControllerTest, SpellCheckCollatorTest, SoftAutoCommitTest, BasicZkTest, ZkSolrClientTest, TestFaceting, WordBreakSolrSpellCheckerTest, TestHashPartitioner, DistributedTermsComponentTest, StatsComponentTest, TestRecovery, IndexBasedSpellCheckerTest, TestRangeQuery, LukeRequestHandlerTest, TestGroupingSearch, SignatureUpdateProcessorFactoryTest, TestJmxIntegration, TestIndexSearcher, TestTrie, QueryEqualityTest, SpatialFilterTest, DistributedQueryElevationComponentTest, DisMaxRequestHandlerTest, IndexSchemaTest, TermsComponentTest, MinimalSchemaTest, PingRequestHandlerTest, TestSurroundQueryParser, TestSolrQueryParser, TestValueSourceCache, ReturnFieldsTest, TestOmitPositions, UpdateParamsTest, ShowFileRequestHandlerTest, TestIndexingPerformance, BadComponentTest, TestDocSet, TestCollationField, TestQuerySenderNoQuery, NumericFieldsTest, TestJmxMonitoredMap, EchoParamsTest, TestPhraseSuggestions, TestPluginEnable, TestDFRSimilarityFactory, PrimUtilsTest, TestSystemIdResolver, TestBadConfig, TestCharFilters, TestCollationKeyRangeQueries, BasicDistributedZk2Test]
[junit4:junit4] Completed on J0 in 74.11s, 1 test, 1 error <<< FAILURES!

[...truncated 5 lines...]
BUILD FAILED
/usr/home/hudson/hudson-slave/workspace/Lucene-Solr-Tests-4.x-java7/build.xml:29: The following error occurred while executing this line:
/usr/home/hudson/hudson-slave/workspace/Lucene-Solr-Tests-4.x-java7/solr/build.xml:146: The following error occurred while executing this line:
/usr/home/hudson/hudson-slave/workspace/Lucene-Solr-Tests-4.x-java7/lucene/module-build.xml:63: The following error occurred while executing this line:
/usr/home/hudson/hudson-slave/workspace/Lucene-Solr-Tests-4.x-java7/lucene/common-build.xml:1133: The following error occurred while executing this line:
/usr/home/hudson/hudson-slave/workspace/Lucene-Solr-Tests-4.x-java7/lucene/common-build.xml:810: There were test failures: 229 suites, 926 tests, 1 error, 6 ignored (1 assumption)

Total time: 30 minutes 26 seconds
Build step 'Invoke Ant' marked build as failure
Recording test results
Email was triggered for: Failure
Sending email for trigger: Failure



Mime
View raw message