lucene-dev mailing list archives

Site index · List index
Message view « Date » · « Thread »
Top « Date » · « Thread »
From Apache Jenkins Server <jenk...@builds.apache.org>
Subject [JENKINS-MAVEN] Lucene-Solr-Maven-4.x #97: POMs out of sync
Date Sat, 15 Sep 2012 11:32:17 GMT
Build: https://builds.apache.org/job/Lucene-Solr-Maven-4.x/97/

1 tests failed.
REGRESSION:  org.apache.solr.cloud.BasicDistributedZk2Test.testDistribSearch

Error Message:
Shard still reported as live in zk

Stack Trace:
java.lang.AssertionError: Shard still reported as live in zk
	at __randomizedtesting.SeedInfo.seed([A2854F5141B3BB24:2363C14936ECDB18]:0)
	at org.junit.Assert.fail(Assert.java:93)
	at org.apache.solr.cloud.AbstractFullDistribZkTestBase.waitToSeeNotLive(AbstractFullDistribZkTestBase.java:1215)
	at org.apache.solr.cloud.BasicDistributedZk2Test.brindDownShardIndexSomeDocsAndRecover(BasicDistributedZk2Test.java:190)
	at org.apache.solr.cloud.BasicDistributedZk2Test.doTest(BasicDistributedZk2Test.java:83)
	at org.apache.solr.BaseDistributedSearchTestCase.testDistribSearch(BaseDistributedSearchTestCase.java:691)
	at sun.reflect.NativeMethodAccessorImpl.invoke0(Native Method)
	at sun.reflect.NativeMethodAccessorImpl.invoke(NativeMethodAccessorImpl.java:57)
	at sun.reflect.DelegatingMethodAccessorImpl.invoke(DelegatingMethodAccessorImpl.java:43)
	at java.lang.reflect.Method.invoke(Method.java:616)
	at com.carrotsearch.randomizedtesting.RandomizedRunner.invoke(RandomizedRunner.java:1559)
	at com.carrotsearch.randomizedtesting.RandomizedRunner.access$600(RandomizedRunner.java:79)
	at com.carrotsearch.randomizedtesting.RandomizedRunner$6.evaluate(RandomizedRunner.java:737)
	at com.carrotsearch.randomizedtesting.RandomizedRunner$7.evaluate(RandomizedRunner.java:773)
	at com.carrotsearch.randomizedtesting.RandomizedRunner$8.evaluate(RandomizedRunner.java:787)
	at com.carrotsearch.randomizedtesting.rules.SystemPropertiesRestoreRule$1.evaluate(SystemPropertiesRestoreRule.java:53)
	at org.apache.lucene.util.TestRuleSetupTeardownChained$1.evaluate(TestRuleSetupTeardownChained.java:50)
	at org.apache.lucene.util.TestRuleFieldCacheSanity$1.evaluate(TestRuleFieldCacheSanity.java:51)
	at org.apache.lucene.util.AbstractBeforeAfterRule$1.evaluate(AbstractBeforeAfterRule.java:45)
	at com.carrotsearch.randomizedtesting.rules.SystemPropertiesInvariantRule$1.evaluate(SystemPropertiesInvariantRule.java:55)
	at org.apache.lucene.util.TestRuleThreadAndTestName$1.evaluate(TestRuleThreadAndTestName.java:48)
	at org.apache.lucene.util.TestRuleIgnoreAfterMaxFailures$1.evaluate(TestRuleIgnoreAfterMaxFailures.java:70)
	at org.apache.lucene.util.TestRuleMarkFailure$1.evaluate(TestRuleMarkFailure.java:48)
	at com.carrotsearch.randomizedtesting.rules.StatementAdapter.evaluate(StatementAdapter.java:36)
	at com.carrotsearch.randomizedtesting.ThreadLeakControl$StatementRunner.run(ThreadLeakControl.java:358)
	at com.carrotsearch.randomizedtesting.ThreadLeakControl.forkTimeoutingTask(ThreadLeakControl.java:782)
	at com.carrotsearch.randomizedtesting.ThreadLeakControl$3.evaluate(ThreadLeakControl.java:442)
	at com.carrotsearch.randomizedtesting.RandomizedRunner.runSingleTest(RandomizedRunner.java:746)
	at com.carrotsearch.randomizedtesting.RandomizedRunner$3.evaluate(RandomizedRunner.java:648)
	at com.carrotsearch.randomizedtesting.RandomizedRunner$4.evaluate(RandomizedRunner.java:682)
	at com.carrotsearch.randomizedtesting.RandomizedRunner$5.evaluate(RandomizedRunner.java:693)
	at com.carrotsearch.randomizedtesting.rules.StatementAdapter.evaluate(StatementAdapter.java:36)
	at com.carrotsearch.randomizedtesting.rules.SystemPropertiesRestoreRule$1.evaluate(SystemPropertiesRestoreRule.java:53)
	at org.apache.lucene.util.AbstractBeforeAfterRule$1.evaluate(AbstractBeforeAfterRule.java:45)
	at org.apache.lucene.util.TestRuleStoreClassName$1.evaluate(TestRuleStoreClassName.java:42)
	at com.carrotsearch.randomizedtesting.rules.SystemPropertiesInvariantRule$1.evaluate(SystemPropertiesInvariantRule.java:55)
	at com.carrotsearch.randomizedtesting.rules.NoShadowingOrOverridesOnMethodsRule$1.evaluate(NoShadowingOrOverridesOnMethodsRule.java:39)
	at com.carrotsearch.randomizedtesting.rules.NoShadowingOrOverridesOnMethodsRule$1.evaluate(NoShadowingOrOverridesOnMethodsRule.java:39)
	at com.carrotsearch.randomizedtesting.rules.StatementAdapter.evaluate(StatementAdapter.java:36)
	at org.apache.lucene.util.TestRuleAssertionsRequired$1.evaluate(TestRuleAssertionsRequired.java:43)
	at org.apache.lucene.util.TestRuleMarkFailure$1.evaluate(TestRuleMarkFailure.java:48)
	at org.apache.lucene.util.TestRuleIgnoreAfterMaxFailures$1.evaluate(TestRuleIgnoreAfterMaxFailures.java:70)
	at org.apache.lucene.util.TestRuleIgnoreTestSuites$1.evaluate(TestRuleIgnoreTestSuites.java:55)
	at com.carrotsearch.randomizedtesting.rules.StatementAdapter.evaluate(StatementAdapter.java:36)
	at com.carrotsearch.randomizedtesting.ThreadLeakControl$StatementRunner.run(ThreadLeakControl.java:358)
	at java.lang.Thread.run(Thread.java:679)




Build Log:
[...truncated 3323 lines...]
      [mvn] 435 T3 oasc.SolrCore.finalize SEVERE REFCOUNT ERROR: unreferenced org.apache.solr.core.SolrCore@4076a247 (collection1) has a reference count of 1
      [mvn] 436 T3 oasc.CoreContainer.finalize SEVERE CoreContainer was not shutdown prior to finalize(), indicates a bug -- POSSIBLE RESOURCE LEAK!!!  instance=317963993
      [mvn] 664 T57 oasc.SolrCore.initIndex SEVERE [collection1] Solr index directory '/usr/home/hudson/hudson-slave/workspace/Lucene-Solr-Maven-4.x/maven-build/solr/core/src/test/target/test/./solrtest-SolrCoreCheckLockOnStartupTest-1347707299460/index/' is locked.  Throwing exception
      [mvn] Tests run: 2, Failures: 0, Errors: 0, Skipped: 0, Time elapsed: 0.688 sec
      [mvn] Running org.apache.solr.search.TestPseudoReturnFields
      [mvn] Creating dataDir: /usr/home/hudson/hudson-slave/workspace/Lucene-Solr-Maven-4.x/maven-build/solr/core/src/test/target/test/./solrtest-TestPseudoReturnFields-1347707299808
      [mvn] 65 T3 oasc.CoreContainer.finalize SEVERE CoreContainer was not shutdown prior to finalize(), indicates a bug -- POSSIBLE RESOURCE LEAK!!!  instance=1596238422
      [mvn] 65 T3 oasc.SolrCore.finalize SEVERE REFCOUNT ERROR: unreferenced org.apache.solr.core.SolrCore@602b24e6 (collection1) has a reference count of 1
      [mvn] Tests run: 13, Failures: 0, Errors: 0, Skipped: 0, Time elapsed: 0.645 sec
      [mvn] Running org.apache.solr.update.processor.StatelessScriptUpdateProcessorFactoryTest
      [mvn] Creating dataDir: /usr/home/hudson/hudson-slave/workspace/Lucene-Solr-Maven-4.x/maven-build/solr/core/src/test/target/test/./solrtest-StatelessScriptUpdateProcessorFactoryTest-1347707300553
      [mvn] Tests run: 7, Failures: 0, Errors: 0, Skipped: 0, Time elapsed: 1.037 sec
      [mvn] Running org.apache.solr.internal.csv.writer.CSVConfigGuesserTest
      [mvn] Tests run: 3, Failures: 0, Errors: 0, Skipped: 0, Time elapsed: 0.002 sec
      [mvn] Running org.apache.solr.handler.admin.SystemInfoHandlerTest
      [mvn] Tests run: 1, Failures: 0, Errors: 0, Skipped: 0, Time elapsed: 0.01 sec
      [mvn] Running org.apache.solr.util.TestUtils
      [mvn] Tests run: 3, Failures: 0, Errors: 0, Skipped: 0, Time elapsed: 0.015 sec
      [mvn] Running org.apache.solr.TestDocumentBuilder
      [mvn] doc1: SolrInputDocument[field1=value1, field2=value1, field3=value2, field4=15, field5=[45, 33, 20]]
      [mvn] clone: SolrInputDocument[field1=value1, field2=value1, field3=value2, field4=15, field5=[45, 33, 20]]
      [mvn] Tests run: 1, Failures: 0, Errors: 0, Skipped: 0, Time elapsed: 0.014 sec
      [mvn] Running org.apache.solr.search.TestSort
      [mvn] Creating dataDir: /usr/home/hudson/hudson-slave/workspace/Lucene-Solr-Maven-4.x/maven-build/solr/core/src/test/target/test/./solrtest-TestSort-1347707301535
      [mvn] Tests run: 2, Failures: 0, Errors: 0, Skipped: 0, Time elapsed: 3.645 sec
      [mvn] Running org.apache.solr.request.JSONWriterTest
      [mvn] Creating dataDir: /usr/home/hudson/hudson-slave/workspace/Lucene-Solr-Maven-4.x/maven-build/solr/core/src/test/target/test/./solrtest-JSONWriterTest-1347707305182
      [mvn] Tests run: 3, Failures: 0, Errors: 0, Skipped: 0, Time elapsed: 0.53 sec
      [mvn] Running org.apache.solr.update.SoftAutoCommitTest
      [mvn] Tests run: 3, Failures: 0, Errors: 0, Skipped: 0, Time elapsed: 9.181 sec
      [mvn] Running org.apache.solr.cloud.LeaderElectionTest
      [mvn] Creating dataDir: /usr/home/hudson/hudson-slave/workspace/Lucene-Solr-Maven-4.x/maven-build/solr/core/src/test/target/test/./solrtest-LeaderElectionTest-1347707314898
      [mvn] 1994 T140 oasc.SolrException.log SEVERE Failed setting watch:org.apache.zookeeper.KeeperException$NoNodeException: KeeperErrorCode = NoNode for /collections/collection1/leader_elect/shard1/election/88323346632278026-7-n_0000000002
      [mvn] 		at org.apache.zookeeper.KeeperException.create(KeeperException.java:102)
      [mvn] 		at org.apache.zookeeper.KeeperException.create(KeeperException.java:42)
      [mvn] 		at org.apache.zookeeper.ZooKeeper.getData(ZooKeeper.java:927)
      [mvn] 		at org.apache.solr.common.cloud.SolrZkClient$7.execute(SolrZkClient.java:301)
      [mvn] 		at org.apache.solr.common.cloud.SolrZkClient$7.execute(SolrZkClient.java:298)
      [mvn] 		at org.apache.solr.common.cloud.ZkCmdExecutor.retryOperation(ZkCmdExecutor.java:67)
      [mvn] 		at org.apache.solr.common.cloud.SolrZkClient.getData(SolrZkClient.java:298)
      [mvn] 		at org.apache.solr.cloud.LeaderElector.checkIfIamLeader(LeaderElector.java:119)
      [mvn] 		at org.apache.solr.cloud.LeaderElector.access$000(LeaderElector.java:56)
      [mvn] 		at org.apache.solr.cloud.LeaderElector$1.process(LeaderElector.java:131)
      [mvn] 		at org.apache.zookeeper.ClientCnxn$EventThread.processEvent(ClientCnxn.java:526)
      [mvn] 		at org.apache.zookeeper.ClientCnxn$EventThread.run(ClientCnxn.java:502)
      [mvn] 	
      [mvn] 2526 T146 oasc.SolrException.log SEVERE Failed setting watch:org.apache.zookeeper.KeeperException$NoNodeException: KeeperErrorCode = NoNode for /collections/collection1/leader_elect/shard1/election/88323346632278029-10-n_0000000009
      [mvn] 		at org.apache.zookeeper.KeeperException.create(KeeperException.java:102)
      [mvn] 		at org.apache.zookeeper.KeeperException.create(KeeperException.java:42)
      [mvn] 		at org.apache.zookeeper.ZooKeeper.getData(ZooKeeper.java:927)
      [mvn] 		at org.apache.solr.common.cloud.SolrZkClient$7.execute(SolrZkClient.java:301)
      [mvn] 		at org.apache.solr.common.cloud.SolrZkClient$7.execute(SolrZkClient.java:298)
      [mvn] 		at org.apache.solr.common.cloud.ZkCmdExecutor.retryOperation(ZkCmdExecutor.java:67)
      [mvn] 		at org.apache.solr.common.cloud.SolrZkClient.getData(SolrZkClient.java:298)
      [mvn] 		at org.apache.solr.cloud.LeaderElector.checkIfIamLeader(LeaderElector.java:119)
      [mvn] 		at org.apache.solr.cloud.LeaderElector.access$000(LeaderElector.java:56)
      [mvn] 		at org.apache.solr.cloud.LeaderElector$1.process(LeaderElector.java:131)
      [mvn] 		at org.apache.zookeeper.ClientCnxn$EventThread.processEvent(ClientCnxn.java:526)
      [mvn] 		at org.apache.zookeeper.ClientCnxn$EventThread.run(ClientCnxn.java:502)
      [mvn] 	
      [mvn] 5214 T177 oasc.LeaderElectionTest$ClientThread.run SEVERE setup failed org.apache.zookeeper.KeeperException$SessionExpiredException: KeeperErrorCode = Session expired for /collections/collection1/leader_elect/shard1/election
      [mvn] 	at org.apache.zookeeper.KeeperException.create(KeeperException.java:118)
      [mvn] 	at org.apache.zookeeper.KeeperException.create(KeeperException.java:42)
      [mvn] 	at org.apache.zookeeper.ZooKeeper.exists(ZooKeeper.java:815)
      [mvn] 	at org.apache.solr.common.cloud.SolrZkClient$4.execute(SolrZkClient.java:232)
      [mvn] 	at org.apache.solr.common.cloud.SolrZkClient$4.execute(SolrZkClient.java:229)
      [mvn] 	at org.apache.solr.common.cloud.ZkCmdExecutor.retryOperation(ZkCmdExecutor.java:67)
      [mvn] 	at org.apache.solr.common.cloud.SolrZkClient.exists(SolrZkClient.java:229)
      [mvn] 	at org.apache.solr.common.cloud.ZkCmdExecutor.ensureExists(ZkCmdExecutor.java:94)
      [mvn] 	at org.apache.solr.common.cloud.ZkCmdExecutor.ensureExists(ZkCmdExecutor.java:88)
      [mvn] 	at org.apache.solr.cloud.LeaderElector.setup(LeaderElector.java:291)
      [mvn] 	at org.apache.solr.cloud.LeaderElectionTest$ClientThread.setupOnConnect(LeaderElectionTest.java:116)
      [mvn] 	at org.apache.solr.cloud.LeaderElectionTest$ClientThread.run(LeaderElectionTest.java:125)
      [mvn] 	at java.util.concurrent.Executors$RunnableAdapter.call(Executors.java:471)
      [mvn] 	at java.util.concurrent.FutureTask$Sync.innerRun(FutureTask.java:334)
      [mvn] 	at java.util.concurrent.FutureTask.run(FutureTask.java:166)
      [mvn] 	at java.util.concurrent.ScheduledThreadPoolExecutor$ScheduledFutureTask.access$101(ScheduledThreadPoolExecutor.java:165)
      [mvn] 	at java.util.concurrent.ScheduledThreadPoolExecutor$ScheduledFutureTask.run(ScheduledThreadPoolExecutor.java:266)
      [mvn] 	at java.util.concurrent.ThreadPoolExecutor.runWorker(ThreadPoolExecutor.java:1110)
      [mvn] 	at java.util.concurrent.ThreadPoolExecutor$Worker.run(ThreadPoolExecutor.java:603)
      [mvn] 	at java.lang.Thread.run(Thread.java:679)
      [mvn] 
      [mvn] 5379 T189 oasc.LeaderElectionTest$ClientThread.run SEVERE setup failed org.apache.zookeeper.KeeperException$SessionExpiredException: KeeperErrorCode = Session expired for /collections/collection1/leader_elect/shard1/election
      [mvn] 	at org.apache.zookeeper.KeeperException.create(KeeperException.java:118)
      [mvn] 	at org.apache.zookeeper.KeeperException.create(KeeperException.java:42)
      [mvn] 	at org.apache.zookeeper.ZooKeeper.exists(ZooKeeper.java:815)
      [mvn] 	at org.apache.solr.common.cloud.SolrZkClient$4.execute(SolrZkClient.java:232)
      [mvn] 	at org.apache.solr.common.cloud.SolrZkClient$4.execute(SolrZkClient.java:229)
      [mvn] 	at org.apache.solr.common.cloud.ZkCmdExecutor.retryOperation(ZkCmdExecutor.java:67)
      [mvn] 	at org.apache.solr.common.cloud.SolrZkClient.exists(SolrZkClient.java:229)
      [mvn] 	at org.apache.solr.common.cloud.ZkCmdExecutor.ensureExists(ZkCmdExecutor.java:94)
      [mvn] 	at org.apache.solr.common.cloud.ZkCmdExecutor.ensureExists(ZkCmdExecutor.java:88)
      [mvn] 	at org.apache.solr.cloud.LeaderElector.setup(LeaderElector.java:291)
      [mvn] 	at org.apache.solr.cloud.LeaderElectionTest$ClientThread.setupOnConnect(LeaderElectionTest.java:116)
      [mvn] 	at org.apache.solr.cloud.LeaderElectionTest$ClientThread.run(LeaderElectionTest.java:125)
      [mvn] 	at java.util.concurrent.Executors$RunnableAdapter.call(Executors.java:471)
      [mvn] 	at java.util.concurrent.FutureTask$Sync.innerRun(FutureTask.java:334)
      [mvn] 	at java.util.concurrent.FutureTask.run(FutureTask.java:166)
      [mvn] 	at java.util.concurrent.ScheduledThreadPoolExecutor$ScheduledFutureTask.access$101(ScheduledThreadPoolExecutor.java:165)
      [mvn] 	at java.util.concurrent.ScheduledThreadPoolExecutor$ScheduledFutureTask.run(ScheduledThreadPoolExecutor.java:266)
      [mvn] 	at java.util.concurrent.ThreadPoolExecutor.runWorker(ThreadPoolExecutor.java:1110)
      [mvn] 	at java.util.concurrent.ThreadPoolExecutor$Worker.run(ThreadPoolExecutor.java:603)
      [mvn] 	at java.lang.Thread.run(Thread.java:679)
      [mvn] 
      [mvn] 5471 T189 oasc.LeaderElectionTest$ClientThread.run SEVERE setup failed org.apache.zookeeper.KeeperException$SessionExpiredException: KeeperErrorCode = Session expired for /collections/collection1/leader_elect/shard1/election
      [mvn] 	at org.apache.zookeeper.KeeperException.create(KeeperException.java:118)
      [mvn] 	at org.apache.zookeeper.KeeperException.create(KeeperException.java:42)
      [mvn] 	at org.apache.zookeeper.ZooKeeper.exists(ZooKeeper.java:815)
      [mvn] 	at org.apache.solr.common.cloud.SolrZkClient$4.execute(SolrZkClient.java:232)
      [mvn] 	at org.apache.solr.common.cloud.SolrZkClient$4.execute(SolrZkClient.java:229)
      [mvn] 	at org.apache.solr.common.cloud.ZkCmdExecutor.retryOperation(ZkCmdExecutor.java:67)
      [mvn] 	at org.apache.solr.common.cloud.SolrZkClient.exists(SolrZkClient.java:229)
      [mvn] 	at org.apache.solr.common.cloud.ZkCmdExecutor.ensureExists(ZkCmdExecutor.java:94)
      [mvn] 	at org.apache.solr.common.cloud.ZkCmdExecutor.ensureExists(ZkCmdExecutor.java:88)
      [mvn] 	at org.apache.solr.cloud.LeaderElector.setup(LeaderElector.java:291)
      [mvn] 	at org.apache.solr.cloud.LeaderElectionTest$ClientThread.setupOnConnect(LeaderElectionTest.java:116)
      [mvn] 	at org.apache.solr.cloud.LeaderElectionTest$ClientThread.run(LeaderElectionTest.java:125)
      [mvn] 	at java.util.concurrent.Executors$RunnableAdapter.call(Executors.java:471)
      [mvn] 	at java.util.concurrent.FutureTask$Sync.innerRun(FutureTask.java:334)
      [mvn] 	at java.util.concurrent.FutureTask.run(FutureTask.java:166)
      [mvn] 	at java.util.concurrent.ScheduledThreadPoolExecutor$ScheduledFutureTask.access$101(ScheduledThreadPoolExecutor.java:165)
      [mvn] 	at java.util.concurrent.ScheduledThreadPoolExecutor$ScheduledFutureTask.run(ScheduledThreadPoolExecutor.java:266)
      [mvn] 	at java.util.concurrent.ThreadPoolExecutor.runWorker(ThreadPoolExecutor.java:1110)
      [mvn] 	at java.util.concurrent.ThreadPoolExecutor$Worker.run(ThreadPoolExecutor.java:603)
      [mvn] 	at java.lang.Thread.run(Thread.java:679)
      [mvn] 
      [mvn] Tests run: 4, Failures: 0, Errors: 0, Skipped: 0, Time elapsed: 13.193 sec
      [mvn] Running org.apache.solr.handler.component.TermVectorComponentDistributedTest
      [mvn] Tests run: 1, Failures: 0, Errors: 0, Skipped: 0, Time elapsed: 7.716 sec
      [mvn] Running org.apache.solr.highlight.HighlighterTest
      [mvn] Creating dataDir: /usr/home/hudson/hudson-slave/workspace/Lucene-Solr-Maven-4.x/maven-build/solr/core/src/test/target/test/./solrtest-HighlighterTest-1347707335807
      [mvn] Tests run: 27, Failures: 0, Errors: 0, Skipped: 0, Time elapsed: 1.506 sec
      [mvn] Running org.apache.solr.search.TestStressVersions
      [mvn] Creating dataDir: /usr/home/hudson/hudson-slave/workspace/Lucene-Solr-Maven-4.x/maven-build/solr/core/src/test/target/test/./solrtest-TestStressVersions-1347707337315
      [mvn] Tests run: 1, Failures: 0, Errors: 0, Skipped: 0, Time elapsed: 5.211 sec
      [mvn] Running org.apache.solr.handler.admin.LoggingHandlerTest
      [mvn] Creating dataDir: /usr/home/hudson/hudson-slave/workspace/Lucene-Solr-Maven-4.x/maven-build/solr/core/src/test/target/test/./solrtest-LoggingHandlerTest-1347707342529
      [mvn] Tests run: 1, Failures: 0, Errors: 0, Skipped: 0, Time elapsed: 0.608 sec
      [mvn] Running org.apache.solr.update.AutoCommitTest
      [mvn] 8701 T400 oasc.SolrException.log SEVERE java.lang.InterruptedException
      [mvn] 		at java.util.concurrent.locks.AbstractQueuedSynchronizer.doAcquireSharedInterruptibly(AbstractQueuedSynchronizer.java:1000)
      [mvn] 		at java.util.concurrent.locks.AbstractQueuedSynchronizer.acquireSharedInterruptibly(AbstractQueuedSynchronizer.java:1304)
      [mvn] 		at java.util.concurrent.FutureTask$Sync.innerGet(FutureTask.java:248)
      [mvn] 		at java.util.concurrent.FutureTask.get(FutureTask.java:111)
      [mvn] 		at org.apache.solr.update.DirectUpdateHandler2.commit(DirectUpdateHandler2.java:599)
      [mvn] 		at org.apache.solr.update.CommitTracker.run(CommitTracker.java:215)
      [mvn] 		at java.util.concurrent.Executors$RunnableAdapter.call(Executors.java:471)
      [mvn] 		at java.util.concurrent.FutureTask$Sync.innerRun(FutureTask.java:334)
      [mvn] 		at java.util.concurrent.FutureTask.run(FutureTask.java:166)
      [mvn] 		at java.util.concurrent.ScheduledThreadPoolExecutor$ScheduledFutureTask.access$101(ScheduledThreadPoolExecutor.java:165)
      [mvn] 		at java.util.concurrent.ScheduledThreadPoolExecutor$ScheduledFutureTask.run(ScheduledThreadPoolExecutor.java:266)
      [mvn] 		at java.util.concurrent.ThreadPoolExecutor.runWorker(ThreadPoolExecutor.java:1110)
      [mvn] 		at java.util.concurrent.ThreadPoolExecutor$Worker.run(ThreadPoolExecutor.java:603)
      [mvn] 		at java.lang.Thread.run(Thread.java:679)
      [mvn] 	
      [mvn] Tests run: 3, Failures: 0, Errors: 0, Skipped: 0, Time elapsed: 8.124 sec
      [mvn] Running org.apache.solr.analysis.LegacyHTMLStripCharFilterTest
      [mvn] Tests run: 13, Failures: 0, Errors: 0, Skipped: 1, Time elapsed: 0.269 sec
      [mvn] Running org.apache.solr.search.similarities.TestDefaultSimilarityFactory
      [mvn] Creating dataDir: /usr/home/hudson/hudson-slave/workspace/Lucene-Solr-Maven-4.x/maven-build/solr/core/src/test/target/test/./solrtest-TestDefaultSimilarityFactory-1347707351568
      [mvn] Tests run: 2, Failures: 0, Errors: 0, Skipped: 0, Time elapsed: 0.147 sec
      [mvn] Running org.apache.solr.schema.NumericFieldsTest
      [mvn] Creating dataDir: /usr/home/hudson/hudson-slave/workspace/Lucene-Solr-Maven-4.x/maven-build/solr/core/src/test/target/test/./solrtest-NumericFieldsTest-1347707351716
      [mvn] Tests run: 1, Failures: 0, Errors: 0, Skipped: 0, Time elapsed: 0.352 sec
      [mvn] Running org.apache.solr.cloud.ZkNodePropsTest
      [mvn] Tests run: 1, Failures: 0, Errors: 0, Skipped: 0, Time elapsed: 0.02 sec
      [mvn] Running org.apache.solr.internal.csv.ExtendedBufferedReaderTest
      [mvn] Tests run: 8, Failures: 0, Errors: 0, Skipped: 0, Time elapsed: 0.002 sec
      [mvn] Running org.apache.solr.spelling.IndexBasedSpellCheckerTest
      [mvn] Creating dataDir: /usr/home/hudson/hudson-slave/workspace/Lucene-Solr-Maven-4.x/maven-build/solr/core/src/test/target/test/./solrtest-IndexBasedSpellCheckerTest-1347707352055
      [mvn] Tests run: 5, Failures: 0, Errors: 0, Skipped: 0, Time elapsed: 0.813 sec
      [mvn] Running org.apache.solr.search.TestDocSet
      [mvn] Tests run: 2, Failures: 0, Errors: 0, Skipped: 0, Time elapsed: 0.646 sec
      [mvn] Running org.apache.solr.schema.UUIDFieldTest
      [mvn] Tests run: 1, Failures: 0, Errors: 0, Skipped: 0, Time elapsed: 0.014 sec
      [mvn] Running org.apache.solr.ConvertedLegacyTest
      [mvn] Creating dataDir: /usr/home/hudson/hudson-slave/workspace/Lucene-Solr-Maven-4.x/maven-build/solr/core/src/test/target/test/./solrtest-ConvertedLegacyTest-1347707353526
      [mvn] Tests run: 1, Failures: 0, Errors: 0, Skipped: 0, Time elapsed: 2.273 sec
      [mvn] Running org.apache.solr.core.TestMergePolicyConfig
      [mvn] Creating dataDir: /usr/home/hudson/hudson-slave/workspace/Lucene-Solr-Maven-4.x/maven-build/solr/core/src/test/target/test/./solrtest-TestMergePolicyConfig-1347707355800
      [mvn] Tests run: 1, Failures: 0, Errors: 0, Skipped: 0, Time elapsed: 0.397 sec
      [mvn] Running org.apache.solr.search.QueryEqualityTest
      [mvn] Creating dataDir: /usr/home/hudson/hudson-slave/workspace/Lucene-Solr-Maven-4.x/maven-build/solr/core/src/test/target/test/./solrtest-QueryEqualityTest-1347707356202
      [mvn] Tests run: 60, Failures: 0, Errors: 0, Skipped: 0, Time elapsed: 0.732 sec
      [mvn] Running org.apache.solr.search.TestStressReorder
      [mvn] Creating dataDir: /usr/home/hudson/hudson-slave/workspace/Lucene-Solr-Maven-4.x/maven-build/solr/core/src/test/target/test/./solrtest-TestStressReorder-1347707356933
      [mvn] Tests run: 1, Failures: 0, Errors: 0, Skipped: 0, Time elapsed: 2.85 sec
      [mvn] Running org.apache.solr.update.processor.SignatureUpdateProcessorFactoryTest
      [mvn] Creating dataDir: /usr/home/hudson/hudson-slave/workspace/Lucene-Solr-Maven-4.x/maven-build/solr/core/src/test/target/test/./solrtest-SignatureUpdateProcessorFactoryTest-1347707359786
      [mvn] Tests run: 6, Failures: 0, Errors: 0, Skipped: 0, Time elapsed: 0.918 sec
      [mvn] Running org.apache.solr.search.TestValueSourceCache
      [mvn] Creating dataDir: /usr/home/hudson/hudson-slave/workspace/Lucene-Solr-Maven-4.x/maven-build/solr/core/src/test/target/test/./solrtest-TestValueSourceCache-1347707360698
      [mvn] Tests run: 2, Failures: 0, Errors: 0, Skipped: 0, Time elapsed: 0.443 sec
      [mvn] Running org.apache.solr.internal.csv.CSVPrinterTest
      [mvn] Tests run: 6, Failures: 0, Errors: 0, Skipped: 0, Time elapsed: 0.364 sec
      [mvn] Running org.apache.solr.update.SolrIndexConfigTest
      [mvn] Tests run: 2, Failures: 0, Errors: 0, Skipped: 0, Time elapsed: 0.299 sec
      [mvn] Running org.apache.solr.cloud.ZkSolrClientTest
      [mvn] Tests run: 4, Failures: 0, Errors: 0, Skipped: 0, Time elapsed: 8.564 sec
      [mvn] Running org.apache.solr.handler.MoreLikeThisHandlerTest
      [mvn] Creating dataDir: /usr/home/hudson/hudson-slave/workspace/Lucene-Solr-Maven-4.x/maven-build/solr/core/src/test/target/test/./solrtest-MoreLikeThisHandlerTest-1347707370375
      [mvn] Tests run: 1, Failures: 0, Errors: 0, Skipped: 0, Time elapsed: 0.564 sec
      [mvn] Running org.apache.solr.schema.OpenExchangeRatesOrgProviderTest
      [mvn] Tests run: 5, Failures: 0, Errors: 0, Skipped: 0, Time elapsed: 0.067 sec
      [mvn] Running org.apache.solr.search.similarities.TestLMJelinekMercerSimilarityFactory
      [mvn] Creating dataDir: /usr/home/hudson/hudson-slave/workspace/Lucene-Solr-Maven-4.x/maven-build/solr/core/src/test/target/test/./solrtest-TestLMJelinekMercerSimilarityFactory-1347707371008
      [mvn] Tests run: 2, Failures: 0, Errors: 0, Skipped: 0, Time elapsed: 0.099 sec
      [mvn] Running org.apache.solr.core.SolrCoreTest
      [mvn] Creating dataDir: /usr/home/hudson/hudson-slave/workspace/Lucene-Solr-Maven-4.x/maven-build/solr/core/src/test/target/test/./solrtest-SolrCoreTest-1347707371112
      [mvn] Creating dataDir: /usr/home/hudson/hudson-slave/workspace/Lucene-Solr-Maven-4.x/maven-build/solr/core/src/test/target/test/./solrtest-SolrCoreTest-1347707371607
      [mvn] Creating dataDir: /usr/home/hudson/hudson-slave/workspace/Lucene-Solr-Maven-4.x/maven-build/solr/core/src/test/target/test/./solrtest-SolrCoreTest-1347707372089
      [mvn] Creating dataDir: /usr/home/hudson/hudson-slave/workspace/Lucene-Solr-Maven-4.x/maven-build/solr/core/src/test/target/test/./solrtest-SolrCoreTest-1347707372687
      [mvn] Creating dataDir: /usr/home/hudson/hudson-slave/workspace/Lucene-Solr-Maven-4.x/maven-build/solr/core/src/test/target/test/./solrtest-SolrCoreTest-1347707373149
      [mvn] Creating dataDir: /usr/home/hudson/hudson-slave/workspace/Lucene-Solr-Maven-4.x/maven-build/solr/core/src/test/target/test/./solrtest-SolrCoreTest-1347707373559
      [mvn] Tests run: 6, Failures: 0, Errors: 0, Skipped: 0, Time elapsed: 3.87 sec
      [mvn] Running org.apache.solr.handler.component.DistributedTermsComponentTest
      [mvn] Tests run: 1, Failures: 0, Errors: 0, Skipped: 0, Time elapsed: 5.343 sec
      [mvn] Running org.apache.solr.core.PluginInfoTest
      [mvn] Tests run: 9, Failures: 0, Errors: 0, Skipped: 0, Time elapsed: 0.05 sec
      [mvn] Running org.apache.solr.EchoParamsTest
      [mvn] Creating dataDir: /usr/home/hudson/hudson-slave/workspace/Lucene-Solr-Maven-4.x/maven-build/solr/core/src/test/target/test/./solrtest-EchoParamsTest-1347707380377
      [mvn] Tests run: 1, Failures: 0, Errors: 0, Skipped: 0, Time elapsed: 0.142 sec
      [mvn] Running org.apache.solr.util.TestFastOutputStream
      [mvn] Tests run: 1, Failures: 0, Errors: 0, Skipped: 0, Time elapsed: 0.438 sec
      [mvn] Running org.apache.solr.core.TestXIncludeConfig
      [mvn] Tests run: 1, Failures: 0, Errors: 0, Skipped: 0, Time elapsed: 0.418 sec
      [mvn] Running org.apache.solr.spelling.suggest.TestPhraseSuggestions
      [mvn] Creating dataDir: /usr/home/hudson/hudson-slave/workspace/Lucene-Solr-Maven-4.x/maven-build/solr/core/src/test/target/test/./solrtest-TestPhraseSuggestions-1347707381376
      [mvn] Tests run: 1, Failures: 0, Errors: 0, Skipped: 0, Time elapsed: 0.1 sec
      [mvn] Running org.apache.solr.core.ResourceLoaderTest
      [mvn] Tests run: 4, Failures: 0, Errors: 0, Skipped: 0, Time elapsed: 0.047 sec
      [mvn] Running org.apache.solr.handler.component.QueryElevationComponentTest
      [mvn] Creating dataDir: /usr/home/hudson/hudson-slave/workspace/Lucene-Solr-Maven-4.x/maven-build/solr/core/src/test/target/test/./solrtest-QueryElevationComponentTest-1347707381529
      [mvn] Creating dataDir: /usr/home/hudson/hudson-slave/workspace/Lucene-Solr-Maven-4.x/maven-build/solr/core/src/test/target/test/./solrtest-QueryElevationComponentTest-1347707381938
      [mvn] Creating dataDir: /usr/home/hudson/hudson-slave/workspace/Lucene-Solr-Maven-4.x/maven-build/solr/core/src/test/target/test/./solrtest-QueryElevationComponentTest-1347707382280
      [mvn] Creating dataDir: /usr/home/hudson/hudson-slave/workspace/Lucene-Solr-Maven-4.x/maven-build/solr/core/src/test/target/test/./solrtest-QueryElevationComponentTest-1347707382647
      [mvn] Creating dataDir: /usr/home/hudson/hudson-slave/workspace/Lucene-Solr-Maven-4.x/maven-build/solr/core/src/test/target/test/./solrtest-QueryElevationComponentTest-1347707382991
      [mvn] Creating dataDir: /usr/home/hudson/hudson-slave/workspace/Lucene-Solr-Maven-4.x/maven-build/solr/core/src/test/target/test/./solrtest-QueryElevationComponentTest-1347707383401
      [mvn] Creating dataDir: /usr/home/hudson/hudson-slave/workspace/Lucene-Solr-Maven-4.x/maven-build/solr/core/src/test/target/test/./solrtest-QueryElevationComponentTest-1347707383685
      [mvn] Tests run: 7, Failures: 0, Errors: 0, Skipped: 0, Time elapsed: 2.366 sec
      [mvn] Running org.apache.solr.update.processor.ScriptEngineTest
      [mvn] Tests run: 6, Failures: 0, Errors: 0, Skipped: 1, Time elapsed: 0.075 sec
      [mvn] Running org.apache.solr.search.TestLFUCache
      [mvn] Creating dataDir: /usr/home/hudson/hudson-slave/workspace/Lucene-Solr-Maven-4.x/maven-build/solr/core/src/test/target/test/./solrtest-TestLFUCache-1347707383969
      [mvn] {39=39, 38=38, 37=37, 36=36, 35=35, 34=34, 33=33, 32=32, 31=31, 30=30}
      [mvn] Tests run: 5, Failures: 0, Errors: 0, Skipped: 0, Time elapsed: 0.387 sec
      [mvn] Running org.apache.solr.schema.CurrencyFieldTest
      [mvn] Creating dataDir: /usr/home/hudson/hudson-slave/workspace/Lucene-Solr-Maven-4.x/maven-build/solr/core/src/test/target/test/./solrtest-CurrencyFieldTest-1347707384364
      [mvn] Tests run: 8, Failures: 0, Errors: 0, Skipped: 1, Time elapsed: 0.713 sec
      [mvn] Running org.apache.solr.schema.IndexSchemaRuntimeFieldTest
      [mvn] Creating dataDir: /usr/home/hudson/hudson-slave/workspace/Lucene-Solr-Maven-4.x/maven-build/solr/core/src/test/target/test/./solrtest-IndexSchemaRuntimeFieldTest-1347707385071
      [mvn] Tests run: 1, Failures: 0, Errors: 0, Skipped: 0, Time elapsed: 0.551 sec
      [mvn] Running org.apache.solr.spelling.suggest.SuggesterTest
      [mvn] Creating dataDir: /usr/home/hudson/hudson-slave/workspace/Lucene-Solr-Maven-4.x/maven-build/solr/core/src/test/target/test/./solrtest-SuggesterTest-1347707385625
      [mvn] NOTE: per solr.test.leavedatadir, dataDir will not be removed: /usr/home/hudson/hudson-slave/workspace/Lucene-Solr-Maven-4.x/maven-build/solr/core/src/test/target/test/./solrtest-SuggesterTest-1347707385625
      [mvn] Tests run: 4, Failures: 0, Errors: 0, Skipped: 0, Time elapsed: 0.954 sec
      [mvn] Running org.apache.solr.search.TestExtendedDismaxParser
      [mvn] Tests run: 10, Failures: 0, Errors: 0, Skipped: 0, Time elapsed: 5.181 sec
      [mvn] Running org.apache.solr.search.TestStressLucene
      [mvn] Tests run: 1, Failures: 0, Errors: 0, Skipped: 0, Time elapsed: 3.144 sec
      [mvn] Running org.apache.solr.util.DOMUtilTest
      [mvn] Tests run: 1, Failures: 0, Errors: 0, Skipped: 0, Time elapsed: 0.018 sec
      [mvn] Running org.apache.solr.handler.CSVRequestHandlerTest
      [mvn] Creating dataDir: /usr/home/hudson/hudson-slave/workspace/Lucene-Solr-Maven-4.x/maven-build/solr/core/src/test/target/test/./solrtest-CSVRequestHandlerTest-1347707394922
      [mvn] Tests run: 1, Failures: 0, Errors: 0, Skipped: 0, Time elapsed: 0.396 sec
      [mvn] Running org.apache.solr.handler.admin.ShowFileRequestHandlerTest
      [mvn] Creating dataDir: /usr/home/hudson/hudson-slave/workspace/Lucene-Solr-Maven-4.x/maven-build/solr/core/src/test/target/test/./solrtest-ShowFileRequestHandlerTest-1347707395320
      [mvn] Tests run: 2, Failures: 0, Errors: 0, Skipped: 0, Time elapsed: 0.807 sec
      [mvn] Running org.apache.solr.analysis.TestCharFilters
      [mvn] Creating dataDir: /usr/home/hudson/hudson-slave/workspace/Lucene-Solr-Maven-4.x/maven-build/solr/core/src/test/target/test/./solrtest-TestCharFilters-1347707396130
      [mvn] Tests run: 2, Failures: 0, Errors: 0, Skipped: 0, Time elapsed: 0.132 sec
      [mvn] Running org.apache.solr.servlet.CacheHeaderTest
      [mvn] Creating dataDir: /usr/home/hudson/hudson-slave/workspace/Lucene-Solr-Maven-4.x/maven-build/solr/core/src/test/target/test/./solrtest-CacheHeaderTest-1347707396263
      [mvn] Tests run: 5, Failures: 0, Errors: 0, Skipped: 0, Time elapsed: 0.702 sec
      [mvn] Running org.apache.solr.search.TestRangeQuery
      [mvn] Creating dataDir: /usr/home/hudson/hudson-slave/workspace/Lucene-Solr-Maven-4.x/maven-build/solr/core/src/test/target/test/./solrtest-TestRangeQuery-1347707396968
      [mvn] Tests run: 2, Failures: 0, Errors: 0, Skipped: 0, Time elapsed: 2.655 sec
      [mvn] Running org.apache.solr.core.RequestHandlersTest
      [mvn] Creating dataDir: /usr/home/hudson/hudson-slave/workspace/Lucene-Solr-Maven-4.x/maven-build/solr/core/src/test/target/test/./solrtest-RequestHandlersTest-1347707399617
      [mvn] Tests run: 3, Failures: 0, Errors: 0, Skipped: 0, Time elapsed: 0.421 sec
      [mvn] Running org.apache.solr.spelling.suggest.SuggesterFSTTest
      [mvn] Creating dataDir: /usr/home/hudson/hudson-slave/workspace/Lucene-Solr-Maven-4.x/maven-build/solr/core/src/test/target/test/./solrtest-SuggesterFSTTest-1347707400038
      [mvn] NOTE: per solr.test.leavedatadir, dataDir will not be removed: /usr/home/hudson/hudson-slave/workspace/Lucene-Solr-Maven-4.x/maven-build/solr/core/src/test/target/test/./solrtest-SuggesterFSTTest-1347707400038
      [mvn] Tests run: 4, Failures: 0, Errors: 0, Skipped: 0, Time elapsed: 0.742 sec
      [mvn] Running org.apache.solr.util.SolrPluginUtilsTest
      [mvn] Creating dataDir: /usr/home/hudson/hudson-slave/workspace/Lucene-Solr-Maven-4.x/maven-build/solr/core/src/test/target/test/./solrtest-SolrPluginUtilsTest-1347707400783
      [mvn] Tests run: 7, Failures: 0, Errors: 0, Skipped: 0, Time elapsed: 0.377 sec
      [mvn] Running org.apache.solr.cloud.RecoveryZkTest
      [mvn] Creating dataDir: /usr/home/hudson/hudson-slave/workspace/Lucene-Solr-Maven-4.x/maven-build/solr/core/src/test/target/test/./solrtest-RecoveryZkTest-1347707401176
      [mvn] ASYNC  NEW_CORE C0 name=collection1 org.apache.solr.core.SolrCore@41755a16 url=http://127.0.0.1:41344/solr/collection1 node=127.0.0.1:41344_solr
      [mvn] 9003 T833 C0 P41344 oasc.SolrException.log SEVERE shard update error StdNode: http://127.0.0.1:64148/solr/collection1/:org.apache.solr.client.solrj.SolrServerException: IOException occured when talking to server at: http://127.0.0.1:64148/solr/collection1
      [mvn] 		at org.apache.solr.client.solrj.impl.HttpSolrServer.request(HttpSolrServer.java:414)
      [mvn] 		at org.apache.solr.client.solrj.impl.HttpSolrServer.request(HttpSolrServer.java:182)
      [mvn] 		at org.apache.solr.update.SolrCmdDistributor$1.call(SolrCmdDistributor.java:335)
      [mvn] 		at org.apache.solr.update.SolrCmdDistributor$1.call(SolrCmdDistributor.java:309)
      [mvn] 		at java.util.concurrent.FutureTask$Sync.innerRun(FutureTask.java:334)
      [mvn] 		at java.util.concurrent.FutureTask.run(FutureTask.java:166)
      [mvn] 		at java.util.concurrent.Executors$RunnableAdapter.call(Executors.java:471)
      [mvn] 		at java.util.concurrent.FutureTask$Sync.innerRun(FutureTask.java:334)
      [mvn] 		at java.util.concurrent.FutureTask.run(FutureTask.java:166)
      [mvn] 		at java.util.concurrent.ThreadPoolExecutor.runWorker(ThreadPoolExecutor.java:1110)
      [mvn] 		at java.util.concurrent.ThreadPoolExecutor$Worker.run(ThreadPoolExecutor.java:603)
      [mvn] 		at java.lang.Thread.run(Thread.java:679)
      [mvn] 	Caused by: org.apache.http.NoHttpResponseException: The target server failed to respond
      [mvn] 		at org.apache.http.impl.conn.DefaultResponseParser.parseHead(DefaultResponseParser.java:101)
      [mvn] 		at org.apache.http.impl.io.AbstractMessageParser.parse(AbstractMessageParser.java:252)
      [mvn] 		at org.apache.http.impl.AbstractHttpClientConnection.receiveResponseHeader(AbstractHttpClientConnection.java:282)
      [mvn] 		at org.apache.http.impl.conn.DefaultClientConnection.receiveResponseHeader(DefaultClientConnection.java:247)
      [mvn] 		at org.apache.http.impl.conn.AbstractClientConnAdapter.receiveResponseHeader(AbstractClientConnAdapter.java:216)
      [mvn] 		at org.apache.http.protocol.HttpRequestExecutor.doReceiveResponse(HttpRequestExecutor.java:298)
      [mvn] 		at org.apache.http.protocol.HttpRequestExecutor.execute(HttpRequestExecutor.java:125)
      [mvn] 		at org.apache.http.impl.client.DefaultRequestDirector.tryExecute(DefaultRequestDirector.java:647)
      [mvn] 		at org.apache.http.impl.client.DefaultRequestDirector.execute(DefaultRequestDirector.java:464)
      [mvn] 		at org.apache.http.impl.client.AbstractHttpClient.execute(AbstractHttpClient.java:820)
      [mvn] 		at org.apache.http.impl.client.AbstractHttpClient.execute(AbstractHttpClient.java:754)
      [mvn] 		at org.apache.http.impl.client.AbstractHttpClient.execute(AbstractHttpClient.java:732)
      [mvn] 		at org.apache.solr.client.solrj.impl.HttpSolrServer.request(HttpSolrServer.java:353)
      [mvn] 		... 11 more
      [mvn] 	
      [mvn] 9003 T834 C0 P41344 oasc.SolrException.log SEVERE shard update error StdNode: http://127.0.0.1:64148/solr/collection1/:org.apache.solr.client.solrj.SolrServerException: IOException occured when talking to server at: http://127.0.0.1:64148/solr/collection1
      [mvn] 		at org.apache.solr.client.solrj.impl.HttpSolrServer.request(HttpSolrServer.java:414)
      [mvn] 		at org.apache.solr.client.solrj.impl.HttpSolrServer.request(HttpSolrServer.java:182)
      [mvn] 		at org.apache.solr.update.SolrCmdDistributor$1.call(SolrCmdDistributor.java:335)
      [mvn] 		at org.apache.solr.update.SolrCmdDistributor$1.call(SolrCmdDistributor.java:309)
      [mvn] 		at java.util.concurrent.FutureTask$Sync.innerRun(FutureTask.java:334)
      [mvn] 		at java.util.concurrent.FutureTask.run(FutureTask.java:166)
      [mvn] 		at java.util.concurrent.Executors$RunnableAdapter.call(Executors.java:471)
      [mvn] 		at java.util.concurrent.FutureTask$Sync.innerRun(FutureTask.java:334)
      [mvn] 		at java.util.concurrent.FutureTask.run(FutureTask.java:166)
      [mvn] 		at java.util.concurrent.ThreadPoolExecutor.runWorker(ThreadPoolExecutor.java:1110)
      [mvn] 		at java.util.concurrent.ThreadPoolExecutor$Worker.run(ThreadPoolExecutor.java:603)
      [mvn] 		at java.lang.Thread.run(Thread.java:679)
      [mvn] 	Caused by: org.apache.http.NoHttpResponseException: The target server failed to respond
      [mvn] 		at org.apache.http.impl.conn.DefaultResponseParser.parseHead(DefaultResponseParser.java:101)
      [mvn] 		at org.apache.http.impl.io.AbstractMessageParser.parse(AbstractMessageParser.java:252)
      [mvn] 		at org.apache.http.impl.AbstractHttpClientConnection.receiveResponseHeader(AbstractHttpClientConnection.java:282)
      [mvn] 		at org.apache.http.impl.conn.DefaultClientConnection.receiveResponseHeader(DefaultClientConnection.java:247)
      [mvn] 		at org.apache.http.impl.conn.AbstractClientConnAdapter.receiveResponseHeader(AbstractClientConnAdapter.java:216)
      [mvn] 		at org.apache.http.protocol.HttpRequestExecutor.doReceiveResponse(HttpRequestExecutor.java:298)
      [mvn] 		at org.apache.http.protocol.HttpRequestExecutor.execute(HttpRequestExecutor.java:125)
      [mvn] 		at org.apache.http.impl.client.DefaultRequestDirector.tryExecute(DefaultRequestDirector.java:647)
      [mvn] 		at org.apache.http.impl.client.DefaultRequestDirector.execute(DefaultRequestDirector.java:464)
      [mvn] 		at org.apache.http.impl.client.AbstractHttpClient.execute(AbstractHttpClient.java:820)
      [mvn] 		at org.apache.http.impl.client.AbstractHttpClient.execute(AbstractHttpClient.java:754)
      [mvn] 		at org.apache.http.impl.client.AbstractHttpClient.execute(AbstractHttpClient.java:732)
      [mvn] 		at org.apache.solr.client.solrj.impl.HttpSolrServer.request(HttpSolrServer.java:353)
      [mvn] 		... 11 more
      [mvn] 	
      [mvn] added docs:328 with 0 fails deletes:154
      [mvn] added docs:325 with 0 fails deletes:153
      [mvn] 44476 T892 oasc.SolrException.log SEVERE Sync Failed
      [mvn] Tests run: 1, Failures: 0, Errors: 0, Skipped: 0, Time elapsed: 44.821 sec
      [mvn] Running org.apache.solr.search.TestReload
      [mvn] Creating dataDir: /usr/home/hudson/hudson-slave/workspace/Lucene-Solr-Maven-4.x/maven-build/solr/core/src/test/target/test/./solrtest-TestReload-1347707445985
      [mvn] !!! softCommittrue
      [mvn] !!! softCommitfalse
      [mvn] !!! softCommitfalse
      [mvn] !!! softCommittrue
      [mvn] !!! softCommittrue
      [mvn] !!! softCommitfalse
      [mvn] Tests run: 1, Failures: 0, Errors: 0, Skipped: 0, Time elapsed: 3.59 sec
      [mvn] Running org.apache.solr.cloud.LeaderElectionIntegrationTest
      [mvn] Creating dataDir: /usr/home/hudson/hudson-slave/workspace/Lucene-Solr-Maven-4.x/maven-build/solr/core/src/test/target/test/./solrtest-LeaderElectionIntegrationTest-1347707449579
      [mvn] Creating dataDir: /usr/home/hudson/hudson-slave/workspace/Lucene-Solr-Maven-4.x/maven-build/solr/core/src/test/target/test/./solrtest-LeaderElectionIntegrationTest-1347707462564
      [mvn] Tests run: 2, Failures: 0, Errors: 0, Skipped: 0, Time elapsed: 24.529 sec
      [mvn] Running org.apache.solr.internal.csv.CharBufferTest
      [mvn] Tests run: 13, Failures: 0, Errors: 0, Skipped: 0, Time elapsed: 0.002 sec
      [mvn] Running org.apache.solr.util.TestSystemIdResolver
      [mvn] Tests run: 1, Failures: 0, Errors: 0, Skipped: 0, Time elapsed: 0.023 sec
      [mvn] Running org.apache.solr.response.TestPHPSerializedResponseWriter
      [mvn] Creating dataDir: /usr/home/hudson/hudson-slave/workspace/Lucene-Solr-Maven-4.x/maven-build/solr/core/src/test/target/test/./solrtest-TestPHPSerializedResponseWriter-1347707474133
      [mvn] Tests run: 2, Failures: 0, Errors: 0, Skipped: 0, Time elapsed: 0.579 sec
      [mvn] Running org.apache.solr.TestSolrCoreProperties
      [mvn] Tests run: 1, Failures: 0, Errors: 0, Skipped: 0, Time elapsed: 0.18 sec
      [mvn] Running org.apache.solr.TestDistributedSearch
      [mvn] Tests run: 1, Failures: 0, Errors: 0, Skipped: 0, Time elapsed: 87.157 sec
      [mvn] Running org.apache.solr.update.processor.FieldMutatingUpdateProcessorTest
      [mvn] Creating dataDir: /usr/home/hudson/hudson-slave/workspace/Lucene-Solr-Maven-4.x/maven-build/solr/core/src/test/target/test/./solrtest-FieldMutatingUpdateProcessorTest-1347707562056
      [mvn] Tests run: 26, Failures: 0, Errors: 0, Skipped: 0, Time elapsed: 0.61 sec
      [mvn] Running org.apache.solr.MinimalSchemaTest
      [mvn] Creating dataDir: /usr/home/hudson/hudson-slave/workspace/Lucene-Solr-Maven-4.x/maven-build/solr/core/src/test/target/test/./solrtest-MinimalSchemaTest-1347707562666
      [mvn] Tests run: 3, Failures: 0, Errors: 0, Skipped: 0, Time elapsed: 0.399 sec
      [mvn] Running org.apache.solr.cloud.TestMultiCoreConfBootstrap
      [mvn] Creating dataDir: /usr/home/hudson/hudson-slave/workspace/Lucene-Solr-Maven-4.x/maven-build/solr/core/src/test/target/test/./solrtest-TestMultiCoreConfBootstrap-1347707563081
      [mvn] !!!! WARNING: best effort to remove /usr/home/hudson/hudson-slave/workspace/Lucene-Solr-Maven-4.x/maven-build/solr/core/src/test/target/test/./solrtest-TestMultiCoreConfBootstrap-1347707563081 FAILED !!!!!
      [mvn] Tests run: 1, Failures: 0, Errors: 0, Skipped: 0, Time elapsed: 3.595 sec
      [mvn] Running org.apache.solr.core.TestPropInject
      [mvn] Tests run: 2, Failures: 0, Errors: 0, Skipped: 0, Time elapsed: 0.818 sec
      [mvn] Running org.apache.solr.update.processor.UniqFieldsUpdateProcessorFactoryTest
      [mvn] Creating dataDir: /usr/home/hudson/hudson-slave/workspace/Lucene-Solr-Maven-4.x/maven-build/solr/core/src/test/target/test/./solrtest-UniqFieldsUpdateProcessorFactoryTest-1347707567480
      [mvn] Tests run: 1, Failures: 0, Errors: 0, Skipped: 0, Time elapsed: 0.501 sec
      [mvn] Running org.apache.solr.schema.TestCollationField
      [mvn] Creating dataDir: /usr/home/hudson/hudson-slave/workspace/Lucene-Solr-Maven-4.x/maven-build/solr/core/src/test/target/test/./solrtest-TestCollationField-1347707568018
      [mvn] Tests run: 8, Failures: 0, Errors: 0, Skipped: 0, Time elapsed: 0.315 sec
      [mvn] Running org.apache.solr.handler.BinaryUpdateRequestHandlerTest
      [mvn] Creating dataDir: /usr/home/hudson/hudson-slave/workspace/Lucene-Solr-Maven-4.x/maven-build/solr/core/src/test/target/test/./solrtest-BinaryUpdateRequestHandlerTest-1347707568296
      [mvn] null
      [mvn] Tests run: 1, Failures: 0, Errors: 0, Skipped: 0, Time elapsed: 0.775 sec
      [mvn] Running org.apache.solr.search.QueryParsingTest
      [mvn] Creating dataDir: /usr/home/hudson/hudson-slave/workspace/Lucene-Solr-Maven-4.x/maven-build/solr/core/src/test/target/test/./solrtest-QueryParsingTest-1347707569073
      [mvn] Tests run: 4, Failures: 0, Errors: 0, Skipped: 0, Time elapsed: 0.627 sec
      [mvn] Running org.apache.solr.util.TestNumberUtils
      [mvn] Tests run: 1, Failures: 0, Errors: 0, Skipped: 0, Time elapsed: 0.403 sec
      [mvn] Running org.apache.solr.handler.PingRequestHandlerTest
      [mvn] Creating dataDir: /usr/home/hudson/hudson-slave/workspace/Lucene-Solr-Maven-4.x/maven-build/solr/core/src/test/target/test/./solrtest-PingRequestHandlerTest-1347707570110
      [mvn] Tests run: 5, Failures: 0, Errors: 0, Skipped: 0, Time elapsed: 0.506 sec
      [mvn] Running org.apache.solr.spelling.suggest.SuggesterWFSTTest
      [mvn] Creating dataDir: /usr/home/hudson/hudson-slave/workspace/Lucene-Solr-Maven-4.x/maven-build/solr/core/src/test/target/test/./solrtest-SuggesterWFSTTest-1347707570611
      [mvn] NOTE: per solr.test.leavedatadir, dataDir will not be removed: /usr/home/hudson/hudson-slave/workspace/Lucene-Solr-Maven-4.x/maven-build/solr/core/src/test/target/test/./solrtest-SuggesterWFSTTest-1347707570611
      [mvn] Tests run: 4, Failures: 0, Errors: 0, Skipped: 0, Time elapsed: 0.835 sec
      [mvn] Running org.apache.solr.cloud.ChaosMonkeySafeLeaderTest
      [mvn] Tests run: 1, Failures: 0, Errors: 0, Skipped: 1, Time elapsed: 0.001 sec
      [mvn] Running org.apache.solr.handler.component.TermVectorComponentTest
      [mvn] Creating dataDir: /usr/home/hudson/hudson-slave/workspace/Lucene-Solr-Maven-4.x/maven-build/solr/core/src/test/target/test/./solrtest-TermVectorComponentTest-1347707571447
      [mvn] Tests run: 3, Failures: 0, Errors: 0, Skipped: 0, Time elapsed: 0.548 sec
      [mvn] Running org.apache.solr.core.IndexReaderFactoryTest
      [mvn] Tests run: 1, Failures: 0, Errors: 0, Skipped: 0, Time elapsed: 0.381 sec
      [mvn] Running org.apache.solr.handler.JsonLoaderTest
      [mvn] Creating dataDir: /usr/home/hudson/hudson-slave/workspace/Lucene-Solr-Maven-4.x/maven-build/solr/core/src/test/target/test/./solrtest-JsonLoaderTest-1347707572379
      [mvn] Tests run: 6, Failures: 0, Errors: 0, Skipped: 0, Time elapsed: 0.44 sec
      [mvn] Running org.apache.solr.core.TestQuerySenderListener
      [mvn] Creating dataDir: /usr/home/hudson/hudson-slave/workspace/Lucene-Solr-Maven-4.x/maven-build/solr/core/src/test/target/test/./solrtest-TestQuerySenderListener-1347707572817
      [mvn] Tests run: 3, Failures: 0, Errors: 0, Skipped: 0, Time elapsed: 0.28 sec
      [mvn] Running org.apache.solr.util.TimeZoneUtilsTest
      [mvn] Tests run: 5, Failures: 0, Errors: 0, Skipped: 0, Time elapsed: 0.101 sec
      [mvn] Running org.apache.solr.search.similarities.TestDFRSimilarityFactory
      [mvn] Creating dataDir: /usr/home/hudson/hudson-slave/workspace/Lucene-Solr-Maven-4.x/maven-build/solr/core/src/test/target/test/./solrtest-TestDFRSimilarityFactory-1347707573197
      [mvn] Tests run: 3, Failures: 0, Errors: 0, Skipped: 0, Time elapsed: 0.079 sec
      [mvn] Running org.apache.solr.util.CircularListTest
      [mvn] Tests run: 1, Failures: 0, Errors: 0, Skipped: 0, Time elapsed: 0.008 sec
      [mvn] Running org.apache.solr.handler.admin.CoreAdminHandlerTest
      [mvn] Creating dataDir: /usr/home/hudson/hudson-slave/workspace/Lucene-Solr-Maven-4.x/maven-build/solr/core/src/test/target/test/./solrtest-CoreAdminHandlerTest-1347707573285
      [mvn] 893 T1218 oasc.CoreContainer.create SEVERE Unable to create core: bogus_dir_core java.io.IOException: Can't find resource 'solrconfig.xml' in classpath or '/usr/home/hudson/hudson-slave/workspace/Lucene-Solr-Maven-4.x/maven-build/solr/core/src/test/target/test-classes/solr/dir_does_not_exist_127896/conf/', cwd=/usr/home/hudson/hudson-slave/workspace/Lucene-Solr-Maven-4.x/maven-build/solr/core/src/test/target/test
      [mvn] 	at org.apache.solr.core.SolrResourceLoader.openResource(SolrResourceLoader.java:314)
      [mvn] 	at org.apache.solr.core.SolrResourceLoader.openConfig(SolrResourceLoader.java:280)
      [mvn] 	at org.apache.solr.core.Config.<init>(Config.java:111)
      [mvn] 	at org.apache.solr.core.Config.<init>(Config.java:78)
      [mvn] 	at org.apache.solr.core.SolrConfig.<init>(SolrConfig.java:117)
      [mvn] 	at org.apache.solr.core.CoreContainer.create(CoreContainer.java:791)
      [mvn] 	at org.apache.solr.handler.admin.CoreAdminHandler.handleCreateAction(CoreAdminHandler.java:519)
      [mvn] 	at org.apache.solr.handler.admin.CoreAdminHandler.handleRequestBody(CoreAdminHandler.java:142)
      [mvn] 	at org.apache.solr.handler.admin.CoreAdminHandlerTest.testCoreAdminHandler(CoreAdminHandlerTest.java:105)
      [mvn] 	at sun.reflect.NativeMethodAccessorImpl.invoke0(Native Method)
      [mvn] 	at sun.reflect.NativeMethodAccessorImpl.invoke(NativeMethodAccessorImpl.java:57)
      [mvn] 	at sun.reflect.DelegatingMethodAccessorImpl.invoke(DelegatingMethodAccessorImpl.java:43)
      [mvn] 	at java.lang.reflect.Method.invoke(Method.java:616)
      [mvn] 	at com.carrotsearch.randomizedtesting.RandomizedRunner.invoke(RandomizedRunner.java:1559)
      [mvn] 	at com.carrotsearch.randomizedtesting.RandomizedRunner.access$600(RandomizedRunner.java:79)
      [mvn] 	at com.carrotsearch.randomizedtesting.RandomizedRunner$6.evaluate(RandomizedRunner.java:737)
      [mvn] 	at com.carrotsearch.randomizedtesting.RandomizedRunner$7.evaluate(RandomizedRunner.java:773)
      [mvn] 	at com.carrotsearch.randomizedtesting.RandomizedRunner$8.evaluate(RandomizedRunner.java:787)
      [mvn] 	at com.carrotsearch.randomizedtesting.rules.SystemPropertiesRestoreRule$1.evaluate(SystemPropertiesRestoreRule.java:53)
      [mvn] 	at org.apache.lucene.util.TestRuleSetupTeardownChained$1.evaluate(TestRuleSetupTeardownChained.java:50)
      [mvn] 	at org.apache.lucene.util.TestRuleFieldCacheSanity$1.evaluate(TestRuleFieldCacheSanity.java:51)
      [mvn] 	at org.apache.lucene.util.AbstractBeforeAfterRule$1.evaluate(AbstractBeforeAfterRule.java:45)
      [mvn] 	at com.carrotsearch.randomizedtesting.rules.SystemPropertiesInvariantRule$1.evaluate(SystemPropertiesInvariantRule.java:55)
      [mvn] 	at org.apache.lucene.util.TestRuleThreadAndTestName$1.evaluate(TestRuleThreadAndTestName.java:48)
      [mvn] 	at org.apache.lucene.util.TestRuleIgnoreAfterMaxFailures$1.evaluate(TestRuleIgnoreAfterMaxFailures.java:70)
      [mvn] 	at org.apache.lucene.util.TestRuleMarkFailure$1.evaluate(TestRuleMarkFailure.java:48)
      [mvn] 	at com.carrotsearch.randomizedtesting.rules.StatementAdapter.evaluate(StatementAdapter.java:36)
      [mvn] 	at com.carrotsearch.randomizedtesting.ThreadLeakControl$StatementRunner.run(ThreadLeakControl.java:358)
      [mvn] 	at com.carrotsearch.randomizedtesting.ThreadLeakControl.forkTimeoutingTask(ThreadLeakControl.java:782)
      [mvn] 	at com.carrotsearch.randomizedtesting.ThreadLeakControl$3.evaluate(ThreadLeakControl.java:442)
      [mvn] 	at com.carrotsearch.randomizedtesting.RandomizedRunner.runSingleTest(RandomizedRunner.java:746)
      [mvn] 	at com.carrotsearch.randomizedtesting.RandomizedRunner$3.evaluate(RandomizedRunner.java:648)
      [mvn] 	at com.carrotsearch.randomizedtesting.RandomizedRunner$4.evaluate(RandomizedRunner.java:682)
      [mvn] 	at com.carrotsearch.randomizedtesting.RandomizedRunner$5.evaluate(RandomizedRunner.java:693)
      [mvn] 	at com.carrotsearch.randomizedtesting.rules.StatementAdapter.evaluate(StatementAdapter.java:36)
      [mvn] 	at com.carrotsearch.randomizedtesting.rules.SystemPropertiesRestoreRule$1.evaluate(SystemPropertiesRestoreRule.java:53)
      [mvn] 	at org.apache.lucene.util.AbstractBeforeAfterRule$1.evaluate(AbstractBeforeAfterRule.java:45)
      [mvn] 	at org.apache.lucene.util.TestRuleStoreClassName$1.evaluate(TestRuleStoreClassName.java:42)
      [mvn] 	at com.carrotsearch.randomizedtesting.rules.SystemPropertiesInvariantRule$1.evaluate(SystemPropertiesInvariantRule.java:55)
      [mvn] 	at com.carrotsearch.randomizedtesting.rules.NoShadowingOrOverridesOnMethodsRule$1.evaluate(NoShadowingOrOverridesOnMethodsRule.java:39)
      [mvn] 	at com.carrotsearch.randomizedtesting.rules.NoShadowingOrOverridesOnMethodsRule$1.evaluate(NoShadowingOrOverridesOnMethodsRule.java:39)
      [mvn] 	at com.carrotsearch.randomizedtesting.rules.StatementAdapter.evaluate(StatementAdapter.java:36)
      [mvn] 	at org.apache.lucene.util.TestRuleAssertionsRequired$1.evaluate(TestRuleAssertionsRequired.java:43)
      [mvn] 	at org.apache.lucene.util.TestRuleMarkFailure$1.evaluate(TestRuleMarkFailure.java:48)
      [mvn] 	at org.apache.lucene.util.TestRuleIgnoreAfterMaxFailures$1.evaluate(TestRuleIgnoreAfterMaxFailures.java:70)
      [mvn] 	at org.apache.lucene.util.TestRuleIgnoreTestSuites$1.evaluate(TestRuleIgnoreTestSuites.java:55)
      [mvn] 	at com.carrotsearch.randomizedtesting.rules.StatementAdapter.evaluate(StatementAdapter.java:36)
      [mvn] 	at com.carrotsearch.randomizedtesting.ThreadLeakControl$StatementRunner.run(ThreadLeakControl.java:358)
      [mvn] 	at java.lang.Thread.run(Thread.java:679)
      [mvn] 
      [mvn] Tests run: 1, Failures: 0, Errors: 0, Skipped: 0, Time elapsed: 0.917 sec
      [mvn] Running org.apache.solr.request.SimpleFacetsTest
      [mvn] Creating dataDir: /usr/home/hudson/hudson-slave/workspace/Lucene-Solr-Maven-4.x/maven-build/solr/core/src/test/target/test/./solrtest-SimpleFacetsTest-1347707574213
      [mvn] ASYNC  NEW_CORE C1 name=collection1 org.apache.solr.core.SolrCore@2061b97c
      [mvn] 2612 T1222 C1 oasc.SolrException.log SEVERE org.apache.solr.common.SolrException: Specify the group.field as parameter or local parameter
      [mvn] 		at org.apache.solr.request.SimpleFacets.getGroupedCounts(SimpleFacets.java:360)
      [mvn] 		at org.apache.solr.request.SimpleFacets.getTermCounts(SimpleFacets.java:319)
      [mvn] 		at org.apache.solr.request.SimpleFacets.getFacetFieldCounts(SimpleFacets.java:423)
      [mvn] 		at org.apache.solr.request.SimpleFacets.getFacetCounts(SimpleFacets.java:206)
      [mvn] 		at org.apache.solr.handler.component.FacetComponent.process(FacetComponent.java:87)
      [mvn] 		at org.apache.solr.handler.component.SearchHandler.handleRequestBody(SearchHandler.java:206)
      [mvn] 		at org.apache.solr.handler.RequestHandlerBase.handleRequest(RequestHandlerBase.java:129)
      [mvn] 		at org.apache.solr.core.SolrCore.execute(SolrCore.java:1701)
      [mvn] 		at org.apache.solr.util.TestHarness.query(TestHarness.java:364)
      [mvn] 		at org.apache.solr.util.TestHarness.query(TestHarness.java:346)
      [mvn] 		at org.apache.solr.request.SimpleFacetsTest.testSimpleGroupedFacets(SimpleFacetsTest.java:245)
      [mvn] 		at sun.reflect.NativeMethodAccessorImpl.invoke0(Native Method)
      [mvn] 		at sun.reflect.NativeMethodAccessorImpl.invoke(NativeMethodAccessorImpl.java:57)
      [mvn] 		at sun.reflect.DelegatingMethodAccessorImpl.invoke(DelegatingMethodAccessorImpl.java:43)
      [mvn] 		at java.lang.reflect.Method.invoke(Method.java:616)
      [mvn] 		at com.carrotsearch.randomizedtesting.RandomizedRunner.invoke(RandomizedRunner.java:1559)
      [mvn] 		at com.carrotsearch.randomizedtesting.RandomizedRunner.access$600(RandomizedRunner.java:79)
      [mvn] 		at com.carrotsearch.randomizedtesting.RandomizedRunner$6.evaluate(RandomizedRunner.java:737)
      [mvn] 		at com.carrotsearch.randomizedtesting.RandomizedRunner$7.evaluate(RandomizedRunner.java:773)
      [mvn] 		at com.carrotsearch.randomizedtesting.RandomizedRunner$8.evaluate(RandomizedRunner.java:787)
      [mvn] 		at com.carrotsearch.randomizedtesting.rules.SystemPropertiesRestoreRule$1.evaluate(SystemPropertiesRestoreRule.java:53)
      [mvn] 		at org.apache.lucene.util.TestRuleSetupTeardownChained$1.evaluate(TestRuleSetupTeardownChained.java:50)
      [mvn] 		at org.apache.lucene.util.TestRuleFieldCacheSanity$1.evaluate(TestRuleFieldCacheSanity.java:51)
      [mvn] 		at org.apache.lucene.util.AbstractBeforeAfterRule$1.evaluate(AbstractBeforeAfterRule.java:45)
      [mvn] 		at com.carrotsearch.randomizedtesting.rules.SystemPropertiesInvariantRule$1.evaluate(SystemPropertiesInvariantRule.java:55)
      [mvn] 		at org.apache.lucene.util.TestRuleThreadAndTestName$1.evaluate(TestRuleThreadAndTestName.java:48)
      [mvn] 		at org.apache.lucene.util.TestRuleIgnoreAfterMaxFailures$1.evaluate(TestRuleIgnoreAfterMaxFailures.java:70)
      [mvn] 		at org.apache.lucene.util.TestRuleMarkFailure$1.evaluate(TestRuleMarkFailure.java:48)
      [mvn] 		at com.carrotsearch.randomizedtesting.rules.StatementAdapter.evaluate(StatementAdapter.java:36)
      [mvn] 		at com.carrotsearch.randomizedtesting.ThreadLeakControl$StatementRunner.run(ThreadLeakControl.java:358)
      [mvn] 		at com.carrotsearch.randomizedtesting.ThreadLeakControl.forkTimeoutingTask(ThreadLeakControl.java:782)
      [mvn] 		at com.carrotsearch.randomizedtesting.ThreadLeakControl$3.evaluate(ThreadLeakControl.java:442)
      [mvn] 		at com.carrotsearch.randomizedtesting.RandomizedRunner.runSingleTest(RandomizedRunner.java:746)
      [mvn] 		at com.carrotsearch.randomizedtesting.RandomizedRunner$3.evaluate(RandomizedRunner.java:648)
      [mvn] 		at com.carrotsearch.randomizedtesting.RandomizedRunner$4.evaluate(RandomizedRunner.java:682)
      [mvn] 		at com.carrotsearch.randomizedtesting.RandomizedRunner$5.evaluate(RandomizedRunner.java:693)
      [mvn] 		at com.carrotsearch.randomizedtesting.rules.StatementAdapter.evaluate(StatementAdapter.java:36)
      [mvn] 		at com.carrotsearch.randomizedtesting.rules.SystemPropertiesRestoreRule$1.evaluate(SystemPropertiesRestoreRule.java:53)
      [mvn] 		at org.apache.lucene.util.AbstractBeforeAfterRule$1.evaluate(AbstractBeforeAfterRule.java:45)
      [mvn] 		at org.apache.lucene.util.TestRuleStoreClassName$1.evaluate(TestRuleStoreClassName.java:42)
      [mvn] 		at com.carrotsearch.randomizedtesting.rules.SystemPropertiesInvariantRule$1.evaluate(SystemPropertiesInvariantRule.java:55)
      [mvn] 		at com.carrotsearch.randomizedtesting.rules.NoShadowingOrOverridesOnMethodsRule$1.evaluate(NoShadowingOrOverridesOnMethodsRule.java:39)
      [mvn] 		at com.carrotsearch.randomizedtesting.rules.NoShadowingOrOverridesOnMethodsRule$1.evaluate(NoShadowingOrOverridesOnMethodsRule.java:39)
      [mvn] 		at com.carrotsearch.randomizedtesting.rules.StatementAdapter.evaluate(StatementAdapter.java:36)
      [mvn] 		at org.apache.lucene.util.TestRuleAssertionsRequired$1.evaluate(TestRuleAssertionsRequired.java:43)
      [mvn] 		at org.apache.lucene.util.TestRuleMarkFailure$1.evaluate(TestRuleMarkFailure.java:48)
      [mvn] 		at org.apache.lucene.util.TestRuleIgnoreAfterMaxFailures$1.evaluate(TestRuleIgnoreAfterMaxFailures.java:70)
      [mvn] 		at org.apache.lucene.util.TestRuleIgnoreTestSuites$1.evaluate(TestRuleIgnoreTestSuites.java:55)
      [mvn] 		at com.carrotsearch.randomizedtesting.rules.StatementAdapter.evaluate(StatementAdapter.java:36)
      [mvn] 		at com.carrotsearch.randomizedtesting.ThreadLeakControl$StatementRunner.run(ThreadLeakControl.java:358)
      [mvn] 		at java.lang.Thread.run(Thread.java:679)
      [mvn] 	
      [mvn] 2632 T1222 C1 oasc.SolrException.log SEVERE org.apache.solr.common.SolrException: range facet infinite loop: gap is either zero, or too small relative start/end and caused underflow: 23.0 + 0 = 23.0
      [mvn] 		at org.apache.solr.request.SimpleFacets.getFacetRangeCounts(SimpleFacets.java:1122)
      [mvn] 		at org.apache.solr.request.SimpleFacets.getFacetRangeCounts(SimpleFacets.java:1074)
      [mvn] 		at org.apache.solr.request.SimpleFacets.getFacetRangeCounts(SimpleFacets.java:1018)
      [mvn] 		at org.apache.solr.request.SimpleFacets.getFacetCounts(SimpleFacets.java:208)
      [mvn] 		at org.apache.solr.handler.component.FacetComponent.process(FacetComponent.java:87)
      [mvn] 		at org.apache.solr.handler.component.SearchHandler.handleRequestBody(SearchHandler.java:206)
      [mvn] 		at org.apache.solr.handler.RequestHandlerBase.handleRequest(RequestHandlerBase.java:129)
      [mvn] 		at org.apache.solr.core.SolrCore.execute(SolrCore.java:1701)
      [mvn] 		at org.apache.solr.util.TestHarness.query(TestHarness.java:364)
      [mvn] 		at org.apache.solr.util.TestHarness.query(TestHarness.java:346)
      [mvn] 		at org.apache.solr.SolrTestCaseJ4.assertQEx(SolrTestCaseJ4.java:611)
      [mvn] 		at org.apache.solr.request.SimpleFacetsTest.testRangeFacetInfiniteLoopDetection(SimpleFacetsTest.java:2052)
      [mvn] 		at sun.reflect.NativeMethodAccessorImpl.invoke0(Native Method)
      [mvn] 		at sun.reflect.NativeMethodAccessorImpl.invoke(NativeMethodAccessorImpl.java:57)
      [mvn] 		at sun.reflect.DelegatingMethodAccessorImpl.invoke(DelegatingMethodAccessorImpl.java:43)
      [mvn] 		at java.lang.reflect.Method.invoke(Method.java:616)
      [mvn] 		at com.carrotsearch.randomizedtesting.RandomizedRunner.invoke(RandomizedRunner.java:1559)
      [mvn] 		at com.carrotsearch.randomizedtesting.RandomizedRunner.access$600(RandomizedRunner.java:79)
      [mvn] 		at com.carrotsearch.randomizedtesting.RandomizedRunner$6.evaluate(RandomizedRunner.java:737)
      [mvn] 		at com.carrotsearch.randomizedtesting.RandomizedRunner$7.evaluate(RandomizedRunner.java:773)
      [mvn] 		at com.carrotsearch.randomizedtesting.RandomizedRunner$8.evaluate(RandomizedRunner.java:787)
      [mvn] 		at com.carrotsearch.randomizedtesting.rules.SystemPropertiesRestoreRule$1.evaluate(SystemPropertiesRestoreRule.java:53)
      [mvn] 		at org.apache.lucene.util.TestRuleSetupTeardownChained$1.evaluate(TestRuleSetupTeardownChained.java:50)
      [mvn] 		at org.apache.lucene.util.TestRuleFieldCacheSanity$1.evaluate(TestRuleFieldCacheSanity.java:51)
      [mvn] 		at org.apache.lucene.util.AbstractBeforeAfterRule$1.evaluate(AbstractBeforeAfterRule.java:45)
      [mvn] 		at com.carrotsearch.randomizedtesting.rules.SystemPropertiesInvariantRule$1.evaluate(SystemPropertiesInvariantRule.java:55)
      [mvn] 		at org.apache.lucene.util.TestRuleThreadAndTestName$1.evaluate(TestRuleThreadAndTestName.java:48)
      [mvn] 		at org.apache.lucene.util.TestRuleIgnoreAfterMaxFailures$1.evaluate(TestRuleIgnoreAfterMaxFailures.java:70)
      [mvn] 		at org.apache.lucene.util.TestRuleMarkFailure$1.evaluate(TestRuleMarkFailure.java:48)
      [mvn] 		at com.carrotsearch.randomizedtesting.rules.StatementAdapter.evaluate(StatementAdapter.java:36)
      [mvn] 		at com.carrotsearch.randomizedtesting.ThreadLeakControl$StatementRunner.run(ThreadLeakControl.java:358)
      [mvn] 		at com.carrotsearch.randomizedtesting.ThreadLeakControl.forkTimeoutingTask(ThreadLeakControl.java:782)
      [mvn] 		at com.carrotsearch.randomizedtesting.ThreadLeakControl$3.evaluate(ThreadLeakControl.java:442)
      [mvn] 		at com.carrotsearch.randomizedtesting.RandomizedRunner.runSingleTest(RandomizedRunner.java:746)
      [mvn] 		at com.carrotsearch.randomizedtesting.RandomizedRunner$3.evaluate(RandomizedRunner.java:648)
      [mvn] 		at com.carrotsearch.randomizedtesting.RandomizedRunner$4.evaluate(RandomizedRunner.java:682)
      [mvn] 		at com.carrotsearch.randomizedtesting.RandomizedRunner$5.evaluate(RandomizedRunner.java:693)
      [mvn] 		at com.carrotsearch.randomizedtesting.rules.StatementAdapter.evaluate(StatementAdapter.java:36)
      [mvn] 		at com.carrotsearch.randomizedtesting.rules.SystemPropertiesRestoreRule$1.evaluate(SystemPropertiesRestoreRule.java:53)
      [mvn] 		at org.apache.lucene.util.AbstractBeforeAfterRule$1.evaluate(AbstractBeforeAfterRule.java:45)
      [mvn] 		at org.apache.lucene.util.TestRuleStoreClassName$1.evaluate(TestRuleStoreClassName.java:42)
      [mvn] 		at com.carrotsearch.randomizedtesting.rules.SystemPropertiesInvariantRule$1.evaluate(SystemPropertiesInvariantRule.java:55)
      [mvn] 		at com.carrotsearch.randomizedtesting.rules.NoShadowingOrOverridesOnMethodsRule$1.evaluate(NoShadowingOrOverridesOnMethodsRule.java:39)
      [mvn] 		at com.carrotsearch.randomizedtesting.rules.NoShadowingOrOverridesOnMethodsRule$1.evaluate(NoShadowingOrOverridesOnMethodsRule.java:39)
      [mvn] 		at com.carrotsearch.randomizedtesting.rules.StatementAdapter.evaluate(StatementAdapter.java:36)
      [mvn] 		at org.apache.lucene.util.TestRuleAssertionsRequired$1.evaluate(TestRuleAssertionsRequired.java:43)
      [mvn] 		at org.apache.lucene.util.TestRuleMarkFailure$1.evaluate(TestRuleMarkFailure.java:48)
      [mvn] 		at org.apache.lucene.util.TestRuleIgnoreAfterMaxFailures$1.evaluate(TestRuleIgnoreAfterMaxFailures.java:70)
      [mvn] 		at org.apache.lucene.util.TestRuleIgnoreTestSuites$1.evaluate(TestRuleIgnoreTestSuites.java:55)
      [mvn] 		at com.carrotsearch.randomizedtesting.rules.StatementAdapter.evaluate(StatementAdapter.java:36)
      [mvn] 		at com.carrotsearch.randomizedtesting.ThreadLeakControl$StatementRunner.run(ThreadLeakControl.java:358)
      [mvn] 		at java.lang.Thread.run(Thread.java:679)
      [mvn] 	
      [mvn] 2634 T1222 C1 oasc.SolrException.log SEVERE org.apache.solr.common.SolrException: range facet infinite loop: gap is either zero, or too small relative start/end and caused underflow: 23.0 + 0 = 23.0
      [mvn] 		at org.apache.solr.request.SimpleFacets.getFacetRangeCounts(SimpleFacets.java:1122)
      [mvn] 		at org.apache.solr.request.SimpleFacets.getFacetRangeCounts(SimpleFacets.java:1074)
      [mvn] 		at org.apache.solr.request.SimpleFacets.getFacetRangeCounts(SimpleFacets.java:1018)
      [mvn] 		at org.apache.solr.request.SimpleFacets.getFacetCounts(SimpleFacets.java:208)
      [mvn] 		at org.apache.solr.handler.component.FacetComponent.process(FacetComponent.java:87)
      [mvn] 		at org.apache.solr.handler.component.SearchHandler.handleRequestBody(SearchHandler.java:206)
      [mvn] 		at org.apache.solr.handler.RequestHandlerBase.handleRequest(RequestHandlerBase.java:129)
      [mvn] 		at org.apache.solr.core.SolrCore.execute(SolrCore.java:1701)
      [mvn] 		at org.apache.solr.util.TestHarness.query(TestHarness.java:364)
      [mvn] 		at org.apache.solr.util.TestHarness.query(TestHarness.java:346)
      [mvn] 		at org.apache.solr.SolrTestCaseJ4.assertQEx(SolrTestCaseJ4.java:611)
      [mvn] 		at org.apache.solr.request.SimpleFacetsTest.testRangeFacetInfiniteLoopDetection(SimpleFacetsTest.java:2052)
      [mvn] 		at sun.reflect.NativeMethodAccessorImpl.invoke0(Native Method)
      [mvn] 		at sun.reflect.NativeMethodAccessorImpl.invoke(NativeMethodAccessorImpl.java:57)
      [mvn] 		at sun.reflect.DelegatingMethodAccessorImpl.invoke(DelegatingMethodAccessorImpl.java:43)
      [mvn] 		at java.lang.reflect.Method.invoke(Method.java:616)
      [mvn] 		at com.carrotsearch.randomizedtesting.RandomizedRunner.invoke(RandomizedRunner.java:1559)
      [mvn] 		at com.carrotsearch.randomizedtesting.RandomizedRunner.access$600(RandomizedRunner.java:79)
      [mvn] 		at com.carrotsearch.randomizedtesting.RandomizedRunner$6.evaluate(RandomizedRunner.java:737)
      [mvn] 		at com.carrotsearch.randomizedtesting.RandomizedRunner$7.evaluate(RandomizedRunner.java:773)
      [mvn] 		at com.carrotsearch.randomizedtesting.RandomizedRunner$8.evaluate(RandomizedRunner.java:787)
      [mvn] 		at com.carrotsearch.randomizedtesting.rules.SystemPropertiesRestoreRule$1.evaluate(SystemPropertiesRestoreRule.java:53)
      [mvn] 		at org.apache.lucene.util.TestRuleSetupTeardownChained$1.evaluate(TestRuleSetupTeardownChained.java:50)
      [mvn] 		at org.apache.lucene.util.TestRuleFieldCacheSanity$1.evaluate(TestRuleFieldCacheSanity.java:51)
      [mvn] 		at org.apache.lucene.util.AbstractBeforeAfterRule$1.evaluate(AbstractBeforeAfterRule.java:45)
      [mvn] 		at com.carrotsearch.randomizedtesting.rules.SystemPropertiesInvariantRule$1.evaluate(SystemPropertiesInvariantRule.java:55)
      [mvn] 		at org.apache.lucene.util.TestRuleThreadAndTestName$1.evaluate(TestRuleThreadAndTestName.java:48)
      [mvn] 		at org.apache.lucene.util.TestRuleIgnoreAfterMaxFailures$1.evaluate(TestRuleIgnoreAfterMaxFailures.java:70)
      [mvn] 		at org.apache.lucene.util.TestRuleMarkFailure$1.evaluate(TestRuleMarkFailure.java:48)
      [mvn] 		at com.carrotsearch.randomizedtesting.rules.StatementAdapter.evaluate(StatementAdapter.java:36)
      [mvn] 		at com.carrotsearch.randomizedtesting.ThreadLeakControl$StatementRunner.run(ThreadLeakControl.java:358)
      [mvn] 		at com.carrotsearch.randomizedtesting.ThreadLeakControl.forkTimeoutingTask(ThreadLeakControl.java:782)
      [mvn] 		at com.carrotsearch.randomizedtesting.ThreadLeakControl$3.evaluate(ThreadLeakControl.java:442)
      [mvn] 		at com.carrotsearch.randomizedtesting.RandomizedRunner.runSingleTest(RandomizedRunner.java:746)
      [mvn] 		at com.carrotsearch.randomizedtesting.RandomizedRunner$3.evaluate(RandomizedRunner.java:648)
      [mvn] 		at com.carrotsearch.randomizedtesting.RandomizedRunner$4.evaluate(RandomizedRunner.java:682)
      [mvn] 		at com.carrotsearch.randomizedtesting.RandomizedRunner$5.evaluate(RandomizedRunner.java:693)
      [mvn] 		at com.carrotsearch.randomizedtesting.rules.StatementAdapter.evaluate(StatementAdapter.java:36)
      [mvn] 		at com.carrotsearch.randomizedtesting.rules.SystemPropertiesRestoreRule$1.evaluate(SystemPropertiesRestoreRule.java:53)
      [mvn] 		at org.apache.lucene.util.AbstractBeforeAfterRule$1.evaluate(AbstractBeforeAfterRule.java:45)
      [mvn] 		at org.apache.lucene.util.TestRuleStoreClassName$1.evaluate(TestRuleStoreClassName.java:42)
      [mvn] 		at com.carrotsearch.randomizedtesting.rules.SystemPropertiesInvariantRule$1.evaluate(SystemPropertiesInvariantRule.java:55)
      [mvn] 		at com.carrotsearch.randomizedtesting.rules.NoShadowingOrOverridesOnMethodsRule$1.evaluate(NoShadowingOrOverridesOnMethodsRule.java:39)
      [mvn] 		at com.carrotsearch.randomizedtesting.rules.NoShadowingOrOverridesOnMethodsRule$1.evaluate(NoShadowingOrOverridesOnMethodsRule.java:39)
      [mvn] 		at com.carrotsearch.randomizedtesting.rules.StatementAdapter.evaluate(StatementAdapter.java:36)
      [mvn] 		at org.apache.lucene.util.TestRuleAssertionsRequired$1.evaluate(TestRuleAssertionsRequired.java:43)
      [mvn] 		at org.apache.lucene.util.TestRuleMarkFailure$1.evaluate(TestRuleMarkFailure.java:48)
      [mvn] 		at org.apache.lucene.util.TestRuleIgnoreAfterMaxFailures$1.evaluate(TestRuleIgnoreAfterMaxFailures.java:70)
      [mvn] 		at org.apache.lucene.util.TestRuleIgnoreTestSuites$1.evaluate(TestRuleIgnoreTestSuites.java:55)
      [mvn] 		at com.carrotsearch.randomizedtesting.rules.StatementAdapter.evaluate(StatementAdapter.java:36)
      [mvn] 		at com.carrotsearch.randomizedtesting.ThreadLeakControl$StatementRunner.run(ThreadLeakControl.java:358)
      [mvn] 		at java.lang.Thread.run(Thread.java:679)
      [mvn] 	
      [mvn] 2635 T1222 C1 oasc.SolrException.log SEVERE org.apache.solr.common.SolrException: range facet infinite loop: gap is either zero, or too small relative start/end and caused underflow: 23.0 + 0 = 23.0
      [mvn] 		at org.apache.solr.request.SimpleFacets.getFacetRangeCounts(SimpleFacets.java:1122)
      [mvn] 		at org.apache.solr.request.SimpleFacets.getFacetRangeCounts(SimpleFacets.java:1074)
      [mvn] 		at org.apache.solr.request.SimpleFacets.getFacetRangeCounts(SimpleFacets.java:1018)
      [mvn] 		at org.apache.solr.request.SimpleFacets.getFacetCounts(SimpleFacets.java:208)
      [mvn] 		at org.apache.solr.handler.component.FacetComponent.process(FacetComponent.java:87)
      [mvn] 		at org.apache.solr.handler.component.SearchHandler.handleRequestBody(SearchHandler.java:206)
      [mvn] 		at org.apache.solr.handler.RequestHandlerBase.handleRequest(RequestHandlerBase.java:129)
      [mvn] 		at org.apache.solr.core.SolrCore.execute(SolrCore.java:1701)
      [mvn] 		at org.apache.solr.util.TestHarness.query(TestHarness.java:364)
      [mvn] 		at org.apache.solr.util.TestHarness.query(TestHarness.java:346)
      [mvn] 		at org.apache.solr.SolrTestCaseJ4.assertQEx(SolrTestCaseJ4.java:611)
      [mvn] 		at org.apache.solr.request.SimpleFacetsTest.testRangeFacetInfiniteLoopDetection(SimpleFacetsTest.java:2052)
      [mvn] 		at sun.reflect.NativeMethodAccessorImpl.invoke0(Native Method)
      [mvn] 		at sun.reflect.NativeMethodAccessorImpl.invoke(NativeMethodAccessorImpl.java:57)
      [mvn] 		at sun.reflect.DelegatingMethodAccessorImpl.invoke(DelegatingMethodAccessorImpl.java:43)
      [mvn] 		at java.lang.reflect.Method.invoke(Method.java:616)
      [mvn] 		at com.carrotsearch.randomizedtesting.RandomizedRunner.invoke(RandomizedRunner.java:1559)
      [mvn] 		at com.carrotsearch.randomizedtesting.RandomizedRunner.access$600(RandomizedRunner.java:79)
      [mvn] 		at com.carrotsearch.randomizedtesting.RandomizedRunner$6.evaluate(RandomizedRunner.java:737)
      [mvn] 		at com.carrotsearch.randomizedtesting.RandomizedRunner$7.evaluate(RandomizedRunner.java:773)
      [mvn] 		at com.carrotsearch.randomizedtesting.RandomizedRunner$8.evaluate(RandomizedRunner.java:787)
      [mvn] 		at com.carrotsearch.randomizedtesting.rules.SystemPropertiesRestoreRule$1.evaluate(SystemPropertiesRestoreRule.java:53)
      [mvn] 		at org.apache.lucene.util.TestRuleSetupTeardownChained$1.evaluate(TestRuleSetupTeardownChained.java:50)
      [mvn] 		at org.apache.lucene.util.TestRuleFieldCacheSanity$1.evaluate(TestRuleFieldCacheSanity.java:51)
      [mvn] 		at org.apache.lucene.util.AbstractBeforeAfterRule$1.evaluate(AbstractBeforeAfterRule.java:45)
      [mvn] 		at com.carrotsearch.randomizedtesting.rules.SystemPropertiesInvariantRule$1.evaluate(SystemPropertiesInvariantRule.java:55)
      [mvn] 		at org.apache.lucene.util.TestRuleThreadAndTestName$1.evaluate(TestRuleThreadAndTestName.java:48)
      [mvn] 		at org.apache.lucene.util.TestRuleIgnoreAfterMaxFailures$1.evaluate(TestRuleIgnoreAfterMaxFailures.java:70)
      [mvn] 		at org.apache.lucene.util.TestRuleMarkFailure$1.evaluate(TestRuleMarkFailure.java:48)
      [mvn] 		at com.carrotsearch.randomizedtesting.rules.StatementAdapter.evaluate(StatementAdapter.java:36)
      [mvn] 		at com.carrotsearch.randomizedtesting.ThreadLeakControl$StatementRunner.run(ThreadLeakControl.java:358)
      [mvn] 		at com.carrotsearch.randomizedtesting.ThreadLeakControl.forkTimeoutingTask(ThreadLeakControl.java:782)
      [mvn] 		at com.carrotsearch.randomizedtesting.ThreadLeakControl$3.evaluate(ThreadLeakControl.java:442)
      [mvn] 		at com.carrotsearch.randomizedtesting.RandomizedRunner.runSingleTest(RandomizedRunner.java:746)
      [mvn] 		at com.carrotsearch.randomizedtesting.RandomizedRunner$3.evaluate(RandomizedRunner.java:648)
      [mvn] 		at com.carrotsearch.randomizedtesting.RandomizedRunner$4.evaluate(RandomizedRunner.java:682)
      [mvn] 		at com.carrotsearch.randomizedtesting.RandomizedRunner$5.evaluate(RandomizedRunner.java:693)
      [mvn] 		at com.carrotsearch.randomizedtesting.rules.StatementAdapter.evaluate(StatementAdapter.java:36)
      [mvn] 		at com.carrotsearch.randomizedtesting.rules.SystemPropertiesRestoreRule$1.evaluate(SystemPropertiesRestoreRule.java:53)
      [mvn] 		at org.apache.lucene.util.AbstractBeforeAfterRule$1.evaluate(AbstractBeforeAfterRule.java:45)
      [mvn] 		at org.apache.lucene.util.TestRuleStoreClassName$1.evaluate(TestRuleStoreClassName.java:42)
      [mvn] 		at com.carrotsearch.randomizedtesting.rules.SystemPropertiesInvariantRule$1.evaluate(SystemPropertiesInvariantRule.java:55)
      [mvn] 		at com.carrotsearch.randomizedtesting.rules.NoShadowingOrOverridesOnMethodsRule$1.evaluate(NoShadowingOrOverridesOnMethodsRule.java:39)
      [mvn] 		at com.carrotsearch.randomizedtesting.rules.NoShadowingOrOverridesOnMethodsRule$1.evaluate(NoShadowingOrOverridesOnMethodsRule.java:39)
      [mvn] 		at com.carrotsearch.randomizedtesting.rules.StatementAdapter.evaluate(StatementAdapter.java:36)
      [mvn] 		at org.apache.lucene.util.TestRuleAssertionsRequired$1.evaluate(TestRuleAssertionsRequired.java:43)
      [mvn] 		at org.apache.lucene.util.TestRuleMarkFailure$1.evaluate(TestRuleMarkFailure.java:48)
      [mvn] 		at org.apache.lucene.util.TestRuleIgnoreAfterMaxFailures$1.evaluate(TestRuleIgnoreAfterMaxFailures.java:70)
      [mvn] 		at org.apache.lucene.util.TestRuleIgnoreTestSuites$1.evaluate(TestRuleIgnoreTestSuites.java:55)
      [mvn] 		at com.carrotsearch.randomizedtesting.rules.StatementAdapter.evaluate(StatementAdapter.java:36)
      [mvn] 		at com.carrotsearch.randomizedtesting.ThreadLeakControl$StatementRunner.run(ThreadLeakControl.java:358)
      [mvn] 		at java.lang.Thread.run(Thread.java:679)
      [mvn] 	
      [mvn] 2636 T1222 C1 oasc.SolrException.log SEVERE org.apache.solr.common.SolrException: range facet infinite loop: gap is either zero, or too small relative start/end and caused underflow: 23.0 + 0 = 23.0
      [mvn] 		at org.apache.solr.request.SimpleFacets.getFacetRangeCounts(SimpleFacets.java:1122)
      [mvn] 		at org.apache.solr.request.SimpleFacets.getFacetRangeCounts(SimpleFacets.java:1074)
      [mvn] 		at org.apache.solr.request.SimpleFacets.getFacetRangeCounts(SimpleFacets.java:1018)
      [mvn] 		at org.apache.solr.request.SimpleFacets.getFacetCounts(SimpleFacets.java:208)
      [mvn] 		at org.apache.solr.handler.component.FacetComponent.process(FacetComponent.java:87)
      [mvn] 		at org.apache.solr.handler.component.SearchHandler.handleRequestBody(SearchHandler.java:206)
      [mvn] 		at org.apache.solr.handler.RequestHandlerBase.handleRequest(RequestHandlerBase.java:129)
      [mvn] 		at org.apache.solr.core.SolrCore.execute(SolrCore.java:1701)
      [mvn] 		at org.apache.solr.util.TestHarness.query(TestHarness.java:364)
      [mvn] 		at org.apache.solr.util.TestHarness.query(TestHarness.java:346)
      [mvn] 		at org.apache.solr.SolrTestCaseJ4.assertQEx(SolrTestCaseJ4.java:611)
      [mvn] 		at org.apache.solr.request.SimpleFacetsTest.testRangeFacetInfiniteLoopDetection(SimpleFacetsTest.java:2052)
      [mvn] 		at sun.reflect.NativeMethodAccessorImpl.invoke0(Native Method)
      [mvn] 		at sun.reflect.NativeMethodAccessorImpl.invoke(NativeMethodAccessorImpl.java:57)
      [mvn] 		at sun.reflect.DelegatingMethodAccessorImpl.invoke(DelegatingMethodAccessorImpl.java:43)
      [mvn] 		at java.lang.reflect.Method.invoke(Method.java:616)
      [mvn] 		at com.carrotsearch.randomizedtesting.RandomizedRunner.invoke(RandomizedRunner.java:1559)
      [mvn] 		at com.carrotsearch.randomizedtesting.RandomizedRunner.access$600(RandomizedRunner.java:79)
      [mvn] 		at com.carrotsearch.randomizedtesting.RandomizedRunner$6.evaluate(RandomizedRunner.java:737)
      [mvn] 		at com.carrotsearch.randomizedtesting.RandomizedRunner$7.evaluate(RandomizedRunner.java:773)
      [mvn] 		at com.carrotsearch.randomizedtesting.RandomizedRunner$8.evaluate(RandomizedRunner.java:787)
      [mvn] 		at com.carrotsearch.randomizedtesting.rules.SystemPropertiesRestoreRule$1.evaluate(SystemPropertiesRestoreRule.java:53)
      [mvn] 		at org.apache.lucene.util.TestRuleSetupTeardownChained$1.evaluate(TestRuleSetupTeardownChained.java:50)
      [mvn] 		at org.apache.lucene.util.TestRuleFieldCacheSanity$1.evaluate(TestRuleFieldCacheSanity.java:51)
      [mvn] 		at org.apache.lucene.util.AbstractBeforeAfterRule$1.evaluate(AbstractBeforeAfterRule.java:45)
      [mvn] 		at com.carrotsearch.randomizedtesting.rules.SystemPropertiesInvariantRule$1.evaluate(SystemPropertiesInvariantRule.java:55)
      [mvn] 		at org.apache.lucene.util.TestRuleThreadAndTestName$1.evaluate(TestRuleThreadAndTestName.java:48)
      [mvn] 		at org.apache.lucene.util.TestRuleIgnoreAfterMaxFailures$1.evaluate(TestRuleIgnoreAfterMaxFailures.java:70)
      [mvn] 		at org.apache.lucene.util.TestRuleMarkFailure$1.evaluate(TestRuleMarkFailure.java:48)
      [mvn] 		at com.carrotsearch.randomizedtesting.rules.StatementAdapter.evaluate(StatementAdapter.java:36)
      [mvn] 		at com.carrotsearch.randomizedtesting.ThreadLeakControl$StatementRunner.run(ThreadLeakControl.java:358)
      [mvn] 		at com.carrotsearch.randomizedtesting.ThreadLeakControl.forkTimeoutingTask(ThreadLeakControl.java:782)
      [mvn] 		at com.carrotsearch.randomizedtesting.ThreadLeakControl$3.evaluate(ThreadLeakControl.java:442)
      [mvn] 		at com.carrotsearch.randomizedtesting.RandomizedRunner.runSingleTest(RandomizedRunner.java:746)
      [mvn] 		at com.carrotsearch.randomizedtesting.RandomizedRunner$3.evaluate(RandomizedRunner.java:648)
      [mvn] 		at com.carrotsearch.randomizedtesting.RandomizedRunner$4.evaluate(RandomizedRunner.java:682)
      [mvn] 		at com.carrotsearch.randomizedtesting.RandomizedRunner$5.evaluate(RandomizedRunner.java:693)
      [mvn] 		at com.carrotsearch.randomizedtesting.rules.StatementAdapter.evaluate(StatementAdapter.java:36)
      [mvn] 		at com.carrotsearch.randomizedtesting.rules.SystemPropertiesRestoreRule$1.evaluate(SystemPropertiesRestoreRule.java:53)
      [mvn] 		at org.apache.lucene.util.AbstractBeforeAfterRule$1.evaluate(AbstractBeforeAfterRule.java:45)
      [mvn] 		at org.apache.lucene.util.TestRuleStoreClassName$1.evaluate(TestRuleStoreClassName.java:42)
      [mvn] 		at com.carrotsearch.randomizedtesting.rules.SystemPropertiesInvariantRule$1.evaluate(SystemPropertiesInvariantRule.java:55)
      [mvn] 		at com.carrotsearch.randomizedtesting.rules.NoShadowingOrOverridesOnMethodsRule$1.evaluate(NoShadowingOrOverridesOnMethodsRule.java:39)
      [mvn] 		at com.carrotsearch.randomizedtesting.rules.NoShadowingOrOverridesOnMethodsRule$1.evaluate(NoShadowingOrOverridesOnMethodsRule.java:39)
      [mvn] 		at com.carrotsearch.randomizedtesting.rules.StatementAdapter.evaluate(StatementAdapter.java:36)
      [mvn] 		at org.apache.lucene.util.TestRuleAssertionsRequired$1.evaluate(TestRuleAssertionsRequired.java:43)
      [mvn] 		at org.apache.lucene.util.TestRuleMarkFailure$1.evaluate(TestRuleMarkFailure.java:48)
      [mvn] 		at org.apache.lucene.util.TestRuleIgnoreAfterMaxFailures$1.evaluate(TestRuleIgnoreAfterMaxFailures.java:70)
      [mvn] 		at org.apache.lucene.util.TestRuleIgnoreTestSuites$1.evaluate(TestRuleIgnoreTestSuites.java:55)
      [mvn] 		at com.carrotsearch.randomizedtesting.rules.StatementAdapter.evaluate(StatementAdapter.java:36)
      [mvn] 		at com.carrotsearch.randomizedtesting.ThreadLeakControl$StatementRunner.run(ThreadLeakControl.java:358)
      [mvn] 		at java.lang.Thread.run(Thread.java:679)
      [mvn] 	
      [mvn] 2637 T1222 C1 oasc.SolrException.log SEVERE org.apache.solr.common.SolrException: range facet infinite loop: gap is either zero, or too small relative start/end and caused underflow: 23 + 0 = 23
      [mvn] 		at org.apache.solr.request.SimpleFacets.getFacetRangeCounts(SimpleFacets.java:1122)
      [mvn] 		at org.apache.solr.request.SimpleFacets.getFacetRangeCounts(SimpleFacets.java:1074)
      [mvn] 		at org.apache.solr.request.SimpleFacets.getFacetRangeCounts(SimpleFacets.java:1018)
      [mvn] 		at org.apache.solr.request.SimpleFacets.getFacetCounts(SimpleFacets.java:208)
      [mvn] 		at org.apache.solr.handler.component.FacetComponent.process(FacetComponent.java:87)
      [mvn] 		at org.apache.solr.handler.component.SearchHandler.handleRequestBody(SearchHandler.java:206)
      [mvn] 		at org.apache.solr.handler.RequestHandlerBase.handleRequest(RequestHandlerBase.java:129)
      [mvn] 		at org.apache.solr.core.SolrCore.execute(SolrCore.java:1701)
      [mvn] 		at org.apache.solr.util.TestHarness.query(TestHarness.java:364)
      [mvn] 		at org.apache.solr.util.TestHarness.query(TestHarness.java:346)
      [mvn] 		at org.apache.solr.SolrTestCaseJ4.assertQEx(SolrTestCaseJ4.java:611)
      [mvn] 		at org.apache.solr.request.SimpleFacetsTest.testRangeFacetInfiniteLoopDetection(SimpleFacetsTest.java:2052)
      [mvn] 		at sun.reflect.NativeMethodAccessorImpl.invoke0(Native Method)
      [mvn] 		at sun.reflect.NativeMethodAccessorImpl.invoke(NativeMethodAccessorImpl.java:57)
      [mvn] 		at sun.reflect.DelegatingMethodAccessorImpl.invoke(DelegatingMethodAccessorImpl.java:43)
      [mvn] 		at java.lang.reflect.Method.invoke(Method.java:616)
      [mvn] 		at com.carrotsearch.randomizedtesting.RandomizedRunner.invoke(RandomizedRunner.java:1559)
      [mvn] 		at com.carrotsearch.randomizedtesting.RandomizedRunner.access$600(RandomizedRunner.java:79)
      [mvn] 		at com.carrotsearch.randomizedtesting.RandomizedRunner$6.evaluate(RandomizedRunner.java:737)
      [mvn] 		at com.carrotsearch.randomizedtesting.RandomizedRunner$7.evaluate(RandomizedRunner.java:773)
      [mvn] 		at com.carrotsearch.randomizedtesting.RandomizedRunner$8.evaluate(RandomizedRunner.java:787)
      [mvn] 		at com.carrotsearch.randomizedtesting.rules.SystemPropertiesRestoreRule$1.evaluate(SystemPropertiesRestoreRule.java:53)
      [mvn] 		at org.apache.lucene.util.TestRuleSetupTeardownChained$1.evaluate(TestRuleSetupTeardownChained.java:50)
      [mvn] 		at org.apache.lucene.util.TestRuleFieldCacheSanity$1.evaluate(TestRuleFieldCacheSanity.java:51)
      [mvn] 		at org.apache.lucene.util.AbstractBeforeAfterRule$1.evaluate(AbstractBeforeAfterRule.java:45)
      [mvn] 		at com.carrotsearch.randomizedtesting.rules.SystemPropertiesInvariantRule$1.evaluate(SystemPropertiesInvariantRule.java:55)
      [mvn] 		at org.apache.lucene.util.TestRuleThreadAndTestName$1.evaluate(TestRuleThreadAndTestName.java:48)
      [mvn] 		at org.apache.lucene.util.TestRuleIgnoreAfterMaxFailures$1.evaluate(TestRuleIgnoreAfterMaxFailures.java:70)
      [mvn] 		at org.apache.lucene.util.TestRuleMarkFailure$1.evaluate(TestRuleMarkFailure.java:48)
      [mvn] 		at com.carrotsearch.randomizedtesting.rules.StatementAdapter.evaluate(StatementAdapter.java:36)
      [mvn] 		at com.carrotsearch.randomizedtesting.ThreadLeakControl$StatementRunner.run(ThreadLeakControl.java:358)
      [mvn] 		at com.carrotsearch.randomizedtesting.ThreadLeakControl.forkTimeoutingTask(ThreadLeakControl.java:782)
      [mvn] 		at com.carrotsearch.randomizedtesting.ThreadLeakControl$3.evaluate(ThreadLeakControl.java:442)
      [mvn] 		at com.carrotsearch.randomizedtesting.RandomizedRunner.runSingleTest(RandomizedRunner.java:746)
      [mvn] 		at com.carrotsearch.randomizedtesting.RandomizedRunner$3.evaluate(RandomizedRunner.java:648)
      [mvn] 		at com.carrotsearch.randomizedtesting.RandomizedRunner$4.evaluate(RandomizedRunner.java:682)
      [mvn] 		at com.carrotsearch.randomizedtesting.RandomizedRunner$5.evaluate(RandomizedRunner.java:693)
      [mvn] 		at com.carrotsearch.randomizedtesting.rules.StatementAdapter.evaluate(StatementAdapter.java:36)
      [mvn] 		at com.carrotsearch.randomizedtesting.rules.SystemPropertiesRestoreRule$1.evaluate(SystemPropertiesRestoreRule.java:53)
      [mvn] 		at org.apache.lucene.util.AbstractBeforeAfterRule$1.evaluate(AbstractBeforeAfterRule.java:45)
      [mvn] 		at org.apache.lucene.util.TestRuleStoreClassName$1.evaluate(TestRuleStoreClassName.java:42)
      [mvn] 		at com.carrotsearch.randomizedtesting.rules.SystemPropertiesInvariantRule$1.evaluate(SystemPropertiesInvariantRule.java:55)
      [mvn] 		at com.carrotsearch.randomizedtesting.rules.NoShadowingOrOverridesOnMethodsRule$1.evaluate(NoShadowingOrOverridesOnMethodsRule.java:39)
      [mvn] 		at com.carrotsearch.randomizedtesting.rules.NoShadowingOrOverridesOnMethodsRule$1.evaluate(NoShadowingOrOverridesOnMethodsRule.java:39)
      [mvn] 		at com.carrotsearch.randomizedtesting.rules.StatementAdapter.evaluate(StatementAdapter.java:36)
      [mvn] 		at org.apache.lucene.util.TestRuleAssertionsRequired$1.evaluate(TestRuleAssertionsRequired.java:43)
      [mvn] 		at org.apache.lucene.util.TestRuleMarkFailure$1.evaluate(TestRuleMarkFailure.java:48)
      [mvn] 		at org.apache.lucene.util.TestRuleIgnoreAfterMaxFailures$1.evaluate(TestRuleIgnoreAfterMaxFailures.java:70)
      [mvn] 		at org.apache.lucene.util.TestRuleIgnoreTestSuites$1.evaluate(TestRuleIgnoreTestSuites.java:55)
      [mvn] 		at com.carrotsearch.randomizedtesting.rules.StatementAdapter.evaluate(StatementAdapter.java:36)
      [mvn] 		at com.carrotsearch.randomizedtesting.ThreadLeakControl$StatementRunner.run(ThreadLeakControl.java:358)
      [mvn] 		at java.lang.Thread.run(Thread.java:679)
      [mvn] 	
      [mvn] 2638 T1222 C1 oasc.SolrException.log SEVERE org.apache.solr.common.SolrException: range facet infinite loop: gap is either zero, or too small relative start/end and caused underflow: 23 + 0 = 23
      [mvn] 		at org.apache.solr.request.SimpleFacets.getFacetRangeCounts(SimpleFacets.java:1122)
      [mvn] 		at org.apache.solr.request.SimpleFacets.getFacetRangeCounts(SimpleFacets.java:1074)
      [mvn] 		at org.apache.solr.request.SimpleFacets.getFacetRangeCounts(SimpleFacets.java:1018)
      [mvn] 		at org.apache.solr.request.SimpleFacets.getFacetCounts(SimpleFacets.java:208)
      [mvn] 		at org.apache.solr.handler.component.FacetComponent.process(FacetComponent.java:87)
      [mvn] 		at org.apache.solr.handler.component.SearchHandler.handleRequestBody(SearchHandler.java:206)
      [mvn] 		at org.apache.solr.handler.RequestHandlerBase.handleRequest(RequestHandlerBase.java:129)
      [mvn] 		at org.apache.solr.core.SolrCore.execute(SolrCore.java:1701)
      [mvn] 		at org.apache.solr.util.TestHarness.query(TestHarness.java:364)
      [mvn] 		at org.apache.solr.util.TestHarness.query(TestHarness.java:346)
      [mvn] 		at org.apache.solr.SolrTestCaseJ4.assertQEx(SolrTestCaseJ4.java:611)
      [mvn] 		at org.apache.solr.request.SimpleFacetsTest.testRangeFacetInfiniteLoopDetection(SimpleFacetsTest.java:2052)
      [mvn] 		at sun.reflect.NativeMethodAccessorImpl.invoke0(Native Method)
      [mvn] 		at sun.reflect.NativeMethodAccessorImpl.invoke(NativeMethodAccessorImpl.java:57)
      [mvn] 		at sun.reflect.DelegatingMethodAccessorImpl.invoke(DelegatingMethodAccessorImpl.java:43)
      [mvn] 		at java.lang.reflect.Method.invoke(Method.java:616)
      [mvn] 		at com.carrotsearch.randomizedtesting.RandomizedRunner.invoke(RandomizedRunner.java:1559)
      [mvn] 		at com.carrotsearch.randomizedtesting.RandomizedRunner.access$600(RandomizedRunner.java:79)
      [mvn] 		at com.carrotsearch.randomizedtesting.RandomizedRunner$6.evaluate(RandomizedRunner.java:737)
      [mvn] 		at com.carrotsearch.randomizedtesting.RandomizedRunner$7.evaluate(RandomizedRunner.java:773)
      [mvn] 		at com.carrotsearch.randomizedtesting.RandomizedRunner$8.evaluate(RandomizedRunner.java:787)
      [mvn] 		at com.carrotsearch.randomizedtesting.rules.SystemPropertiesRestoreRule$1.evaluate(SystemPropertiesRestoreRule.java:53)
      [mvn] 		at org.apache.lucene.util.TestRuleSetupTeardownChained$1.evaluate(TestRuleSetupTeardownChained.java:50)
      [mvn] 		at org.apache.lucene.util.TestRuleFieldCacheSanity$1.evaluate(TestRuleFieldCacheSanity.java:51)
      [mvn] 		at org.apache.lucene.util.AbstractBeforeAfterRule$1.evaluate(AbstractBeforeAfterRule.java:45)
      [mvn] 		at com.carrotsearch.randomizedtesting.rules.SystemPropertiesInvariantRule$1.evaluate(SystemPropertiesInvariantRule.java:55)
      [mvn] 		at org.apache.lucene.util.TestRuleThreadAndTestName$1.evaluate(TestRuleThreadAndTestName.java:48)
      [mvn] 		at org.apache.lucene.util.TestRuleIgnoreAfterMaxFailures$1.evaluate(TestRuleIgnoreAfterMaxFailures.java:70)
      [mvn] 		at org.apache.lucene.util.TestRuleMarkFailure$1.evaluate(TestRuleMarkFailure.java:48)
      [mvn] 		at com.carrotsearch.randomizedtesting.rules.StatementAdapter.evaluate(StatementAdapter.java:36)
      [mvn] 		at com.carrotsearch.randomizedtesting.ThreadLeakControl$StatementRunner.run(ThreadLeakControl.java:358)
      [mvn] 		at com.carrotsearch.randomizedtesting.ThreadLeakControl.forkTimeoutingTask(ThreadLeakControl.java:782)
      [mvn] 		at com.carrotsearch.randomizedtesting.ThreadLeakControl$3.evaluate(ThreadLeakControl.java:442)
      [mvn] 		at com.carrotsearch.randomizedtesting.RandomizedRunner.runSingleTest(RandomizedRunner.java:746)
      [mvn] 		at com.carrotsearch.randomizedtesting.RandomizedRunner$3.evaluate(RandomizedRunner.java:648)
      [mvn] 		at com.carrotsearch.randomizedtesting.RandomizedRunner$4.evaluate(RandomizedRunner.java:682)
      [mvn] 		at com.carrotsearch.randomizedtesting.RandomizedRunner$5.evaluate(RandomizedRunner.java:693)
      [mvn] 		at com.carrotsearch.randomizedtesting.rules.StatementAdapter.evaluate(StatementAdapter.java:36)
      [mvn] 		at com.carrotsearch.randomizedtesting.rules.SystemPropertiesRestoreRule$1.evaluate(SystemPropertiesRestoreRule.java:53)
      [mvn] 		at org.apache.lucene.util.AbstractBeforeAfterRule$1.evaluate(AbstractBeforeAfterRule.java:45)
      [mvn] 		at org.apache.lucene.util.TestRuleStoreClassName$1.evaluate(TestRuleStoreClassName.java:42)
      [mvn] 		at com.carrotsearch.randomizedtesting.rules.SystemPropertiesInvariantRule$1.evaluate(SystemPropertiesInvariantRule.java:55)
      [mvn] 		at com.carrotsearch.randomizedtesting.rules.NoShadowingOrOverridesOnMethodsRule$1.evaluate(NoShadowingOrOverridesOnMethodsRule.java:39)
      [mvn] 		at com.carrotsearch.randomizedtesting.rules.NoShadowingOrOverridesOnMethodsRule$1.evaluate(NoShadowingOrOverridesOnMethodsRule.java:39)
      [mvn] 		at com.carrotsearch.randomizedtesting.rules.StatementAdapter.evaluate(StatementAdapter.java:36)
      [mvn] 		at org.apache.lucene.util.TestRuleAssertionsRequired$1.evaluate(TestRuleAssertionsRequired.java:43)
      [mvn] 		at org.apache.lucene.util.TestRuleMarkFailure$1.evaluate(TestRuleMarkFailure.java:48)
      [mvn] 		at org.apache.lucene.util.TestRuleIgnoreAfterMaxFailures$1.evaluate(TestRuleIgnoreAfterMaxFailures.java:70)
      [mvn] 		at org.apache.lucene.util.TestRuleIgnoreTestSuites$1.evaluate(TestRuleIgnoreTestSuites.java:55)
      [mvn] 		at com.carrotsearch.randomizedtesting.rules.StatementAdapter.evaluate(StatementAdapter.java:36)
      [mvn] 		at com.carrotsearch.randomizedtesting.ThreadLeakControl$StatementRunner.run(ThreadLeakControl.java:358)
      [mvn] 		at java.lang.Thread.run(Thread.java:679)
      [mvn] 	
      [mvn] 2640 T1222 C1 oasc.SolrException.log SEVERE org.apache.solr.common.SolrException: date facet infinite loop: gap is effectively zero
      [mvn] 		at org.apache.solr.request.SimpleFacets.getFacetDateCounts(SimpleFacets.java:928)
      [mvn] 		at org.apache.solr.request.SimpleFacets.getFacetDateCounts(SimpleFacets.java:837)
      [mvn] 		at org.apache.solr.request.SimpleFacets.getFacetCounts(SimpleFacets.java:207)
      [mvn] 		at org.apache.solr.handler.component.FacetComponent.process(FacetComponent.java:87)
      [mvn] 		at org.apache.solr.handler.component.SearchHandler.handleRequestBody(SearchHandler.java:206)
      [mvn] 		at org.apache.solr.handler.RequestHandlerBase.handleRequest(RequestHandlerBase.java:129)
      [mvn] 		at org.apache.solr.core.SolrCore.execute(SolrCore.java:1701)
      [mvn] 		at org.apache.solr.util.TestHarness.query(TestHarness.java:364)
      [mvn] 		at org.apache.solr.util.TestHarness.query(TestHarness.java:346)
      [mvn] 		at org.apache.solr.SolrTestCaseJ4.assertQEx(SolrTestCaseJ4.java:611)
      [mvn] 		at org.apache.solr.request.SimpleFacetsTest.testRangeFacetInfiniteLoopDetection(SimpleFacetsTest.java:2063)
      [mvn] 		at sun.reflect.NativeMethodAccessorImpl.invoke0(Native Method)
      [mvn] 		at sun.reflect.NativeMethodAccessorImpl.invoke(NativeMethodAccessorImpl.java:57)
      [mvn] 		at sun.reflect.DelegatingMethodAccessorImpl.invoke(DelegatingMethodAccessorImpl.java:43)
      [mvn] 		at java.lang.reflect.Method.invoke(Method.java:616)
      [mvn] 		at com.carrotsearch.randomizedtesting.RandomizedRunner.invoke(RandomizedRunner.java:1559)
      [mvn] 		at com.carrotsearch.randomizedtesting.RandomizedRunner.access$600(RandomizedRunner.java:79)
      [mvn] 		at com.carrotsearch.randomizedtesting.RandomizedRunner$6.evaluate(RandomizedRunner.java:737)
      [mvn] 		at com.carrotsearch.randomizedtesting.RandomizedRunner$7.evaluate(RandomizedRunner.java:773)
      [mvn] 		at com.carrotsearch.randomizedtesting.RandomizedRunner$8.evaluate(RandomizedRunner.java:787)
      [mvn] 		at com.carrotsearch.randomizedtesting.rules.SystemPropertiesRestoreRule$1.evaluate(SystemPropertiesRestoreRule.java:53)
      [mvn] 		at org.apache.lucene.util.TestRuleSetupTeardownChained$1.evaluate(TestRuleSetupTeardownChained.java:50)
      [mvn] 		at org.apache.lucene.util.TestRuleFieldCacheSanity$1.evaluate(TestRuleFieldCacheSanity.java:51)
      [mvn] 		at org.apache.lucene.util.AbstractBeforeAfterRule$1.evaluate(AbstractBeforeAfterRule.java:45)
      [mvn] 		at com.carrotsearch.randomizedtesting.rules.SystemPropertiesInvariantRule$1.evaluate(SystemPropertiesInvariantRule.java:55)
      [mvn] 		at org.apache.lucene.util.TestRuleThreadAndTestName$1.evaluate(TestRuleThreadAndTestName.java:48)
      [mvn] 		at org.apache.lucene.util.TestRuleIgnoreAfterMaxFailures$1.evaluate(TestRuleIgnoreAfterMaxFailures.java:70)
      [mvn] 		at org.apache.lucene.util.TestRuleMarkFailure$1.evaluate(TestRuleMarkFailure.java:48)
      [mvn] 		at com.carrotsearch.randomizedtesting.rules.StatementAdapter.evaluate(StatementAdapter.java:36)
      [mvn] 		at com.carrotsearch.randomizedtesting.ThreadLeakControl$StatementRunner.run(ThreadLeakControl.java:358)
      [mvn] 		at com.carrotsearch.randomizedtesting.ThreadLeakControl.forkTimeoutingTask(ThreadLeakControl.java:782)
      [mvn] 		at com.carrotsearch.randomizedtesting.ThreadLeakControl$3.evaluate(ThreadLeakControl.java:442)
      [mvn] 		at com.carrotsearch.randomizedtesting.RandomizedRunner.runSingleTest(RandomizedRunner.java:746)
      [mvn] 		at com.carrotsearch.randomizedtesting.RandomizedRunner$3.evaluate(RandomizedRunner.java:648)
      [mvn] 		at com.carrotsearch.randomizedtesting.RandomizedRunner$4.evaluate(RandomizedRunner.java:682)
      [mvn] 		at com.carrotsearch.randomizedtesting.RandomizedRunner$5.evaluate(RandomizedRunner.java:693)
      [mvn] 		at com.carrotsearch.randomizedtesting.rules.StatementAdapter.evaluate(StatementAdapter.java:36)
      [mvn] 		at com.carrotsearch.randomizedtesting.rules.SystemPropertiesRestoreRule$1.evaluate(SystemPropertiesRestoreRule.java:53)
      [mvn] 		at org.apache.lucene.util.AbstractBeforeAfterRule$1.evaluate(AbstractBeforeAfterRule.java:45)
      [mvn] 		at org.apache.lucene.util.TestRuleStoreClassName$1.evaluate(TestRuleStoreClassName.java:42)
      [mvn] 		at com.carrotsearch.randomizedtesting.rules.SystemPropertiesInvariantRule$1.evaluate(SystemPropertiesInvariantRule.java:55)
      [mvn] 		at com.carrotsearch.randomizedtesting.rules.NoShadowingOrOverridesOnMethodsRule$1.evaluate(NoShadowingOrOverridesOnMethodsRule.java:39)
      [mvn] 		at com.carrotsearch.randomizedtesting.rules.NoShadowingOrOverridesOnMethodsRule$1.evaluate(NoShadowingOrOverridesOnMethodsRule.java:39)
      [mvn] 		at com.carrotsearch.randomizedtesting.rules.StatementAdapter.evaluate(StatementAdapter.java:36)
      [mvn] 		at org.apache.lucene.util.TestRuleAssertionsRequired$1.evaluate(TestRuleAssertionsRequired.java:43)
      [mvn] 		at org.apache.lucene.util.TestRuleMarkFailure$1.evaluate(TestRuleMarkFailure.java:48)
      [mvn] 		at org.apache.lucene.util.TestRuleIgnoreAfterMaxFailures$1.evaluate(TestRuleIgnoreAfterMaxFailures.java:70)
      [mvn] 		at org.apache.lucene.util.TestRuleIgnoreTestSuites$1.evaluate(TestRuleIgnoreTestSuites.java:55)
      [mvn] 		at com.carrotsearch.randomizedtesting.rules.StatementAdapter.evaluate(StatementAdapter.java:36)
      [mvn] 		at com.carrotsearch.randomizedtesting.ThreadLeakControl$StatementRunner.run(ThreadLeakControl.java:358)
      [mvn] 		at java.lang.Thread.run(Thread.java:679)
      [mvn] 	
      [mvn] 2641 T1222 C1 oasc.SolrException.log SEVERE org.apache.solr.common.SolrException: range facet infinite loop: gap is either zero, or too small relative start/end and caused underflow: Sat Sep 15 07:12:56 AST 2012 + +0DAYS = Sat Sep 15 07:12:56 AST 2012
      [mvn] 		at org.apache.solr.request.SimpleFacets.getFacetRangeCounts(SimpleFacets.java:1122)
      [mvn] 		at org.apache.solr.request.SimpleFacets.getFacetRangeCounts(SimpleFacets.java:1074)
      [mvn] 		at org.apache.solr.request.SimpleFacets.getFacetRangeCounts(SimpleFacets.java:1018)
      [mvn] 		at org.apache.solr.request.SimpleFacets.getFacetCounts(SimpleFacets.java:208)
      [mvn] 		at org.apache.solr.handler.component.FacetComponent.process(FacetComponent.java:87)
      [mvn] 		at org.apache.solr.handler.component.SearchHandler.handleRequestBody(SearchHandler.java:206)
      [mvn] 		at org.apache.solr.handler.RequestHandlerBase.handleRequest(RequestHandlerBase.java:129)
      [mvn] 		at org.apache.solr.core.SolrCore.execute(SolrCore.java:1701)
      [mvn] 		at org.apache.solr.util.TestHarness.query(TestHarness.java:364)
      [mvn] 		at org.apache.solr.util.TestHarness.query(TestHarness.java:346)
      [mvn] 		at org.apache.solr.SolrTestCaseJ4.assertQEx(SolrTestCaseJ4.java:611)
      [mvn] 		at org.apache.solr.request.SimpleFacetsTest.testRangeFacetInfiniteLoopDetection(SimpleFacetsTest.java:2063)
      [mvn] 		at sun.reflect.NativeMethodAccessorImpl.invoke0(Native Method)
      [mvn] 		at sun.reflect.NativeMethodAccessorImpl.invoke(NativeMethodAccessorImpl.java:57)
      [mvn] 		at sun.reflect.DelegatingMethodAccessorImpl.invoke(DelegatingMethodAccessorImpl.java:43)
      [mvn] 		at java.lang.reflect.Method.invoke(Method.java:616)
      [mvn] 		at com.carrotsearch.randomizedtesting.RandomizedRunner.invoke(RandomizedRunner.java:1559)
      [mvn] 		at com.carrotsearch.randomizedtesting.RandomizedRunner.access$600(RandomizedRunner.java:79)
      [mvn] 		at com.carrotsearch.randomizedtesting.RandomizedRunner$6.evaluate(RandomizedRunner.java:737)
      [mvn] 		at com.carrotsearch.randomizedtesting.RandomizedRunner$7.evaluate(RandomizedRunner.java:773)
      [mvn] 		at com.carrotsearch.randomizedtesting.RandomizedRunner$8.evaluate(RandomizedRunner.java:787)
      [mvn] 		at com.carrotsearch.randomizedtesting.rules.SystemPropertiesRestoreRule$1.evaluate(SystemPropertiesRestoreRule.java:53)
      [mvn] 		at org.apache.lucene.util.TestRuleSetupTeardownChained$1.evaluate(TestRuleSetupTeardownChained.java:50)
      [mvn] 		at org.apache.lucene.util.TestRuleFieldCacheSanity$1.evaluate(TestRuleFieldCacheSanity.java:51)
      [mvn] 		at org.apache.lucene.util.AbstractBeforeAfterRule$1.evaluate(AbstractBeforeAfterRule.java:45)
      [mvn] 		at com.carrotsearch.randomizedtesting.rules.SystemPropertiesInvariantRule$1.evaluate(SystemPropertiesInvariantRule.java:55)
      [mvn] 		at org.apache.lucene.util.TestRuleThreadAndTestName$1.evaluate(TestRuleThreadAndTestName.java:48)
      [mvn] 		at org.apache.lucene.util.TestRuleIgnoreAfterMaxFailures$1.evaluate(TestRuleIgnoreAfterMaxFailures.java:70)
      [mvn] 		at org.apache.lucene.util.TestRuleMarkFailure$1.evaluate(TestRuleMarkFailure.java:48)
      [mvn] 		at com.carrotsearch.randomizedtesting.rules.StatementAdapter.evaluate(StatementAdapter.java:36)
      [mvn] 		at com.carrotsearch.randomizedtesting.ThreadLeakControl$StatementRunner.run(ThreadLeakControl.java:358)
      [mvn] 		at com.carrotsearch.randomizedtesting.ThreadLeakControl.forkTimeoutingTask(ThreadLeakControl.java:782)
      [mvn] 		at com.carrotsearch.randomizedtesting.ThreadLeakControl$3.evaluate(ThreadLeakControl.java:442)
      [mvn] 		at com.carrotsearch.randomizedtesting.RandomizedRunner.runSingleTest(RandomizedRunner.java:746)
      [mvn] 		at com.carrotsearch.randomizedtesting.RandomizedRunner$3.evaluate(RandomizedRunner.java:648)
      [mvn] 		at com.carrotsearch.randomizedtesting.RandomizedRunner$4.evaluate(RandomizedRunner.java:682)
      [mvn] 		at com.carrotsearch.randomizedtesting.RandomizedRunner$5.evaluate(RandomizedRunner.java:693)
      [mvn] 		at com.carrotsearch.randomizedtesting.rules.StatementAdapter.evaluate(StatementAdapter.java:36)
      [mvn] 		at com.carrotsearch.randomizedtesting.rules.SystemPropertiesRestoreRule$1.evaluate(SystemPropertiesRestoreRule.java:53)
      [mvn] 		at org.apache.lucene.util.AbstractBeforeAfterRule$1.evaluate(AbstractBeforeAfterRule.java:45)
      [mvn] 		at org.apache.lucene.util.TestRuleStoreClassName$1.evaluate(TestRuleStoreClassName.java:42)
      [mvn] 		at com.carrotsearch.randomizedtesting.rules.SystemPropertiesInvariantRule$1.evaluate(SystemPropertiesInvariantRule.java:55)
      [mvn] 		at com.carrotsearch.randomizedtesting.rules.NoShadowingOrOverridesOnMethodsRule$1.evaluate(NoShadowingOrOverridesOnMethodsRule.java:39)
      [mvn] 		at com.carrotsearch.randomizedtesting.rules.NoShadowingOrOverridesOnMethodsRule$1.evaluate(NoShadowingOrOverridesOnMethodsRule.java:39)
      [mvn] 		at com.carrotsearch.randomizedtesting.rules.StatementAdapter.evaluate(StatementAdapter.java:36)
      [mvn] 		at org.apache.lucene.util.TestRuleAssertionsRequired$1.evaluate(TestRuleAssertionsRequired.java:43)
      [mvn] 		at org.apache.lucene.util.TestRuleMarkFailure$1.evaluate(TestRuleMarkFailure.java:48)
      [mvn] 		at org.apache.lucene.util.TestRuleIgnoreAfterMaxFailures$1.evaluate(TestRuleIgnoreAfterMaxFailures.java:70)
      [mvn] 		at org.apache.lucene.util.TestRuleIgnoreTestSuites$1.evaluate(TestRuleIgnoreTestSuites.java:55)
      [mvn] 		at com.carrotsearch.randomizedtesting.rules.StatementAdapter.evaluate(StatementAdapter.java:36)
      [mvn] 		at com.carrotsearch.randomizedtesting.ThreadLeakControl$StatementRunner.run(ThreadLeakControl.java:358)
      [mvn] 		at java.lang.Thread.run(Thread.java:679)
      [mvn] 	
      [mvn] 2642 T1222 C1 oasc.SolrException.log SEVERE org.apache.solr.common.SolrException: date facet infinite loop: gap is effectively zero
      [mvn] 		at org.apache.solr.request.SimpleFacets.getFacetDateCounts(SimpleFacets.java:928)
      [mvn] 		at org.apache.solr.request.SimpleFacets.getFacetDateCounts(SimpleFacets.java:837)
      [mvn] 		at org.apache.solr.request.SimpleFacets.getFacetCounts(SimpleFacets.java:207)
      [mvn] 		at org.apache.solr.handler.component.FacetComponent.process(FacetComponent.java:87)
      [mvn] 		at org.apache.solr.handler.component.SearchHandler.handleRequestBody(SearchHandler.java:206)
      [mvn] 		at org.apache.solr.handler.RequestHandlerBase.handleRequest(RequestHandlerBase.java:129)
      [mvn] 		at org.apache.solr.core.SolrCore.execute(SolrCore.java:1701)
      [mvn] 		at org.apache.solr.util.TestHarness.query(TestHarness.java:364)
      [mvn] 		at org.apache.solr.util.TestHarness.query(TestHarness.java:346)
      [mvn] 		at org.apache.solr.SolrTestCaseJ4.assertQEx(SolrTestCaseJ4.java:611)
      [mvn] 		at org.apache.solr.request.SimpleFacetsTest.testRangeFacetInfiniteLoopDetection(SimpleFacetsTest.java:2063)
      [mvn] 		at sun.reflect.NativeMethodAccessorImpl.invoke0(Native Method)
      [mvn] 		at sun.reflect.NativeMethodAccessorImpl.invoke(NativeMethodAccessorImpl.java:57)
      [mvn] 		at sun.reflect.DelegatingMethodAccessorImpl.invoke(DelegatingMethodAccessorImpl.java:43)
      [mvn] 		at java.lang.reflect.Method.invoke(Method.java:616)
      [mvn] 		at com.carrotsearch.randomizedtesting.RandomizedRunner.invoke(RandomizedRunner.java:1559)
      [mvn] 		at com.carrotsearch.randomizedtesting.RandomizedRunner.access$600(RandomizedRunner.java:79)
      [mvn] 		at com.carrotsearch.randomizedtesting.RandomizedRunner$6.evaluate(RandomizedRunner.java:737)
      [mvn] 		at com.carrotsearch.randomizedtesting.RandomizedRunner$7.evaluate(RandomizedRunner.java:773)
      [mvn] 		at com.carrotsearch.randomizedtesting.RandomizedRunner$8.evaluate(RandomizedRunner.java:787)
      [mvn] 		at com.carrotsearch.randomizedtesting.rules.SystemPropertiesRestoreRule$1.evaluate(SystemPropertiesRestoreRule.java:53)
      [mvn] 		at org.apache.lucene.util.TestRuleSetupTeardownChained$1.evaluate(TestRuleSetupTeardownChained.java:50)
      [mvn] 		at org.apache.lucene.util.TestRuleFieldCacheSanity$1.evaluate(TestRuleFieldCacheSanity.java:51)
      [mvn] 		at org.apache.lucene.util.AbstractBeforeAfterRule$1.evaluate(AbstractBeforeAfterRule.java:45)
      [mvn] 		at com.carrotsearch.randomizedtesting.rules.SystemPropertiesInvariantRule$1.evaluate(SystemPropertiesInvariantRule.java:55)
      [mvn] 		at org.apache.lucene.util.TestRuleThreadAndTestName$1.evaluate(TestRuleThreadAndTestName.java:48)
      [mvn] 		at org.apache.lucene.util.TestRuleIgnoreAfterMaxFailures$1.evaluate(TestRuleIgnoreAfterMaxFailures.java:70)
      [mvn] 		at org.apache.lucene.util.TestRuleMarkFailure$1.evaluate(TestRuleMarkFailure.java:48)
      [mvn] 		at com.carrotsearch.randomizedtesting.rules.StatementAdapter.evaluate(StatementAdapter.java:36)
      [mvn] 		at com.carrotsearch.randomizedtesting.ThreadLeakControl$StatementRunner.run(ThreadLeakControl.java:358)
      [mvn] 		at com.carrotsearch.randomizedtesting.ThreadLeakControl.forkTimeoutingTask(ThreadLeakControl.java:782)
      [mvn] 		at com.carrotsearch.randomizedtesting.ThreadLeakControl$3.evaluate(ThreadLeakControl.java:442)
      [mvn] 		at com.carrotsearch.randomizedtesting.RandomizedRunner.runSingleTest(RandomizedRunner.java:746)
      [mvn] 		at com.carrotsearch.randomizedtesting.RandomizedRunner$3.evaluate(RandomizedRunner.java:648)
      [mvn] 		at com.carrotsearch.randomizedtesting.RandomizedRunner$4.evaluate(RandomizedRunner.java:682)
      [mvn] 		at com.carrotsearch.randomizedtesting.RandomizedRunner$5.evaluate(RandomizedRunner.java:693)
      [mvn] 		at com.carrotsearch.randomizedtesting.rules.StatementAdapter.evaluate(StatementAdapter.java:36)
      [mvn] 		at com.carrotsearch.randomizedtesting.rules.SystemPropertiesRestoreRule$1.evaluate(SystemPropertiesRestoreRule.java:53)
      [mvn] 		at org.apache.lucene.util.AbstractBeforeAfterRule$1.evaluate(AbstractBeforeAfterRule.java:45)
      [mvn] 		at org.apache.lucene.util.TestRuleStoreClassName$1.evaluate(TestRuleStoreClassName.java:42)
      [mvn] 		at com.carrotsearch.randomizedtesting.rules.SystemPropertiesInvariantRule$1.evaluate(SystemPropertiesInvariantRule.java:55)
      [mvn] 		at com.carrotsearch.randomizedtesting.rules.NoShadowingOrOverridesOnMethodsRule$1.evaluate(NoShadowingOrOverridesOnMethodsRule.java:39)
      [mvn] 		at com.carrotsearch.randomizedtesting.rules.NoShadowingOrOverridesOnMethodsRule$1.evaluate(NoShadowingOrOverridesOnMethodsRule.java:39)
      [mvn] 		at com.carrotsearch.randomizedtesting.rules.StatementAdapter.evaluate(StatementAdapter.java:36)
      [mvn] 		at org.apache.lucene.util.TestRuleAssertionsRequired$1.evaluate(TestRuleAssertionsRequired.java:43)
      [mvn] 		at org.apache.lucene.util.TestRuleMarkFailure$1.evaluate(TestRuleMarkFailure.java:48)
      [mvn] 		at org.apache.lucene.util.TestRuleIgnoreAfterMaxFailures$1.evaluate(TestRuleIgnoreAfterMaxFailures.java:70)
      [mvn] 		at org.apache.lucene.util.TestRuleIgnoreTestSuites$1.evaluate(TestRuleIgnoreTestSuites.java:55)
      [mvn] 		at com.carrotsearch.randomizedtesting.rules.StatementAdapter.evaluate(StatementAdapter.java:36)
      [mvn] 		at com.carrotsearch.randomizedtesting.ThreadLeakControl$StatementRunner.run(ThreadLeakControl.java:358)
      [mvn] 		at java.lang.Thread.run(Thread.java:679)
      [mvn] 	
      [mvn] 2644 T1222 C1 oasc.SolrException.log SEVERE org.apache.solr.common.SolrException: range facet infinite loop: gap is either zero, or too small relative start/end and caused underflow: Sat Sep 15 07:12:56 AST 2012 + +0DAYS = Sat Sep 15 07:12:56 AST 2012
      [mvn] 		at org.apache.solr.request.SimpleFacets.getFacetRangeCounts(SimpleFacets.java:1122)
      [mvn] 		at org.apache.solr.request.SimpleFacets.getFacetRangeCounts(SimpleFacets.java:1074)
      [mvn] 		at org.apache.solr.request.SimpleFacets.getFacetRangeCounts(SimpleFacets.java:1018)
      [mvn] 		at org.apache.solr.request.SimpleFacets.getFacetCounts(SimpleFacets.java:208)
      [mvn] 		at org.apache.solr.handler.component.FacetComponent.process(FacetComponent.java:87)
      [mvn] 		at org.apache.solr.handler.component.SearchHandler.handleRequestBody(SearchHandler.java:206)
      [mvn] 		at org.apache.solr.handler.RequestHandlerBase.handleRequest(RequestHandlerBase.java:129)
      [mvn] 		at org.apache.solr.core.SolrCore.execute(SolrCore.java:1701)
      [mvn] 		at org.apache.solr.util.TestHarness.query(TestHarness.java:364)
      [mvn] 		at org.apache.solr.util.TestHarness.query(TestHarness.java:346)
      [mvn] 		at org.apache.solr.SolrTestCaseJ4.assertQEx(SolrTestCaseJ4.java:611)
      [mvn] 		at org.apache.solr.request.SimpleFacetsTest.testRangeFacetInfiniteLoopDetection(SimpleFacetsTest.java:2063)
      [mvn] 		at sun.reflect.NativeMethodAccessorImpl.invoke0(Native Method)
      [mvn] 		at sun.reflect.NativeMethodAccessorImpl.invoke(NativeMethodAccessorImpl.java:57)
      [mvn] 		at sun.reflect.DelegatingMethodAccessorImpl.invoke(DelegatingMethodAccessorImpl.java:43)
      [mvn] 		at java.lang.reflect.Method.invoke(Method.java:616)
      [mvn] 		at com.carrotsearch.randomizedtesting.RandomizedRunner.invoke(RandomizedRunner.java:1559)
      [mvn] 		at com.carrotsearch.randomizedtesting.RandomizedRunner.access$600(RandomizedRunner.java:79)
      [mvn] 		at com.carrotsearch.randomizedtesting.RandomizedRunner$6.evaluate(RandomizedRunner.java:737)
      [mvn] 		at com.carrotsearch.randomizedtesting.RandomizedRunner$7.evaluate(RandomizedRunner.java:773)
      [mvn] 		at com.carrotsearch.randomizedtesting.RandomizedRunner$8.evaluate(RandomizedRunner.java:787)
      [mvn] 		at com.carrotsearch.randomizedtesting.rules.SystemPropertiesRestoreRule$1.evaluate(SystemPropertiesRestoreRule.java:53)
      [mvn] 		at org.apache.lucene.util.TestRuleSetupTeardownChained$1.evaluate(TestRuleSetupTeardownChained.java:50)
      [mvn] 		at org.apache.lucene.util.TestRuleFieldCacheSanity$1.evaluate(TestRuleFieldCacheSanity.java:51)
      [mvn] 		at org.apache.lucene.util.AbstractBeforeAfterRule$1.evaluate(AbstractBeforeAfterRule.java:45)
      [mvn] 		at com.carrotsearch.randomizedtesting.rules.SystemPropertiesInvariantRule$1.evaluate(SystemPropertiesInvariantRule.java:55)
      [mvn] 		at org.apache.lucene.util.TestRuleThreadAndTestName$1.evaluate(TestRuleThreadAndTestName.java:48)
      [mvn] 		at org.apache.lucene.util.TestRuleIgnoreAfterMaxFailures$1.evaluate(TestRuleIgnoreAfterMaxFailures.java:70)
      [mvn] 		at org.apache.lucene.util.TestRuleMarkFailure$1.evaluate(TestRuleMarkFailure.java:48)
      [mvn] 		at com.carrotsearch.randomizedtesting.rules.StatementAdapter.evaluate(StatementAdapter.java:36)
      [mvn] 		at com.carrotsearch.randomizedtesting.ThreadLeakControl$StatementRunner.run(ThreadLeakControl.java:358)
      [mvn] 		at com.carrotsearch.randomizedtesting.ThreadLeakControl.forkTimeoutingTask(ThreadLeakControl.java:782)
      [mvn] 		at com.carrotsearch.randomizedtesting.ThreadLeakControl$3.evaluate(ThreadLeakControl.java:442)
      [mvn] 		at com.carrotsearch.randomizedtesting.RandomizedRunner.runSingleTest(RandomizedRunner.java:746)
      [mvn] 		at com.carrotsearch.randomizedtesting.RandomizedRunner$3.evaluate(RandomizedRunner.java:648)
      [mvn] 		at com.carrotsearch.randomizedtesting.RandomizedRunner$4.evaluate(RandomizedRunner.java:682)
      [mvn] 		at com.carrotsearch.randomizedtesting.RandomizedRunner$5.evaluate(RandomizedRunner.java:693)
      [mvn] 		at com.carrotsearch.randomizedtesting.rules.StatementAdapter.evaluate(StatementAdapter.java:36)
      [mvn] 		at com.carrotsearch.randomizedtesting.rules.SystemPropertiesRestoreRule$1.evaluate(SystemPropertiesRestoreRule.java:53)
      [mvn] 		at org.apache.lucene.util.AbstractBeforeAfterRule$1.evaluate(AbstractBeforeAfterRule.java:45)
      [mvn] 		at org.apache.lucene.util.TestRuleStoreClassName$1.evaluate(TestRuleStoreClassName.java:42)
      [mvn] 		at com.carrotsearch.randomizedtesting.rules.SystemPropertiesInvariantRule$1.evaluate(SystemPropertiesInvariantRule.java:55)
      [mvn] 		at com.carrotsearch.randomizedtesting.rules.NoShadowingOrOverridesOnMethodsRule$1.evaluate(NoShadowingOrOverridesOnMethodsRule.java:39)
      [mvn] 		at com.carrotsearch.randomizedtesting.rules.NoShadowingOrOverridesOnMethodsRule$1.evaluate(NoShadowingOrOverridesOnMethodsRule.java:39)
      [mvn] 		at com.carrotsearch.randomizedtesting.rules.StatementAdapter.evaluate(StatementAdapter.java:36)
      [mvn] 		at org.apache.lucene.util.TestRuleAssertionsRequired$1.evaluate(TestRuleAssertionsRequired.java:43)
      [mvn] 		at org.apache.lucene.util.TestRuleMarkFailure$1.evaluate(TestRuleMarkFailure.java:48)
      [mvn] 		at org.apache.lucene.util.TestRuleIgnoreAfterMaxFailures$1.evaluate(TestRuleIgnoreAfterMaxFailures.java:70)
      [mvn] 		at org.apache.lucene.util.TestRuleIgnoreTestSuites$1.evaluate(TestRuleIgnoreTestSuites.java:55)
      [mvn] 		at com.carrotsearch.randomizedtesting.rules.StatementAdapter.evaluate(StatementAdapter.java:36)
      [mvn] 		at com.carrotsearch.randomizedtesting.ThreadLeakControl$StatementRunner.run(ThreadLeakControl.java:358)
      [mvn] 		at java.lang.Thread.run(Thread.java:679)
      [mvn] 	
      [mvn] 2645 T1222 C1 oasc.SolrException.log SEVERE org.apache.solr.common.SolrException: range facet infinite loop: gap is either zero, or too small relative start/end and caused underflow: 9.9999998E10 + 2160 = 9.9999998E10
      [mvn] 		at org.apache.solr.request.SimpleFacets.getFacetRangeCounts(SimpleFacets.java:1122)
      [mvn] 		at org.apache.solr.request.SimpleFacets.getFacetRangeCounts(SimpleFacets.java:1074)
      [mvn] 		at org.apache.solr.request.SimpleFacets.getFacetRangeCounts(SimpleFacets.java:1018)
      [mvn] 		at org.apache.solr.request.SimpleFacets.getFacetCounts(SimpleFacets.java:208)
      [mvn] 		at org.apache.solr.handler.component.FacetComponent.process(FacetComponent.java:87)
      [mvn] 		at org.apache.solr.handler.component.SearchHandler.handleRequestBody(SearchHandler.java:206)
      [mvn] 		at org.apache.solr.handler.RequestHandlerBase.handleRequest(RequestHandlerBase.java:129)
      [mvn] 		at org.apache.solr.core.SolrCore.execute(SolrCore.java:1701)
      [mvn] 		at org.apache.solr.util.TestHarness.query(TestHarness.java:364)
      [mvn] 		at org.apache.solr.util.TestHarness.query(TestHarness.java:346)
      [mvn] 		at org.apache.solr.SolrTestCaseJ4.assertQEx(SolrTestCaseJ4.java:611)
      [mvn] 		at org.apache.solr.request.SimpleFacetsTest.testRangeFacetInfiniteLoopDetection(SimpleFacetsTest.java:2075)
      [mvn] 		at sun.reflect.NativeMethodAccessorImpl.invoke0(Native Method)
      [mvn] 		at sun.reflect.NativeMethodAccessorImpl.invoke(NativeMethodAccessorImpl.java:57)
      [mvn] 		at sun.reflect.DelegatingMethodAccessorImpl.invoke(DelegatingMethodAccessorImpl.java:43)
      [mvn] 		at java.lang.reflect.Method.invoke(Method.java:616)
      [mvn] 		at com.carrotsearch.randomizedtesting.RandomizedRunner.invoke(RandomizedRunner.java:1559)
      [mvn] 		at com.carrotsearch.randomizedtesting.RandomizedRunner.access$600(RandomizedRunner.java:79)
      [mvn] 		at com.carrotsearch.randomizedtesting.RandomizedRunner$6.evaluate(RandomizedRunner.java:737)
      [mvn] 		at com.carrotsearch.randomizedtesting.RandomizedRunner$7.evaluate(RandomizedRunner.java:773)
      [mvn] 		at com.carrotsearch.randomizedtesting.RandomizedRunner$8.evaluate(RandomizedRunner.java:787)
      [mvn] 		at com.carrotsearch.randomizedtesting.rules.SystemPropertiesRestoreRule$1.evaluate(SystemPropertiesRestoreRule.java:53)
      [mvn] 		at org.apache.lucene.util.TestRuleSetupTeardownChained$1.evaluate(TestRuleSetupTeardownChained.java:50)
      [mvn] 		at org.apache.lucene.util.TestRuleFieldCacheSanity$1.evaluate(TestRuleFieldCacheSanity.java:51)
      [mvn] 		at org.apache.lucene.util.AbstractBeforeAfterRule$1.evaluate(AbstractBeforeAfterRule.java:45)
      [mvn] 		at com.carrotsearch.randomizedtesting.rules.SystemPropertiesInvariantRule$1.evaluate(SystemPropertiesInvariantRule.java:55)
      [mvn] 		at org.apache.lucene.util.TestRuleThreadAndTestName$1.evaluate(TestRuleThreadAndTestName.java:48)
      [mvn] 		at org.apache.lucene.util.TestRuleIgnoreAfterMaxFailures$1.evaluate(TestRuleIgnoreAfterMaxFailures.java:70)
      [mvn] 		at org.apache.lucene.util.TestRuleMarkFailure$1.evaluate(TestRuleMarkFailure.java:48)
      [mvn] 		at com.carrotsearch.randomizedtesting.rules.StatementAdapter.evaluate(StatementAdapter.java:36)
      [mvn] 		at com.carrotsearch.randomizedtesting.ThreadLeakControl$StatementRunner.run(ThreadLeakControl.java:358)
      [mvn] 		at com.carrotsearch.randomizedtesting.ThreadLeakControl.forkTimeoutingTask(ThreadLeakControl.java:782)
      [mvn] 		at com.carrotsearch.randomizedtesting.ThreadLeakControl$3.evaluate(ThreadLeakControl.java:442)
      [mvn] 		at com.carrotsearch.randomizedtesting.RandomizedRunner.runSingleTest(RandomizedRunner.java:746)
      [mvn] 		at com.carrotsearch.randomizedtesting.RandomizedRunner$3.evaluate(RandomizedRunner.java:648)
      [mvn] 		at com.carrotsearch.randomizedtesting.RandomizedRunner$4.evaluate(RandomizedRunner.java:682)
      [mvn] 		at com.carrotsearch.randomizedtesting.RandomizedRunner$5.evaluate(RandomizedRunner.java:693)
      [mvn] 		at com.carrotsearch.randomizedtesting.rules.StatementAdapter.evaluate(StatementAdapter.java:36)
      [mvn] 		at com.carrotsearch.randomizedtesting.rules.SystemPropertiesRestoreRule$1.evaluate(SystemPropertiesRestoreRule.java:53)
      [mvn] 		at org.apache.lucene.util.AbstractBeforeAfterRule$1.evaluate(AbstractBeforeAfterRule.java:45)
      [mvn] 		at org.apache.lucene.util.TestRuleStoreClassName$1.evaluate(TestRuleStoreClassName.java:42)
      [mvn] 		at com.carrotsearch.randomizedtesting.rules.SystemPropertiesInvariantRule$1.evaluate(SystemPropertiesInvariantRule.java:55)
      [mvn] 		at com.carrotsearch.randomizedtesting.rules.NoShadowingOrOverridesOnMethodsRule$1.evaluate(NoShadowingOrOverridesOnMethodsRule.java:39)
      [mvn] 		at com.carrotsearch.randomizedtesting.rules.NoShadowingOrOverridesOnMethodsRule$1.evaluate(NoShadowingOrOverridesOnMethodsRule.java:39)
      [mvn] 		at com.carrotsearch.randomizedtesting.rules.StatementAdapter.evaluate(StatementAdapter.java:36)
      [mvn] 		at org.apache.lucene.util.TestRuleAssertionsRequired$1.evaluate(TestRuleAssertionsRequired.java:43)
      [mvn] 		at org.apache.lucene.util.TestRuleMarkFailure$1.evaluate(TestRuleMarkFailure.java:48)
      [mvn] 		at org.apache.lucene.util.TestRuleIgnoreAfterMaxFailures$1.evaluate(TestRuleIgnoreAfterMaxFailures.java:70)
      [mvn] 		at org.apache.lucene.util.TestRuleIgnoreTestSuites$1.evaluate(TestRuleIgnoreTestSuites.java:55)
      [mvn] 		at com.carrotsearch.randomizedtesting.rules.StatementAdapter.evaluate(StatementAdapter.java:36)
      [mvn] 		at com.carrotsearch.randomizedtesting.ThreadLeakControl$StatementRunner.run(ThreadLeakControl.java:358)
      [mvn] 		at java.lang.Thread.run(Thread.java:679)
      [mvn] 	
      [mvn] 2646 T1222 C1 oasc.SolrException.log SEVERE org.apache.solr.common.SolrException: range facet infinite loop: gap is either zero, or too small relative start/end and caused underflow: 9.9999998E10 + 2160 = 9.9999998E10
      [mvn] 		at org.apache.solr.request.SimpleFacets.getFacetRangeCounts(SimpleFacets.java:1122)
      [mvn] 		at org.apache.solr.request.SimpleFacets.getFacetRangeCounts(SimpleFacets.java:1074)
      [mvn] 		at org.apache.solr.request.SimpleFacets.getFacetRangeCounts(SimpleFacets.java:1018)
      [mvn] 		at org.apache.solr.request.SimpleFacets.getFacetCounts(SimpleFacets.java:208)
      [mvn] 		at org.apache.solr.handler.component.FacetComponent.process(FacetComponent.java:87)
      [mvn] 		at org.apache.solr.handler.component.SearchHandler.handleRequestBody(SearchHandler.java:206)
      [mvn] 		at org.apache.solr.handler.RequestHandlerBase.handleRequest(RequestHandlerBase.java:129)
      [mvn] 		at org.apache.solr.core.SolrCore.execute(SolrCore.java:1701)
      [mvn] 		at org.apache.solr.util.TestHarness.query(TestHarness.java:364)
      [mvn] 		at org.apache.solr.util.TestHarness.query(TestHarness.java:346)
      [mvn] 		at org.apache.solr.SolrTestCaseJ4.assertQEx(SolrTestCaseJ4.java:611)
      [mvn] 		at org.apache.solr.request.SimpleFacetsTest.testRangeFacetInfiniteLoopDetection(SimpleFacetsTest.java:2075)
      [mvn] 		at sun.reflect.NativeMethodAccessorImpl.invoke0(Native Method)
      [mvn] 		at sun.reflect.NativeMethodAccessorImpl.invoke(NativeMethodAccessorImpl.java:57)
      [mvn] 		at sun.reflect.DelegatingMethodAccessorImpl.invoke(DelegatingMethodAccessorImpl.java:43)
      [mvn] 		at java.lang.reflect.Method.invoke(Method.java:616)
      [mvn] 		at com.carrotsearch.randomizedtesting.RandomizedRunner.invoke(RandomizedRunner.java:1559)
      [mvn] 		at com.carrotsearch.randomizedtesting.RandomizedRunner.access$600(RandomizedRunner.java:79)
      [mvn] 		at com.carrotsearch.randomizedtesting.RandomizedRunner$6.evaluate(RandomizedRunner.java:737)
      [mvn] 		at com.carrotsearch.randomizedtesting.RandomizedRunner$7.evaluate(RandomizedRunner.java:773)
      [mvn] 		at com.carrotsearch.randomizedtesting.RandomizedRunner$8.evaluate(RandomizedRunner.java:787)
      [mvn] 		at com.carrotsearch.randomizedtesting.rules.SystemPropertiesRestoreRule$1.evaluate(SystemPropertiesRestoreRule.java:53)
      [mvn] 		at org.apache.lucene.util.TestRuleSetupTeardownChained$1.evaluate(TestRuleSetupTeardownChained.java:50)
      [mvn] 		at org.apache.lucene.util.TestRuleFieldCacheSanity$1.evaluate(TestRuleFieldCacheSanity.java:51)
      [mvn] 		at org.apache.lucene.util.AbstractBeforeAfterRule$1.evaluate(AbstractBeforeAfterRule.java:45)
      [mvn] 		at com.carrotsearch.randomizedtesting.rules.SystemPropertiesInvariantRule$1.evaluate(SystemPropertiesInvariantRule.java:55)
      [mvn] 		at org.apache.lucene.util.TestRuleThreadAndTestName$1.evaluate(TestRuleThreadAndTestName.java:48)
      [mvn] 		at org.apache.lucene.util.TestRuleIgnoreAfterMaxFailures$1.evaluate(TestRuleIgnoreAfterMaxFailures.java:70)
      [mvn] 		at org.apache.lucene.util.TestRuleMarkFailure$1.evaluate(TestRuleMarkFailure.java:48)
      [mvn] 		at com.carrotsearch.randomizedtesting.rules.StatementAdapter.evaluate(StatementAdapter.java:36)
      [mvn] 		at com.carrotsearch.randomizedtesting.ThreadLeakControl$StatementRunner.run(ThreadLeakControl.java:358)
      [mvn] 		at com.carrotsearch.randomizedtesting.ThreadLeakControl.forkTimeoutingTask(ThreadLeakControl.java:782)
      [mvn] 		at com.carrotsearch.randomizedtesting.ThreadLeakControl$3.evaluate(ThreadLeakControl.java:442)
      [mvn] 		at com.carrotsearch.randomizedtesting.RandomizedRunner.runSingleTest(RandomizedRunner.java:746)
      [mvn] 		at com.carrotsearch.randomizedtesting.RandomizedRunner$3.evaluate(RandomizedRunner.java:648)
      [mvn] 		at com.carrotsearch.randomizedtesting.RandomizedRunner$4.evaluate(RandomizedRunner.java:682)
      [mvn] 		at com.carrotsearch.randomizedtesting.RandomizedRunner$5.evaluate(RandomizedRunner.java:693)
      [mvn] 		at com.carrotsearch.randomizedtesting.rules.StatementAdapter.evaluate(StatementAdapter.java:36)
      [mvn] 		at com.carrotsearch.randomizedtesting.rules.SystemPropertiesRestoreRule$1.evaluate(SystemPropertiesRestoreRule.java:53)
      [mvn] 		at org.apache.lucene.util.AbstractBeforeAfterRule$1.evaluate(AbstractBeforeAfterRule.java:45)
      [mvn] 		at org.apache.lucene.util.TestRuleStoreClassName$1.evaluate(TestRuleStoreClassName.java:42)
      [mvn] 		at com.carrotsearch.randomizedtesting.rules.SystemPropertiesInvariantRule$1.evaluate(SystemPropertiesInvariantRule.java:55)
      [mvn] 		at com.carrotsearch.randomizedtesting.rules.NoShadowingOrOverridesOnMethodsRule$1.evaluate(NoShadowingOrOverridesOnMethodsRule.java:39)
      [mvn] 		at com.carrotsearch.randomizedtesting.rules.NoShadowingOrOverridesOnMethodsRule$1.evaluate(NoShadowingOrOverridesOnMethodsRule.java:39)
      [mvn] 		at com.carrotsearch.randomizedtesting.rules.StatementAdapter.evaluate(StatementAdapter.java:36)
      [mvn] 		at org.apache.lucene.util.TestRuleAssertionsRequired$1.evaluate(TestRuleAssertionsRequired.java:43)
      [mvn] 		at org.apache.lucene.util.TestRuleMarkFailure$1.evaluate(TestRuleMarkFailure.java:48)
      [mvn] 		at org.apache.lucene.util.TestRuleIgnoreAfterMaxFailures$1.evaluate(TestRuleIgnoreAfterMaxFailures.java:70)
      [mvn] 		at org.apache.lucene.util.TestRuleIgnoreTestSuites$1.evaluate(TestRuleIgnoreTestSuites.java:55)
      [mvn] 		at com.carrotsearch.randomizedtesting.rules.StatementAdapter.evaluate(StatementAdapter.java:36)
      [mvn] 		at com.carrotsearch.randomizedtesting.ThreadLeakControl$StatementRunner.run(ThreadLeakControl.java:358)
      [mvn] 		at java.lang.Thread.run(Thread.java:679)
      [mvn] 	
      [mvn] 2647 T1222 C1 oasc.SolrException.log SEVERE org.apache.solr.common.SolrException: range facet infinite loop: gap is either zero, or too small relative start/end and caused underflow: 9.9E12 + 0.0003 = 9.9E12
      [mvn] 		at org.apache.solr.request.SimpleFacets.getFacetRangeCounts(SimpleFacets.java:1122)
      [mvn] 		at org.apache.solr.request.SimpleFacets.getFacetRangeCounts(SimpleFacets.java:1074)
      [mvn] 		at org.apache.solr.request.SimpleFacets.getFacetRangeCounts(SimpleFacets.java:1018)
      [mvn] 		at org.apache.solr.request.SimpleFacets.getFacetCounts(SimpleFacets.java:208)
      [mvn] 		at org.apache.solr.handler.component.FacetComponent.process(FacetComponent.java:87)
      [mvn] 		at org.apache.solr.handler.component.SearchHandler.handleRequestBody(SearchHandler.java:206)
      [mvn] 		at org.apache.solr.handler.RequestHandlerBase.handleRequest(RequestHandlerBase.java:129)
      [mvn] 		at org.apache.solr.core.SolrCore.execute(SolrCore.java:1701)
      [mvn] 		at org.apache.solr.util.TestHarness.query(TestHarness.java:364)
      [mvn] 		at org.apache.solr.util.TestHarness.query(TestHarness.java:346)
      [mvn] 		at org.apache.solr.SolrTestCaseJ4.assertQEx(SolrTestCaseJ4.java:611)
      [mvn] 		at org.apache.solr.request.SimpleFacetsTest.testRangeFacetInfiniteLoopDetection(SimpleFacetsTest.java:2086)
      [mvn] 		at sun.reflect.NativeMethodAccessorImpl.invoke0(Native Method)
      [mvn] 		at sun.reflect.NativeMethodAccessorImpl.invoke(NativeMethodAccessorImpl.java:57)
      [mvn] 		at sun.reflect.DelegatingMethodAccessorImpl.invoke(DelegatingMethodAccessorImpl.java:43)
      [mvn] 		at java.lang.reflect.Method.invoke(Method.java:616)
      [mvn] 		at com.carrotsearch.randomizedtesting.RandomizedRunner.invoke(RandomizedRunner.java:1559)
      [mvn] 		at com.carrotsearch.randomizedtesting.RandomizedRunner.access$600(RandomizedRunner.java:79)
      [mvn] 		at com.carrotsearch.randomizedtesting.RandomizedRunner$6.evaluate(RandomizedRunner.java:737)
      [mvn] 		at com.carrotsearch.randomizedtesting.RandomizedRunner$7.evaluate(RandomizedRunner.java:773)
      [mvn] 		at com.carrotsearch.randomizedtesting.RandomizedRunner$8.evaluate(RandomizedRunner.java:787)
      [mvn] 		at com.carrotsearch.randomizedtesting.rules.SystemPropertiesRestoreRule$1.evaluate(SystemPropertiesRestoreRule.java:53)
      [mvn] 		at org.apache.lucene.util.TestRuleSetupTeardownChained$1.evaluate(TestRuleSetupTeardownChained.java:50)
      [mvn] 		at org.apache.lucene.util.TestRuleFieldCacheSanity$1.evaluate(TestRuleFieldCacheSanity.java:51)
      [mvn] 		at org.apache.lucene.util.AbstractBeforeAfterRule$1.evaluate(AbstractBeforeAfterRule.java:45)
      [mvn] 		at com.carrotsearch.randomizedtesting.rules.SystemPropertiesInvariantRule$1.evaluate(SystemPropertiesInvariantRule.java:55)
      [mvn] 		at org.apache.lucene.util.TestRuleThreadAndTestName$1.evaluate(TestRuleThreadAndTestName.java:48)
      [mvn] 		at org.apache.lucene.util.TestRuleIgnoreAfterMaxFailures$1.evaluate(TestRuleIgnoreAfterMaxFailures.java:70)
      [mvn] 		at org.apache.lucene.util.TestRuleMarkFailure$1.evaluate(TestRuleMarkFailure.java:48)
      [mvn] 		at com.carrotsearch.randomizedtesting.rules.StatementAdapter.evaluate(StatementAdapter.java:36)
      [mvn] 		at com.carrotsearch.randomizedtesting.ThreadLeakControl$StatementRunner.run(ThreadLeakControl.java:358)
      [mvn] 		at com.carrotsearch.randomizedtesting.ThreadLeakControl.forkTimeoutingTask(ThreadLeakControl.java:782)
      [mvn] 		at com.carrotsearch.randomizedtesting.ThreadLeakControl$3.evaluate(ThreadLeakControl.java:442)
      [mvn] 		at com.carrotsearch.randomizedtesting.RandomizedRunner.runSingleTest(RandomizedRunner.java:746)
      [mvn] 		at com.carrotsearch.randomizedtesting.RandomizedRunner$3.evaluate(RandomizedRunner.java:648)
      [mvn] 		at com.carrotsearch.randomizedtesting.RandomizedRunner$4.evaluate(RandomizedRunner.java:682)
      [mvn] 		at com.carrotsearch.randomizedtesting.RandomizedRunner$5.evaluate(RandomizedRunner.java:693)
      [mvn] 		at com.carrotsearch.randomizedtesting.rules.StatementAdapter.evaluate(StatementAdapter.java:36)
      [mvn] 		at com.carrotsearch.randomizedtesting.rules.SystemPropertiesRestoreRule$1.evaluate(SystemPropertiesRestoreRule.java:53)
      [mvn] 		at org.apache.lucene.util.AbstractBeforeAfterRule$1.evaluate(AbstractBeforeAfterRule.java:45)
      [mvn] 		at org.apache.lucene.util.TestRuleStoreClassName$1.evaluate(TestRuleStoreClassName.java:42)
      [mvn] 		at com.carrotsearch.randomizedtesting.rules.SystemPropertiesInvariantRule$1.evaluate(SystemPropertiesInvariantRule.java:55)
      [mvn] 		at com.carrotsearch.randomizedtesting.rules.NoShadowingOrOverridesOnMethodsRule$1.evaluate(NoShadowingOrOverridesOnMethodsRule.java:39)
      [mvn] 		at com.carrotsearch.randomizedtesting.rules.NoShadowingOrOverridesOnMethodsRule$1.evaluate(NoShadowingOrOverridesOnMethodsRule.java:39)
      [mvn] 		at com.carrotsearch.randomizedtesting.rules.StatementAdapter.evaluate(StatementAdapter.java:36)
      [mvn] 		at org.apache.lucene.util.TestRuleAssertionsRequired$1.evaluate(TestRuleAssertionsRequired.java:43)
      [mvn] 		at org.apache.lucene.util.TestRuleMarkFailure$1.evaluate(TestRuleMarkFailure.java:48)
      [mvn] 		at org.apache.lucene.util.TestRuleIgnoreAfterMaxFailures$1.evaluate(TestRuleIgnoreAfterMaxFailures.java:70)
      [mvn] 		at org.apache.lucene.util.TestRuleIgnoreTestSuites$1.evaluate(TestRuleIgnoreTestSuites.java:55)
      [mvn] 		at com.carrotsearch.randomizedtesting.rules.StatementAdapter.evaluate(StatementAdapter.java:36)
      [mvn] 		at com.carrotsearch.randomizedtesting.ThreadLeakControl$StatementRunner.run(ThreadLeakControl.java:358)
      [mvn] 		at java.lang.Thread.run(Thread.java:679)
      [mvn] 	
      [mvn] 2648 T1222 C1 oasc.SolrException.log SEVERE org.apache.solr.common.SolrException: range facet infinite loop: gap is either zero, or too small relative start/end and caused underflow: 9.9E12 + 0.0003 = 9.9E12
      [mvn] 		at org.apache.solr.request.SimpleFacets.getFacetRangeCounts(SimpleFacets.java:1122)
      [mvn] 		at org.apache.solr.request.SimpleFacets.getFacetRangeCounts(SimpleFacets.java:1074)
      [mvn] 		at org.apache.solr.request.SimpleFacets.getFacetRangeCounts(SimpleFacets.java:1018)
      [mvn] 		at org.apache.solr.request.SimpleFacets.getFacetCounts(SimpleFacets.java:208)
      [mvn] 		at org.apache.solr.handler.component.FacetComponent.process(FacetComponent.java:87)
      [mvn] 		at org.apache.solr.handler.component.SearchHandler.handleRequestBody(SearchHandler.java:206)
      [mvn] 		at org.apache.solr.handler.RequestHandlerBase.handleRequest(RequestHandlerBase.java:129)
      [mvn] 		at org.apache.solr.core.SolrCore.execute(SolrCore.java:1701)
      [mvn] 		at org.apache.solr.util.TestHarness.query(TestHarness.java:364)
      [mvn] 		at org.apache.solr.util.TestHarness.query(TestHarness.java:346)
      [mvn] 		at org.apache.solr.SolrTestCaseJ4.assertQEx(SolrTestCaseJ4.java:611)
      [mvn] 		at org.apache.solr.request.SimpleFacetsTest.testRangeFacetInfiniteLoopDetection(SimpleFacetsTest.java:2086)
      [mvn] 		at sun.reflect.NativeMethodAccessorImpl.invoke0(Native Method)
      [mvn] 		at sun.reflect.NativeMethodAccessorImpl.invoke(NativeMethodAccessorImpl.java:57)
      [mvn] 		at sun.reflect.DelegatingMethodAccessorImpl.invoke(DelegatingMethodAccessorImpl.java:43)
      [mvn] 		at java.lang.reflect.Method.invoke(Method.java:616)
      [mvn] 		at com.carrotsearch.randomizedtesting.RandomizedRunner.invoke(RandomizedRunner.java:1559)
      [mvn] 		at com.carrotsearch.randomizedtesting.RandomizedRunner.access$600(RandomizedRunner.java:79)
      [mvn] 		at com.carrotsearch.randomizedtesting.RandomizedRunner$6.evaluate(RandomizedRunner.java:737)
      [mvn] 		at com.carrotsearch.randomizedtesting.RandomizedRunner$7.evaluate(RandomizedRunner.java:773)
      [mvn] 		at com.carrotsearch.randomizedtesting.RandomizedRunner$8.evaluate(RandomizedRunner.java:787)
      [mvn] 		at com.carrotsearch.randomizedtesting.rules.SystemPropertiesRestoreRule$1.evaluate(SystemPropertiesRestoreRule.java:53)
      [mvn] 		at org.apache.lucene.util.TestRuleSetupTeardownChained$1.evaluate(TestRuleSetupTeardownChained.java:50)
      [mvn] 		at org.apache.lucene.util.TestRuleFieldCacheSanity$1.evaluate(TestRuleFieldCacheSanity.java:51)
      [mvn] 		at org.apache.lucene.util.AbstractBeforeAfterRule$1.evaluate(AbstractBeforeAfterRule.java:45)
      [mvn] 		at com.carrotsearch.randomizedtesting.rules.SystemPropertiesInvariantRule$1.evaluate(SystemPropertiesInvariantRule.java:55)
      [mvn] 		at org.apache.lucene.util.TestRuleThreadAndTestName$1.evaluate(TestRuleThreadAndTestName.java:48)
      [mvn] 		at org.apache.lucene.util.TestRuleIgnoreAfterMaxFailures$1.evaluate(TestRuleIgnoreAfterMaxFailures.java:70)
      [mvn] 		at org.apache.lucene.util.TestRuleMarkFailure$1.evaluate(TestRuleMarkFailure.java:48)
      [mvn] 		at com.carrotsearch.randomizedtesting.rules.StatementAdapter.evaluate(StatementAdapter.java:36)
      [mvn] 		at com.carrotsearch.randomizedtesting.ThreadLeakControl$StatementRunner.run(ThreadLeakControl.java:358)
      [mvn] 		at com.carrotsearch.randomizedtesting.ThreadLeakControl.forkTimeoutingTask(ThreadLeakControl.java:782)
      [mvn] 		at com.carrotsearch.randomizedtesting.ThreadLeakControl$3.evaluate(ThreadLeakControl.java:442)
      [mvn] 		at com.carrotsearch.randomizedtesting.RandomizedRunner.runSingleTest(RandomizedRunner.java:746)
      [mvn] 		at com.carrotsearch.randomizedtesting.RandomizedRunner$3.evaluate(RandomizedRunner.java:648)
      [mvn] 		at com.carrotsearch.randomizedtesting.RandomizedRunner$4.evaluate(RandomizedRunner.java:682)
      [mvn] 		at com.carrotsearch.randomizedtesting.RandomizedRunner$5.evaluate(RandomizedRunner.java:693)
      [mvn] 		at com.carrotsearch.randomizedtesting.rules.StatementAdapter.evaluate(StatementAdapter.java:36)
      [mvn] 		at com.carrotsearch.randomizedtesting.rules.SystemPropertiesRestoreRule$1.evaluate(SystemPropertiesRestoreRule.java:53)
      [mvn] 		at org.apache.lucene.util.AbstractBeforeAfterRule$1.evaluate(AbstractBeforeAfterRule.java:45)
      [mvn] 		at org.apache.lucene.util.TestRuleStoreClassName$1.evaluate(TestRuleStoreClassName.java:42)
      [mvn] 		at com.carrotsearch.randomizedtesting.rules.SystemPropertiesInvariantRule$1.evaluate(SystemPropertiesInvariantRule.java:55)
      [mvn] 		at com.carrotsearch.randomizedtesting.rules.NoShadowingOrOverridesOnMethodsRule$1.evaluate(NoShadowingOrOverridesOnMethodsRule.java:39)
      [mvn] 		at com.carrotsearch.randomizedtesting.rules.NoShadowingOrOverridesOnMethodsRule$1.evaluate(NoShadowingOrOverridesOnMethodsRule.java:39)
      [mvn] 		at com.carrotsearch.randomizedtesting.rules.StatementAdapter.evaluate(StatementAdapter.java:36)
      [mvn] 		at org.apache.lucene.util.TestRuleAssertionsRequired$1.evaluate(TestRuleAssertionsRequired.java:43)
      [mvn] 		at org.apache.lucene.util.TestRuleMarkFailure$1.evaluate(TestRuleMarkFailure.java:48)
      [mvn] 		at org.apache.lucene.util.TestRuleIgnoreAfterMaxFailures$1.evaluate(TestRuleIgnoreAfterMaxFailures.java:70)
      [mvn] 		at org.apache.lucene.util.TestRuleIgnoreTestSuites$1.evaluate(TestRuleIgnoreTestSuites.java:55)
      [mvn] 		at com.carrotsearch.randomizedtesting.rules.StatementAdapter.evaluate(StatementAdapter.java:36)
      [mvn] 		at com.carrotsearch.randomizedtesting.ThreadLeakControl$StatementRunner.run(ThreadLeakControl.java:358)
      [mvn] 		at java.lang.Thread.run(Thread.java:679)
      [mvn] 	
      [mvn] Tests run: 32, Failures: 0, Errors: 0, Skipped: 0, Time elapsed: 3.01 sec
      [mvn] Running org.apache.solr.schema.TestBinaryField
      [mvn] Tests run: 1, Failures: 0, Errors: 0, Skipped: 0, Time elapsed: 0.198 sec
      [mvn] Running org.apache.solr.highlight.HighlighterConfigTest
      [mvn] Tests run: 1, Failures: 0, Errors: 0, Skipped: 0, Time elapsed: 0.374 sec
      [mvn] Running org.apache.solr.spelling.SpellCheckCollatorTest
      [mvn] Creating dataDir: /usr/home/hudson/hudson-slave/workspace/Lucene-Solr-Maven-4.x/maven-build/solr/core/src/test/target/test/./solrtest-SpellCheckCollatorTest-1347707577795
      [mvn] Tests run: 7, Failures: 0, Errors: 0, Skipped: 0, Time elapsed: 2.149 sec
      [mvn] Running org.apache.solr.AnalysisAfterCoreReloadTest
      [mvn] Tests run: 1, Failures: 0, Errors: 0, Skipped: 0, Time elapsed: 1.711 sec
      [mvn] Running org.apache.solr.update.PeerSyncTest
      [mvn] Tests run: 1, Failures: 0, Errors: 0, Skipped: 0, Time elapsed: 2.681 sec
      [mvn] Running org.apache.solr.search.TestLRUCache
      [mvn] Tests run: 3, Failures: 0, Errors: 0, Skipped: 0, Time elapsed: 0.025 sec
      [mvn] Running org.apache.solr.search.TestQueryTypes
      [mvn] Tests run: 1, Failures: 0, Errors: 0, Skipped: 0, Time elapsed: 0.543 sec
      [mvn] Running org.apache.solr.search.TestRTGBase
      [mvn] Tests run: 0, Failures: 0, Errors: 0, Skipped: 0, Time elapsed: 0.004 sec
      [mvn] Running org.apache.solr.request.TestWriterPerf
      [mvn] Tests run: 1, Failures: 0, Errors: 0, Skipped: 0, Time elapsed: 0.923 sec
      [mvn] Running org.apache.solr.core.TestQuerySenderNoQuery
      [mvn] Creating dataDir: /usr/home/hudson/hudson-slave/workspace/Lucene-Solr-Maven-4.x/maven-build/solr/core/src/test/target/test/./solrtest-TestQuerySenderNoQuery-1347707585838
      [mvn] Tests run: 3, Failures: 0, Errors: 0, Skipped: 0, Time elapsed: 0.402 sec
      [mvn] Running org.apache.solr.util.TestFastWriter
      [mvn] Tests run: 1, Failures: 0, Errors: 0, Skipped: 0, Time elapsed: 0.247 sec
      [mvn] Running org.apache.solr.search.function.SortByFunctionTest
      [mvn] Tests run: 2, Failures: 0, Errors: 0, Skipped: 0, Time elapsed: 1.159 sec
      [mvn] Running org.apache.solr.search.TestSurroundQueryParser
      [mvn] Tests run: 1, Failures: 0, Errors: 0, Skipped: 0, Time elapsed: 0.491 sec
      [mvn] Running org.apache.solr.TestDistributedGrouping
      [mvn] Tests run: 1, Failures: 0, Errors: 0, Skipped: 0, Time elapsed: 11.135 sec
      [mvn] Running org.apache.solr.cloud.ZkCLITest
      [mvn] Creating dataDir: /usr/home/hudson/hudson-slave/workspace/Lucene-Solr-Maven-4.x/maven-build/solr/core/src/test/target/test/./solrtest-ZkCLITest-1347707599281
      [mvn] Creating dataDir: /usr/home/hudson/hudson-slave/workspace/Lucene-Solr-Maven-4.x/maven-build/solr/core/src/test/target/test/./solrtest-ZkCLITest-1347707600311
      [mvn] Creating dataDir: /usr/home/hudson/hudson-slave/workspace/Lucene-Solr-Maven-4.x/maven-build/solr/core/src/test/target/test/./solrtest-ZkCLITest-1347707601768
      [mvn] Tests run: 3, Failures: 0, Errors: 0, Skipped: 0, Time elapsed: 2.761 sec
      [mvn] Running org.apache.solr.core.TestBadConfig
      [mvn] Creating dataDir: /usr/home/hudson/hudson-slave/workspace/Lucene-Solr-Maven-4.x/maven-build/solr/core/src/test/target/test/./solrtest-TestBadConfig-1347707602046
      [mvn] 401 T1511 oasup.StatelessScriptUpdateProcessorFactory.inform SEVERE Unable to initialize scripts: Unable to evaluate script: currency.xml Ignoring exception matching \Qcurrency.xml\E
      [mvn] Creating dataDir: /usr/home/hudson/hudson-slave/workspace/Lucene-Solr-Maven-4.x/maven-build/solr/core/src/test/target/test/./solrtest-TestBadConfig-1347707602446
      [mvn] Creating dataDir: /usr/home/hudson/hudson-slave/workspace/Lucene-Solr-Maven-4.x/maven-build/solr/core/src/test/target/test/./solrtest-TestBadConfig-1347707602461
      [mvn] 567 T3 oasc.CoreContainer.finalize SEVERE CoreContainer was not shutdown prior to finalize(), indicates a bug -- POSSIBLE RESOURCE LEAK!!!  instance=1952097414
      [mvn] 804 T1511 oasup.StatelessScriptUpdateProcessorFactory.inform SEVERE Unable to initialize scripts: No ScriptEngine found by name: giberish -- supported names: js, rhino, JavaScript, javascript, ECMAScript, ecmascript Ignoring exception matching \Qgiberish\E
      [mvn] Creating dataDir: /usr/home/hudson/hudson-slave/workspace/Lucene-Solr-Maven-4.x/maven-build/solr/core/src/test/target/test/./solrtest-TestBadConfig-1347707602856
      [mvn] 945 T3 oasc.CoreContainer.finalize SEVERE CoreContainer was not shutdown prior to finalize(), indicates a bug -- POSSIBLE RESOURCE LEAK!!!  instance=2083480925
      [mvn] 1193 T1511 oasup.StatelessScriptUpdateProcessorFactory.inform SEVERE Unable to initialize scripts: Unable to evaluate script: a-file-name-that-does-not-exist.js Ignoring exception matching \Qa-file-name-that-does-not-exist.js\E
      [mvn] Creating dataDir: /usr/home/hudson/hudson-slave/workspace/Lucene-Solr-Maven-4.x/maven-build/solr/core/src/test/target/test/./solrtest-TestBadConfig-1347707603236
      [mvn] Creating dataDir: /usr/home/hudson/hudson-slave/workspace/Lucene-Solr-Maven-4.x/maven-build/solr/core/src/test/target/test/./solrtest-TestBadConfig-1347707603291
      [mvn] 1345 T3 oasc.SolrCore.finalize SEVERE REFCOUNT ERROR: unreferenced org.apache.solr.core.SolrCore@37555c7c (collection1) has a reference count of 1
      [mvn] 1346 T3 oasc.CoreContainer.finalize SEVERE CoreContainer was not shutdown prior to finalize(), indicates a bug -- POSSIBLE RESOURCE LEAK!!!  instance=404330708
      [mvn] 1346 T3 oasc.CoreContainer.finalize SEVERE CoreContainer was not shutdown prior to finalize(), indicates a bug -- POSSIBLE RESOURCE LEAK!!!  instance=174094521
      [mvn] 1608 T1511 oasu.UpdateLog.init SEVERE Unable to use updateLog: _version_field must exist in schema, using indexed="true" stored="true" and multiValued="false" (_version_ does not exist) Ignoring exception matching \Q_version_\E
      [mvn] Tests run: 6, Failures: 0, Errors: 0, Skipped: 0, Time elapsed: 1.628 sec
      [mvn] Running org.apache.solr.SolrInfoMBeanTest
      [mvn] Creating dataDir: /usr/home/hudson/hudson-slave/workspace/Lucene-Solr-Maven-4.x/maven-build/solr/core/src/test/target/test/./solrtest-SolrInfoMBeanTest-1347707603667
      [mvn] Tests run: 1, Failures: 0, Errors: 0, Skipped: 0, Time elapsed: 0.55 sec
      [mvn] Running org.apache.solr.handler.component.SearchHandlerTest
      [mvn] Creating dataDir: /usr/home/hudson/hudson-slave/workspace/Lucene-Solr-Maven-4.x/maven-build/solr/core/src/test/target/test/./solrtest-SearchHandlerTest-1347707604223
      [mvn] Tests run: 1, Failures: 0, Errors: 0, Skipped: 0, Time elapsed: 0.531 sec
      [mvn] Running org.apache.solr.util.DateMathParserTest
      [mvn] Tests run: 8, Failures: 0, Errors: 0, Skipped: 0, Time elapsed: 0.047 sec
      [mvn] Running org.apache.solr.search.TestRealTimeGet
      [mvn] Creating dataDir: /usr/home/hudson/hudson-slave/workspace/Lucene-Solr-Maven-4.x/maven-build/solr/core/src/test/target/test/./solrtest-TestRealTimeGet-1347707604801
      [mvn] Tests run: 4, Failures: 0, Errors: 0, Skipped: 0, Time elapsed: 2.291 sec
      [mvn] Running org.apache.solr.cloud.ClusterStateTest
      [mvn] Tests run: 1, Failures: 0, Errors: 0, Skipped: 0, Time elapsed: 0.019 sec
      [mvn] Running org.apache.solr.schema.MultiTermTest
      [mvn] Creating dataDir: /usr/home/hudson/hudson-slave/workspace/Lucene-Solr-Maven-4.x/maven-build/solr/core/src/test/target/test/./solrtest-MultiTermTest-1347707607116
      [mvn] Tests run: 3, Failures: 0, Errors: 0, Skipped: 0, Time elapsed: 0.227 sec
      [mvn] Running org.apache.solr.schema.PreAnalyzedFieldTest
      [mvn] Tests run: 3, Failures: 0, Errors: 0, Skipped: 0, Time elapsed: 0.028 sec
      [mvn] Running org.apache.solr.response.TestCSVResponseWriter
      [mvn] Creating dataDir: /usr/home/hudson/hudson-slave/workspace/Lucene-Solr-Maven-4.x/maven-build/solr/core/src/test/target/test/./solrtest-TestCSVResponseWriter-1347707607371
      [mvn] Tests run: 1, Failures: 0, Errors: 0, Skipped: 0, Time elapsed: 0.455 sec
      [mvn] Running org.apache.solr.analysis.TestReversedWildcardFilterFactory
      [mvn] Creating dataDir: /usr/home/hudson/hudson-slave/workspace/Lucene-Solr-Maven-4.x/maven-build/solr/core/src/test/target/test/./solrtest-TestReversedWildcardFilterFactory-1347707607822
      [mvn] Tests run: 4, Failures: 0, Errors: 0, Skipped: 0, Time elapsed: 0.323 sec
      [mvn] Running org.apache.solr.internal.csv.CSVUtilsTest
      [mvn] Tests run: 14, Failures: 0, Errors: 0, Skipped: 0, Time elapsed: 0.003 sec
      [mvn] Running org.apache.solr.util.SimplePostToolTest
      [mvn] Entering crawl at level 0 (1 links total, 1 new)
      [mvn] POSTed web resource http://example.com (depth: 0)
      [mvn] Entering crawl at level 1 (2 links total, 2 new)
      [mvn] POSTed web resource http://example.com/page2 (depth: 1)
      [mvn] POSTed web resource http://example.com/page1 (depth: 1)
      [mvn] Entering crawl at level 2 (2 links total, 2 new)
      [mvn] SimplePostTool: WARNING: The URL http://example.com/disallowed returned a HTTP result status of 403
      [mvn] POSTed web resource http://example.com/page1/foo (depth: 2)
      [mvn] Entering crawl at level 3 (1 links total, 1 new)
      [mvn] POSTed web resource http://example.com/page1/foo/bar (depth: 3)
      [mvn] Entering crawl at level 0 (1 links total, 1 new)
      [mvn] POSTed web resource http://example.com (depth: 0)
      [mvn] Entering crawl at level 1 (2 links total, 2 new)
      [mvn] POSTed web resource http://example.com/page2 (depth: 1)
      [mvn] POSTed web resource http://example.com/page1 (depth: 1)
      [mvn] Entering crawl at level 0 (1 links total, 1 new)
      [mvn] POSTed web resource http://example.com (depth: 0)
      [mvn] Entering crawl at level 1 (2 links total, 2 new)
      [mvn] POSTed web resource http://example.com/page2 (depth: 1)
      [mvn] POSTed web resource http://example.com/page1 (depth: 1)
      [mvn] Entering crawl at level 2 (2 links total, 2 new)
      [mvn] POSTed web resource http://example.com/disallowed (depth: 2)
      [mvn] POSTed web resource http://example.com/page1/foo (depth: 2)
      [mvn] Entering crawl at level 3 (1 links total, 1 new)
      [mvn] POSTed web resource http://example.com/page1/foo/bar (depth: 3)
      [mvn] Indexing directory /usr/home/hudson/hudson-slave/workspace/Lucene-Solr-Maven-4.x/maven-build/solr/core/src/test/target/test-classes/exampledocs (2 files, depth=0)
      [mvn] POSTing file example.txt (text/plain)
      [mvn] POSTing file example.html (text/html)
      [mvn] Tests run: 11, Failures: 0, Errors: 0, Skipped: 0, Time elapsed: 0.382 sec
      [mvn] Running org.apache.solr.analysis.TestWordDelimiterFilterFactory
      [mvn] Creating dataDir: /usr/home/hudson/hudson-slave/workspace/Lucene-Solr-Maven-4.x/maven-build/solr/core/src/test/target/test/./solrtest-TestWordDelimiterFilterFactory-1347707608533
      [mvn] Tests run: 7, Failures: 0, Errors: 0, Skipped: 0, Time elapsed: 0.575 sec
      [mvn] Running org.apache.solr.handler.component.BadComponentTest
      [mvn] Creating dataDir: /usr/home/hudson/hudson-slave/workspace/Lucene-Solr-Maven-4.x/maven-build/solr/core/src/test/target/test/./solrtest-BadComponentTest-1347707609110
      [mvn] Tests run: 1, Failures: 0, Errors: 0, Skipped: 0, Time elapsed: 0.265 sec
      [mvn] Running org.apache.solr.core.SOLR749Test
      [mvn] Creating dataDir: /usr/home/hudson/hudson-slave/workspace/Lucene-Solr-Maven-4.x/maven-build/solr/core/src/test/target/test/./solrtest-SOLR749Test-1347707609374
      [mvn] Tests run: 1, Failures: 0, Errors: 0, Skipped: 0, Time elapsed: 0.31 sec
      [mvn] Running org.apache.solr.update.processor.DefaultValueUpdateProcessorTest
      [mvn] Creating dataDir: /usr/home/hudson/hudson-slave/workspace/Lucene-Solr-Maven-4.x/maven-build/solr/core/src/test/target/test/./solrtest-DefaultValueUpdateProcessorTest-1347707609685
      [mvn] Tests run: 1, Failures: 0, Errors: 0, Skipped: 0, Time elapsed: 0.269 sec
      [mvn] Running org.apache.solr.handler.component.SpellCheckComponentTest
      [mvn] Creating dataDir: /usr/home/hudson/hudson-slave/workspace/Lucene-Solr-Maven-4.x/maven-build/solr/core/src/test/target/test/./solrtest-SpellCheckComponentTest-1347707609955
      [mvn] Tests run: 9, Failures: 0, Errors: 0, Skipped: 0, Time elapsed: 6.243 sec
      [mvn] Running org.apache.solr.update.TestUpdate
      [mvn] Creating dataDir: /usr/home/hudson/hudson-slave/workspace/Lucene-Solr-Maven-4.x/maven-build/solr/core/src/test/target/test/./solrtest-TestUpdate-1347707616203
      [mvn] Tests run: 1, Failures: 0, Errors: 0, Skipped: 0, Time elapsed: 0.564 sec
      [mvn] Running org.apache.solr.handler.component.TermsComponentTest
      [mvn] Creating dataDir: /usr/home/hudson/hudson-slave/workspace/Lucene-Solr-Maven-4.x/maven-build/solr/core/src/test/target/test/./solrtest-TermsComponentTest-1347707616764
      [mvn] Tests run: 13, Failures: 0, Errors: 0, Skipped: 0, Time elapsed: 0.438 sec
      [mvn] Running org.apache.solr.cloud.ChaosMonkeyNothingIsSafeTest
      [mvn] Tests run: 1, Failures: 0, Errors: 0, Skipped: 1, Time elapsed: 0 sec
      [mvn] Running org.apache.solr.internal.csv.CSVStrategyTest
      [mvn] Tests run: 5, Failures: 0, Errors: 0, Skipped: 0, Time elapsed: 0 sec
      [mvn] Running org.apache.solr.update.DirectUpdateHandlerTest
      [mvn] Creating dataDir: /usr/home/hudson/hudson-slave/workspace/Lucene-Solr-Maven-4.x/maven-build/solr/core/src/test/target/test/./solrtest-DirectUpdateHandlerTest-1347707617207
      [mvn] Creating dataDir: /usr/home/hudson/hudson-slave/workspace/Lucene-Solr-Maven-4.x/maven-build/solr/core/src/test/target/test/./solrtest-DirectUpdateHandlerTest-1347707617702
      [mvn] Creating dataDir: /usr/home/hudson/hudson-slave/workspace/Lucene-Solr-Maven-4.x/maven-build/solr/core/src/test/target/test/./solrtest-DirectUpdateHandlerTest-1347707618393
      [mvn] Tests run: 6, Failures: 0, Errors: 0, Skipped: 0, Time elapsed: 1.755 sec
      [mvn] Running org.apache.solr.core.TestJmxIntegration
      [mvn] Tests run: 3, Failures: 0, Errors: 0, Skipped: 1, Time elapsed: 1.222 sec
      [mvn] Running org.apache.solr.core.TestArbitraryIndexDir
      [mvn] Tests run: 1, Failures: 0, Errors: 0, Skipped: 0, Time elapsed: 0.56 sec
      [mvn] Running org.apache.solr.core.TestJmxMonitoredMap
      [mvn] Tests run: 2, Failures: 0, Errors: 0, Skipped: 0, Time elapsed: 0.134 sec
      [mvn] Running org.apache.solr.schema.BadIndexSchemaTest
      [mvn] Creating dataDir: /usr/home/hudson/hudson-slave/workspace/Lucene-Solr-Maven-4.x/maven-build/solr/core/src/test/target/test/./solrtest-BadIndexSchemaTest-1347707620890
      [mvn] Creating dataDir: /usr/home/hudson/hudson-slave/workspace/Lucene-Solr-Maven-4.x/maven-build/solr/core/src/test/target/test/./solrtest-BadIndexSchemaTest-1347707620973
      [mvn] 183 T1628 oasc.SolrCore.initCodec SEVERE FieldType 'pulsing1' is configured with a postings format, but the codec does not support it: class org.apache.solr.core.SolrCore$3
      [mvn] Creating dataDir: /usr/home/hudson/hudson-slave/workspace/Lucene-Solr-Maven-4.x/maven-build/solr/core/src/test/target/test/./solrtest-BadIndexSchemaTest-1347707621074
      [mvn] Creating dataDir: /usr/home/hudson/hudson-slave/workspace/Lucene-Solr-Maven-4.x/maven-build/solr/core/src/test/target/test/./solrtest-BadIndexSchemaTest-1347707621155
      [mvn] Creating dataDir: /usr/home/hudson/hudson-slave/workspace/Lucene-Solr-Maven-4.x/maven-build/solr/core/src/test/target/test/./solrtest-BadIndexSchemaTest-1347707621237
      [mvn] 428 T1628 oass.IndexSchema.readSchema SEVERE FieldType 'sim1' is configured with a similarity, but the global similarity does not support it: class org.apache.solr.search.similarities.DefaultSimilarityFactory
      [mvn] Creating dataDir: /usr/home/hudson/hudson-slave/workspace/Lucene-Solr-Maven-4.x/maven-build/solr/core/src/test/target/test/./solrtest-BadIndexSchemaTest-1347707621319
      [mvn] Creating dataDir: /usr/home/hudson/hudson-slave/workspace/Lucene-Solr-Maven-4.x/maven-build/solr/core/src/test/target/test/./solrtest-BadIndexSchemaTest-1347707621397
      [mvn] Creating dataDir: /usr/home/hudson/hudson-slave/workspace/Lucene-Solr-Maven-4.x/maven-build/solr/core/src/test/target/test/./solrtest-BadIndexSchemaTest-1347707621479
      [mvn] 628 T3 oasc.CoreContainer.finalize SEVERE CoreContainer was not shutdown prior to finalize(), indicates a bug -- POSSIBLE RESOURCE LEAK!!!  instance=2002192902
      [mvn] 629 T3 oasc.SolrCore.finalize SEVERE REFCOUNT ERROR: unreferenced org.apache.solr.core.SolrCore@73534d1f (collection1) has a reference count of 1
      [mvn] Creating dataDir: /usr/home/hudson/hudson-slave/workspace/Lucene-Solr-Maven-4.x/maven-build/solr/core/src/test/target/test/./solrtest-BadIndexSchemaTest-1347707621565
      [mvn] Creating dataDir: /usr/home/hudson/hudson-slave/workspace/Lucene-Solr-Maven-4.x/maven-build/solr/core/src/test/target/test/./solrtest-BadIndexSchemaTest-1347707621626
      [mvn] Creating dataDir: /usr/home/hudson/hudson-slave/workspace/Lucene-Solr-Maven-4.x/maven-build/solr/core/src/test/target/test/./solrtest-BadIndexSchemaTest-1347707621680
      [mvn] Creating dataDir: /usr/home/hudson/hudson-slave/workspace/Lucene-Solr-Maven-4.x/maven-build/solr/core/src/test/target/test/./solrtest-BadIndexSchemaTest-1347707621730
      [mvn] Creating dataDir: /usr/home/hudson/hudson-slave/workspace/Lucene-Solr-Maven-4.x/maven-build/solr/core/src/test/target/test/./solrtest-BadIndexSchemaTest-1347707621781
      [mvn] Creating dataDir: /usr/home/hudson/hudson-slave/workspace/Lucene-Solr-Maven-4.x/maven-build/solr/core/src/test/target/test/./solrtest-BadIndexSchemaTest-1347707621832
      [mvn] Creating dataDir: /usr/home/hudson/hudson-slave/workspace/Lucene-Solr-Maven-4.x/maven-build/solr/core/src/test/target/test/./solrtest-BadIndexSchemaTest-1347707621888
      [mvn] 1053 T1628 oass.IndexSchema.readSchema SEVERE uniqueKey field (id) can not be the dest of a copyField (src=XXX)
      [mvn] Creating dataDir: /usr/home/hudson/hudson-slave/workspace/Lucene-Solr-Maven-4.x/maven-build/solr/core/src/test/target/test/./solrtest-BadIndexSchemaTest-1347707621940
      [mvn] 1105 T1628 oass.IndexSchema.readSchema SEVERE uniqueKey field (null) can not be configured with a default value (XXX)
      [mvn] Creating dataDir: /usr/home/hudson/hudson-slave/workspace/Lucene-Solr-Maven-4.x/maven-build/solr/core/src/test/target/test/./solrtest-BadIndexSchemaTest-1347707621993
      [mvn] 1157 T1628 oass.IndexSchema.readSchema SEVERE uniqueKey field (null) can not be configured to be multivalued
      [mvn] Creating dataDir: /usr/home/hudson/hudson-slave/workspace/Lucene-Solr-Maven-4.x/maven-build/solr/core/src/test/target/test/./solrtest-BadIndexSchemaTest-1347707622047
      [mvn] Tests run: 10, Failures: 0, Errors: 0, Skipped: 0, Time elapsed: 1.235 sec
      [mvn] Running org.apache.solr.handler.FieldAnalysisRequestHandlerTest
      [mvn] Creating dataDir: /usr/home/hudson/hudson-slave/workspace/Lucene-Solr-Maven-4.x/maven-build/solr/core/src/test/target/test/./solrtest-FieldAnalysisRequestHandlerTest-1347707622118
      [mvn] Tests run: 4, Failures: 0, Errors: 0, Skipped: 0, Time elapsed: 0.383 sec
      [mvn] Running org.apache.solr.search.TestFastLRUCache
      [mvn] Tests run: 7, Failures: 0, Errors: 0, Skipped: 0, Time elapsed: 0.066 sec
      [mvn] Running org.apache.solr.search.similarities.TestLMDirichletSimilarityFactory
      [mvn] 446 T3 oasu.ConcurrentLRUCache.finalize SEVERE ConcurrentLRUCache was not destroyed prior to finalize(), indicates a bug -- POSSIBLE RESOURCE LEAK!!!
      [mvn] Creating dataDir: /usr/home/hudson/hudson-slave/workspace/Lucene-Solr-Maven-4.x/maven-build/solr/core/src/test/target/test/./solrtest-TestLMDirichletSimilarityFactory-1347707622573
      [mvn] Tests run: 2, Failures: 0, Errors: 0, Skipped: 0, Time elapsed: 0.076 sec
      [mvn] Running org.apache.solr.core.TestPropInjectDefaults
      [mvn] Creating dataDir: /usr/home/hudson/hudson-slave/workspace/Lucene-Solr-Maven-4.x/maven-build/solr/core/src/test/target/test/./solrtest-TestPropInjectDefaults-1347707622644
      [mvn] Tests run: 2, Failures: 0, Errors: 0, Skipped: 0, Time elapsed: 0.286 sec
      [mvn] Running org.apache.solr.TestRandomFaceting
      [mvn] Creating dataDir: /usr/home/hudson/hudson-slave/workspace/Lucene-Solr-Maven-4.x/maven-build/solr/core/src/test/target/test/./solrtest-TestRandomFaceting-1347707622931
      [mvn] 9177 T3 oasc.CoreContainer.finalize SEVERE CoreContainer was not shutdown prior to finalize(), indicates a bug -- POSSIBLE RESOURCE LEAK!!!  instance=576969665
      [mvn] 9178 T3 oasc.CoreContainer.finalize SEVERE CoreContainer was not shutdown prior to finalize(), indicates a bug -- POSSIBLE RESOURCE LEAK!!!  instance=88043645
      [mvn] Tests run: 1, Failures: 0, Errors: 0, Skipped: 0, Time elapsed: 15.196 sec
      [mvn] Running org.apache.solr.core.TestSolrXMLSerializer
      [mvn] Tests run: 1, Failures: 0, Errors: 0, Skipped: 0, Time elapsed: 0.024 sec
      [mvn] Running org.apache.solr.cloud.BasicDistributedZk2Test
      [mvn] Creating dataDir: /usr/home/hudson/hudson-slave/workspace/Lucene-Solr-Maven-4.x/maven-build/solr/core/src/test/target/test/./solrtest-BasicDistributedZk2Test-1347707638166
      [mvn] 44943 T1802 oasc.SolrException.log SEVERE Sync Failed
      [mvn] ASYNC  NEW_CORE C2 name=collection1 org.apache.solr.core.SolrCore@54b34ad9 url=http://127.0.0.1:44350/solr/collection1 node=127.0.0.1:44350_solr
      [mvn] 119975 T1842 C2 P44350 oasc.SolrException.log SEVERE Error while trying to recover. core=collection1:org.apache.solr.client.solrj.SolrServerException: IOException occured when talking to server at: http://127.0.0.1:14790/solr
      [mvn] 		at org.apache.solr.client.solrj.impl.HttpSolrServer.request(HttpSolrServer.java:414)
      [mvn] 		at org.apache.solr.client.solrj.impl.HttpSolrServer.request(HttpSolrServer.java:182)
      [mvn] 		at org.apache.solr.cloud.RecoveryStrategy.sendPrepRecoveryCmd(RecoveryStrategy.java:199)
      [mvn] 		at org.apache.solr.cloud.RecoveryStrategy.doRecovery(RecoveryStrategy.java:388)
      [mvn] 		at org.apache.solr.cloud.RecoveryStrategy.run(RecoveryStrategy.java:220)
      [mvn] 	Caused by: org.apache.http.conn.ConnectTimeoutException: Connect to 127.0.0.1:14790 timed out
      [mvn] 		at org.apache.http.conn.scheme.PlainSocketFactory.connectSocket(PlainSocketFactory.java:125)
      [mvn] 		at org.apache.http.impl.conn.DefaultClientConnectionOperator.openConnection(DefaultClientConnectionOperator.java:148)
      [mvn] 		at org.apache.http.impl.conn.AbstractPoolEntry.open(AbstractPoolEntry.java:150)
      [mvn] 		at org.apache.http.impl.conn.AbstractPooledConnAdapter.open(AbstractPooledConnAdapter.java:121)
      [mvn] 		at org.apache.http.impl.client.DefaultRequestDirector.tryConnect(DefaultRequestDirector.java:575)
      [mvn] 		at org.apache.http.impl.client.DefaultRequestDirector.execute(DefaultRequestDirector.java:425)
      [mvn] 		at org.apache.http.impl.client.AbstractHttpClient.execute(AbstractHttpClient.java:820)
      [mvn] 		at org.apache.http.impl.client.AbstractHttpClient.execute(AbstractHttpClient.java:754)
      [mvn] 		at org.apache.http.impl.client.AbstractHttpClient.execute(AbstractHttpClient.java:732)
      [mvn] 		at org.apache.solr.client.solrj.impl.HttpSolrServer.request(HttpSolrServer.java:353)
      [mvn] 		... 4 more
      [mvn] 	
      [mvn] 119976 T1842 C2 P44350 oasc.RecoveryStrategy.doRecovery SEVERE Recovery failed - trying again... core=collection1
      [mvn] / (2)
      [mvn] DATA:
      [mvn]     
      [mvn]  /solr (6)
      [mvn]   /solr/configs (1)
      [mvn]    /solr/configs/conf1 (9)
      [mvn]     /solr/configs/conf1/mapping-ISOLatin1Accent.txt (0)
      [mvn]     DATA: ...supressed...
      [mvn]     /solr/configs/conf1/currency.xml (0)
      [mvn]     DATA: ...supressed...
      [mvn]     /solr/configs/conf1/protwords.txt (0)
      [mvn]     DATA: ...supressed...
      [mvn]     /solr/configs/conf1/synonyms.txt (0)
      [mvn]     DATA: ...supressed...
      [mvn]     /solr/configs/conf1/old_synonyms.txt (0)
      [mvn]     DATA: ...supressed...
      [mvn]     /solr/configs/conf1/solrconfig.xml (0)
      [mvn]     DATA: ...supressed...
      [mvn]     /solr/configs/conf1/stopwords.txt (0)
      [mvn]     DATA: ...supressed...
      [mvn]     /solr/configs/conf1/open-exchange-rates.json (0)
      [mvn]     DATA:
      [mvn]         {
      [mvn]           "disclaimer": "This data is collected from various providers and provided free of charge for informational purposes only, with no guarantee whatsoever of accuracy, validity, availability or fitness for any purpose; use at your own risk. Other than that - have fun, and please share/watch/fork if you think data like this should be free!",
      [mvn]           "license": "Data collected from various providers with public-facing APIs; copyright may apply; not for resale; no warranties given.",
      [mvn]           "timestamp": 1332070464,
      [mvn]           "base": "USD",
      [mvn]           "rates": {
      [mvn]             "AED": 3.6732,
      [mvn]             "AFN": 48.299999,
      [mvn]             "ALL": 105.919998,
      [mvn]             "AMD": 388.890015,
      [mvn]             "ANG": 1.79,
      [mvn]             "AOA": 94.769997,
      [mvn]             "ARS": 4.35,
      [mvn]             "AUD": 0.943931,
      [mvn]             "AWG": 1.7899,
      [mvn]             "AZN": 0.7863,
      [mvn]             "BAM": 1.48775,
      [mvn]             "BBD": 2,
      [mvn]             "BDT": 82,
      [mvn]             "BGN": 1.4962,
      [mvn]             "BHD": 0.37703,
      [mvn]             "BIF": 1304.170044,
      [mvn]             "BMD": 1,
      [mvn]             "BND": 1.2575,
      [mvn]             "BOB": 6.91,
      [mvn]             "BRL": 1.8003,
      [mvn]             "BSD": 1,
      [mvn]             "BTN": 50.185001,
      [mvn]             "BWP": 7.2307,
      [mvn]             "BYR": 8150,
      [mvn]             "BZD": 1.9135,
      [mvn]             "CAD": 0.9921,
      [mvn]             "CDF": 917.276917,
      [mvn]             "CHF": 0.9164,
      [mvn]             "CLF": 0.02146,
      [mvn]             "CLP": 482.75,
      [mvn]             "CNY": 6.3239,
      [mvn]             "COP": 1760,
      [mvn]             "CRC": 507.600006,
      [mvn]             "CUP": 1,
      [mvn]             "CVE": 84.190002,
      [mvn]             "CZK": 18.606001,
      [mvn]             "DJF": 179.490005,
      [mvn]             "DKK": 5.64424,
      [mvn]             "DOP": 39.025002,
      [mvn]             "DZD": 74.544998,
      [mvn]             "EGP": 6.0385,
      [mvn]             "ETB": 17.720449,
      [mvn]             "EUR": 0.758956,
      [mvn]             "FJD": 1.7734,
      [mvn]             "FKP": 0.6316,
      [mvn]             "GBP": 0.631373,
      [mvn]             "GEL": 1.6469,
      [mvn]             "GHS": 1.7455,
      [mvn]             "GIP": 0.63165,
      [mvn]             "GMD": 31.5,
      [mvn]             "GNF": 7100,
      [mvn]             "GTQ": 7.6975,
      [mvn]             "GYD": 203.699997,
      [mvn]             "HKD": 7.76306,
      [mvn]             "HNL": 19.055,
      [mvn]             "HRK": 5.7333,
      [mvn]             "HTG": 41,
      [mvn]             "HUF": 219.850006,
      [mvn]             "IDR": 9118,
      [mvn]             "IEP": 0.5978,
      [mvn]             "ILS": 3.7542,
      [mvn]             "INR": 50.165001,
      [mvn]             "IQD": 1165.5,
      [mvn]             "IRR": 12308,
      [mvn]             "ISK": 127.440002,
      [mvn]             "JMD": 86.699997,
      [mvn]             "JOD": 0.7095,
      [mvn]             "JPY": 83.445,
      [mvn]             "KES": 83.18,
      [mvn]             "KGS": 46.699402,
      [mvn]             "KHR": 4010.300049,
      [mvn]             "KMF": 373.424255,
      [mvn]             "KPW": 900,
      [mvn]             "KRW": 1125.849976,
      [mvn]             "KWD": 0.27925,
      [mvn]             "KZT": 147.690002,
      [mvn]             "LAK": 7993.799805,
      [mvn]             "LBP": 1504,
      [mvn]             "LKR": 125.224998,
      [mvn]             "LRD": 73.459999,
      [mvn]             "LSL": 7.5768,
      [mvn]             "LTL": 2.6219,
      [mvn]             "LVL": 0.5291,
      [mvn]             "LYD": 1.2572,
      [mvn]             "MAD": 8.4611,
      [mvn]             "MDL": 11.89,
      [mvn]             "MGA": 2155,
      [mvn]             "MKD": 46.705002,
      [mvn]             "MMK": 6.51,
      [mvn]             "MNT": 1322.5,
      [mvn]             "MOP": 7.9958,
      [mvn]             "MRO": 293,
      [mvn]             "MUR": 29.110001,
      [mvn]             "MVR": 15.36,
      [mvn]             "MWK": 165.206207,
      [mvn]             "MXN": 12.6745,
      [mvn]             "MYR": 3.0575,
      [mvn]             "MZN": 27.200001,
      [mvn]             "NAD": 7.58,
      [mvn]             "NGN": 157.600006,
      [mvn]             "NIO": 23.215,
      [mvn]             "NOK": 5.73163,
      [mvn]             "NPR": 80.620003,
      [mvn]             "NZD": 1.212269,
      [mvn]             "OMR": 0.38485,
      [mvn]             "PAB": 1,
      [mvn]             "PEN": 2.674,
      [mvn]             "PGK": 2.0627,
      [mvn]             "PHP": 43.02,
      [mvn]             "PKR": 90.800003,
      [mvn]             "PLN": 3.1285,
      [mvn]             "PYG": 4245,
      [mvn]             "QAR": 3.6415,
      [mvn]             "RON": 3.3256,
      [mvn]             "RSD": 84.100502,
      [mvn]             "RUB": 29.2342,
      [mvn]             "RWF": 606.717468,
      [mvn]             "SAR": 3.7505,
      [mvn]             "SBD": 7.075973,
      [mvn]             "SCR": 14.0447,
      [mvn]             "SDG": 2.6765,
      [mvn]             "SEK": 6.74525,
      [mvn]             "SGD": 1.258,
      [mvn]             "SHP": 0.63165,
      [mvn]             "SLL": 4364.5,
      [mvn]             "SOS": 1629,
      [mvn]             "SRD": 3.2875,
      [mvn]             "STD": 18650,
      [mvn]             "SVC": 8.7475,
      [mvn]             "SYP": 57.450001,
      [mvn]             "SZL": 7.5752,
      [mvn]             "THB": 30.700001,
      [mvn]             "TJS": 4.7588,
      [mvn]             "TMT": 2.85,
      [mvn]             "TND": 1.5178,
      [mvn]             "TOP": 1.693601,
      [mvn]             "TRY": 1.796,
      [mvn]             "TTD": 6.40015,
      [mvn]             "TWD": 29.532,
      [mvn]             "TZS": 1595,
      [mvn]             "UAH": 8.029,
      [mvn]             "UGX": 2481.699951,
      [mvn]             "USD": 1,
      [mvn]             "UYU": 19.469999,
      [mvn]             "UZS": 1835.75,
      [mvn]             "VEF": 4.295,
      [mvn]             "VND": 20820,
      [mvn]             "VUV": 90.199997,
      [mvn]             "WST": 2.247475,
      [mvn]             "XAF": 497.898987,
      [mvn]             "XCD": 2.7,
      [mvn]             "XDR": 0.652794,
      [mvn]             "XOF": 498.399994,
      [mvn]             "XPF": 90.639999,
      [mvn]             "YER": 216.005005,
      [mvn]             "ZAR": 7.5688,
      [mvn]             "ZMK": 5271.5,
      [mvn]             "ZWD": 378.700012,
      [mvn]             "ZWL": 322.355011
      [mvn]           }
      [mvn]         }
      [mvn]     /solr/configs/conf1/schema.xml (0)
      [mvn]     DATA: ...supressed...
      [mvn]   /solr/live_nodes (4)
      [mvn]    /solr/live_nodes/127.0.0.1:14786_solr (0)
      [mvn]    /solr/live_nodes/127.0.0.1:44350_solr (0)
      [mvn]    /solr/live_nodes/127.0.0.1:49029_solr (0)
      [mvn]    /solr/live_nodes/127.0.0.1:14788_solr (0)
      [mvn]   /solr/overseer (3)
      [mvn]   DATA:
      [mvn]       
      [mvn]    /solr/overseer/queue (0)
      [mvn]    DATA:
      [mvn]        
      [mvn]    /solr/overseer/queue-work (0)
      [mvn]    DATA:
      [mvn]        
      [mvn]    /solr/overseer/collection-queue-work (0)
      [mvn]    DATA:
      [mvn]        
      [mvn]   /solr/overseer_elect (2)
      [mvn]    /solr/overseer_elect/election (4)
      [mvn]     /solr/overseer_elect/election/88323367775043590-127.0.0.1:44350_solr-n_0000000004 (0)
      [mvn]     /solr/overseer_elect/election/88323367775043589-127.0.0.1:49029_solr-n_0000000003 (0)
      [mvn]     /solr/overseer_elect/election/88323367775043587-127.0.0.1:14788_solr-n_0000000001 (0)
      [mvn]     /solr/overseer_elect/election/88323367775043586-127.0.0.1:14786_solr-n_0000000000 (0)
      [mvn]    /solr/overseer_elect/leader (0)
      [mvn]    DATA:
      [mvn]        {"id":"88323367775043586-127.0.0.1:14786_solr-n_0000000000"}
      [mvn]   /solr/collections (2)
      [mvn]    /solr/collections/collection1 (3)
      [mvn]    DATA:
      [mvn]        {"configName":"conf1"}
      [mvn]     /solr/collections/collection1/shards (0)
      [mvn]     /solr/collections/collection1/leader_elect (2)
      [mvn]      /solr/collections/collection1/leader_elect/shard1 (1)
      [mvn]       /solr/collections/collection1/leader_elect/shard1/election (2)
      [mvn]        /solr/collections/collection1/leader_elect/shard1/election/88323367775043589-127.0.0.1:49029_solr_collection1-n_0000000001 (0)
      [mvn]        /solr/collections/collection1/leader_elect/shard1/election/88323367775043587-127.0.0.1:14788_solr_collection1-n_0000000000 (0)
      [mvn]      /solr/collections/collection1/leader_elect/shard2 (1)
      [mvn]       /solr/collections/collection1/leader_elect/shard2/election (1)
      [mvn]        /solr/collections/collection1/leader_elect/shard2/election/88323367775043590-127.0.0.1:44350_solr_collection1-n_0000000004 (0)
      [mvn]     /solr/collections/collection1/leaders (1)
      [mvn]      /solr/collections/collection1/leaders/shard1 (0)
      [mvn]      DATA:
      [mvn]          {
      [mvn]            "core":"collection1",
      [mvn]            "node_name":"127.0.0.1:14788_solr",
      [mvn]            "base_url":"http://127.0.0.1:14788/solr"}
      [mvn]    /solr/collections/control_collection (3)
      [mvn]    DATA:
      [mvn]        {"configName":"conf1"}
      [mvn]     /solr/collections/control_collection/shards (0)
      [mvn]     /solr/collections/control_collection/leader_elect (1)
      [mvn]      /solr/collections/control_collection/leader_elect/control_shard (1)
      [mvn]       /solr/collections/control_collection/leader_elect/control_shard/election (1)
      [mvn]        /solr/collections/control_collection/leader_elect/control_shard/election/88323367775043586-127.0.0.1:14786_solr_collection1-n_0000000000 (0)
      [mvn]     /solr/collections/control_collection/leaders (1)
      [mvn]      /solr/collections/control_collection/leaders/control_shard (0)
      [mvn]      DATA:
      [mvn]          {
      [mvn]            "core":"collection1",
      [mvn]            "node_name":"127.0.0.1:14786_solr",
      [mvn]            "base_url":"http://127.0.0.1:14786/solr"}
      [mvn]   /solr/clusterstate.json (0)
      [mvn]   DATA:
      [mvn]       {
      [mvn]         "collection1":{
      [mvn]           "shard1":{
      [mvn]             "127.0.0.1:14788_solr_collection1":{
      [mvn]               "shard":"shard1",
      [mvn]               "roles":null,
      [mvn]               "leader":"true",
      [mvn]               "state":"active",
      [mvn]               "core":"collection1",
      [mvn]               "collection":"collection1",
      [mvn]               "node_name":"127.0.0.1:14788_solr",
      [mvn]               "base_url":"http://127.0.0.1:14788/solr"},
      [mvn]             "127.0.0.1:49029_solr_collection1":{
      [mvn]               "shard":"shard1",
      [mvn]               "roles":null,
      [mvn]               "state":"active",
      [mvn]               "core":"collection1",
      [mvn]               "collection":"collection1",
      [mvn]               "node_name":"127.0.0.1:49029_solr",
      [mvn]               "base_url":"http://127.0.0.1:49029/solr"}},
      [mvn]           "shard2":{
      [mvn]             "127.0.0.1:14790_solr_collection1":{
      [mvn]               "shard":"shard2",
      [mvn]               "roles":null,
      [mvn]               "state":"active",
      [mvn]               "core":"collection1",
      [mvn]               "collection":"collection1",
      [mvn]               "node_name":"127.0.0.1:14790_solr",
      [mvn]               "base_url":"http://127.0.0.1:14790/solr"},
      [mvn]             "127.0.0.1:44350_solr_collection1":{
      [mvn]               "shard":"shard2",
      [mvn]               "roles":null,
      [mvn]               "state":"recovering",
      [mvn]               "core":"collection1",
      [mvn]               "collection":"collection1",
      [mvn]               "node_name":"127.0.0.1:44350_solr",
      [mvn]               "base_url":"http://127.0.0.1:44350/solr"}}},
      [mvn]         "control_collection":{"control_shard":{"127.0.0.1:14786_solr_collection1":{
      [mvn]               "shard":"control_shard",
      [mvn]               "leader":"true",
      [mvn]               "roles":null,
      [mvn]               "state":"active",
      [mvn]               "core":"collection1",
      [mvn]               "collection":"control_collection",
      [mvn]               "node_name":"127.0.0.1:14786_solr",
      [mvn]               "base_url":"http://127.0.0.1:14786/solr"}}}}
      [mvn]  /zookeeper (1)
      [mvn]  DATA:
      [mvn]      
      [mvn] 
      [mvn] 166990 T1842 C2 P44350 oasc.SolrException.log SEVERE Error while trying to recover. core=collection1:org.apache.solr.client.solrj.SolrServerException: IOException occured when talking to server at: http://127.0.0.1:14790/solr
      [mvn] 		at org.apache.solr.client.solrj.impl.HttpSolrServer.request(HttpSolrServer.java:414)
      [mvn] 		at org.apache.solr.client.solrj.impl.HttpSolrServer.request(HttpSolrServer.java:182)
      [mvn] 		at org.apache.solr.cloud.RecoveryStrategy.sendPrepRecoveryCmd(RecoveryStrategy.java:199)
      [mvn] 		at org.apache.solr.cloud.RecoveryStrategy.doRecovery(RecoveryStrategy.java:388)
      [mvn] 		at org.apache.solr.cloud.RecoveryStrategy.run(RecoveryStrategy.java:220)
      [mvn] 	Caused by: org.apache.http.conn.ConnectTimeoutException: Connect to 127.0.0.1:14790 timed out
      [mvn] 		at org.apache.http.conn.scheme.PlainSocketFactory.connectSocket(PlainSocketFactory.java:125)
      [mvn] 		at org.apache.http.impl.conn.DefaultClientConnectionOperator.openConnection(DefaultClientConnectionOperator.java:148)
      [mvn] 		at org.apache.http.impl.conn.AbstractPoolEntry.open(AbstractPoolEntry.java:150)
      [mvn] 		at org.apache.http.impl.conn.AbstractPooledConnAdapter.open(AbstractPooledConnAdapter.java:121)
      [mvn] 		at org.apache.http.impl.client.DefaultRequestDirector.tryConnect(DefaultRequestDirector.java:575)
      [mvn] 		at org.apache.http.impl.client.DefaultRequestDirector.execute(DefaultRequestDirector.java:425)
      [mvn] 		at org.apache.http.impl.client.AbstractHttpClient.execute(AbstractHttpClient.java:820)
      [mvn] 		at org.apache.http.impl.client.AbstractHttpClient.execute(AbstractHttpClient.java:754)
      [mvn] 		at org.apache.http.impl.client.AbstractHttpClient.execute(AbstractHttpClient.java:732)
      [mvn] 		at org.apache.solr.client.solrj.impl.HttpSolrServer.request(HttpSolrServer.java:353)
      [mvn] 		... 4 more
      [mvn] 	
      [mvn] 166991 T1842 C2 P44350 oasc.RecoveryStrategy.doRecovery SEVERE Recovery failed - trying again... core=collection1
      [mvn] 166991 T1842 C2 P44350 oasc.SolrException.log SEVERE Recovery failed - max retries exceeded. core=collection1
      [mvn] 166991 T1842 C2 P44350 oasc.SolrException.log SEVERE Recovery failed - I give up. core=collection1
      [mvn] 171135 T1842 C2 P44350 oasc.SolrException.log SEVERE Could not publish that recovery failed:org.apache.zookeeper.KeeperException$ConnectionLossException: KeeperErrorCode = ConnectionLoss for /overseer/queue/qn-
      [mvn] 		at org.apache.zookeeper.KeeperException.create(KeeperException.java:90)
      [mvn] 		at org.apache.zookeeper.KeeperException.create(KeeperException.java:42)
      [mvn] 		at org.apache.zookeeper.ZooKeeper.create(ZooKeeper.java:643)
      [mvn] 		at org.apache.solr.common.cloud.SolrZkClient$5.execute(SolrZkClient.java:256)
      [mvn] 		at org.apache.solr.common.cloud.SolrZkClient$5.execute(SolrZkClient.java:253)
      [mvn] 		at org.apache.solr.common.cloud.ZkCmdExecutor.retryOperation(ZkCmdExecutor.java:67)
      [mvn] 		at org.apache.solr.common.cloud.SolrZkClient.create(SolrZkClient.java:253)
      [mvn] 		at org.apache.solr.cloud.DistributedQueue.offer(DistributedQueue.java:236)
      [mvn] 		at org.apache.solr.cloud.ZkController.publish(ZkController.java:867)
      [mvn] 		at org.apache.solr.cloud.ZkController.publish(ZkController.java:838)
      [mvn] 		at org.apache.solr.cloud.RecoveryStrategy.recoveryFailed(RecoveryStrategy.java:112)
      [mvn] 		at org.apache.solr.cloud.RecoveryStrategy.doRecovery(RecoveryStrategy.java:466)
      [mvn] 		at org.apache.solr.cloud.RecoveryStrategy.run(RecoveryStrategy.java:220)
      [mvn] 	
      [mvn] NOTE: reproduce with: ant test  -Dtestcase=BasicDistributedZk2Test -Dtests.method=testDistribSearch -Dtests.seed=A2854F5141B3BB24 -Dtests.locale=ar_MA -Dtests.timezone=SystemV/MST7 -Dtests.file.encoding=ISO8859-1
      [mvn] 177136 T1802 oasc.SolrException.log SEVERE Errir checking for the number of election participants:org.apache.zookeeper.KeeperException$SessionExpiredException: KeeperErrorCode = Session expired for /collections/collection1/leader_elect/shard2/election
      [mvn] 		at org.apache.zookeeper.KeeperException.create(KeeperException.java:118)
      [mvn] 		at org.apache.zookeeper.KeeperException.create(KeeperException.java:42)
      [mvn] 		at org.apache.zookeeper.ZooKeeper.getChildren(ZooKeeper.java:1249)
      [mvn] 		at org.apache.solr.common.cloud.SolrZkClient$6.execute(SolrZkClient.java:278)
      [mvn] 		at org.apache.solr.common.cloud.SolrZkClient$6.execute(SolrZkClient.java:275)
      [mvn] 		at org.apache.solr.common.cloud.ZkCmdExecutor.retryOperation(ZkCmdExecutor.java:67)
      [mvn] 		at org.apache.solr.common.cloud.SolrZkClient.getChildren(SolrZkClient.java:275)
      [mvn] 		at org.apache.solr.cloud.ShardLeaderElectionContext.waitForReplicasToComeUp(ElectionContext.java:275)
      [mvn] 		at org.apache.solr.cloud.ShardLeaderElectionContext.runLeaderProcess(ElectionContext.java:142)
      [mvn] 		at org.apache.solr.cloud.LeaderElector.runIamLeaderProcess(LeaderElector.java:158)
      [mvn] 		at org.apache.solr.cloud.LeaderElector.checkIfIamLeader(LeaderElector.java:102)
      [mvn] 		at org.apache.solr.cloud.LeaderElector.joinElection(LeaderElector.java:275)
      [mvn] 		at org.apache.solr.cloud.ShardLeaderElectionContext.rejoinLeaderElection(ElectionContext.java:326)
      [mvn] 		at org.apache.solr.cloud.ShardLeaderElectionContext.runLeaderProcess(ElectionContext.java:204)
      [mvn] 		at org.apache.solr.cloud.LeaderElector.runIamLeaderProcess(LeaderElector.java:158)
      [mvn] 		at org.apache.solr.cloud.LeaderElector.checkIfIamLeader(LeaderElector.java:102)
      [mvn] 		at org.apache.solr.cloud.LeaderElector.access$000(LeaderElector.java:56)
      [mvn] 		at org.apache.solr.cloud.LeaderElector$1.process(LeaderElector.java:131)
      [mvn] 		at org.apache.zookeeper.ClientCnxn$EventThread.processEvent(ClientCnxn.java:526)
      [mvn] 		at org.apache.zookeeper.ClientCnxn$EventThread.run(ClientCnxn.java:502)
      [mvn] 	
      [mvn] NOTE: test params are: codec=Lucene40: {n_f1=Pulsing40(freqCutoff=17 minBlockSize=56 maxBlockSize=165), foo_b=PostingsFormat(name=Asserting), foo_d=PostingsFormat(name=MockSep), foo_f=PostingsFormat(name=Asserting), n_tl1=Pulsing40(freqCutoff=17 minBlockSize=56 maxBlockSize=165), n_d1=PostingsFormat(name=SimpleText), rnd_b=PostingsFormat(name=MockSep), intDefault=PostingsFormat(name=SimpleText), n_td1=Pulsing40(freqCutoff=17 minBlockSize=56 maxBlockSize=165), id=PostingsFormat(name=MockSep), timestamp=PostingsFormat(name=SimpleText), range_facet_sl=PostingsFormat(name=Asserting), range_facet_si=Pulsing40(freqCutoff=17 minBlockSize=56 maxBlockSize=165), oddField_s=PostingsFormat(name=Asserting), multiDefault=Pulsing40(freqCutoff=17 minBlockSize=56 maxBlockSize=165), n_tf1=PostingsFormat(name=SimpleText), n_dt1=Pulsing40(freqCutoff=17 minBlockSize=56 maxBlockSize=165), n_ti1=PostingsFormat(name=MockSep), range_facet_l=PostingsFormat(name=SimpleText), text=PostingsFormat(name=Asserting), _version_=PostingsFormat(name=SimpleText), SubjectTerms_mfacet=PostingsFormat(name=SimpleText), a_t=PostingsFormat(name=SimpleText), n_tdt1=PostingsFormat(name=SimpleText), other_tl1=PostingsFormat(name=SimpleText), n_l1=PostingsFormat(name=SimpleText), a_si=Pulsing40(freqCutoff=17 minBlockSize=56 maxBlockSize=165)}, sim=DefaultSimilarity, locale=ar_MA, timezone=SystemV/MST7
      [mvn] NOTE: FreeBSD 9.0-RELEASE amd64/Sun Microsystems Inc. 1.6.0_32 (64-bit)/cpus=16,threads=1,free=153515528,total=284426240
      [mvn] NOTE: All tests run in this JVM: [SampleTest, TestStressRecovery, TestPerFieldSimilarity, TestIndexingPerformance, TestTrie, SuggesterTSTTest, ReturnFieldsTest, SpellPossibilityIteratorTest, TestQueryUtils, FastVectorHighlighterTest, SolrCoreCheckLockOnStartupTest, TestPseudoReturnFields, StatelessScriptUpdateProcessorFactoryTest, SystemInfoHandlerTest, TestUtils, TestDocumentBuilder, TestSort, JSONWriterTest, SoftAutoCommitTest, LeaderElectionTest, TermVectorComponentDistributedTest, HighlighterTest, TestStressVersions, LoggingHandlerTest, AutoCommitTest, LegacyHTMLStripCharFilterTest, TestDefaultSimilarityFactory, NumericFieldsTest, ZkNodePropsTest, IndexBasedSpellCheckerTest, TestDocSet, UUIDFieldTest, ConvertedLegacyTest, TestMergePolicyConfig, QueryEqualityTest, TestStressReorder, SignatureUpdateProcessorFactoryTest, TestValueSourceCache, SolrIndexConfigTest, ZkSolrClientTest, MoreLikeThisHandlerTest, OpenExchangeRatesOrgProviderTest, TestLMJelinekMercerSimilarityFactory, SolrCoreTest, DistributedTermsComponentTest, PluginInfoTest, EchoParamsTest, TestFastOutputStream, TestXIncludeConfig, TestPhraseSuggestions, ResourceLoaderTest, QueryElevationComponentTest, ScriptEngineTest, TestLFUCache, CurrencyFieldTest, IndexSchemaRuntimeFieldTest, SuggesterTest, TestExtendedDismaxParser, TestStressLucene, DOMUtilTest, CSVRequestHandlerTest, ShowFileRequestHandlerTest, TestCharFilters, CacheHeaderTest, TestRangeQuery, RequestHandlersTest, SuggesterFSTTest, SolrPluginUtilsTest, RecoveryZkTest, TestReload, LeaderElectionIntegrationTest, TestSystemIdResolver, TestPHPSerializedResponseWriter, TestSolrCoreProperties, TestDistributedSearch, FieldMutatingUpdateProcessorTest, MinimalSchemaTest, TestMultiCoreConfBootstrap, TestPropInject, UniqFieldsUpdateProcessorFactoryTest, TestCollationField, BinaryUpdateRequestHandlerTest, QueryParsingTest, TestNumberUtils, PingRequestHandlerTest, SuggesterWFSTTest, TermVectorComponentTest, IndexReaderFactoryTest, JsonLoaderTest, TestQuerySenderListener, TimeZoneUtilsTest, TestDFRSimilarityFactory, CircularListTest, CoreAdminHandlerTest, SimpleFacetsTest, TestBinaryField, HighlighterConfigTest, SpellCheckCollatorTest, AnalysisAfterCoreReloadTest, PeerSyncTest, TestLRUCache, TestQueryTypes, TestRTGBase, TestWriterPerf, TestQuerySenderNoQuery, TestFastWriter, SortByFunctionTest, TestSurroundQueryParser, TestDistributedGrouping, ZkCLITest, TestBadConfig, SolrInfoMBeanTest, SearchHandlerTest, DateMathParserTest, TestRealTimeGet, ClusterStateTest, MultiTermTest, PreAnalyzedFieldTest, TestCSVResponseWriter, TestReversedWildcardFilterFactory, SimplePostToolTest, TestWordDelimiterFilterFactory, BadComponentTest, SOLR749Test, DefaultValueUpdateProcessorTest, SpellCheckComponentTest, TestUpdate, TermsComponentTest, DirectUpdateHandlerTest, TestJmxIntegration, TestArbitraryIndexDir, TestJmxMonitoredMap, BadIndexSchemaTest, FieldAnalysisRequestHandlerTest, TestFastLRUCache, TestLMDirichletSimilarityFactory, TestPropInjectDefaults, TestRandomFaceting, TestSolrXMLSerializer, BasicDistributedZk2Test]
      [mvn] Tests run: 1, Failures: 1, Errors: 0, Skipped: 0, Time 

[...truncated too long message...]

' encoding to copy filtered resources.
      [mvn] [INFO] skip non existing resourceDirectory /usr/home/hudson/hudson-slave/workspace/Lucene-Solr-Maven-4.x/maven-build/solr/contrib/velocity/src/main/resources
      [mvn] [INFO] Copying 3 resources
      [mvn] [INFO] [compiler:compile {execution: default-compile}]
      [mvn] [INFO] Compiling 4 source files to /usr/home/hudson/hudson-slave/workspace/Lucene-Solr-Maven-4.x/maven-build/solr/contrib/velocity/target/classes
      [mvn] [INFO] [bundle:manifest {execution: bundle-manifest}]
      [mvn] [debug] execute contextualize
      [mvn] [INFO] [resources:testResources {execution: default-testResources}]
      [mvn] [INFO] Using 'UTF-8' encoding to copy filtered resources.
      [mvn] [INFO] Copying 3 resources
      [mvn] [INFO] Copying 1 resource
      [mvn] [INFO] Copying 3 resources
      [mvn] [INFO] [compiler:testCompile {execution: default-testCompile}]
      [mvn] [INFO] Compiling 1 source file to /usr/home/hudson/hudson-slave/workspace/Lucene-Solr-Maven-4.x/maven-build/solr/contrib/velocity/target/test-classes
      [mvn] [INFO] [surefire:test {execution: default-test}]
      [mvn] [INFO] Surefire report directory: /usr/home/hudson/hudson-slave/workspace/Lucene-Solr-Maven-4.x/maven-build/solr/contrib/velocity/target/surefire-reports
      [mvn] 
      [mvn] -------------------------------------------------------
      [mvn]  T E S T S
      [mvn] -------------------------------------------------------
      [mvn] Running org.apache.solr.velocity.VelocityResponseWriterTest
      [mvn] Creating dataDir: /usr/home/hudson/hudson-slave/workspace/Lucene-Solr-Maven-4.x/maven-build/solr/contrib/velocity/target/test/./solrtest-VelocityResponseWriterTest-1347708728284
      [mvn] Tests run: 1, Failures: 0, Errors: 0, Skipped: 0, Time elapsed: 1.851 sec
      [mvn] 
      [mvn] Results :
      [mvn] 
      [mvn] Tests run: 1, Failures: 0, Errors: 0, Skipped: 0
      [mvn] 
      [mvn] [INFO] [jar:jar {execution: default-jar}]
      [mvn] [INFO] Building jar: /usr/home/hudson/hudson-slave/workspace/Lucene-Solr-Maven-4.x/maven-build/solr/contrib/velocity/target/solr-velocity-4.0-SNAPSHOT.jar
      [mvn] [INFO] [install:install {execution: default-install}]
      [mvn] [INFO] Installing /usr/home/hudson/hudson-slave/workspace/Lucene-Solr-Maven-4.x/maven-build/solr/contrib/velocity/target/solr-velocity-4.0-SNAPSHOT.jar to /home/hudson/.m2/repository/org/apache/solr/solr-velocity/4.0-SNAPSHOT/solr-velocity-4.0-SNAPSHOT.jar
      [mvn] [INFO] ------------------------------------------------------------------------
      [mvn] [INFO] Building Apache Solr Contrib aggregator POM
      [mvn] [INFO]    task-segment: [install]
      [mvn] [INFO] ------------------------------------------------------------------------
      [mvn] [INFO] [groovy:execute {execution: generate-timestamps}]
      [mvn] [INFO] [buildnumber:create {execution: default}]
      [mvn] [INFO] [enforcer:enforce {execution: enforce-java-compat-version-and-maven-2.2.1}]
      [mvn] [INFO] [remote-resources:process {execution: default}]
      [mvn] [INFO] [bundle:manifest {execution: bundle-manifest}]
      [mvn] [WARNING] Ignoring project type pom - supportedProjectTypes = [jar, bundle]
      [mvn] [INFO] [site:attach-descriptor {execution: default-attach-descriptor}]
      [mvn] [INFO] [install:install {execution: default-install}]
      [mvn] [INFO] Installing /usr/home/hudson/hudson-slave/workspace/Lucene-Solr-Maven-4.x/maven-build/solr/contrib/pom.xml to /home/hudson/.m2/repository/org/apache/solr/solr-contrib-aggregator/4.0-SNAPSHOT/solr-contrib-aggregator-4.0-SNAPSHOT.pom
      [mvn] [INFO] 
      [mvn] [INFO] 
      [mvn] [INFO] ------------------------------------------------------------------------
      [mvn] [INFO] Reactor Summary:
      [mvn] [INFO] ------------------------------------------------------------------------
      [mvn] [INFO] Grandparent POM for Apache Lucene Core and Apache Solr  SUCCESS [7.692s]
      [mvn] [INFO] Lucene parent POM ..................................... SUCCESS [0.078s]
      [mvn] [INFO] Lucene Core ........................................... SUCCESS [14.120s]
      [mvn] [INFO] Lucene codecs ......................................... SUCCESS [4.450s]
      [mvn] [INFO] Lucene Test Framework ................................. SUCCESS [4.825s]
      [mvn] [INFO] Lucene Core tests ..................................... SUCCESS [4:44.036s]
      [mvn] [INFO] Lucene Core aggregator POM ............................ SUCCESS [0.095s]
      [mvn] [INFO] Lucene codecs tests ................................... SUCCESS [3.388s]
      [mvn] [INFO] Lucene codecs aggregator POM .......................... SUCCESS [0.083s]
      [mvn] [INFO] Lucene Common Analyzers ............................... SUCCESS [2:02.268s]
      [mvn] [INFO] Lucene ICU Analysis Components ........................ SUCCESS [12.763s]
      [mvn] [INFO] Lucene Kuromoji Japanese Morphological Analyzer ....... SUCCESS [30.585s]
      [mvn] [INFO] Lucene Morfologik Polish Lemmatizer ................... SUCCESS [3.363s]
      [mvn] [INFO] Lucene Phonetic Filters ............................... SUCCESS [22.279s]
      [mvn] [INFO] Lucene Smart Chinese Analyzer ......................... SUCCESS [10.557s]
      [mvn] [INFO] Lucene Stempel Analyzer ............................... SUCCESS [6.500s]
      [mvn] [INFO] Lucene UIMA Analysis Components ....................... SUCCESS [21.116s]
      [mvn] [INFO] Lucene Analysis Modules aggregator POM ................ SUCCESS [0.080s]
      [mvn] [INFO] Lucene Queries ........................................ SUCCESS [10.513s]
      [mvn] [INFO] Lucene Sandbox ........................................ SUCCESS [7.515s]
      [mvn] [INFO] Lucene QueryParsers ................................... SUCCESS [13.689s]
      [mvn] [INFO] Lucene Memory ......................................... SUCCESS [8.084s]
      [mvn] [INFO] Lucene Highlighter .................................... SUCCESS [10.862s]
      [mvn] [INFO] Lucene Facets ......................................... SUCCESS [1:01.206s]
      [mvn] [INFO] Lucene Benchmark ...................................... SUCCESS [27.959s]
      [mvn] [INFO] Lucene Demo ........................................... SUCCESS [4.423s]
      [mvn] [INFO] Lucene Grouping ....................................... SUCCESS [16.063s]
      [mvn] [INFO] Lucene Join ........................................... SUCCESS [19.957s]
      [mvn] [INFO] Lucene Miscellaneous .................................. SUCCESS [7.465s]
      [mvn] [INFO] Lucene Spatial ........................................ SUCCESS [11.017s]
      [mvn] [INFO] Lucene Suggest ........................................ SUCCESS [17.444s]
      [mvn] [INFO] Apache Solr parent POM ................................ SUCCESS [0.101s]
      [mvn] [INFO] Apache Solr Solrj ..................................... SUCCESS [5.474s]
      [mvn] [INFO] Apache Solr Core ...................................... SUCCESS [11.779s]
      [mvn] [INFO] Apache Solr Test Framework ............................ SUCCESS [3.181s]
      [mvn] [INFO] Apache Solr Core tests ................................ FAILED [17:27.431s]
      [mvn] [INFO] Apache Solr Core aggregator POM ....................... SUCCESS [0.086s]
      [mvn] [INFO] Apache Solr Solrj tests ............................... SUCCESS [3:49.119s]
      [mvn] [INFO] Apache Solr Solrj aggregator POM ...................... SUCCESS [0.084s]
      [mvn] [INFO] Apache Solr Search Server ............................. SUCCESS [6.954s]
      [mvn] [INFO] Apache Solr Analysis Extras ........................... SUCCESS [7.231s]
      [mvn] [INFO] Apache Solr Clustering ................................ SUCCESS [14.895s]
      [mvn] [INFO] Apache Solr DataImportHandler ......................... SUCCESS [1:32.945s]
      [mvn] [INFO] Apache Solr DataImportHandler Extras .................. SUCCESS [6.721s]
      [mvn] [INFO] Apache Solr Content Extraction Library ................ SUCCESS [10.045s]
      [mvn] [INFO] Apache Solr Language Identifier ....................... SUCCESS [7.509s]
      [mvn] [INFO] Apache Solr UIMA integration .......................... SUCCESS [31.044s]
      [mvn] [INFO] Apache Solr Velocity .................................. SUCCESS [5.010s]
      [mvn] [INFO] Apache Solr Contrib aggregator POM .................... SUCCESS [0.079s]
      [mvn] [INFO] ------------------------------------------------------------------------
      [mvn] [INFO] Error for project: Apache Solr Core tests (during install)
      [mvn] [INFO] ------------------------------------------------------------------------
      [mvn] [INFO] There are test failures.
      [mvn] 
      [mvn] Please refer to /usr/home/hudson/hudson-slave/workspace/Lucene-Solr-Maven-4.x/maven-build/solr/core/src/test/target/surefire-reports for the individual test results.
      [mvn] [INFO] ------------------------------------------------------------------------
      [mvn] [INFO] For more information, run Maven with the -e switch
      [mvn] [INFO] ------------------------------------------------------------------------
      [mvn] [INFO] BUILD ERRORS
      [mvn] [INFO] ------------------------------------------------------------------------
      [mvn] [INFO] Total time: 37 minutes 25 seconds
      [mvn] [INFO] Finished at: Sat Sep 15 11:32:10 UTC 2012
      [mvn] [INFO] Final Memory: 288M/1580M
      [mvn] [INFO] ------------------------------------------------------------------------

BUILD FAILED
/usr/home/hudson/hudson-slave/workspace/Lucene-Solr-Maven-4.x/build.xml:156: The following error occurred while executing this line:
/usr/home/hudson/hudson-slave/workspace/Lucene-Solr-Maven-4.x/extra-targets.xml:56: Java returned: 1

Total time: 37 minutes 31 seconds
Build step 'Invoke Ant' marked build as failure
Recording test results
Email was triggered for: Failure
Sending email for trigger: Failure




Mime
View raw message