lucene-dev mailing list archives

Site index · List index
Message view « Date » · « Thread »
Top « Date » · « Thread »
From Apache Jenkins Server <jenk...@builds.apache.org>
Subject [JENKINS] Lucene-Solr-Tests-4.x-java7 - Build # 451 - Failure
Date Sat, 15 Sep 2012 13:50:02 GMT
Build: https://builds.apache.org/job/Lucene-Solr-Tests-4.x-java7/451/

1 tests failed.
REGRESSION:  org.apache.solr.cloud.BasicDistributedZk2Test.testDistribSearch

Error Message:
Shard still reported as live in zk

Stack Trace:
java.lang.AssertionError: Shard still reported as live in zk
	at __randomizedtesting.SeedInfo.seed([FADDB7CFB2F1FB60:7B3B39D7C5AE9B5C]:0)
	at org.junit.Assert.fail(Assert.java:93)
	at org.apache.solr.cloud.AbstractFullDistribZkTestBase.waitToSeeNotLive(AbstractFullDistribZkTestBase.java:1215)
	at org.apache.solr.cloud.BasicDistributedZk2Test.brindDownShardIndexSomeDocsAndRecover(BasicDistributedZk2Test.java:190)
	at org.apache.solr.cloud.BasicDistributedZk2Test.doTest(BasicDistributedZk2Test.java:83)
	at org.apache.solr.BaseDistributedSearchTestCase.testDistribSearch(BaseDistributedSearchTestCase.java:691)
	at sun.reflect.NativeMethodAccessorImpl.invoke0(Native Method)
	at sun.reflect.NativeMethodAccessorImpl.invoke(NativeMethodAccessorImpl.java:57)
	at sun.reflect.DelegatingMethodAccessorImpl.invoke(DelegatingMethodAccessorImpl.java:43)
	at java.lang.reflect.Method.invoke(Method.java:601)
	at com.carrotsearch.randomizedtesting.RandomizedRunner.invoke(RandomizedRunner.java:1559)
	at com.carrotsearch.randomizedtesting.RandomizedRunner.access$600(RandomizedRunner.java:79)
	at com.carrotsearch.randomizedtesting.RandomizedRunner$6.evaluate(RandomizedRunner.java:737)
	at com.carrotsearch.randomizedtesting.RandomizedRunner$7.evaluate(RandomizedRunner.java:773)
	at com.carrotsearch.randomizedtesting.RandomizedRunner$8.evaluate(RandomizedRunner.java:787)
	at com.carrotsearch.randomizedtesting.rules.SystemPropertiesRestoreRule$1.evaluate(SystemPropertiesRestoreRule.java:53)
	at org.apache.lucene.util.TestRuleSetupTeardownChained$1.evaluate(TestRuleSetupTeardownChained.java:50)
	at org.apache.lucene.util.TestRuleFieldCacheSanity$1.evaluate(TestRuleFieldCacheSanity.java:51)
	at org.apache.lucene.util.AbstractBeforeAfterRule$1.evaluate(AbstractBeforeAfterRule.java:45)
	at com.carrotsearch.randomizedtesting.rules.SystemPropertiesInvariantRule$1.evaluate(SystemPropertiesInvariantRule.java:55)
	at org.apache.lucene.util.TestRuleThreadAndTestName$1.evaluate(TestRuleThreadAndTestName.java:48)
	at org.apache.lucene.util.TestRuleIgnoreAfterMaxFailures$1.evaluate(TestRuleIgnoreAfterMaxFailures.java:70)
	at org.apache.lucene.util.TestRuleMarkFailure$1.evaluate(TestRuleMarkFailure.java:48)
	at com.carrotsearch.randomizedtesting.rules.StatementAdapter.evaluate(StatementAdapter.java:36)
	at com.carrotsearch.randomizedtesting.ThreadLeakControl$StatementRunner.run(ThreadLeakControl.java:358)
	at com.carrotsearch.randomizedtesting.ThreadLeakControl.forkTimeoutingTask(ThreadLeakControl.java:782)
	at com.carrotsearch.randomizedtesting.ThreadLeakControl$3.evaluate(ThreadLeakControl.java:442)
	at com.carrotsearch.randomizedtesting.RandomizedRunner.runSingleTest(RandomizedRunner.java:746)
	at com.carrotsearch.randomizedtesting.RandomizedRunner$3.evaluate(RandomizedRunner.java:648)
	at com.carrotsearch.randomizedtesting.RandomizedRunner$4.evaluate(RandomizedRunner.java:682)
	at com.carrotsearch.randomizedtesting.RandomizedRunner$5.evaluate(RandomizedRunner.java:693)
	at com.carrotsearch.randomizedtesting.rules.StatementAdapter.evaluate(StatementAdapter.java:36)
	at com.carrotsearch.randomizedtesting.rules.SystemPropertiesRestoreRule$1.evaluate(SystemPropertiesRestoreRule.java:53)
	at org.apache.lucene.util.AbstractBeforeAfterRule$1.evaluate(AbstractBeforeAfterRule.java:45)
	at org.apache.lucene.util.TestRuleStoreClassName$1.evaluate(TestRuleStoreClassName.java:42)
	at com.carrotsearch.randomizedtesting.rules.SystemPropertiesInvariantRule$1.evaluate(SystemPropertiesInvariantRule.java:55)
	at com.carrotsearch.randomizedtesting.rules.NoShadowingOrOverridesOnMethodsRule$1.evaluate(NoShadowingOrOverridesOnMethodsRule.java:39)
	at com.carrotsearch.randomizedtesting.rules.NoShadowingOrOverridesOnMethodsRule$1.evaluate(NoShadowingOrOverridesOnMethodsRule.java:39)
	at com.carrotsearch.randomizedtesting.rules.StatementAdapter.evaluate(StatementAdapter.java:36)
	at org.apache.lucene.util.TestRuleAssertionsRequired$1.evaluate(TestRuleAssertionsRequired.java:43)
	at org.apache.lucene.util.TestRuleMarkFailure$1.evaluate(TestRuleMarkFailure.java:48)
	at org.apache.lucene.util.TestRuleIgnoreAfterMaxFailures$1.evaluate(TestRuleIgnoreAfterMaxFailures.java:70)
	at org.apache.lucene.util.TestRuleIgnoreTestSuites$1.evaluate(TestRuleIgnoreTestSuites.java:55)
	at com.carrotsearch.randomizedtesting.rules.StatementAdapter.evaluate(StatementAdapter.java:36)
	at com.carrotsearch.randomizedtesting.ThreadLeakControl$StatementRunner.run(ThreadLeakControl.java:358)
	at java.lang.Thread.run(Thread.java:722)




Build Log:
[...truncated 8281 lines...]
[junit4:junit4] Suite: org.apache.solr.cloud.BasicDistributedZk2Test
[junit4:junit4]   2> 4 T1495 oas.SolrTestCaseJ4.setUp ###Starting testDistribSearch
[junit4:junit4]   2> Creating dataDir: /usr/home/hudson/hudson-slave/workspace/Lucene-Solr-Tests-4.x-java7/solr/build/solr-core/test/J1/./solrtest-BasicDistributedZk2Test-1347716811396
[junit4:junit4]   2> 6 T1495 oasc.ZkTestServer.run STARTING ZK TEST SERVER
[junit4:junit4]   2> 9 T1496 oazs.ZooKeeperServer.setTickTime tickTime set to 1000
[junit4:junit4]   2> 10 T1496 oazs.NIOServerCnxn$Factory.<init> binding to port 0.0.0.0/0.0.0.0:0
[junit4:junit4]   2> 11 T1496 oazsp.FileTxnSnapLog.save Snapshotting: 0
[junit4:junit4]   2> 107 T1495 oasc.ZkTestServer.run start zk server on port:15224
[junit4:junit4]   2> 107 T1495 oaz.ZooKeeper.<init> Initiating client connection, connectString=127.0.0.1:15224 sessionTimeout=10000 watcher=org.apache.solr.common.cloud.ConnectionManager@2af6d178
[junit4:junit4]   2> 108 T1501 oaz.ClientCnxn$SendThread.startConnect Opening socket connection to server /127.0.0.1:15224
[junit4:junit4]   2> 108 T1495 oascc.ConnectionManager.waitForConnected Waiting for client to connect to ZooKeeper
[junit4:junit4]   2> 109 T1501 oaz.ClientCnxn$SendThread.primeConnection Socket connection established to localhost/127.0.0.1:15224, initiating session
[junit4:junit4]   2> 109 T1497 oazs.NIOServerCnxn$Factory.run Accepted socket connection from /140.211.11.196:12808
[junit4:junit4]   2> 110 T1497 oazs.NIOServerCnxn.readConnectRequest Client attempting to establish new session at /140.211.11.196:12808
[junit4:junit4]   2> 110 T1499 oazsp.FileTxnLog.append Creating new log file: log.1
[junit4:junit4]   2> 141 T1499 oazs.NIOServerCnxn.finishSessionInit Established session 0x139ca2e8a8b0000 with negotiated timeout 10000 for client /140.211.11.196:12808
[junit4:junit4]   2> 141 T1501 oaz.ClientCnxn$SendThread.readConnectResult Session establishment complete on server localhost/127.0.0.1:15224, sessionid = 0x139ca2e8a8b0000, negotiated timeout = 10000
[junit4:junit4]   2> 142 T1502 oascc.ConnectionManager.process Watcher org.apache.solr.common.cloud.ConnectionManager@2af6d178 name:ZooKeeperConnection Watcher:127.0.0.1:15224 got event WatchedEvent state:SyncConnected type:None path:null path:null type:None
[junit4:junit4]   2> 142 T1495 oascc.ConnectionManager.waitForConnected Client is connected to ZooKeeper
[junit4:junit4]   2> 143 T1495 oascc.SolrZkClient.makePath makePath: /solr
[junit4:junit4]   2> 146 T1500 oazs.PrepRequestProcessor.pRequest Processed session termination for sessionid: 0x139ca2e8a8b0000
[junit4:junit4]   2> 147 T1502 oaz.ClientCnxn$EventThread.run EventThread shut down
[junit4:junit4]   2> 147 T1495 oaz.ZooKeeper.close Session: 0x139ca2e8a8b0000 closed
[junit4:junit4]   2> 148 T1497 oazs.NIOServerCnxn.doIO WARNING EndOfStreamException: Unable to read additional data from client sessionid 0x139ca2e8a8b0000, likely client has closed socket
[junit4:junit4]   2> 148 T1495 oaz.ZooKeeper.<init> Initiating client connection, connectString=127.0.0.1:15224/solr sessionTimeout=10000 watcher=org.apache.solr.common.cloud.ConnectionManager@38080cbb
[junit4:junit4]   2> 149 T1497 oazs.NIOServerCnxn.closeSock Closed socket connection for client /140.211.11.196:12808 which had sessionid 0x139ca2e8a8b0000
[junit4:junit4]   2> 149 T1503 oaz.ClientCnxn$SendThread.startConnect Opening socket connection to server /127.0.0.1:15224
[junit4:junit4]   2> 149 T1495 oascc.ConnectionManager.waitForConnected Waiting for client to connect to ZooKeeper
[junit4:junit4]   2> 150 T1503 oaz.ClientCnxn$SendThread.primeConnection Socket connection established to localhost/127.0.0.1:15224, initiating session
[junit4:junit4]   2> 150 T1497 oazs.NIOServerCnxn$Factory.run Accepted socket connection from /140.211.11.196:37134
[junit4:junit4]   2> 151 T1497 oazs.NIOServerCnxn.readConnectRequest Client attempting to establish new session at /140.211.11.196:37134
[junit4:junit4]   2> 158 T1499 oazs.NIOServerCnxn.finishSessionInit Established session 0x139ca2e8a8b0001 with negotiated timeout 10000 for client /140.211.11.196:37134
[junit4:junit4]   2> 158 T1503 oaz.ClientCnxn$SendThread.readConnectResult Session establishment complete on server localhost/127.0.0.1:15224, sessionid = 0x139ca2e8a8b0001, negotiated timeout = 10000
[junit4:junit4]   2> 158 T1504 oascc.ConnectionManager.process Watcher org.apache.solr.common.cloud.ConnectionManager@38080cbb name:ZooKeeperConnection Watcher:127.0.0.1:15224/solr got event WatchedEvent state:SyncConnected type:None path:null path:null type:None
[junit4:junit4]   2> 158 T1495 oascc.ConnectionManager.waitForConnected Client is connected to ZooKeeper
[junit4:junit4]   2> 159 T1495 oascc.SolrZkClient.makePath makePath: /collections/collection1
[junit4:junit4]   2> 163 T1495 oascc.SolrZkClient.makePath makePath: /collections/collection1/shards
[junit4:junit4]   2> 172 T1495 oascc.SolrZkClient.makePath makePath: /collections/control_collection
[junit4:junit4]   2> 174 T1495 oascc.SolrZkClient.makePath makePath: /collections/control_collection/shards
[junit4:junit4]   2> 177 T1495 oasc.AbstractZkTestCase.putConfig put /usr/home/hudson/hudson-slave/workspace/Lucene-Solr-Tests-4.x-java7/solr/build/solr-core/test-files/solr/collection1/conf/solrconfig.xml to /configs/conf1/solrconfig.xml
[junit4:junit4]   2> 178 T1495 oascc.SolrZkClient.makePath makePath: /configs/conf1/solrconfig.xml
[junit4:junit4]   2> 190 T1495 oasc.AbstractZkTestCase.putConfig put /usr/home/hudson/hudson-slave/workspace/Lucene-Solr-Tests-4.x-java7/solr/build/solr-core/test-files/solr/collection1/conf/schema.xml to /configs/conf1/schema.xml
[junit4:junit4]   2> 191 T1495 oascc.SolrZkClient.makePath makePath: /configs/conf1/schema.xml
[junit4:junit4]   2> 296 T1495 oasc.AbstractZkTestCase.putConfig put /usr/home/hudson/hudson-slave/workspace/Lucene-Solr-Tests-4.x-java7/solr/build/solr-core/test-files/solr/collection1/conf/solrconfig.xml to /configs/conf1/solrconfig.xml
[junit4:junit4]   2> 297 T1495 oascc.SolrZkClient.makePath makePath: /configs/conf1/solrconfig.xml
[junit4:junit4]   2> 301 T1495 oasc.AbstractZkTestCase.putConfig put /usr/home/hudson/hudson-slave/workspace/Lucene-Solr-Tests-4.x-java7/solr/build/solr-core/test-files/solr/collection1/conf/stopwords.txt to /configs/conf1/stopwords.txt
[junit4:junit4]   2> 302 T1495 oascc.SolrZkClient.makePath makePath: /configs/conf1/stopwords.txt
[junit4:junit4]   2> 314 T1495 oasc.AbstractZkTestCase.putConfig put /usr/home/hudson/hudson-slave/workspace/Lucene-Solr-Tests-4.x-java7/solr/build/solr-core/test-files/solr/collection1/conf/protwords.txt to /configs/conf1/protwords.txt
[junit4:junit4]   2> 315 T1495 oascc.SolrZkClient.makePath makePath: /configs/conf1/protwords.txt
[junit4:junit4]   2> 318 T1495 oasc.AbstractZkTestCase.putConfig put /usr/home/hudson/hudson-slave/workspace/Lucene-Solr-Tests-4.x-java7/solr/build/solr-core/test-files/solr/collection1/conf/currency.xml to /configs/conf1/currency.xml
[junit4:junit4]   2> 319 T1495 oascc.SolrZkClient.makePath makePath: /configs/conf1/currency.xml
[junit4:junit4]   2> 322 T1495 oasc.AbstractZkTestCase.putConfig put /usr/home/hudson/hudson-slave/workspace/Lucene-Solr-Tests-4.x-java7/solr/build/solr-core/test-files/solr/collection1/conf/open-exchange-rates.json to /configs/conf1/open-exchange-rates.json
[junit4:junit4]   2> 323 T1495 oascc.SolrZkClient.makePath makePath: /configs/conf1/open-exchange-rates.json
[junit4:junit4]   2> 326 T1495 oasc.AbstractZkTestCase.putConfig put /usr/home/hudson/hudson-slave/workspace/Lucene-Solr-Tests-4.x-java7/solr/build/solr-core/test-files/solr/collection1/conf/mapping-ISOLatin1Accent.txt to /configs/conf1/mapping-ISOLatin1Accent.txt
[junit4:junit4]   2> 327 T1495 oascc.SolrZkClient.makePath makePath: /configs/conf1/mapping-ISOLatin1Accent.txt
[junit4:junit4]   2> 330 T1495 oasc.AbstractZkTestCase.putConfig put /usr/home/hudson/hudson-slave/workspace/Lucene-Solr-Tests-4.x-java7/solr/build/solr-core/test-files/solr/collection1/conf/old_synonyms.txt to /configs/conf1/old_synonyms.txt
[junit4:junit4]   2> 331 T1495 oascc.SolrZkClient.makePath makePath: /configs/conf1/old_synonyms.txt
[junit4:junit4]   2> 334 T1495 oasc.AbstractZkTestCase.putConfig put /usr/home/hudson/hudson-slave/workspace/Lucene-Solr-Tests-4.x-java7/solr/build/solr-core/test-files/solr/collection1/conf/synonyms.txt to /configs/conf1/synonyms.txt
[junit4:junit4]   2> 334 T1495 oascc.SolrZkClient.makePath makePath: /configs/conf1/synonyms.txt
[junit4:junit4]   2> 337 T1500 oazs.PrepRequestProcessor.pRequest Processed session termination for sessionid: 0x139ca2e8a8b0001
[junit4:junit4]   2> 339 T1504 oaz.ClientCnxn$EventThread.run EventThread shut down
[junit4:junit4]   2> 339 T1497 oazs.NIOServerCnxn.closeSock Closed socket connection for client /140.211.11.196:37134 which had sessionid 0x139ca2e8a8b0001
[junit4:junit4]   2> 339 T1495 oaz.ZooKeeper.close Session: 0x139ca2e8a8b0001 closed
[junit4:junit4]   2> 342 T1495 oejs.Server.doStart jetty-8.1.2.v20120308
[junit4:junit4]   2> 345 T1495 oejs.AbstractConnector.doStart Started SocketConnector@0.0.0.0:10684
[junit4:junit4]   2> 345 T1495 oasc.SolrResourceLoader.locateSolrHome JNDI not configured for solr (NoInitialContextEx)
[junit4:junit4]   2> 346 T1495 oasc.SolrResourceLoader.locateSolrHome using system property solr.solr.home: /usr/home/hudson/hudson-slave/workspace/Lucene-Solr-Tests-4.x-java7/solr/build/solr-core/test-files/solr
[junit4:junit4]   2> 346 T1495 oasc.SolrResourceLoader.<init> new SolrResourceLoader for deduced Solr Home: '/usr/home/hudson/hudson-slave/workspace/Lucene-Solr-Tests-4.x-java7/solr/build/solr-core/test-files/solr/'
[junit4:junit4]   2> 385 T1495 oass.SolrDispatchFilter.init SolrDispatchFilter.init()
[junit4:junit4]   2> 386 T1495 oasc.SolrResourceLoader.locateSolrHome JNDI not configured for solr (NoInitialContextEx)
[junit4:junit4]   2> 386 T1495 oasc.SolrResourceLoader.locateSolrHome using system property solr.solr.home: /usr/home/hudson/hudson-slave/workspace/Lucene-Solr-Tests-4.x-java7/solr/build/solr-core/test-files/solr
[junit4:junit4]   2> 387 T1495 oasc.CoreContainer$Initializer.initialize looking for solr.xml: /usr/home/hudson/hudson-slave/workspace/Lucene-Solr-Tests-4.x-java7/solr/build/solr-core/test-files/solr/solr.xml
[junit4:junit4]   2> 387 T1495 oasc.CoreContainer.<init> New CoreContainer 1698912830
[junit4:junit4]   2> 388 T1495 oasc.CoreContainer.load Loading CoreContainer using Solr Home: '/usr/home/hudson/hudson-slave/workspace/Lucene-Solr-Tests-4.x-java7/solr/build/solr-core/test-files/solr/'
[junit4:junit4]   2> 388 T1495 oasc.SolrResourceLoader.<init> new SolrResourceLoader for directory: '/usr/home/hudson/hudson-slave/workspace/Lucene-Solr-Tests-4.x-java7/solr/build/solr-core/test-files/solr/'
[junit4:junit4]   2> 423 T1495 oasc.CoreContainer.load Registering Log Listener
[junit4:junit4]   2> 444 T1495 oasc.CoreContainer.initZooKeeper Zookeeper client=127.0.0.1:15224/solr
[junit4:junit4]   2> 444 T1495 oaz.ZooKeeper.<init> Initiating client connection, connectString=127.0.0.1:15224/solr sessionTimeout=5000 watcher=org.apache.solr.common.cloud.ConnectionManager@415af408
[junit4:junit4]   2> 445 T1514 oaz.ClientCnxn$SendThread.startConnect Opening socket connection to server /127.0.0.1:15224
[junit4:junit4]   2> 445 T1495 oascc.ConnectionManager.waitForConnected Waiting for client to connect to ZooKeeper
[junit4:junit4]   2> 447 T1514 oaz.ClientCnxn$SendThread.primeConnection Socket connection established to localhost/127.0.0.1:15224, initiating session
[junit4:junit4]   2> 447 T1497 oazs.NIOServerCnxn$Factory.run Accepted socket connection from /140.211.11.196:33407
[junit4:junit4]   2> 447 T1497 oazs.NIOServerCnxn.readConnectRequest Client attempting to establish new session at /140.211.11.196:33407
[junit4:junit4]   2> 453 T1499 oazs.NIOServerCnxn.finishSessionInit Established session 0x139ca2e8a8b0002 with negotiated timeout 5000 for client /140.211.11.196:33407
[junit4:junit4]   2> 453 T1514 oaz.ClientCnxn$SendThread.readConnectResult Session establishment complete on server localhost/127.0.0.1:15224, sessionid = 0x139ca2e8a8b0002, negotiated timeout = 5000
[junit4:junit4]   2> 453 T1515 oascc.ConnectionManager.process Watcher org.apache.solr.common.cloud.ConnectionManager@415af408 name:ZooKeeperConnection Watcher:127.0.0.1:15224/solr got event WatchedEvent state:SyncConnected type:None path:null path:null type:None
[junit4:junit4]   2> 453 T1495 oascc.ConnectionManager.waitForConnected Client is connected to ZooKeeper
[junit4:junit4]   2> 455 T1500 oazs.PrepRequestProcessor.pRequest Got user-level KeeperException when processing sessionid:0x139ca2e8a8b0002 type:create cxid:0x2 zxid:0xfffffffffffffffe txntype:unknown reqpath:n/a Error Path:/solr/overseer Error:KeeperErrorCode = NodeExists for /solr/overseer
[junit4:junit4]   2> 457 T1495 oascc.SolrZkClient.makePath makePath: /live_nodes
[junit4:junit4]   2> 467 T1495 oasc.ZkController.createEphemeralLiveNode Register node as live in ZooKeeper:/live_nodes/127.0.0.1:10684_solr
[junit4:junit4]   2> 467 T1500 oazs.PrepRequestProcessor.pRequest Got user-level KeeperException when processing sessionid:0x139ca2e8a8b0002 type:delete cxid:0x7 zxid:0xfffffffffffffffe txntype:unknown reqpath:n/a Error Path:/solr/live_nodes/127.0.0.1:10684_solr Error:KeeperErrorCode = NoNode for /solr/live_nodes/127.0.0.1:10684_solr
[junit4:junit4]   2> 468 T1495 oascc.SolrZkClient.makePath makePath: /live_nodes/127.0.0.1:10684_solr
[junit4:junit4]   2> 471 T1495 oashc.HttpShardHandlerFactory.getParameter Setting socketTimeout to: 0
[junit4:junit4]   2> 472 T1495 oashc.HttpShardHandlerFactory.getParameter Setting urlScheme to: http://
[junit4:junit4]   2> 472 T1495 oashc.HttpShardHandlerFactory.getParameter Setting connTimeout to: 0
[junit4:junit4]   2> 473 T1495 oashc.HttpShardHandlerFactory.getParameter Setting maxConnectionsPerHost to: 20
[junit4:junit4]   2> 473 T1495 oashc.HttpShardHandlerFactory.getParameter Setting corePoolSize to: 0
[junit4:junit4]   2> 474 T1495 oashc.HttpShardHandlerFactory.getParameter Setting maximumPoolSize to: 2147483647
[junit4:junit4]   2> 474 T1495 oashc.HttpShardHandlerFactory.getParameter Setting maxThreadIdleTime to: 5
[junit4:junit4]   2> 475 T1495 oashc.HttpShardHandlerFactory.getParameter Setting sizeOfQueue to: -1
[junit4:junit4]   2> 475 T1495 oashc.HttpShardHandlerFactory.getParameter Setting fairnessPolicy to: false
[junit4:junit4]   2> 476 T1495 oascsi.HttpClientUtil.createClient Creating new http client, config:maxConnectionsPerHost=20&maxConnections=10000&socketTimeout=0&connTimeout=0&retry=false
[junit4:junit4]   2> 492 T1495 oascc.SolrZkClient.makePath makePath: /overseer_elect/election
[junit4:junit4]   2> 498 T1500 oazs.PrepRequestProcessor.pRequest Got user-level KeeperException when processing sessionid:0x139ca2e8a8b0002 type:delete cxid:0x15 zxid:0xfffffffffffffffe txntype:unknown reqpath:n/a Error Path:/solr/overseer_elect/leader Error:KeeperErrorCode = NoNode for /solr/overseer_elect/leader
[junit4:junit4]   2> 507 T1495 oascc.SolrZkClient.makePath makePath: /overseer_elect/leader
[junit4:junit4]   2> 510 T1495 oasc.Overseer.start Overseer (id=88323968952107010-127.0.0.1:10684_solr-n_0000000000) starting
[junit4:junit4]   2> 510 T1500 oazs.PrepRequestProcessor.pRequest Got user-level KeeperException when processing sessionid:0x139ca2e8a8b0002 type:create cxid:0x1a zxid:0xfffffffffffffffe txntype:unknown reqpath:n/a Error Path:/solr/overseer Error:KeeperErrorCode = NodeExists for /solr/overseer
[junit4:junit4]   2> 512 T1500 oazs.PrepRequestProcessor.pRequest Got user-level KeeperException when processing sessionid:0x139ca2e8a8b0002 type:create cxid:0x1b zxid:0xfffffffffffffffe txntype:unknown reqpath:n/a Error Path:/solr/overseer Error:KeeperErrorCode = NodeExists for /solr/overseer
[junit4:junit4]   2> 513 T1500 oazs.PrepRequestProcessor.pRequest Got user-level KeeperException when processing sessionid:0x139ca2e8a8b0002 type:create cxid:0x1c zxid:0xfffffffffffffffe txntype:unknown reqpath:n/a Error Path:/solr/overseer Error:KeeperErrorCode = NodeExists for /solr/overseer
[junit4:junit4]   2> 523 T1500 oazs.PrepRequestProcessor.pRequest Got user-level KeeperException when processing sessionid:0x139ca2e8a8b0002 type:create cxid:0x1d zxid:0xfffffffffffffffe txntype:unknown reqpath:n/a Error Path:/solr/overseer Error:KeeperErrorCode = NodeExists for /solr/overseer
[junit4:junit4]   2> 525 T1517 oasc.OverseerCollectionProcessor.run Process current queue of collection creations
[junit4:junit4]   2> 525 T1495 oascc.SolrZkClient.makePath makePath: /clusterstate.json
[junit4:junit4]   2> 528 T1495 oascc.ZkStateReader.createClusterStateWatchersAndUpdate Updating cluster state from ZooKeeper... 
[junit4:junit4]   2> 531 T1516 oasc.Overseer$ClusterStateUpdater.run Starting to work on the main queue
[junit4:junit4]   2> 535 T1495 oasc.CoreContainer.create Creating SolrCore 'collection1' using instanceDir: /usr/home/hudson/hudson-slave/workspace/Lucene-Solr-Tests-4.x-java7/solr/build/solr-core/test-files/solr/collection1
[junit4:junit4]   2> 536 T1495 oasc.ZkController.createCollectionZkNode Check for collection zkNode:control_collection
[junit4:junit4]   2> 537 T1495 oasc.ZkController.createCollectionZkNode Collection zkNode exists
[junit4:junit4]   2> 537 T1495 oasc.ZkController.readConfigName Load collection config from:/collections/control_collection
[junit4:junit4]   2> 538 T1495 oasc.SolrResourceLoader.<init> new SolrResourceLoader for directory: '/usr/home/hudson/hudson-slave/workspace/Lucene-Solr-Tests-4.x-java7/solr/build/solr-core/test-files/solr/collection1/'
[junit4:junit4]   2> 540 T1495 oasc.SolrResourceLoader.replaceClassLoader Adding 'file:/usr/home/hudson/hudson-slave/workspace/Lucene-Solr-Tests-4.x-java7/solr/build/solr-core/test-files/solr/collection1/lib/classes/' to classloader
[junit4:junit4]   2> 540 T1495 oasc.SolrResourceLoader.replaceClassLoader Adding 'file:/usr/home/hudson/hudson-slave/workspace/Lucene-Solr-Tests-4.x-java7/solr/build/solr-core/test-files/solr/collection1/lib/README' to classloader
[junit4:junit4]   2> 590 T1495 oasc.SolrConfig.<init> Using Lucene MatchVersion: LUCENE_40
[junit4:junit4]   2> 658 T1495 oasc.SolrConfig.<init> Loaded SolrConfig: solrconfig.xml
[junit4:junit4]   2> 759 T1495 oass.IndexSchema.readSchema Reading Solr Schema
[junit4:junit4]   2> 766 T1495 oass.IndexSchema.readSchema Schema name=test
[junit4:junit4]   2> 1405 T1495 oass.OpenExchangeRatesOrgProvider.init Initialized with rates=open-exchange-rates.json, refreshInterval=1440.
[junit4:junit4]   2> 1417 T1495 oass.IndexSchema.readSchema default search field in schema is text
[junit4:junit4]   2> 1422 T1495 oass.IndexSchema.readSchema unique key field: id
[junit4:junit4]   2> 1436 T1495 oass.FileExchangeRateProvider.reload Reloading exchange rates from file currency.xml
[junit4:junit4]   2> 1441 T1495 oass.FileExchangeRateProvider.reload Reloading exchange rates from file currency.xml
[junit4:junit4]   2> 1445 T1495 oass.OpenExchangeRatesOrgProvider.reload Reloading exchange rates from open-exchange-rates.json
[junit4:junit4]   2> 1447 T1495 oass.OpenExchangeRatesOrgProvider.reload Reloading exchange rates from open-exchange-rates.json
[junit4:junit4]   2> 1448 T1495 oasc.SolrCore.<init> [collection1] Opening new SolrCore at /usr/home/hudson/hudson-slave/workspace/Lucene-Solr-Tests-4.x-java7/solr/build/solr-core/test-files/solr/collection1/, dataDir=./org.apache.solr.cloud.BasicDistributedZk2Test-1347716811396/control/data/
[junit4:junit4]   2> 1449 T1495 oasc.JmxMonitoredMap.<init> JMX monitoring is enabled. Adding Solr mbeans to JMX Server: com.sun.jmx.mbeanserver.JmxMBeanServer@106051c1
[junit4:junit4]   2> 1450 T1495 oasc.SolrCore.getNewIndexDir WARNING New index directory detected: old=null new=./org.apache.solr.cloud.BasicDistributedZk2Test-1347716811396/control/data/index/
[junit4:junit4]   2> 1451 T1495 oasc.SolrCore.initIndex WARNING [collection1] Solr index directory './org.apache.solr.cloud.BasicDistributedZk2Test-1347716811396/control/data/index' doesn't exist. Creating new index...
[junit4:junit4]   2> 1453 T1495 oasc.CachingDirectoryFactory.get return new directory for /usr/home/hudson/hudson-slave/workspace/Lucene-Solr-Tests-4.x-java7/solr/build/solr-core/test/J1/./org.apache.solr.cloud.BasicDistributedZk2Test-1347716811396/control/data/index forceNew:false
[junit4:junit4]   2> 1487 T1495 oasc.SolrDeletionPolicy.onCommit SolrDeletionPolicy.onCommit: commits:num=1
[junit4:junit4]   2> 		commit{dir=NRTCachingDirectory(org.apache.lucene.store.NIOFSDirectory@/usr/home/hudson/hudson-slave/workspace/Lucene-Solr-Tests-4.x-java7/solr/build/solr-core/test/J1/org.apache.solr.cloud.BasicDistributedZk2Test-1347716811396/control/data/index lockFactory=org.apache.lucene.store.NativeFSLockFactory@f7632e7; maxCacheMB=48.0 maxMergeSizeMB=4.0),segFN=segments_1,generation=1,filenames=[segments_1]
[junit4:junit4]   2> 1488 T1495 oasc.SolrDeletionPolicy.updateCommits newest commit = 1
[junit4:junit4]   2> 1489 T1495 oasc.SolrCore.initWriters created xml: solr.XMLResponseWriter
[junit4:junit4]   2> 1492 T1495 oasup.UpdateRequestProcessorChain.init inserting DistributedUpdateProcessorFactory into updateRequestProcessorChain "dedupe"
[junit4:junit4]   2> 1492 T1495 oasup.UpdateRequestProcessorChain.init inserting DistributedUpdateProcessorFactory into updateRequestProcessorChain "dedupe-allfields"
[junit4:junit4]   2> 1493 T1495 oasup.UpdateRequestProcessorChain.init inserting DistributedUpdateProcessorFactory into updateRequestProcessorChain "stored_sig"
[junit4:junit4]   2> 1493 T1495 oasup.UpdateRequestProcessorChain.init inserting DistributedUpdateProcessorFactory into updateRequestProcessorChain "uniq-fields"
[junit4:junit4]   2> 1494 T1495 oasup.UpdateRequestProcessorChain.init inserting DistributedUpdateProcessorFactory into updateRequestProcessorChain "distrib-dup-test-chain-implicit"
[junit4:junit4]   2> 1495 T1495 oasc.RequestHandlers.initHandlersFromConfig adding lazy requestHandler: solr.ReplicationHandler
[junit4:junit4]   2> 1495 T1495 oasc.RequestHandlers.initHandlersFromConfig created /replication: solr.ReplicationHandler
[junit4:junit4]   2> 1496 T1495 oasc.RequestHandlers.initHandlersFromConfig created standard: solr.StandardRequestHandler
[junit4:junit4]   2> 1497 T1495 oasc.RequestHandlers.initHandlersFromConfig created /get: solr.RealTimeGetHandler
[junit4:junit4]   2> 1497 T1495 oasc.RequestHandlers.initHandlersFromConfig created dismax: solr.SearchHandler
[junit4:junit4]   2> 1498 T1495 oasc.RequestHandlers.initHandlersFromConfig created mock: org.apache.solr.core.MockQuerySenderListenerReqHandler
[junit4:junit4]   2> 1499 T1495 oasc.RequestHandlers.initHandlersFromConfig created /admin/: org.apache.solr.handler.admin.AdminHandlers
[junit4:junit4]   2> 1499 T1495 oasc.RequestHandlers.initHandlersFromConfig created defaults: solr.StandardRequestHandler
[junit4:junit4]   2> 1500 T1495 oasc.RequestHandlers.initHandlersFromConfig adding lazy requestHandler: solr.StandardRequestHandler
[junit4:junit4]   2> 1500 T1495 oasc.RequestHandlers.initHandlersFromConfig created lazy: solr.StandardRequestHandler
[junit4:junit4]   2> 1501 T1495 oasc.RequestHandlers.initHandlersFromConfig created /update: solr.UpdateRequestHandler
[junit4:junit4]   2> 1502 T1495 oasc.RequestHandlers.initHandlersFromConfig created /terms: org.apache.solr.handler.component.SearchHandler
[junit4:junit4]   2> 1502 T1495 oasc.RequestHandlers.initHandlersFromConfig created spellCheckCompRH: org.apache.solr.handler.component.SearchHandler
[junit4:junit4]   2> 1503 T1495 oasc.RequestHandlers.initHandlersFromConfig created spellCheckCompRH_Direct: org.apache.solr.handler.component.SearchHandler
[junit4:junit4]   2> 1503 T1495 oasc.RequestHandlers.initHandlersFromConfig created spellCheckWithWordbreak: org.apache.solr.handler.component.SearchHandler
[junit4:junit4]   2> 1504 T1495 oasc.RequestHandlers.initHandlersFromConfig created spellCheckWithWordbreak_Direct: org.apache.solr.handler.component.SearchHandler
[junit4:junit4]   2> 1505 T1495 oasc.RequestHandlers.initHandlersFromConfig created spellCheckCompRH1: org.apache.solr.handler.component.SearchHandler
[junit4:junit4]   2> 1505 T1495 oasc.RequestHandlers.initHandlersFromConfig created tvrh: org.apache.solr.handler.component.SearchHandler
[junit4:junit4]   2> 1506 T1495 oasc.RequestHandlers.initHandlersFromConfig created /mlt: solr.MoreLikeThisHandler
[junit4:junit4]   2> 1507 T1495 oasc.RequestHandlers.initHandlersFromConfig created /debug/dump: solr.DumpRequestHandler
[junit4:junit4]   2> 1511 T1495 oashl.XMLLoader.init xsltCacheLifetimeSeconds=60
[junit4:junit4]   2> 1515 T1495 oasc.SolrCore.initDeprecatedSupport WARNING solrconfig.xml uses deprecated <admin/gettableFiles>, Please update your config to use the ShowFileRequestHandler.
[junit4:junit4]   2> 1517 T1495 oasc.SolrCore.initDeprecatedSupport WARNING adding ShowFileRequestHandler with hidden files: [SCHEMA.XML, OLD_SYNONYMS.TXT, STOPWORDS.TXT, PROTWORDS.TXT, OPEN-EXCHANGE-RATES.JSON, SYNONYMS.TXT, CURRENCY.XML, MAPPING-ISOLATIN1ACCENT.TXT]
[junit4:junit4]   2> 1521 T1495 oass.SolrIndexSearcher.<init> Opening Searcher@c6a716d main
[junit4:junit4]   2> 1522 T1495 oasu.CommitTracker.<init> Hard AutoCommit: disabled
[junit4:junit4]   2> 1523 T1495 oasu.CommitTracker.<init> Soft AutoCommit: disabled
[junit4:junit4]   2> 1523 T1495 oashc.SpellCheckComponent.inform Initializing spell checkers
[junit4:junit4]   2> 1534 T1495 oass.DirectSolrSpellChecker.init init: {name=direct,classname=DirectSolrSpellChecker,field=lowerfilt,minQueryLength=3}
[junit4:junit4]   2> 1628 T1518 oasc.SolrCore.registerSearcher [collection1] Registered new searcher Searcher@c6a716d main{StandardDirectoryReader(segments_1:1)}
[junit4:junit4]   2> 1633 T1500 oazs.PrepRequestProcessor.pRequest Got user-level KeeperException when processing sessionid:0x139ca2e8a8b0002 type:create cxid:0x56 zxid:0xfffffffffffffffe txntype:unknown reqpath:n/a Error Path:/solr/overseer/queue Error:KeeperErrorCode = NoNode for /solr/overseer/queue
[junit4:junit4]   2> 1644 T1495 oasc.CoreContainer.register registering core: collection1
[junit4:junit4]   2> 1645 T1495 oasc.ZkController.register Register shard - core:collection1 address:http://127.0.0.1:10684/solr shardId:control_shard
[junit4:junit4]   2> 1646 T1495 oascc.SolrZkClient.makePath makePath: /collections/control_collection/leader_elect/control_shard/election
[junit4:junit4]   2> 1661 T1500 oazs.PrepRequestProcessor.pRequest Got user-level KeeperException when processing sessionid:0x139ca2e8a8b0002 type:delete cxid:0x65 zxid:0xfffffffffffffffe txntype:unknown reqpath:n/a Error Path:/solr/collections/control_collection/leaders Error:KeeperErrorCode = NoNode for /solr/collections/control_collection/leaders
[junit4:junit4]   2> 1662 T1495 oasc.ShardLeaderElectionContext.runLeaderProcess Running the leader process.
[junit4:junit4]   2> 1663 T1500 oazs.PrepRequestProcessor.pRequest Got user-level KeeperException when processing sessionid:0x139ca2e8a8b0002 type:create cxid:0x66 zxid:0xfffffffffffffffe txntype:unknown reqpath:n/a Error Path:/solr/overseer Error:KeeperErrorCode = NodeExists for /solr/overseer
[junit4:junit4]   2> 2038 T1516 oascc.ZkStateReader.updateClusterState Updating cloud state from ZooKeeper... 
[junit4:junit4]   2> 2039 T1500 oazs.PrepRequestProcessor.pRequest Got user-level KeeperException when processing sessionid:0x139ca2e8a8b0002 type:create cxid:0x6d zxid:0xfffffffffffffffe txntype:unknown reqpath:n/a Error Path:/solr/overseer/queue-work Error:KeeperErrorCode = NoNode for /solr/overseer/queue-work
[junit4:junit4]   2> 2060 T1515 oascc.ZkStateReader$2.process A cluster state change has occurred - updating...
[junit4:junit4]   2> 2165 T1495 oasc.ShardLeaderElectionContext.waitForReplicasToComeUp Enough replicas found to continue.
[junit4:junit4]   2> 2166 T1495 oasc.ShardLeaderElectionContext.runLeaderProcess I may be the new leader - try and sync
[junit4:junit4]   2> 2166 T1495 oasc.SyncStrategy.sync Sync replicas to http://127.0.0.1:10684/solr/collection1/
[junit4:junit4]   2> 2167 T1495 oasc.SyncStrategy.syncReplicas Sync Success - now sync replicas to me
[junit4:junit4]   2> 2167 T1495 oasc.SyncStrategy.syncToMe http://127.0.0.1:10684/solr/collection1/ has no replicas
[junit4:junit4]   2> 2168 T1495 oasc.ShardLeaderElectionContext.runLeaderProcess I am the new leader: http://127.0.0.1:10684/solr/collection1/
[junit4:junit4]   2> 2168 T1495 oascc.SolrZkClient.makePath makePath: /collections/control_collection/leaders/control_shard
[junit4:junit4]   2> 2174 T1500 oazs.PrepRequestProcessor.pRequest Got user-level KeeperException when processing sessionid:0x139ca2e8a8b0002 type:create cxid:0x8b zxid:0xfffffffffffffffe txntype:unknown reqpath:n/a Error Path:/solr/overseer Error:KeeperErrorCode = NodeExists for /solr/overseer
[junit4:junit4]   2> 2566 T1516 oascc.ZkStateReader.updateClusterState Updating cloud state from ZooKeeper... 
[junit4:junit4]   2> 2580 T1515 oascc.ZkStateReader$2.process A cluster state change has occurred - updating...
[junit4:junit4]   2> 2591 T1495 oasc.ZkController.register We are http://127.0.0.1:10684/solr/collection1/ and leader is http://127.0.0.1:10684/solr/collection1/
[junit4:junit4]   2> 2591 T1495 oasc.ZkController.register No LogReplay needed for core=collection1 baseURL=http://127.0.0.1:10684/solr
[junit4:junit4]   2> 2592 T1495 oasc.ZkController.checkRecovery I am the leader, no recovery necessary
[junit4:junit4]   2> 2601 T1495 oascc.ZkStateReader.updateClusterState Updating cloud state from ZooKeeper... 
[junit4:junit4]   2> 2602 T1495 oass.SolrDispatchFilter.init user.dir=/usr/home/hudson/hudson-slave/workspace/Lucene-Solr-Tests-4.x-java7/solr/build/solr-core/test/J1
[junit4:junit4]   2> 2603 T1495 oass.SolrDispatchFilter.init SolrDispatchFilter.init() done
[junit4:junit4]   2> 2603 T1495 oascsi.HttpClientUtil.createClient Creating new http client, config:maxConnections=128&maxConnectionsPerHost=32&followRedirects=false
[junit4:junit4]   2> 2619 T1495 oejs.Server.doStart jetty-8.1.2.v20120308
[junit4:junit4]   2> 2622 T1495 oejs.AbstractConnector.doStart Started SocketConnector@0.0.0.0:43302
[junit4:junit4]   2> 2623 T1495 oasc.SolrResourceLoader.locateSolrHome JNDI not configured for solr (NoInitialContextEx)
[junit4:junit4]   2> 2623 T1495 oasc.SolrResourceLoader.locateSolrHome using system property solr.solr.home: /usr/home/hudson/hudson-slave/workspace/Lucene-Solr-Tests-4.x-java7/solr/build/solr-core/test-files/solr
[junit4:junit4]   2> 2624 T1495 oasc.SolrResourceLoader.<init> new SolrResourceLoader for deduced Solr Home: '/usr/home/hudson/hudson-slave/workspace/Lucene-Solr-Tests-4.x-java7/solr/build/solr-core/test-files/solr/'
[junit4:junit4]   2> 2667 T1495 oass.SolrDispatchFilter.init SolrDispatchFilter.init()
[junit4:junit4]   2> 2667 T1495 oasc.SolrResourceLoader.locateSolrHome JNDI not configured for solr (NoInitialContextEx)
[junit4:junit4]   2> 2668 T1495 oasc.SolrResourceLoader.locateSolrHome using system property solr.solr.home: /usr/home/hudson/hudson-slave/workspace/Lucene-Solr-Tests-4.x-java7/solr/build/solr-core/test-files/solr
[junit4:junit4]   2> 2668 T1495 oasc.CoreContainer$Initializer.initialize looking for solr.xml: /usr/home/hudson/hudson-slave/workspace/Lucene-Solr-Tests-4.x-java7/solr/build/solr-core/test-files/solr/solr.xml
[junit4:junit4]   2> 2669 T1495 oasc.CoreContainer.<init> New CoreContainer 1831477986
[junit4:junit4]   2> 2670 T1495 oasc.CoreContainer.load Loading CoreContainer using Solr Home: '/usr/home/hudson/hudson-slave/workspace/Lucene-Solr-Tests-4.x-java7/solr/build/solr-core/test-files/solr/'
[junit4:junit4]   2> 2670 T1495 oasc.SolrResourceLoader.<init> new SolrResourceLoader for directory: '/usr/home/hudson/hudson-slave/workspace/Lucene-Solr-Tests-4.x-java7/solr/build/solr-core/test-files/solr/'
[junit4:junit4]   2> 2710 T1495 oasc.CoreContainer.load Registering Log Listener
[junit4:junit4]   2> 2728 T1495 oasc.CoreContainer.initZooKeeper Zookeeper client=127.0.0.1:15224/solr
[junit4:junit4]   2> 2728 T1495 oaz.ZooKeeper.<init> Initiating client connection, connectString=127.0.0.1:15224/solr sessionTimeout=5000 watcher=org.apache.solr.common.cloud.ConnectionManager@22fb4d91
[junit4:junit4]   2> 2729 T1528 oaz.ClientCnxn$SendThread.startConnect Opening socket connection to server /127.0.0.1:15224
[junit4:junit4]   2> 2729 T1495 oascc.ConnectionManager.waitForConnected Waiting for client to connect to ZooKeeper
[junit4:junit4]   2> 2731 T1528 oaz.ClientCnxn$SendThread.primeConnection Socket connection established to localhost/127.0.0.1:15224, initiating session
[junit4:junit4]   2> 2731 T1497 oazs.NIOServerCnxn$Factory.run Accepted socket connection from /140.211.11.196:54073
[junit4:junit4]   2> 2731 T1497 oazs.NIOServerCnxn.readConnectRequest Client attempting to establish new session at /140.211.11.196:54073
[junit4:junit4]   2> 2733 T1499 oazs.NIOServerCnxn.finishSessionInit Established session 0x139ca2e8a8b0003 with negotiated timeout 5000 for client /140.211.11.196:54073
[junit4:junit4]   2> 2733 T1528 oaz.ClientCnxn$SendThread.readConnectResult Session establishment complete on server localhost/127.0.0.1:15224, sessionid = 0x139ca2e8a8b0003, negotiated timeout = 5000
[junit4:junit4]   2> 2734 T1529 oascc.ConnectionManager.process Watcher org.apache.solr.common.cloud.ConnectionManager@22fb4d91 name:ZooKeeperConnection Watcher:127.0.0.1:15224/solr got event WatchedEvent state:SyncConnected type:None path:null path:null type:None
[junit4:junit4]   2> 2734 T1495 oascc.ConnectionManager.waitForConnected Client is connected to ZooKeeper
[junit4:junit4]   2> 2735 T1500 oazs.PrepRequestProcessor.pRequest Got user-level KeeperException when processing sessionid:0x139ca2e8a8b0003 type:create cxid:0x1 zxid:0xfffffffffffffffe txntype:unknown reqpath:n/a Error Path:/solr/overseer Error:KeeperErrorCode = NodeExists for /solr/overseer
[junit4:junit4]   2> 2736 T1500 oazs.PrepRequestProcessor.pRequest Got user-level KeeperException when processing sessionid:0x139ca2e8a8b0003 type:create cxid:0x2 zxid:0xfffffffffffffffe txntype:unknown reqpath:n/a Error Path:/solr/overseer Error:KeeperErrorCode = NodeExists for /solr/overseer
[junit4:junit4]   2> 2745 T1495 oasc.ZkController.createEphemeralLiveNode Register node as live in ZooKeeper:/live_nodes/127.0.0.1:43302_solr
[junit4:junit4]   2> 2745 T1500 oazs.PrepRequestProcessor.pRequest Got user-level KeeperException when processing sessionid:0x139ca2e8a8b0003 type:delete cxid:0x4 zxid:0xfffffffffffffffe txntype:unknown reqpath:n/a Error Path:/solr/live_nodes/127.0.0.1:43302_solr Error:KeeperErrorCode = NoNode for /solr/live_nodes/127.0.0.1:43302_solr
[junit4:junit4]   2> 2747 T1495 oascc.SolrZkClient.makePath makePath: /live_nodes/127.0.0.1:43302_solr
[junit4:junit4]   2> 2756 T1515 oascc.ZkStateReader$3.process Updating live nodes
[junit4:junit4]   2> 2757 T1495 oashc.HttpShardHandlerFactory.getParameter Setting socketTimeout to: 0
[junit4:junit4]   2> 2757 T1495 oashc.HttpShardHandlerFactory.getParameter Setting urlScheme to: http://
[junit4:junit4]   2> 2758 T1495 oashc.HttpShardHandlerFactory.getParameter Setting connTimeout to: 0
[junit4:junit4]   2> 2758 T1495 oashc.HttpShardHandlerFactory.getParameter Setting maxConnectionsPerHost to: 20
[junit4:junit4]   2> 2759 T1495 oashc.HttpShardHandlerFactory.getParameter Setting corePoolSize to: 0
[junit4:junit4]   2> 2759 T1495 oashc.HttpShardHandlerFactory.getParameter Setting maximumPoolSize to: 2147483647
[junit4:junit4]   2> 2760 T1495 oashc.HttpShardHandlerFactory.getParameter Setting maxThreadIdleTime to: 5
[junit4:junit4]   2> 2760 T1495 oashc.HttpShardHandlerFactory.getParameter Setting sizeOfQueue to: -1
[junit4:junit4]   2> 2761 T1495 oashc.HttpShardHandlerFactory.getParameter Setting fairnessPolicy to: false
[junit4:junit4]   2> 2761 T1495 oascsi.HttpClientUtil.createClient Creating new http client, config:maxConnectionsPerHost=20&maxConnections=10000&socketTimeout=0&connTimeout=0&retry=false
[junit4:junit4]   2> 2779 T1495 oascc.ZkStateReader.createClusterStateWatchersAndUpdate Updating cluster state from ZooKeeper... 
[junit4:junit4]   2> 2785 T1495 oasc.CoreContainer.create Creating SolrCore 'collection1' using instanceDir: /usr/home/hudson/hudson-slave/workspace/Lucene-Solr-Tests-4.x-java7/solr/build/solr-core/test-files/solr/collection1
[junit4:junit4]   2> 2786 T1495 oasc.ZkController.createCollectionZkNode Check for collection zkNode:collection1
[junit4:junit4]   2> 2787 T1495 oasc.ZkController.createCollectionZkNode Collection zkNode exists
[junit4:junit4]   2> 2787 T1495 oasc.ZkController.readConfigName Load collection config from:/collections/collection1
[junit4:junit4]   2> 2789 T1495 oasc.SolrResourceLoader.<init> new SolrResourceLoader for directory: '/usr/home/hudson/hudson-slave/workspace/Lucene-Solr-Tests-4.x-java7/solr/build/solr-core/test-files/solr/collection1/'
[junit4:junit4]   2> 2790 T1495 oasc.SolrResourceLoader.replaceClassLoader Adding 'file:/usr/home/hudson/hudson-slave/workspace/Lucene-Solr-Tests-4.x-java7/solr/build/solr-core/test-files/solr/collection1/lib/classes/' to classloader
[junit4:junit4]   2> 2791 T1495 oasc.SolrResourceLoader.replaceClassLoader Adding 'file:/usr/home/hudson/hudson-slave/workspace/Lucene-Solr-Tests-4.x-java7/solr/build/solr-core/test-files/solr/collection1/lib/README' to classloader
[junit4:junit4]   2> 2843 T1495 oasc.SolrConfig.<init> Using Lucene MatchVersion: LUCENE_40
[junit4:junit4]   2> 2916 T1495 oasc.SolrConfig.<init> Loaded SolrConfig: solrconfig.xml
[junit4:junit4]   2> 3017 T1495 oass.IndexSchema.readSchema Reading Solr Schema
[junit4:junit4]   2> 3024 T1495 oass.IndexSchema.readSchema Schema name=test
[junit4:junit4]   2> 3083 T1516 oascc.ZkStateReader.updateClusterState Updating cloud state from ZooKeeper... 
[junit4:junit4]   2> 3096 T1529 oascc.ZkStateReader$2.process A cluster state change has occurred - updating...
[junit4:junit4]   2> 3096 T1515 oascc.ZkStateReader$2.process A cluster state change has occurred - updating...
[junit4:junit4]   2> 3670 T1495 oass.OpenExchangeRatesOrgProvider.init Initialized with rates=open-exchange-rates.json, refreshInterval=1440.
[junit4:junit4]   2> 3683 T1495 oass.IndexSchema.readSchema default search field in schema is text
[junit4:junit4]   2> 3688 T1495 oass.IndexSchema.readSchema unique key field: id
[junit4:junit4]   2> 3702 T1495 oass.FileExchangeRateProvider.reload Reloading exchange rates from file currency.xml
[junit4:junit4]   2> 3708 T1495 oass.FileExchangeRateProvider.reload Reloading exchange rates from file currency.xml
[junit4:junit4]   2> 3713 T1495 oass.OpenExchangeRatesOrgProvider.reload Reloading exchange rates from open-exchange-rates.json
[junit4:junit4]   2> 3714 T1495 oass.OpenExchangeRatesOrgProvider.reload Reloading exchange rates from open-exchange-rates.json
[junit4:junit4]   2> 3716 T1495 oasc.SolrCore.<init> [collection1] Opening new SolrCore at /usr/home/hudson/hudson-slave/workspace/Lucene-Solr-Tests-4.x-java7/solr/build/solr-core/test-files/solr/collection1/, dataDir=./org.apache.solr.cloud.BasicDistributedZk2Test-1347716811396/jetty1/
[junit4:junit4]   2> 3716 T1495 oasc.JmxMonitoredMap.<init> JMX monitoring is enabled. Adding Solr mbeans to JMX Server: com.sun.jmx.mbeanserver.JmxMBeanServer@106051c1
[junit4:junit4]   2> 3718 T1495 oasc.SolrCore.getNewIndexDir WARNING New index directory detected: old=null new=./org.apache.solr.cloud.BasicDistributedZk2Test-1347716811396/jetty1/index/
[junit4:junit4]   2> 3719 T1495 oasc.SolrCore.initIndex WARNING [collection1] Solr index directory './org.apache.solr.cloud.BasicDistributedZk2Test-1347716811396/jetty1/index' doesn't exist. Creating new index...
[junit4:junit4]   2> 3720 T1495 oasc.CachingDirectoryFactory.get return new directory for /usr/home/hudson/hudson-slave/workspace/Lucene-Solr-Tests-4.x-java7/solr/build/solr-core/test/J1/./org.apache.solr.cloud.BasicDistributedZk2Test-1347716811396/jetty1/index forceNew:false
[junit4:junit4]   2> 3753 T1495 oasc.SolrDeletionPolicy.onCommit SolrDeletionPolicy.onCommit: commits:num=1
[junit4:junit4]   2> 		commit{dir=NRTCachingDirectory(org.apache.lucene.store.NIOFSDirectory@/usr/home/hudson/hudson-slave/workspace/Lucene-Solr-Tests-4.x-java7/solr/build/solr-core/test/J1/org.apache.solr.cloud.BasicDistributedZk2Test-1347716811396/jetty1/index lockFactory=org.apache.lucene.store.NativeFSLockFactory@4eff0691; maxCacheMB=48.0 maxMergeSizeMB=4.0),segFN=segments_1,generation=1,filenames=[segments_1]
[junit4:junit4]   2> 3753 T1495 oasc.SolrDeletionPolicy.updateCommits newest commit = 1
[junit4:junit4]   2> 3755 T1495 oasc.SolrCore.initWriters created xml: solr.XMLResponseWriter
[junit4:junit4]   2> 3757 T1495 oasup.UpdateRequestProcessorChain.init inserting DistributedUpdateProcessorFactory into updateRequestProcessorChain "dedupe"
[junit4:junit4]   2> 3758 T1495 oasup.UpdateRequestProcessorChain.init inserting DistributedUpdateProcessorFactory into updateRequestProcessorChain "dedupe-allfields"
[junit4:junit4]   2> 3758 T1495 oasup.UpdateRequestProcessorChain.init inserting DistributedUpdateProcessorFactory into updateRequestProcessorChain "stored_sig"
[junit4:junit4]   2> 3759 T1495 oasup.UpdateRequestProcessorChain.init inserting DistributedUpdateProcessorFactory into updateRequestProcessorChain "uniq-fields"
[junit4:junit4]   2> 3760 T1495 oasup.UpdateRequestProcessorChain.init inserting DistributedUpdateProcessorFactory into updateRequestProcessorChain "distrib-dup-test-chain-implicit"
[junit4:junit4]   2> 3760 T1495 oasc.RequestHandlers.initHandlersFromConfig adding lazy requestHandler: solr.ReplicationHandler
[junit4:junit4]   2> 3761 T1495 oasc.RequestHandlers.initHandlersFromConfig created /replication: solr.ReplicationHandler
[junit4:junit4]   2> 3762 T1495 oasc.RequestHandlers.initHandlersFromConfig created standard: solr.StandardRequestHandler
[junit4:junit4]   2> 3762 T1495 oasc.RequestHandlers.initHandlersFromConfig created /get: solr.RealTimeGetHandler
[junit4:junit4]   2> 3763 T1495 oasc.RequestHandlers.initHandlersFromConfig created dismax: solr.SearchHandler
[junit4:junit4]   2> 3764 T1495 oasc.RequestHandlers.initHandlersFromConfig created mock: org.apache.solr.core.MockQuerySenderListenerReqHandler
[junit4:junit4]   2> 3765 T1495 oasc.RequestHandlers.initHandlersFromConfig created /admin/: org.apache.solr.handler.admin.AdminHandlers
[junit4:junit4]   2> 3765 T1495 oasc.RequestHandlers.initHandlersFromConfig created defaults: solr.StandardRequestHandler
[junit4:junit4]   2> 3766 T1495 oasc.RequestHandlers.initHandlersFromConfig adding lazy requestHandler: solr.StandardRequestHandler
[junit4:junit4]   2> 3766 T1495 oasc.RequestHandlers.initHandlersFromConfig created lazy: solr.StandardRequestHandler
[junit4:junit4]   2> 3767 T1495 oasc.RequestHandlers.initHandlersFromConfig created /update: solr.UpdateRequestHandler
[junit4:junit4]   2> 3768 T1495 oasc.RequestHandlers.initHandlersFromConfig created /terms: org.apache.solr.handler.component.SearchHandler
[junit4:junit4]   2> 3769 T1495 oasc.RequestHandlers.initHandlersFromConfig created spellCheckCompRH: org.apache.solr.handler.component.SearchHandler
[junit4:junit4]   2> 3769 T1495 oasc.RequestHandlers.initHandlersFromConfig created spellCheckCompRH_Direct: org.apache.solr.handler.component.SearchHandler
[junit4:junit4]   2> 3770 T1495 oasc.RequestHandlers.initHandlersFromConfig created spellCheckWithWordbreak: org.apache.solr.handler.component.SearchHandler
[junit4:junit4]   2> 3771 T1495 oasc.RequestHandlers.initHandlersFromConfig created spellCheckWithWordbreak_Direct: org.apache.solr.handler.component.SearchHandler
[junit4:junit4]   2> 3771 T1495 oasc.RequestHandlers.initHandlersFromConfig created spellCheckCompRH1: org.apache.solr.handler.component.SearchHandler
[junit4:junit4]   2> 3772 T1495 oasc.RequestHandlers.initHandlersFromConfig created tvrh: org.apache.solr.handler.component.SearchHandler
[junit4:junit4]   2> 3773 T1495 oasc.RequestHandlers.initHandlersFromConfig created /mlt: solr.MoreLikeThisHandler
[junit4:junit4]   2> 3774 T1495 oasc.RequestHandlers.initHandlersFromConfig created /debug/dump: solr.DumpRequestHandler
[junit4:junit4]   2> 3778 T1495 oashl.XMLLoader.init xsltCacheLifetimeSeconds=60
[junit4:junit4]   2> 3782 T1495 oasc.SolrCore.initDeprecatedSupport WARNING solrconfig.xml uses deprecated <admin/gettableFiles>, Please update your config to use the ShowFileRequestHandler.
[junit4:junit4]   2> 3783 T1495 oasc.SolrCore.initDeprecatedSupport WARNING adding ShowFileRequestHandler with hidden files: [SCHEMA.XML, OLD_SYNONYMS.TXT, STOPWORDS.TXT, PROTWORDS.TXT, OPEN-EXCHANGE-RATES.JSON, SYNONYMS.TXT, CURRENCY.XML, MAPPING-ISOLATIN1ACCENT.TXT]
[junit4:junit4]   2> 3787 T1495 oass.SolrIndexSearcher.<init> Opening Searcher@3fe126e1 main
[junit4:junit4]   2> 3789 T1495 oasu.CommitTracker.<init> Hard AutoCommit: disabled
[junit4:junit4]   2> 3789 T1495 oasu.CommitTracker.<init> Soft AutoCommit: disabled
[junit4:junit4]   2> 3790 T1495 oashc.SpellCheckComponent.inform Initializing spell checkers
[junit4:junit4]   2> 3809 T1495 oass.DirectSolrSpellChecker.init init: {name=direct,classname=DirectSolrSpellChecker,field=lowerfilt,minQueryLength=3}
[junit4:junit4]   2> 3872 T1530 oasc.SolrCore.registerSearcher [collection1] Registered new searcher Searcher@3fe126e1 main{StandardDirectoryReader(segments_1:1)}
[junit4:junit4]   2> 4103 T1516 oascc.ZkStateReader.updateClusterState Updating cloud state from ZooKeeper... 
[junit4:junit4]   2> 4117 T1515 oascc.ZkStateReader$2.process A cluster state change has occurred - updating...
[junit4:junit4]   2> 4117 T1529 oascc.ZkStateReader$2.process A cluster state change has occurred - updating...
[junit4:junit4]   2> 4380 T1495 oasc.CoreContainer.register registering core: collection1
[junit4:junit4]   2> 4380 T1495 oasc.ZkController.register Register shard - core:collection1 address:http://127.0.0.1:43302/solr shardId:shard1
[junit4:junit4]   2> 4382 T1495 oascc.SolrZkClient.makePath makePath: /collections/collection1/leader_elect/shard1/election
[junit4:junit4]   2> 4397 T1500 oazs.PrepRequestProcessor.pRequest Got user-level KeeperException when processing sessionid:0x139ca2e8a8b0003 type:delete cxid:0x43 zxid:0xfffffffffffffffe txntype:unknown reqpath:n/a Error Path:/solr/collections/collection1/leaders Error:KeeperErrorCode = NoNode for /solr/collections/collection1/leaders
[junit4:junit4]   2> 4398 T1495 oasc.ShardLeaderElectionContext.runLeaderProcess Running the leader process.
[junit4:junit4]   2> 4399 T1500 oazs.PrepRequestProcessor.pRequest Got user-level KeeperException when processing sessionid:0x139ca2e8a8b0003 type:create cxid:0x44 zxid:0xfffffffffffffffe txntype:unknown reqpath:n/a Error Path:/solr/overseer Error:KeeperErrorCode = NodeExists for /solr/overseer
[junit4:junit4]   2> 4408 T1495 oasc.ShardLeaderElectionContext.waitForReplicasToComeUp Enough replicas found to continue.
[junit4:junit4]   2> 4409 T1495 oasc.ShardLeaderElectionContext.runLeaderProcess I may be the new leader - try and sync
[junit4:junit4]   2> 4409 T1495 oasc.SyncStrategy.sync Sync replicas to http://127.0.0.1:43302/solr/collection1/
[junit4:junit4]   2> 4410 T1495 oasc.SyncStrategy.syncReplicas Sync Success - now sync replicas to me
[junit4:junit4]   2> 4410 T1495 oasc.SyncStrategy.syncToMe http://127.0.0.1:43302/solr/collection1/ has no replicas
[junit4:junit4]   2> 4411 T1495 oasc.ShardLeaderElectionContext.runLeaderProcess I am the new leader: http://127.0.0.1:43302/solr/collection1/
[junit4:junit4]   2> 4412 T1495 oascc.SolrZkClient.makePath makePath: /collections/collection1/leaders/shard1
[junit4:junit4]   2> 4416 T1500 oazs.PrepRequestProcessor.pRequest Got user-level KeeperException when processing sessionid:0x139ca2e8a8b0003 type:create cxid:0x4e zxid:0xfffffffffffffffe txntype:unknown reqpath:n/a Error Path:/solr/overseer Error:KeeperErrorCode = NodeExists for /solr/overseer
[junit4:junit4]   2> 4621 T1516 oascc.ZkStateReader.updateClusterState Updating cloud state from ZooKeeper... 
[junit4:junit4]   2> 4747 T1515 oascc.ZkStateReader$2.process A cluster state change has occurred - updating...
[junit4:junit4]   2> 4747 T1529 oascc.ZkStateReader$2.process A cluster state change has occurred - updating...
[junit4:junit4]   2> 4775 T1495 oasc.ZkController.register We are http://127.0.0.1:43302/solr/collection1/ and leader is http://127.0.0.1:43302/solr/collection1/
[junit4:junit4]   2> 4775 T1495 oasc.ZkController.register No LogReplay needed for core=collection1 baseURL=http://127.0.0.1:43302/solr
[junit4:junit4]   2> 4776 T1495 oasc.ZkController.checkRecovery I am the leader, no recovery necessary
[junit4:junit4]   2> 4778 T1495 oascc.ZkStateReader.updateClusterState Updating cloud state from ZooKeeper... 
[junit4:junit4]   2> 4779 T1495 oass.SolrDispatchFilter.init user.dir=/usr/home/hudson/hudson-slave/workspace/Lucene-Solr-Tests-4.x-java7/solr/build/solr-core/test/J1
[junit4:junit4]   2> 4779 T1495 oass.SolrDispatchFilter.init SolrDispatchFilter.init() done
[junit4:junit4]   2> 4780 T1495 oascsi.HttpClientUtil.createClient Creating new http client, config:maxConnections=128&maxConnectionsPerHost=32&followRedirects=false
[junit4:junit4]   2> 4799 T1495 oejs.Server.doStart jetty-8.1.2.v20120308
[junit4:junit4]   2> 4803 T1495 oejs.AbstractConnector.doStart Started SocketConnector@0.0.0.0:64103
[junit4:junit4]   2> 4803 T1495 oasc.SolrResourceLoader.locateSolrHome JNDI not configured for solr (NoInitialContextEx)
[junit4:junit4]   2> 4804 T1495 oasc.SolrResourceLoader.locateSolrHome using system property solr.solr.home: /usr/home/hudson/hudson-slave/workspace/Lucene-Solr-Tests-4.x-java7/solr/build/solr-core/test-files/solr
[junit4:junit4]   2> 4804 T1495 oasc.SolrResourceLoader.<init> new SolrResourceLoader for deduced Solr Home: '/usr/home/hudson/hudson-slave/workspace/Lucene-Solr-Tests-4.x-java7/solr/build/solr-core/test-files/solr/'
[junit4:junit4]   2> 4853 T1495 oass.SolrDispatchFilter.init SolrDispatchFilter.init()
[junit4:junit4]   2> 4853 T1495 oasc.SolrResourceLoader.locateSolrHome JNDI not configured for solr (NoInitialContextEx)
[junit4:junit4]   2> 4854 T1495 oasc.SolrResourceLoader.locateSolrHome using system property solr.solr.home: /usr/home/hudson/hudson-slave/workspace/Lucene-Solr-Tests-4.x-java7/solr/build/solr-core/test-files/solr
[junit4:junit4]   2> 4854 T1495 oasc.CoreContainer$Initializer.initialize looking for solr.xml: /usr/home/hudson/hudson-slave/workspace/Lucene-Solr-Tests-4.x-java7/solr/build/solr-core/test-files/solr/solr.xml
[junit4:junit4]   2> 4855 T1495 oasc.CoreContainer.<init> New CoreContainer 1045430691
[junit4:junit4]   2> 4855 T1495 oasc.CoreContainer.load Loading CoreContainer using Solr Home: '/usr/home/hudson/hudson-slave/workspace/Lucene-Solr-Tests-4.x-java7/solr/build/solr-core/test-files/solr/'
[junit4:junit4]   2> 4856 T1495 oasc.SolrResourceLoader.<init> new SolrResourceLoader for directory: '/usr/home/hudson/hudson-slave/workspace/Lucene-Solr-Tests-4.x-java7/solr/build/solr-core/test-files/solr/'
[junit4:junit4]   2> 4892 T1495 oasc.CoreContainer.load Registering Log Listener
[junit4:junit4]   2> 4909 T1495 oasc.CoreContainer.initZooKeeper Zookeeper client=127.0.0.1:15224/solr
[junit4:junit4]   2> 4910 T1495 oaz.ZooKeeper.<init> Initiating client connection, connectString=127.0.0.1:15224/solr sessionTimeout=5000 watcher=org.apache.solr.common.cloud.ConnectionManager@1213411c
[junit4:junit4]   2> 4911 T1540 oaz.ClientCnxn$SendThread.startConnect Opening socket connection to server /127.0.0.1:15224
[junit4:junit4]   2> 4911 T1495 oascc.ConnectionManager.waitForConnected Waiting for client to connect to ZooKeeper
[junit4:junit4]   2> 4912 T1540 oaz.ClientCnxn$SendThread.primeConnection Socket connection established to localhost/127.0.0.1:15224, initiating session
[junit4:junit4]   2> 4912 T1497 oazs.NIOServerCnxn$Factory.run Accepted socket connection from /140.211.11.196:54508
[junit4:junit4]   2> 4913 T1497 oazs.NIOServerCnxn.readConnectRequest Client attempting to establish new session at /140.211.11.196:54508
[junit4:junit4]   2> 4917 T1499 oazs.NIOServerCnxn.finishSessionInit Established session 0x139ca2e8a8b0004 with negotiated timeout 5000 for client /140.211.11.196:54508
[junit4:junit4]   2> 4917 T1540 oaz.ClientCnxn$SendThread.readConnectResult Session establishment complete on server localhost/127.0.0.1:15224, sessionid = 0x139ca2e8a8b0004, negotiated timeout = 5000
[junit4:junit4]   2> 4917 T1541 oascc.ConnectionManager.process Watcher org.apache.solr.common.cloud.ConnectionManager@1213411c name:ZooKeeperConnection Watcher:127.0.0.1:15224/solr got event WatchedEvent state:SyncConnected type:None path:null path:null type:None
[junit4:junit4]   2> 4918 T1495 oascc.ConnectionManager.waitForConnected Client is connected to ZooKeeper
[junit4:junit4]   2> 4919 T1500 oazs.PrepRequestProcessor.pRequest Got user-level KeeperException when processing sessionid:0x139ca2e8a8b0004 type:create cxid:0x1 zxid:0xfffffffffffffffe txntype:unknown reqpath:n/a Error Path:/solr/overseer Error:KeeperErrorCode = NodeExists for /solr/overseer
[junit4:junit4]   2> 4920 T1500 oazs.PrepRequestProcessor.pRequest Got user-level KeeperException when processing sessionid:0x139ca2e8a8b0004 type:create cxid:0x2 zxid:0xfffffffffffffffe txntype:unknown reqpath:n/a Error Path:/solr/overseer Error:KeeperErrorCode = NodeExists for /solr/overseer
[junit4:junit4]   2> 4929 T1495 oasc.ZkController.createEphemeralLiveNode Register node as live in ZooKeeper:/live_nodes/127.0.0.1:64103_solr
[junit4:junit4]   2> 4930 T1500 oazs.PrepRequestProcessor.pRequest Got user-level KeeperException when processing sessionid:0x139ca2e8a8b0004 type:delete cxid:0x4 zxid:0xfffffffffffffffe txntype:unknown reqpath:n/a Error Path:/solr/live_nodes/127.0.0.1:64103_solr Error:KeeperErrorCode = NoNode for /solr/live_nodes/127.0.0.1:64103_solr
[junit4:junit4]   2> 4931 T1495 oascc.SolrZkClient.makePath makePath: /live_nodes/127.0.0.1:64103_solr
[junit4:junit4]   2> 4933 T1515 oascc.ZkStateReader$3.process Updating live nodes
[junit4:junit4]   2> 4933 T1529 oascc.ZkStateReader$3.process Updating live nodes
[junit4:junit4]   2> 4934 T1495 oashc.HttpShardHandlerFactory.getParameter Setting socketTimeout to: 0
[junit4:junit4]   2> 4934 T1495 oashc.HttpShardHandlerFactory.getParameter Setting urlScheme to: http://
[junit4:junit4]   2> 4935 T1495 oashc.HttpShardHandlerFactory.getParameter Setting connTimeout to: 0
[junit4:junit4]   2> 4935 T1495 oashc.HttpShardHandlerFactory.getParameter Setting maxConnectionsPerHost to: 20
[junit4:junit4]   2> 4936 T1495 oashc.HttpShardHandlerFactory.getParameter Setting corePoolSize to: 0
[junit4:junit4]   2> 4936 T1495 oashc.HttpShardHandlerFactory.getParameter Setting maximumPoolSize to: 2147483647
[junit4:junit4]   2> 4937 T1495 oashc.HttpShardHandlerFactory.getParameter Setting maxThreadIdleTime to: 5
[junit4:junit4]   2> 4937 T1495 oashc.HttpShardHandlerFactory.getParameter Setting sizeOfQueue to: -1
[junit4:junit4]   2> 4938 T1495 oashc.HttpShardHandlerFactory.getParameter Setting fairnessPolicy to: false
[junit4:junit4]   2> 4938 T1495 oascsi.HttpClientUtil.createClient Creating new http client, config:maxConnectionsPerHost=20&maxConnections=10000&socketTimeout=0&connTimeout=0&retry=false
[junit4:junit4]   2> 4954 T1495 oascc.ZkStateReader.createClusterStateWatchersAndUpdate Updating cluster state from ZooKeeper... 
[junit4:junit4]   2> 4961 T1495 oasc.CoreContainer.create Creating SolrCore 'collection1' using instanceDir: /usr/home/hudson/hudson-slave/workspace/Lucene-Solr-Tests-4.x-java7/solr/build/solr-core/test-files/solr/collection1
[junit4:junit4]   2> 4961 T1495 oasc.ZkController.createCollectionZkNode Check for collection zkNode:collection1
[junit4:junit4]   2> 4962 T1495 oasc.ZkController.createCollectionZkNode Collection zkNode exists
[junit4:junit4]   2> 4963 T1495 oasc.ZkController.readConfigName Load collection config from:/collections/collection1
[junit4:junit4]   2> 4964 T1495 oasc.SolrResourceLoader.<init> new SolrResourceLoader for directory: '/usr/home/hudson/hudson-slave/workspace/Lucene-Solr-Tests-4.x-java7/solr/build/solr-core/test-files/solr/collection1/'
[junit4:junit4]   2> 4966 T1495 oasc.SolrResourceLoader.replaceClassLoader Adding 'file:/usr/home/hudson/hudson-slave/workspace/Lucene-Solr-Tests-4.x-java7/solr/build/solr-core/test-files/solr/collection1/lib/classes/' to classloader
[junit4:junit4]   2> 4966 T1495 oasc.SolrResourceLoader.replaceClassLoader Adding 'file:/usr/home/hudson/hudson-slave/workspace/Lucene-Solr-Tests-4.x-java7/solr/build/solr-core/test-files/solr/collection1/lib/README' to classloader
[junit4:junit4]   2> 5022 T1495 oasc.SolrConfig.<init> Using Lucene MatchVersion: LUCENE_40
[junit4:junit4]   2> 5099 T1495 oasc.SolrConfig.<init> Loaded SolrConfig: solrconfig.xml
[junit4:junit4]   2> 5201 T1495 oass.IndexSchema.readSchema Reading Solr Schema
[junit4:junit4]   2> 5207 T1495 oass.IndexSchema.readSchema Schema name=test
[junit4:junit4]   2> 5253 T1516 oascc.ZkStateReader.updateClusterState Updating cloud state from ZooKeeper... 
[junit4:junit4]   2> 5272 T1529 oascc.ZkStateReader$2.process A cluster state change has occurred - updating...
[junit4:junit4]   2> 5272 T1515 oascc.ZkStateReader$2.process A cluster state change has occurred - updating...
[junit4:junit4]   2> 5271 T1541 oascc.ZkStateReader$2.process A cluster state change has occurred - updating...
[junit4:junit4]   2> 5819 T1495 oass.OpenExchangeRatesOrgProvider.init Initialized with rates=open-exchange-rates.json, refreshInterval=1440.
[junit4:junit4]   2> 5827 T1495 oass.IndexSchema.readSchema default search field in schema is text
[junit4:junit4]   2> 5830 T1495 oass.IndexSchema.readSchema unique key field: id
[junit4:junit4]   2> 5840 T1495 oass.FileExchangeRateProvider.reload Reloading exchange rates from file currency.xml
[junit4:junit4]   2> 5844 T1495 oass.FileExchangeRateProvider.reload Reloading exchange rates from file currency.xml
[junit4:junit4]   2> 5847 T1495 oass.OpenExchangeRatesOrgProvider.reload Reloading exchange rates from open-exchange-rates.json
[junit4:junit4]   2> 5848 T1495 oass.OpenExchangeRatesOrgProvider.reload Reloading exchange rates from open-exchange-rates.json
[junit4:junit4]   2> 5849 T1495 oasc.SolrCore.<init> [collection1] Opening new SolrCore at /usr/home/hudson/hudson-slave/workspace/Lucene-Solr-Tests-4.x-java7/solr/build/solr-core/test-files/solr/collection1/, dataDir=./org.apache.solr.cloud.BasicDistributedZk2Test-1347716811396/jetty2/
[junit4:junit4]   2> 5849 T1495 oasc.JmxMonitoredMap.<init> JMX monitoring is enabled. Adding Solr mbeans to JMX Server: com.sun.jmx.mbeanserver.JmxMBeanServer@106051c1
[junit4:junit4]   2> 5850 T1495 oasc.SolrCore.getNewIndexDir WARNING New index directory detected: old=null new=./org.apache.solr.cloud.BasicDistributedZk2Test-1347716811396/jetty2/index/
[junit4:junit4]   2> 5851 T1495 oasc.SolrCore.initIndex WARNING [collection1] Solr index directory './org.apache.solr.cloud.BasicDistributedZk2Test-1347716811396/jetty2/index' doesn't exist. Creating new index...
[junit4:junit4]   2> 5852 T1495 oasc.CachingDirectoryFactory.get return new directory for /usr/home/hudson/hudson-slave/workspace/Lucene-Solr-Tests-4.x-java7/solr/build/solr-core/test/J1/./org.apache.solr.cloud.BasicDistributedZk2Test-1347716811396/jetty2/index forceNew:false
[junit4:junit4]   2> 5856 T1495 oasc.SolrDeletionPolicy.onCommit SolrDeletionPolicy.onCommit: commits:num=1
[junit4:junit4]   2> 		commit{dir=NRTCachingDirectory(org.apache.lucene.store.NIOFSDirectory@/usr/home/hudson/hudson-slave/workspace/Lucene-Solr-Tests-4.x-java7/solr/build/solr-core/test/J1/org.apache.solr.cloud.BasicDistributedZk2Test-1347716811396/jetty2/index lockFactory=org.apache.lucene.store.NativeFSLockFactory@1a80e9b7; maxCacheMB=48.0 maxMergeSizeMB=4.0),segFN=segments_1,generation=1,filenames=[segments_1]
[junit4:junit4]   2> 5857 T1495 oasc.SolrDeletionPolicy.updateCommits newest commit = 1
[junit4:junit4]   2> 5858 T1495 oasc.SolrCore.initWriters created xml: solr.XMLResponseWriter
[junit4:junit4]   2> 5860 T1495 oasup.UpdateRequestProcessorChain.init inserting DistributedUpdateProcessorFactory into updateRequestProcessorChain "dedupe"
[junit4:junit4]   2> 5860 T1495 oasup.UpdateRequestProcessorChain.init inserting DistributedUpdateProcessorFactory into updateRequestProcessorChain "dedupe-allfields"
[junit4:junit4]   2> 5861 T1495 oasup.UpdateRequestProcessorChain.init inserting DistributedUpdateProcessorFactory into updateRequestProcessorChain "stored_sig"
[junit4:junit4]   2> 5861 T1495 oasup.UpdateRequestProcessorChain.init inserting DistributedUpdateProcessorFactory into updateRequestProcessorChain "uniq-fields"
[junit4:junit4]   2> 5862 T1495 oasup.UpdateRequestProcessorChain.init inserting DistributedUpdateProcessorFactory into updateRequestProcessorChain "distrib-dup-test-chain-implicit"
[junit4:junit4]   2> 5862 T1495 oasc.RequestHandlers.initHandlersFromConfig adding lazy requestHandler: solr.ReplicationHandler
[junit4:junit4]   2> 5863 T1495 oasc.RequestHandlers.initHandlersFromConfig created /replication: solr.ReplicationHandler
[junit4:junit4]   2> 5863 T1495 oasc.RequestHandlers.initHandlersFromConfig created standard: solr.StandardRequestHandler
[junit4:junit4]   2> 5864 T1495 oasc.RequestHandlers.initHandlersFromConfig created /get: solr.RealTimeGetHandler
[junit4:junit4]   2> 5864 T1495 oasc.RequestHandlers.initHandlersFromConfig created dismax: solr.SearchHandler
[junit4:junit4]   2> 5865 T1495 oasc.RequestHandlers.initHandlersFromConfig created mock: org.apache.solr.core.MockQuerySenderListenerReqHandler
[junit4:junit4]   2> 5865 T1495 oasc.RequestHandlers.initHandlersFromConfig created /admin/: org.apache.solr.handler.admin.AdminHandlers
[junit4:junit4]   2> 5866 T1495 oasc.RequestHandlers.initHandlersFromConfig created defaults: solr.StandardRequestHandler
[junit4:junit4]   2> 5866 T1495 oasc.RequestHandlers.initHandlersFromConfig adding lazy requestHandler: solr.StandardRequestHandler
[junit4:junit4]   2> 5867 T1495 oasc.RequestHandlers.initHandlersFromConfig created lazy: solr.StandardRequestHandler
[junit4:junit4]   2> 5867 T1495 oasc.RequestHandlers.initHandlersFromConfig created /update: solr.UpdateRequestHandler
[junit4:junit4]   2> 5868 T1495 oasc.RequestHandlers.initHandlersFromConfig created /terms: org.apache.solr.handler.component.SearchHandler
[junit4:junit4]   2> 5868 T1495 oasc.RequestHandlers.initHandlersFromConfig created spellCheckCompRH: org.apache.solr.handler.component.SearchHandler
[junit4:junit4]   2> 5869 T1495 oasc.RequestHandlers.initHandlersFromConfig created spellCheckCompRH_Direct: org.apache.solr.handler.component.SearchHandler
[junit4:junit4]   2> 5869 T1495 oasc.RequestHandlers.initHandlersFromConfig created spellCheckWithWordbreak: org.apache.solr.handler.component.SearchHandler
[junit4:junit4]   2> 5870 T1495 oasc.RequestHandlers.initHandlersFromConfig created spellCheckWithWordbreak_Direct: org.apache.solr.handler.component.SearchHandler
[junit4:junit4]   2> 5870 T1495 oasc.RequestHandlers.initHandlersFromConfig created spellCheckCompRH1: org.apache.solr.handler.component.SearchHandler
[junit4:junit4]   2> 5871 T1495 oasc.RequestHandlers.initHandlersFromConfig created tvrh: org.apache.solr.handler.component.SearchHandler
[junit4:junit4]   2> 5871 T1495 oasc.RequestHandlers.initHandlersFromConfig created /mlt: solr.MoreLikeThisHandler
[junit4:junit4]   2> 5872 T1495 oasc.RequestHandlers.initHandlersFromConfig created /debug/dump: solr.DumpRequestHandler
[junit4:junit4]   2> 5875 T1495 oashl.XMLLoader.init xsltCacheLifetimeSeconds=60
[junit4:junit4]   2> 5878 T1495 oasc.SolrCore.initDeprecatedSupport WARNING solrconfig.xml uses deprecated <admin/gettableFiles>, Please update your config to use the ShowFileRequestHandler.
[junit4:junit4]   2> 5879 T1495 oasc.SolrCore.initDeprecatedSupport WARNING adding ShowFileRequestHandler with hidden files: [SCHEMA.XML, OLD_SYNONYMS.TXT, STOPWORDS.TXT, PROTWORDS.TXT, OPEN-EXCHANGE-RATES.JSON, SYNONYMS.TXT, CURRENCY.XML, MAPPING-ISOLATIN1ACCENT.TXT]
[junit4:junit4]   2> 5882 T1495 oass.SolrIndexSearcher.<init> Opening Searcher@40f3c09a main
[junit4:junit4]   2> 5883 T1495 oasu.CommitTracker.<init> Hard AutoCommit: disabled
[junit4:junit4]   2> 5883 T1495 oasu.CommitTracker.<init> Soft AutoCommit: disabled
[junit4:junit4]   2> 5884 T1495 oashc.SpellCheckComponent.inform Initializing spell checkers
[junit4:junit4]   2> 5901 T1495 oass.DirectSolrSpellChecker.init init: {name=direct,classname=DirectSolrSpellChecker,field=lowerfilt,minQueryLength=3}
[junit4:junit4]   2> 5943 T1542 oasc.SolrCore.registerSearcher [collection1] Registered new searcher Searcher@40f3c09a main{StandardDirectoryReader(segments_1:1)}
[junit4:junit4]   2> 6278 T1516 oascc.ZkStateReader.updateClusterState Updating cloud state from ZooKeeper... 
[junit4:junit4]   2> 6291 T1515 oascc.ZkStateReader$2.process A cluster state change has occurred - updating...
[junit4:junit4]   2> 6291 T1529 oascc.ZkStateReader$2.process A cluster state change has occurred - updating...
[junit4:junit4]   2> 6291 T1541 oascc.ZkStateReader$2.process A cluster state change has occurred - updating...
[junit4:junit4]   2> 6449 T1495 oasc.CoreContainer.register registering core: collection1
[junit4:junit4]   2> 6449 T1495 oasc.ZkController.register Register shard - core:collection1 address:http://127.0.0.1:64103/solr shardId:shard2
[junit4:junit4]   2> 6450 T1495 oascc.SolrZkClient.makePath makePath: /collections/collection1/leader_elect/shard2/election
[junit4:junit4]   2> 6464 T1500 oazs.PrepRequestProcessor.pRequest Got user-level KeeperException when processing sessionid:0x139ca2e8a8b0004 type:delete cxid:0x42 zxid:0xfffffffffffffffe txntype:unknown reqpath:n/a Error Path:/solr/collections/collection1/leaders/shard2 Error:KeeperErrorCode = NoNode for /solr/collections/collection1/leaders/shard2
[junit4:junit4]   2> 6465 T1495 oasc.ShardLeaderElectionContext.runLeaderProcess Running the leader process.
[junit4:junit4]   2> 6466 T1500 oazs.PrepRequestProcessor.pRequest Got user-level KeeperException when processing sessionid:0x139ca2e8a8b0004 type:create cxid:0x43 zxid:0xfffffffffffffffe txntype:unknown reqpath:n/a Error Path:/solr/overseer Error:KeeperErrorCode = NodeExists for /solr/overseer
[junit4:junit4]   2> 6468 T1495 oasc.ShardLeaderElectionContext.waitForReplicasToComeUp Enough replicas found to continue.
[junit4:junit4]   2> 6468 T1495 oasc.ShardLeaderElectionContext.runLeaderProcess I may be the new leader - try and sync
[junit4:junit4]   2> 6469 T1495 oasc.SyncStrategy.sync Sync replicas to http://127.0.0.1:64103/solr/collection1/
[junit4:junit4]   2> 6469 T1495 oasc.SyncStrategy.syncReplicas Sync Success - now sync replicas to me
[junit4:junit4]   2> 6469 T1495 oasc.SyncStrategy.syncToMe http://127.0.0.1:64103/solr/collection1/ has no replicas
[junit4:junit4]   2> 6470 T1495 oasc.ShardLeaderElectionContext.runLeaderProcess I am the new leader: http://127.0.0.1:64103/solr/collection1/
[junit4:junit4]   2> 6470 T1495 oascc.SolrZkClient.makePath makePath: /collections/collection1/leaders/shard2
[junit4:junit4]   2> 6473 T1500 oazs.PrepRequestProcessor.pRequest Got user-level KeeperException when processing sessionid:0x139ca2e8a8b0004 type:create cxid:0x4c zxid:0xfffffffffffffffe txntype:unknown reqpath:n/a Error Path:/solr/overseer Error:KeeperErrorCode = NodeExists for /solr/overseer
[junit4:junit4]   2> 6795 T1516 oascc.ZkStateReader.updateClusterState Updating cloud state from ZooKeeper... 
[junit4:junit4]   2> 6813 T1515 oascc.ZkStateReader$2.process A cluster state change has occurred - updating...
[junit4:junit4]   2> 6813 T1529 oascc.ZkStateReader$2.process A cluster state change has occurred - updating...
[junit4:junit4]   2> 6813 T1541 oascc.ZkStateReader$2.process A cluster state change has occurred - updating...
[junit4:junit4]   2> 6840 T1495 oasc.ZkController.register We are http://127.0.0.1:64103/solr/collection1/ and leader is http://127.0.0.1:64103/solr/collection1/
[junit4:junit4]   2> 6840 T1495 oasc.ZkController.register No LogReplay needed for core=collection1 baseURL=http://127.0.0.1:64103/solr
[junit4:junit4]   2> 6841 T1495 oasc.ZkController.checkRecovery I am the leader, no recovery necessary
[junit4:junit4]   2> 6842 T1495 oascc.ZkStateReader.updateClusterState Updating cloud state from ZooKeeper... 
[junit4:junit4]   2> 6843 T1495 oass.SolrDispatchFilter.init user.dir=/usr/home/hudson/hudson-slave/workspace/Lucene-Solr-Tests-4.x-java7/solr/build/solr-core/test/J1
[junit4:junit4]   2> 6844 T1495 oass.SolrDispatchFilter.init SolrDispatchFilter.init() done
[junit4:junit4]   2> 6844 T1495 oascsi.HttpClientUtil.createClient Creating new http client, config:maxConnections=128&maxConnectionsPerHost=32&followRedirects=false
[junit4:junit4]   2> 6860 T1495 oejs.Server.doStart jetty-8.1.2.v20120308
[junit4:junit4]   2> 6864 T1495 oejs.AbstractConnector.doStart Started SocketConnector@0.0.0.0:23877
[junit4:junit4]   2> 6864 T1495 oasc.SolrResourceLoader.locateSolrHome JNDI not configured for solr (NoInitialContextEx)
[junit4:junit4]   2> 6865 T1495 oasc.SolrResourceLoader.locateSolrHome using system property solr.solr.home: /usr/home/hudson/hudson-slave/workspace/Lucene-Solr-Tests-4.x-java7/solr/build/solr-core/test-files/solr
[junit4:junit4]   2> 6865 T1495 oasc.SolrResourceLoader.<init> new SolrResourceLoader for deduced Solr Home: '/usr/home/hudson/hudson-slave/workspace/Lucene-Solr-Tests-4.x-java7/solr/build/solr-core/test-files/solr/'
[junit4:junit4]   2> 6907 T1495 oass.SolrDispatchFilter.init SolrDispatchFilter.init()
[junit4:junit4]   2> 6908 T1495 oasc.SolrResourceLoader.locateSolrHome JNDI not configured for solr (NoInitialContextEx)
[junit4:junit4]   2> 6908 T1495 oasc.SolrResourceLoader.locateSolrHome using system property solr.solr.home: /usr/home/hudson/hudson-slave/workspace/Lucene-Solr-Tests-4.x-java7/solr/build/solr-core/test-files/solr
[junit4:junit4]   2> 6909 T1495 oasc.CoreContainer$Initializer.initialize looking for solr.xml: /usr/home/hudson/hudson-slave/workspace/Lucene-Solr-Tests-4.x-java7/solr/build/solr-core/test-files/solr/solr.xml
[junit4:junit4]   2> 6909 T1495 oasc.CoreContainer.<init> New CoreContainer 486979833
[junit4:junit4]   2> 6910 T1495 oasc.CoreContainer.load Loading CoreContainer using Solr Home: '/usr/home/hudson/hudson-slave/workspace/Lucene-Solr-Tests-4.x-java7/solr/build/solr-core/test-files/solr/'
[junit4:junit4]   2> 6910 T1495 oasc.SolrResourceLoader.<init> new SolrResourceLoader for directory: '/usr/home/hudson/hudson-slave/workspace/Lucene-Solr-Tests-4.x-java7/solr/build/solr-core/test-files/solr/'
[junit4:junit4]   2> 6942 T1495 oasc.CoreContainer.load Registering Log Listener
[junit4:junit4]   2> 6958 T1495 oasc.CoreContainer.initZooKeeper Zookeeper client=127.0.0.1:15224/solr
[junit4:junit4]   2> 6959 T1495 oaz.ZooKeeper.<init> Initiating client connection, connectString=127.0.0.1:15224/solr sessionTimeout=5000 watcher=org.apache.solr.common.cloud.ConnectionManager@585fda2e
[junit4:junit4]   2> 6960 T1552 oaz.ClientCnxn$SendThread.startConnect Opening socket connection to server /127.0.0.1:15224
[junit4:junit4]   2> 6960 T1495 oascc.ConnectionManager.waitForConnected Waiting for client to connect to ZooKeeper
[junit4:junit4]   2> 6961 T1552 oaz.ClientCnxn$SendThread.primeConnection Socket connection established to localhost/127.0.0.1:15224, initiating session
[junit4:junit4]   2> 6961 T1497 oazs.NIOServerCnxn$Factory.run Accepted socket connection from /140.211.11.196:32253
[junit4:junit4]   2> 6961 T1497 oazs.NIOServerCnxn.readConnectRequest Client attempting to establish new session at /140.211.11.196:32253
[junit4:junit4]   2> 6963 T1499 oazs.NIOServerCnxn.finishSessionInit Established session 0x139ca2e8a8b0005 with negotiated timeout 5000 for client /140.211.11.196:32253
[junit4:junit4]   2> 6963 T1552 oaz.ClientCnxn$SendThread.readConnectResult Session establishment complete on server localhost/127.0.0.1:15224, sessionid = 0x139ca2e8a8b0005, negotiated timeout = 5000
[junit4:junit4]   2> 6963 T1553 oascc.ConnectionManager.process Watcher org.apache.solr.common.cloud.ConnectionManager@585fda2e name:ZooKeeperConnection Watcher:127.0.0.1:15224/solr got event WatchedEvent state:SyncConnected type:None path:null path:null type:None
[junit4:junit4]   2> 6964 T1495 oascc.ConnectionManager.waitForConnected Client is connected to ZooKeeper
[junit4:junit4]   2> 6965 T1500 oazs.PrepRequestProcessor.pRequest Got user-level KeeperException when processing sessionid:0x139ca2e8a8b0005 type:create cxid:0x1 zxid:0xfffffffffffffffe txntype:unknown reqpath:n/a Error Path:/solr/overseer Error:KeeperErrorCode = NodeExists for /solr/overseer
[junit4:junit4]   2> 6975 T1500 oazs.PrepRequestProcessor.pRequest Got user-level KeeperException when processing sessionid:0x139ca2e8a8b0005 type:create cxid:0x2 zxid:0xfffffffffffffffe txntype:unknown reqpath:n/a Error Path:/solr/overseer Error:KeeperErrorCode = NodeExists for /solr/overseer
[junit4:junit4]   2> 6976 T1495 oasc.ZkController.createEphemeralLiveNode Register node as live in ZooKeeper:/live_nodes/127.0.0.1:23877_solr
[junit4:junit4]   2> 6976 T1500 oazs.PrepRequestProcessor.pRequest Got user-level KeeperException when processing sessionid:0x139ca2e8a8b0005 type:delete cxid:0x4 zxid:0xfffffffffffffffe txntype:unknown reqpath:n/a Error Path:/solr/live_nodes/127.0.0.1:23877_solr Error:KeeperErrorCode = NoNode for /solr/live_nodes/127.0.0.1:23877_solr
[junit4:junit4]   2> 6977 T1495 oascc.SolrZkClient.makePath makePath: /live_nodes/127.0.0.1:23877_solr
[junit4:junit4]   2> 6986 T1541 oascc.ZkStateReader$3.process Updating live nodes
[junit4:junit4]   2> 6986 T1529 oascc.ZkStateReader$3.process Updating live nodes
[junit4:junit4]   2> 6986 T1515 oascc.ZkStateReader$3.process Updating live nodes
[junit4:junit4]   2> 6987 T1495 oashc.HttpShardHandlerFactory.getParameter Setting socketTimeout to: 0
[junit4:junit4]   2> 6988 T1495 oashc.HttpShardHandlerFactory.getParameter Setting urlScheme to: http://
[junit4:junit4]   2> 6988 T1495 oashc.HttpShardHandlerFactory.getParameter Setting connTimeout to: 0
[junit4:junit4]   2> 6989 T1495 oashc.HttpShardHandlerFactory.getParameter Setting maxConnectionsPerHost to: 20
[junit4:junit4]   2> 6989 T1495 oashc.HttpShardHandlerFactory.getParameter Setting corePoolSize to: 0
[junit4:junit4]   2> 6990 T1495 oashc.HttpShardHandlerFactory.getParameter Setting maximumPoolSize to: 2147483647
[junit4:junit4]   2> 6990 T1495 oashc.HttpShardHandlerFactory.getParameter Setting maxThreadIdleTime to: 5
[junit4:junit4]   2> 6991 T1495 oashc.HttpShardHandlerFactory.getParameter Setting sizeOfQueue to: -1
[junit4:junit4]   2> 6991 T1495 oashc.HttpShardHandlerFactory.getParameter Setting fairnessPolicy to: false
[junit4:junit4]   2> 6992 T1495 oascsi.HttpClientUtil.createClient Creating new http client, config:maxConnectionsPerHost=20&maxConnections=10000&socketTimeout=0&connTimeout=0&retry=false
[junit4:junit4]   2> 7004 T1495 oascc.ZkStateReader.createClusterStateWatchersAndUpdate Updating cluster state from ZooKeeper... 
[junit4:junit4]   2> 7010 T1495 oasc.CoreContainer.create Creating SolrCore 'collection1' using instanceDir: /usr/home/hudson/hudson-slave/workspace/Lucene-Solr-Tests-4.x-java7/solr/build/solr-core/test-files/solr/collection1
[junit4:junit4]   2> 7011 T1495 oasc.ZkController.createCollectionZkNode Check for collection zkNode:collection1
[junit4:junit4]   2> 7011 T1495 oasc.ZkController.createCollectionZkNode Collection zkNode exists
[junit4:junit4]   2> 7012 T1495 oasc.ZkController.readConfigName Load collection config from:/collections/collection1
[junit4:junit4]   2> 7013 T1495 oasc.SolrResourceLoader.<init> new SolrResourceLoader for directory: '/usr/home/hudson/hudson-slave/workspace/Lucene-Solr-Tests-4.x-java7/solr/build/solr-core/test-files/solr/collection1/'
[junit4:junit4]   2> 7015 T1495 oasc.SolrResourceLoader.replaceClassLoader Adding 'file:/usr/home/hudson/hudson-slave/workspace/Lucene-Solr-Tests-4.x-java7/solr/build/solr-core/test-files/solr/collection1/lib/classes/' to classloader
[junit4:junit4]   2> 7016 T1495 oasc.SolrResourceLoader.replaceClassLoader Adding 'file:/usr/home/hudson/hudson-slave/workspace/Lucene-Solr-Tests-4.x-java7/solr/build/solr-core/test-files/solr/collection1/lib/README' to classloader
[junit4:junit4]   2> 7066 T1495 oasc.SolrConfig.<init> Using Lucene MatchVersion: LUCENE_40
[junit4:junit4]   2> 7137 T1495 oasc.SolrConfig.<init> Loaded SolrConfig: solrconfig.xml
[junit4:junit4]   2> 7238 T1495 oass.IndexSchema.readSchema Reading Solr Schema
[junit4:junit4]   2> 7244 T1495 oass.IndexSchema.readSchema Schema name=test
[junit4:junit4]   2> 7326 T1516 oascc.ZkStateReader.updateClusterState Updating cloud state from ZooKeeper... 
[junit4:junit4]   2> 7341 T1529 oascc.ZkStateReader$2.process A cluster state change has occurred - updating...
[junit4:junit4]   2> 7341 T1553 oascc.ZkStateReader$2.process A cluster state change has occurred - updating...
[junit4:junit4]   2> 7341 T1541 oascc.ZkStateReader$2.process A cluster state change has occurred - updating...
[junit4:junit4]   2> 7341 T1515 oascc.ZkStateReader$2.process A cluster state change has occurred - updating...
[junit4:junit4]   2> 7916 T1495 oass.OpenExchangeRatesOrgProvider.init Initialized with rates=open-exchange-rates.json, refreshInterval=1440.
[junit4:junit4]   2> 7930 T1495 oass.IndexSchema.readSchema default search field in schema is text
[junit4:junit4]   2> 7934 T1495 oass.IndexSchema.readSchema unique key field: id
[junit4:junit4]   2> 7948 T1495 oass.FileExchangeRateProvider.reload Reloading exchange rates from file currency.xml
[junit4:junit4]   2> 7954 T1495 oass.FileExchangeRateProvider.reload Reloading exchange rates from file currency.xml
[junit4:junit4]   2> 7959 T1495 oass.OpenExchangeRatesOrgProvider.reload Reloading exchange rates from open-exchange-rates.json
[junit4:junit4]   2> 7960 T1495 oass.OpenExchangeRatesOrgProvider.reload Reloading exchange rates from open-exchange-rates.json
[junit4:junit4]   2> 7962 T1495 oasc.SolrCore.<init> [collection1] Opening new SolrCore at /usr/home/hudson/hudson-slave/workspace/Lucene-Solr-Tests-4.x-java7/solr/build/solr-core/test-files/solr/collection1/, dataDir=./org.apache.solr.cloud.BasicDistributedZk2Test-1347716811396/jetty3/
[junit4:junit4]   2> 7962 T1495 oasc.JmxMonitoredMap.<init> JMX monitoring is enabled. Adding Solr mbeans to JMX Server: com.sun.jmx.mbeanserver.JmxMBeanServer@106051c1
[junit4:junit4]   2> 7964 T1495 oasc.SolrCore.getNewIndexDir WARNING New index directory detected: old=null new=./org.apache.solr.cloud.BasicDistributedZk2Test-1347716811396/jetty3/index/
[junit4:junit4]   2> 7966 T1495 oasc.SolrCore.initIndex WARNING [collection1] Solr index directory './org.apache.solr.cloud.BasicDistributedZk2Test-1347716811396/jetty3/index' doesn't exist. Creating new index...
[junit4:junit4]   2> 7968 T1495 oasc.CachingDirectoryFactory.get return new directory for /usr/home/hudson/hudson-slave/workspace/Lucene-Solr-Tests-4.x-java7/solr/build/solr-core/test/J1/./org.apache.solr.cloud.BasicDistributedZk2Test-1347716811396/jetty3/index forceNew:false
[junit4:junit4]   2> 7978 T1495 oasc.SolrDeletionPolicy.onCommit SolrDeletionPolicy.onCommit: commits:num=1
[junit4:junit4]   2> 		commit{dir=NRTCachingDirectory(org.apache.lucene.store.NIOFSDirectory@/usr/home/hudson/hudson-slave/workspace/Lucene-Solr-Tests-4.x-java7/solr/build/solr-core/test/J1/org.apache.solr.cloud.BasicDistributedZk2Test-1347716811396/jetty3/index lockFactory=org.apache.lucene.store.NativeFSLockFactory@7c1f0c2a; maxCacheMB=48.0 maxMergeSizeMB=4.0),segFN=segments_1,generation=1,filenames=[segments_1]
[junit4:junit4]   2> 7979 T1495 oasc.SolrDeletionPolicy.updateCommits newest commit = 1
[junit4:junit4]   2> 7981 T1495 oasc.SolrCore.initWriters created xml: solr.XMLResponseWriter
[junit4:junit4]   2> 7985 T1495 oasup.UpdateRequestProcessorChain.init inserting DistributedUpdateProcessorFactory into updateRequestProcessorChain "dedupe"
[junit4:junit4]   2> 7986 T1495 oasup.UpdateRequestProcessorChain.init inserting DistributedUpdateProcessorFactory into updateRequestProcessorChain "dedupe-allfields"
[junit4:junit4]   2> 7987 T1495 oasup.UpdateRequestProcessorChain.init inserting DistributedUpdateProcessorFactory into updateRequestProcessorChain "stored_sig"
[junit4:junit4]   2> 7988 T1495 oasup.UpdateRequestProcessorChain.init inserting DistributedUpdateProcessorFactory into updateRequestProcessorChain "uniq-fields"
[junit4:junit4]   2> 7989 T1495 oasup.UpdateRequestProcessorChain.init inserting DistributedUpdateProcessorFactory into updateRequestProcessorChain "distrib-dup-test-chain-implicit"
[junit4:junit4]   2> 7990 T1495 oasc.RequestHandlers.initHandlersFromConfig adding lazy requestHandler: solr.ReplicationHandler
[junit4:junit4]   2> 7991 T1495 oasc.RequestHandlers.initHandlersFromConfig created /replication: solr.ReplicationHandler
[junit4:junit4]   2> 7992 T1495 oasc.RequestHandlers.initHandlersFromConfig created standard: solr.StandardRequestHandler
[junit4:junit4]   2> 7993 T1495 oasc.RequestHandlers.initHandlersFromConfig created /get: solr.RealTimeGetHandler
[junit4:junit4]   2> 7994 T1495 oasc.RequestHandlers.initHandlersFromConfig created dismax: solr.SearchHandler
[junit4:junit4]   2> 7996 T1495 oasc.RequestHandlers.initHandlersFromConfig created mock: org.apache.solr.core.MockQuerySenderListenerReqHandler
[junit4:junit4]   2> 7997 T1495 oasc.RequestHandlers.initHandlersFromConfig created /admin/: org.apache.solr.handler.admin.AdminHandlers
[junit4:junit4]   2> 7998 T1495 oasc.RequestHandlers.initHandlersFromConfig created defaults: solr.StandardRequestHandler
[junit4:junit4]   2> 7999 T1495 oasc.RequestHandlers.initHandlersFromConfig adding lazy requestHandler: solr.StandardRequestHandler
[junit4:junit4]   2> 8000 T1495 oasc.RequestHandlers.initHandlersFromConfig created lazy: solr.StandardRequestHandler
[junit4:junit4]   2> 8001 T1495 oasc.RequestHandlers.initHandlersFromConfig created /update: solr.UpdateRequestHandler
[junit4:junit4]   2> 8002 T1495 oasc.RequestHandlers.initHandlersFromConfig created /terms: org.apache.solr.handler.component.SearchHandler
[junit4:junit4]   2> 8003 T1495 oasc.RequestHandlers.initHandlersFromConfig created spellCheckCompRH: org.apache.solr.handler.component.SearchHandler
[junit4:junit4]   2> 8004 T1495 oasc.RequestHandlers.initHandlersFromConfig created spellCheckCompRH_Direct: org.apache.solr.handler.component.SearchHandler
[junit4:junit4]   2> 8005 T1495 oasc.RequestHandlers.initHandlersFromConfig created spellCheckWithWordbreak: org.apache.solr.handler.component.SearchHandler
[junit4:junit4]   2> 8006 T1495 oasc.RequestHandlers.initHandlersFromConfig created spellCheckWithWordbreak_Direct: org.apache.solr.handler.component.SearchHandler
[junit4:junit4]   2> 8007 T1495 oasc.RequestHandlers.initHandlersFromConfig created spellCheckCompRH1: org.apache.solr.handler.component.SearchHandler
[junit4:junit4]   2> 8008 T1495 oasc.RequestHandlers.initHandlersFromConfig created tvrh: org.apache.solr.handler.component.SearchHandler
[junit4:junit4]   2> 8009 T1495 oasc.RequestHandlers.initHandlersFromConfig created /mlt: solr.MoreLikeThisHandler
[junit4:junit4]   2> 8009 T1495 oasc.RequestHandlers.initHandlersFromConfig created /debug/dump: solr.DumpRequestHandler
[junit4:junit4]   2> 8014 T1495 oashl.XMLLoader.init xsltCacheLifetimeSeconds=60
[junit4:junit4]   2> 8020 T1495 oasc.SolrCore.initDeprecatedSupport WARNING solrconfig.xml uses deprecated <admin/gettableFiles>, Please update your config to use the ShowFileRequestHandler.
[junit4:junit4]   2> 8021 T1495 oasc.SolrCore.initDeprecatedSupport WARNING adding ShowFileRequestHandler with hidden files: [SCHEMA.XML, OLD_SYNONYMS.TXT, STOPWORDS.TXT, PROTWORDS.TXT, OPEN-EXCHANGE-RATES.JSON, SYNONYMS.TXT, CURRENCY.XML, MAPPING-ISOLATIN1ACCENT.TXT]
[junit4:junit4]   2> 8026 T1495 oass.SolrIndexSearcher.<init> Opening Searcher@52aa900d main
[junit4:junit4]   2> 8027 T1495 oasu.CommitTracker.<init> Hard AutoCommit: disabled
[junit4:junit4]   2> 8028 T1495 oasu.CommitTracker.<init> Soft AutoCommit: disabled
[junit4:junit4]   2> 8029 T1495 oashc.SpellCheckComponent.inform Initializing spell checkers
[junit4:junit4]   2> 8037 T1495 oass.DirectSolrSpellChecker.init init: {name=direct,classname=DirectSolrSpellChecker,field=lowerfilt,minQueryLength=3}
[junit4:junit4]   2> 8092 T1554 oasc.SolrCore.registerSearcher [collection1] Registered new searcher Searcher@52aa900d main{StandardDirectoryReader(segments_1:1)}
[junit4:junit4]   2> 8357 T1516 oascc.ZkStateReader.updateClusterState Updating cloud state from ZooKeeper... 
[junit4:junit4]   2> 8371 T1515 oascc.ZkStateReader$2.process A cluster state change has occurred - updating...
[junit4:junit4]   2> 8371 T1553 oascc.ZkStateReader$2.process A cluster state change has occurred - updating...
[junit4:junit4]   2> 8371 T1529 oascc.ZkStateReader$2.process A cluster state change has occurred - updating...
[junit4:junit4]   2> 8371 T1541 oascc.ZkStateReader$2.process A cluster state change has occurred - updating...
[junit4:junit4]   2> 8600 T1495 oasc.CoreContainer.register registering core: collection1
[junit4:junit4]   2> 8600 T1495 oasc.ZkController.register Register shard - core:collection1 address:http://127.0.0.1:23877/solr shardId:shard1
[junit4:junit4]   2> 8604 T1495 oasc.ZkController.register We are http://127.0.0.1:23877/solr/collection1/ and leader is http://127.0.0.1:43302/solr/collection1/
[junit4:junit4]   2> 8605 T1495 oasc.ZkController.register No LogReplay needed for core=collection1 baseURL=http://127.0.0.1:23877/solr
[junit4:junit4]   2> 8605 T1495 oasc.ZkController.checkRecovery Core needs to recover:collection1
[junit4:junit4]   2> 8605 T1495 oasu.DefaultSolrCoreState.doRecovery Running recovery - first canceling any ongoing recovery
[junit4:junit4]   2> ASYNC  NEW_CORE C130 name=collection1 org.apache.solr.core.SolrCore@5585490f url=http://127.0.0.1:23877/solr/collection1 node=127.0.0.1:23877_solr
[junit4:junit4]   2> 8607 T1555 C130 P23877 oasc.RecoveryStrategy.run Starting recovery process.  core=collection1 recoveringAfterStartup=true
[junit4:junit4]   2> 8607 T1555 C130 P23877 oasc.RecoveryStrategy.doRecovery ###### startupVersions=[]
[junit4:junit4]   2> 8607 T1495 oascc.ZkStateReader.updateClusterState Updating cloud state from ZooKeeper... 
[junit4:junit4]   2> 8609 T1555 C130 P23877 oasc.RecoveryStrategy.doRecovery Attempting to PeerSync from http://127.0.0.1:43302/solr/collection1/ core=collection1 - recoveringAfterStartup=true
[junit4:junit4]   2> 8609 T1555 C130 P23877 oasu.PeerSync.sync PeerSync: core=collection1 url=http://127.0.0.1:23877/solr START replicas=[http://127.0.0.1:43302/solr/collection1/] nUpdates=100
[junit4:junit4]   2> 8609 T1495 oass.SolrDispatchFilter.init user.dir=/usr/home/hudson/hudson-slave/workspace/Lucene-Solr-Tests-4.x-java7/solr/build/solr-core/test/J1
[junit4:junit4]   2> 8610 T1555 C130 P23877 oasu.PeerSync.sync WARNING no frame of reference to tell of we've missed updates
[junit4:junit4]   2> 8609 T1495 oass.SolrDispatchFilter.init SolrDispatchFilter.init() done
[junit4:junit4]   2> 8610 T1555 C130 P23877 oasc.RecoveryStrategy.doRecovery PeerSync Recovery was not successful - trying replication. core=collection1
[junit4:junit4]   2> 8610 T1555 C130 P23877 oasc.RecoveryStrategy.doRecovery Starting Replication Recovery. core=collection1
[junit4:junit4]   2> 8610 T1495 oascsi.HttpClientUtil.createClient Creating new http client, config:maxConnections=128&maxConnectionsPerHost=32&followRedirects=false
[junit4:junit4]   2> 8610 T1555 C130 P23877 oascsi.HttpClientUtil.createClient Creating new http client, config:maxConnections=128&maxConnectionsPerHost=32&followRedirects=false
[junit4:junit4]   2> ASYNC  NEW_CORE C131 name=collection1 org.apache.solr.core.SolrCore@4f86d031 url=http://127.0.0.1:43302/solr/collection1 node=127.0.0.1:43302_solr
[junit4:junit4]   2> 8619 T1521 C131 P43302 REQ /get {distrib=false&qt=/get&wt=javabin&version=2&getVersions=100} status=0 QTime=0 
[junit4:junit4]   2> 8633 T1495 oejs.Server.doStart jetty-8.1.2.v20120308
[junit4:junit4]   2> 8635 T1495 oejs.AbstractConnector.doStart Started SocketConnector@0.0.0.0:52489
[junit4:junit4]   2> 8636 T1495 oasc.SolrResourceLoader.locateSolrHome JNDI not configured for solr (NoInitialContextEx)
[junit4:junit4]   2> 8636 T1495 oasc.SolrResourceLoader.locateSolrHome using system property solr.solr.home: /usr/home/hudson/hudson-slave/workspace/Lucene-Solr-Tests-4.x-java7/solr/build/solr-core/test-files/solr
[junit4:junit4]   2> 8637 T1495 oasc.SolrResourceLoader.<init> new SolrResourceLoader for deduced Solr Home: '/usr/home/hudson/hudson-slave/workspace/Lucene-Solr-Tests-4.x-java7/solr/build/solr-core/test-files/solr/'
[junit4:junit4]   2> 8673 T1495 oass.SolrDispatchFilter.init SolrDispatchFilter.init()
[junit4:junit4]   2> 8674 T1495 oasc.SolrResourceLoader.locateSolrHome JNDI not configured for solr (NoInitialContextEx)
[junit4:junit4]   2> 8674 T1495 oasc.SolrResourceLoader.locateSolrHome using system property solr.solr.home: /usr/home/hudson/hudson-slave/workspace/Lucene-Solr-Tests-4.x-java7/solr/build/solr-core/test-files/solr
[junit4:junit4]   2> 8675 T1495 oasc.CoreContainer$Initializer.initialize looking for solr.xml: /usr/home/hudson/hudson-slave/workspace/Lucene-Solr-Tests-4.x-java7/solr/build/solr-core/test-files/solr/solr.xml
[junit4:junit4]   2> 8675 T1495 oasc.CoreContainer.<init> New CoreContainer 1792927468
[junit4:junit4]   2> 8676 T1495 oasc.CoreContainer.load Loading CoreContainer using Solr Home: '/usr/home/hudson/hudson-slave/workspace/Lucene-Solr-Tests-4.x-java7/solr/build/solr-core/test-files/solr/'
[junit4:junit4]   2> 8677 T1495 oasc.SolrResourceLoader.<init> new SolrResourceLoader for directory: '/usr/home/hudson/hudson-slave/workspace/Lucene-Solr-Tests-4.x-java7/solr/build/solr-core/test-files/solr/'
[junit4:junit4]   2> 8707 T1495 oasc.CoreContainer.load Registering Log Listener
[junit4:junit4]   2> 8722 T1495 oasc.CoreContainer.initZooKeeper Zookeeper client=127.0.0.1:15224/solr
[junit4:junit4]   2> 8722 T1495 oaz.ZooKeeper.<init> Initiating client connection, connectString=127.0.0.1:15224/solr sessionTimeout=5000 watcher=org.apache.solr.common.cloud.ConnectionManager@37bf3bde
[junit4:junit4]   2> 8723 T1566 oaz.ClientCnxn$SendThread.startConnect Opening socket connection to server /127.0.0.1:15224
[junit4:junit4]   2> 8723 T1495 oascc.ConnectionManager.waitForConnected Waiting for client to connect to ZooKeeper
[junit4:junit4]   2> 8725 T1566 oaz.ClientCnxn$SendThread.primeConnection Socket connection established to localhost/127.0.0.1:15224, initiating session
[junit4:junit4]   2> 8725 T1497 oazs.NIOServerCnxn$Factory.run Accepted socket connection from /140.211.11.196:53856
[junit4:junit4]   2> 8725 T1497 oazs.NIOServerCnxn.readConnectRequest Client attempting to establish new session at /140.211.11.196:53856
[junit4:junit4]   2> 8727 T1499 oazs.NIOServerCnxn.finishSessionInit Established session 0x139ca2e8a8b0006 with negotiated timeout 5000 for client /140.211.11.196:53856
[junit4:junit4]   2> 8727 T1566 oaz.ClientCnxn$SendThread.readConnectResult Session establishment complete on server localhost/127.0.0.1:15224, sessionid = 0x139ca2e8a8b0006, negotiated timeout = 5000
[junit4:junit4]   2> 8727 T1567 oascc.ConnectionManager.process Watcher org.apache.solr.common.cloud.ConnectionManager@37bf3bde name:ZooKeeperConnection Watcher:127.0.0.1:15224/solr got event WatchedEvent state:SyncConnected type:None path:null path:null type:None
[junit4:junit4]   2> 8727 T1495 oascc.ConnectionManager.waitForConnected Client is connected to ZooKeeper
[junit4:junit4]   2> 8728 T1500 oazs.PrepRequestProcessor.pRequest Got user-level KeeperException when processing sessionid:0x139ca2e8a8b0006 type:create cxid:0x1 zxid:0xfffffffffffffffe txntype:unknown reqpath:n/a Error Path:/solr/overseer Error:KeeperErrorCode = NodeExists for /solr/overseer
[junit4:junit4]   2> 8730 T1500 oazs.PrepRequestProcessor.pRequest Got user-level KeeperException when processing sessionid:0x139ca2e8a8b0006 type:create cxid:0x2 zxid:0xfffffffffffffffe txntype:unknown reqpath:n/a Error Path:/solr/overseer Error:KeeperErrorCode = NodeExists for /solr/overseer
[junit4:junit4]   2> 8738 T1495 oasc.ZkController.createEphemeralLiveNode Register node as live in ZooKeeper:/live_nodes/127.0.0.1:52489_solr
[junit4:junit4]   2> 8739 T1500 oazs.PrepRequestProcessor.pRequest Got user-level KeeperException when processing sessionid:0x139ca2e8a8b0006 type:delete cxid:0x4 zxid:0xfffffffffffffffe txntype:unknown reqpath:n/a Error Path:/solr/live_nodes/127.0.0.1:52489_solr Error:KeeperErrorCode = NoNode for /solr/live_nodes/127.0.0.1:52489_solr
[junit4:junit4]   2> 8740 T1495 oascc.SolrZkClient.makePath makePath: /live_nodes/127.0.0.1:52489_solr
[junit4:junit4]   2> 8742 T1553 oascc.ZkStateReader$3.process Updating live nodes
[junit4:junit4]   2> 8742 T1541 oascc.ZkStateReader$3.process Updating live nodes
[junit4:junit4]   2> 8742 T1515 oascc.ZkStateReader$3.process Updating live nodes
[junit4:junit4]   2> 8742 T1529 oascc.ZkStateReader$3.process Updating live nodes
[junit4:junit4]   2> 8743 T1495 oashc.HttpShardHandlerFactory.getParameter Setting socketTimeout to: 0
[junit4:junit4]   2> 8743 T1495 oashc.HttpShardHandlerFactory.getParameter Setting urlScheme to: http://
[junit4:junit4]   2> 8744 T1495 oashc.HttpShardHandlerFactory.getParameter Setting connTimeout to: 0
[junit4:junit4]   2> 8744 T1495 oashc.HttpShardHandlerFactory.getParameter Setting maxConnectionsPerHost to: 20
[junit4:junit4]   2> 8744 T1495 oashc.HttpShardHandlerFactory.getParameter Setting corePoolSize to: 0
[junit4:junit4]   2> 8745 T1495 oashc.HttpShardHandlerFactory.getParameter Setting maximumPoolSize to: 2147483647
[junit4:junit4]   2> 8745 T1495 oashc.HttpShardHandlerFactory.getParameter Setting maxThreadIdleTime to: 5
[junit4:junit4]   2> 8745 T1495 oashc.HttpShardHandlerFactory.getParameter Setting sizeOfQueue to: -1
[junit4:junit4]   2> 8746 T1495 oashc.HttpShardHandlerFactory.getParameter Setting fairnessPolicy to: false
[junit4:junit4]   2> 8746 T1495 oascsi.HttpClientUtil.createClient Creating new http client, config:maxConnectionsPerHost=20&maxConnections=10000&socketTimeout=0&connTimeout=0&retry=false
[junit4:junit4]   2> 8755 T1495 oascc.ZkStateReader.createClusterStateWatchersAndUpdate Updating cluster state from ZooKeeper... 
[junit4:junit4]   2> 8760 T1495 oasc.CoreContainer.create Creating SolrCore 'collection1' using instanceDir: /usr/home/hudson/hudson-slave/workspace/Lucene-Solr-Tests-4.x-java7/solr/build/solr-core/test-files/solr/collection1
[junit4:junit4]   2> 8760 T1495 oasc.ZkController.createCollectionZkNode Check for collection zkNode:collection1
[junit4:junit4]   2> 8761 T1495 oasc.ZkController.createCollectionZkNode Collection zkNode exists
[junit4:junit4]   2> 8761 T1495 oasc.ZkController.readConfigName Load collection config from:/collections/collection1
[junit4:junit4]   2> 8762 T1495 oasc.SolrResourceLoader.<init> new SolrResourceLoader for directory: '/usr/home/hudson/hudson-slave/workspace/Lucene-Solr-Tests-4.x-java7/solr/build/solr-core/test-files/solr/collection1/'
[junit4:junit4]   2> 8763 T1495 oasc.SolrResourceLoader.replaceClassLoader Adding 'file:/usr/home/hudson/hudson-slave/workspace/Lucene-Solr-Tests-4.x-java7/solr/build/solr-core/test-files/solr/collection1/lib/classes/' to classloader
[junit4:junit4]   2> 8764 T1495 oasc.SolrResourceLoader.replaceClassLoader Adding 'file:/usr/home/hudson/hudson-slave/workspace/Lucene-Solr-Tests-4.x-java7/solr/build/solr-core/test-files/solr/collection1/lib/README' to classloader
[junit4:junit4]   2> 8799 T1495 oasc.SolrConfig.<init> Using Lucene MatchVersion: LUCENE_40
[junit4:junit4]   2> 8847 T1495 oasc.SolrConfig.<init> Loaded SolrConfig: solrconfig.xml
[junit4:junit4]   2> 8876 T1516 oascc.ZkStateReader.updateClusterState Updating cloud state from ZooKeeper... 
[junit4:junit4]   2> 8889 T1553 oascc.ZkStateReader$2.process A cluster state change has occurred - updating...
[junit4:junit4]   2> 8889 T1515 oascc.ZkStateReader$2.process A cluster state change has occurred - updating...
[junit4:junit4]   2> 8889 T1541 oascc.ZkStateReader$2.process A cluster state change has occurred - updating...
[junit4:junit4]   2> 8889 T1529 oascc.ZkStateReader$2.process A cluster state change has occurred - updating...
[junit4:junit4]   2> 8948 T1567 oascc.ZkStateReader$2.process A cluster state change has occurred - updating...
[junit4:junit4]   2> 8948 T1495 oass.IndexSchema.readSchema Reading Solr Schema
[junit4:junit4]   2> 8953 T1495 oass.IndexSchema.readSchema Schema name=test
[junit4:junit4]   2> 9394 T1495 oass.OpenExchangeRatesOrgProvider.init Initialized with rates=open-exchange-rates.json, refreshInterval=1440.
[junit4:junit4]   2> 9402 T1495 oass.IndexSchema.readSchema default search field in schema is text
[junit4:junit4]   2> 9406 T1495 oass.IndexSchema.readSchema unique key field: id
[junit4:junit4]   2> 9417 T1495 oass.FileExchangeRateProvider.reload Reloading exchange rates from file currency.xml
[junit4:junit4]   2> 9420 T1495 oass.FileExchangeRateProvider.reload Reloading exchange rates from file currency.xml
[junit4:junit4]   2> 9424 T1495 oass.OpenExchangeRatesOrgProvider.reload Reloading exchange rates from open-exchange-rates.json
[junit4:junit4]   2> 9425 T1495 oass.OpenExchangeRatesOrgProvider.reload Reloading exchange rates from open-exchange-rates.json
[junit4:junit4]   2> 9426 T1495 oasc.SolrCore.<init> [collection1] Opening new SolrCore at /usr/home/hudson/hudson-slave/workspace/Lucene-Solr-Tests-4.x-java7/solr/build/solr-core/test-files/solr/collection1/, dataDir=./org.apache.solr.cloud.BasicDistributedZk2Test-1347716811396/jetty4/
[junit4:junit4]   2> 9426 T1495 oasc.JmxMonitoredMap.<init> JMX monitoring is enabled. Adding Solr mbeans to JMX Server: com.sun.jmx.mbeanserver.JmxMBeanServer@106051c1
[junit4:junit4]   2> 9427 T1495 oasc.SolrCore.getNewIndexDir WARNING New index directory detected: old=null new=./org.apache.solr.cloud.BasicDistributedZk2Test-1347716811396/jetty4/index/
[junit4:junit4]   2> 9428 T1495 oasc.SolrCore.initIndex WARNING [collection1] Solr index directory './org.apache.solr.cloud.BasicDistributedZk2Test-1347716811396/jetty4/index' doesn't exist. Creating new index...
[junit4:junit4]   2> 9429 T1495 oasc.CachingDirectoryFactory.get return new directory for /usr/home/hudson/hudson-slave/workspace/Lucene-Solr-Tests-4.x-java7/solr/build/solr-core/test/J1/./org.apache.solr.cloud.BasicDistributedZk2Test-1347716811396/jetty4/index forceNew:false
[junit4:junit4]   2> 9434 T1495 oasc.SolrDeletionPolicy.onCommit SolrDeletionPolicy.onCommit: commits:num=1
[junit4:junit4]   2> 		commit{dir=NRTCachingDirectory(org.apache.lucene.store.NIOFSDirectory@/usr/home/hudson/hudson-slave/workspace/Lucene-Solr-Tests-4.x-java7/solr/build/solr-core/test/J1/org.apache.solr.cloud.BasicDistributedZk2Test-1347716811396/jetty4/index lockFactory=org.apache.lucene.store.NativeFSLockFactory@251dcf2d; maxCacheMB=48.0 maxMergeSizeMB=4.0),segFN=segments_1,generation=1,filenames=[segments_1]
[junit4:junit4]   2> 9434 T1495 oasc.SolrDeletionPolicy.updateCommits newest commit = 1
[junit4:junit4]   2> 9435 T1495 oasc.SolrCore.initWriters created xml: solr.XMLResponseWriter
[junit4:junit4]   2> 9439 T1495 oasup.UpdateRequestProcessorChain.init inserting DistributedUpdateProcessorFactory into updateRequestProcessorChain "dedupe"
[junit4:junit4]   2> 9440 T1495 oasup.UpdateRequestProcessorChain.init inserting DistributedUpdateProcessorFactory into updateRequestProcessorChain "dedupe-allfields"
[junit4:junit4]   2> 9441 T1495 oasup.UpdateRequestProcessorChain.init inserting DistributedUpdateProcessorFactory into updateRequestProcessorChain "stored_sig"
[junit4:junit4]   2> 9441 T1495 oasup.UpdateRequestProcessorChain.init inserting DistributedUpdateProcessorFactory into updateRequestProcessorChain "uniq-fields"
[junit4:junit4]   2> 9442 T1495 oasup.UpdateRequestProcessorChain.init inserting DistributedUpdateProcessorFactory into updateRequestProcessorChain "distrib-dup-test-chain-implicit"
[junit4:junit4]   2> 9443 T1495 oasc.RequestHandlers.initHandlersFromConfig adding lazy requestHandler: solr.ReplicationHandler
[junit4:junit4]   2> 9443 T1495 oasc.RequestHandlers.initHandlersFromConfig created /replication: solr.ReplicationHandler
[junit4:junit4]   2> 9444 T1495 oasc.RequestHandlers.initHandlersFromConfig created standard: solr.StandardRequestHandler
[junit4:junit4]   2> 9444 T1495 oasc.RequestHandlers.initHandlersFromConfig created /get: solr.RealTimeGetHandler
[junit4:junit4]   2> 9445 T1495 oasc.RequestHandlers.initHandlersFromConfig created dismax: solr.SearchHandler
[junit4:junit4]   2> 9446 T1495 oasc.RequestHandlers.initHandlersFromConfig created mock: org.apache.solr.core.MockQuerySenderListenerReqHandler
[junit4:junit4]   2> 9446 T1495 oasc.RequestHandlers.initHandlersFromConfig created /admin/: org.apache.solr.handler.admin.AdminHandlers
[junit4:junit4]   2> 9447 T1495 oasc.RequestHandlers.initHandlersFromConfig created defaults: solr.StandardRequestHandler
[junit4:junit4]   2> 9447 T1495 oasc.RequestHandlers.initHandlersFromConfig adding lazy requestHandler: solr.StandardRequestHandler
[junit4:junit4]   2> 9447 T1495 oasc.RequestHandlers.initHandlersFromConfig created lazy: solr.StandardRequestHandler
[junit4:junit4]   2> 9448 T1495 oasc.RequestHandlers.initHandlersFromConfig created /update: solr.UpdateRequestHandler
[junit4:junit4]   2> 9448 T1495 oasc.RequestHandlers.initHandlersFromConfig created /terms: org.apache.solr.handler.component.SearchHandler
[junit4:junit4]   2> 9449 T1495 oasc.RequestHandlers.initHandlersFromConfig created spellCheckCompRH: org.apache.solr.handler.component.SearchHandler
[junit4:junit4]   2> 9450 T1495 oasc.RequestHandlers.initHandlersFromConfig created spellCheckCompRH_Direct: org.apache.solr.handler.component.SearchHandler
[junit4:junit4]   2> 9450 T1495 oasc.RequestHandlers.initHandlersFromConfig created spellCheckWithWordbreak: org.apache.solr.handler.component.SearchHandler
[junit4:junit4]   2> 9451 T1495 oasc.RequestHandlers.initHandlersFromConfig created spellCheckWithWordbreak_Direct: org.apache.solr.handler.component.SearchHandler
[junit4:junit4]   2> 9451 T1495 oasc.RequestHandlers.initHandlersFromConfig created spellCheckCompRH1: org.apache.solr.handler.component.SearchHandler
[junit4:junit4]   2> 9452 T1495 oasc.RequestHandlers.initHandlersFromConfig created tvrh: org.apache.solr.handler.component.SearchHandler
[junit4:junit4]   2> 9452 T1495 oasc.RequestHandlers.initHandlersFromConfig created /mlt: solr.MoreLikeThisHandler
[junit4:junit4]   2> 9453 T1495 oasc.RequestHandlers.initHandlersFromConfig created /debug/dump: solr.DumpRequestHandler
[junit4:junit4]   2> 9456 T1495 oashl.XMLLoader.init xsltCacheLifetimeSeconds=60
[junit4:junit4]   2> 9459 T1495 oasc.SolrCore.initDeprecatedSupport WARNING solrconfig.xml uses deprecated <admin/gettableFiles>, Please update your config to use the ShowFileRequestHandler.
[junit4:junit4]   2> 9460 T1495 oasc.SolrCore.initDeprecatedSupport WARNING adding ShowFileRequestHandler with hidden files: [SCHEMA.XML, OLD_SYNONYMS.TXT, STOPWORDS.TXT, PROTWORDS.TXT, OPEN-EXCHANGE-RATES.JSON, SYNONYMS.TXT, CURRENCY.XML, MAPPING-ISOLATIN1ACCENT.TXT]
[junit4:junit4]   2> 9463 T1495 oass.SolrIndexSearcher.<init> Opening Searcher@2abfaea main
[junit4:junit4]   2> 9464 T1495 oasu.CommitTracker.<init> Hard AutoCommit: disabled
[junit4:junit4]   2> 9465 T1495 oasu.CommitTracker.<init> Soft AutoCommit: disabled
[junit4:junit4]   2> 9465 T1495 oashc.SpellCheckComponent.inform Initializing spell checkers
[junit4:junit4]   2> 9474 T1495 oass.DirectSolrSpellChecker.init init: {name=direct,classname=DirectSolrSpellChecker,field=lowerfilt,minQueryLength=3}
[junit4:junit4]   2> 9665 T1568 oasc.SolrCore.registerSearcher [collection1] Registered new searcher Searcher@2abfaea main{StandardDirectoryReader(segments_1:1)}
[junit4:junit4]   2> 9895 T1516 oascc.ZkStateReader.updateClusterState Updating cloud state from ZooKeeper... 
[junit4:junit4]   2> 9909 T1553 oascc.ZkStateReader$2.process A cluster state change has occurred - updating...
[junit4:junit4]   2> 9909 T1515 oascc.ZkStateReader$2.process A cluster state change has occurred - updating...
[junit4:junit4]   2> 9909 T1567 oascc.ZkStateReader$2.process A cluster state change has occurred - updating...
[junit4:junit4]   2> 9909 T1541 oascc.ZkStateReader$2.process A cluster state change has occurred - updating...
[junit4:junit4]   2> 9909 T1529 oascc.ZkStateReader$2.process A cluster state change has occurred - updating...
[junit4:junit4]   2> 10171 T1495 oasc.CoreContainer.register registering core: collection1
[junit4:junit4]   2> 10171 T1495 oasc.ZkController.register Register shard - core:collection1 address:http://127.0.0.1:52489/solr shardId:shard2
[junit4:junit4]   2> 10175 T1495 oasc.ZkController.register We are http://127.0.0.1:52489/solr/collection1/ and leader is http://127.0.0.1:64103/solr/collection1/
[junit4:junit4]   2> 10176 T1495 oasc.ZkController.register No LogReplay needed for core=collection1 baseURL=http://127.0.0.1:52489/solr
[junit4:junit4]   2> 10176 T1495 oasc.ZkController.checkRecovery Core needs to recover:collection1
[junit4:junit4]   2> 10177 T1495 oasu.DefaultSolrCoreState.doRecovery Running recovery - first canceling any ongoing recovery
[junit4:junit4]   2> ASYNC  NEW_CORE C132 name=collection1 org.apache.solr.core.SolrCore@3b0754ec url=http://127.0.0.1:52489/solr/collection1 node=127.0.0.1:52489_solr
[junit4:junit4]   2> 10178 T1569 C132 P52489 oasc.RecoveryStrategy.run Starting recovery process.  core=collection1 recoveringAfterStartup=true
[junit4:junit4]   2> 10179 T1569 C132 P52489 oasc.RecoveryStrategy.doRecovery ###### startupVersions=[]
[junit4:junit4]   2> 10178 T1495 oascc.ZkStateReader.updateClusterState Updating cloud state from ZooKeeper... 
[junit4:junit4]   2> 10180 T1569 C132 P52489 oasc.RecoveryStrategy.doRecovery Attempting to PeerSync from http://127.0.0.1:64103/solr/collection1/ core=collection1 - recoveringAfterStartup=true
[junit4:junit4]   2> 10180 T1569 C132 P52489 oasu.PeerSync.sync PeerSync: core=collection1 url=http://127.0.0.1:52489/solr START replicas=[http://127.0.0.1:64103/solr/collection1/] nUpdates=100
[junit4:junit4]   2> 10180 T1495 oass.SolrDispatchFilter.init user.dir=/usr/home/hudson/hudson-slave/workspace/Lucene-Solr-Tests-4.x-java7/solr/build/solr-core/test/J1
[junit4:junit4]   2> 10180 T1569 C132 P52489 oasu.PeerSync.sync WARNING no frame of reference to tell of we've missed updates
[junit4:junit4]   2> 10181 T1569 C132 P52489 oasc.RecoveryStrategy.doRecovery PeerSync Recovery was not successful - trying replication. core=collection1
[junit4:junit4]   2> 10181 T1495 oass.SolrDispatchFilter.init SolrDispatchFilter.init() done
[junit4:junit4]   2> 10181 T1569 C132 P52489 oasc.RecoveryStrategy.doRecovery Starting Replication Recovery. core=collection1
[junit4:junit4]   2> 10182 T1569 C132 P52489 oascsi.HttpClientUtil.createClient Creating new http client, config:maxConnections=128&maxConnectionsPerHost=32&followRedirects=false
[junit4:junit4]   2> 10181 T1495 oascsi.HttpClientUtil.createClient Creating new http client, config:maxConnections=128&maxConnectionsPerHost=32&followRedirects=false
[junit4:junit4]   2> ASYNC  NEW_CORE C133 name=collection1 org.apache.solr.core.SolrCore@29662ca5 url=http://127.0.0.1:64103/solr/collection1 node=127.0.0.1:64103_solr
[junit4:junit4]   2> 10191 T1533 C133 P64103 REQ /get {distrib=false&qt=/get&wt=javabin&version=2&getVersions=100} status=0 QTime=0 
[junit4:junit4]   2> 10198 T1495 oaz.ZooKeeper.<init> Initiating client connection, connectString=127.0.0.1:15224/solr sessionTimeout=10000 watcher=org.apache.solr.common.cloud.ConnectionManager@4bf9c513
[junit4:junit4]   2> 10199 T1571 oaz.ClientCnxn$SendThread.startConnect Opening socket connection to server /127.0.0.1:15224
[junit4:junit4]   2> 10199 T1495 oascc.ConnectionManager.waitForConnected Waiting for client to connect to ZooKeeper
[junit4:junit4]   2> 10199 T1571 oaz.ClientCnxn$SendThread.primeConnection Socket connection established to localhost/127.0.0.1:15224, initiating session
[junit4:junit4]   2> 10200 T1497 oazs.NIOServerCnxn$Factory.run Accepted socket connection from /140.211.11.196:65311
[junit4:junit4]   2> 10200 T1497 oazs.NIOServerCnxn.readConnectRequest Client attempting to establish new session at /140.211.11.196:65311
[junit4:junit4]   2> 10201 T1499 oazs.NIOServerCnxn.finishSessionInit Established session 0x139ca2e8a8b0007 with negotiated timeout 10000 for client /140.211.11.196:65311
[junit4:junit4]   2> 10201 T1571 oaz.ClientCnxn$SendThread.readConnectResult Session establishment complete on server localhost/127.0.0.1:15224, sessionid = 0x139ca2e8a8b0007, negotiated timeout = 10000
[junit4:junit4]   2> 10202 T1572 oascc.ConnectionManager.process Watcher org.apache.solr.common.cloud.ConnectionManager@4bf9c513 name:ZooKeeperConnection Watcher:127.0.0.1:15224/solr got event WatchedEvent state:SyncConnected type:None path:null path:null type:None
[junit4:junit4]   2> 10202 T1495 oascc.ConnectionManager.waitForConnected Client is connected to ZooKeeper
[junit4:junit4]   2> 10203 T1495 oascc.ZkStateReader.createClusterStateWatchersAndUpdate Updating cluster state from ZooKeeper... 
[junit4:junit4]   2> 10204 T1495 oasc.ChaosMonkey.monkeyLog monkey: init - expire sessions:true cause connection loss:true
[junit4:junit4]   2> 10205 T1495 oascsi.HttpClientUtil.createClient Creating new http client, config:
[junit4:junit4]   2> 10217 T1495 oascc.ZkStateReader.updateClusterState Updating cloud state from ZooKeeper... 
[junit4:junit4]   2> ASYNC  NEW_CORE C134 name=collection1 org.apache.solr.core.SolrCore@2350bd77 url=http://127.0.0.1:10684/solr/collection1 node=127.0.0.1:10684_solr
[junit4:junit4]   2> 10227 T1507 C134 P10684 oasc.SolrDeletionPolicy.onInit SolrDeletionPolicy.onInit: commits:num=1
[junit4:junit4]   2> 		commit{dir=NRTCachingDirectory(org.apache.lucene.store.NIOFSDirectory@/usr/home/hudson/hudson-slave/workspace/Lucene-Solr-Tests-4.x-java7/solr/build/solr-core/test/J1/org.apache.solr.cloud.BasicDistributedZk2Test-1347716811396/control/data/index lockFactory=org.apache.lucene.store.NativeFSLockFactory@f7632e7; maxCacheMB=48.0 maxMergeSizeMB=4.0),segFN=segments_1,generation=1,filenames=[segments_1]
[junit4:junit4]   2> 10228 T1507 C134 P10684 oasc.SolrDeletionPolicy.updateCommits newest commit = 1
[junit4:junit4]   2> 10231 T1507 C134 P10684 /update {wt=javabin&version=2} {add=[1 (1413183513941770240)]} 0 8
[junit4:junit4]   2> 10232 T1495 oaz.ZooKeeper.<init> Initiating client connection, connectString=127.0.0.1:15224/solr sessionTimeout=10000 watcher=org.apache.solr.common.cloud.ConnectionManager@1e0dd1e7
[junit4:junit4]   2> 10233 T1573 oaz.ClientCnxn$SendThread.startConnect Opening socket connection to server /127.0.0.1:15224
[junit4:junit4]   2> 10233 T1495 oascc.ConnectionManager.waitForConnected Waiting for client to connect to ZooKeeper
[junit4:junit4]   2> 10234 T1573 oaz.ClientCnxn$SendThread.primeConnection Socket connection established to localhost/127.0.0.1:15224, initiating session
[junit4:junit4]   2> 10234 T1497 oazs.NIOServerCnxn$Factory.run Accepted socket connection from /140.211.11.196:46218
[junit4:junit4]   2> 10235 T1497 oazs.NIOServerCnxn.readConnectRequest Client attempting to establish new session at /140.211.11.196:46218
[junit4:junit4]   2> 10236 T1499 oazs.NIOServerCnxn.finishSessionInit Established session 0x139ca2e8a8b0008 with negotiated timeout 10000 for client /140.211.11.196:46218
[junit4:junit4]   2> 10237 T1573 oaz.ClientCnxn$SendThread.readConnectResult Session establishment complete on server localhost/127.0.0.1:15224, sessionid = 0x139ca2e8a8b0008, negotiated timeout = 10000
[junit4:junit4]   2> 10237 T1574 oascc.ConnectionManager.process Watcher org.apache.solr.common.cloud.ConnectionManager@1e0dd1e7 name:ZooKeeperConnection Watcher:127.0.0.1:15224/solr got event WatchedEvent state:SyncConnected type:None path:null path:null type:None
[junit4:junit4]   2> 10237 T1495 oascc.ConnectionManager.waitForConnected Client is connected to ZooKeeper
[junit4:junit4]   2> 10238 T1495 oascc.ZkStateReader.createClusterStateWatchersAndUpdate Updating cluster state from ZooKeeper... 
[junit4:junit4]   2> 10245 T1523 C131 P43302 oasc.SolrDeletionPolicy.onInit SolrDeletionPolicy.onInit: commits:num=1
[junit4:junit4]   2> 		commit{dir=NRTCachingDirectory(org.apache.lucene.store.NIOFSDirectory@/usr/home/hudson/hudson-slave/workspace/Lucene-Solr-Tests-4.x-java7/solr/build/solr-core/test/J1/org.apache.solr.cloud.BasicDistributedZk2Test-1347716811396/jetty1/index lockFactory=org.apache.lucene.store.NativeFSLockFactory@4eff0691; maxCacheMB=48.0 maxMergeSizeMB=4.0),segFN=segments_1,generation=1,filenames=[segments_1]
[junit4:junit4]   2> 10245 T1523 C131 P43302 oasc.SolrDeletionPolicy.updateCommits newest commit = 1
[junit4:junit4]   2>  C130_STATE=coll:collection1 core:collection1 props:{shard=shard1, roles=null, state=recovering, core=collection1, collection=collection1, node_name=127.0.0.1:23877_solr, base_url=http://127.0.0.1:23877/solr}
[junit4:junit4]   2> 10258 T1545 C130 P23877 oasc.SolrDeletionPolicy.onInit SolrDeletionPolicy.onInit: commits:num=1
[junit4:junit4]   2> 		commit{dir=NRTCachingDirectory(org.apache.lucene.store.NIOFSDirectory@/usr/home/hudson/hudson-slave/workspace/Lucene-Solr-Tests-4.x-java7/solr/build/solr-core/test/J1/org.apache.solr.cloud.BasicDistributedZk2Test-1347716811396/jetty3/index lockFactory=org.apache.lucene.store.NativeFSLockFactory@7c1f0c2a; maxCacheMB=48.0 maxMergeSizeMB=4.0),segFN=segments_1,generation=1,filenames=[segments_1]
[junit4:junit4]   2> 10259 T1545 C130 P23877 oasc.SolrDeletionPolicy.updateCommits newest commit = 1
[junit4:junit4]   2> 10261 T1545 C130 P23877 REQ /update {distrib.from=http://127.0.0.1:43302/solr/collection1/&update.distrib=FROMLEADER&wt=javabin&version=2} status=0 QTime=6 
[junit4:junit4]   2> 10262 T1523 C131 P43302 /update {wt=javabin&version=2} {add=[1 (1413183513959596032)]} 0 21
[junit4:junit4]   2> 10262 T1495 oasc.AbstractDistribZkTestBase.waitForRecoveriesToFinish Wait for recoveries to finish - collection: collection1 failOnTimeout:true timeout (sec):1440
[junit4:junit4]   2> 10263 T1495 oascc.ZkStateReader.updateClusterState Updating cloud state from ZooKeeper... 
[junit4:junit4]   2> 10413 T1516 oascc.ZkStateReader.updateClusterState Updating cloud state from ZooKeeper... 
[junit4:junit4]   2> 10427 T1574 oascc.ZkStateReader$2.process A cluster state change has occurred - updating...
[junit4:junit4]   2> 10427 T1541 oascc.ZkStateReader$2.process A cluster state change has occurred - updating...
[junit4:junit4]   2> 10427 T1572 oascc.ZkStateReader$2.process A cluster state change has occurred - updating...
[junit4:junit4]   2> 10427 T1515 oascc.ZkStateReader$2.process A cluster state change has occurred - updating...
[junit4:junit4]   2> 10427 T1529 oascc.ZkStateReader$2.process A cluster state change has occurred - updating...
[junit4:junit4]   2> 10427 T1567 oascc.ZkStateReader$2.process A cluster state change has occurred - updating...
[junit4:junit4]   2> 10427 T1553 oascc.ZkStateReader$2.process A cluster state change has occurred - updating...
[junit4:junit4]   2> 11265 T1495 oascc.ZkStateReader.updateClusterState Updating cloud state from ZooKeeper... 
[junit4:junit4]   2> 11634 T1555 C130 P23877 oasc.RecoveryStrategy.doRecovery Begin buffering updates. core=collection1
[junit4:junit4]   2> 11634 T1555 C130 P23877 oasu.UpdateLog.bufferUpdates Starting to buffer updates. FSUpdateLog{state=ACTIVE, tlog=tlog{file=./org.apache.solr.cloud.BasicDistributedZk2Test-1347716811396/jetty3/tlog/tlog.0000000000000000000 refcount=1}}
[junit4:junit4]   2> 11635 T1555 C130 P23877 oasc.RecoveryStrategy.replicate Attempting to replicate from http://127.0.0.1:43302/solr/collection1/. core=collection1
[junit4:junit4]   2> 11635 T1555 C130 P23877 oascsi.HttpClientUtil.createClient Creating new http client, config:maxConnections=128&maxConnectionsPerHost=32&followRedirects=false
[junit4:junit4]   2> 11651 T1524 C131 P43302 oasu.DirectUpdateHandler2.commit start commit{flags=0,_version_=0,optimize=false,openSearcher=true,waitSearcher=true,expungeDeletes=false,softCommit=false}
[junit4:junit4]   2> 11771 T1524 C131 P43302 oasc.SolrDeletionPolicy.onCommit SolrDeletionPolicy.onCommit: commits:num=2
[junit4:junit4]   2> 		commit{dir=NRTCachingDirectory(org.apache.lucene.store.NIOFSDirectory@/usr/home/hudson/hudson-slave/workspace/Lucene-Solr-Tests-4.x-java7/solr/build/solr-core/test/J1/org.apache.solr.cloud.BasicDistributedZk2Test-1347716811396/jetty1/index lockFactory=org.apache.lucene.store.NativeFSLockFactory@4eff0691; maxCacheMB=48.0 maxMergeSizeMB=4.0),segFN=segments_1,generation=1,filenames=[segments_1]
[junit4:junit4]   2> 		commit{dir=NRTCachingDirectory(org.apache.lucene.store.NIOFSDirectory@/usr/home/hudson/hudson-slave/workspace/Lucene-Solr-Tests-4.x-java7/solr/build/solr-core/test/J1/org.apache.solr.cloud.BasicDistributedZk2Test-1347716811396/jetty1/index lockFactory=org.apache.lucene.store.NativeFSLockFactory@4eff0691; maxCacheMB=48.0 maxMergeSizeMB=4.0),segFN=segments_2,generation=2,filenames=[_0_Block_0.tip, _0_Block_0.pos, _0_MockVariableIntBlock_0.doc, _0_Block_0.tim, _0_MockVariableIntBlock_0.skp, _0_Pulsing40_0.prx, _0_NestedPulsing_0.tip, _0_Pulsing40_0.frq, _0_NestedPulsing_0.tim, _0_MockVariableIntBlock_0.pyl, _0_MockVariableIntBlock_0.tib, _0_MockVariableIntBlock_0.pos, _0_Pulsing40_0.tip, _0.si, _0_MockVariableIntBlock_0.tii, _0.fnm, _0_Block_0.doc, _0_Pulsing40_0.tim, _0_NestedPulsing_0.frq, _0_nrm.cfs, _0_NestedPulsing_0.prx, _0_nrm.cfe, _0_MockVariableIntBlock_0.frq, segments_2, _0.fdx, _0.fdt]
[junit4:junit4]   2> 11772 T1524 C131 P43302 oasc.SolrDeletionPolicy.updateCommits newest commit = 2
[junit4:junit4]   2> 11787 T1524 C131 P43302 oass.SolrIndexSearcher.<init> Opening Searcher@47e7673e main
[junit4:junit4]   2> 11788 T1524 C131 P43302 oasu.DirectUpdateHandler2.commit end_commit_flush
[junit4:junit4]   2> 11790 T1530 oasc.SolrCore.registerSearcher [collection1] Registered new searcher Searcher@47e7673e main{StandardDirectoryReader(segments_2:3 _0(4.0.0.2):C1)}
[junit4:junit4]   2> 11790 T1524 C131 P43302 /update {waitSearcher=true&commit=true&commit_end_point=true&wt=javabin&softCommit=false&version=2} {commit=} 0 139
[junit4:junit4]   2> 11791 T1555 C130 P23877 oash.ReplicationHandler.inform Commits will be reserved for  10000
[junit4:junit4]   2> 11792 T1555 C130 P23877 oash.SnapPuller.<init>  No value set for 'pollInterval'. Timer Task not started.
[junit4:junit4]   2> 11793 T1525 C131 P43302 oash.ReplicationHandler.inform Commits will be reserved for  10000
[junit4:junit4]   2> 11794 T1525 C131 P43302 REQ /replication {command=indexversion&wt=javabin&qt=/replication&version=2} status=0 QTime=1 
[junit4:junit4]   2> 11794 T1555 C130 P23877 oash.SnapPuller.fetchLatestIndex Master's generation: 2
[junit4:junit4]   2> 11795 T1555 C130 P23877 oash.SnapPuller.fetchLatestIndex Slave's generation: 1
[junit4:junit4]   2> 11795 T1555 C130 P23877 oash.SnapPuller.fetchLatestIndex Starting replication process
[junit4:junit4]   2> 11800 T1525 C131 P43302 REQ /replication {command=filelist&generation=2&wt=javabin&qt=/replication&version=2} status=0 QTime=3 
[junit4:junit4]   2> 11800 T1555 C130 P23877 oash.SnapPuller.fetchLatestIndex Number of files in latest index in master: 26
[junit4:junit4]   2> 11809 T1555 C130 P23877 oash.SnapPuller.fetchLatestIndex Starting download to ./org.apache.solr.cloud.BasicDistributedZk2Test-1347716811396/jetty3/index.20120915074703192 fullCopy=true
[junit4:junit4]   2> 11813 T1525 C131 P43302 REQ /replication {file=_0_Block_0.pos&command=filecontent&checksum=true&generation=2&qt=/replication&wt=filestream} status=0 QTime=0 
[junit4:junit4]   2> 11819 T1525 C131 P43302 REQ /replication {file=_0_Block_0.tip&command=filecontent&checksum=true&generation=2&qt=/replication&wt=filestream} status=0 QTime=0 
[junit4:junit4]   2> 11824 T1525 C131 P43302 REQ /replication {file=_0_Block_0.tim&command=filecontent&checksum=true&generation=2&qt=/replication&wt=filestream} status=0 QTime=0 
[junit4:junit4]   2> 11828 T1525 C131 P43302 REQ /replication {file=_0_MockVariableIntBlock_0.doc&command=filecontent&checksum=true&generation=2&qt=/replication&wt=filestream} status=0 QTime=0 
[junit4:junit4]   2> 11832 T1525 C131 P43302 REQ /replication {file=_0_MockVariableIntBlock_0.skp&command=filecontent&checksum=true&generation=2&qt=/replication&wt=filestream} status=0 QTime=0 
[junit4:junit4]   2> 11833 T1555 C130 P23877 oash.SnapPuller$FileFetcher.fetchPackets WARNING No content recieved for file: {name=_0_MockVariableIntBlock_0.skp, lastmodified=1347716823000, size=0}
[junit4:junit4]   2> 11836 T1525 C131 P43302 REQ /replication {file=_0_NestedPulsing_0.tip&command=filecontent&checksum=true&generation=2&qt=/replication&wt=filestream} status=0 QTime=0 
[junit4:junit4]   2> 11840 T1525 C131 P43302 REQ /replication {file=_0_Pulsing40_0.prx&command=filecontent&checksum=true&generation=2&qt=/replication&wt=filestream} status=0 QTime=0 
[junit4:junit4]   2> 11845 T1525 C131 P43302 REQ /replication {file=_0_Pulsing40_0.frq&command=filecontent&checksum=true&generation=2&qt=/replication&wt=filestream} status=0 QTime=0 
[junit4:junit4]   2> 11850 T1525 C131 P43302 REQ /replication {file=_0_NestedPulsing_0.tim&command=filecontent&checksum=true&generation=2&qt=/replication&wt=filestream} status=0 QTime=0 
[junit4:junit4]   2> 11855 T1525 C131 P43302 REQ /replication {file=_0_MockVariableIntBlock_0.pyl&command=filecontent&checksum=true&generation=2&qt=/replication&wt=filestream} status=0 QTime=0 
[junit4:junit4]   2> 11856 T1555 C130 P23877 oash.SnapPuller$FileFetcher.fetchPackets WARNING No content recieved for file: {name=_0_MockVariableIntBlock_0.pyl, lastmodified=1347716823000, size=0}
[junit4:junit4]   2> 11860 T1525 C131 P43302 REQ /replication {file=_0_MockVariableIntBlock_0.tib&command=filecontent&checksum=true&generation=2&qt=/replication&wt=filestream} status=0 QTime=0 
[junit4:junit4]   2> 11867 T1525 C131 P43302 REQ /replication {file=_0_Pulsing40_0.tip&command=filecontent&checksum=true&generation=2&qt=/replication&wt=filestream} status=0 QTime=0 
[junit4:junit4]   2> 11874 T1525 C131 P43302 REQ /replication {file=_0_MockVariableIntBlock_0.pos&command=filecontent&checksum=true&generation=2&qt=/replication&wt=filestream} status=0 QTime=0 
[junit4:junit4]   2> 11878 T1525 C131 P43302 REQ /replication {file=_0.si&command=filecontent&checksum=true&generation=2&qt=/replication&wt=filestream} status=0 QTime=0 
[junit4:junit4]   2> 11882 T1525 C131 P43302 REQ /replication {file=_0_MockVariableIntBlock_0.tii&command=filecontent&checksum=true&generation=2&qt=/replication&wt=filestream} status=0 QTime=0 
[junit4:junit4]   2> 11886 T1525 C131 P43302 REQ /replication {file=_0_Pulsing40_0.tim&command=filecontent&checksum=true&generation=2&qt=/replication&wt=filestream} status=0 QTime=0 
[junit4:junit4]   2> 11890 T1525 C131 P43302 REQ /replication {file=_0_Block_0.doc&command=filecontent&checksum=true&generation=2&qt=/replication&wt=filestream} status=0 QTime=0 
[junit4:junit4]   2> 11894 T1525 C131 P43302 REQ /replication {file=_0.fnm&command=filecontent&checksum=true&generation=2&qt=/replication&wt=filestream} status=0 QTime=0 
[junit4:junit4]   2> 11898 T1525 C131 P43302 REQ /replication {file=_0_NestedPulsing_0.frq&command=filecontent&checksum=true&generation=2&qt=/replication&wt=filestream} status=0 QTime=0 
[junit4:junit4]   2> 11902 T1525 C131 P43302 REQ /replication {file=_0_nrm.cfs&command=filecontent&checksum=true&generation=2&qt=/replication&wt=filestream} status=0 QTime=0 
[junit4:junit4]   2> 11906 T1525 C131 P43302 REQ /replication {file=_0_NestedPulsing_0.prx&command=filecontent&checksum=true&generation=2&qt=/replication&wt=filestream} status=0 QTime=0 
[junit4:junit4]   2> 11911 T1525 C131 P43302 REQ /replication {file=_0_MockVariableIntBlock_0.frq&command=filecontent&checksum=true&generation=2&qt=/replication&wt=filestream} status=0 QTime=0 
[junit4:junit4]   2> 11915 T1525 C131 P43302 REQ /replication {file=_0_nrm.cfe&command=filecontent&checksum=true&generation=2&qt=/replication&wt=filestream} status=0 QTime=0 
[junit4:junit4]   2> 11919 T1525 C131 P43302 REQ /replication {file=segments_2&command=filecontent&checksum=true&generation=2&qt=/replication&wt=filestream} status=0 QTime=0 
[junit4:junit4]   2> 11923 T1525 C131 P43302 REQ /replication {file=_0.fdx&command=filecontent&checksum=true&generation=2&qt=/replication&wt=filestream} status=0 QTime=0 
[junit4:junit4]   2> 11927 T1525 C131 P43302 REQ /replication {file=_0.fdt&command=filecontent&checksum=true&generation=2&qt=/replication&wt=filestream} status=0 QTime=0 
[junit4:junit4]   2> 11928 T1555 C130 P23877 oash.SnapPuller.fetchLatestIndex Total time taken for download : 0 secs
[junit4:junit4]   2> 11929 T1555 C130 P23877 oash.SnapPuller.modifyIndexProps New index installed. Updating index properties... index=index.20120915074703192
[junit4:junit4]   2> 11930 T1555 C130 P23877 oasu.DefaultSolrCoreState.newIndexWriter Creating new IndexWriter...
[junit4:junit4]   2> 11931 T1555 C130 P23877 oasu.DefaultSolrCoreState.newIndexWriter Waiting until IndexWriter is unused... core=collection1
[junit4:junit4]   2> 11931 T1555 C130 P23877 oasu.DefaultSolrCoreState.newIndexWriter Rollback old IndexWriter... core=collection1
[junit4:junit4]   2> 11936 T1555 C130 P23877 oasc.SolrCore.getNewIndexDir WARNING New index directory detected: old=./org.apache.solr.cloud.BasicDistributedZk2Test-1347716811396/jetty3/index/ new=./org.apache.solr.cloud.BasicDistributedZk2Test-1347716811396/jetty3/index.20120915074703192
[junit4:junit4]   2> 11937 T1555 C130 P23877 oasc.CachingDirectoryFactory.get return new directory for /usr/home/hudson/hudson-slave/workspace/Lucene-Solr-Tests-4.x-java7/solr/build/solr-core/test/J1/./org.apache.solr.cloud.BasicDistributedZk2Test-1347716811396/jetty3/index.20120915074703192 forceNew:true
[junit4:junit4]   2> 11950 T1555 C130 P23877 oasc.SolrDeletionPolicy.onInit SolrDeletionPolicy.onInit: commits:num=1
[junit4:junit4]   2> 		commit{dir=NRTCachingDirectory(org.apache.lucene.store.NIOFSDirectory@/usr/home/hudson/hudson-slave/workspace/Lucene-Solr-Tests-4.x-java7/solr/build/solr-core/test/J1/org.apache.solr.cloud.BasicDistributedZk2Test-1347716811396/jetty3/index.20120915074703192 lockFactory=org.apache.lucene.store.NativeFSLockFactory@5239329e; maxCacheMB=48.0 maxMergeSizeMB=4.0),segFN=segments_2,generation=2,filenames=[_0_Block_0.pos, _0_Block_0.tip, _0_Block_0.tim, _0_MockVariableIntBlock_0.doc, _0_MockVariableIntBlock_0.skp, _0_NestedPulsing_0.tip, _0_Pulsing40_0.prx, _0_Pulsing40_0.frq, _0_NestedPulsing_0.tim, _0_MockVariableIntBlock_0.pyl, _0_MockVariableIntBlock_0.tib, _0_MockVariableIntBlock_0.pos, _0_Pulsing40_0.tip, _0.si, _0_MockVariableIntBlock_0.tii, _0.fnm, _0_Block_0.doc, _0_Pulsing40_0.tim, _0_NestedPulsing_0.frq, _0_nrm.cfs, _0_NestedPulsing_0.prx, _0_nrm.cfe, _0_MockVariableIntBlock_0.frq, segments_2, _0.fdx, _0.fdt]
[junit4:junit4]   2> 11951 T1555 C130 P23877 oasc.SolrDeletionPolicy.updateCommits newest commit = 2
[junit4:junit4]   2> 11951 T1555 C130 P23877 oasu.DefaultSolrCoreState.newIndexWriter New IndexWriter is ready to be used.
[junit4:junit4]   2> 11955 T1555 C130 P23877 oass.SolrIndexSearcher.<init> Opening Searcher@2aaf5586 main
[junit4:junit4]   2> 11957 T1554 oasc.SolrCore.registerSearcher [collection1] Registered new searcher Searcher@2aaf5586 main{StandardDirectoryReader(segments_2:3:nrt _0(4.0.0.2):C1)}
[junit4:junit4]   2> 11958 T1554 oasc.CachingDirectoryFactory.close Closing directory:/usr/home/hudson/hudson-slave/workspace/Lucene-Solr-Tests-4.x-java7/solr/build/solr-core/test/J1/./org.apache.solr.cloud.BasicDistributedZk2Test-1347716811396/jetty3/index
[junit4:junit4]   2> 11958 T1554 oash.SnapPuller$2.onClose removing old index directory ./org.apache.solr.cloud.BasicDistributedZk2Test-1347716811396/jetty3/index
[junit4:junit4]   2> 11960 T1555 C130 P23877 oasu.DirectUpdateHandler2.commit start commit{flags=0,_version_=0,optimize=false,openSearcher=true,waitSearcher=true,expungeDeletes=false,softCommit=false}
[junit4:junit4]   2> 11962 T1555 C130 P23877 oass.SolrIndexSearcher.<init> Opening Searcher@4c113aa1 main
[junit4:junit4]   2> 11962 T1555 C130 P23877 oasu.DirectUpdateHandler2.commit end_commit_flush
[junit4:junit4]   2> 11963 T1554 oasc.SolrCore.registerSearcher [collection1] Registered new searcher Searcher@4c113aa1 main{StandardDirectoryReader(segments_2:3:nrt _0(4.0.0.2):C1)}
[junit4:junit4]   2> 11964 T1555 C130 P23877 oasc.RecoveryStrategy.replay Replaying buffered documents. core=collection1
[junit4:junit4]   2> 11964 T1577 C130 P23877 oasu.UpdateLog$LogReplayer.doReplay WARNING Starting log replay tlog{file=./org.apache.solr.cloud.BasicDistributedZk2Test-1347716811396/jetty3/tlog/tlog.0000000000000000000 refcount=2} active=true starting pos=426
[junit4:junit4]   2> 11965 T1577 C130 P23877 oasu.DirectUpdateHandler2.commit start commit{flags=2,_version_=0,optimize=false,openSearcher=true,waitSearcher=true,expungeDeletes=false,softCommit=false}
[junit4:junit4]   2> 11966 T1577 C130 P23877 oass.SolrIndexSearcher.<init> Opening Searcher@2c4ff53 main
[junit4:junit4]   2> 11967 T1577 C130 P23877 oasu.DirectUpdateHandler2.commit end_commit_flush
[junit4:junit4]   2> 11968 T1554 oasc.SolrCore.registerSearcher [collection1] Registered new searcher Searcher@2c4ff53 main{StandardDirectoryReader(segments_2:3:nrt _0(4.0.0.2):C1)}
[junit4:junit4]   2> 11969 T1577 C130 P23877 oasu.UpdateLog$LogReplayer.run WARNING Log replay finished. recoveryInfo=RecoveryInfo{adds=0 deletes=0 deleteByQuery=0 errors=0 positionOfStart=426}
[junit4:junit4]   2> 11969 T1555 C130 P23877 oasc.RecoveryStrategy.doRecovery Replication Recovery was successful - registering as Active. core=collection1
[junit4:junit4]   2> 11971 T1555 C130 P23877 oasc.RecoveryStrategy.doRecovery Finished recovery process. core=collection1
[junit4:junit4]   2> 12267 T1495 oascc.ZkStateReader.updateClusterState Updating cloud state from ZooKeeper... 
[junit4:junit4]   2> 12437 T1516 oascc.ZkStateReader.updateClusterState Updating cloud state from ZooKeeper... 
[junit4:junit4]   2> 12451 T1567 oascc.ZkStateReader$2.process A cluster state change has occurred - updating...
[junit4:junit4]   2> 12451 T1553 oascc.ZkStateReader$2.process A cluster state change has occurred - updating...
[junit4:junit4]   2> 12451 T1572 oascc.ZkStateReader$2.process A cluster state change has occurred - updating...
[junit4:junit4]   2> 12451 T1515 oascc.ZkStateReader$2.process A cluster state change has occurred - updating...
[junit4:junit4]   2> 12451 T1541 oascc.ZkStateReader$2.process A cluster state change has occurred - updating...
[junit4:junit4]   2> 12451 T1574 oascc.ZkStateReader$2.process A cluster state change has occurred - updating...
[junit4:junit4]   2> 12451 T1529 oascc.ZkStateReader$2.process A cluster state change has occurred - updating...
[junit4:junit4]   2>  C132_STATE=coll:collection1 core:collection1 props:{shard=shard2, roles=null, state=recovering, core=collection1, collection=collection1, node_name=127.0.0.1:52489_solr, base_url=http://127.0.0.1:52489/solr}
[junit4:junit4]   2> 13200 T1569 C132 P52489 oasc.RecoveryStrategy.doRecovery Begin buffering updates. core=collection1
[junit4:junit4]   2> 13200 T1569 C132 P52489 oasu.UpdateLog.bufferUpdates Starting to buffer updates. FSUpdateLog{state=ACTIVE, tlog=null}
[junit4:junit4]   2> 13200 T1569 C132 P52489 oasc.RecoveryStrategy.replicate Attempting to replicate from http://127.0.0.1:64103/solr/collection1/. core=collection1
[junit4:junit4]   2> 13200 T1569 C132 P52489 oascsi.HttpClientUtil.createClient Creating new http client, config:maxConnections=128&maxConnectionsPerHost=32&followRedirects=false
[junit4:junit4]   2> 13210 T1535 C133 P64103 oasu.DirectUpdateHandler2.commit start commit{flags=0,_version_=0,optimize=false,openSearcher=true,waitSearcher=true,expungeDeletes=false,softCommit=false}
[junit4:junit4]   2> 13214 T1535 C133 P64103 oasc.SolrDeletionPolicy.onInit SolrDeletionPolicy.onInit: commits:num=1
[junit4:junit4]   2> 		commit{dir=NRTCachingDirectory(org.apache.lucene.store.NIOFSDirectory@/usr/home/hudson/hudson-slave/workspace/Lucene-Solr-Tests-4.x-java7/solr/build/solr-core/test/J1/org.apache.solr.cloud.BasicDistributedZk2Test-1347716811396/jetty2/index lockFactory=org.apache.lucene.store.NativeFSLockFactory@1a80e9b7; maxCacheMB=48.0 maxMergeSizeMB=4.0),segFN=segments_1,generation=1,filenames=[segments_1]
[junit4:junit4]   2> 13214 T1535 C133 P64103 oasc.SolrDeletionPolicy.updateCommits newest commit = 1
[junit4:junit4]   2> 13215 T1535 C133 P64103 oass.SolrIndexSearcher.<init> Opening Searcher@2419ae47 main
[junit4:junit4]   2> 13215 T1535 C133 P64103 oasu.DirectUpdateHandler2.commit end_commit_flush
[junit4:junit4]   2> 13217 T1542 oasc.SolrCore.registerSearcher [collection1] Registered new searcher Searcher@2419ae47 main{StandardDirectoryReader(segments_1:1)}
[junit4:junit4]   2> 13218 T1535 C133 P64103 /update {waitSearcher=true&commit=true&commit_end_point=true&wt=javabin&softCommit=false&version=2} {commit=} 0 8
[junit4:junit4]   2> 13219 T1569 C132 P52489 oash.ReplicationHandler.inform Commits will be reserved for  10000
[junit4:junit4]   2> 13219 T1569 C132 P52489 oash.SnapPuller.<init>  No value set for 'pollInterval'. Timer Task not started.
[junit4:junit4]   2> 13220 T1536 C133 P64103 oash.ReplicationHandler.inform Commits will be reserved for  10000
[junit4:junit4]   2> 13221 T1536 C133 P64103 REQ /replication {command=indexversion&wt=javabin&qt=/replication&version=2} status=0 QTime=1 
[junit4:junit4]   2> 13224 T1569 C132 P52489 oasc.SolrDeletionPolicy.onInit SolrDeletionPolicy.onInit: commits:num=1
[junit4:junit4]   2> 		commit{dir=NRTCachingDirectory(org.apache.lucene.store.NIOFSDirectory@/usr/home/hudson/hudson-slave/workspace/Lucene-Solr-Tests-4.x-java7/solr/build/solr-core/test/J1/org.apache.solr.cloud.BasicDistributedZk2Test-1347716811396/jetty4/index lockFactory=org.apache.lucene.store.NativeFSLockFactory@251dcf2d; maxCacheMB=48.0 maxMergeSizeMB=4.0),segFN=segments_1,generation=1,filenames=[segments_1]
[junit4:junit4]   2> 13224 T1569 C132 P52489 oasc.SolrDeletionPolicy.updateCommits newest commit = 1
[junit4:junit4]   2> 13225 T1569 C132 P52489 oasu.DirectUpdateHandler2.commit start commit{flags=0,_version_=0,optimize=false,openSearcher=true,waitSearcher=true,expungeDeletes=false,softCommit=false}
[junit4:junit4]   2> 13228 T1569 C132 P52489 oasc.SolrDeletionPolicy.onCommit SolrDeletionPolicy.onCommit: commits:num=2
[junit4:junit4]   2> 		commit{dir=NRTCachingDirectory(org.apache.lucene.store.NIOFSDirectory@/usr/home/hudson/hudson-slave/workspace/Lucene-Solr-Tests-4.x-java7/solr/build/solr-core/test/J1/org.apache.solr.cloud.BasicDistributedZk2Test-1347716811396/jetty4/index lockFactory=org.apache.lucene.store.NativeFSLockFactory@251dcf2d; maxCacheMB=48.0 maxMergeSizeMB=4.0),segFN=segments_1,generation=1,filenames=[segments_1]
[junit4:junit4]   2> 		commit{dir=NRTCachingDirectory(org.apache.lucene.store.NIOFSDirectory@/usr/home/hudson/hudson-slave/workspace/Lucene-Solr-Tests-4.x-java7/solr/build/solr-core/test/J1/org.apache.solr.cloud.BasicDistributedZk2Test-1347716811396/jetty4/index lockFactory=org.apache.lucene.store.NativeFSLockFactory@251dcf2d; maxCacheMB=48.0 maxMergeSizeMB=4.0),segFN=segments_2,generation=2,filenames=[segments_2]
[junit4:junit4]   2> 13228 T1569 C132 P52489 oasc.SolrDeletionPolicy.updateCommits newest commit = 2
[junit4:junit4]   2> 13230 T1569 C132 P52489 oass.SolrIndexSearcher.<init> Opening Searcher@740a2a7f main
[junit4:junit4]   2> 13230 T1569 C132 P52489 oasu.DirectUpdateHandler2.commit end_commit_flush
[junit4:junit4]   2> 13232 T1568 oasc.SolrCore.registerSearcher [collection1] Registered new searcher Searcher@740a2a7f main{StandardDirectoryReader(segments_2:2)}
[junit4:junit4]   2> 13233 T1569 C132 P52489 oasc.RecoveryStrategy.replay No replay needed. core=collection1
[junit4:junit4]   2> 13233 T1569 C132 P52489 oasc.RecoveryStrategy.doRecovery Replication Recovery was successful - registering as Active. core=collection1
[junit4:junit4]   2> 13235 T1569 C132 P52489 oasc.RecoveryStrategy.doRecovery Finished recovery process. core=collection1
[junit4:junit4]   2> 13270 T1495 oascc.ZkStateReader.updateClusterState Updating cloud state from ZooKeeper... 
[junit4:junit4]   2> 13458 T1516 oascc.ZkStateReader.updateClusterState Updating cloud state from ZooKeeper... 
[junit4:junit4]   2> 13463 T1567 oascc.ZkStateReader$2.process A cluster state change has occurred - updating...
[junit4:junit4]   2> 13463 T1515 oascc.ZkStateReader$2.process A cluster state change has occurred - updating...
[junit4:junit4]   2> 13463 T1574 oascc.ZkStateReader$2.process A cluster state change has occurred - updating...
[junit4:junit4]   2> 13463 T1572 oascc.ZkStateReader$2.process A cluster state change has occurred - updating...
[junit4:junit4]   2> 13463 T1541 oascc.ZkStateReader$2.process A cluster state change has occurred - updating...
[junit4:junit4]   2> 13463 T1553 oascc.ZkStateReader$2.process A cluster state change has occurred - updating...
[junit4:junit4]   2> 13463 T1529 oascc.ZkStateReader$2.process A cluster state change has occurred - updating...
[junit4:junit4]   2> 14272 T1495 oascc.ZkStateReader.updateClusterState Updating cloud state from ZooKeeper... 
[junit4:junit4]   2> 14276 T1507 C134 P10684 oasu.DirectUpdateHandler2.commit start commit{flags=0,_version_=0,optimize=false,openSearcher=true,waitSearcher=true,expungeDeletes=false,softCommit=false}
[junit4:junit4]   2> 14414 T1507 C134 P10684 oasc.SolrDeletionPolicy.onCommit SolrDeletionPolicy.onCommit: commits:num=2
[junit4:junit4]   2> 		commit{dir=NRTCachingDirectory(org.apache.lucene.store.NIOFSDirectory@/usr/home/hudson/hudson-slave/workspace/Lucene-Solr-Tests-4.x-java7/solr/build/solr-core/test/J1/org.apache.solr.cloud.BasicDistributedZk2Test-1347716811396/control/data/index lockFactory=org.apache.lucene.store.NativeFSLockFactory@f7632e7; maxCacheMB=48.0 maxMergeSizeMB=4.0),segFN=segments_1,generation=1,filenames=[segments_1]
[junit4:junit4]   2> 		commit{dir=NRTCachingDirectory(org.apache.lucene.store.NIOFSDirectory@/usr/home/hudson/hudson-slave/workspace/Lucene-Solr-Tests-4.x-java7/solr/build/solr-core/test/J1/org.apache.solr.cloud.BasicDistributedZk2Test-1347716811396/control/data/index lockFactory=org.apache.lucene.store.NativeFSLockFactory@f7632e7; maxCacheMB=48.0 maxMergeSizeMB=4.0),segFN=segments_2,generation=2,filenames=[_0_Block_0.tip, _0_Block_0.pos, _0_MockVariableIntBlock_0.doc, _0_Block_0.tim, _0_MockVariableIntBlock_0.skp, _0_Pulsing40_0.prx, _0_NestedPulsing_0.tip, _0_Pulsing40_0.frq, _0_NestedPulsing_0.tim, _0_MockVariableIntBlock_0.pyl, _0_MockVariableIntBlock_0.tib, _0_MockVariableIntBlock_0.pos, _0_Pulsing40_0.tip, _0.si, _0_MockVariableIntBlock_0.tii, _0.fnm, _0_Block_0.doc, _0_Pulsing40_0.tim, _0_NestedPulsing_0.frq, _0_nrm.cfs, _0_NestedPulsing_0.prx, _0_nrm.cfe, _0_MockVariableIntBlock_0.frq, segments_2, _0.fdx, _0.fdt]
[junit4:junit4]   2> 14415 T1507 C134 P10684 oasc.SolrDeletionPolicy.updateCommits newest commit = 2
[junit4:junit4]   2> 14431 T1507 C134 P10684 oass.SolrIndexSearcher.<init> Opening Searcher@52b9cad4 main
[junit4:junit4]   2> 14432 T1507 C134 P10684 oasu.DirectUpdateHandler2.commit end_commit_flush
[junit4:junit4]   2> 14433 T1518 oasc.SolrCore.registerSearcher [collection1] Registered new searcher Searcher@52b9cad4 main{StandardDirectoryReader(segments_2:3 _0(4.0.0.2):C1)}
[junit4:junit4]   2> 14434 T1507 C134 P10684 /update {waitSearcher=true&wt=javabin&commit=true&softCommit=false&version=2} {commit=} 0 158
[junit4:junit4]   2> 14435 T1523 C131 P43302 oasu.DirectUpdateHandler2.commit start commit{flags=0,_version_=0,optimize=false,openSearcher=true,waitSearcher=true,expungeDeletes=false,softCommit=false}
[junit4:junit4]   2> 14449 T1523 C131 P43302 oass.SolrIndexSearcher.<init> Opening Searcher@20fd6122 main
[junit4:junit4]   2> 14450 T1523 C131 P43302 oasu.DirectUpdateHandler2.commit end_commit_flush
[junit4:junit4]   2> 14452 T1530 oasc.SolrCore.registerSearcher [collection1] Registered new searcher Searcher@20fd6122 main{StandardDirectoryReader(segments_2:3 _0(4.0.0.2):C1)}
[junit4:junit4]   2> 14452 T1523 C131 P43302 oasu.SolrCmdDistributor.distribCommit Distrib commit to:[StdNode: http://127.0.0.1:23877/solr/collection1/, StdNode: http://127.0.0.1:64103/solr/collection1/, StdNode: http://127.0.0.1:52489/solr/collection1/]
[junit4:junit4]   2> 14455 T1537 C133 P64103 oasu.DirectUpdateHandler2.commit start commit{flags=0,_version_=0,optimize=false,openSearcher=true,waitSearcher=true,expungeDeletes=false,softCommit=false}
[junit4:junit4]   2>  C130_STATE=coll:collection1 core:collection1 props:{shard=shard1, roles=null, state=active, core=collection1, collection=collection1, node_name=127.0.0.1:23877_solr, base_url=http://127.0.0.1:23877/solr}
[junit4:junit4]   2> 14455 T1545 C130 P23877 oasu.DirectUpdateHandler2.commit start commit{flags=0,_version_=0,optimize=false,openSearcher=true,waitSearcher=true,expungeDeletes=false,softCommit=false}
[junit4:junit4]   2> 14459 T1545 C130 P23877 oass.SolrIndexSearcher.<init> Opening Searcher@7699f4ec main
[junit4:junit4]   2> 14460 T1545 C130 P23877 oasu.DirectUpdateHandler2.commit end_commit_flush
[junit4:junit4]   2> 14461 T1537 C133 P64103 oass.SolrIndexSearcher.<init> Opening Searcher@154ec8cc main
[junit4:junit4]   2> 14461 T1554 oasc.SolrCore.registerSearcher [collection1] Registered new searcher Searcher@7699f4ec main{StandardDirectoryReader(segments_2:3:nrt _0(4.0.0.2):C1)}
[junit4:junit4]   2> 14461 T1537 C133 P64103 oasu.DirectUpdateHandler2.commit end_commit_flush
[junit4:junit4]   2> 14462 T1545 C130 P23877 /update {waitSearcher=true&commit=true&wt=javabin&commit_end_point=true&expungeDeletes=false&softCommit=false&version=2} {commit=} 0 7
[junit4:junit4]   2> 14463 T1542 oasc.SolrCore.registerSearcher [collection1] Registered new searcher Searcher@154ec8cc main{StandardDirectoryReader(segments_1:1)}
[junit4:junit4]   2> 14463 T1537 C133 P64103 /update {waitSearcher=true&commit=true&wt=javabin&commit_end_point=true&expungeDeletes=false&softCommit=false&version=2} {commit=} 0 9
[junit4:junit4]   2>  C132_STATE=coll:collection1 core:collection1 props:{shard=shard2, roles=null, state=active, core=collection1, collection=collection1, node_name=127.0.0.1:52489_solr, base_url=http://127.0.0.1:52489/solr}
[junit4:junit4]   2> 14466 T1559 C132 P52489 oasu.DirectUpdateHandler2.commit start commit{flags=0,_version_=0,optimize=false,openSearcher=true,waitSearcher=true,expungeDeletes=false,softCommit=false}
[junit4:junit4]   2> 14470 T1559 C132 P52489 oass.SolrIndexSearcher.<init> Opening Searcher@3a996bbc main
[junit4:junit4]   2> 14471 T1559 C132 P52489 oasu.DirectUpdateHandler2.commit end_commit_flush
[junit4:junit4]   2> 14472 T1568 oasc.SolrCore.registerSearcher [collection1] Registered new searcher Searcher@3a996bbc main{StandardDirectoryReader(segments_2:2)}
[junit4:junit4]   2> 14472 T1559 C132 P52489 /update {waitSearcher=true&commit=true&wt=javabin&commit_end_point=true&expungeDeletes=false&softCommit=false&version=2} {commit=} 0 6
[junit4:junit4]   2> 14473 T1523 C131 P43302 /update {waitSearcher=true&wt=javabin&commit=true&softCommit=false&version=2} {commit=} 0 38
[junit4:junit4]   2> 14479 T1508 C134 P10684 REQ /select {fl=id,score&shard.url=127.0.0.1:10684/solr/collection1/&NOW=1347716825867&start=0&q=*:*&distrib=false&isShard=true&wt=javabin&fsv=true&rows=10&version=2} hits=1 status=0 QTime=0 
[junit4:junit4]   2> 14482 T1508 C134 P10684 REQ /select {shard.url=127.0.0.1:10684/solr/collection1/&NOW=1347716825867&q=*:*&ids=1&distrib=false&isShard=true&wt=javabin&version=2} status=0 QTime=0 
[junit4:junit4]   2> 14483 T1507 C134 P10684 REQ /select {wt=javabin&q=*:*&version=2} hits=1 status=0 QTime=7 
[junit4:junit4]   2> 14484 T1495 oaz.ZooKeeper.<init> Initiating client connection, connectString=127.0.0.1:15224/solr sessionTimeout=10000 watcher=org.apache.solr.common.cloud.ConnectionManager@5ff19172
[junit4:junit4]   2> 14486 T1581 oaz.ClientCnxn$SendThread.startConnect Opening socket connection to server /127.0.0.1:15224
[junit4:junit4]   2> 14486 T1495 oascc.ConnectionManager.waitForConnected Waiting for client to connect to ZooKeeper
[junit4:junit4]   2> 14487 T1581 oaz.ClientCnxn$SendThread.primeConnection Socket connection established to localhost/127.0.0.1:15224, initiating session
[junit4:junit4]   2> 14487 T1497 oazs.NIOServerCnxn$Factory.run Accepted socket connection from /140.211.11.196:50005
[junit4:junit4]   2> 14487 T1497 oazs.NIOServerCnxn.readConnectRequest Client attempting to establish new session at /140.211.11.196:50005
[junit4:junit4]   2> 14489 T1499 oazs.NIOServerCnxn.finishSessionInit Established session 0x139ca2e8a8b0009 with negotiated timeout 10000 for client /140.211.11.196:50005
[junit4:junit4]   2> 14490 T1581 oaz.ClientCnxn$SendThread.readConnectResult Session establishment complete on server localhost/127.0.0.1:15224, sessionid = 0x139ca2e8a8b0009, negotiated timeout = 10000
[junit4:junit4]   2> 14490 T1582 oascc.ConnectionManager.process Watcher org.apache.solr.common.cloud.ConnectionManager@5ff19172 name:ZooKeeperConnection Watcher:127.0.0.1:15224/solr got event WatchedEvent state:SyncConnected type:None path:null path:null type:None
[junit4:junit4]   2> 14490 T1495 oascc.ConnectionManager.waitForConnected Client is connected to ZooKeeper
[junit4:junit4]   2> 14492 T1495 oascc.ZkStateReader.createClusterStateWatchersAndUpdate Updating cluster state from ZooKeeper... 
[junit4:junit4]   2> 14494 T1500 oazs.PrepRequestProcessor.pRequest Processed session termination for sessionid: 0x139ca2e8a8b0009
[junit4:junit4]   2> 14502 T1582 oaz.ClientCnxn$EventThread.run EventThread shut down
[junit4:junit4]   2> 14502 T1497 oazs.NIOServerCnxn.closeSock Closed socket connection for client /140.211.11.196:50005 which had sessionid 0x139ca2e8a8b0009
[junit4:junit4]   2> 14502 T1495 oaz.ZooKeeper.close Session: 0x139ca2e8a8b0009 closed
[junit4:junit4]   2> 14504 T1526 C131 P43302 REQ /select {distrib=false&wt=javabin&q=*:*&version=2} hits=1 status=0 QTime=0 
[junit4:junit4]   2> 14506 T1538 C133 P64103 REQ /select {distrib=false&wt=javabin&q=*:*&version=2} hits=0 status=0 QTime=0 
[junit4:junit4]   2> 14511 T1546 C130 P23877 REQ /select {fl=id,score&shard.url=127.0.0.1:43302/solr/collection1/|127.0.0.1:23877/solr/collection1/&NOW=1347716825899&start=0&q=*:*&distrib=false&isShard=true&wt=javabin&fsv=true&rows=10&version=2} hits=1 status=0 QTime=1 
[junit4:junit4]   2> 14511 T1561 C132 P52489 REQ /select {fl=id,score&shard.url=127.0.0.1:64103/solr/collection1/|127.0.0.1:52489/solr/collection1/&NOW=1347716825899&start=0&q=*:*&distrib=false&isShard=true&wt=javabin&fsv=true&rows=10&version=2} hits=0 status=0 QTime=1 
[junit4:junit4]   2> 14514 T1546 C130 P23877 REQ /select {shard.url=127.0.0.1:43302/solr/collection1/|127.0.0.1:23877/solr/collection1/&NOW=1347716825899&q=*:*&ids=1&distrib=false&isShard=true&wt=javabin&version=2} status=0 QTime=0 
[junit4:junit4]   2> 14515 T1560 C132 P52489 REQ /select {wt=javabin&q=*:*&version=2} hits=1 status=0 QTime=7 
[junit4:junit4]   2> 14521 T1507 C134 P10684 /update {wt=javabin&version=2} {add=[2 (1413183518444355584)]} 0 3
[junit4:junit4]   2> 14535 T1559 C132 P52489 REQ /update {update.distrib=FROMLEADER&distrib.from=http://127.0.0.1:64103/solr/collection1/&wt=javabin&version=2} status=0 QTime=3 
[junit4:junit4]   2> 14536 T1537 C133 P64103 REQ /update {distrib.from=http://127.0.0.1:43302/solr/collection1/&update.distrib=TOLEADER&wt=javabin&version=2} status=0 QTime=10 
[junit4:junit4]   2> 14536 T1523 C131 P43302 /update {wt=javabin&version=2} {add=[2]} 0 12
[junit4:junit4]   2> 14540 T1507 C134 P10684 /update {wt=javabin&version=2} {add=[3 (1413183518466375680)]} 0 1
[junit4:junit4]   2> 14549 T1559 C132 P52489 REQ /update {update.distrib=FROMLEADER&distrib.from=http://127.0.0.1:64103/solr/collection1/&wt=javabin&version=2} status=0 QTime=1 
[junit4:junit4]   2> 14549 T1537 C133 P64103 REQ /update {distrib.from=http://127.0.0.1:43302/solr/collection1/&update.distrib=TOLEADER&wt=javabin&version=2} status=0 QTime=4 
[junit4:junit4]   2> 14550 T1523 C131 P43302 /update {wt=javabin&version=2} {add=[3]} 0 7
[junit4:junit4]   2> 14554 T1507 C134 P10684 /update {wt=javabin&version=2} {add=[4 (1413183518481055744)]} 0 1
[junit4:junit4]   2> 14566 T1545 C130 P23877 REQ /update {distrib.from=http://127.0.0.1:43302/solr/collection1/&update.distrib=FROMLEADER&wt=javabin&version=2} status=0 QTime=3 
[junit4:junit4]   2> 14567 T1523 C131 P43302 /update {wt=javabin&version=2} {add=[4 (1413183518486298624)]} 0 9
[junit4:junit4]   2> 14570 T1507 C134 P10684 /update {wt=javabin&version=2} {add=[5 (1413183518497832960)]} 0 1
[junit4:junit4]   2> 14579 T1559 C132 P52489 REQ /update {update.distrib=FROMLEADER&distrib.from=http://127.0.0.1:64103/solr/collection1/&wt=javabin&version=2} status=0 QTime=1 
[junit4:junit4]   2> 14579 T1537 C133 P64103 REQ /update {distrib.from=http://127.0.0.1:43302/solr/collection1/&update.distrib=TOLEADER&wt=javabin&version=2} status=0 QTime=4 
[junit4:junit4]   2> 14580 T1523 C131 P43302 /update {wt=javabin&version=2} {add=[5]} 0 7
[junit4:junit4]   2> 14584 T1507 C134 P10684 /update {wt=javabin&version=2} {add=[6 (1413183518512513024)]} 0 1
[junit4:junit4]   2> 14592 T1559 C132 P52489 REQ /update {update.distrib=FROMLEADER&distrib.from=http://127.0.0.1:64103/solr/collection1/&wt=javabin&version=2} status=0 QTime=1 
[junit4:junit4]   2> 14592 T1537 C133 P64103 REQ /update {distrib.from=http://127.0.0.1:43302/solr/collection1/&update.distrib=TOLEADER&wt=javabin&version=2} status=0 QTime=4 
[junit4:junit4]   2> 14593 T1523 C131 P43302 /update {wt=javabin&version=2} {add=[6]} 0 7
[junit4:junit4]   2> 14597 T1507 C134 P10684 /update {wt=javabin&version=2} {add=[7 (1413183518526144512)]} 0 1
[junit4:junit4]   2> 14603 T1559 C132 P52489 REQ /update {distrib.from=http://127.0.0.1:64103/solr/collection1/&update.distrib=FROMLEADER&wt=javabin&version=2} status=0 QTime=1 
[junit4:junit4]   2> 14603 T1539 C133 P64103 /update {wt=javabin&version=2} {add=[7 (1413183518529290240)]} 0 5
[junit4:junit4]   2> 14607 T1507 C134 P10684 /update {wt=javabin&version=2} {add=[8 (1413183518536630272)]} 0 1
[junit4:junit4]   2> 14614 T1545 C130 P23877 REQ /update {distrib.from=http://127.0.0.1:43302/solr/collection1/&update.distrib=FROMLEADER&wt=javabin&version=2} status=0 QTime=1 
[junit4:junit4]   2> 14615 T1523 C131 P43302 /update {wt=javabin&version=2} {add=[8 (1413183518540824576)]} 0 5
[junit4:junit4]   2> 14619 T1507 C134 P10684 /update {wt=javabin&version=2} {add=[9 (1413183518549213184)]} 0 1
[junit4:junit4]   2> 14628 T1559 C132 P52489 REQ /update {update.distrib=FROMLEADER&distrib.from=http://127.0.0.1:64103/solr/collection1/&wt=javabin&version=2} status=0 QTime=1 
[junit4:junit4]   2> 14628 T1537 C133 P64103 REQ /update {distrib.from=http://127.0.0.1:43302/solr/collection1/&update.distrib=TOLEADER&wt=javabin&version=2} status=0 QTime=4 
[junit4:junit4]   2> 14629 T1523 C131 P43302 /update {wt=javabin&version=2} {add=[9]} 0 7
[junit4:junit4]   2> 14632 T1507 C134 P10684 /update {wt=javabin&version=2} {add=[10 (1413183518562844672)]} 0 1
[junit4:junit4]   2> 14639 T1545 C130 P23877 REQ /update {distrib.from=http://127.0.0.1:43302/solr/collection1/&update.distrib=FROMLEADER&wt=javabin&version=2} status=0 QTime=1 
[junit4:junit4]   2> 14639 T1523 C131 P43302 /update {wt=javabin&version=2} {add=[10 (1413183518567038976)]} 0 4
[junit4:junit4]   2> 14654 T1507 C134 P10684 /update {wt=javabin&version=2} {add=[11 (1413183518574379008)]} 0 12
[junit4:junit4]   2> 14661 T1545 C130 P23877 REQ /update {distrib.from=http://127.0.0.1:43302/solr/collection1/&update.distrib=FROMLEADER&wt=javabin&version=2} status=0 QTime=1 
[junit4:junit4]   2> 14661 T1523 C131 P43302 /update {wt=javabin&version=2} {add=[11 (1413183518590107648)]} 0 4
[junit4:junit4]   2> 14666 T1507 C134 P10684 /update {wt=javabin&version=2} {add=[12 (1413183518597447680)]} 0 2
[junit4:junit4]   2> 14675 T1545 C130 P23877 REQ /update {update.distrib=FROMLEADER&distrib.from=http://127.0.0.1:43302/solr/collection1/&wt=javabin&version=2} status=0 QTime=1 
[junit4:junit4]   2> 14675 T1527 C131 P43302 REQ /update {distrib.from=http://127.0.0.1:64103/solr/collection1/&update.distrib=TOLEADER&wt=javabin&version=2} status=0 QTime=5 
[junit4:junit4]   2> 14676 T1539 C133 P64103 /update {wt=javabin&version=2} {add=[12]} 0 7
[junit4:junit4]   2> 14680 T1507 C134 P10684 /update {wt=javabin&version=2} {add=[13 (1413183518613176320)]} 0 1
[junit4:junit4]   2> 14686 T1545 C130 P23877 REQ /update {distrib.from=http://127.0.0.1:43302/solr/collection1/&update.distrib=FROMLEADER&wt=javabin&version=2} status=0 QTime=1 
[junit4:junit4]   2> 14686 T1523 C131 P43302 /update {wt=javabin&version=2} {add=[13 (1413183518616322048)]} 0 4
[junit4:junit4]   2> 14690 T1507 C134 P10684 /update {wt=javabin&version=2} {add=[14 (1413183518623662080)]} 0 1
[junit4:junit4]   2> 14699 T1545 C130 P23877 REQ /update {update.distrib=FROMLEADER&distrib.from=http://127.0.0.1:43302/solr/collection1/&wt=javabin&version=2} status=0 QTime=1 
[junit4:junit4]   2> 14699 T1527 C131 P43302 REQ /update {distrib.from=http://127.0.0.1:64103/solr/collection1/&update.distrib=TOLEADER&wt=javabin&version=2} status=0 QTime=5 
[junit4:junit4]   2> 14700 T1539 C133 P64103 /update {wt=javabin&version=2} {add=[14]} 0 8
[junit4:junit4]   2> 14704 T1507 C134 P10684 /update {wt=javabin&version=2} {add=[15 (1413183518638342144)]} 0 1
[junit4:junit4]   2> 14712 T1545 C130 P23877 REQ /update {update.distrib=FROMLEADER&distrib.from=http://127.0.0.1:43302/solr/collection1/&wt=javabin&version=2} status=0 QTime=1 
[junit4:junit4]   2> 14712 T1527 C131 P43302 REQ /update {distrib.from=http://127.0.0.1:64103/solr/collection1/&update.distrib=TOLEADER&wt=javabin&version=2} status=0 QTime=4 
[junit4:junit4]   2> 14713 T1539 C133 P64103 /update {wt=javabin&version=2} {add=[15]} 0 7
[junit4:junit4]   2> 14717 T1507 C134 P10684 /update {wt=javabin&version=2} {add=[16 (1413183518651973632)]} 0 1
[junit4:junit4]   2> 14725 T1545 C130 P23877 REQ /update {update.distrib=FROMLEADER&distrib.from=http://127.0.0.1:43302/solr/collection1/&wt=javabin&version=2} status=0 QTime=1 
[junit4:junit4]   2> 14725 T1527 C131 P43302 REQ /update {distrib.from=http://127.0.0.1:64103/solr/collection1/&update.distrib=TOLEADER&wt=javabin&version=2} status=0 QTime=4 
[junit4:junit4]   2> 14726 T1539 C133 P64103 /update {wt=javabin&version=2} {add=[16]} 0 7
[junit4:junit4]   2> 14731 T1507 C134 P10684 /update {wt=javabin&version=2} {add=[17 (1413183518665605120)]} 0 2
[junit4:junit4]   2> 14743 T1559 C132 P52489 REQ /update {update.distrib=FROMLEADER&distrib.from=http://127.0.0.1:64103/solr/collection1/&wt=javabin&version=2} status=0 QTime=2 
[junit4:junit4]   2> 14744 T1537 C133 P64103 REQ /update {distrib.from=http://127.0.0.1:43302/solr/collection1/&update.distrib=TOLEADER&wt=javabin&version=2} status=0 QTime=7 
[junit4:junit4]   2> 14744 T1523 C131 P43302 /update {wt=javabin&version=2} {add=[17]} 0 10
[junit4:junit4]   2> 14748 T1507 C134 P10684 /update {wt=javabin&version=2} {add=[100 (1413183518684479488)]} 0 1
[junit4:junit4]   2> 14779 T1545 C130 P23877 REQ /update {update.distrib=FROMLEADER&distrib.from=http://127.0.0.1:43302/solr/collection1/&wt=javabin&version=2} status=0 QTime=12 
[junit4:junit4]   2> 14780 T1527 C131 P43302 REQ /update {distrib.from=http://127.0.0.1:64103/solr/collection1/&update.distrib=TOLEADER&wt=javabin&version=2} status=0 QTime=28 
[junit4:junit4]   2> 14780 T1539 C133 P64103 /update {wt=javabin&version=2} {add=[100]} 0 30
[junit4:junit4]   2> 14784 T1507 C134 P10684 /update {wt=javabin&version=2} {add=[101 (1413183518722228224)]} 0 1
[junit4:junit4]   2> 14793 T1545 C130 P23877 REQ /update {distrib.from=http://127.0.0.1:43302/solr/collection1/&update.distrib=FROMLEADER&wt=javabin&version=2} status=0 QTime=2 
[junit4:junit4]   2> 14793 T1523 C131 P43302 /update {wt=javabin&version=2} {add=[101 (1413183518725373952)]} 0 7
[junit4:junit4]   2> 14797 T1507 C134 P10684 /update {wt=javabin&version=2} {add=[102 (1413183518735859712)]} 0 1
[junit4:junit4]   2> 14803 T1545 C130 P23877 REQ /update {distrib.from=http://127.0.0.1:43302/solr/collection1/&update.distrib=FROMLEADER&wt=javabin&version=2} status=0 QTime=1 
[junit4:junit4]   2> 14803 T1523 C131 P43302 /update {wt=javabin&version=2} {add=[102 (1413183518739005440)]} 0 4
[junit4:junit4]   2> 14819 T1507 C134 P10684 /update {wt=javabin&version=2} {add=[103 (1413183518746345472)]} 0 13
[junit4:junit4]   2> 14826 T1559 C132 P52489 REQ /update {distrib.from=http://127.0.0.1:64103/solr/collection1/&update.distrib=FROMLEADER&wt=javabin&version=2} status=0 QTime=1 
[junit4:junit4]   2> 14827 T1539 C133 P64103 /update {wt=javabin&version=2} {add=[103 (1413183518763122688)]} 0 5
[junit4:junit4]   2> 14832 T1507 C134 P10684 /update {wt=javabin&version=2} {add=[104 (1413183518771511296)]} 0 2
[junit4:junit4]   2> 14838 T1559 C132 P52489 REQ /update {distrib.from=http://127.0.0.1:64103/solr/collection1/&update.distrib=FROMLEADER&wt=javabin&version=2} status=0 QTime=1 
[junit4:junit4]   2> 14839 T1539 C133 P64103 /update {wt=javabin&version=2} {add=[104 (1413183518775705600)]} 0 5
[junit4:junit4]   2> 14843 T1507 C134 P10684 /update {wt=javabin&version=2} {add=[105 (1413183518784094208)]} 0 1
[junit4:junit4]   2> 14872 T1559 C132 P52489 REQ /update {distrib.from=http://127.0.0.1:64103/solr/collection1/&update.distrib=FROMLEADER&wt=javabin&version=2} status=0 QTime=13 
[junit4:junit4]   2> 14873 T1539 C133 P64103 /update {wt=javabin&version=2} {add=[105 (1413183518787239936)]} 0 28
[junit4:junit4]   2> 14876 T1507 C134 P10684 /update {wt=javabin&version=2} {add=[106 (1413183518818697216)]} 0 1
[junit4:junit4]   2> 14887 T1559 C132 P52489 REQ /update {update.distrib=FROMLEADER&distrib.from=http://127.0.0.1:64103/solr/collection1/&wt=javabin&version=2} status=0 QTime=2 
[junit4:junit4]   2> 14887 T1537 C133 P64103 REQ /update {distrib.from=http://127.0.0.1:43302/solr/collection1/&update.distrib=TOLEADER&wt=javabin&version=2} status=0 QTime=6 
[junit4:junit4]   2> 14888 T1523 C131 P43302 /update {wt=javabin&version=2} {add=[106]} 0 9
[junit4:junit4]   2> 14891 T1507 C134 P10684 /update {wt=javabin&version=2} {add=[107 (1413183518834425856)]} 0 1
[junit4:junit4]   2> 14900 T1545 C130 P23877 REQ /update {update.distrib=FROMLEADER&distrib.from=http://127.0.0.1:43302/solr/collection1/&wt=javabin&version=2} status=0 QTime=1 
[junit4:junit4]   2> 14900 T1527 C131 P43302 REQ /update {distrib.from=http://127.0.0.1:64103/solr/collection1/&update.distrib=TOLEADER&wt=javabin&version=2} status=0 QTime=4 
[junit4:junit4]   2> 14901 T1539 C133 P64103 /update {wt=javabin&version=2} {add=[107]} 0 7
[junit4:junit4]   2> 14905 T1507 C134 P10684 /update {wt=javabin&version=2} {add=[108 (1413183518849105920)]} 0 1
[junit4:junit4]   2> 14911 T1545 C130 P23877 REQ /update {distrib.from=http://127.0.0.1:43302/solr/collection1/&update.distrib=FROMLEADER&wt=javabin&version=2} status=0 QTime=1 
[junit4:junit4]   2> 14911 T1523 C131 P43302 /update {wt=javabin&version=2} {add=[108 (1413183518852251648)]} 0 4
[junit4:junit4]   2> 14915 T1507 C134 P10684 /update {wt=javabin&version=2} {add=[109 (1413183518859591680)]} 0 1
[junit4:junit4]   2> 14923 T1545 C130 P23877 REQ /update {update.distrib=FROMLEADER&distrib.from=http://127.0.0.1:43302/solr/collection1/&wt=javabin&version=2} status=0 QTime=1 
[junit4:junit4]   2> 14923 T1527 C131 P43302 REQ /update {distrib.from=http://127.0.0.1:64103/solr/collection1/&update.distrib=TOLEADER&wt=javabin&version=2} status=0 QTime=4 
[junit4:junit4]   2> 14924 T1539 C133 P64103 /update {wt=javabin&version=2} {add=[109]} 0 7
[junit4:junit4]   2> 14927 T1507 C134 P10684 /update {wt=javabin&version=2} {add=[110 (1413183518872174592)]} 0 1
[junit4:junit4]   2> 14935 T1545 C130 P23877 REQ /update {update.distrib=FROMLEADER&distrib.from=http://127.0.0.1:43302/solr/collection1/&wt=javabin&version=2} status=0 QTime=1 
[junit4:junit4]   2> 14935 T1527 C131 P43302 REQ /update {distrib.from=http://127.0.0.1:64103/solr/collection1/&update.distrib=TOLEADER&wt=javabin&version=2} status=0 QTime=4 
[junit4:junit4]   2> 14936 T1539 C133 P64103 /update {wt=javabin&version=2} {add=[110]} 0 7
[junit4:junit4]   2> 14939 T1507 C134 P10684 /update {wt=javabin&version=2} {add=[111 (1413183518884757504)]} 0 1
[junit4:junit4]   2> 14945 T1545 C130 P23877 REQ /update {distrib.from=http://127.0.0.1:43302/solr/collection1/&update.distrib=FROMLEADER&wt=javabin&version=2} status=0 QTime=1 
[junit4:junit4]   2> 14945 T1523 C131 P43302 /update {wt=javabin&version=2} {add=[111 (1413183518887903232)]} 0 4
[junit4:junit4]   2> 14949 T1507 C134 P10684 /update {wt=javabin&version=2} {add=[112 (1413183518895243264)]} 0 1
[junit4:junit4]   2> 14955 T1559 C132 P52489 REQ /update {distrib.from=http://127.0.0.1:64103/solr/collection1/&update.distrib=FROMLEADER&wt=javabin&version=2} status=0 QTime=1 
[junit4:junit4]   2> 14955 T1539 C133 P64103 /update {wt=javabin&version=2} {add=[112 (1413183518898388992)]} 0 4
[junit4:junit4]   2> 14967 T1507 C134 P10684 /update {wt=javabin&version=2} {add=[113 (1413183518905729024)]} 0 9
[junit4:junit4]   2> 14976 T1545 C130 P23877 REQ /update {update.distrib=FROMLEADER&distrib.from=http://127.0.0.1:43302/solr/collection1/&wt=javabin&version=2} status=0 QTime=1 
[junit4:junit4]   2> 14976 T1527 C131 P43302 REQ /update {distrib.from=http://127.0.0.1:64103/solr/collection1/&update.distrib=TOLEADER&wt=javabin&version=2} status=0 QTime=4 
[junit4:junit4]   2> 14977 T1539 C133 P64103 /update {wt=javabin&version=2} {add=[113]} 0 7
[junit4:junit4]   2> 14982 T1507 C134 P10684 /update {wt=javabin&version=2} {add=[114 (1413183518928797696)]} 0 2
[junit4:junit4]   2> 14989 T1545 C130 P23877 REQ /update {distrib.from=http://127.0.0.1:43302/solr/collection1/&update.distrib=FROMLEADER&wt=javabin&version=2} status=0 QTime=1 
[junit4:junit4]   2> 14989 T1523 C131 P43302 /update {wt=javabin&version=2} {add=[114 (1413183518934040576)]} 0 4
[junit4:junit4]   2> 14993 T1507 C134 P10684 /update {wt=javabin&version=2} {add=[115 (1413183518941380608)]} 0 1
[junit4:junit4]   2> 15001 T1559 C132 P52489 REQ /update {update.distrib=FROMLEADER&distrib.from=http://127.0.0.1:64103/solr/collection1/&wt=javabin&version=2} status=0 QTime=1 
[junit4:junit4]   2> 15001 T1537 C133 P64103 REQ /update {distrib.from=http://127.0.0.1:43302/solr/collection1/&update.distrib=TOLEADER&wt=javabin&version=2} status=0 QTime=4 
[junit4:junit4]   2> 15002 T1523 C131 P43302 /update {wt=javabin&version=2} {add=[115]} 0 7
[junit4:junit4]   2> 15005 T1507 C134 P10684 /update {wt=javabin&version=2} {add=[116 (1413183518953963520)]} 0 1
[junit4:junit4]   2> 15011 T1559 C132 P52489 REQ /update {distrib.from=http://127.0.0.1:64103/solr/collection1/&update.distrib=FROMLEADER&wt=javabin&version=2} status=0 QTime=1 
[junit4:junit4]   2> 15011 T1539 C133 P64103 /update {wt=javabin&version=2} {add=[116 (1413183518957109248)]} 0 4
[junit4:junit4]   2> 15015 T1507 C134 P10684 /update {wt=javabin&version=2} {add=[117 (1413183518964449280)]} 0 1
[junit4:junit4]   2> 15024 T1559 C132 P52489 REQ /update {update.distrib=FROMLEADER&distrib.from=http://127.0.0.1:64103/solr/collection1/&wt=javabin&version=2} status=0 QTime=1 
[junit4:junit4]   2> 15024 T1537 C133 P64103 REQ /update {distrib.from=http://127.0.0.1:43302/solr/collection1/&update.distrib=TOLEADER&wt=javabin&version=2} status=0 QTime=4 
[junit4:junit4]   2> 15025 T1523 C131 P43302 /update {wt=javabin&version=2} {add=[117]} 0 7
[junit4:junit4]   2> 15028 T1507 C134 P10684 /update {wt=javabin&version=2} {add=[118 (1413183518978080768)]} 0 1
[junit4:junit4]   2> 15053 T1545 C130 P23877 REQ /update {distrib.from=http://127.0.0.1:43302/solr/collection1/&update.distrib=FROMLEADER&wt=javabin&version=2} status=0 QTime=10 
[junit4:junit4]   2> 15053 T1523 C131 P43302 /update {wt=javabin&version=2} {add=[118 (1413183518982275072)]} 0 22
[junit4:junit4]   2> 15057 T1507 C134 P10684 /update {wt=javabin&version=2} {add=[119 (1413183519008489472)]} 0 1
[junit4:junit4]   2> 15064 T1559 C132 P52489 REQ /update {distrib.from=http://127.0.0.1:64103/solr/collection1/&update.distrib=FROMLEADER&wt=javabin&version=2} status=0 QTime=1 
[junit4:junit4]   2> 15065 T1539 C133 P64103 /update {wt=javabin&version=2} {add=[119 (1413183519012683776)]} 0 4
[junit4:junit4]   2> 15070 T1507 C134 P10684 /update {wt=javabin&version=2} {add=[120 (1413183519022120960)]} 0 2
[junit4:junit4]   2> 15079 T1559 C132 P52489 REQ /update {distrib.from=http://127.0.0.1:64103/solr/collection1/&update.distrib=FROMLEADER&wt=javabin&version=2} status=0 QTime=1 
[junit4:junit4]   2> 15080 T1539 C133 P64103 /update {wt=javabin&version=2} {add=[120 (1413183519026315264)]} 0 7
[junit4:junit4]   2> 15083 T1507 C134 P10684 /update {wt=javabin&version=2} {add=[121 (1413183519035752448)]} 0 1
[junit4:junit4]   2> 15091 T1559 C132 P52489 REQ /update {update.distrib=FROMLEADER&distrib.from=http://127.0.0.1:64103/solr/collection1/&wt=javabin&version=2} status=0 QTime=1 
[junit4:junit4]   2> 15091 T1537 C133 P64103 REQ /update {distrib.from=http://127.0.0.1:43302/solr/collection1/&update.distrib=TOLEADER&wt=javabin&version=2} status=0 QTime=4 
[junit4:junit4]   2> 15092 T1523 C131 P43302 /update {wt=javabin&version=2} {add=[121]} 0 7
[junit4:junit4]   2> 15096 T1507 C134 P10684 /update {wt=javabin&version=2} {add=[122 (1413183519049383936)]} 0 1
[junit4:junit4]   2> 15104 T1545 C130 P23877 REQ /update {distrib.from=http://127.0.0.1:43302/solr/collection1/&update.distrib=FROMLEADER&wt=javabin&version=2} status=0 QTime=2 
[junit4:junit4]   2> 15104 T1523 C131 P43302 /update {wt=javabin&version=2} {add=[122 (1413183519052529664)]} 0 6
[junit4:junit4]   2> 15117 T1507 C134 P10684 /update {wt=javabin&version=2} {add=[123 (1413183519061966848)]} 0 10
[junit4:junit4]   2> 15126 T1545 C130 P23877 REQ /update {update.distrib=FROMLEADER&distrib.from=http://127.0.0.1:43302/solr/collection1/&wt=javabin&version=2} status=0 QTime=1 
[junit4:junit4]   2> 15126 T1527 C131 P43302 REQ /update {distrib.from=http://127.0.0.1:64103/solr/collection1/&update.distrib=TOLEADER&wt=javabin&version=2} status=0 QTime=4 
[junit4:junit4]   2> 15127 T1539 C133 P64103 /update {wt=javabin&version=2} {add=[123]} 0 7
[junit4:junit4]   2> 15132 T1507 C134 P10684 /update {wt=javabin&version=2} {add=[124 (1413183519086084096)]} 0 2
[junit4:junit4]   2> 15141 T1545 C130 P23877 REQ /update {update.distrib=FROMLEADER&distrib.from=http://127.0.0.1:43302/solr/collection1/&wt=javabin&version=2} status=0 QTime=1 
[junit4:junit4]   2> 15141 T1527 C131 P43302 REQ /update {distrib.from=http://127.0.0.1:64103/solr/collection1/&update.distrib=TOLEADER&wt=javabin&version=2} status=0 QTime=4 
[junit4:junit4]   2> 15142 T1539 C133 P64103 /update {wt=javabin&version=2} {add=[124]} 0 7
[junit4:junit4]   2> 15146 T1507 C134 P10684 /update {wt=javabin&version=2} {add=[125 (1413183519101812736)]} 0 1
[junit4:junit4]   2> 15152 T1545 C130 P23877 REQ /update {distrib.from=http://127.0.0.1:43302/solr/collection1/&update.distrib=FROMLEADER&wt=javabin&version=2} status=0 QTime=1 
[junit4:junit4]   2> 15152 T1523 C131 P43302 /update {wt=javabin&version=2} {add=[125 (1413183519104958464)]} 0 4
[junit4:junit4]   2> 15156 T1507 C134 P10684 /update {wt=javabin&version=2} {add=[126 (1413183519112298496)]} 0 1
[junit4:junit4]   2> 15164 T1559 C132 P52489 REQ /update {update.distrib=FROMLEADER&distrib.from=http://127.0.0.1:64103/solr/collection1/&wt=javabin&version=2} status=0 QTime=1 
[junit4:junit4]   2> 15165 T1537 C133 P64103 REQ /update {distrib.from=http://127.0.0.1:43302/solr/collection1/&update.distrib=TOLEADER&wt=javabin&version=2} status=0 QTime=5 
[junit4:junit4]   2> 15165 T1523 C131 P43302 /update {wt=javabin&version=2} {add=[126]} 0 7
[junit4:junit4]   2> 15169 T1507 C134 P10684 /update {wt=javabin&version=2} {add=[127 (1413183519125929984)]} 0 1
[junit4:junit4]   2> 15192 T1559 C132 P52489 REQ /update {distrib.from=http://127.0.0.1:64103/solr/collection1/&update.distrib=FROMLEADER&wt=javabin&version=2} status=0 QTime=9 
[junit4:junit4]   2> 15193 T1539 C133 P64103 /update {wt=javabin&version=2} {add=[127 (1413183519129075712)]} 0 22
[junit4:junit4]   2> 15197 T1507 C134 P10684 /update {wt=javabin&version=2} {add=[128 (1413183519155290112)]} 0 1
[junit4:junit4]   2> 15205 T1559 C132 P52489 REQ /update {distrib.from=http://127.0.0.1:64103/solr/collection1/&update.distrib=FROMLEADER&wt=javabin&version=2} status=0 QTime=2 
[junit4:junit4]   2> 15206 T1539 C133 P64103 /update {wt=javabin&version=2} {add=[128 (1413183519158435840)]} 0 7
[junit4:junit4]   2> 15209 T1507 C134 P10684 /update {wt=javabin&version=2} {add=[129 (1413183519167873024)]} 0 1
[junit4:junit4]   2> 15217 T1545 C130 P23877 REQ /update {update.distrib=FROMLEADER&distrib.from=http://127.0.0.1:43302/solr/collection1/&wt=javabin&version=2} status=0 QTime=1 
[junit4:junit4]   2> 15217 T1527 C131 P43302 REQ /update {distrib.from=http://127.0.0.1:64103/solr/collection1/&update.distrib=TOLEADER&wt=javabin&version=2} status=0 QTime=4 
[junit4:junit4]   2> 15218 T1539 C133 P64103 /update {wt=javabin&version=2} {add=[129]} 0 7
[junit4:junit4]   2> 15222 T1507 C134 P10684 /update {wt=javabin&version=2} {add=[130 (1413183519181504512)]} 0 1
[junit4:junit4]   2> 15229 T1559 C132 P52489 REQ /update {distrib.from=http://127.0.0.1:64103/solr/collection1/&update.distrib=FROMLEADER&wt=javabin&version=2} status=0 QTime=1 
[junit4:junit4]   2> 15229 T1539 C133 P64103 /update {wt=javabin&version=2} {add=[130 (1413183519185698816)]} 0 4
[junit4:junit4]   2> 15233 T1507 C134 P10684 /update {wt=javabin&version=2} {add=[131 (1413183519193038848)]} 0 1
[junit4:junit4]   2> 15242 T1559 C132 P52489 REQ /update {update.distrib=FROMLEADER&distrib.from=http://127.0.0.1:64103/solr/collection1/&wt=javabin&version=2} status=0 QTime=1 
[junit4:junit4]   2> 15243 T1537 C133 P64103 REQ /update {distrib.from=http://127.0.0.1:43302/solr/collection1/&update.distrib=TOLEADER&wt=javabin&version=2} status=0 QTime=5 
[junit4:junit4]   2> 15243 T1523 C131 P43302 /update {wt=javabin&version=2} {add=[131]} 0 7
[junit4:junit4]   2> 15247 T1507 C134 P10684 /update {wt=javabin&version=2} {add=[132 (1413183519207718912)]} 0 1
[junit4:junit4]   2> 15254 T1545 C130 P23877 REQ /update {distrib.from=http://127.0.0.1:43302/solr/collection1/&update.distrib=FROMLEADER&wt=javabin&version=2} status=0 QTime=1 
[junit4:junit4]   2> 15255 T1523 C131 P43302 /update {wt=javabin&version=2} {add=[132 (1413183519211913216)]} 0 5
[junit4:junit4]   2> 15267 T1507 C134 P10684 /update {wt=javabin&version=2} {add=[133 (1413183519219253248)]} 0 10
[junit4:junit4]   2> 15276 T1545 C130 P23877 REQ /update {update.distrib=FROMLEADER&distrib.from=http://127.0.0.1:43302/solr/collection1/&wt=javabin&version=2} status=0 QTime=1 
[junit4:junit4]   2> 15276 T1527 C131 P43302 REQ /update {distrib.from=http://127.0.0.1:64103/solr/collection1/&update.distrib=TOLEADER&wt=javabin&version=2} status=0 QTime=4 
[junit4:junit4]   2> 15277 T1539 C133 P64103 /update {wt=javabin&version=2} {add=[133]} 0 7
[junit4:junit4]   2> 15282 T1507 C134 P10684 /update {wt=javabin&version=2} {add=[134 (1413183519243370496)]} 0 2
[junit4:junit4]   2> 15290 T1559 C132 P52489 REQ /update {update.distrib=FROMLEADER&distrib.from=http://127.0.0.1:64103/solr/collection1/&wt=javabin&version=2} status=0 QTime=1 
[junit4:junit4]   2> 15290 T1537 C133 P64103 REQ /update {distrib.from=http://127.0.0.1:43302/solr/collection1/&update.distrib=TOLEADER&wt=javabin&version=2} status=0 QTime=4 
[junit4:junit4]   2> 15291 T1523 C131 P43302 /update {wt=javabin&version=2} {add=[134]} 0 7
[junit4:junit4]   2> 15295 T1507 C134 P10684 /update {wt=javabin&version=2} {add=[135 (1413183519258050560)]} 0 1
[junit4:junit4]   2> 15303 T1545 C130 P23877 REQ /update {update.distrib=FROMLEADER&distrib.from=http://127.0.0.1:43302/solr/collection1/&wt=javabin&version=2} status=0 QTime=1 
[junit4:junit4]   2> 15303 T1527 C131 P43302 REQ /update {distrib.from=http://127.0.0.1:64103/solr/collection1/&update.distrib=TOLEADER&wt=javabin&version=2} status=0 QTime=4 
[junit4:junit4]   2> 15304 T1539 C133 P64103 /update {wt=javabin&version=2} {add=[135]} 0 7
[junit4:junit4]   2> 15308 T1507 C134 P10684 /update {wt=javabin&version=2} {add=[136 (1413183519271682048)]} 0 1
[junit4:junit4]   2> 15316 T1559 C132 P52489 REQ /update {update.distrib=FROMLEADER&distrib.from=http://127.0.0.1:64103/solr/collection1/&wt=javabin&version=2} status=0 QTime=1 
[junit4:junit4]   2> 15316 T1537 C133 P64103 REQ /update {distrib.from=http://127.0.0.1:43302/solr/collection1/&update.distrib=TOLEADER&wt=javabin&version=2} status=0 QTime=4 
[junit4:junit4]   2> 15317 T1523 C131 P43302 /update {wt=javabin&version=2} {add=[136]} 0 7
[junit4:junit4]   2> 15320 T1507 C134 P10684 /update {wt=javabin&version=2} {add=[137 (1413183519284264960)]} 0 1
[junit4:junit4]   2> 15328 T1559 C132 P52489 REQ /update {update.distrib=FROMLEADER&distrib.from=http://127.0.0.1:64103/solr/collection1/&wt=javabin&version=2} status=0 QTime=1 
[junit4:junit4]   2> 15328 T1537 C133 P64103 REQ /update {distrib.from=http://127.0.0.1:43302/solr/collection1/&update.distrib=TOLEADER&wt=javabin&version=2} status=0 QTime=4 
[junit4:junit4]   2> 15329 T1523 C131 P43302 /update {wt=javabin&version=2} {add=[137]} 0 7
[junit4:junit4]   2> 15333 T1507 C134 P10684 /update {wt=javabin&version=2} {add=[138 (1413183519297896448)]} 0 1
[junit4:junit4]   2> 15339 T1545 C130 P23877 REQ /update {distrib.from=http://127.0.0.1:43302/solr/collection1/&update.distrib=FROMLEADER&wt=javabin&version=2} status=0 QTime=1 
[junit4:junit4]   2> 15339 T1523 C131 P43302 /update {wt=javabin&version=2} {add=[138 (1413183519301042176)]} 0 4
[junit4:junit4]   2> 15343 T1507 C134 P10684 /update {wt=javabin&version=2} {add=[139 (1413183519308382208)]} 0 1
[junit4:junit4]   2> 15349 T1559 C132 P52489 REQ /update {distrib.from=http://127.0.0.1:64103/solr/collection1/&update.distrib=FROMLEADER&wt=javabin&version=2} status=0 QTime=1 
[junit4:junit4]   2> 15349 T1539 C133 P64103 /update {wt=javabin&version=2} {add=[139 (1413183519311527936)]} 0 4
[junit4:junit4]   2> 15353 T1507 C134 P10684 /update {wt=javabin&version=2} {add=[140 (1413183519318867968)]} 0 1
[junit4:junit4]   2> 15361 T1559 C132 P52489 REQ /update {update.distrib=FROMLEADER&distrib.from=http://127.0.0.1:64103/solr/collection1/&wt=javabin&version=2} status=0 QTime=1 
[junit4:junit4]   2> 15361 T1537 C133 P64103 REQ /update {distrib.from=http://127.0.0.1:43302/solr/collection1/&update.distrib=TOLEADER&wt=javabin&version=2} status=0 QTime=4 
[junit4:junit4]   2> 15362 T1523 C131 P43302 /update {wt=javabin&version=2} {add=[140]} 0 7
[junit4:junit4]   2> 15366 T1507 C134 P10684 /update {wt=javabin&version=2} {add=[141 (1413183519332499456)]} 0 1
[junit4:junit4]   2> 15372 T1559 C132 P52489 REQ /update {distrib.from=http://127.0.0.1:64103/solr/collection1/&update.distrib=FROMLEADER&wt=javabin&version=2} status=0 QTime=1 
[junit4:junit4]   2> 15372 T1539 C133 P64103 /update {wt=javabin&version=2} {add=[141 (1413183519335645184)]} 0 4
[junit4:junit4]   2> 15376 T1507 C134 P10684 /update {wt=javabin&version=2} {add=[142 (1413183519342985216)]} 0 1
[junit4:junit4]   2> 15399 T1559 C132 P52489 REQ /update {distrib.from=http://127.0.0.1:64103/solr/collection1/&update.distrib=FROMLEADER&wt=javabin&version=2} status=0 QTime=9 
[junit4:junit4]   2> 15400 T1539 C133 P64103 /update {wt=javabin&version=2} {add=[142 (1413183519346130944)]} 0 22
[junit4:junit4]   2> 15413 T1507 C134 P10684 /update {wt=javabin&version=2} {add=[143 (1413183519372345344)]} 0 10
[junit4:junit4]   2> 15424 T1559 C132 P52489 REQ /update {update.distrib=FROMLEADER&distrib.from=http://127.0.0.1:64103/solr/collection1/&wt=javabin&version=2} status=0 QTime=2 
[junit4:junit4]   2> 15424 T1537 C133 P64103 REQ /update {distrib.from=http://127.0.0.1:43302/solr/collection1/&update.distrib=TOLEADER&wt=javabin&version=2} status=0 QTime=6 
[junit4:junit4]   2> 15425 T1523 C131 P43302 /update {wt=javabin&version=2} {add=[143]} 0 9
[junit4:junit4]   2> 15430 T1507 C134 P10684 /update {wt=javabin&version=2} {add=[144 (1413183519398559744)]} 0 2
[junit4:junit4]   2> 15436 T1559 C132 P52489 REQ /update {distrib.from=http://127.0.0.1:64103/solr/collection1/&update.distrib=FROMLEADER&wt=javabin&version=2} status=0 QTime=1 
[junit4:junit4]   2> 15436 T1539 C133 P64103 /update {wt=javabin&version=2} {add=[144 (1413183519402754048)]} 0 4
[junit4:junit4]   2> 15440 T1507 C134 P10684 /update {wt=javabin&version=2} {add=[145 (1413183519410094080)]} 0 1
[junit4:junit4]   2> 15446 T1559 C132 P52489 REQ /update {distrib.from=http://127.0.0.1:64103/solr/collection1/&update.distrib=FROMLEADER&wt=javabin&version=2} status=0 QTime=1 
[junit4:junit4]   2> 15446 T1539 C133 P64103 /update {wt=javabin&version=2} {add=[145 (1413183519413239808)]} 0 4
[junit4:junit4]   2> 15450 T1507 C134 P10684 /update {wt=javabin&version=2} {add=[146 (1413183519420579840)]} 0 1
[junit4:junit4]   2> 15476 T1545 C130 P23877 REQ /update {update.distrib=FROMLEADER&distrib.from=http://127.0.0.1:43302/solr/collection1/&wt=javabin&version=2} status=0 QTime=9 
[junit4:junit4]   2> 15477 T1527 C131 P43302 REQ /update {distrib.from=http://127.0.0.1:64103/solr/collection1/&update.distrib=TOLEADER&wt=javabin&version=2} status=0 QTime=23 
[junit4:junit4]   2> 15478 T1539 C133 P64103 /update {wt=javabin&version=2} {add=[146]} 0 26
[junit4:junit4]   2> 15481 T1507 C134 P10684 /update {wt=javabin&version=2} {add=[147 (1413183519453085696)]} 0 1
[junit4:junit4]   2> 15489 T1559 C132 P52489 REQ /update {update.distrib=FROMLEADER&distrib.from=http://127.0.0.1:64103/solr/collection1/&wt=javabin&version=2} status=0 QTime=1 
[junit4:junit4]   2> 15489 T1537 C133 P64103 REQ /update {distrib.from=http://127.0.0.1:43302/solr/collection1/&update.distrib=TOLEADER&wt=javabin&version=2} status=0 QTime=4 
[junit4:junit4]   2> 15490 T1523 C131 P43302 /update {wt=javabin&version=2} {add=[147]} 0 7
[junit4:junit4]   2> 15494 T1507 C134 P10684 /update {wt=javabin&version=2} {add=[148 (1413183519466717184)]} 0 1
[junit4:junit4]   2> 15505 T1545 C130 P23877 REQ /update {update.distrib=FROMLEADER&distrib.from=http://127.0.0.1:43302/solr/collection1/&wt=javabin&version=2} status=0 QTime=2 
[junit4:junit4]   2> 15505 T1527 C131 P43302 REQ /update {distrib.from=http://127.0.0.1:64103/solr/collection1/&update.distrib=TOLEADER&wt=javabin&version=2} status=0 QTime=7 
[junit4:junit4]   2> 15506 T1539 C133 P64103 /update {wt=javabin&version=2} {add=[148]} 0 10
[junit4:junit4]   2> 15510 T1507 C134 P10684 /update {wt=javabin&version=2} {add=[149 (1413183519483494400)]} 0 1
[junit4:junit4]   2> 15518 T1559 C132 P52489 REQ /update {update.distrib=FROMLEADER&distrib.from=http://127.0.0.1:64103/solr/collection1/&wt=javabin&version=2} status=0 QTime=1 
[junit4:junit4]   2> 15518 T1537 C133 P64103 REQ /update {distrib.from=http://127.0.0.1:43302/solr/collection1/&update.distrib=TOLEADER&wt=javabin&version=2} status=0 QTime=4 
[junit4:junit4]   2> 15519 T1523 C131 P43302 /update {wt=javabin&version=2} {add=[149]} 0 7
[junit4:junit4]   2> 15519 T1495 oasc.AbstractDistribZkTestBase.waitForRecoveriesToFinish Wait for recoveries to finish - collection: collection1 failOnTimeout:true timeout (sec):1440
[junit4:junit4]   2> 15521 T1495 oascc.ZkStateReader.updateClusterState Updating cloud state from ZooKeeper... 
[junit4:junit4]   2> 15523 T1507 C134 P10684 oasu.DirectUpdateHandler2.commit start commit{flags=0,_version_=0,optimize=false,openSearcher=true,waitSearcher=true,expungeDeletes=false,softCommit=false}
[junit4:junit4]   2> 16076 T1507 C134 P10684 oasc.SolrDeletionPolicy.onCommit SolrDeletionPolicy.onCommit: commits:num=2
[junit4:junit4]   2> 		commit{dir=NRTCachingDirectory(org.apache.lucene.store.NIOFSDirectory@/usr/home/hudson/hudson-slave/workspace/Lucene-Solr-Tests-4.x-java7/solr/build/solr-core/test/J1/org.apache.solr.cloud.BasicDistributedZk2Test-1347716811396/control/data/index lockFactory=org.apache.lucene.store.NativeFSLockFactory@f7632e7; maxCacheMB=48.0 maxMergeSizeMB=4.0),segFN=segments_2,generation=2,filenames=[_0_Block_0.tip, _0_Block_0.pos, _0_MockVariableIntBlock_0.doc, _0_Block_0.tim, _0_MockVariableIntBlock_0.skp, _0_Pulsing40_0.prx, _0_NestedPulsing_0.tip, _0_Pulsing40_0.frq, _0_NestedPulsing_0.tim, _0_MockVariableIntBlock_0.pyl, _0_MockVariableIntBlock_0.tib, _0_MockVariableIntBlock_0.pos, _0_Pulsing40_0.tip, _0.si, _0_MockVariableIntBlock_0.tii, _0.fnm, _0_Block_0.doc, _0_Pulsing40_0.tim, _0_NestedPulsing_0.frq, _0_nrm.cfs, _0_NestedPulsing_0.prx, _0_nrm.cfe, _0_MockVariableIntBlock_0.frq, segments_2, _0.fdx, _0.fdt]
[junit4:junit4]   2> 		commit{dir=NRTCachingDirectory(org.apache.lucene.store.NIOFSDirectory@/usr/home/hudson/hudson-slave/workspace/Lucene-Solr-Tests-4.x-java7/solr/build/solr-core/test/J1/org.apache.solr.cloud.BasicDistributedZk2Test-1347716811396/control/data/index lockFactory=org.apache.lucene.store.NativeFSLockFactory@f7632e7; maxCacheMB=48.0 maxMergeSizeMB=4.0),segFN=segments_3,generation=3,filenames=[_5_nrm.cfe, _1_NestedPulsing_0.tip, _2_NestedPulsing_0.tim, _5_NestedPulsing_0.tip, _2_Block_0.pos, _5_NestedPulsing_0.tim, _7.si, _3.fdt, _3_NestedPulsing_0.prx, _0_Pulsing40_0.frq, _7.fnm, _7_NestedPulsing_0.frq, _6_Block_0.pos, _6_NestedPulsing_0.prx, _5_Pulsing40_0.tip, _1_NestedPulsing_0.tim, _2_NestedPulsing_0.tip, _5_Pulsing40_0.tim, _1_Block_0.tip, _1_Block_0.pos, _0_Pulsing40_0.tim, _1_Block_0.tim, _1_MockVariableIntBlock_0.tii, _2.fdt, _3_Pulsing40_0.tip, _3_NestedPulsing_0.tim, _7.fdx, _2.fdx, _7.fdt, _3_Pulsing40_0.tim, _1_MockVariableIntBlock_0.tib, _3_Block_0.pos, _3_Block_0.doc, _1.fdx, _7_Pulsing40_0.frq, _5_nrm.cfs, _1.fdt, _3_NestedPulsing_0.tip, _7_NestedPulsing_0.tim, _0_MockVariableIntBlock_0.frq, _7_Block_0.pos, _3.si, _4_NestedPulsing_0.frq, _6.fdt, _2_MockVariableIntBlock_0.skp, _7_NestedPulsing_0.tip, _1_MockVariableIntBlock_0.skp, _2.si, _3_Pulsing40_0.frq, _6_NestedPulsing_0.frq, _2_Pulsing40_0.tim, _2_MockVariableIntBlock_0.pyl, _2_Block_0.tim, _0_MockVariableIntBlock_0.doc, _6.fdx, _2_Block_0.tip, _2_Pulsing40_0.tip, _1_MockVariableIntBlock_0.pyl, _3.fnm, _0_NestedPulsing_0.tip, _5_Block_0.tim, _2_MockVariableIntBlock_0.doc, _0_NestedPulsing_0.tim, _4_Pulsing40_0.prx, _0_MockVariableIntBlock_0.pyl, _2_nrm.cfe, _5_Pulsing40_0.frq, _1_MockVariableIntBlock_0.doc, _4_NestedPulsing_0.tip, _0_MockVariableIntBlock_0.pos, _0_Pulsing40_0.tip, _4_NestedPulsing_0.tim, _2_nrm.cfs, _5_Block_0.doc, _4_Block_0.pos, _3_Block_0.tip, _2_MockVariableIntBlock_0.tii, _4_Block_0.tip, _2_MockVariableIntBlock_0.tib, _1_MockVariableIntBlock_0.pos, _2_NestedPulsing_0.prx, _0_NestedPulsing_0.frq, _0_NestedPulsing_0.prx, _2.fnm, _7_Pulsing40_0.tim, _3.fdx, _4_Pulsing40_0.tip, _4_Pulsing40_0.tim, _1_NestedPulsing_0.frq, _5_NestedPulsing_0.frq, _5_Pulsing40_0.prx, _1.si, _2_NestedPulsing_0.frq, _6_NestedPulsing_0.tip, _6.si, _6.fnm, _6_NestedPulsing_0.tim, _7_Pulsing40_0.tip, _3_nrm.cfe, _0_Block_0.tip, _5.fdt, _1_Pulsing40_0.tip, _6_Pulsing40_0.frq, _0_Block_0.tim, _1_Pulsing40_0.tim, _7_Block_0.tim, _4_nrm.cfe, _4.fnm, _0_MockVariableIntBlock_0.skp, _7_Block_0.tip, _0_Pulsing40_0.prx, _7_Pulsing40_0.prx, _1.fnm, _4.fdx, _1_Pulsing40_0.frq, _3_Block_0.tim, _6_Pulsing40_0.tim, _1_Pulsing40_0.prx, _6_Pulsing40_0.tip, _4_NestedPulsing_0.prx, _1_Block_0.doc, _2_Pulsing40_0.prx, _2_MockVariableIntBlock_0.pos, _0.fnm, _4_Block_0.tim, _6_Block_0.doc, _2_Pulsing40_0.frq, _5.si, _3_nrm.cfs, _3_NestedPulsing_0.frq, _6_Pulsing40_0.prx, _4_nrm.cfs, _5_Block_0.tip, _7_Block_0.doc, _0_Block_0.pos, _1_NestedPulsing_0.prx, _2_MockVariableIntBlock_0.frq, _4_Block_0.doc, _6_nrm.cfs, _7_nrm.cfs, _0_MockVariableIntBlock_0.tib, _5_Block_0.pos, _0.si, _0_MockVariableIntBlock_0.tii, _1_nrm.cfs, _5.fnm, _0_Block_0.doc, _7_NestedPulsing_0.prx, _7_nrm.cfe, _6_nrm.cfe, _4.si, _4.fdt, _0_nrm.cfs, _1_nrm.cfe, _1_MockVariableIntBlock_0.frq, _5_NestedPulsing_0.prx, _4_Pulsing40_0.frq, _3_Pulsing40_0.prx, _6_Block_0.tip, _0_nrm.cfe, _5.fdx, _0.fdx, _6_Block_0.tim, _2_Block_0.doc, _0.fdt, segments_3]


[...truncated too long message...]

rMBean(DefaultMBeanServerInterceptor.java:415)
[junit4:junit4]   2> 	at com.sun.jmx.mbeanserver.JmxMBeanServer.unregisterMBean(JmxMBeanServer.java:536)
[junit4:junit4]   2> 	at org.apache.solr.core.JmxMonitoredMap.unregister(JmxMonitoredMap.java:175)
[junit4:junit4]   2> 	at org.apache.solr.core.JmxMonitoredMap.clear(JmxMonitoredMap.java:116)
[junit4:junit4]   2> 	at org.apache.solr.core.SolrCore.close(SolrCore.java:864)
[junit4:junit4]   2> 	at org.apache.solr.cloud.ShardLeaderElectionContext.runLeaderProcess(ElectionContext.java:213)
[junit4:junit4]   2> 	at org.apache.solr.cloud.LeaderElector.runIamLeaderProcess(LeaderElector.java:158)
[junit4:junit4]   2> 	at org.apache.solr.cloud.LeaderElector.checkIfIamLeader(LeaderElector.java:102)
[junit4:junit4]   2> 	at org.apache.solr.cloud.LeaderElector.access$000(LeaderElector.java:56)
[junit4:junit4]   2> 	at org.apache.solr.cloud.LeaderElector$1.process(LeaderElector.java:131)
[junit4:junit4]   2> 	at org.apache.zookeeper.ClientCnxn$EventThread.processEvent(ClientCnxn.java:526)
[junit4:junit4]   2> 	at org.apache.zookeeper.ClientCnxn$EventThread.run(ClientCnxn.java:502)
[junit4:junit4]   2> 
[junit4:junit4]   2> 184506 T1567 oasc.SolrCore.closeSearcher [collection1] Closing main searcher on request.
[junit4:junit4]   2> 184510 T1567 oasu.DirectUpdateHandler2.close closing DirectUpdateHandler2{commits=5,autocommits=0,soft autocommits=0,optimizes=0,rollbacks=0,expungeDeletes=0,docsPending=0,adds=0,deletesById=0,deletesByQuery=0,errors=0,cumulative_adds=35,cumulative_deletesById=0,cumulative_deletesByQuery=0,cumulative_errors=0}
[junit4:junit4]   2> 184510 T1567 oasu.DefaultSolrCoreState.decref SolrCoreState ref count has reached 0 - closing IndexWriter
[junit4:junit4]   2> 184513 T1567 oasu.DefaultSolrCoreState.decref Closing SolrCoreState - canceling any ongoing recovery
[junit4:junit4]   2> 184513 T1567 oasc.LeaderElector$1.process WARNING  org.apache.zookeeper.KeeperException$SessionExpiredException: KeeperErrorCode = Session expired for /collections/collection1/leader_elect/shard2/election/88323968952107014-127.0.0.1:52489_solr_collection1-n_0000000004
[junit4:junit4]   2> 	at org.apache.zookeeper.KeeperException.create(KeeperException.java:118)
[junit4:junit4]   2> 	at org.apache.zookeeper.KeeperException.create(KeeperException.java:42)
[junit4:junit4]   2> 	at org.apache.zookeeper.ZooKeeper.delete(ZooKeeper.java:734)
[junit4:junit4]   2> 	at org.apache.solr.common.cloud.SolrZkClient$2.execute(SolrZkClient.java:178)
[junit4:junit4]   2> 	at org.apache.solr.common.cloud.SolrZkClient$2.execute(SolrZkClient.java:175)
[junit4:junit4]   2> 	at org.apache.solr.common.cloud.ZkCmdExecutor.retryOperation(ZkCmdExecutor.java:67)
[junit4:junit4]   2> 	at org.apache.solr.common.cloud.SolrZkClient.delete(SolrZkClient.java:175)
[junit4:junit4]   2> 	at org.apache.solr.cloud.ElectionContext.cancelElection(ElectionContext.java:60)
[junit4:junit4]   2> 	at org.apache.solr.cloud.ShardLeaderElectionContext.runLeaderProcess(ElectionContext.java:151)
[junit4:junit4]   2> 	at org.apache.solr.cloud.LeaderElector.runIamLeaderProcess(LeaderElector.java:158)
[junit4:junit4]   2> 	at org.apache.solr.cloud.LeaderElector.checkIfIamLeader(LeaderElector.java:102)
[junit4:junit4]   2> 	at org.apache.solr.cloud.LeaderElector.joinElection(LeaderElector.java:275)
[junit4:junit4]   2> 	at org.apache.solr.cloud.ShardLeaderElectionContext.rejoinLeaderElection(ElectionContext.java:326)
[junit4:junit4]   2> 	at org.apache.solr.cloud.ShardLeaderElectionContext.runLeaderProcess(ElectionContext.java:204)
[junit4:junit4]   2> 	at org.apache.solr.cloud.LeaderElector.runIamLeaderProcess(LeaderElector.java:158)
[junit4:junit4]   2> 	at org.apache.solr.cloud.LeaderElector.checkIfIamLeader(LeaderElector.java:102)
[junit4:junit4]   2> 	at org.apache.solr.cloud.LeaderElector.access$000(LeaderElector.java:56)
[junit4:junit4]   2> 	at org.apache.solr.cloud.LeaderElector$1.process(LeaderElector.java:131)
[junit4:junit4]   2> 	at org.apache.zookeeper.ClientCnxn$EventThread.processEvent(ClientCnxn.java:526)
[junit4:junit4]   2> 	at org.apache.zookeeper.ClientCnxn$EventThread.run(ClientCnxn.java:502)
[junit4:junit4]   2> 
[junit4:junit4]   2> 184514 T1567 oascc.ZkStateReader$3.process Updating live nodes
[junit4:junit4]   2> 184514 T1567 oascc.ZkStateReader$3.process WARNING ZooKeeper watch triggered, but Solr cannot talk to ZK
[junit4:junit4]   2> 184514 T1567 oascc.ZkStateReader$2.process A cluster state change has occurred - updating...
[junit4:junit4]   2> 184514 T1567 oascc.ZkStateReader$2.process WARNING ZooKeeper watch triggered, but Solr cannot talk to ZK
[junit4:junit4]   2> 184515 T1567 oascc.ConnectionManager.process Watcher org.apache.solr.common.cloud.ConnectionManager@37bf3bde name:ZooKeeperConnection Watcher:127.0.0.1:15224/solr got event WatchedEvent state:Disconnected type:None path:null path:null type:None
[junit4:junit4]   2> 184515 T1567 oascc.ConnectionManager.process Client->ZooKeeper status change trigger but we are already closed
[junit4:junit4]   2> 184515 T1567 oaz.ClientCnxn$EventThread.run EventThread shut down
[junit4:junit4]   2> NOTE: test params are: codec=Lucene40: {n_f1=Block(blocksize=128), foo_b=MockVariableIntBlock(baseBlockSize=18), foo_d=PostingsFormat(name=NestedPulsing), foo_f=MockVariableIntBlock(baseBlockSize=18), n_tl1=Block(blocksize=128), n_d1=Pulsing40(freqCutoff=19 minBlockSize=91 maxBlockSize=250), rnd_b=PostingsFormat(name=NestedPulsing), intDefault=Block(blocksize=128), n_td1=Block(blocksize=128), timestamp=Pulsing40(freqCutoff=19 minBlockSize=91 maxBlockSize=250), id=PostingsFormat(name=NestedPulsing), range_facet_sl=PostingsFormat(name=NestedPulsing), range_facet_si=Pulsing40(freqCutoff=19 minBlockSize=91 maxBlockSize=250), oddField_s=PostingsFormat(name=NestedPulsing), multiDefault=Pulsing40(freqCutoff=19 minBlockSize=91 maxBlockSize=250), n_tf1=Pulsing40(freqCutoff=19 minBlockSize=91 maxBlockSize=250), n_dt1=Block(blocksize=128), n_ti1=PostingsFormat(name=NestedPulsing), range_facet_l=Pulsing40(freqCutoff=19 minBlockSize=91 maxBlockSize=250), text=MockVariableIntBlock(baseBlockSize=18), _version_=Block(blocksize=128), SubjectTerms_mfacet=Block(blocksize=128), a_t=Pulsing40(freqCutoff=19 minBlockSize=91 maxBlockSize=250), n_tdt1=Block(blocksize=128), other_tl1=Block(blocksize=128), n_l1=Pulsing40(freqCutoff=19 minBlockSize=91 maxBlockSize=250), a_si=Block(blocksize=128)}, sim=RandomSimilarityProvider(queryNorm=false,coord=yes): {}, locale=mk, timezone=America/Managua
[junit4:junit4]   2> NOTE: FreeBSD 9.0-RELEASE amd64/Oracle Corporation 1.7.0_06 (64-bit)/cpus=16,threads=1,free=141478360,total=396361728
[junit4:junit4]   2> NOTE: All tests run in this JVM: [TestSolrDeletionPolicy1, DocumentAnalysisRequestHandlerTest, TestSolrCoreProperties, TestPhraseSuggestions, RequiredFieldsTest, DirectSolrSpellCheckerTest, TestSolrXMLSerializer, RAMDirectoryFactoryTest, BasicFunctionalityTest, UUIDFieldTest, TestPropInjectDefaults, SuggesterTSTTest, TestBM25SimilarityFactory, DocumentBuilderTest, SyncSliceTest, TestCSVResponseWriter, DebugComponentTest, TestRemoteStreaming, PingRequestHandlerTest, LukeRequestHandlerTest, PeerSyncTest, UpdateParamsTest, TestOmitPositions, QueryParsingTest, TestFoldingMultitermQuery, OutputWriterTest, FullSolrCloudDistribCmdsTest, StatelessScriptUpdateProcessorFactoryTest, TestReplicationHandler, XsltUpdateRequestHandlerTest, FileUtilsTest, TestDistributedGrouping, XmlUpdateRequestHandlerTest, TestLRUCache, IndexSchemaRuntimeFieldTest, IndexReaderFactoryTest, TestReversedWildcardFilterFactory, TestDocSet, DistributedQueryElevationComponentTest, TestHashPartitioner, EchoParamsTest, TestStressLucene, TestCSVLoader, TestRecovery, TestUtils, TestPropInject, StatsComponentTest, TestWriterPerf, TestArbitraryIndexDir, RecoveryZkTest, LegacyHTMLStripCharFilterTest, TermVectorComponentTest, TestDistributedSearch, TestStressRecovery, URLClassifyProcessorTest, TestQuerySenderListener, SolrCoreTest, DirectUpdateHandlerTest, TestMultiCoreConfBootstrap, TestCoreContainer, ConvertedLegacyTest, TestJmxIntegration, HighlighterTest, TestTrie, CacheHeaderTest, TestWordDelimiterFilterFactory, TestPseudoReturnFields, DistanceFunctionTest, MinimalSchemaTest, JsonLoaderTest, DirectUpdateHandlerOptimizeTest, TestValueSourceCache, ReturnFieldsTest, TestQueryUtils, CSVRequestHandlerTest, ShowFileRequestHandlerTest, SolrCoreCheckLockOnStartupTest, TestIndexingPerformance, PrimitiveFieldTypeTest, BadComponentTest, TestUpdate, HighlighterConfigTest, SOLR749Test, SolrIndexConfigTest, MultiTermTest, TestPerFieldSimilarity, TestDFRSimilarityFactory, TestDefaultSimilarityFactory, DateMathParserTest, OpenExchangeRatesOrgProviderTest, TestSystemIdResolver, SpellingQueryConverterTest, DOMUtilTest, SystemInfoHandlerTest, PreAnalyzedFieldTest, ZkNodePropsTest, TestDocumentBuilder, PathHierarchyTokenizerFactoryTest, BasicDistributedZk2Test]
[junit4:junit4] Completed on J1 in 184.68s, 1 test, 1 failure <<< FAILURES!

[...truncated 5 lines...]
BUILD FAILED
/usr/home/hudson/hudson-slave/workspace/Lucene-Solr-Tests-4.x-java7/build.xml:32: The following error occurred while executing this line:
/usr/home/hudson/hudson-slave/workspace/Lucene-Solr-Tests-4.x-java7/solr/build.xml:146: The following error occurred while executing this line:
/usr/home/hudson/hudson-slave/workspace/Lucene-Solr-Tests-4.x-java7/lucene/module-build.xml:63: The following error occurred while executing this line:
/usr/home/hudson/hudson-slave/workspace/Lucene-Solr-Tests-4.x-java7/lucene/common-build.xml:1133: The following error occurred while executing this line:
/usr/home/hudson/hudson-slave/workspace/Lucene-Solr-Tests-4.x-java7/lucene/common-build.xml:810: There were test failures: 229 suites, 927 tests, 1 failure, 6 ignored (1 assumption)

Total time: 34 minutes 50 seconds
Build step 'Invoke Ant' marked build as failure
Recording test results
Email was triggered for: Failure
Sending email for trigger: Failure



Mime
View raw message