lucene-dev mailing list archives

Site index · List index
Message view « Date » · « Thread »
Top « Date » · « Thread »
From Policeman Jenkins Server <jenk...@sd-datasolutions.de>
Subject [JENKINS] Lucene-Solr-trunk-Linux (64bit/jdk1.8.0-ea-b51) - Build # 794 - Failure!
Date Sat, 01 Sep 2012 04:35:16 GMT
Build: http://jenkins.sd-datasolutions.de/job/Lucene-Solr-trunk-Linux/794/
Java: 64bit/jdk1.8.0-ea-b51 -XX:+UseSerialGC

1 tests failed.
REGRESSION:  org.apache.solr.cloud.ZkSolrClientTest.testWatchChildren

Error Message:
expected:<2> but was:<1>

Stack Trace:
java.lang.AssertionError: expected:<2> but was:<1>
	at __randomizedtesting.SeedInfo.seed([E257F4B98C96A5C5:AA2996A5CB521F7E]:0)
	at org.junit.Assert.fail(Assert.java:93)
	at org.junit.Assert.failNotEquals(Assert.java:647)
	at org.junit.Assert.assertEquals(Assert.java:128)
	at org.junit.Assert.assertEquals(Assert.java:472)
	at org.junit.Assert.assertEquals(Assert.java:456)
	at org.apache.solr.cloud.ZkSolrClientTest.testWatchChildren(ZkSolrClientTest.java:218)
	at sun.reflect.NativeMethodAccessorImpl.invoke0(Native Method)
	at sun.reflect.NativeMethodAccessorImpl.invoke(NativeMethodAccessorImpl.java:57)
	at sun.reflect.DelegatingMethodAccessorImpl.invoke(DelegatingMethodAccessorImpl.java:43)
	at java.lang.reflect.Method.invoke(Method.java:474)
	at com.carrotsearch.randomizedtesting.RandomizedRunner.invoke(RandomizedRunner.java:1559)
	at com.carrotsearch.randomizedtesting.RandomizedRunner.access$600(RandomizedRunner.java:79)
	at com.carrotsearch.randomizedtesting.RandomizedRunner$6.evaluate(RandomizedRunner.java:737)
	at com.carrotsearch.randomizedtesting.RandomizedRunner$7.evaluate(RandomizedRunner.java:773)
	at com.carrotsearch.randomizedtesting.RandomizedRunner$8.evaluate(RandomizedRunner.java:787)
	at com.carrotsearch.randomizedtesting.rules.SystemPropertiesRestoreRule$1.evaluate(SystemPropertiesRestoreRule.java:53)
	at org.apache.lucene.util.TestRuleSetupTeardownChained$1.evaluate(TestRuleSetupTeardownChained.java:50)
	at org.apache.lucene.util.TestRuleFieldCacheSanity$1.evaluate(TestRuleFieldCacheSanity.java:51)
	at org.apache.lucene.util.AbstractBeforeAfterRule$1.evaluate(AbstractBeforeAfterRule.java:45)
	at com.carrotsearch.randomizedtesting.rules.SystemPropertiesInvariantRule$1.evaluate(SystemPropertiesInvariantRule.java:55)
	at org.apache.lucene.util.TestRuleThreadAndTestName$1.evaluate(TestRuleThreadAndTestName.java:48)
	at org.apache.lucene.util.TestRuleIgnoreAfterMaxFailures$1.evaluate(TestRuleIgnoreAfterMaxFailures.java:70)
	at org.apache.lucene.util.TestRuleMarkFailure$1.evaluate(TestRuleMarkFailure.java:48)
	at com.carrotsearch.randomizedtesting.rules.StatementAdapter.evaluate(StatementAdapter.java:36)
	at com.carrotsearch.randomizedtesting.ThreadLeakControl$StatementRunner.run(ThreadLeakControl.java:345)
	at com.carrotsearch.randomizedtesting.ThreadLeakControl.forkTimeoutingTask(ThreadLeakControl.java:769)
	at com.carrotsearch.randomizedtesting.ThreadLeakControl$3.evaluate(ThreadLeakControl.java:429)
	at com.carrotsearch.randomizedtesting.RandomizedRunner.runSingleTest(RandomizedRunner.java:746)
	at com.carrotsearch.randomizedtesting.RandomizedRunner$3.evaluate(RandomizedRunner.java:648)
	at com.carrotsearch.randomizedtesting.RandomizedRunner$4.evaluate(RandomizedRunner.java:682)
	at com.carrotsearch.randomizedtesting.RandomizedRunner$5.evaluate(RandomizedRunner.java:693)
	at com.carrotsearch.randomizedtesting.rules.StatementAdapter.evaluate(StatementAdapter.java:36)
	at com.carrotsearch.randomizedtesting.rules.SystemPropertiesRestoreRule$1.evaluate(SystemPropertiesRestoreRule.java:53)
	at org.apache.lucene.util.AbstractBeforeAfterRule$1.evaluate(AbstractBeforeAfterRule.java:45)
	at org.apache.lucene.util.TestRuleStoreClassName$1.evaluate(TestRuleStoreClassName.java:42)
	at com.carrotsearch.randomizedtesting.rules.SystemPropertiesInvariantRule$1.evaluate(SystemPropertiesInvariantRule.java:55)
	at com.carrotsearch.randomizedtesting.rules.NoShadowingOrOverridesOnMethodsRule$1.evaluate(NoShadowingOrOverridesOnMethodsRule.java:39)
	at com.carrotsearch.randomizedtesting.rules.NoShadowingOrOverridesOnMethodsRule$1.evaluate(NoShadowingOrOverridesOnMethodsRule.java:39)
	at org.apache.lucene.util.TestRuleAssertionsRequired$1.evaluate(TestRuleAssertionsRequired.java:40)
	at org.apache.lucene.util.TestRuleMarkFailure$1.evaluate(TestRuleMarkFailure.java:48)
	at org.apache.lucene.util.TestRuleIgnoreAfterMaxFailures$1.evaluate(TestRuleIgnoreAfterMaxFailures.java:70)
	at org.apache.lucene.util.TestRuleIgnoreTestSuites$1.evaluate(TestRuleIgnoreTestSuites.java:55)
	at com.carrotsearch.randomizedtesting.rules.StatementAdapter.evaluate(StatementAdapter.java:36)
	at com.carrotsearch.randomizedtesting.ThreadLeakControl$StatementRunner.run(ThreadLeakControl.java:345)
	at java.lang.Thread.run(Thread.java:722)




Build Log:
[...truncated 7025 lines...]
[junit4:junit4] Suite: org.apache.solr.cloud.ZkSolrClientTest
[junit4:junit4]   2> 9748 T1782 oasu.AbstractSolrTestCase.setUp ####SETUP_START testReconnect
[junit4:junit4]   2> 9748 T1782 oasu.AbstractSolrTestCase.setUp ####SETUP_END testReconnect
[junit4:junit4]   2> 9749 T1782 oasc.ZkTestServer.run STARTING ZK TEST SERVER
[junit4:junit4]   2> 9750 T1783 oazs.ZooKeeperServer.setTickTime tickTime set to 3000
[junit4:junit4]   2> 9750 T1783 oazs.NIOServerCnxn$Factory.<init> binding to port
0.0.0.0/0.0.0.0:0
[junit4:junit4]   2> 9750 T1783 oazsp.FileTxnSnapLog.save Snapshotting: 0
[junit4:junit4]   2> 9849 T1782 oasc.ZkTestServer.run start zk server on port:42966
[junit4:junit4]   2> 9850 T1782 oaz.ZooKeeper.<init> Initiating client connection,
connectString=127.0.0.1:42966 sessionTimeout=10000 watcher=org.apache.solr.common.cloud.ConnectionManager@47c65448
[junit4:junit4]   2> 9850 T1788 oaz.ClientCnxn$SendThread.startConnect Opening socket connection
to server /127.0.0.1:42966
[junit4:junit4]   2> 9850 T1782 oascc.ConnectionManager.waitForConnected Waiting for client
to connect to ZooKeeper
[junit4:junit4]   2> 9850 T1788 oaz.ClientCnxn$SendThread.primeConnection Socket connection
established to localhost.localdomain/127.0.0.1:42966, initiating session
[junit4:junit4]   2> 9851 T1784 oazs.NIOServerCnxn$Factory.run Accepted socket connection
from /127.0.0.1:36039
[junit4:junit4]   2> 9851 T1784 oazs.NIOServerCnxn.readConnectRequest Client attempting
to establish new session at /127.0.0.1:36039
[junit4:junit4]   2> 9851 T1786 oazsp.FileTxnLog.append Creating new log file: log.1
[junit4:junit4]   2> 9986 T1786 oazs.NIOServerCnxn.finishSessionInit Established session
0x139801482230000 with negotiated timeout 10000 for client /127.0.0.1:36039
[junit4:junit4]   2> 9986 T1788 oaz.ClientCnxn$SendThread.readConnectResult Session establishment
complete on server localhost.localdomain/127.0.0.1:42966, sessionid = 0x139801482230000, negotiated
timeout = 10000
[junit4:junit4]   2> 9987 T1789 oascc.ConnectionManager.process Watcher org.apache.solr.common.cloud.ConnectionManager@47c65448
name:ZooKeeperConnection Watcher:127.0.0.1:42966 got event WatchedEvent state:SyncConnected
type:None path:null path:null type:None
[junit4:junit4]   2> 9987 T1782 oascc.ConnectionManager.waitForConnected Client is connected
to ZooKeeper
[junit4:junit4]   2> 9987 T1782 oascc.SolrZkClient.makePath makePath: /solr
[junit4:junit4]   2> 9989 T1787 oazs.PrepRequestProcessor.pRequest Processed session termination
for sessionid: 0x139801482230000
[junit4:junit4]   2> 9990 T1789 oaz.ClientCnxn$EventThread.run EventThread shut down
[junit4:junit4]   2> 9990 T1784 oazs.NIOServerCnxn.closeSock Closed socket connection for
client /127.0.0.1:36039 which had sessionid 0x139801482230000
[junit4:junit4]   2> 9990 T1782 oaz.ZooKeeper.close Session: 0x139801482230000 closed
[junit4:junit4]   2> 9990 T1782 oaz.ZooKeeper.<init> Initiating client connection,
connectString=127.0.0.1:42966/solr sessionTimeout=10000 watcher=org.apache.solr.common.cloud.ConnectionManager@380b3cd5
[junit4:junit4]   2> 9991 T1790 oaz.ClientCnxn$SendThread.startConnect Opening socket connection
to server /127.0.0.1:42966
[junit4:junit4]   2> 9991 T1782 oascc.ConnectionManager.waitForConnected Waiting for client
to connect to ZooKeeper
[junit4:junit4]   2> 9991 T1784 oazs.NIOServerCnxn$Factory.run Accepted socket connection
from /127.0.0.1:36040
[junit4:junit4]   2> 9991 T1790 oaz.ClientCnxn$SendThread.primeConnection Socket connection
established to localhost.localdomain/127.0.0.1:42966, initiating session
[junit4:junit4]   2> 9992 T1784 oazs.NIOServerCnxn.readConnectRequest Client attempting
to establish new session at /127.0.0.1:36040
[junit4:junit4]   2> 9992 T1786 oazs.NIOServerCnxn.finishSessionInit Established session
0x139801482230001 with negotiated timeout 10000 for client /127.0.0.1:36040
[junit4:junit4]   2> 9992 T1790 oaz.ClientCnxn$SendThread.readConnectResult Session establishment
complete on server localhost.localdomain/127.0.0.1:42966, sessionid = 0x139801482230001, negotiated
timeout = 10000
[junit4:junit4]   2> 9992 T1791 oascc.ConnectionManager.process Watcher org.apache.solr.common.cloud.ConnectionManager@380b3cd5
name:ZooKeeperConnection Watcher:127.0.0.1:42966/solr got event WatchedEvent state:SyncConnected
type:None path:null path:null type:None
[junit4:junit4]   2> 9992 T1782 oascc.ConnectionManager.waitForConnected Client is connected
to ZooKeeper
[junit4:junit4]   2> 9993 T1782 oascc.SolrZkClient.makePath makePath: /collections/collection1/shards
[junit4:junit4]   2> 9994 T1782 oascc.SolrZkClient.makePath makePath: collections/collection1
[junit4:junit4]   2> 9995 T1787 oazs.PrepRequestProcessor.run PrepRequestProcessor exited
loop!
[junit4:junit4]   2> 9995 T1786 oazs.SyncRequestProcessor.run SyncRequestProcessor exited!
[junit4:junit4]   2> 9995 T1782 oazs.FinalRequestProcessor.shutdown shutdown of request
processor complete
[junit4:junit4]   2> 9997 T1782 oazs.NIOServerCnxn.closeSock Closed socket connection for
client /127.0.0.1:36040 which had sessionid 0x139801482230001
[junit4:junit4]   2> 9997 T1790 oaz.ClientCnxn$SendThread.run Unable to read additional
data from server sessionid 0x139801482230001, likely server has closed socket, closing socket
connection and attempting reconnect
[junit4:junit4]   2> 9997 T1784 oazs.NIOServerCnxn$Factory.run NIOServerCnxn factory exited
run method
[junit4:junit4]   2> 9998 T1782 oazs.FinalRequestProcessor.shutdown shutdown of request
processor complete
[junit4:junit4]   2> 10078 T1782 oascc.SolrZkClient.makePath makePath: collections/collection2
[junit4:junit4]   2> 10097 T1791 oascc.ConnectionManager.process Watcher org.apache.solr.common.cloud.ConnectionManager@380b3cd5
name:ZooKeeperConnection Watcher:127.0.0.1:42966/solr got event WatchedEvent state:Disconnected
type:None path:null path:null type:None
[junit4:junit4]   2> 10097 T1782 oasc.ZkTestServer.run STARTING ZK TEST SERVER
[junit4:junit4]   2> 10098 T1791 oascc.ConnectionManager.process zkClient has disconnected
[junit4:junit4]   2> 10098 T1792 oazs.ZooKeeperServer.setTickTime tickTime set to 3000
[junit4:junit4]   2> 10098 T1792 oazs.NIOServerCnxn$Factory.<init> binding to port
0.0.0.0/0.0.0.0:42966
[junit4:junit4]   2> 10099 T1792 oazsp.FileSnap.deserialize Reading snapshot /mnt/ssd/jenkins/workspace/Lucene-Solr-trunk-Linux/solr/build/solr-core/test/J1/./org.apache.solr.cloud.ZkSolrClientTest-1346473591328/zookeeper/server1/data/version-2/snapshot.0
[junit4:junit4]   2> 10099 T1792 oazsp.FileTxnSnapLog.save Snapshotting: 8
[junit4:junit4]   2> 10198 T1782 oasc.ZkTestServer.run start zk server on port:42966
[junit4:junit4]   2> 10798 T1782 oascc.SolrZkClient.makePath makePath: collections/collection3
[junit4:junit4]   2> 11426 T1785 oazs.SessionTrackerImpl.run SessionTrackerImpl exited
loop!
[junit4:junit4]   2> 11723 T1790 oaz.ClientCnxn$SendThread.startConnect Opening socket
connection to server localhost.localdomain/127.0.0.1:42966
[junit4:junit4]   2> 11723 T1790 oaz.ClientCnxn$SendThread.primeConnection Socket connection
established to localhost.localdomain/127.0.0.1:42966, initiating session
[junit4:junit4]   2> 11723 T1793 oazs.NIOServerCnxn$Factory.run Accepted socket connection
from /127.0.0.1:36042
[junit4:junit4]   2> 11723 T1793 oazs.NIOServerCnxn.readConnectRequest Client attempting
to renew session 0x139801482230001 at /127.0.0.1:36042
[junit4:junit4]   2> 11724 T1793 oazs.NIOServerCnxn.finishSessionInit Established session
0x139801482230001 with negotiated timeout 10000 for client /127.0.0.1:36042
[junit4:junit4]   2> 11724 T1790 oaz.ClientCnxn$SendThread.readConnectResult Session establishment
complete on server localhost.localdomain/127.0.0.1:42966, sessionid = 0x139801482230001, negotiated
timeout = 10000
[junit4:junit4]   2> 11724 T1791 oascc.ConnectionManager.process Watcher org.apache.solr.common.cloud.ConnectionManager@380b3cd5
name:ZooKeeperConnection Watcher:127.0.0.1:42966/solr got event WatchedEvent state:SyncConnected
type:None path:null path:null type:None
[junit4:junit4]   2> 11725 T1795 oazsp.FileTxnLog.append Creating new log file: log.9
[junit4:junit4]   2> 11727 T1782 oazs.ZooKeeperServer.expire Expiring session 0x139801482230001,
timeout of 4000ms exceeded
[junit4:junit4]   2> 11728 T1796 oazs.PrepRequestProcessor.pRequest Processed session termination
for sessionid: 0x139801482230001
[junit4:junit4]   2> 11728 T1795 oazs.NIOServerCnxn.closeSock Closed socket connection
for client /127.0.0.1:36042 which had sessionid 0x139801482230001
[junit4:junit4]   2> 11729 T1790 oaz.ClientCnxn$SendThread.run Unable to read additional
data from server sessionid 0x139801482230001, likely server has closed socket, closing socket
connection and attempting reconnect
[junit4:junit4]   2> 11829 T1791 oascc.ConnectionManager.process Watcher org.apache.solr.common.cloud.ConnectionManager@380b3cd5
name:ZooKeeperConnection Watcher:127.0.0.1:42966/solr got event WatchedEvent state:Disconnected
type:None path:null path:null type:None
[junit4:junit4]   2> 11829 T1791 oascc.ConnectionManager.process zkClient has disconnected
[junit4:junit4]   2> 12728 T1782 oascc.SolrZkClient.makePath makePath: collections/collection4
[junit4:junit4]   2> 13219 T1790 oaz.ClientCnxn$SendThread.startConnect Opening socket
connection to server localhost.localdomain/127.0.0.1:42966
[junit4:junit4]   2> 13220 T1790 oaz.ClientCnxn$SendThread.primeConnection Socket connection
established to localhost.localdomain/127.0.0.1:42966, initiating session
[junit4:junit4]   2> 13220 T1793 oazs.NIOServerCnxn$Factory.run Accepted socket connection
from /127.0.0.1:36043
[junit4:junit4]   2> 13220 T1793 oazs.NIOServerCnxn.readConnectRequest Client attempting
to renew session 0x139801482230001 at /127.0.0.1:36043
[junit4:junit4]   2> 13220 T1793 oazs.NIOServerCnxn.finishSessionInit Invalid session 0x139801482230001
for client /127.0.0.1:36043, probably expired
[junit4:junit4]   2> 13220 T1791 oascc.ConnectionManager.process Watcher org.apache.solr.common.cloud.ConnectionManager@380b3cd5
name:ZooKeeperConnection Watcher:127.0.0.1:42966/solr got event WatchedEvent state:Expired
type:None path:null path:null type:None
[junit4:junit4]   2> 13220 T1790 oaz.ClientCnxn$SendThread.run Unable to reconnect to ZooKeeper
service, session 0x139801482230001 has expired, closing socket connection
[junit4:junit4]   2> 13220 T1791 oascc.ConnectionManager.process Our previous ZooKeeper
session was expired. Attempting to reconnect to recover relationship with ZooKeeper...
[junit4:junit4]   2> 13221 T1793 oazs.NIOServerCnxn.closeSock Closed socket connection
for client /127.0.0.1:36043 which had sessionid 0x139801482230001
[junit4:junit4]   2> 13221 T1791 oascc.DefaultConnectionStrategy.reconnect Connection expired
- starting a new one...
[junit4:junit4]   2> 13221 T1791 oaz.ZooKeeper.<init> Initiating client connection,
connectString=127.0.0.1:42966/solr sessionTimeout=10000 watcher=org.apache.solr.common.cloud.ConnectionManager@380b3cd5
[junit4:junit4]   2> 13221 T1797 oaz.ClientCnxn$SendThread.startConnect Opening socket
connection to server /127.0.0.1:42966
[junit4:junit4]   2> 13221 T1791 oascc.ConnectionManager.waitForConnected Waiting for client
to connect to ZooKeeper
[junit4:junit4]   2> 13222 T1797 oaz.ClientCnxn$SendThread.primeConnection Socket connection
established to localhost.localdomain/127.0.0.1:42966, initiating session
[junit4:junit4]   2> 13222 T1793 oazs.NIOServerCnxn$Factory.run Accepted socket connection
from /127.0.0.1:36044
[junit4:junit4]   2> 13222 T1793 oazs.NIOServerCnxn.readConnectRequest Client attempting
to establish new session at /127.0.0.1:36044
[junit4:junit4]   2> 13223 T1795 oazs.NIOServerCnxn.finishSessionInit Established session
0x139801483800000 with negotiated timeout 10000 for client /127.0.0.1:36044
[junit4:junit4]   2> 13223 T1797 oaz.ClientCnxn$SendThread.readConnectResult Session establishment
complete on server localhost.localdomain/127.0.0.1:42966, sessionid = 0x139801483800000, negotiated
timeout = 10000
[junit4:junit4]   2> 13223 T1798 oascc.ConnectionManager.process Watcher org.apache.solr.common.cloud.ConnectionManager@380b3cd5
name:ZooKeeperConnection Watcher:127.0.0.1:42966/solr got event WatchedEvent state:SyncConnected
type:None path:null path:null type:None
[junit4:junit4]   2> 13224 T1791 oascc.ConnectionManager.waitForConnected Client is connected
to ZooKeeper
[junit4:junit4]   2> 13224 T1791 oascc.ConnectionManager$1.update Connection with ZooKeeper
reestablished.
[junit4:junit4]   2> 13224 T1791 oascc.DefaultConnectionStrategy.reconnect Reconnected
to ZooKeeper
[junit4:junit4]   2> 13224 T1791 oascc.ConnectionManager.process Connected:true
[junit4:junit4]   2> 13224 T1791 oaz.ClientCnxn$EventThread.run EventThread shut down
[junit4:junit4]   2> 13321 T1782 oascc.SolrZkClient.makePath makePath: collections/collection4
[junit4:junit4]   2> 13322 T1796 oazs.PrepRequestProcessor.pRequest Processed session termination
for sessionid: 0x139801483800000
[junit4:junit4]   2> 13323 T1798 oaz.ClientCnxn$EventThread.run EventThread shut down
[junit4:junit4]   2> 13323 T1782 oaz.ZooKeeper.close Session: 0x139801483800000 closed
[junit4:junit4]   2> 13323 T1793 oazs.NIOServerCnxn.closeSock Closed socket connection
for client /127.0.0.1:36044 which had sessionid 0x139801483800000
[junit4:junit4]   2> 13323 T1795 oazs.SyncRequestProcessor.run SyncRequestProcessor exited!
[junit4:junit4]   2> 13323 T1796 oazs.PrepRequestProcessor.run PrepRequestProcessor exited
loop!
[junit4:junit4]   2> 13324 T1782 oazs.FinalRequestProcessor.shutdown shutdown of request
processor complete
[junit4:junit4]   2> 13325 T1793 oazs.NIOServerCnxn$Factory.run NIOServerCnxn factory exited
run method
[junit4:junit4]   2> 13326 T1782 oazs.FinalRequestProcessor.shutdown shutdown of request
processor complete
[junit4:junit4]   2> 13326 T1782 oasu.AbstractSolrTestCase.tearDown ####TEARDOWN_START
testReconnect
[junit4:junit4]   2> 13332 T1782 oasu.AbstractSolrTestCase.setUp ####SETUP_START testConnect
[junit4:junit4]   2> 13333 T1782 oasu.AbstractSolrTestCase.setUp ####SETUP_END testConnect
[junit4:junit4]   2> 13333 T1782 oasc.ZkTestServer.run STARTING ZK TEST SERVER
[junit4:junit4]   2> 13334 T1799 oazs.ZooKeeperServer.setTickTime tickTime set to 3000
[junit4:junit4]   2> 13334 T1799 oazs.NIOServerCnxn$Factory.<init> binding to port
0.0.0.0/0.0.0.0:0
[junit4:junit4]   2> 13335 T1799 oazsp.FileTxnSnapLog.save Snapshotting: 0
[junit4:junit4]   2> 13433 T1782 oasc.ZkTestServer.run start zk server on port:35553
[junit4:junit4]   2> 13434 T1782 oaz.ZooKeeper.<init> Initiating client connection,
connectString=127.0.0.1:35553/solr sessionTimeout=10000 watcher=org.apache.solr.common.cloud.ConnectionManager@7f4a0164
[junit4:junit4]   2> 13434 T1804 oaz.ClientCnxn$SendThread.startConnect Opening socket
connection to server /127.0.0.1:35553
[junit4:junit4]   2> 13434 T1782 oascc.ConnectionManager.waitForConnected Waiting for client
to connect to ZooKeeper
[junit4:junit4]   2> 13435 T1804 oaz.ClientCnxn$SendThread.primeConnection Socket connection
established to localhost.localdomain/127.0.0.1:35553, initiating session
[junit4:junit4]   2> 13435 T1800 oazs.NIOServerCnxn$Factory.run Accepted socket connection
from /127.0.0.1:33537
[junit4:junit4]   2> 13435 T1800 oazs.NIOServerCnxn.readConnectRequest Client attempting
to establish new session at /127.0.0.1:33537
[junit4:junit4]   2> 13435 T1802 oazsp.FileTxnLog.append Creating new log file: log.1
[junit4:junit4]   2> 13517 T1802 oazs.NIOServerCnxn.finishSessionInit Established session
0x139801490230000 with negotiated timeout 10000 for client /127.0.0.1:33537
[junit4:junit4]   2> 13517 T1804 oaz.ClientCnxn$SendThread.readConnectResult Session establishment
complete on server localhost.localdomain/127.0.0.1:35553, sessionid = 0x139801490230000, negotiated
timeout = 10000
[junit4:junit4]   2> 13517 T1805 oascc.ConnectionManager.process Watcher org.apache.solr.common.cloud.ConnectionManager@7f4a0164
name:ZooKeeperConnection Watcher:127.0.0.1:35553/solr got event WatchedEvent state:SyncConnected
type:None path:null path:null type:None
[junit4:junit4]   2> 13517 T1782 oascc.ConnectionManager.waitForConnected Client is connected
to ZooKeeper
[junit4:junit4]   2> 13518 T1803 oazs.PrepRequestProcessor.pRequest Processed session termination
for sessionid: 0x139801490230000
[junit4:junit4]   2> 13519 T1805 oaz.ClientCnxn$EventThread.run EventThread shut down
[junit4:junit4]   2> 13519 T1782 oaz.ZooKeeper.close Session: 0x139801490230000 closed
[junit4:junit4]   2> 13519 T1800 oazs.NIOServerCnxn.closeSock Closed socket connection
for client /127.0.0.1:33537 which had sessionid 0x139801490230000
[junit4:junit4]   2> 13519 T1802 oazs.SyncRequestProcessor.run SyncRequestProcessor exited!
[junit4:junit4]   2> 13519 T1803 oazs.PrepRequestProcessor.run PrepRequestProcessor exited
loop!
[junit4:junit4]   2> 13520 T1782 oazs.FinalRequestProcessor.shutdown shutdown of request
processor complete
[junit4:junit4]   2> 13521 T1800 oazs.NIOServerCnxn$Factory.run NIOServerCnxn factory exited
run method
[junit4:junit4]   2> 13522 T1782 oazs.FinalRequestProcessor.shutdown shutdown of request
processor complete
[junit4:junit4]   2> 13522 T1782 oasu.AbstractSolrTestCase.tearDown ####TEARDOWN_START
testConnect
[junit4:junit4]   2> 13526 T1782 oasu.AbstractSolrTestCase.setUp ####SETUP_START testMakeRootNode
[junit4:junit4]   2> 13527 T1782 oasu.AbstractSolrTestCase.setUp ####SETUP_END testMakeRootNode
[junit4:junit4]   2> 13527 T1782 oasc.ZkTestServer.run STARTING ZK TEST SERVER
[junit4:junit4]   2> 13528 T1806 oazs.ZooKeeperServer.setTickTime tickTime set to 3000
[junit4:junit4]   2> 13528 T1806 oazs.NIOServerCnxn$Factory.<init> binding to port
0.0.0.0/0.0.0.0:0
[junit4:junit4]   2> 13528 T1806 oazsp.FileTxnSnapLog.save Snapshotting: 0
[junit4:junit4]   2> 13627 T1782 oasc.ZkTestServer.run start zk server on port:51851
[junit4:junit4]   2> 13628 T1782 oaz.ZooKeeper.<init> Initiating client connection,
connectString=127.0.0.1:51851 sessionTimeout=10000 watcher=org.apache.solr.common.cloud.ConnectionManager@37d82bdb
[junit4:junit4]   2> 13628 T1811 oaz.ClientCnxn$SendThread.startConnect Opening socket
connection to server /127.0.0.1:51851
[junit4:junit4]   2> 13628 T1782 oascc.ConnectionManager.waitForConnected Waiting for client
to connect to ZooKeeper
[junit4:junit4]   2> 13628 T1811 oaz.ClientCnxn$SendThread.primeConnection Socket connection
established to localhost.localdomain/127.0.0.1:51851, initiating session
[junit4:junit4]   2> 13629 T1807 oazs.NIOServerCnxn$Factory.run Accepted socket connection
from /127.0.0.1:54426
[junit4:junit4]   2> 13629 T1807 oazs.NIOServerCnxn.readConnectRequest Client attempting
to establish new session at /127.0.0.1:54426
[junit4:junit4]   2> 13629 T1809 oazsp.FileTxnLog.append Creating new log file: log.1
[junit4:junit4]   2> 13687 T1809 oazs.NIOServerCnxn.finishSessionInit Established session
0x139801490e50000 with negotiated timeout 10000 for client /127.0.0.1:54426
[junit4:junit4]   2> 13687 T1811 oaz.ClientCnxn$SendThread.readConnectResult Session establishment
complete on server localhost.localdomain/127.0.0.1:51851, sessionid = 0x139801490e50000, negotiated
timeout = 10000
[junit4:junit4]   2> 13687 T1812 oascc.ConnectionManager.process Watcher org.apache.solr.common.cloud.ConnectionManager@37d82bdb
name:ZooKeeperConnection Watcher:127.0.0.1:51851 got event WatchedEvent state:SyncConnected
type:None path:null path:null type:None
[junit4:junit4]   2> 13687 T1782 oascc.ConnectionManager.waitForConnected Client is connected
to ZooKeeper
[junit4:junit4]   2> 13687 T1782 oascc.SolrZkClient.makePath makePath: /solr
[junit4:junit4]   2> 13690 T1810 oazs.PrepRequestProcessor.pRequest Processed session termination
for sessionid: 0x139801490e50000
[junit4:junit4]   2> 13690 T1812 oaz.ClientCnxn$EventThread.run EventThread shut down
[junit4:junit4]   2> 13690 T1782 oaz.ZooKeeper.close Session: 0x139801490e50000 closed
[junit4:junit4]   2> 13690 T1807 oazs.NIOServerCnxn.doIO WARNING EndOfStreamException:
Unable to read additional data from client sessionid 0x139801490e50000, likely client has
closed socket
[junit4:junit4]   2> 13690 T1782 oaz.ZooKeeper.<init> Initiating client connection,
connectString=127.0.0.1:51851 sessionTimeout=10000 watcher=org.apache.solr.common.cloud.ConnectionManager@844013d
[junit4:junit4]   2> 13691 T1807 oazs.NIOServerCnxn.closeSock Closed socket connection
for client /127.0.0.1:54426 which had sessionid 0x139801490e50000
[junit4:junit4]   2> 13691 T1813 oaz.ClientCnxn$SendThread.startConnect Opening socket
connection to server /127.0.0.1:51851
[junit4:junit4]   2> 13691 T1782 oascc.ConnectionManager.waitForConnected Waiting for client
to connect to ZooKeeper
[junit4:junit4]   2> 13692 T1813 oaz.ClientCnxn$SendThread.primeConnection Socket connection
established to localhost.localdomain/127.0.0.1:51851, initiating session
[junit4:junit4]   2> 13692 T1807 oazs.NIOServerCnxn$Factory.run Accepted socket connection
from /127.0.0.1:54427
[junit4:junit4]   2> 13692 T1807 oazs.NIOServerCnxn.readConnectRequest Client attempting
to establish new session at /127.0.0.1:54427
[junit4:junit4]   2> 13692 T1809 oazs.NIOServerCnxn.finishSessionInit Established session
0x139801490e50001 with negotiated timeout 10000 for client /127.0.0.1:54427
[junit4:junit4]   2> 13692 T1813 oaz.ClientCnxn$SendThread.readConnectResult Session establishment
complete on server localhost.localdomain/127.0.0.1:51851, sessionid = 0x139801490e50001, negotiated
timeout = 10000
[junit4:junit4]   2> 13693 T1814 oascc.ConnectionManager.process Watcher org.apache.solr.common.cloud.ConnectionManager@844013d
name:ZooKeeperConnection Watcher:127.0.0.1:51851 got event WatchedEvent state:SyncConnected
type:None path:null path:null type:None
[junit4:junit4]   2> 13693 T1782 oascc.ConnectionManager.waitForConnected Client is connected
to ZooKeeper
[junit4:junit4]   2> 13693 T1810 oazs.PrepRequestProcessor.pRequest Processed session termination
for sessionid: 0x139801490e50001
[junit4:junit4]   2> 13694 T1814 oaz.ClientCnxn$EventThread.run EventThread shut down
[junit4:junit4]   2> 13694 T1782 oaz.ZooKeeper.close Session: 0x139801490e50001 closed
[junit4:junit4]   2> 13694 T1807 oazs.NIOServerCnxn.closeSock Closed socket connection
for client /127.0.0.1:54427 which had sessionid 0x139801490e50001
[junit4:junit4]   2> 13694 T1810 oazs.PrepRequestProcessor.run PrepRequestProcessor exited
loop!
[junit4:junit4]   2> 13694 T1809 oazs.SyncRequestProcessor.run SyncRequestProcessor exited!
[junit4:junit4]   2> 13695 T1782 oazs.FinalRequestProcessor.shutdown shutdown of request
processor complete
[junit4:junit4]   2> 13696 T1807 oazs.NIOServerCnxn$Factory.run NIOServerCnxn factory exited
run method
[junit4:junit4]   2> 13697 T1782 oazs.FinalRequestProcessor.shutdown shutdown of request
processor complete
[junit4:junit4]   2> 13697 T1782 oasu.AbstractSolrTestCase.tearDown ####TEARDOWN_START
testMakeRootNode
[junit4:junit4]   2> 13701 T1782 oasu.AbstractSolrTestCase.setUp ####SETUP_START testWatchChildren
[junit4:junit4]   2> 13702 T1782 oasu.AbstractSolrTestCase.setUp ####SETUP_END testWatchChildren
[junit4:junit4]   2> 13702 T1782 oasc.ZkTestServer.run STARTING ZK TEST SERVER
[junit4:junit4]   2> 13703 T1815 oazs.ZooKeeperServer.setTickTime tickTime set to 3000
[junit4:junit4]   2> 13703 T1815 oazs.NIOServerCnxn$Factory.<init> binding to port
0.0.0.0/0.0.0.0:0
[junit4:junit4]   2> 13704 T1815 oazsp.FileTxnSnapLog.save Snapshotting: 0
[junit4:junit4]   2> 13802 T1782 oasc.ZkTestServer.run start zk server on port:52043
[junit4:junit4]   2> 14203 T1782 oaz.ZooKeeper.<init> Initiating client connection,
connectString=127.0.0.1:52043 sessionTimeout=10000 watcher=org.apache.solr.common.cloud.ConnectionManager@7dd2458d
[junit4:junit4]   2> 14204 T1820 oaz.ClientCnxn$SendThread.startConnect Opening socket
connection to server /127.0.0.1:52043
[junit4:junit4]   2> 14204 T1782 oascc.ConnectionManager.waitForConnected Waiting for client
to connect to ZooKeeper
[junit4:junit4]   2> 14204 T1820 oaz.ClientCnxn$SendThread.primeConnection Socket connection
established to localhost.localdomain/127.0.0.1:52043, initiating session
[junit4:junit4]   2> 14204 T1816 oazs.NIOServerCnxn$Factory.run Accepted socket connection
from /127.0.0.1:43046
[junit4:junit4]   2> 14204 T1816 oazs.NIOServerCnxn.readConnectRequest Client attempting
to establish new session at /127.0.0.1:43046
[junit4:junit4]   2> 14205 T1818 oazsp.FileTxnLog.append Creating new log file: log.1
[junit4:junit4]   2> 14267 T1818 oazs.NIOServerCnxn.finishSessionInit Established session
0x139801491940000 with negotiated timeout 10000 for client /127.0.0.1:43046
[junit4:junit4]   2> 14267 T1820 oaz.ClientCnxn$SendThread.readConnectResult Session establishment
complete on server localhost.localdomain/127.0.0.1:52043, sessionid = 0x139801491940000, negotiated
timeout = 10000
[junit4:junit4]   2> 14267 T1821 oascc.ConnectionManager.process Watcher org.apache.solr.common.cloud.ConnectionManager@7dd2458d
name:ZooKeeperConnection Watcher:127.0.0.1:52043 got event WatchedEvent state:SyncConnected
type:None path:null path:null type:None
[junit4:junit4]   2> 14267 T1782 oascc.ConnectionManager.waitForConnected Client is connected
to ZooKeeper
[junit4:junit4]   2> 14267 T1782 oascc.SolrZkClient.makePath makePath: /solr
[junit4:junit4]   2> 14269 T1819 oazs.PrepRequestProcessor.pRequest Processed session termination
for sessionid: 0x139801491940000
[junit4:junit4]   2> 14270 T1821 oaz.ClientCnxn$EventThread.run EventThread shut down
[junit4:junit4]   2> 14270 T1782 oaz.ZooKeeper.close Session: 0x139801491940000 closed
[junit4:junit4]   2> 14270 T1816 oazs.NIOServerCnxn.closeSock Closed socket connection
for client /127.0.0.1:43046 which had sessionid 0x139801491940000
[junit4:junit4]   2> 14270 T1782 oaz.ZooKeeper.<init> Initiating client connection,
connectString=127.0.0.1:52043/solr sessionTimeout=10000 watcher=org.apache.solr.common.cloud.ConnectionManager@6dd15e9c
[junit4:junit4]   2> 14271 T1822 oaz.ClientCnxn$SendThread.startConnect Opening socket
connection to server /127.0.0.1:52043
[junit4:junit4]   2> 14271 T1782 oascc.ConnectionManager.waitForConnected Waiting for client
to connect to ZooKeeper
[junit4:junit4]   2> 14271 T1822 oaz.ClientCnxn$SendThread.primeConnection Socket connection
established to localhost.localdomain/127.0.0.1:52043, initiating session
[junit4:junit4]   2> 14271 T1816 oazs.NIOServerCnxn$Factory.run Accepted socket connection
from /127.0.0.1:43047
[junit4:junit4]   2> 14271 T1816 oazs.NIOServerCnxn.readConnectRequest Client attempting
to establish new session at /127.0.0.1:43047
[junit4:junit4]   2> 14272 T1818 oazs.NIOServerCnxn.finishSessionInit Established session
0x139801491940001 with negotiated timeout 10000 for client /127.0.0.1:43047
[junit4:junit4]   2> 14272 T1822 oaz.ClientCnxn$SendThread.readConnectResult Session establishment
complete on server localhost.localdomain/127.0.0.1:52043, sessionid = 0x139801491940001, negotiated
timeout = 10000
[junit4:junit4]   2> 14272 T1823 oascc.ConnectionManager.process Watcher org.apache.solr.common.cloud.ConnectionManager@6dd15e9c
name:ZooKeeperConnection Watcher:127.0.0.1:52043/solr got event WatchedEvent state:SyncConnected
type:None path:null path:null type:None
[junit4:junit4]   2> 14272 T1782 oascc.ConnectionManager.waitForConnected Client is connected
to ZooKeeper
[junit4:junit4]   2> 14272 T1782 oascc.SolrZkClient.makePath makePath: /collections
[junit4:junit4]   2> 14274 T1782 oascc.SolrZkClient.makePath makePath: /collections/collection99/shards
[junit4:junit4]   2> 14276 T1782 oascc.SolrZkClient.makePath makePath: collections/collection99/config=collection1
[junit4:junit4]   2> 14277 T1782 oascc.SolrZkClient.makePath makePath: collections/collection99/config=collection3
[junit4:junit4]   2> 14278 T1782 oascc.SolrZkClient.makePath makePath: /collections/collection97/shards
[junit4:junit4]   2> 14420 T1801 oazs.SessionTrackerImpl.run SessionTrackerImpl exited
loop!
[junit4:junit4]   2> 14420 T1808 oazs.SessionTrackerImpl.run SessionTrackerImpl exited
loop!
[junit4:junit4]   2> 14420 T1794 oazs.SessionTrackerImpl.run SessionTrackerImpl exited
loop!
[junit4:junit4]   2> 22980 T1819 oazs.PrepRequestProcessor.pRequest Processed session termination
for sessionid: 0x139801491940001
[junit4:junit4]   2> 22981 T1823 oaz.ClientCnxn$EventThread.run EventThread shut down
[junit4:junit4]   2> 22981 T1816 oazs.NIOServerCnxn.closeSock Closed socket connection
for client /127.0.0.1:43047 which had sessionid 0x139801491940001
[junit4:junit4]   2> 22981 T1782 oaz.ZooKeeper.close Session: 0x139801491940001 closed
[junit4:junit4]   2> 22981 T1818 oazs.SyncRequestProcessor.run SyncRequestProcessor exited!
[junit4:junit4]   2> 22981 T1819 oazs.PrepRequestProcessor.run PrepRequestProcessor exited
loop!
[junit4:junit4]   2> 22982 T1782 oazs.FinalRequestProcessor.shutdown shutdown of request
processor complete
[junit4:junit4]   2> 22983 T1816 oazs.NIOServerCnxn$Factory.run NIOServerCnxn factory exited
run method
[junit4:junit4]   2> 22984 T1782 oazs.FinalRequestProcessor.shutdown shutdown of request
processor complete
[junit4:junit4]   2> 22984 T1782 oasu.AbstractSolrTestCase.tearDown ####TEARDOWN_START
testWatchChildren
[junit4:junit4]   2> NOTE: reproduce with: ant test  -Dtestcase=ZkSolrClientTest -Dtests.method=testWatchChildren
-Dtests.seed=E257F4B98C96A5C5 -Dtests.multiplier=3 -Dtests.slow=true -Dtests.locale=sk_SK
-Dtests.timezone=Asia/Aqtau -Dtests.file.encoding=UTF-8
[junit4:junit4] FAILURE 9.29s J1 | ZkSolrClientTest.testWatchChildren <<<
[junit4:junit4]    > Throwable #1: java.lang.AssertionError: expected:<2> but was:<1>
[junit4:junit4]    > 	at __randomizedtesting.SeedInfo.seed([E257F4B98C96A5C5:AA2996A5CB521F7E]:0)
[junit4:junit4]    > 	at org.junit.Assert.fail(Assert.java:93)
[junit4:junit4]    > 	at org.junit.Assert.failNotEquals(Assert.java:647)
[junit4:junit4]    > 	at org.junit.Assert.assertEquals(Assert.java:128)
[junit4:junit4]    > 	at org.junit.Assert.assertEquals(Assert.java:472)
[junit4:junit4]    > 	at org.junit.Assert.assertEquals(Assert.java:456)
[junit4:junit4]    > 	at org.apache.solr.cloud.ZkSolrClientTest.testWatchChildren(ZkSolrClientTest.java:218)
[junit4:junit4]    > 	at sun.reflect.NativeMethodAccessorImpl.invoke0(Native Method)
[junit4:junit4]    > 	at sun.reflect.NativeMethodAccessorImpl.invoke(NativeMethodAccessorImpl.java:57)
[junit4:junit4]    > 	at sun.reflect.DelegatingMethodAccessorImpl.invoke(DelegatingMethodAccessorImpl.java:43)
[junit4:junit4]    > 	at java.lang.reflect.Method.invoke(Method.java:474)
[junit4:junit4]    > 	at com.carrotsearch.randomizedtesting.RandomizedRunner.invoke(RandomizedRunner.java:1559)
[junit4:junit4]    > 	at com.carrotsearch.randomizedtesting.RandomizedRunner.access$600(RandomizedRunner.java:79)
[junit4:junit4]    > 	at com.carrotsearch.randomizedtesting.RandomizedRunner$6.evaluate(RandomizedRunner.java:737)
[junit4:junit4]    > 	at com.carrotsearch.randomizedtesting.RandomizedRunner$7.evaluate(RandomizedRunner.java:773)
[junit4:junit4]    > 	at com.carrotsearch.randomizedtesting.RandomizedRunner$8.evaluate(RandomizedRunner.java:787)
[junit4:junit4]    > 	at com.carrotsearch.randomizedtesting.rules.SystemPropertiesRestoreRule$1.evaluate(SystemPropertiesRestoreRule.java:53)
[junit4:junit4]    > 	at org.apache.lucene.util.TestRuleSetupTeardownChained$1.evaluate(TestRuleSetupTeardownChained.java:50)
[junit4:junit4]    > 	at org.apache.lucene.util.TestRuleFieldCacheSanity$1.evaluate(TestRuleFieldCacheSanity.java:51)
[junit4:junit4]    > 	at org.apache.lucene.util.AbstractBeforeAfterRule$1.evaluate(AbstractBeforeAfterRule.java:45)
[junit4:junit4]    > 	at com.carrotsearch.randomizedtesting.rules.SystemPropertiesInvariantRule$1.evaluate(SystemPropertiesInvariantRule.java:55)
[junit4:junit4]    > 	at org.apache.lucene.util.TestRuleThreadAndTestName$1.evaluate(TestRuleThreadAndTestName.java:48)
[junit4:junit4]    > 	at org.apache.lucene.util.TestRuleIgnoreAfterMaxFailures$1.evaluate(TestRuleIgnoreAfterMaxFailures.java:70)
[junit4:junit4]    > 	at org.apache.lucene.util.TestRuleMarkFailure$1.evaluate(TestRuleMarkFailure.java:48)
[junit4:junit4]    > 	at com.carrotsearch.randomizedtesting.rules.StatementAdapter.evaluate(StatementAdapter.java:36)
[junit4:junit4]    > 	at com.carrotsearch.randomizedtesting.ThreadLeakControl$StatementRunner.run(ThreadLeakControl.java:345)
[junit4:junit4]    > 	at com.carrotsearch.randomizedtesting.ThreadLeakControl.forkTimeoutingTask(ThreadLeakControl.java:769)
[junit4:junit4]    > 	at com.carrotsearch.randomizedtesting.ThreadLeakControl$3.evaluate(ThreadLeakControl.java:429)
[junit4:junit4]    > 	at com.carrotsearch.randomizedtesting.RandomizedRunner.runSingleTest(RandomizedRunner.java:746)
[junit4:junit4]    > 	at com.carrotsearch.randomizedtesting.RandomizedRunner$3.evaluate(RandomizedRunner.java:648)
[junit4:junit4]    > 	at com.carrotsearch.randomizedtesting.RandomizedRunner$4.evaluate(RandomizedRunner.java:682)
[junit4:junit4]    > 	at com.carrotsearch.randomizedtesting.RandomizedRunner$5.evaluate(RandomizedRunner.java:693)
[junit4:junit4]    > 	at com.carrotsearch.randomizedtesting.rules.StatementAdapter.evaluate(StatementAdapter.java:36)
[junit4:junit4]    > 	at com.carrotsearch.randomizedtesting.rules.SystemPropertiesRestoreRule$1.evaluate(SystemPropertiesRestoreRule.java:53)
[junit4:junit4]    > 	at org.apache.lucene.util.AbstractBeforeAfterRule$1.evaluate(AbstractBeforeAfterRule.java:45)
[junit4:junit4]    > 	at org.apache.lucene.util.TestRuleStoreClassName$1.evaluate(TestRuleStoreClassName.java:42)
[junit4:junit4]    > 	at com.carrotsearch.randomizedtesting.rules.SystemPropertiesInvariantRule$1.evaluate(SystemPropertiesInvariantRule.java:55)
[junit4:junit4]    > 	at com.carrotsearch.randomizedtesting.rules.NoShadowingOrOverridesOnMethodsRule$1.evaluate(NoShadowingOrOverridesOnMethodsRule.java:39)
[junit4:junit4]    > 	at com.carrotsearch.randomizedtesting.rules.NoShadowingOrOverridesOnMethodsRule$1.evaluate(NoShadowingOrOverridesOnMethodsRule.java:39)
[junit4:junit4]    > 	at org.apache.lucene.util.TestRuleAssertionsRequired$1.evaluate(TestRuleAssertionsRequired.java:40)
[junit4:junit4]    > 	at org.apache.lucene.util.TestRuleMarkFailure$1.evaluate(TestRuleMarkFailure.java:48)
[junit4:junit4]    > 	at org.apache.lucene.util.TestRuleIgnoreAfterMaxFailures$1.evaluate(TestRuleIgnoreAfterMaxFailures.java:70)
[junit4:junit4]    > 	at org.apache.lucene.util.TestRuleIgnoreTestSuites$1.evaluate(TestRuleIgnoreTestSuites.java:55)
[junit4:junit4]    > 	at com.carrotsearch.randomizedtesting.rules.StatementAdapter.evaluate(StatementAdapter.java:36)
[junit4:junit4]    > 	at com.carrotsearch.randomizedtesting.ThreadLeakControl$StatementRunner.run(ThreadLeakControl.java:345)
[junit4:junit4]    > 	at java.lang.Thread.run(Thread.java:722)
[junit4:junit4]   2> 23420 T1817 oazs.SessionTrackerImpl.run SessionTrackerImpl exited
loop!
[junit4:junit4]   2> NOTE: test params are: codec=SimpleText, sim=DefaultSimilarity, locale=sk_SK,
timezone=Asia/Aqtau
[junit4:junit4]   2> NOTE: Linux 3.2.0-29-generic amd64/Oracle Corporation 1.8.0-ea (64-bit)/cpus=8,threads=1,free=139782856,total=319827968
[junit4:junit4]   2> NOTE: All tests run in this JVM: [PeerSyncTest, TestStressVersions,
BasicFunctionalityTest, StatsComponentTest, TestSolrDeletionPolicy1, OverseerTest, XsltUpdateRequestHandlerTest,
TestReload, TestCodecSupport, TestTrie, EchoParamsTest, TestElisionMultitermQuery, SignatureUpdateProcessorFactoryTest,
OpenExchangeRatesOrgProviderTest, OutputWriterTest, DocumentAnalysisRequestHandlerTest, TestCSVResponseWriter,
TimeZoneUtilsTest, TestFoldingMultitermQuery, TestMergePolicyConfig, TestSolrCoreProperties,
TestPropInjectDefaults, TestWriterPerf, TestUpdate, TestOmitPositions, DisMaxRequestHandlerTest,
TestDistributedSearch, TestSolrXMLSerializer, TestArbitraryIndexDir, TestDocumentBuilder,
DebugComponentTest, QueryParsingTest, TestReplicationHandler, TestMultiCoreConfBootstrap,
TestJmxIntegration, ZkNodePropsTest, TestCSVLoader, XmlUpdateRequestHandlerTest, FieldMutatingUpdateProcessorTest,
TestDFRSimilarityFactory, TestFastOutputStream, UUIDFieldTest, FullSolrCloudDistribCmdsTest,
DOMUtilTest, RequiredFieldsTest, ReturnFieldsTest, RecoveryZkTest, TestBinaryField, TestSurroundQueryParser,
DirectUpdateHandlerTest, ScriptEngineTest, BadIndexSchemaTest, TestSort, URLClassifyProcessorTest,
SpellCheckComponentTest, LeaderElectionIntegrationTest, TestRealTimeGet, ZkControllerTest,
TestExtendedDismaxParser, SoftAutoCommitTest, BasicZkTest, ZkSolrClientTest]
[junit4:junit4] Completed on J1 in 15.25s, 4 tests, 1 failure <<< FAILURES!

[...truncated 319 lines...]
BUILD FAILED
/mnt/ssd/jenkins/workspace/Lucene-Solr-trunk-Linux/build.xml:29: The following error occurred
while executing this line:
/mnt/ssd/jenkins/workspace/Lucene-Solr-trunk-Linux/solr/build.xml:144: The following error
occurred while executing this line:
/mnt/ssd/jenkins/workspace/Lucene-Solr-trunk-Linux/lucene/module-build.xml:62: The following
error occurred while executing this line:
/mnt/ssd/jenkins/workspace/Lucene-Solr-trunk-Linux/lucene/common-build.xml:1056: The following
error occurred while executing this line:
/mnt/ssd/jenkins/workspace/Lucene-Solr-trunk-Linux/lucene/common-build.xml:741: There were
test failures: 228 suites, 917 tests, 1 failure, 6 ignored (1 assumption)

Total time: 32 minutes 19 seconds
Build step 'Invoke Ant' marked build as failure
Recording test results
Description set: Java: 64bit/jdk1.8.0-ea-b51 -XX:+UseSerialGC
Email was triggered for: Failure
Sending email for trigger: Failure



Mime
View raw message