lucene-dev mailing list archives

Site index · List index
Message view « Date » · « Thread »
Top « Date » · « Thread »
From Policeman Jenkins Server <jenk...@sd-datasolutions.de>
Subject [JENKINS] Lucene-Solr-trunk-Linux (64bit/ibm-j9-jdk7) - Build # 1337 - Failure!
Date Mon, 24 Sep 2012 15:47:41 GMT
Build: http://jenkins.sd-datasolutions.de/job/Lucene-Solr-trunk-Linux/1337/
Java: 64bit/ibm-j9-jdk7 -Xjit:exclude={org/apache/lucene/util/fst/FST.pack(IIF)Lorg/apache/lucene/util/fst/FST;}

3 tests failed.
REGRESSION:  org.apache.solr.TestDistributedGrouping.testDistribSearch

Error Message:
Server at http://127.0.0.1:44805/solr returned non ok status:500, message:Server Error

Stack Trace:
org.apache.solr.common.SolrException: Server at http://127.0.0.1:44805/solr returned non ok status:500, message:Server Error
	at __randomizedtesting.SeedInfo.seed([874486D6DF4B0784:6A208CEA81467B8]:0)
	at org.apache.solr.client.solrj.impl.HttpSolrServer.request(HttpSolrServer.java:372)
	at org.apache.solr.client.solrj.impl.HttpSolrServer.request(HttpSolrServer.java:181)
	at org.apache.solr.client.solrj.request.QueryRequest.process(QueryRequest.java:90)
	at org.apache.solr.client.solrj.SolrServer.query(SolrServer.java:301)
	at org.apache.solr.BaseDistributedSearchTestCase.queryServer(BaseDistributedSearchTestCase.java:371)
	at org.apache.solr.TestDistributedGrouping.simpleQuery(TestDistributedGrouping.java:217)
	at org.apache.solr.TestDistributedGrouping.doTest(TestDistributedGrouping.java:203)
	at org.apache.solr.BaseDistributedSearchTestCase.testDistribSearch(BaseDistributedSearchTestCase.java:701)
	at sun.reflect.NativeMethodAccessorImpl.invoke0(Native Method)
	at sun.reflect.NativeMethodAccessorImpl.invoke(NativeMethodAccessorImpl.java:88)
	at sun.reflect.DelegatingMethodAccessorImpl.invoke(DelegatingMethodAccessorImpl.java:55)
	at java.lang.reflect.Method.invoke(Method.java:613)
	at com.carrotsearch.randomizedtesting.RandomizedRunner.invoke(RandomizedRunner.java:1559)
	at com.carrotsearch.randomizedtesting.RandomizedRunner.access$600(RandomizedRunner.java:79)
	at com.carrotsearch.randomizedtesting.RandomizedRunner$6.evaluate(RandomizedRunner.java:737)
	at com.carrotsearch.randomizedtesting.RandomizedRunner$7.evaluate(RandomizedRunner.java:773)
	at com.carrotsearch.randomizedtesting.RandomizedRunner$8.evaluate(RandomizedRunner.java:787)
	at com.carrotsearch.randomizedtesting.rules.SystemPropertiesRestoreRule$1.evaluate(SystemPropertiesRestoreRule.java:53)
	at org.apache.lucene.util.TestRuleSetupTeardownChained$1.evaluate(TestRuleSetupTeardownChained.java:50)
	at org.apache.lucene.util.TestRuleFieldCacheSanity$1.evaluate(TestRuleFieldCacheSanity.java:51)
	at org.apache.lucene.util.AbstractBeforeAfterRule$1.evaluate(AbstractBeforeAfterRule.java:45)
	at com.carrotsearch.randomizedtesting.rules.SystemPropertiesInvariantRule$1.evaluate(SystemPropertiesInvariantRule.java:55)
	at org.apache.lucene.util.TestRuleThreadAndTestName$1.evaluate(TestRuleThreadAndTestName.java:48)
	at org.apache.lucene.util.TestRuleIgnoreAfterMaxFailures$1.evaluate(TestRuleIgnoreAfterMaxFailures.java:70)
	at org.apache.lucene.util.TestRuleMarkFailure$1.evaluate(TestRuleMarkFailure.java:48)
	at com.carrotsearch.randomizedtesting.rules.StatementAdapter.evaluate(StatementAdapter.java:36)
	at com.carrotsearch.randomizedtesting.ThreadLeakControl$StatementRunner.run(ThreadLeakControl.java:358)
	at com.carrotsearch.randomizedtesting.ThreadLeakControl.forkTimeoutingTask(ThreadLeakControl.java:782)
	at com.carrotsearch.randomizedtesting.ThreadLeakControl$3.evaluate(ThreadLeakControl.java:442)
	at com.carrotsearch.randomizedtesting.RandomizedRunner.runSingleTest(RandomizedRunner.java:746)
	at com.carrotsearch.randomizedtesting.RandomizedRunner$3.evaluate(RandomizedRunner.java:648)
	at com.carrotsearch.randomizedtesting.RandomizedRunner$4.evaluate(RandomizedRunner.java:682)
	at com.carrotsearch.randomizedtesting.RandomizedRunner$5.evaluate(RandomizedRunner.java:693)
	at com.carrotsearch.randomizedtesting.rules.StatementAdapter.evaluate(StatementAdapter.java:36)
	at com.carrotsearch.randomizedtesting.rules.SystemPropertiesRestoreRule$1.evaluate(SystemPropertiesRestoreRule.java:53)
	at org.apache.lucene.util.AbstractBeforeAfterRule$1.evaluate(AbstractBeforeAfterRule.java:45)
	at org.apache.lucene.util.TestRuleStoreClassName$1.evaluate(TestRuleStoreClassName.java:42)
	at com.carrotsearch.randomizedtesting.rules.SystemPropertiesInvariantRule$1.evaluate(SystemPropertiesInvariantRule.java:55)
	at com.carrotsearch.randomizedtesting.rules.NoShadowingOrOverridesOnMethodsRule$1.evaluate(NoShadowingOrOverridesOnMethodsRule.java:39)
	at com.carrotsearch.randomizedtesting.rules.NoShadowingOrOverridesOnMethodsRule$1.evaluate(NoShadowingOrOverridesOnMethodsRule.java:39)
	at com.carrotsearch.randomizedtesting.rules.StatementAdapter.evaluate(StatementAdapter.java:36)
	at org.apache.lucene.util.TestRuleAssertionsRequired$1.evaluate(TestRuleAssertionsRequired.java:43)
	at org.apache.lucene.util.TestRuleMarkFailure$1.evaluate(TestRuleMarkFailure.java:48)
	at org.apache.lucene.util.TestRuleIgnoreAfterMaxFailures$1.evaluate(TestRuleIgnoreAfterMaxFailures.java:70)
	at org.apache.lucene.util.TestRuleIgnoreTestSuites$1.evaluate(TestRuleIgnoreTestSuites.java:55)
	at com.carrotsearch.randomizedtesting.rules.StatementAdapter.evaluate(StatementAdapter.java:36)
	at com.carrotsearch.randomizedtesting.ThreadLeakControl$StatementRunner.run(ThreadLeakControl.java:358)
	at java.lang.Thread.run(Thread.java:777)


REGRESSION:  org.apache.solr.TestDistributedSearch.testDistribSearch

Error Message:
Server at http://127.0.0.1:53596/solr returned non ok status:500, message:Server Error

Stack Trace:
org.apache.solr.common.SolrException: Server at http://127.0.0.1:53596/solr returned non ok status:500, message:Server Error
	at __randomizedtesting.SeedInfo.seed([874486D6DF4B0784:6A208CEA81467B8]:0)
	at org.apache.solr.client.solrj.impl.HttpSolrServer.request(HttpSolrServer.java:372)
	at org.apache.solr.client.solrj.impl.HttpSolrServer.request(HttpSolrServer.java:181)
	at org.apache.solr.client.solrj.request.QueryRequest.process(QueryRequest.java:90)
	at org.apache.solr.client.solrj.SolrServer.query(SolrServer.java:301)
	at org.apache.solr.BaseDistributedSearchTestCase.queryServer(BaseDistributedSearchTestCase.java:371)
	at org.apache.solr.BaseDistributedSearchTestCase.query(BaseDistributedSearchTestCase.java:394)
	at org.apache.solr.BaseDistributedSearchTestCase.query(BaseDistributedSearchTestCase.java:376)
	at org.apache.solr.TestDistributedSearch.doTest(TestDistributedSearch.java:134)
	at org.apache.solr.BaseDistributedSearchTestCase.testDistribSearch(BaseDistributedSearchTestCase.java:701)
	at sun.reflect.NativeMethodAccessorImpl.invoke0(Native Method)
	at sun.reflect.NativeMethodAccessorImpl.invoke(NativeMethodAccessorImpl.java:88)
	at sun.reflect.DelegatingMethodAccessorImpl.invoke(DelegatingMethodAccessorImpl.java:55)
	at java.lang.reflect.Method.invoke(Method.java:613)
	at com.carrotsearch.randomizedtesting.RandomizedRunner.invoke(RandomizedRunner.java:1559)
	at com.carrotsearch.randomizedtesting.RandomizedRunner.access$600(RandomizedRunner.java:79)
	at com.carrotsearch.randomizedtesting.RandomizedRunner$6.evaluate(RandomizedRunner.java:737)
	at com.carrotsearch.randomizedtesting.RandomizedRunner$7.evaluate(RandomizedRunner.java:773)
	at com.carrotsearch.randomizedtesting.RandomizedRunner$8.evaluate(RandomizedRunner.java:787)
	at com.carrotsearch.randomizedtesting.rules.SystemPropertiesRestoreRule$1.evaluate(SystemPropertiesRestoreRule.java:53)
	at org.apache.lucene.util.TestRuleSetupTeardownChained$1.evaluate(TestRuleSetupTeardownChained.java:50)
	at org.apache.lucene.util.TestRuleFieldCacheSanity$1.evaluate(TestRuleFieldCacheSanity.java:51)
	at org.apache.lucene.util.AbstractBeforeAfterRule$1.evaluate(AbstractBeforeAfterRule.java:45)
	at com.carrotsearch.randomizedtesting.rules.SystemPropertiesInvariantRule$1.evaluate(SystemPropertiesInvariantRule.java:55)
	at org.apache.lucene.util.TestRuleThreadAndTestName$1.evaluate(TestRuleThreadAndTestName.java:48)
	at org.apache.lucene.util.TestRuleIgnoreAfterMaxFailures$1.evaluate(TestRuleIgnoreAfterMaxFailures.java:70)
	at org.apache.lucene.util.TestRuleMarkFailure$1.evaluate(TestRuleMarkFailure.java:48)
	at com.carrotsearch.randomizedtesting.rules.StatementAdapter.evaluate(StatementAdapter.java:36)
	at com.carrotsearch.randomizedtesting.ThreadLeakControl$StatementRunner.run(ThreadLeakControl.java:358)
	at com.carrotsearch.randomizedtesting.ThreadLeakControl.forkTimeoutingTask(ThreadLeakControl.java:782)
	at com.carrotsearch.randomizedtesting.ThreadLeakControl$3.evaluate(ThreadLeakControl.java:442)
	at com.carrotsearch.randomizedtesting.RandomizedRunner.runSingleTest(RandomizedRunner.java:746)
	at com.carrotsearch.randomizedtesting.RandomizedRunner$3.evaluate(RandomizedRunner.java:648)
	at com.carrotsearch.randomizedtesting.RandomizedRunner$4.evaluate(RandomizedRunner.java:682)
	at com.carrotsearch.randomizedtesting.RandomizedRunner$5.evaluate(RandomizedRunner.java:693)
	at com.carrotsearch.randomizedtesting.rules.StatementAdapter.evaluate(StatementAdapter.java:36)
	at com.carrotsearch.randomizedtesting.rules.SystemPropertiesRestoreRule$1.evaluate(SystemPropertiesRestoreRule.java:53)
	at org.apache.lucene.util.AbstractBeforeAfterRule$1.evaluate(AbstractBeforeAfterRule.java:45)
	at org.apache.lucene.util.TestRuleStoreClassName$1.evaluate(TestRuleStoreClassName.java:42)
	at com.carrotsearch.randomizedtesting.rules.SystemPropertiesInvariantRule$1.evaluate(SystemPropertiesInvariantRule.java:55)
	at com.carrotsearch.randomizedtesting.rules.NoShadowingOrOverridesOnMethodsRule$1.evaluate(NoShadowingOrOverridesOnMethodsRule.java:39)
	at com.carrotsearch.randomizedtesting.rules.NoShadowingOrOverridesOnMethodsRule$1.evaluate(NoShadowingOrOverridesOnMethodsRule.java:39)
	at com.carrotsearch.randomizedtesting.rules.StatementAdapter.evaluate(StatementAdapter.java:36)
	at org.apache.lucene.util.TestRuleAssertionsRequired$1.evaluate(TestRuleAssertionsRequired.java:43)
	at org.apache.lucene.util.TestRuleMarkFailure$1.evaluate(TestRuleMarkFailure.java:48)
	at org.apache.lucene.util.TestRuleIgnoreAfterMaxFailures$1.evaluate(TestRuleIgnoreAfterMaxFailures.java:70)
	at org.apache.lucene.util.TestRuleIgnoreTestSuites$1.evaluate(TestRuleIgnoreTestSuites.java:55)
	at com.carrotsearch.randomizedtesting.rules.StatementAdapter.evaluate(StatementAdapter.java:36)
	at com.carrotsearch.randomizedtesting.ThreadLeakControl$StatementRunner.run(ThreadLeakControl.java:358)
	at java.lang.Thread.run(Thread.java:777)


REGRESSION:  org.apache.solr.cloud.RecoveryZkTest.testDistribSearch

Error Message:
Server at http://127.0.0.1:51456/solr/collection1 returned non ok status:404, message:Can not find: /solr/collection1/select

Stack Trace:
org.apache.solr.common.SolrException: Server at http://127.0.0.1:51456/solr/collection1 returned non ok status:404, message:Can not find: /solr/collection1/select
	at __randomizedtesting.SeedInfo.seed([874486D6DF4B0784:6A208CEA81467B8]:0)
	at org.apache.solr.client.solrj.impl.HttpSolrServer.request(HttpSolrServer.java:372)
	at org.apache.solr.client.solrj.impl.HttpSolrServer.request(HttpSolrServer.java:181)
	at org.apache.solr.client.solrj.request.QueryRequest.process(QueryRequest.java:90)
	at org.apache.solr.client.solrj.SolrServer.query(SolrServer.java:301)
	at org.apache.solr.cloud.RecoveryZkTest.doTest(RecoveryZkTest.java:92)
	at org.apache.solr.BaseDistributedSearchTestCase.testDistribSearch(BaseDistributedSearchTestCase.java:695)
	at sun.reflect.NativeMethodAccessorImpl.invoke0(Native Method)
	at sun.reflect.NativeMethodAccessorImpl.invoke(NativeMethodAccessorImpl.java:88)
	at sun.reflect.DelegatingMethodAccessorImpl.invoke(DelegatingMethodAccessorImpl.java:55)
	at java.lang.reflect.Method.invoke(Method.java:613)
	at com.carrotsearch.randomizedtesting.RandomizedRunner.invoke(RandomizedRunner.java:1559)
	at com.carrotsearch.randomizedtesting.RandomizedRunner.access$600(RandomizedRunner.java:79)
	at com.carrotsearch.randomizedtesting.RandomizedRunner$6.evaluate(RandomizedRunner.java:737)
	at com.carrotsearch.randomizedtesting.RandomizedRunner$7.evaluate(RandomizedRunner.java:773)
	at com.carrotsearch.randomizedtesting.RandomizedRunner$8.evaluate(RandomizedRunner.java:787)
	at com.carrotsearch.randomizedtesting.rules.SystemPropertiesRestoreRule$1.evaluate(SystemPropertiesRestoreRule.java:53)
	at org.apache.lucene.util.TestRuleSetupTeardownChained$1.evaluate(TestRuleSetupTeardownChained.java:50)
	at org.apache.lucene.util.TestRuleFieldCacheSanity$1.evaluate(TestRuleFieldCacheSanity.java:51)
	at org.apache.lucene.util.AbstractBeforeAfterRule$1.evaluate(AbstractBeforeAfterRule.java:45)
	at com.carrotsearch.randomizedtesting.rules.SystemPropertiesInvariantRule$1.evaluate(SystemPropertiesInvariantRule.java:55)
	at org.apache.lucene.util.TestRuleThreadAndTestName$1.evaluate(TestRuleThreadAndTestName.java:48)
	at org.apache.lucene.util.TestRuleIgnoreAfterMaxFailures$1.evaluate(TestRuleIgnoreAfterMaxFailures.java:70)
	at org.apache.lucene.util.TestRuleMarkFailure$1.evaluate(TestRuleMarkFailure.java:48)
	at com.carrotsearch.randomizedtesting.rules.StatementAdapter.evaluate(StatementAdapter.java:36)
	at com.carrotsearch.randomizedtesting.ThreadLeakControl$StatementRunner.run(ThreadLeakControl.java:358)
	at com.carrotsearch.randomizedtesting.ThreadLeakControl.forkTimeoutingTask(ThreadLeakControl.java:782)
	at com.carrotsearch.randomizedtesting.ThreadLeakControl$3.evaluate(ThreadLeakControl.java:442)
	at com.carrotsearch.randomizedtesting.RandomizedRunner.runSingleTest(RandomizedRunner.java:746)
	at com.carrotsearch.randomizedtesting.RandomizedRunner$3.evaluate(RandomizedRunner.java:648)
	at com.carrotsearch.randomizedtesting.RandomizedRunner$4.evaluate(RandomizedRunner.java:682)
	at com.carrotsearch.randomizedtesting.RandomizedRunner$5.evaluate(RandomizedRunner.java:693)
	at com.carrotsearch.randomizedtesting.rules.StatementAdapter.evaluate(StatementAdapter.java:36)
	at com.carrotsearch.randomizedtesting.rules.SystemPropertiesRestoreRule$1.evaluate(SystemPropertiesRestoreRule.java:53)
	at org.apache.lucene.util.AbstractBeforeAfterRule$1.evaluate(AbstractBeforeAfterRule.java:45)
	at org.apache.lucene.util.TestRuleStoreClassName$1.evaluate(TestRuleStoreClassName.java:42)
	at com.carrotsearch.randomizedtesting.rules.SystemPropertiesInvariantRule$1.evaluate(SystemPropertiesInvariantRule.java:55)
	at com.carrotsearch.randomizedtesting.rules.NoShadowingOrOverridesOnMethodsRule$1.evaluate(NoShadowingOrOverridesOnMethodsRule.java:39)
	at com.carrotsearch.randomizedtesting.rules.NoShadowingOrOverridesOnMethodsRule$1.evaluate(NoShadowingOrOverridesOnMethodsRule.java:39)
	at com.carrotsearch.randomizedtesting.rules.StatementAdapter.evaluate(StatementAdapter.java:36)
	at org.apache.lucene.util.TestRuleAssertionsRequired$1.evaluate(TestRuleAssertionsRequired.java:43)
	at org.apache.lucene.util.TestRuleMarkFailure$1.evaluate(TestRuleMarkFailure.java:48)
	at org.apache.lucene.util.TestRuleIgnoreAfterMaxFailures$1.evaluate(TestRuleIgnoreAfterMaxFailures.java:70)
	at org.apache.lucene.util.TestRuleIgnoreTestSuites$1.evaluate(TestRuleIgnoreTestSuites.java:55)
	at com.carrotsearch.randomizedtesting.rules.StatementAdapter.evaluate(StatementAdapter.java:36)
	at com.carrotsearch.randomizedtesting.ThreadLeakControl$StatementRunner.run(ThreadLeakControl.java:358)
	at java.lang.Thread.run(Thread.java:777)




Build Log:
[...truncated 7808 lines...]
[junit4:junit4] Suite: org.apache.solr.cloud.RecoveryZkTest
[junit4:junit4]   2> 4 T218 oas.SolrTestCaseJ4.setUp ###Starting testDistribSearch
[junit4:junit4]   2> Creating dataDir: /mnt/ssd/jenkins/workspace/Lucene-Solr-trunk-Linux/solr/build/solr-core/test/J1/./solrtest-RecoveryZkTest-1348501231218
[junit4:junit4]   2> 6 T218 oasc.ZkTestServer.run STARTING ZK TEST SERVER
[junit4:junit4]   2> 20 T219 oaz.Environment.logEnv Server environment:zookeeper.version=3.3.6-1366786, built on 07/29/2012 06:22 GMT
[junit4:junit4]   2> 21 T219 oaz.Environment.logEnv Server environment:host.name=serv1
[junit4:junit4]   2> 21 T219 oaz.Environment.logEnv Server environment:java.version=1.7.0
[junit4:junit4]   2> 21 T219 oaz.Environment.logEnv Server environment:java.vendor=IBM Corporation
[junit4:junit4]   2> 21 T219 oaz.Environment.logEnv Server environment:java.home=/opt/ibm/java-x86_64-70/jre
[junit4:junit4]   2> 21 T219 oaz.Environment.logEnv Server environment:java.class.path=/mnt/ssd/jenkins/workspace/Lucene-Solr-trunk-Linux/solr/build/solr-core/classes/test:/mnt/ssd/jenkins/workspace/Lucene-Solr-trunk-Linux/solr/build/solr-test-framework/classes/java:/mnt/ssd/jenkins/workspace/Lucene-Solr-trunk-Linux/solr/build/solr-core/test-files:/mnt/ssd/jenkins/workspace/Lucene-Solr-trunk-Linux/lucene/build/codecs/classes/java:/mnt/ssd/jenkins/workspace/Lucene-Solr-trunk-Linux/lucene/build/test-framework/classes/java:/mnt/ssd/jenkins/workspace/Lucene-Solr-trunk-Linux/solr/build/solr-solrj/classes/java:/mnt/ssd/jenkins/workspace/Lucene-Solr-trunk-Linux/solr/build/solr-core/classes/java:/mnt/ssd/jenkins/workspace/Lucene-Solr-trunk-Linux/lucene/build/analysis/common/lucene-analyzers-common-5.0-SNAPSHOT.jar:/mnt/ssd/jenkins/workspace/Lucene-Solr-trunk-Linux/lucene/build/analysis/kuromoji/lucene-analyzers-kuromoji-5.0-SNAPSHOT.jar:/mnt/ssd/jenkins/workspace/Lucene-Solr-trunk-Linux/lucene/build/analysis/phonetic/lucene-analyzers-phonetic-5.0-SNAPSHOT.jar:/mnt/ssd/jenkins/workspace/Lucene-Solr-trunk-Linux/lucene/build/highlighter/lucene-highlighter-5.0-SNAPSHOT.jar:/mnt/ssd/jenkins/workspace/Lucene-Solr-trunk-Linux/lucene/build/memory/lucene-memory-5.0-SNAPSHOT.jar:/mnt/ssd/jenkins/workspace/Lucene-Solr-trunk-Linux/lucene/build/misc/lucene-misc-5.0-SNAPSHOT.jar:/mnt/ssd/jenkins/workspace/Lucene-Solr-trunk-Linux/lucene/build/spatial/lucene-spatial-5.0-SNAPSHOT.jar:/mnt/ssd/jenkins/workspace/Lucene-Solr-trunk-Linux/lucene/build/suggest/lucene-suggest-5.0-SNAPSHOT.jar:/mnt/ssd/jenkins/workspace/Lucene-Solr-trunk-Linux/lucene/build/grouping/lucene-grouping-5.0-SNAPSHOT.jar:/mnt/ssd/jenkins/workspace/Lucene-Solr-trunk-Linux/lucene/build/queries/lucene-queries-5.0-SNAPSHOT.jar:/mnt/ssd/jenkins/workspace/Lucene-Solr-trunk-Linux/lucene/build/queryparser/lucene-queryparser-5.0-SNAPSHOT.jar:/mnt/ssd/jenkins/workspace/Lucene-Solr-trunk-Linux/solr/core/lib/commons-cli-1.2.jar:/mnt/ssd/jenkins/workspace/Lucene-Solr-trunk-Linux/solr/core/lib/commons-codec-1.7.jar:/mnt/ssd/jenkins/workspace/Lucene-Solr-trunk-Linux/solr/core/lib/commons-fileupload-1.2.1.jar:/mnt/ssd/jenkins/workspace/Lucene-Solr-trunk-Linux/solr/core/lib/commons-lang-2.6.jar:/mnt/ssd/jenkins/workspace/Lucene-Solr-trunk-Linux/solr/core/lib/easymock-2.2.jar:/mnt/ssd/jenkins/workspace/Lucene-Solr-trunk-Linux/solr/core/lib/guava-r05.jar:/mnt/ssd/jenkins/workspace/Lucene-Solr-trunk-Linux/solr/core/lib/javax.servlet-api-3.0.1.jar:/mnt/ssd/jenkins/workspace/Lucene-Solr-trunk-Linux/solr/core/lib/spatial4j-0.3.jar:/mnt/ssd/jenkins/workspace/Lucene-Solr-trunk-Linux/solr/solrj/lib/commons-io-2.1.jar:/mnt/ssd/jenkins/workspace/Lucene-Solr-trunk-Linux/solr/solrj/lib/httpclient-4.1.3.jar:/mnt/ssd/jenkins/workspace/Lucene-Solr-trunk-Linux/solr/solrj/lib/httpcore-4.1.4.jar:/mnt/ssd/jenkins/workspace/Lucene-Solr-trunk-Linux/solr/solrj/lib/httpmime-4.1.3.jar:/mnt/ssd/jenkins/workspace/Lucene-Solr-trunk-Linux/solr/solrj/lib/jcl-over-slf4j-1.6.4.jar:/mnt/ssd/jenkins/workspace/Lucene-Solr-trunk-Linux/solr/solrj/lib/log4j-over-slf4j-1.6.4.jar:/mnt/ssd/jenkins/workspace/Lucene-Solr-trunk-Linux/solr/solrj/lib/slf4j-api-1.6.4.jar:/mnt/ssd/jenkins/workspace/Lucene-Solr-trunk-Linux/solr/solrj/lib/slf4j-jdk14-1.6.4.jar:/mnt/ssd/jenkins/workspace/Lucene-Solr-trunk-Linux/solr/solrj/lib/wstx-asl-3.2.7.jar:/mnt/ssd/jenkins/workspace/Lucene-Solr-trunk-Linux/solr/solrj/lib/zookeeper-3.3.6.jar:/mnt/ssd/jenkins/workspace/Lucene-Solr-trunk-Linux/solr/example/lib/jetty-continuation-8.1.2.v20120308.jar:/mnt/ssd/jenkins/workspace/Lucene-Solr-trunk-Linux/solr/example/lib/jetty-deploy-8.1.2.v20120308.jar:/mnt/ssd/jenkins/workspace/Lucene-Solr-trunk-Linux/solr/example/lib/jetty-http-8.1.2.v20120308.jar:/mnt/ssd/jenkins/workspace/Lucene-Solr-trunk-Linux/solr/example/lib/jetty-io-8.1.2.v20120308.jar:/mnt/ssd/jenkins/workspace/Lucene-Solr-trunk-Linux/solr/example/lib/jetty-jmx-8.1.2.v20120308.jar:/mnt/ssd/jenkins/workspace/Lucene-Solr-trunk-Linux/solr/example/lib/jetty-security-8.1.2.v20120308.jar:/mnt/ssd/jenkins/workspace/Lucene-Solr-trunk-Linux/solr/example/lib/jetty-server-8.1.2.v20120308.jar:/mnt/ssd/jenkins/workspace/Lucene-Solr-trunk-Linux/solr/example/lib/jetty-servlet-8.1.2.v20120308.jar:/mnt/ssd/jenkins/workspace/Lucene-Solr-trunk-Linux/solr/example/lib/jetty-util-8.1.2.v20120308.jar:/mnt/ssd/jenkins/workspace/Lucene-Solr-trunk-Linux/solr/example/lib/jetty-webapp-8.1.2.v20120308.jar:/mnt/ssd/jenkins/workspace/Lucene-Solr-trunk-Linux/solr/example/lib/jetty-xml-8.1.2.v20120308.jar:/mnt/ssd/jenkins/workspace/Lucene-Solr-trunk-Linux/solr/example/lib/servlet-api-3.0.jar:/mnt/ssd/jenkins/workspace/Lucene-Solr-trunk-Linux/solr/example/example-DIH/solr/db/lib/hsqldb-1.8.0.10.jar:/mnt/ssd/jenkins/workspace/Lucene-Solr-trunk-Linux/lucene/build/core/classes/java:/mnt/ssd/jenkins/workspace/Lucene-Solr-trunk-Linux/lucene/test-framework/lib/junit-4.10.jar:/mnt/ssd/jenkins/workspace/Lucene-Solr-trunk-Linux/lucene/test-framework/lib/randomizedtesting-runner-2.0.1.jar:/var/lib/jenkins/tools/Ant/ANT_1.8.2/lib/ant-launcher.jar:/var/lib/jenkins/.ant/lib/ivy-2.2.0.jar:/var/lib/jenkins/tools/Ant/ANT_1.8.2/lib/ant-jdepend.jar:/var/lib/jenkins/tools/Ant/ANT_1.8.2/lib/ant-netrexx.jar:/var/lib/jenkins/tools/Ant/ANT_1.8.2/lib/ant-antlr.jar:/var/lib/jenkins/tools/Ant/ANT_1.8.2/lib/ant-commons-net.jar:/var/lib/jenkins/tools/Ant/ANT_1.8.2/lib/ant-javamail.jar:/var/lib/jenkins/tools/Ant/ANT_1.8.2/lib/ant-apache-regexp.jar:/var/lib/jenkins/tools/Ant/ANT_1.8.2/lib/ant-jsch.jar:/var/lib/jenkins/tools/Ant/ANT_1.8.2/lib/ant-apache-xalan2.jar:/var/lib/jenkins/tools/Ant/ANT_1.8.2/lib/ant-junit4.jar:/var/lib/jenkins/tools/Ant/ANT_1.8.2/lib/ant-jmf.jar:/var/lib/jenkins/tools/Ant/ANT_1.8.2/lib/ant.jar:/var/lib/jenkins/tools/Ant/ANT_1.8.2/lib/ant-junit.jar:/var/lib/jenkins/tools/Ant/ANT_1.8.2/lib/ant-apache-bcel.jar:/var/lib/jenkins/tools/Ant/ANT_1.8.2/lib/ant-jai.jar:/var/lib/jenkins/tools/Ant/ANT_1.8.2/lib/ant-commons-logging.jar:/var/lib/jenkins/tools/Ant/ANT_1.8.2/lib/ant-apache-resolver.jar:/var/lib/jenkins/tools/Ant/ANT_1.8.2/lib/ant-apache-oro.jar:/var/lib/jenkins/tools/Ant/ANT_1.8.2/lib/ant-swing.jar:/var/lib/jenkins/tools/Ant/ANT_1.8.2/lib/ant-apache-bsf.jar:/var/lib/jenkins/tools/Ant/ANT_1.8.2/lib/ant-apache-log4j.jar:/var/lib/jenkins/tools/Ant/ANT_1.8.2/lib/ant-testutil.jar:/opt/ibm/java-x86_64-70/lib/tools.jar:/var/lib/jenkins/.ivy2/cache/com.carrotsearch.randomizedtesting/junit4-ant/jars/junit4-ant-2.0.1.jar
[junit4:junit4]   2> 22 T219 oaz.Environment.logEnv Server environment:java.library.path=/opt/ibm/java-x86_64-70/jre/lib/amd64/default:/opt/ibm/java-x86_64-70/jre/lib/amd64:/opt/ibm/java-x86_64-70/jre/lib/amd64/j9vm:/opt/ibm/java-x86_64-70/jre/lib/amd64:/opt/ibm/java-x86_64-70/jre/../lib/amd64:/usr/lib/jvm/j2sdk1.6-sun/jre/lib/amd64/server:/usr/lib/jvm/j2sdk1.6-sun/jre/lib/amd64:/usr/lib/jvm/j2sdk1.6-sun/jre/../lib/amd64:/usr/lib
[junit4:junit4]   2> 22 T219 oaz.Environment.logEnv Server environment:java.io.tmpdir=.
[junit4:junit4]   2> 22 T219 oaz.Environment.logEnv Server environment:java.compiler=j9jit26
[junit4:junit4]   2> 22 T219 oaz.Environment.logEnv Server environment:os.name=Linux
[junit4:junit4]   2> 23 T219 oaz.Environment.logEnv Server environment:os.arch=amd64
[junit4:junit4]   2> 23 T219 oaz.Environment.logEnv Server environment:os.version=3.2.0-31-generic
[junit4:junit4]   2> 23 T219 oaz.Environment.logEnv Server environment:user.name=jenkins
[junit4:junit4]   2> 23 T219 oaz.Environment.logEnv Server environment:user.home=/var/lib/jenkins
[junit4:junit4]   2> 23 T219 oaz.Environment.logEnv Server environment:user.dir=/mnt/ssd/jenkins/workspace/Lucene-Solr-trunk-Linux/solr/build/solr-core/test/J1
[junit4:junit4]   2> 29 T219 oazs.ZooKeeperServer.setTickTime tickTime set to 1000
[junit4:junit4]   2> 47 T219 oazs.NIOServerCnxn$Factory.<init> binding to port 0.0.0.0/0.0.0.0:0
[junit4:junit4]   2> 58 T219 oazsp.FileTxnSnapLog.save Snapshotting: 0
[junit4:junit4]   2> 108 T218 oasc.ZkTestServer.run start zk server on port:39731
[junit4:junit4]   2> 118 T218 oaz.Environment.logEnv Client environment:zookeeper.version=3.3.6-1366786, built on 07/29/2012 06:22 GMT
[junit4:junit4]   2> 119 T218 oaz.Environment.logEnv Client environment:host.name=serv1
[junit4:junit4]   2> 119 T218 oaz.Environment.logEnv Client environment:java.version=1.7.0
[junit4:junit4]   2> 120 T218 oaz.Environment.logEnv Client environment:java.vendor=IBM Corporation
[junit4:junit4]   2> 120 T218 oaz.Environment.logEnv Client environment:java.home=/opt/ibm/java-x86_64-70/jre
[junit4:junit4]   2> 120 T218 oaz.Environment.logEnv Client environment:java.class.path=/mnt/ssd/jenkins/workspace/Lucene-Solr-trunk-Linux/solr/build/solr-core/classes/test:/mnt/ssd/jenkins/workspace/Lucene-Solr-trunk-Linux/solr/build/solr-test-framework/classes/java:/mnt/ssd/jenkins/workspace/Lucene-Solr-trunk-Linux/solr/build/solr-core/test-files:/mnt/ssd/jenkins/workspace/Lucene-Solr-trunk-Linux/lucene/build/codecs/classes/java:/mnt/ssd/jenkins/workspace/Lucene-Solr-trunk-Linux/lucene/build/test-framework/classes/java:/mnt/ssd/jenkins/workspace/Lucene-Solr-trunk-Linux/solr/build/solr-solrj/classes/java:/mnt/ssd/jenkins/workspace/Lucene-Solr-trunk-Linux/solr/build/solr-core/classes/java:/mnt/ssd/jenkins/workspace/Lucene-Solr-trunk-Linux/lucene/build/analysis/common/lucene-analyzers-common-5.0-SNAPSHOT.jar:/mnt/ssd/jenkins/workspace/Lucene-Solr-trunk-Linux/lucene/build/analysis/kuromoji/lucene-analyzers-kuromoji-5.0-SNAPSHOT.jar:/mnt/ssd/jenkins/workspace/Lucene-Solr-trunk-Linux/lucene/build/analysis/phonetic/lucene-analyzers-phonetic-5.0-SNAPSHOT.jar:/mnt/ssd/jenkins/workspace/Lucene-Solr-trunk-Linux/lucene/build/highlighter/lucene-highlighter-5.0-SNAPSHOT.jar:/mnt/ssd/jenkins/workspace/Lucene-Solr-trunk-Linux/lucene/build/memory/lucene-memory-5.0-SNAPSHOT.jar:/mnt/ssd/jenkins/workspace/Lucene-Solr-trunk-Linux/lucene/build/misc/lucene-misc-5.0-SNAPSHOT.jar:/mnt/ssd/jenkins/workspace/Lucene-Solr-trunk-Linux/lucene/build/spatial/lucene-spatial-5.0-SNAPSHOT.jar:/mnt/ssd/jenkins/workspace/Lucene-Solr-trunk-Linux/lucene/build/suggest/lucene-suggest-5.0-SNAPSHOT.jar:/mnt/ssd/jenkins/workspace/Lucene-Solr-trunk-Linux/lucene/build/grouping/lucene-grouping-5.0-SNAPSHOT.jar:/mnt/ssd/jenkins/workspace/Lucene-Solr-trunk-Linux/lucene/build/queries/lucene-queries-5.0-SNAPSHOT.jar:/mnt/ssd/jenkins/workspace/Lucene-Solr-trunk-Linux/lucene/build/queryparser/lucene-queryparser-5.0-SNAPSHOT.jar:/mnt/ssd/jenkins/workspace/Lucene-Solr-trunk-Linux/solr/core/lib/commons-cli-1.2.jar:/mnt/ssd/jenkins/workspace/Lucene-Solr-trunk-Linux/solr/core/lib/commons-codec-1.7.jar:/mnt/ssd/jenkins/workspace/Lucene-Solr-trunk-Linux/solr/core/lib/commons-fileupload-1.2.1.jar:/mnt/ssd/jenkins/workspace/Lucene-Solr-trunk-Linux/solr/core/lib/commons-lang-2.6.jar:/mnt/ssd/jenkins/workspace/Lucene-Solr-trunk-Linux/solr/core/lib/easymock-2.2.jar:/mnt/ssd/jenkins/workspace/Lucene-Solr-trunk-Linux/solr/core/lib/guava-r05.jar:/mnt/ssd/jenkins/workspace/Lucene-Solr-trunk-Linux/solr/core/lib/javax.servlet-api-3.0.1.jar:/mnt/ssd/jenkins/workspace/Lucene-Solr-trunk-Linux/solr/core/lib/spatial4j-0.3.jar:/mnt/ssd/jenkins/workspace/Lucene-Solr-trunk-Linux/solr/solrj/lib/commons-io-2.1.jar:/mnt/ssd/jenkins/workspace/Lucene-Solr-trunk-Linux/solr/solrj/lib/httpclient-4.1.3.jar:/mnt/ssd/jenkins/workspace/Lucene-Solr-trunk-Linux/solr/solrj/lib/httpcore-4.1.4.jar:/mnt/ssd/jenkins/workspace/Lucene-Solr-trunk-Linux/solr/solrj/lib/httpmime-4.1.3.jar:/mnt/ssd/jenkins/workspace/Lucene-Solr-trunk-Linux/solr/solrj/lib/jcl-over-slf4j-1.6.4.jar:/mnt/ssd/jenkins/workspace/Lucene-Solr-trunk-Linux/solr/solrj/lib/log4j-over-slf4j-1.6.4.jar:/mnt/ssd/jenkins/workspace/Lucene-Solr-trunk-Linux/solr/solrj/lib/slf4j-api-1.6.4.jar:/mnt/ssd/jenkins/workspace/Lucene-Solr-trunk-Linux/solr/solrj/lib/slf4j-jdk14-1.6.4.jar:/mnt/ssd/jenkins/workspace/Lucene-Solr-trunk-Linux/solr/solrj/lib/wstx-asl-3.2.7.jar:/mnt/ssd/jenkins/workspace/Lucene-Solr-trunk-Linux/solr/solrj/lib/zookeeper-3.3.6.jar:/mnt/ssd/jenkins/workspace/Lucene-Solr-trunk-Linux/solr/example/lib/jetty-continuation-8.1.2.v20120308.jar:/mnt/ssd/jenkins/workspace/Lucene-Solr-trunk-Linux/solr/example/lib/jetty-deploy-8.1.2.v20120308.jar:/mnt/ssd/jenkins/workspace/Lucene-Solr-trunk-Linux/solr/example/lib/jetty-http-8.1.2.v20120308.jar:/mnt/ssd/jenkins/workspace/Lucene-Solr-trunk-Linux/solr/example/lib/jetty-io-8.1.2.v20120308.jar:/mnt/ssd/jenkins/workspace/Lucene-Solr-trunk-Linux/solr/example/lib/jetty-jmx-8.1.2.v20120308.jar:/mnt/ssd/jenkins/workspace/Lucene-Solr-trunk-Linux/solr/example/lib/jetty-security-8.1.2.v20120308.jar:/mnt/ssd/jenkins/workspace/Lucene-Solr-trunk-Linux/solr/example/lib/jetty-server-8.1.2.v20120308.jar:/mnt/ssd/jenkins/workspace/Lucene-Solr-trunk-Linux/solr/example/lib/jetty-servlet-8.1.2.v20120308.jar:/mnt/ssd/jenkins/workspace/Lucene-Solr-trunk-Linux/solr/example/lib/jetty-util-8.1.2.v20120308.jar:/mnt/ssd/jenkins/workspace/Lucene-Solr-trunk-Linux/solr/example/lib/jetty-webapp-8.1.2.v20120308.jar:/mnt/ssd/jenkins/workspace/Lucene-Solr-trunk-Linux/solr/example/lib/jetty-xml-8.1.2.v20120308.jar:/mnt/ssd/jenkins/workspace/Lucene-Solr-trunk-Linux/solr/example/lib/servlet-api-3.0.jar:/mnt/ssd/jenkins/workspace/Lucene-Solr-trunk-Linux/solr/example/example-DIH/solr/db/lib/hsqldb-1.8.0.10.jar:/mnt/ssd/jenkins/workspace/Lucene-Solr-trunk-Linux/lucene/build/core/classes/java:/mnt/ssd/jenkins/workspace/Lucene-Solr-trunk-Linux/lucene/test-framework/lib/junit-4.10.jar:/mnt/ssd/jenkins/workspace/Lucene-Solr-trunk-Linux/lucene/test-framework/lib/randomizedtesting-runner-2.0.1.jar:/var/lib/jenkins/tools/Ant/ANT_1.8.2/lib/ant-launcher.jar:/var/lib/jenkins/.ant/lib/ivy-2.2.0.jar:/var/lib/jenkins/tools/Ant/ANT_1.8.2/lib/ant-jdepend.jar:/var/lib/jenkins/tools/Ant/ANT_1.8.2/lib/ant-netrexx.jar:/var/lib/jenkins/tools/Ant/ANT_1.8.2/lib/ant-antlr.jar:/var/lib/jenkins/tools/Ant/ANT_1.8.2/lib/ant-commons-net.jar:/var/lib/jenkins/tools/Ant/ANT_1.8.2/lib/ant-javamail.jar:/var/lib/jenkins/tools/Ant/ANT_1.8.2/lib/ant-apache-regexp.jar:/var/lib/jenkins/tools/Ant/ANT_1.8.2/lib/ant-jsch.jar:/var/lib/jenkins/tools/Ant/ANT_1.8.2/lib/ant-apache-xalan2.jar:/var/lib/jenkins/tools/Ant/ANT_1.8.2/lib/ant-junit4.jar:/var/lib/jenkins/tools/Ant/ANT_1.8.2/lib/ant-jmf.jar:/var/lib/jenkins/tools/Ant/ANT_1.8.2/lib/ant.jar:/var/lib/jenkins/tools/Ant/ANT_1.8.2/lib/ant-junit.jar:/var/lib/jenkins/tools/Ant/ANT_1.8.2/lib/ant-apache-bcel.jar:/var/lib/jenkins/tools/Ant/ANT_1.8.2/lib/ant-jai.jar:/var/lib/jenkins/tools/Ant/ANT_1.8.2/lib/ant-commons-logging.jar:/var/lib/jenkins/tools/Ant/ANT_1.8.2/lib/ant-apache-resolver.jar:/var/lib/jenkins/tools/Ant/ANT_1.8.2/lib/ant-apache-oro.jar:/var/lib/jenkins/tools/Ant/ANT_1.8.2/lib/ant-swing.jar:/var/lib/jenkins/tools/Ant/ANT_1.8.2/lib/ant-apache-bsf.jar:/var/lib/jenkins/tools/Ant/ANT_1.8.2/lib/ant-apache-log4j.jar:/var/lib/jenkins/tools/Ant/ANT_1.8.2/lib/ant-testutil.jar:/opt/ibm/java-x86_64-70/lib/tools.jar:/var/lib/jenkins/.ivy2/cache/com.carrotsearch.randomizedtesting/junit4-ant/jars/junit4-ant-2.0.1.jar
[junit4:junit4]   2> 121 T218 oaz.Environment.logEnv Client environment:java.library.path=/opt/ibm/java-x86_64-70/jre/lib/amd64/default:/opt/ibm/java-x86_64-70/jre/lib/amd64:/opt/ibm/java-x86_64-70/jre/lib/amd64/j9vm:/opt/ibm/java-x86_64-70/jre/lib/amd64:/opt/ibm/java-x86_64-70/jre/../lib/amd64:/usr/lib/jvm/j2sdk1.6-sun/jre/lib/amd64/server:/usr/lib/jvm/j2sdk1.6-sun/jre/lib/amd64:/usr/lib/jvm/j2sdk1.6-sun/jre/../lib/amd64:/usr/lib
[junit4:junit4]   2> 121 T218 oaz.Environment.logEnv Client environment:java.io.tmpdir=.
[junit4:junit4]   2> 122 T218 oaz.Environment.logEnv Client environment:java.compiler=j9jit26
[junit4:junit4]   2> 122 T218 oaz.Environment.logEnv Client environment:os.name=Linux
[junit4:junit4]   2> 122 T218 oaz.Environment.logEnv Client environment:os.arch=amd64
[junit4:junit4]   2> 123 T218 oaz.Environment.logEnv Client environment:os.version=3.2.0-31-generic
[junit4:junit4]   2> 123 T218 oaz.Environment.logEnv Client environment:user.name=jenkins
[junit4:junit4]   2> 124 T218 oaz.Environment.logEnv Client environment:user.home=/var/lib/jenkins
[junit4:junit4]   2> 124 T218 oaz.Environment.logEnv Client environment:user.dir=/mnt/ssd/jenkins/workspace/Lucene-Solr-trunk-Linux/solr/build/solr-core/test/J1
[junit4:junit4]   2> 125 T218 oaz.ZooKeeper.<init> Initiating client connection, connectString=127.0.0.1:39731 sessionTimeout=10000 watcher=org.apache.solr.common.cloud.ConnectionManager@54e5d693
[junit4:junit4]   2> 133 T226 oaz.ClientCnxn$SendThread.startConnect Opening socket connection to server /127.0.0.1:39731
[junit4:junit4]   2> 133 T218 oascc.ConnectionManager.waitForConnected Waiting for client to connect to ZooKeeper
[junit4:junit4]   2> 136 T226 oaz.ClientCnxn$SendThread.primeConnection Socket connection established to localhost.localdomain/127.0.0.1:39731, initiating session
[junit4:junit4]   2> 137 T220 oazs.NIOServerCnxn$Factory.run Accepted socket connection from /127.0.0.1:39286
[junit4:junit4]   2> 206 T220 oazs.NIOServerCnxn.doIO WARNING Exception causing close of session 0x0 due to java.io.IOException: ZooKeeperServer not running
[junit4:junit4]   2> 207 T220 oazs.NIOServerCnxn.closeSock Closed socket connection for client /127.0.0.1:39286 (no session established for client)
[junit4:junit4]   2> 207 T226 oaz.ClientCnxn$SendThread.run Unable to read additional data from server sessionid 0x0, likely server has closed socket, closing socket connection and attempting reconnect
[junit4:junit4]   2> 2130 T226 oaz.ClientCnxn$SendThread.startConnect Opening socket connection to server localhost.localdomain/127.0.0.1:39731
[junit4:junit4]   2> 2131 T226 oaz.ClientCnxn$SendThread.primeConnection Socket connection established to localhost.localdomain/127.0.0.1:39731, initiating session
[junit4:junit4]   2> 2131 T220 oazs.NIOServerCnxn$Factory.run Accepted socket connection from /127.0.0.1:39287
[junit4:junit4]   2> 2132 T220 oazs.NIOServerCnxn.readConnectRequest Client attempting to establish new session at /127.0.0.1:39287
[junit4:junit4]   2> 2134 T222 oazsp.FileTxnLog.append Creating new log file: log.1
[junit4:junit4]   2> 2190 T222 oazs.NIOServerCnxn.finishSessionInit Established session 0x139f8efd6ac0000 with negotiated timeout 10000 for client /127.0.0.1:39287
[junit4:junit4]   2> 2190 T226 oaz.ClientCnxn$SendThread.readConnectResult Session establishment complete on server localhost.localdomain/127.0.0.1:39731, sessionid = 0x139f8efd6ac0000, negotiated timeout = 10000
[junit4:junit4]   2> 2192 T227 oascc.ConnectionManager.process Watcher org.apache.solr.common.cloud.ConnectionManager@54e5d693 name:ZooKeeperConnection Watcher:127.0.0.1:39731 got event WatchedEvent state:SyncConnected type:None path:null path:null type:None
[junit4:junit4]   2> 2192 T218 oascc.ConnectionManager.waitForConnected Client is connected to ZooKeeper
[junit4:junit4]   2> 2193 T218 oascc.SolrZkClient.makePath makePath: /solr
[junit4:junit4]   2> 2205 T223 oazs.PrepRequestProcessor.pRequest Processed session termination for sessionid: 0x139f8efd6ac0000
[junit4:junit4]   2> 2205 T227 oaz.ClientCnxn$EventThread.run EventThread shut down
[junit4:junit4]   2> 2206 T220 oazs.NIOServerCnxn.closeSock Closed socket connection for client /127.0.0.1:39287 which had sessionid 0x139f8efd6ac0000
[junit4:junit4]   2> 2206 T218 oaz.ZooKeeper.close Session: 0x139f8efd6ac0000 closed
[junit4:junit4]   2> 2207 T218 oaz.ZooKeeper.<init> Initiating client connection, connectString=127.0.0.1:39731/solr sessionTimeout=10000 watcher=org.apache.solr.common.cloud.ConnectionManager@56b74f7
[junit4:junit4]   2> 2209 T228 oaz.ClientCnxn$SendThread.startConnect Opening socket connection to server /127.0.0.1:39731
[junit4:junit4]   2> 2209 T218 oascc.ConnectionManager.waitForConnected Waiting for client to connect to ZooKeeper
[junit4:junit4]   2> 2209 T228 oaz.ClientCnxn$SendThread.primeConnection Socket connection established to localhost.localdomain/127.0.0.1:39731, initiating session
[junit4:junit4]   2> 2210 T220 oazs.NIOServerCnxn$Factory.run Accepted socket connection from /127.0.0.1:39288
[junit4:junit4]   2> 2210 T220 oazs.NIOServerCnxn.readConnectRequest Client attempting to establish new session at /127.0.0.1:39288
[junit4:junit4]   2> 2211 T222 oazs.NIOServerCnxn.finishSessionInit Established session 0x139f8efd6ac0001 with negotiated timeout 10000 for client /127.0.0.1:39288
[junit4:junit4]   2> 2212 T228 oaz.ClientCnxn$SendThread.readConnectResult Session establishment complete on server localhost.localdomain/127.0.0.1:39731, sessionid = 0x139f8efd6ac0001, negotiated timeout = 10000
[junit4:junit4]   2> 2212 T229 oascc.ConnectionManager.process Watcher org.apache.solr.common.cloud.ConnectionManager@56b74f7 name:ZooKeeperConnection Watcher:127.0.0.1:39731/solr got event WatchedEvent state:SyncConnected type:None path:null path:null type:None
[junit4:junit4]   2> 2213 T218 oascc.ConnectionManager.waitForConnected Client is connected to ZooKeeper
[junit4:junit4]   2> 2213 T218 oascc.SolrZkClient.makePath makePath: /collections/collection1
[junit4:junit4]   2> 2218 T218 oascc.SolrZkClient.makePath makePath: /collections/collection1/shards
[junit4:junit4]   2> 2221 T218 oascc.SolrZkClient.makePath makePath: /collections/control_collection
[junit4:junit4]   2> 2223 T218 oascc.SolrZkClient.makePath makePath: /collections/control_collection/shards
[junit4:junit4]   2> 2227 T218 oasc.AbstractZkTestCase.putConfig put /mnt/ssd/jenkins/workspace/Lucene-Solr-trunk-Linux/solr/build/solr-core/test-files/solr/collection1/conf/solrconfig.xml to /configs/conf1/solrconfig.xml
[junit4:junit4]   2> 2231 T218 oascc.SolrZkClient.makePath makePath: /configs/conf1/solrconfig.xml
[junit4:junit4]   2> 2238 T218 oasc.AbstractZkTestCase.putConfig put /mnt/ssd/jenkins/workspace/Lucene-Solr-trunk-Linux/solr/build/solr-core/test-files/solr/collection1/conf/schema.xml to /configs/conf1/schema.xml
[junit4:junit4]   2> 2241 T218 oascc.SolrZkClient.makePath makePath: /configs/conf1/schema.xml
[junit4:junit4]   2> 2245 T218 oasc.AbstractZkTestCase.putConfig put /mnt/ssd/jenkins/workspace/Lucene-Solr-trunk-Linux/solr/build/solr-core/test-files/solr/collection1/conf/solrconfig.xml to /configs/conf1/solrconfig.xml
[junit4:junit4]   2> 2247 T218 oascc.SolrZkClient.makePath makePath: /configs/conf1/solrconfig.xml
[junit4:junit4]   2> 2251 T218 oasc.AbstractZkTestCase.putConfig put /mnt/ssd/jenkins/workspace/Lucene-Solr-trunk-Linux/solr/build/solr-core/test-files/solr/collection1/conf/stopwords.txt to /configs/conf1/stopwords.txt
[junit4:junit4]   2> 2252 T218 oascc.SolrZkClient.makePath makePath: /configs/conf1/stopwords.txt
[junit4:junit4]   2> 2255 T218 oasc.AbstractZkTestCase.putConfig put /mnt/ssd/jenkins/workspace/Lucene-Solr-trunk-Linux/solr/build/solr-core/test-files/solr/collection1/conf/protwords.txt to /configs/conf1/protwords.txt
[junit4:junit4]   2> 2256 T218 oascc.SolrZkClient.makePath makePath: /configs/conf1/protwords.txt
[junit4:junit4]   2> 2259 T218 oasc.AbstractZkTestCase.putConfig put /mnt/ssd/jenkins/workspace/Lucene-Solr-trunk-Linux/solr/build/solr-core/test-files/solr/collection1/conf/currency.xml to /configs/conf1/currency.xml
[junit4:junit4]   2> 2260 T218 oascc.SolrZkClient.makePath makePath: /configs/conf1/currency.xml
[junit4:junit4]   2> 2265 T218 oasc.AbstractZkTestCase.putConfig put /mnt/ssd/jenkins/workspace/Lucene-Solr-trunk-Linux/solr/build/solr-core/test-files/solr/collection1/conf/open-exchange-rates.json to /configs/conf1/open-exchange-rates.json
[junit4:junit4]   2> 2266 T218 oascc.SolrZkClient.makePath makePath: /configs/conf1/open-exchange-rates.json
[junit4:junit4]   2> 2270 T218 oasc.AbstractZkTestCase.putConfig put /mnt/ssd/jenkins/workspace/Lucene-Solr-trunk-Linux/solr/build/solr-core/test-files/solr/collection1/conf/mapping-ISOLatin1Accent.txt to /configs/conf1/mapping-ISOLatin1Accent.txt
[junit4:junit4]   2> 2270 T218 oascc.SolrZkClient.makePath makePath: /configs/conf1/mapping-ISOLatin1Accent.txt
[junit4:junit4]   2> 2273 T218 oasc.AbstractZkTestCase.putConfig put /mnt/ssd/jenkins/workspace/Lucene-Solr-trunk-Linux/solr/build/solr-core/test-files/solr/collection1/conf/old_synonyms.txt to /configs/conf1/old_synonyms.txt
[junit4:junit4]   2> 2273 T218 oascc.SolrZkClient.makePath makePath: /configs/conf1/old_synonyms.txt
[junit4:junit4]   2> 2276 T218 oasc.AbstractZkTestCase.putConfig put /mnt/ssd/jenkins/workspace/Lucene-Solr-trunk-Linux/solr/build/solr-core/test-files/solr/collection1/conf/synonyms.txt to /configs/conf1/synonyms.txt
[junit4:junit4]   2> 2276 T218 oascc.SolrZkClient.makePath makePath: /configs/conf1/synonyms.txt
[junit4:junit4]   2> 2280 T223 oazs.PrepRequestProcessor.pRequest Processed session termination for sessionid: 0x139f8efd6ac0001
[junit4:junit4]   2> 2281 T229 oaz.ClientCnxn$EventThread.run EventThread shut down
[junit4:junit4]   2> 2281 T218 oaz.ZooKeeper.close Session: 0x139f8efd6ac0001 closed
[junit4:junit4]   2> 2281 T220 oazs.NIOServerCnxn.closeSock Closed socket connection for client /127.0.0.1:39288 which had sessionid 0x139f8efd6ac0001
[junit4:junit4]   2> 2349 T218 oejs.Server.doStart jetty-8.1.2.v20120308
[junit4:junit4]   2> 2352 T218 oejs.AbstractConnector.doStart Started SocketConnector@0.0.0.0:55918
[junit4:junit4]   2> 2352 T218 oasc.SolrResourceLoader.locateSolrHome JNDI not configured for solr (NoInitialContextEx)
[junit4:junit4]   2> 2353 T218 oasc.SolrResourceLoader.locateSolrHome using system property solr.solr.home: /mnt/ssd/jenkins/workspace/Lucene-Solr-trunk-Linux/solr/build/solr-core/test/J1/./org.apache.solr.cloud.RecoveryZkTest-controljetty-1348501233495
[junit4:junit4]   2> 2353 T218 oasc.SolrResourceLoader.<init> new SolrResourceLoader for deduced Solr Home: '/mnt/ssd/jenkins/workspace/Lucene-Solr-trunk-Linux/solr/build/solr-core/test/J1/./org.apache.solr.cloud.RecoveryZkTest-controljetty-1348501233495/'
[junit4:junit4]   2> 2377 T218 oass.SolrDispatchFilter.init SolrDispatchFilter.init()
[junit4:junit4]   2> 2378 T218 oasc.SolrResourceLoader.locateSolrHome JNDI not configured for solr (NoInitialContextEx)
[junit4:junit4]   2> 2378 T218 oasc.SolrResourceLoader.locateSolrHome using system property solr.solr.home: /mnt/ssd/jenkins/workspace/Lucene-Solr-trunk-Linux/solr/build/solr-core/test/J1/./org.apache.solr.cloud.RecoveryZkTest-controljetty-1348501233495
[junit4:junit4]   2> 2379 T218 oasc.CoreContainer$Initializer.initialize looking for solr.xml: /mnt/ssd/jenkins/workspace/Lucene-Solr-trunk-Linux/solr/build/solr-core/test/J1/./org.apache.solr.cloud.RecoveryZkTest-controljetty-1348501233495/solr.xml
[junit4:junit4]   2> 2379 T218 oasc.CoreContainer.<init> New CoreContainer 951254187
[junit4:junit4]   2> 2380 T218 oasc.CoreContainer.load Loading CoreContainer using Solr Home: '/mnt/ssd/jenkins/workspace/Lucene-Solr-trunk-Linux/solr/build/solr-core/test/J1/./org.apache.solr.cloud.RecoveryZkTest-controljetty-1348501233495/'
[junit4:junit4]   2> 2380 T218 oasc.SolrResourceLoader.<init> new SolrResourceLoader for directory: '/mnt/ssd/jenkins/workspace/Lucene-Solr-trunk-Linux/solr/build/solr-core/test/J1/./org.apache.solr.cloud.RecoveryZkTest-controljetty-1348501233495/'
[junit4:junit4]   2> 2392 T218 oasc.CoreContainer.load Registering Log Listener
[junit4:junit4]   2> 2402 T218 oasc.CoreContainer.initZooKeeper Zookeeper client=127.0.0.1:39731/solr
[junit4:junit4]   2> 2408 T218 oaz.ZooKeeper.<init> Initiating client connection, connectString=127.0.0.1:39731/solr sessionTimeout=5000 watcher=org.apache.solr.common.cloud.ConnectionManager@dbe3cb8
[junit4:junit4]   2> 2412 T239 oaz.ClientCnxn$SendThread.startConnect Opening socket connection to server /127.0.0.1:39731
[junit4:junit4]   2> 2412 T218 oascc.ConnectionManager.waitForConnected Waiting for client to connect to ZooKeeper
[junit4:junit4]   2> 2413 T220 oazs.NIOServerCnxn$Factory.run Accepted socket connection from /127.0.0.1:39289
[junit4:junit4]   2> 2413 T239 oaz.ClientCnxn$SendThread.primeConnection Socket connection established to localhost.localdomain/127.0.0.1:39731, initiating session
[junit4:junit4]   2> 2414 T220 oazs.NIOServerCnxn.readConnectRequest Client attempting to establish new session at /127.0.0.1:39289
[junit4:junit4]   2> 2415 T222 oazs.NIOServerCnxn.finishSessionInit Established session 0x139f8efd6ac0002 with negotiated timeout 5000 for client /127.0.0.1:39289
[junit4:junit4]   2> 2416 T239 oaz.ClientCnxn$SendThread.readConnectResult Session establishment complete on server localhost.localdomain/127.0.0.1:39731, sessionid = 0x139f8efd6ac0002, negotiated timeout = 5000
[junit4:junit4]   2> 2416 T240 oascc.ConnectionManager.process Watcher org.apache.solr.common.cloud.ConnectionManager@dbe3cb8 name:ZooKeeperConnection Watcher:127.0.0.1:39731/solr got event WatchedEvent state:SyncConnected type:None path:null path:null type:None
[junit4:junit4]   2> 2418 T218 oascc.ConnectionManager.waitForConnected Client is connected to ZooKeeper
[junit4:junit4]   2> 2422 T223 oazs.PrepRequestProcessor.pRequest Got user-level KeeperException when processing sessionid:0x139f8efd6ac0002 type:create cxid:0x2 zxid:0xfffffffffffffffe txntype:unknown reqpath:n/a Error Path:/solr/overseer Error:KeeperErrorCode = NodeExists for /solr/overseer
[junit4:junit4]   2> 2426 T218 oascc.SolrZkClient.makePath makePath: /live_nodes
[junit4:junit4]   2> 2428 T218 oasc.ZkController.createEphemeralLiveNode Register node as live in ZooKeeper:/live_nodes/127.0.0.1:55918_solr
[junit4:junit4]   2> 2430 T223 oazs.PrepRequestProcessor.pRequest Got user-level KeeperException when processing sessionid:0x139f8efd6ac0002 type:delete cxid:0x7 zxid:0xfffffffffffffffe txntype:unknown reqpath:n/a Error Path:/solr/live_nodes/127.0.0.1:55918_solr Error:KeeperErrorCode = NoNode for /solr/live_nodes/127.0.0.1:55918_solr
[junit4:junit4]   2> 2430 T218 oascc.SolrZkClient.makePath makePath: /live_nodes/127.0.0.1:55918_solr
[junit4:junit4]   2> 2433 T218 oashc.HttpShardHandlerFactory.getParameter Setting socketTimeout to: 0
[junit4:junit4]   2> 2433 T218 oashc.HttpShardHandlerFactory.getParameter Setting urlScheme to: http://
[junit4:junit4]   2> 2434 T218 oashc.HttpShardHandlerFactory.getParameter Setting connTimeout to: 0
[junit4:junit4]   2> 2434 T218 oashc.HttpShardHandlerFactory.getParameter Setting maxConnectionsPerHost to: 20
[junit4:junit4]   2> 2435 T218 oashc.HttpShardHandlerFactory.getParameter Setting corePoolSize to: 0
[junit4:junit4]   2> 2435 T218 oashc.HttpShardHandlerFactory.getParameter Setting maximumPoolSize to: 2147483647
[junit4:junit4]   2> 2436 T218 oashc.HttpShardHandlerFactory.getParameter Setting maxThreadIdleTime to: 5
[junit4:junit4]   2> 2436 T218 oashc.HttpShardHandlerFactory.getParameter Setting sizeOfQueue to: -1
[junit4:junit4]   2> 2437 T218 oashc.HttpShardHandlerFactory.getParameter Setting fairnessPolicy to: false
[junit4:junit4]   2> 2437 T218 oascsi.HttpClientUtil.createClient Creating new http client, config:maxConnectionsPerHost=20&maxConnections=10000&socketTimeout=0&connTimeout=0&retry=false
[junit4:junit4]   2> 2448 T218 oascc.SolrZkClient.makePath makePath: /overseer_elect/election
[junit4:junit4]   2> 2454 T223 oazs.PrepRequestProcessor.pRequest Got user-level KeeperException when processing sessionid:0x139f8efd6ac0002 type:delete cxid:0x15 zxid:0xfffffffffffffffe txntype:unknown reqpath:n/a Error Path:/solr/overseer_elect/leader Error:KeeperErrorCode = NoNode for /solr/overseer_elect/leader
[junit4:junit4]   2> 2455 T218 oascc.SolrZkClient.makePath makePath: /overseer_elect/leader
[junit4:junit4]   2> 2458 T218 oasc.Overseer.start Overseer (id=88375376692903938-127.0.0.1:55918_solr-n_0000000000) starting
[junit4:junit4]   2> 2458 T223 oazs.PrepRequestProcessor.pRequest Got user-level KeeperException when processing sessionid:0x139f8efd6ac0002 type:create cxid:0x1a zxid:0xfffffffffffffffe txntype:unknown reqpath:n/a Error Path:/solr/overseer Error:KeeperErrorCode = NodeExists for /solr/overseer
[junit4:junit4]   2> 2461 T223 oazs.PrepRequestProcessor.pRequest Got user-level KeeperException when processing sessionid:0x139f8efd6ac0002 type:create cxid:0x1b zxid:0xfffffffffffffffe txntype:unknown reqpath:n/a Error Path:/solr/overseer Error:KeeperErrorCode = NodeExists for /solr/overseer
[junit4:junit4]   2> 2474 T223 oazs.PrepRequestProcessor.pRequest Got user-level KeeperException when processing sessionid:0x139f8efd6ac0002 type:create cxid:0x1c zxid:0xfffffffffffffffe txntype:unknown reqpath:n/a Error Path:/solr/overseer Error:KeeperErrorCode = NodeExists for /solr/overseer
[junit4:junit4]   2> 2477 T223 oazs.PrepRequestProcessor.pRequest Got user-level KeeperException when processing sessionid:0x139f8efd6ac0002 type:create cxid:0x1d zxid:0xfffffffffffffffe txntype:unknown reqpath:n/a Error Path:/solr/overseer Error:KeeperErrorCode = NodeExists for /solr/overseer
[junit4:junit4]   2> 2478 T242 oasc.OverseerCollectionProcessor.run Process current queue of collection creations
[junit4:junit4]   2> 2478 T218 oascc.SolrZkClient.makePath makePath: /clusterstate.json
[junit4:junit4]   2> 2483 T218 oascc.ZkStateReader.createClusterStateWatchersAndUpdate Updating cluster state from ZooKeeper... 
[junit4:junit4]   2> 2491 T241 oasc.Overseer$ClusterStateUpdater.run Starting to work on the main queue
[junit4:junit4]   2> 2492 T218 oasc.CoreContainer.create Creating SolrCore 'collection1' using instanceDir: /mnt/ssd/jenkins/workspace/Lucene-Solr-trunk-Linux/solr/build/solr-core/test/J1/./org.apache.solr.cloud.RecoveryZkTest-controljetty-1348501233495/collection1
[junit4:junit4]   2> 2492 T218 oasc.ZkController.createCollectionZkNode Check for collection zkNode:control_collection
[junit4:junit4]   2> 2493 T218 oasc.ZkController.createCollectionZkNode Collection zkNode exists
[junit4:junit4]   2> 2494 T218 oasc.ZkController.readConfigName Load collection config from:/collections/control_collection
[junit4:junit4]   2> 2495 T218 oasc.SolrResourceLoader.<init> new SolrResourceLoader for directory: '/mnt/ssd/jenkins/workspace/Lucene-Solr-trunk-Linux/solr/build/solr-core/test/J1/./org.apache.solr.cloud.RecoveryZkTest-controljetty-1348501233495/collection1/'
[junit4:junit4]   2> 2496 T218 oasc.SolrResourceLoader.replaceClassLoader Adding 'file:/mnt/ssd/jenkins/workspace/Lucene-Solr-trunk-Linux/solr/build/solr-core/test/J1/org.apache.solr.cloud.RecoveryZkTest-controljetty-1348501233495/collection1/lib/README' to classloader
[junit4:junit4]   2> 2497 T218 oasc.SolrResourceLoader.replaceClassLoader Adding 'file:/mnt/ssd/jenkins/workspace/Lucene-Solr-trunk-Linux/solr/build/solr-core/test/J1/org.apache.solr.cloud.RecoveryZkTest-controljetty-1348501233495/collection1/lib/classes/' to classloader
[junit4:junit4]   2> 2520 T218 oasc.SolrConfig.<init> Using Lucene MatchVersion: LUCENE_50
[junit4:junit4]   2> 2554 T218 oasc.SolrConfig.<init> Loaded SolrConfig: solrconfig.xml
[junit4:junit4]   2> 2556 T218 oass.IndexSchema.readSchema Reading Solr Schema
[junit4:junit4]   2> 2560 T218 oass.IndexSchema.readSchema Schema name=test
[junit4:junit4]   2> 2880 T218 oass.OpenExchangeRatesOrgProvider.init Initialized with rates=open-exchange-rates.json, refreshInterval=1440.
[junit4:junit4]   2> 2887 T218 oass.IndexSchema.readSchema default search field in schema is text
[junit4:junit4]   2> 2890 T218 oass.IndexSchema.readSchema unique key field: id
[junit4:junit4]   2> 3148 T218 oass.FileExchangeRateProvider.reload Reloading exchange rates from file currency.xml
[junit4:junit4]   2> 3154 T218 oass.FileExchangeRateProvider.reload Reloading exchange rates from file currency.xml
[junit4:junit4]   2> 3161 T218 oass.OpenExchangeRatesOrgProvider.reload Reloading exchange rates from open-exchange-rates.json
[junit4:junit4]   2> 3163 T218 oass.OpenExchangeRatesOrgProvider.reload Reloading exchange rates from open-exchange-rates.json
[junit4:junit4]   2> 3165 T218 oasc.SolrCore.<init> [collection1] Opening new SolrCore at /mnt/ssd/jenkins/workspace/Lucene-Solr-trunk-Linux/solr/build/solr-core/test/J1/./org.apache.solr.cloud.RecoveryZkTest-controljetty-1348501233495/collection1/, dataDir=./org.apache.solr.cloud.RecoveryZkTest-1348501231217/control/data/
[junit4:junit4]   2> 3165 T218 oasc.JmxMonitoredMap.<init> JMX monitoring is enabled. Adding Solr mbeans to JMX Server: com.sun.jmx.mbeanserver.JmxMBeanServer@337ab6d7
[junit4:junit4]   2> 3482 T218 oasc.SolrCore.getNewIndexDir WARNING New index directory detected: old=null new=./org.apache.solr.cloud.RecoveryZkTest-1348501231217/control/data/index/
[junit4:junit4]   2> 3483 T218 oasc.SolrCore.initIndex WARNING [collection1] Solr index directory './org.apache.solr.cloud.RecoveryZkTest-1348501231217/control/data/index' doesn't exist. Creating new index...
[junit4:junit4]   2> 3483 T218 oasc.CachingDirectoryFactory.get return new directory for /mnt/ssd/jenkins/workspace/Lucene-Solr-trunk-Linux/solr/build/solr-core/test/J1/./org.apache.solr.cloud.RecoveryZkTest-1348501231217/control/data/index forceNew:false
[junit4:junit4]   2> 3487 T218 oasc.SolrDeletionPolicy.onCommit SolrDeletionPolicy.onCommit: commits:num=1
[junit4:junit4]   2> 		commit{dir=/mnt/ssd/jenkins/workspace/Lucene-Solr-trunk-Linux/solr/build/solr-core/test/J1/org.apache.solr.cloud.RecoveryZkTest-1348501231217/control/data/index,segFN=segments_1,generation=1,filenames=[segments_1]
[junit4:junit4]   2> 3488 T218 oasc.SolrDeletionPolicy.updateCommits newest commit = 1
[junit4:junit4]   2> 3488 T218 oasc.SolrCore.initWriters created xml: solr.XMLResponseWriter
[junit4:junit4]   2> 3491 T218 oasup.UpdateRequestProcessorChain.init inserting DistributedUpdateProcessorFactory into updateRequestProcessorChain "dedupe"
[junit4:junit4]   2> 3491 T218 oasup.UpdateRequestProcessorChain.init inserting DistributedUpdateProcessorFactory into updateRequestProcessorChain "dedupe-allfields"
[junit4:junit4]   2> 3492 T218 oasup.UpdateRequestProcessorChain.init inserting DistributedUpdateProcessorFactory into updateRequestProcessorChain "stored_sig"
[junit4:junit4]   2> 3492 T218 oasup.UpdateRequestProcessorChain.init inserting DistributedUpdateProcessorFactory into updateRequestProcessorChain "uniq-fields"
[junit4:junit4]   2> 3493 T218 oasup.UpdateRequestProcessorChain.init inserting DistributedUpdateProcessorFactory into updateRequestProcessorChain "distrib-dup-test-chain-implicit"
[junit4:junit4]   2> 3494 T218 oasc.RequestHandlers.initHandlersFromConfig adding lazy requestHandler: solr.ReplicationHandler
[junit4:junit4]   2> 3494 T218 oasc.RequestHandlers.initHandlersFromConfig created /replication: solr.ReplicationHandler
[junit4:junit4]   2> 3495 T218 oasc.RequestHandlers.initHandlersFromConfig created standard: solr.StandardRequestHandler
[junit4:junit4]   2> 3497 T218 oasc.RequestHandlers.initHandlersFromConfig created /get: solr.RealTimeGetHandler
[junit4:junit4]   2> 3497 T218 oasc.RequestHandlers.initHandlersFromConfig created dismax: solr.SearchHandler
[junit4:junit4]   2> 3498 T218 oasc.RequestHandlers.initHandlersFromConfig created mock: org.apache.solr.core.MockQuerySenderListenerReqHandler
[junit4:junit4]   2> 3499 T218 oasc.RequestHandlers.initHandlersFromConfig created /admin/: org.apache.solr.handler.admin.AdminHandlers
[junit4:junit4]   2> 3500 T218 oasc.RequestHandlers.initHandlersFromConfig created defaults: solr.StandardRequestHandler
[junit4:junit4]   2> 3500 T218 oasc.RequestHandlers.initHandlersFromConfig adding lazy requestHandler: solr.StandardRequestHandler
[junit4:junit4]   2> 3501 T218 oasc.RequestHandlers.initHandlersFromConfig created lazy: solr.StandardRequestHandler
[junit4:junit4]   2> 3502 T218 oasc.RequestHandlers.initHandlersFromConfig created /update: solr.UpdateRequestHandler
[junit4:junit4]   2> 3503 T218 oasc.RequestHandlers.initHandlersFromConfig created /terms: org.apache.solr.handler.component.SearchHandler
[junit4:junit4]   2> 3504 T218 oasc.RequestHandlers.initHandlersFromConfig created spellCheckCompRH: org.apache.solr.handler.component.SearchHandler
[junit4:junit4]   2> 3505 T218 oasc.RequestHandlers.initHandlersFromConfig created spellCheckCompRH_Direct: org.apache.solr.handler.component.SearchHandler
[junit4:junit4]   2> 3506 T218 oasc.RequestHandlers.initHandlersFromConfig created spellCheckWithWordbreak: org.apache.solr.handler.component.SearchHandler
[junit4:junit4]   2> 3507 T218 oasc.RequestHandlers.initHandlersFromConfig created spellCheckWithWordbreak_Direct: org.apache.solr.handler.component.SearchHandler
[junit4:junit4]   2> 3509 T218 oasc.RequestHandlers.initHandlersFromConfig created spellCheckCompRH1: org.apache.solr.handler.component.SearchHandler
[junit4:junit4]   2> 3510 T218 oasc.RequestHandlers.initHandlersFromConfig created tvrh: org.apache.solr.handler.component.SearchHandler
[junit4:junit4]   2> 3511 T218 oasc.RequestHandlers.initHandlersFromConfig created /mlt: solr.MoreLikeThisHandler
[junit4:junit4]   2> 3513 T218 oasc.RequestHandlers.initHandlersFromConfig created /debug/dump: solr.DumpRequestHandler
[junit4:junit4]   2> 3514 T218 oashl.XMLLoader.init xsltCacheLifetimeSeconds=60
[junit4:junit4]   2> 3516 T218 oasc.SolrCore.initDeprecatedSupport WARNING solrconfig.xml uses deprecated <admin/gettableFiles>, Please update your config to use the ShowFileRequestHandler.
[junit4:junit4]   2> 3519 T218 oasc.SolrCore.initDeprecatedSupport WARNING adding ShowFileRequestHandler with hidden files: [OLD_SYNONYMS.TXT, PROTWORDS.TXT, STOPWORDS.TXT, OPEN-EXCHANGE-RATES.JSON, CURRENCY.XML, SCHEMA.XML, SYNONYMS.TXT, MAPPING-ISOLATIN1ACCENT.TXT]
[junit4:junit4]   2> 3523 T218 oass.SolrIndexSearcher.<init> Opening Searcher@a6aa094a main
[junit4:junit4]   2> 3524 T218 oasu.CommitTracker.<init> Hard AutoCommit: disabled
[junit4:junit4]   2> 3525 T218 oasu.CommitTracker.<init> Soft AutoCommit: disabled
[junit4:junit4]   2> 3527 T218 oashc.SpellCheckComponent.inform Initializing spell checkers
[junit4:junit4]   2> 3532 T218 oass.DirectSolrSpellChecker.init init: {name=direct,classname=DirectSolrSpellChecker,field=lowerfilt,minQueryLength=3}
[junit4:junit4]   2> 3569 T243 oasc.SolrCore.registerSearcher [collection1] Registered new searcher Searcher@a6aa094a main{StandardDirectoryReader(segments_1:1)}
[junit4:junit4]   2> 3584 T223 oazs.PrepRequestProcessor.pRequest Got user-level KeeperException when processing sessionid:0x139f8efd6ac0002 type:create cxid:0x56 zxid:0xfffffffffffffffe txntype:unknown reqpath:n/a Error Path:/solr/overseer/queue Error:KeeperErrorCode = NoNode for /solr/overseer/queue
[junit4:junit4]   2> 3586 T218 oasc.CoreContainer.register registering core: collection1
[junit4:junit4]   2> 3587 T218 oasc.ZkController.register Register shard - core:collection1 address:http://127.0.0.1:55918/solr shardId:control_shard
[junit4:junit4]   2> 3589 T218 oascsi.HttpClientUtil.createClient Creating new http client, config:maxConnections=10000&maxConnectionsPerHost=20&connTimeout=30000&socketTimeout=30000&retry=false
[junit4:junit4]   2> 3596 T218 oascc.SolrZkClient.makePath makePath: /collections/control_collection/leader_elect/control_shard/election
[junit4:junit4]   2> 3603 T223 oazs.PrepRequestProcessor.pRequest Got user-level KeeperException when processing sessionid:0x139f8efd6ac0002 type:delete cxid:0x65 zxid:0xfffffffffffffffe txntype:unknown reqpath:n/a Error Path:/solr/collections/control_collection/leaders Error:KeeperErrorCode = NoNode for /solr/collections/control_collection/leaders
[junit4:junit4]   2> 3603 T218 oasc.ShardLeaderElectionContext.runLeaderProcess Running the leader process.
[junit4:junit4]   2> 3604 T223 oazs.PrepRequestProcessor.pRequest Got user-level KeeperException when processing sessionid:0x139f8efd6ac0002 type:create cxid:0x66 zxid:0xfffffffffffffffe txntype:unknown reqpath:n/a Error Path:/solr/overseer Error:KeeperErrorCode = NodeExists for /solr/overseer
[junit4:junit4]   2> 4000 T241 oascc.ZkStateReader.updateClusterState Updating cloud state from ZooKeeper... 
[junit4:junit4]   2> 4005 T223 oazs.PrepRequestProcessor.pRequest Got user-level KeeperException when processing sessionid:0x139f8efd6ac0002 type:create cxid:0x6d zxid:0xfffffffffffffffe txntype:unknown reqpath:n/a Error Path:/solr/overseer/queue-work Error:KeeperErrorCode = NoNode for /solr/overseer/queue-work
[junit4:junit4]   2> 4028 T240 oascc.ZkStateReader$2.process A cluster state change has occurred - updating...
[junit4:junit4]   2> 4106 T218 oasc.ShardLeaderElectionContext.waitForReplicasToComeUp Enough replicas found to continue.
[junit4:junit4]   2> 4108 T218 oasc.ShardLeaderElectionContext.runLeaderProcess I may be the new leader - try and sync
[junit4:junit4]   2> 4109 T218 oasc.SyncStrategy.sync Sync replicas to http://127.0.0.1:55918/solr/collection1/
[junit4:junit4]   2> 4110 T218 oasc.SyncStrategy.syncReplicas Sync Success - now sync replicas to me
[junit4:junit4]   2> 4112 T218 oasc.SyncStrategy.syncToMe http://127.0.0.1:55918/solr/collection1/ has no replicas
[junit4:junit4]   2> 4113 T218 oasc.ShardLeaderElectionContext.runLeaderProcess I am the new leader: http://127.0.0.1:55918/solr/collection1/
[junit4:junit4]   2> 4114 T218 oascc.SolrZkClient.makePath makePath: /collections/control_collection/leaders/control_shard
[junit4:junit4]   2> 4123 T223 oazs.PrepRequestProcessor.pRequest Got user-level KeeperException when processing sessionid:0x139f8efd6ac0002 type:create cxid:0x8b zxid:0xfffffffffffffffe txntype:unknown reqpath:n/a Error Path:/solr/overseer Error:KeeperErrorCode = NodeExists for /solr/overseer
[junit4:junit4]   2> 4541 T241 oascc.ZkStateReader.updateClusterState Updating cloud state from ZooKeeper... 
[junit4:junit4]   2> 4558 T240 oascc.ZkStateReader$2.process A cluster state change has occurred - updating...
[junit4:junit4]   2> 4578 T218 oasc.ZkController.register We are http://127.0.0.1:55918/solr/collection1/ and leader is http://127.0.0.1:55918/solr/collection1/
[junit4:junit4]   2> 4579 T218 oasc.ZkController.register No LogReplay needed for core=collection1 baseURL=http://127.0.0.1:55918/solr
[junit4:junit4]   2> 4579 T218 oasc.ZkController.checkRecovery I am the leader, no recovery necessary
[junit4:junit4]   2> 4581 T218 oascc.ZkStateReader.updateClusterState Updating cloud state from ZooKeeper... 
[junit4:junit4]   2> 4582 T218 oass.SolrDispatchFilter.init user.dir=/mnt/ssd/jenkins/workspace/Lucene-Solr-trunk-Linux/solr/build/solr-core/test/J1
[junit4:junit4]   2> 4582 T218 oass.SolrDispatchFilter.init SolrDispatchFilter.init() done
[junit4:junit4]   2> 4583 T218 oascsi.HttpClientUtil.createClient Creating new http client, config:maxConnections=128&maxConnectionsPerHost=32&followRedirects=false
[junit4:junit4]   2> 4640 T218 oejs.Server.doStart jetty-8.1.2.v20120308
[junit4:junit4]   2> 4641 T218 oejs.AbstractConnector.doStart Started SocketConnector@0.0.0.0:42661
[junit4:junit4]   2> 4642 T218 oasc.SolrResourceLoader.locateSolrHome JNDI not configured for solr (NoInitialContextEx)
[junit4:junit4]   2> 4642 T218 oasc.SolrResourceLoader.locateSolrHome using system property solr.solr.home: /mnt/ssd/jenkins/workspace/Lucene-Solr-trunk-Linux/solr/build/solr-core/test/J1/./org.apache.solr.cloud.RecoveryZkTest-jetty1-1348501235802
[junit4:junit4]   2> 4643 T218 oasc.SolrResourceLoader.<init> new SolrResourceLoader for deduced Solr Home: '/mnt/ssd/jenkins/workspace/Lucene-Solr-trunk-Linux/solr/build/solr-core/test/J1/./org.apache.solr.cloud.RecoveryZkTest-jetty1-1348501235802/'
[junit4:junit4]   2> 4651 T218 oass.SolrDispatchFilter.init SolrDispatchFilter.init()
[junit4:junit4]   2> 4651 T218 oasc.SolrResourceLoader.locateSolrHome JNDI not configured for solr (NoInitialContextEx)
[junit4:junit4]   2> 4652 T218 oasc.SolrResourceLoader.locateSolrHome using system property solr.solr.home: /mnt/ssd/jenkins/workspace/Lucene-Solr-trunk-Linux/solr/build/solr-core/test/J1/./org.apache.solr.cloud.RecoveryZkTest-jetty1-1348501235802
[junit4:junit4]   2> 4652 T218 oasc.CoreContainer$Initializer.initialize looking for solr.xml: /mnt/ssd/jenkins/workspace/Lucene-Solr-trunk-Linux/solr/build/solr-core/test/J1/./org.apache.solr.cloud.RecoveryZkTest-jetty1-1348501235802/solr.xml
[junit4:junit4]   2> 4653 T218 oasc.CoreContainer.<init> New CoreContainer -1495448740
[junit4:junit4]   2> 4653 T218 oasc.CoreContainer.load Loading CoreContainer using Solr Home: '/mnt/ssd/jenkins/workspace/Lucene-Solr-trunk-Linux/solr/build/solr-core/test/J1/./org.apache.solr.cloud.RecoveryZkTest-jetty1-1348501235802/'
[junit4:junit4]   2> 4654 T218 oasc.SolrResourceLoader.<init> new SolrResourceLoader for directory: '/mnt/ssd/jenkins/workspace/Lucene-Solr-trunk-Linux/solr/build/solr-core/test/J1/./org.apache.solr.cloud.RecoveryZkTest-jetty1-1348501235802/'
[junit4:junit4]   2> 4665 T218 oasc.CoreContainer.load Registering Log Listener
[junit4:junit4]   2> 4672 T218 oasc.CoreContainer.initZooKeeper Zookeeper client=127.0.0.1:39731/solr
[junit4:junit4]   2> 4673 T218 oaz.ZooKeeper.<init> Initiating client connection, connectString=127.0.0.1:39731/solr sessionTimeout=5000 watcher=org.apache.solr.common.cloud.ConnectionManager@e8bf6987
[junit4:junit4]   2> 4675 T253 oaz.ClientCnxn$SendThread.startConnect Opening socket connection to server /127.0.0.1:39731
[junit4:junit4]   2> 4675 T218 oascc.ConnectionManager.waitForConnected Waiting for client to connect to ZooKeeper
[junit4:junit4]   2> 4675 T253 oaz.ClientCnxn$SendThread.primeConnection Socket connection established to localhost.localdomain/127.0.0.1:39731, initiating session
[junit4:junit4]   2> 4676 T220 oazs.NIOServerCnxn$Factory.run Accepted socket connection from /127.0.0.1:39293
[junit4:junit4]   2> 4676 T220 oazs.NIOServerCnxn.readConnectRequest Client attempting to establish new session at /127.0.0.1:39293
[junit4:junit4]   2> 4677 T222 oazs.NIOServerCnxn.finishSessionInit Established session 0x139f8efd6ac0003 with negotiated timeout 5000 for client /127.0.0.1:39293
[junit4:junit4]   2> 4677 T253 oaz.ClientCnxn$SendThread.readConnectResult Session establishment complete on server localhost.localdomain/127.0.0.1:39731, sessionid = 0x139f8efd6ac0003, negotiated timeout = 5000
[junit4:junit4]   2> 4678 T254 oascc.ConnectionManager.process Watcher org.apache.solr.common.cloud.ConnectionManager@e8bf6987 name:ZooKeeperConnection Watcher:127.0.0.1:39731/solr got event WatchedEvent state:SyncConnected type:None path:null path:null type:None
[junit4:junit4]   2> 4678 T218 oascc.ConnectionManager.waitForConnected Client is connected to ZooKeeper
[junit4:junit4]   2> 4679 T223 oazs.PrepRequestProcessor.pRequest Got user-level KeeperException when processing sessionid:0x139f8efd6ac0003 type:create cxid:0x1 zxid:0xfffffffffffffffe txntype:unknown reqpath:n/a Error Path:/solr/overseer Error:KeeperErrorCode = NodeExists for /solr/overseer
[junit4:junit4]   2> 4680 T223 oazs.PrepRequestProcessor.pRequest Got user-level KeeperException when processing sessionid:0x139f8efd6ac0003 type:create cxid:0x2 zxid:0xfffffffffffffffe txntype:unknown reqpath:n/a Error Path:/solr/overseer Error:KeeperErrorCode = NodeExists for /solr/overseer
[junit4:junit4]   2> 4681 T218 oasc.ZkController.createEphemeralLiveNode Register node as live in ZooKeeper:/live_nodes/127.0.0.1:42661_solr
[junit4:junit4]   2> 4681 T223 oazs.PrepRequestProcessor.pRequest Got user-level KeeperException when processing sessionid:0x139f8efd6ac0003 type:delete cxid:0x4 zxid:0xfffffffffffffffe txntype:unknown reqpath:n/a Error Path:/solr/live_nodes/127.0.0.1:42661_solr Error:KeeperErrorCode = NoNode for /solr/live_nodes/127.0.0.1:42661_solr
[junit4:junit4]   2> 4682 T218 oascc.SolrZkClient.makePath makePath: /live_nodes/127.0.0.1:42661_solr
[junit4:junit4]   2> 4684 T240 oascc.ZkStateReader$3.process Updating live nodes
[junit4:junit4]   2> 4685 T218 oashc.HttpShardHandlerFactory.getParameter Setting socketTimeout to: 0
[junit4:junit4]   2> 4685 T218 oashc.HttpShardHandlerFactory.getParameter Setting urlScheme to: http://
[junit4:junit4]   2> 4686 T218 oashc.HttpShardHandlerFactory.getParameter Setting connTimeout to: 0
[junit4:junit4]   2> 4686 T218 oashc.HttpShardHandlerFactory.getParameter Setting maxConnectionsPerHost to: 20
[junit4:junit4]   2> 4687 T218 oashc.HttpShardHandlerFactory.getParameter Setting corePoolSize to: 0
[junit4:junit4]   2> 4687 T218 oashc.HttpShardHandlerFactory.getParameter Setting maximumPoolSize to: 2147483647
[junit4:junit4]   2> 4688 T218 oashc.HttpShardHandlerFactory.getParameter Setting maxThreadIdleTime to: 5
[junit4:junit4]   2> 4688 T218 oashc.HttpShardHandlerFactory.getParameter Setting sizeOfQueue to: -1
[junit4:junit4]   2> 4689 T218 oashc.HttpShardHandlerFactory.getParameter Setting fairnessPolicy to: false
[junit4:junit4]   2> 4689 T218 oascsi.HttpClientUtil.createClient Creating new http client, config:maxConnectionsPerHost=20&maxConnections=10000&socketTimeout=0&connTimeout=0&retry=false
[junit4:junit4]   2> 4699 T218 oascc.ZkStateReader.createClusterStateWatchersAndUpdate Updating cluster state from ZooKeeper... 
[junit4:junit4]   2> 4703 T218 oasc.CoreContainer.create Creating SolrCore 'collection1' using instanceDir: /mnt/ssd/jenkins/workspace/Lucene-Solr-trunk-Linux/solr/build/solr-core/test/J1/./org.apache.solr.cloud.RecoveryZkTest-jetty1-1348501235802/collection1
[junit4:junit4]   2> 4704 T218 oasc.ZkController.createCollectionZkNode Check for collection zkNode:collection1
[junit4:junit4]   2> 4705 T218 oasc.ZkController.createCollectionZkNode Collection zkNode exists
[junit4:junit4]   2> 4705 T218 oasc.ZkController.readConfigName Load collection config from:/collections/collection1
[junit4:junit4]   2> 4706 T218 oasc.SolrResourceLoader.<init> new SolrResourceLoader for directory: '/mnt/ssd/jenkins/workspace/Lucene-Solr-trunk-Linux/solr/build/solr-core/test/J1/./org.apache.solr.cloud.RecoveryZkTest-jetty1-1348501235802/collection1/'
[junit4:junit4]   2> 4707 T218 oasc.SolrResourceLoader.replaceClassLoader Adding 'file:/mnt/ssd/jenkins/workspace/Lucene-Solr-trunk-Linux/solr/build/solr-core/test/J1/org.apache.solr.cloud.RecoveryZkTest-jetty1-1348501235802/collection1/lib/README' to classloader
[junit4:junit4]   2> 4708 T218 oasc.SolrResourceLoader.replaceClassLoader Adding 'file:/mnt/ssd/jenkins/workspace/Lucene-Solr-trunk-Linux/solr/build/solr-core/test/J1/org.apache.solr.cloud.RecoveryZkTest-jetty1-1348501235802/collection1/lib/classes/' to classloader
[junit4:junit4]   2> 4734 T218 oasc.SolrConfig.<init> Using Lucene MatchVersion: LUCENE_50
[junit4:junit4]   2> 4773 T218 oasc.SolrConfig.<init> Loaded SolrConfig: solrconfig.xml
[junit4:junit4]   2> 4775 T218 oass.IndexSchema.readSchema Reading Solr Schema
[junit4:junit4]   2> 4784 T218 oass.IndexSchema.readSchema Schema name=test
[junit4:junit4]   2> 5054 T241 oascc.ZkStateReader.updateClusterState Updating cloud state from ZooKeeper... 
[junit4:junit4]   2> 5059 T240 oascc.ZkStateReader$2.process A cluster state change has occurred - updating...
[junit4:junit4]   2> 5060 T254 oascc.ZkStateReader$2.process A cluster state change has occurred - updating...
[junit4:junit4]   2> 5115 T218 oass.OpenExchangeRatesOrgProvider.init Initialized with rates=open-exchange-rates.json, refreshInterval=1440.
[junit4:junit4]   2> 5122 T218 oass.IndexSchema.readSchema default search field in schema is text
[junit4:junit4]   2> 5124 T218 oass.IndexSchema.readSchema unique key field: id
[junit4:junit4]   2> 5138 T218 oass.FileExchangeRateProvider.reload Reloading exchange rates from file currency.xml
[junit4:junit4]   2> 5143 T218 oass.FileExchangeRateProvider.reload Reloading exchange rates from file currency.xml
[junit4:junit4]   2> 5147 T218 oass.OpenExchangeRatesOrgProvider.reload Reloading exchange rates from open-exchange-rates.json
[junit4:junit4]   2> 5149 T218 oass.OpenExchangeRatesOrgProvider.reload Reloading exchange rates from open-exchange-rates.json
[junit4:junit4]   2> 5152 T218 oasc.SolrCore.<init> [collection1] Opening new SolrCore at /mnt/ssd/jenkins/workspace/Lucene-Solr-trunk-Linux/solr/build/solr-core/test/J1/./org.apache.solr.cloud.RecoveryZkTest-jetty1-1348501235802/collection1/, dataDir=./org.apache.solr.cloud.RecoveryZkTest-1348501231217/jetty1/
[junit4:junit4]   2> 5153 T218 oasc.JmxMonitoredMap.<init> JMX monitoring is enabled. Adding Solr mbeans to JMX Server: com.sun.jmx.mbeanserver.JmxMBeanServer@337ab6d7
[junit4:junit4]   2> 5154 T218 oasc.SolrCore.getNewIndexDir WARNING New index directory detected: old=null new=./org.apache.solr.cloud.RecoveryZkTest-1348501231217/jetty1/index/
[junit4:junit4]   2> 5154 T218 oasc.SolrCore.initIndex WARNING [collection1] Solr index directory './org.apache.solr.cloud.RecoveryZkTest-1348501231217/jetty1/index' doesn't exist. Creating new index...
[junit4:junit4]   2> 5155 T218 oasc.CachingDirectoryFactory.get return new directory for /mnt/ssd/jenkins/workspace/Lucene-Solr-trunk-Linux/solr/build/solr-core/test/J1/./org.apache.solr.cloud.RecoveryZkTest-1348501231217/jetty1/index forceNew:false
[junit4:junit4]   2> 5158 T218 oasc.SolrDeletionPolicy.onCommit SolrDeletionPolicy.onCommit: commits:num=1
[junit4:junit4]   2> 		commit{dir=/mnt/ssd/jenkins/workspace/Lucene-Solr-trunk-Linux/solr/build/solr-core/test/J1/org.apache.solr.cloud.RecoveryZkTest-1348501231217/jetty1/index,segFN=segments_1,generation=1,filenames=[segments_1]
[junit4:junit4]   2> 5159 T218 oasc.SolrDeletionPolicy.updateCommits newest commit = 1
[junit4:junit4]   2> 5160 T218 oasc.SolrCore.initWriters created xml: solr.XMLResponseWriter
[junit4:junit4]   2> 5162 T218 oasup.UpdateRequestProcessorChain.init inserting DistributedUpdateProcessorFactory into updateRequestProcessorChain "dedupe"
[junit4:junit4]   2> 5163 T218 oasup.UpdateRequestProcessorChain.init inserting DistributedUpdateProcessorFactory into updateRequestProcessorChain "dedupe-allfields"
[junit4:junit4]   2> 5163 T218 oasup.UpdateRequestProcessorChain.init inserting DistributedUpdateProcessorFactory into updateRequestProcessorChain "stored_sig"
[junit4:junit4]   2> 5164 T218 oasup.UpdateRequestProcessorChain.init inserting DistributedUpdateProcessorFactory into updateRequestProcessorChain "uniq-fields"
[junit4:junit4]   2> 5165 T218 oasup.UpdateRequestProcessorChain.init inserting DistributedUpdateProcessorFactory into updateRequestProcessorChain "distrib-dup-test-chain-implicit"
[junit4:junit4]   2> 5165 T218 oasc.RequestHandlers.initHandlersFromConfig adding lazy requestHandler: solr.ReplicationHandler
[junit4:junit4]   2> 5166 T218 oasc.RequestHandlers.initHandlersFromConfig created /replication: solr.ReplicationHandler
[junit4:junit4]   2> 5167 T218 oasc.RequestHandlers.initHandlersFromConfig created standard: solr.StandardRequestHandler
[junit4:junit4]   2> 5168 T218 oasc.RequestHandlers.initHandlersFromConfig created /get: solr.RealTimeGetHandler
[junit4:junit4]   2> 5169 T218 oasc.RequestHandlers.initHandlersFromConfig created dismax: solr.SearchHandler
[junit4:junit4]   2> 5170 T218 oasc.RequestHandlers.initHandlersFromConfig created mock: org.apache.solr.core.MockQuerySenderListenerReqHandler
[junit4:junit4]   2> 5171 T218 oasc.RequestHandlers.initHandlersFromConfig created /admin/: org.apache.solr.handler.admin.AdminHandlers
[junit4:junit4]   2> 5172 T218 oasc.RequestHandlers.initHandlersFromConfig created defaults: solr.StandardRequestHandler
[junit4:junit4]   2> 5172 T218 oasc.RequestHandlers.initHandlersFromConfig adding lazy requestHandler: solr.StandardRequestHandler
[junit4:junit4]   2> 5173 T218 oasc.RequestHandlers.initHandlersFromConfig created lazy: solr.StandardRequestHandler
[junit4:junit4]   2> 5174 T218 oasc.RequestHandlers.initHandlersFromConfig created /update: solr.UpdateRequestHandler
[junit4:junit4]   2> 5175 T218 oasc.RequestHandlers.initHandlersFromConfig created /terms: org.apache.solr.handler.component.SearchHandler
[junit4:junit4]   2> 5176 T218 oasc.RequestHandlers.initHandlersFromConfig created spellCheckCompRH: org.apache.solr.handler.component.SearchHandler
[junit4:junit4]   2> 5177 T218 oasc.RequestHandlers.initHandlersFromConfig created spellCheckCompRH_Direct: org.apache.solr.handler.component.SearchHandler
[junit4:junit4]   2> 5178 T218 oasc.RequestHandlers.initHandlersFromConfig created spellCheckWithWordbreak: org.apache.solr.handler.component.SearchHandler
[junit4:junit4]   2> 5179 T218 oasc.RequestHandlers.initHandlersFromConfig created spellCheckWithWordbreak_Direct: org.apache.solr.handler.component.SearchHandler
[junit4:junit4]   2> 5180 T218 oasc.RequestHandlers.initHandlersFromConfig created spellCheckCompRH1: org.apache.solr.handler.component.SearchHandler
[junit4:junit4]   2> 5181 T218 oasc.RequestHandlers.initHandlersFromConfig created tvrh: org.apache.solr.handler.component.SearchHandler
[junit4:junit4]   2> 5182 T218 oasc.RequestHandlers.initHandlersFromConfig created /mlt: solr.MoreLikeThisHandler
[junit4:junit4]   2> 5183 T218 oasc.RequestHandlers.initHandlersFromConfig created /debug/dump: solr.DumpRequestHandler
[junit4:junit4]   2> 5184 T218 oashl.XMLLoader.init xsltCacheLifetimeSeconds=60
[junit4:junit4]   2> 5185 T218 oasc.SolrCore.initDeprecatedSupport WARNING solrconfig.xml uses deprecated <admin/gettableFiles>, Please update your config to use the ShowFileRequestHandler.
[junit4:junit4]   2> 5187 T218 oasc.SolrCore.initDeprecatedSupport WARNING adding ShowFileRequestHandler with hidden files: [OLD_SYNONYMS.TXT, PROTWORDS.TXT, STOPWORDS.TXT, OPEN-EXCHANGE-RATES.JSON, CURRENCY.XML, SCHEMA.XML, SYNONYMS.TXT, MAPPING-ISOLATIN1ACCENT.TXT]
[junit4:junit4]   2> 5189 T218 oass.SolrIndexSearcher.<init> Opening Searcher@b9b7cea5 main
[junit4:junit4]   2> 5190 T218 oasu.CommitTracker.<init> Hard AutoCommit: disabled
[junit4:junit4]   2> 5191 T218 oasu.CommitTracker.<init> Soft AutoCommit: disabled
[junit4:junit4]   2> 5193 T218 oashc.SpellCheckComponent.inform Initializing spell checkers
[junit4:junit4]   2> 5211 T218 oass.DirectSolrSpellChecker.init init: {name=direct,classname=DirectSolrSpellChecker,field=lowerfilt,minQueryLength=3}
[junit4:junit4]   2> 5245 T255 oasc.SolrCore.registerSearcher [collection1] Registered new searcher Searcher@b9b7cea5 main{StandardDirectoryReader(segments_1:1)}
[junit4:junit4]   2> 5564 T241 oascc.ZkStateReader.updateClusterState Updating cloud state from ZooKeeper... 
[junit4:junit4]   2> 5571 T240 oascc.ZkStateReader$2.process A cluster state change has occurred - updating...
[junit4:junit4]   2> 5571 T254 oascc.ZkStateReader$2.process A cluster state change has occurred - updating...
[junit4:junit4]   2> 5764 T218 oasc.CoreContainer.register registering core: collection1
[junit4:junit4]   2> 5765 T218 oasc.ZkController.register Register shard - core:collection1 address:http://127.0.0.1:42661/solr shardId:shard1
[junit4:junit4]   2> 5766 T218 oascc.SolrZkClient.makePath makePath: /collections/collection1/leader_elect/shard1/election
[junit4:junit4]   2> 5772 T223 oazs.PrepRequestProcessor.pRequest Got user-level KeeperException when processing sessionid:0x139f8efd6ac0003 type:delete cxid:0x43 zxid:0xfffffffffffffffe txntype:unknown reqpath:n/a Error Path:/solr/collections/collection1/leaders Error:KeeperErrorCode = NoNode for /solr/collections/collection1/leaders
[junit4:junit4]   2> 5773 T218 oasc.ShardLeaderElectionContext.runLeaderProcess Running the leader process.
[junit4:junit4]   2> 5773 T223 oazs.PrepRequestProcessor.pRequest Got user-level KeeperException when processing sessionid:0x139f8efd6ac0003 type:create cxid:0x44 zxid:0xfffffffffffffffe txntype:unknown reqpath:n/a Error Path:/solr/overseer Error:KeeperErrorCode = NodeExists for /solr/overseer
[junit4:junit4]   2> 5775 T218 oasc.ShardLeaderElectionContext.waitForReplicasToComeUp Enough replicas found to continue.
[junit4:junit4]   2> 5776 T218 oasc.ShardLeaderElectionContext.runLeaderProcess I may be the new leader - try and sync
[junit4:junit4]   2> 5776 T218 oasc.SyncStrategy.sync Sync replicas to http://127.0.0.1:42661/solr/collection1/
[junit4:junit4]   2> 5777 T218 oasc.SyncStrategy.syncReplicas Sync Success - now sync replicas to me
[junit4:junit4]   2> 5777 T218 oasc.SyncStrategy.syncToMe http://127.0.0.1:42661/solr/collection1/ has no replicas
[junit4:junit4]   2> 5777 T218 oasc.ShardLeaderElectionContext.runLeaderProcess I am the new leader: http://127.0.0.1:42661/solr/collection1/
[junit4:junit4]   2> 5778 T218 oascc.SolrZkClient.makePath makePath: /collections/collection1/leaders/shard1
[junit4:junit4]   2> 5782 T223 oazs.PrepRequestProcessor.pRequest Got user-level KeeperException when processing sessionid:0x139f8efd6ac0003 type:create cxid:0x4e zxid:0xfffffffffffffffe txntype:unknown reqpath:n/a Error Path:/solr/overseer Error:KeeperErrorCode = NodeExists for /solr/overseer
[junit4:junit4]   2> 6075 T241 oascc.ZkStateReader.updateClusterState Updating cloud state from ZooKeeper... 
[junit4:junit4]   2> 6085 T254 oascc.ZkStateReader$2.process A cluster state change has occurred - updating...
[junit4:junit4]   2> 6085 T240 oascc.ZkStateReader$2.process A cluster state change has occurred - updating...
[junit4:junit4]   2> 6134 T218 oasc.ZkController.register We are http://127.0.0.1:42661/solr/collection1/ and leader is http://127.0.0.1:42661/solr/collection1/
[junit4:junit4]   2> 6135 T218 oasc.ZkController.register No LogReplay needed for core=collection1 baseURL=http://127.0.0.1:42661/solr
[junit4:junit4]   2> 6135 T218 oasc.ZkController.checkRecovery I am the leader, no recovery necessary
[junit4:junit4]   2> 6137 T218 oascc.ZkStateReader.updateClusterState Updating cloud state from ZooKeeper... 
[junit4:junit4]   2> 6138 T218 oass.SolrDispatchFilter.init user.dir=/mnt/ssd/jenkins/workspace/Lucene-Solr-trunk-Linux/solr/build/solr-core/test/J1
[junit4:junit4]   2> 6139 T218 oass.SolrDispatchFilter.init SolrDispatchFilter.init() done
[junit4:junit4]   2> 6139 T218 oascsi.HttpClientUtil.createClient Creating new http client, config:maxConnections=128&maxConnectionsPerHost=32&followRedirects=false
[junit4:junit4]   2> 6204 T218 oejs.Server.doStart jetty-8.1.2.v20120308
[junit4:junit4]   2> 6205 T218 oejs.AbstractConnector.doStart Started SocketConnector@0.0.0.0:51456
[junit4:junit4]   2> 6206 T218 oasc.SolrResourceLoader.locateSolrHome JNDI not configured for solr (NoInitialContextEx)
[junit4:junit4]   2> 6206 T218 oasc.SolrResourceLoader.locateSolrHome using system property solr.solr.home: /mnt/ssd/jenkins/workspace/Lucene-Solr-trunk-Linux/solr/build/solr-core/test/J1/./org.apache.solr.cloud.RecoveryZkTest-jetty2-1348501237360
[junit4:junit4]   2> 6207 T218 oasc.SolrResourceLoader.<init> new SolrResourceLoader for deduced Solr Home: '/mnt/ssd/jenkins/workspace/Lucene-Solr-trunk-Linux/solr/build/solr-core/test/J1/./org.apache.solr.cloud.RecoveryZkTest-jetty2-1348501237360/'
[junit4:junit4]   2> 6221 T218 oass.SolrDispatchFilter.init SolrDispatchFilter.init()
[junit4:junit4]   2> 6221 T218 oasc.SolrResourceLoader.locateSolrHome JNDI not configured for solr (NoInitialContextEx)
[junit4:junit4]   2> 6222 T218 oasc.SolrResourceLoader.locateSolrHome using system property solr.solr.home: /mnt/ssd/jenkins/workspace/Lucene-Solr-trunk-Linux/solr/build/solr-core/test/J1/./org.apache.solr.cloud.RecoveryZkTest-jetty2-1348501237360
[junit4:junit4]   2> 6222 T218 oasc.CoreContainer$Initializer.initialize looking for solr.xml: /mnt/ssd/jenkins/workspace/Lucene-Solr-trunk-Linux/solr/build/solr-core/test/J1/./org.apache.solr.cloud.RecoveryZkTest-jetty2-1348501237360/solr.xml
[junit4:junit4]   2> 6223 T218 oasc.CoreContainer.<init> New CoreContainer -1799299292
[junit4:junit4]   2> 6223 T218 oasc.CoreContainer.load Loading CoreContainer using Solr Home: '/mnt/ssd/jenkins/workspace/Lucene-Solr-trunk-Linux/solr/build/solr-core/test/J1/./org.apache.solr.cloud.RecoveryZkTest-jetty2-1348501237360/'
[junit4:junit4]   2> 6224 T218 oasc.SolrResourceLoader.<init> new SolrResourceLoader for directory: '/mnt/ssd/jenkins/workspace/Lucene-Solr-trunk-Linux/solr/build/solr-core/test/J1/./org.apache.solr.cloud.RecoveryZkTest-jetty2-1348501237360/'
[junit4:junit4]   2> 6235 T218 oasc.CoreContainer.load Registering Log Listener
[junit4:junit4]   2> 6243 T218 oasc.CoreContainer.initZooKeeper Zookeeper client=127.0.0.1:39731/solr
[junit4:junit4]   2> 6244 T218 oaz.ZooKeeper.<init> Initiating client connection, connectString=127.0.0.1:39731/solr sessionTimeout=5000 watcher=org.apache.solr.common.cloud.ConnectionManager@1a74616e
[junit4:junit4]   2> 6246 T265 oaz.ClientCnxn$SendThread.startConnect Opening socket connection to server /127.0.0.1:39731
[junit4:junit4]   2> 6246 T218 oascc.ConnectionManager.waitForConnected Waiting for client to connect to ZooKeeper
[junit4:junit4]   2> 6247 T265 oaz.ClientCnxn$SendThread.primeConnection Socket connection established to localhost.localdomain/127.0.0.1:39731, initiating session
[junit4:junit4]   2> 6247 T220 oazs.NIOServerCnxn$Factory.run Accepted socket connection from /127.0.0.1:39296
[junit4:junit4]   2> 6248 T220 oazs.NIOServerCnxn.readConnectRequest Client attempting to establish new session at /127.0.0.1:39296
[junit4:junit4]   2> 6249 T222 oazs.NIOServerCnxn.finishSessionInit Established session 0x139f8efd6ac0004 with negotiated timeout 5000 for client /127.0.0.1:39296
[junit4:junit4]   2> 6249 T265 oaz.ClientCnxn$SendThread.readConnectResult Session establishment complete on server localhost.localdomain/127.0.0.1:39731, sessionid = 0x139f8efd6ac0004, negotiated timeout = 5000
[junit4:junit4]   2> 6250 T266 oascc.ConnectionManager.process Watcher org.apache.solr.common.cloud.ConnectionManager@1a74616e name:ZooKeeperConnection Watcher:127.0.0.1:39731/solr got event WatchedEvent state:SyncConnected type:None path:null path:null type:None
[junit4:junit4]   2> 6250 T218 oascc.ConnectionManager.waitForConnected Client is connected to ZooKeeper
[junit4:junit4]   2> 6251 T223 oazs.PrepRequestProcessor.pRequest Got user-level KeeperException when processing sessionid:0x139f8efd6ac0004 type:create cxid:0x1 zxid:0xfffffffffffffffe txntype:unknown reqpath:n/a Error Path:/solr/overseer Error:KeeperErrorCode = NodeExists for /solr/overseer
[junit4:junit4]   2> 6252 T223 oazs.PrepRequestProcessor.pRequest Got user-level KeeperException when processing sessionid:0x139f8efd6ac0004 type:create cxid:0x2 zxid:0xfffffffffffffffe txntype:unknown reqpath:n/a Error Path:/solr/overseer Error:KeeperErrorCode = NodeExists for /solr/overseer
[junit4:junit4]   2> 6253 T218 oasc.ZkController.createEphemeralLiveNode Register node as live in ZooKeeper:/live_nodes/127.0.0.1:51456_solr
[junit4:junit4]   2> 6253 T223 oazs.PrepRequestProcessor.pRequest Got user-level KeeperException when processing sessionid:0x139f8efd6ac0004 type:delete cxid:0x4 zxid:0xfffffffffffffffe txntype:unknown reqpath:n/a Error Path:/solr/live_nodes/127.0.0.1:51456_solr Error:KeeperErrorCode = NoNode for /solr/live_nodes/127.0.0.1:51456_solr
[junit4:junit4]   2> 6254 T218 oascc.SolrZkClient.makePath makePath: /live_nodes/127.0.0.1:51456_solr
[junit4:junit4]   2> 6256 T240 oascc.ZkStateReader$3.process Updating live nodes
[junit4:junit4]   2> 6257 T254 oascc.ZkStateReader$3.process Updating live nodes
[junit4:junit4]   2> 6257 T218 oashc.HttpShardHandlerFactory.getParameter Setting socketTimeout to: 0
[junit4:junit4]   2> 6258 T218 oashc.HttpShardHandlerFactory.getParameter Setting urlScheme to: http://
[junit4:junit4]   2> 6258 T218 oashc.HttpShardHandlerFactory.getParameter Setting connTimeout to: 0
[junit4:junit4]   2> 6258 T218 oashc.HttpShardHandlerFactory.getParameter Setting maxConnectionsPerHost to: 20
[junit4:junit4]   2> 6259 T218 oashc.HttpShardHandlerFactory.getParameter Setting corePoolSize to: 0
[junit4:junit4]   2> 6259 T218 oashc.HttpShardHandlerFactory.getParameter Setting maximumPoolSize to: 2147483647
[junit4:junit4]   2> 6260 T218 oashc.HttpShardHandlerFactory.getParameter Setting maxThreadIdleTime to: 5
[junit4:junit4]   2> 6260 T218 oashc.HttpShardHandlerFactory.getParameter Setting sizeOfQueue to: -1
[junit4:junit4]   2> 6261 T218 oashc.HttpShardHandlerFactory.getParameter Setting fairnessPolicy to: false
[junit4:junit4]   2> 6261 T218 oascsi.HttpClientUtil.createClient Creating new http client, config:maxConnectionsPerHost=20&maxConnections=10000&socketTimeout=0&connTimeout=0&retry=false
[junit4:junit4]   2> 6271 T218 oascc.ZkStateReader.createClusterStateWatchersAndUpdate Updating cluster state from ZooKeeper... 
[junit4:junit4]   2> 6275 T218 oasc.CoreContainer.create Creating SolrCore 'collection1' using instanceDir: /mnt/ssd/jenkins/workspace/Lucene-Solr-trunk-Linux/solr/build/solr-core/test/J1/./org.apache.solr.cloud.RecoveryZkTest-jetty2-1348501237360/collection1
[junit4:junit4]   2> 6276 T218 oasc.ZkController.createCollectionZkNode Check for collection zkNode:collection1
[junit4:junit4]   2> 6277 T218 oasc.ZkController.createCollectionZkNode Collection zkNode exists
[junit4:junit4]   2> 6277 T218 oasc.ZkController.readConfigName Load collection config from:/collections/collection1
[junit4:junit4]   2> 6278 T218 oasc.SolrResourceLoader.<init> new SolrResourceLoader for directory: '/mnt/ssd/jenkins/workspace/Lucene-Solr-trunk-Linux/solr/build/solr-core/test/J1/./org.apache.solr.cloud.RecoveryZkTest-jetty2-1348501237360/collection1/'
[junit4:junit4]   2> 6279 T218 oasc.SolrResourceLoader.replaceClassLoader Adding 'file:/mnt/ssd/jenkins/workspace/Lucene-Solr-trunk-Linux/solr/build/solr-core/test/J1/org.apache.solr.cloud.RecoveryZkTest-jetty2-1348501237360/collection1/lib/README' to classloader
[junit4:junit4]   2> 6280 T218 oasc.SolrResourceLoader.replaceClassLoader Adding 'file:/mnt/ssd/jenkins/workspace/Lucene-Solr-trunk-Linux/solr/build/solr-core/test/J1/org.apache.solr.cloud.RecoveryZkTest-jetty2-1348501237360/collection1/lib/classes/' to classloader
[junit4:junit4]   2> 6302 T218 oasc.SolrConfig.<init> Using Lucene MatchVersion: LUCENE_50
[junit4:junit4]   2> 6337 T218 oasc.SolrConfig.<init> Loaded SolrConfig: solrconfig.xml
[junit4:junit4]   2> 6338 T218 oass.IndexSchema.readSchema Reading Solr Schema
[junit4:junit4]   2> 6343 T218 oass.IndexSchema.readSchema Schema name=test
[junit4:junit4]   2> 6591 T241 oascc.ZkStateReader.updateClusterState Updating cloud state from ZooKeeper... 
[junit4:junit4]   2> 6597 T254 oascc.ZkStateReader$2.process A cluster state change has occurred - updating...
[junit4:junit4]   2> 6597 T240 oascc.ZkStateReader$2.process A cluster state change has occurred - updating...
[junit4:junit4]   2> 6598 T266 oascc.ZkStateReader$2.process A cluster state change has occurred - updating...
[junit4:junit4]   2> 6677 T218 oass.OpenExchangeRatesOrgProvider.init Initialized with rates=open-exchange-rates.json, refreshInterval=1440.
[junit4:junit4]   2> 6683 T218 oass.IndexSchema.readSchema default search field in schema is text
[junit4:junit4]   2> 6686 T218 oass.IndexSchema.readSchema unique key field: id
[junit4:junit4]   2> 6699 T218 oass.FileExchangeRateProvider.reload Reloading exchange rates from file currency.xml
[junit4:junit4]   2> 6703 T218 oass.FileExchangeRateProvider.reload Reloading exchange rates from file currency.xml
[junit4:junit4]   2> 6707 T218 oass.OpenExchangeRatesOrgProvider.reload Reloading exchange rates from open-exchange-rates.json
[junit4:junit4]   2> 6709 T218 oass.OpenExchangeRatesOrgProvider.reload Reloading exchange rates from open-exchange-rates.json
[junit4:junit4]   2> 6711 T218 oasc.SolrCore.<init> [collection1] Opening new SolrCore at /mnt/ssd/jenkins/workspace/Lucene-Solr-trunk-Linux/solr/build/solr-core/test/J1/./org.apache.solr.cloud.RecoveryZkTest-jetty2-1348501237360/collection1/, dataDir=./org.apache.solr.cloud.RecoveryZkTest-1348501231217/jetty2/
[junit4:junit4]   2> 6711 T218 oasc.JmxMonitoredMap.<init> JMX monitoring is enabled. Adding Solr mbeans to JMX Server: com.sun.jmx.mbeanserver.JmxMBeanServer@337ab6d7
[junit4:junit4]   2> 6712 T218 oasc.SolrCore.getNewIndexDir WARNING New index directory detected: old=null new=./org.apache.solr.cloud.RecoveryZkTest-1348501231217/jetty2/index/
[junit4:junit4]   2> 6713 T218 oasc.SolrCore.initIndex WARNING [collection1] Solr index directory './org.apache.solr.cloud.RecoveryZkTest-1348501231217/jetty2/index' doesn't exist. Creating new index...
[junit4:junit4]   2> 6713 T218 oasc.CachingDirectoryFactory.get return new directory for /mnt/ssd/jenkins/workspace/Lucene-Solr-trunk-Linux/solr/build/solr-core/test/J1/./org.apache.solr.cloud.RecoveryZkTest-1348501231217/jetty2/index forceNew:false
[junit4:junit4]   2> 6716 T218 oasc.SolrDeletionPolicy.onCommit SolrDeletionPolicy.onCommit: commits:num=1
[junit4:junit4]   2> 		commit{dir=/mnt/ssd/jenkins/workspace/Lucene-Solr-trunk-Linux/solr/build/solr-core/test/J1/org.apache.solr.cloud.RecoveryZkTest-1348501231217/jetty2/index,segFN=segments_1,generation=1,filenames=[segments_1]
[junit4:junit4]   2> 6717 T218 oasc.SolrDeletionPolicy.updateCommits newest commit = 1
[junit4:junit4]   2> 6718 T218 oasc.SolrCore.initWriters created xml: solr.XMLResponseWriter
[junit4:junit4]   2> 6721 T218 oasup.UpdateRequestProcessorChain.init inserting DistributedUpdateProcessorFactory into updateRequestProcessorChain "dedupe"
[junit4:junit4]   2> 6722 T218 oasup.UpdateRequestProcessorChain.init inserting DistributedUpdateProcessorFactory into updateRequestProcessorChain "dedupe-allfields"
[junit4:junit4]   2> 6723 T218 oasup.UpdateRequestProcessorChain.init inserting DistributedUpdateProcessorFactory into updateRequestProcessorChain "stored_sig"
[junit4:junit4]   2> 6723 T218 oasup.UpdateRequestProcessorChain.init inserting DistributedUpdateProcessorFactory into updateRequestProcessorChain "uniq-fields"
[junit4:junit4]   2> 6724 T218 oasup.UpdateRequestProcessorChain.init inserting DistributedUpdateProcessorFactory into updateRequestProcessorChain "distrib-dup-test-chain-implicit"
[junit4:junit4]   2> 6725 T218 oasc.RequestHandlers.initHandlersFromConfig adding lazy requestHandler: solr.ReplicationHandler
[junit4:junit4]   2> 6725 T218 oasc.RequestHandlers.initHandlersFromConfig created /replication: solr.ReplicationHandler
[junit4:junit4]   2> 6727 T218 oasc.RequestHandlers.initHandlersFromConfig created standard: solr.StandardRequestHandler
[junit4:junit4]   2> 6728 T218 oasc.RequestHandlers.initHandlersFromConfig created /get: solr.RealTimeGetHandler
[junit4:junit4]   2> 6729 T218 oasc.RequestHandlers.initHandlersFromConfig created dismax: solr.SearchHandler
[junit4:junit4]   2> 6730 T218 oasc.RequestHandlers.initHandlersFromConfig created mock: org.apache.solr.core.MockQuerySenderListenerReqHandler
[junit4:junit4]   2> 6731 T218 oasc.RequestHandlers.initHandlersFromConfig created /admin/: org.apache.solr.handler.admin.AdminHandlers
[junit4:junit4]   2> 6732 T218 oasc.RequestHandlers.initHandlersFromConfig created defaults: solr.StandardRequestHandler
[junit4:junit4]   2> 6733 T218 oasc.RequestHandlers.initHandlersFromConfig adding lazy requestHandler: solr.StandardRequestHandler
[junit4:junit4]   2> 6734 T218 oasc.RequestHandlers.initHandlersFromConfig created lazy: solr.StandardRequestHandler
[junit4:junit4]   2> 6735 T218 oasc.RequestHandlers.initHandlersFromConfig created /update: solr.UpdateRequestHandler
[junit4:junit4]   2> 6736 T218 oasc.RequestHandlers.initHandlersFromConfig created /terms: org.apache.solr.handler.component.SearchHandler
[junit4:junit4]   2> 6737 T218 oasc.RequestHandlers.initHandlersFromConfig created spellCheckCompRH: org.apache.solr.handler.component.SearchHandler
[junit4:junit4]   2> 6738 T218 oasc.RequestHandlers.initHandlersFromConfig created spellCheckCompRH_Direct: org.apache.solr.handler.component.SearchHandler
[junit4:junit4]   2> 6739 T218 oasc.RequestHandlers.initHandlersFromConfig created spellCheckWithWordbreak: org.apache.solr.handler.component.SearchHandler
[junit4:junit4]   2> 6740 T218 oasc.RequestHandlers.initHandlersFromConfig created spellCheckWithWordbreak_Direct: org.apache.solr.handler.component.SearchHandler
[junit4:junit4]   2> 6741 T218 oasc.RequestHandlers.initHandlersFromConfig created spellCheckCompRH1: org.apache.solr.handler.component.SearchHandler
[junit4:junit4]   2> 6743 T218 oasc.RequestHandlers.initHandlersFromConfig created tvrh: org.apache.solr.handler.component.SearchHandler
[junit4:junit4]   2> 6744 T218 oasc.RequestHandlers.initHandlersFromConfig created /mlt: solr.MoreLikeThisHandler
[junit4:junit4]   2> 6745 T218 oasc.RequestHandlers.initHandlersFromConfig created /debug/dump: solr.DumpRequestHandler
[junit4:junit4]   2> 6746 T218 oashl.XMLLoader.init xsltCacheLifetimeSeconds=60
[junit4:junit4]   2> 6747 T218 oasc.SolrCore.initDeprecatedSupport WARNING solrconfig.xml uses deprecated <admin/gettableFiles>, Please update your config to use the ShowFileRequestHandler.
[junit4:junit4]   2> 6749 T218 oasc.SolrCore.initDeprecatedSupport WARNING adding ShowFileRequestHandler with hidden files: [OLD_SYNONYMS.TXT, PROTWORDS.TXT, STOPWORDS.TXT, OPEN-EXCHANGE-RATES.JSON, CURRENCY.XML, SCHEMA.XML, SYNONYMS.TXT, MAPPING-ISOLATIN1ACCENT.TXT]
[junit4:junit4]   2> 6751 T218 oass.SolrIndexSearcher.<init> Opening Searcher@560a59fc main
[junit4:junit4]   2> 6752 T218 oasu.CommitTracker.<init> Hard AutoCommit: disabled
[junit4:junit4]   2> 6753 T218 oasu.CommitTracker.<init> Soft AutoCommit: disabled
[junit4:junit4]   2> 6754 T218 oashc.SpellCheckComponent.inform Initializing spell checkers
[junit4:junit4]   2> 6758 T218 oass.DirectSolrSpellChecker.init init: {name=direct,classname=DirectSolrSpellChecker,field=lowerfilt,minQueryLength=3}
[junit4:junit4]   2> 6785 T267 oasc.SolrCore.registerSearcher [collection1] Registered new searcher Searcher@560a59fc main{StandardDirectoryReader(segments_1:1)}
[junit4:junit4]   2> 7105 T241 oascc.ZkStateReader.updateClusterState Updating cloud state from ZooKeeper... 
[junit4:junit4]   2> 7109 T240 oascc.ZkStateReader$2.process A cluster state change has occurred - updating...
[junit4:junit4]   2> 7109 T266 oascc.ZkStateReader$2.process A cluster state change has occurred - updating...
[junit4:junit4]   2> 7109 T254 oascc.ZkStateReader$2.process A cluster state change has occurred - updating...
[junit4:junit4]   2> 7301 T218 oasc.CoreContainer.register registering core: collection1
[junit4:junit4]   2> 7301 T218 oasc.ZkController.register Register shard - core:collection1 address:http://127.0.0.1:51456/solr shardId:shard1
[junit4:junit4]   2> 7305 T218 oasc.ZkController.register We are http://127.0.0.1:51456/solr/collection1/ and leader is http://127.0.0.1:42661/solr/collection1/
[junit4:junit4]   2> 7306 T218 oasc.ZkController.register No LogReplay needed for core=collection1 baseURL=http://127.0.0.1:51456/solr
[junit4:junit4]   2> 7306 T218 oasc.ZkController.checkRecovery Core needs to recover:collection1
[junit4:junit4]   2> 7307 T218 oasu.DefaultSolrCoreState.doRecovery Running recovery - first canceling any ongoing recovery
[junit4:junit4]   2> ASYNC  NEW_CORE C16 name=collection1 org.apache.solr.core.SolrCore@6123b86 url=http://127.0.0.1:51456/solr/collection1 node=127.0.0.1:51456_solr
[junit4:junit4]   2> 7308 T268 C16 P51456 oasc.RecoveryStrategy.run Starting recovery process.  core=collection1 recoveringAfterStartup=true
[junit4:junit4]   2> 7309 T268 C16 P51456 oasc.RecoveryStrategy.doRecovery ###### startupVersions=[]
[junit4:junit4]   2> 7309 T218 oascc.ZkStateReader.updateClusterState Updating cloud state from ZooKeeper... 
[junit4:junit4]   2> 7310 T268 C16 P51456 oasc.RecoveryStrategy.doRecovery Attempting to PeerSync from http://127.0.0.1:42661/solr/collection1/ core=collection1 - recoveringAfterStartup=true
[junit4:junit4]   2> 7311 T218 oass.SolrDispatchFilter.init user.dir=/mnt/ssd/jenkins/workspace/Lucene-Solr-trunk-Linux/solr/build/solr-core/test/J1
[junit4:junit4]   2> 7311 T218 oass.SolrDispatchFilter.init SolrDispatchFilter.init() done
[junit4:junit4]   2> 7312 T218 oascsi.HttpClientUtil.createClient Creating new http client, config:maxConnections=128&maxConnectionsPerHost=32&followRedirects=false
[junit4:junit4]   2> 7312 T268 C16 P51456 oascsi.HttpClientUtil.createClient Creating new http client, config:maxConnectionsPerHost=20&maxConnections=10000&connTimeout=30000&socketTimeout=30000&retry=false
[junit4:junit4]   2> 7324 T218 oaz.ZooKeeper.<init> Initiating client connection, connectString=127.0.0.1:39731/solr sessionTimeout=10000 watcher=org.apache.solr.common.cloud.ConnectionManager@ac2fdd37
[junit4:junit4]   2> 7327 T269 oaz.ClientCnxn$SendThread.startConnect Opening socket connection to server /127.0.0.1:39731
[junit4:junit4]   2> 7327 T268 C16 P51456 oasu.PeerSync.sync PeerSync: core=collection1 url=http://127.0.0.1:51456/solr START replicas=[http://127.0.0.1:42661/solr/collection1/] nUpdates=100
[junit4:junit4]   2> 7327 T218 oascc.ConnectionManager.waitForConnected Waiting for client to connect to ZooKeeper
[junit4:junit4]   2> 7328 T269 oaz.ClientCnxn$SendThread.primeConnection Socket connection established to localhost.localdomain/127.0.0.1:39731, initiating session
[junit4:junit4]   2> 7328 T220 oazs.NIOServerCnxn$Factory.run Accepted socket connection from /127.0.0.1:39297
[junit4:junit4]   2> 7328 T220 oazs.NIOServerCnxn.readConnectRequest Client attempting to establish new session at /127.0.0.1:39297
[junit4:junit4]   2> 7329 T268 C16 P51456 oasu.PeerSync.sync WARNING no frame of reference to tell of we've missed updates
[junit4:junit4]   2> 7329 T269 oaz.ClientCnxn$SendThread.readConnectResult Session establishment complete on server localhost.localdomain/127.0.0.1:39731, sessionid = 0x139f8efd6ac0005, negotiated timeout = 10000
[junit4:junit4]   2> 7330 T268 C16 P51456 oasc.RecoveryStrategy.doRecovery PeerSync Recovery was not successful - trying replication. core=collection1
[junit4:junit4]   2> 7330 T270 oascc.ConnectionManager.process Watcher org.apache.solr.common.cloud.ConnectionManager@ac2fdd37 name:ZooKeeperConnection Watcher:127.0.0.1:39731/solr got event WatchedEvent state:SyncConnected type:None path:null path:null type:None
[junit4:junit4]   2> 7329 T222 oazs.NIOServerCnxn.finishSessionInit Established session 0x139f8efd6ac0005 with negotiated timeout 10000 for client /127.0.0.1:39297
[junit4:junit4]   2> 7330 T268 C16 P51456 oasc.RecoveryStrategy.doRecovery Starting Replication Recovery. core=collection1
[junit4:junit4]   2> 7330 T218 oascc.ConnectionManager.waitForConnected Client is connected to ZooKeeper
[junit4:junit4]   2> 7331 T268 C16 P51456 oascsi.HttpClientUtil.createClient Creating new http client, config:maxConnections=128&maxConnectionsPerHost=32&followRedirects=false
[junit4:junit4]   2> 7331 T218 oascc.ZkStateReader.createClusterStateWatchersAndUpdate Updating cluster state from ZooKeeper... 
[junit4:junit4]   2> 7334 T218 oasc.ChaosMonkey.monkeyLog monkey: init - expire sessions:true cause connection loss:true
[junit4:junit4]   2> 7334 T218 oascsi.HttpClientUtil.createClient Creating new http client, config:
[junit4:junit4]   2> ASYNC  NEW_CORE C17 name=collection1 org.apache.solr.core.SolrCore@97e6928f url=http://127.0.0.1:42661/solr/collection1 node=127.0.0.1:42661_solr
[junit4:junit4]   2> 7337 T246 C17 P42661 REQ /get {version=2&getVersions=100&qt=/get&wt=javabin&distrib=false} status=0 QTime=0 
[junit4:junit4]   2> 7343 T218 oascc.ZkStateReader.updateClusterState Updating cloud state from ZooKeeper... 
[junit4:junit4]   2> ASYNC  NEW_CORE C18 name=collection1 org.apache.solr.core.SolrCore@d27af62c url=http://127.0.0.1:55918/solr/collection1 node=127.0.0.1:55918_solr
[junit4:junit4]   2> 7356 T232 C18 P55918 oascsi.HttpClientUtil.createClient Creating new http client, config:maxConnections=500&maxConnectionsPerHost=16
[junit4:junit4]   2> 7519 T233 C18 P55918 oasc.SolrDeletionPolicy.onInit SolrDeletionPolicy.onInit: commits:num=1
[junit4:junit4]   2> 		commit{dir=/mnt/ssd/jenkins/workspace/Lucene-Solr-trunk-Linux/solr/build/solr-core/test/J1/org.apache.solr.cloud.RecoveryZkTest-1348501231217/control/data/index,segFN=segments_1,generation=1,filenames=[segments_1]
[junit4:junit4]   2> 7519 T233 C18 P55918 oasc.SolrDeletionPolicy.updateCommits newest commit = 1
[junit4:junit4]   2> 7522 T233 C18 P55918 /update {version=2&wt=javabin} {add=[10001 (1414006034902548480)]} 0 167
[junit4:junit4]   2> 7522 T232 C18 P55918 /update {version=2&wt=javabin} {add=[1 (1414006034902548481)]} 0 167
[junit4:junit4]   2> 7523 T273 oaz.ZooKeeper.<init> Initiating client connection, connectString=127.0.0.1:39731/solr sessionTimeout=10000 watcher=org.apache.solr.common.cloud.ConnectionManager@4a6bb7b7
[junit4:junit4]   2> 7525 T274 oaz.ClientCnxn$SendThread.startConnect Opening socket connection to server /127.0.0.1:39731
[junit4:junit4]   2> 7525 T273 oascc.ConnectionManager.waitForConnected Waiting for client to connect to ZooKeeper
[junit4:junit4]   2> 7526 T274 oaz.ClientCnxn$SendThread.primeConnection Socket connection established to localhost.localdomain/127.0.0.1:39731, initiating session
[junit4:junit4]   2> 7526 T220 oazs.NIOServerCnxn$Factory.run Accepted socket connection from /127.0.0.1:39302
[junit4:junit4]   2> 7526 T220 oazs.NIOServerCnxn.readConnectRequest Client attempting to establish new session at /127.0.0.1:39302
[junit4:junit4]   2> 7527 T222 oazs.NIOServerCnxn.finishSessionInit Established session 0x139f8efd6ac0006 with negotiated timeout 10000 for client /127.0.0.1:39302
[junit4:junit4]   2> 7527 T274 oaz.ClientCnxn$SendThread.readConnectResult Session establishment complete on server localhost.localdomain/127.0.0.1:39731, sessionid = 0x139f8efd6ac0006, negotiated timeout = 10000
[junit4:junit4]   2> 7528 T275 oascc.ConnectionManager.process Watcher org.apache.solr.common.cloud.ConnectionManager@4a6bb7b7 name:ZooKeeperConnection Watcher:127.0.0.1:39731/solr got event WatchedEvent state:SyncConnected type:None path:null path:null type:None
[junit4:junit4]   2> 7528 T273 oascc.ConnectionManager.waitForConnected Client is connected to ZooKeeper
[junit4:junit4]   2> 7529 T273 oascc.ZkStateReader.createClusterStateWatchersAndUpdate Updating cluster state from ZooKeeper... 
[junit4:junit4]   2> 7534 T248 C17 P42661 oasc.SolrDeletionPolicy.onInit SolrDeletionPolicy.onInit: commits:num=1
[junit4:junit4]   2> 		commit{dir=/mnt/ssd/jenkins/workspace/Lucene-Solr-trunk-Linux/solr/build/solr-core/test/J1/org.apache.solr.cloud.RecoveryZkTest-1348501231217/jetty1/index,segFN=segments_1,generation=1,filenames=[segments_1]
[junit4:junit4]   2> 7535 T248 C17 P42661 oasc.SolrDeletionPolicy.updateCommits newest commit = 1
[junit4:junit4]   2> 7537 T248 C17 P42661 /update {version=2&wt=javabin} {add=[1 (1414006034919325696)]} 0 4
[junit4:junit4]   2> 7537 T249 C17 P42661 /update {version=2&wt=javabin} {add=[10001 (1414006034919325697)]} 0 4
[junit4:junit4]   2> 7541 T232 C18 P55918 /update {version=2&wt=javabin} {add=[2 (1414006034926665728)]} 0 1
[junit4:junit4]   2> 7541 T233 C18 P55918 /update {version=2&wt=javabin} {add=[10002 (1414006034926665729)]} 0 1
[junit4:junit4]   2> 7545 T249 C17 P42661 /update {version=2&wt=javabin} {add=[2 (1414006034930860032)]} 0 1
[junit4:junit4]   2> 7545 T248 C17 P42661 /update {version=2&wt=javabin} {add=[10002 (1414006034930860033)]} 0 1
[junit4:junit4]   2> 7548 T233 C18 P55918 /update {version=2&wt=javabin} {delete=[1 (-1414006034935054336)]} 0 0
[junit4:junit4]   2> 7548 T232 C18 P55918 /update {version=2&wt=javabin} {delete=[10001 (-1414006034935054337)]} 0 0
[junit4:junit4]   2> 7551 T248 C17 P42661 /update {version=2&wt=javabin} {delete=[1 (-1414006034938200064)]} 0 0
[junit4:junit4]   2> 7551 T249 C17 P42661 /update {version=2&wt=javabin} {delete=[10001 (-1414006034938200065)]} 0 0
[junit4:junit4]   2> 7555 T232 C18 P55918 /update {version=2&wt=javabin} {add=[3 (1414006034941345792)]} 0 1
[junit4:junit4]   2> 7555 T233 C18 P55918 /update {version=2&wt=javabin} {add=[10003 (1414006034941345793)]} 0 1
[junit4:junit4]   2> 7558 T249 C17 P42661 /update {version=2&wt=javabin} {add=[3 (1414006034944491520)]} 0 1
[junit4:junit4]   2> 7558 T248 C17 P42661 /update {version=2&wt=javabin} {add=[10003 (1414006034945540096)]} 0 0
[junit4:junit4]   2> 7561 T233 C18 P55918 /update {version=2&wt=javabin} {delete=[2 (-1414006034948685824)]} 0 0
[junit4:junit4]   2> 7561 T232 C18 P55918 /update {version=2&wt=javabin} {delete=[10002 (-1414006034948685825)]} 0 0
[junit4:junit4]   2> 7564 T248 C17 P42661 /update {version=2&wt=javabin} {delete=[2 (-1414006034951831552)]} 0 0
[junit4:junit4]   2> 7564 T249 C17 P42661 /update {version=2&wt=javabin} {delete=[10002 (-1414006034951831553)]} 0 0
[junit4:junit4]   2> 7567 T232 C18 P55918 /update {version=2&wt=javabin} {add=[4 (1414006034954977280)]} 0 0
[junit4:junit4]   2> 7568 T233 C18 P55918 /update {version=2&wt=javabin} {add=[10004 (1414006034954977281)]} 0 1
[junit4:junit4]   2> 7571 T249 C17 P42661 /update {version=2&wt=javabin} {add=[4 (1414006034958123008)]} 0 1
[junit4:junit4]   2> 7571 T248 C17 P42661 /update {version=2&wt=javabin} {add=[10004 (1414006034959171584)]} 0 1
[junit4:junit4]   2> 7575 T233 C18 P55918 /update {version=2&wt=javabin} {add=[5 (1414006034962317312)]} 0 1
[junit4:junit4]   2> 7575 T232 C18 P55918 /update {version=2&wt=javabin} {add=[10005 (1414006034962317313)]} 0 1
[junit4:junit4]   2> 7578 T248 C17 P42661 /update {version=2&wt=javabin} {add=[5 (1414006034966511616)]} 0 0
[junit4:junit4]   2> 7579 T249 C17 P42661 /update {version=2&wt=javabin} {add=[10005 (1414006034966511617)]} 0 1
[junit4:junit4]   2> 7581 T232 C18 P55918 /update {version=2&wt=javabin} {delete=[4 (-1414006034969657344)]} 0 0
[junit4:junit4]   2> 7582 T233 C18 P55918 /update {version=2&wt=javabin} {delete=[10004 (-1414006034970705920)]} 0 0
[junit4:junit4]   2> 7584 T249 C17 P42661 /update {version=2&wt=javabin} {delete=[4 (-1414006034972803072)]} 0 0
[junit4:junit4]   2> 7585 T248 C17 P42661 /update {version=2&wt=javabin} {delete=[10004 (-1414006034973851648)]} 0 0
[junit4:junit4]   2> 7588 T233 C18 P55918 /update {version=2&wt=javabin} {add=[6 (1414006034976997376)]} 0 1
[junit4:junit4]   2> 7588 T232 C18 P55918 /update {version=2&wt=javabin} {add=[10006 (1414006034976997377)]} 0 0
[junit4:junit4]   2> 7592 T248 C17 P42661 /update {version=2&wt=javabin} {add=[6 (1414006034980143104)]} 0 1
[junit4:junit4]   2> 7592 T249 C17 P42661 /update {version=2&wt=javabin} {add=[10006 (1414006034981191680)]} 0 1
[junit4:junit4]   2> 7595 T232 C18 P55918 /update {version=2&wt=javabin} {delete=[6 (-1414006034984337408)]} 0 0
[junit4:junit4]   2> 7595 T233 C18 P55918 /update {version=2&wt=javabin} {delete=[10006 (-1414006034984337409)]} 0 0
[junit4:junit4]   2> 7598 T249 C17 P42661 /update {version=2&wt=javabin} {delete=[6 (-1414006034987483136)]} 0 0
[junit4:junit4]   2> 7598 T248 C17 P42661 /update {version=2&wt=javabin} {delete=[10006 (-1414006034987483137)]} 0 0
[junit4:junit4]   2> 7601 T233 C18 P55918 /update {version=2&wt=javabin} {add=[7 (1414006034990628864)]} 0 1
[junit4:junit4]   2> 7602 T232 C18 P55918 /update {version=2&wt=javabin} {add=[10007 (1414006034990628865)]} 0 1
[junit4:junit4]   2> 7605 T248 C17 P42661 /update {version=2&wt=javabin} {add=[7 (1414006034993774592)]} 0 1
[junit4:junit4]   2> 7605 T249 C17 P42661 /update {version=2&wt=javabin} {add=[10007 (1414006034994823168)]} 0 0
[junit4:junit4]   2> 7608 T232 C18 P55918 /update {version=2&wt=javabin} {add=[8 (1414006034997968896)]} 0 1
[junit4:junit4]   2> 7609 T233 C18 P55918 /update {version=2&wt=javabin} {add=[10008 (1414006034997968897)]} 0 1
[junit4:junit4]   2> 7611 T249 C17 P42661 /update {version=2&wt=javabin} {add=[8 (1414006035001114624)]} 0 0
[junit4:junit4]   2> 7613 T248 C17 P42661 /update {version=2&wt=javabin} {add=[10008 (1414006035002163200)]} 0 1
[junit4:junit4]   2> 7613 T241 oascc.ZkStateReader.updateClusterState Updating cloud state from ZooKeeper... 
[junit4:junit4]   2> 7615 T233 C18 P55918 /update {version=2&wt=javabin} {delete=[8 (-1414006035005308928)]} 0 1
[junit4:junit4]   2> 7616 T232 C18 P55918 /update {version=2&wt=javabin} {delete=[10008 (-1414006035006357504)]} 0 0
[junit4:junit4]   2> 7617 T270 oascc.ZkStateReader$2.process A cluster state change has occurred - updating...
[junit4:junit4]   2> 7617 T240 oascc.ZkStateReader$2.process A cluster state change has occurred - updating...
[junit4:junit4]   2> 7618 T266 oascc.ZkStateReader$2.process A cluster state change has occurred - updating...
[junit4:junit4]   2> 7618 T275 oascc.ZkStateReader$2.process A cluster state change has occurred - updating...
[junit4:junit4]   2> 7618 T254 oascc.ZkStateReader$2.process A cluster state change has occurred - updating...
[junit4:junit4]   2> 7618 T248 C17 P42661 /update {version=2&wt=javabin} {delete=[8 (-1414006035008454656)]} 0 0
[junit4:junit4]   2> 7622 T232 C18 P55918 /update {version=2&wt=javabin} {add=[9 (1414006035012648960)]} 0 1
[junit4:junit4]   2>  C16_STATE=coll:collection1 core:collection1 props:{base_url=http://127.0.0.1:51456/solr, state=recovering, node_name=127.0.0.1:51456_solr, roles=null, collection=collection1, shard=shard1, core=collection1}
[junit4:junit4]   2> 7635 T258 C16 P51456 oasc.SolrDeletionPolicy.onInit SolrDeletionPolicy.onInit: commits:num=1
[junit4:junit4]   2> 		commit{dir=/mnt/ssd/jenkins/workspace/Lucene-Solr-trunk-Linux/solr/build/solr-core/test/J1/org.apache.solr.cloud.RecoveryZkTest-1348501231217/jetty2/index,segFN=segments_1,generation=1,filenames=[segments_1]
[junit4:junit4]   2> 7636 T258 C16 P51456 oasc.SolrDeletionPolicy.updateCommits newest commit = 1
[junit4:junit4]   2> 7637 T258 C16 P51456 REQ /update {update.distrib=FROMLEADER&distrib.from=http://127.0.0.1:42661/solr/collection1/&version=2&wt=javabin} status=0 QTime=5 
[junit4:junit4]   2> 7638 T249 C17 P42661 /update {version=2&wt=javabin} {delete=[10008 (-1414006035011600384)]} 0 18
[junit4:junit4]   2> 7638 T259 C16 P51456 REQ /update {update.distrib=FROMLEADER&distrib.from=http://127.0.0.1:42661/solr/collection1/&version=2&wt=javabin} status=0 QTime=2 
[junit4:junit4]   2> 7640 T248 C17 P42661 /update {version=2&wt=javabin} {add=[9 (1414006035015794688)]} 0 15
[junit4:junit4]   2> 7644 T233 C18 P55918 /update {version=2&wt=javabin} {add=[10 (1414006035034669056)]} 0 1
[junit4:junit4]   2> 7658 T232 C18 P55918 /update {version=2&wt=javabin} {add=[10009 (1414006035034669057)]} 0 15
[junit4:junit4]   2> 7664 T259 C16 P51456 REQ /update {update.distrib=FROMLEADER&distrib.from=http://127.0.0.1:42661/solr/collection1/&version=2&wt=javabin} status=0 QTime=1 
[junit4:junit4]   2> 7665 T248 C17 P42661 /update {version=2&wt=javabin} {add=[10 (1414006035039911936)]} 0 17
[junit4:junit4]   2> 7667 T258 C16 P51456 REQ /update {update.distrib=FROMLEADER&distrib.from=http://127.0.0.1:42661/solr/collection1/&version=2&wt=javabin} status=0 QTime=1 
[junit4:junit4]   2> 7668 T249 C17 P42661 /update {version=2&wt=javabin} {add=[10009 (1414006035054592000)]} 0 6
[junit4:junit4]   2> 7669 T232 C18 P55918 /update {version=2&wt=javabin} {delete=[9 (-1414006035061932032)]} 0 0
[junit4:junit4]   2> 7676 T258 C16 P51456 REQ /update {update.distrib=FROMLEADER&distrib.from=http://127.0.0.1:42661/solr/collection1/&version=2&wt=javabin} status=0 QTime=0 
[junit4:junit4]   2> 7678 T249 C17 P42661 /update {version=2&wt=javabin} {delete=[9 (-1414006035066126336)]} 0 5
[junit4:junit4]   2> 7684 T232 C18 P55918 /update {version=2&wt=javabin} {add=[11 (1414006035075563520)]} 0 2
[junit4:junit4]   2> 7685 T233 C18 P55918 /update {version=2&wt=javabin} {add=[10010 (1414006035065077760)]} 0 14
[junit4:junit4]   2> 7697 T258 C16 P51456 REQ /update {update.distrib=FROMLEADER&distrib.from=http://127.0.0.1:42661/solr/collection1/&version=2&wt=javabin} status=0 QTime=2 
[junit4:junit4]   2> 7699 T248 C17 P42661 /update {version=2&wt=javabin} {add=[10010 (1414006035082903553)]} 0 10
[junit4:junit4]   2> 7703 T233 C18 P55918 /update {version=2&wt=javabin} {delete=[10009 (-1414006035096535040)]} 0 1
[junit4:junit4]   2> 7706 T258 C16 P51456 REQ /update {update.distrib=FROMLEADER&distrib.from=http://127.0.0.1:42661/solr/collection1/&version=2&wt=javabin} status=0 QTime=1 
[junit4:junit4]   2> 7707 T249 C17 P42661 /update {version=2&wt=javabin} {add=[11 (1414006035082903552)]} 0 19
[junit4:junit4]   2> 7710 T259 C16 P51456 REQ /update {update.distrib=FROMLEADER&distrib.from=http://127.0.0.1:42661/solr/collection1/&version=2&wt=javabin} status=0 QTime=1 
[junit4:junit4]   2> 7711 T248 C17 P42661 /update {version=2&wt=javabin} {delete=[10009 (-1414006035101777920)]} 0 5
[junit4:junit4]   2> 7716 T233 C18 P55918 /update {version=2&wt=javabin} {add=[12 (1414006035108069376)]} 0 3
[junit4:junit4]   2> 7718 T232 C18 P55918 /update {version=2&wt=javabin} {add=[10011 (1414006035112263680)]} 0 1
[junit4:junit4]   2> 7724 T259 C16 P51456 REQ /update {update.distrib=FROMLEADER&distrib.from=http://127.0.0.1:42661/solr/collection1/&version=2&wt=javabin} status=0 QTime=1 
[junit4:junit4]   2> 7725 T248 C17 P42661 /update {version=2&wt=javabin} {add=[12 (1414006035115409408)]} 0 5
[junit4:junit4]   2> 7729 T232 C18 P55918 /update {version=2&wt=javabin} {add=[13 (1414006035123798016)]} 0 1
[junit4:junit4]   2> 7730 T259 C16 P51456 REQ /update {update.distrib=FROMLEADER&distrib.from=http://127.0.0.1:42661/solr/collection1/&version=2&wt=javabin} status=0 QTime=1 
[junit4:junit4]   2> 7732 T249 C17 P42661 /update {version=2&wt=javabin} {add=[10011 (1414006035118555136)]} 0 10
[junit4:junit4]   2> 7740 T259 C16 P51456 REQ /update {update.distrib=FROMLEADER&distrib.from=http://127.0.0.1:42661/solr/collection1/&version=2&wt=javabin} status=0 QTime=2 
[junit4:junit4]   2> 7743 T248 C17 P42661 /update {version=2&wt=javabin} {add=[13 (1414006035129040896)]} 0 10
[junit4:junit4]   2> 7744 T232 C18 P55918 /update {version=2&wt=javabin} {add=[10012 (1414006035138478080)]} 0 3
[junit4:junit4]   2> 7748 T233 C18 P55918 /update {version=2&wt=javabin} {delete=[11 (-1414006035144769536)]} 0 1
[junit4:junit4]   2> 7755 T259 C16 P51456 REQ /update {update.distrib=FROMLEADER&distrib.from=http://127.0.0.1:42661/solr/collection1/&version=2&wt=javabin} status=0 QTime=1 
[junit4:junit4]   2> 7757 T248 C17 P42661 /update {version=2&wt=javabin} {add=[10012 (1414006035145818112)]} 0 8
[junit4:junit4]   2> 7759 T258 C16 P51456 REQ /update {update.distrib=FROMLEADER&distrib.from=http://127.0.0.1:42661/solr/collection1/&version=2&wt=javabin} status=0 QTime=1 
[junit4:junit4]   2> 7760 T249 C17 P42661 /update {version=2&wt=javabin} {delete=[11 (-1414006035148963840)]} 0 8
[junit4:junit4]   2> 7762 T233 C18 P55918 /update {version=2&wt=javabin} {add=[10013 (1414006035158401024)]} 0 1
[junit4:junit4]   2> 7765 T232 C18 P55918 /update {version=2&wt=javabin} {add=[14 (1414006035161546752)]} 0 2
[junit4:junit4]   2> 7775 T259 C16 P51456 REQ /update {update.distrib=FROMLEADER&distrib.from=http://127.0.0.1:42661/solr/collection1/&version=2&wt=javabin} status=0 QTime=3 
[junit4:junit4]   2> 7776 T248 C17 P42661 /update {version=2&wt=javabin} {add=[14 (1414006035166789632)]} 0 8
[junit4:junit4]   2> 7781 T232 C18 P55918 /update {version=2&wt=javabin} {add=[15 (1414006035178323968)]} 0 1
[junit4:junit4]   2> 7782 T258 C16 P51456 REQ /update {update.distrib=FROMLEADER&distrib.from=http://127.0.0.1:42661/solr/collection1/&version=2&wt=javabin} status=0 QTime=12 
[junit4:junit4]   2> 7783 T249 C17 P42661 /update {version=2&wt=javabin} {add=[10013 (1414006035163643904)]} 0 18
[junit4:junit4]   2> 7788 T232 C18 P55918 /update {version=2&wt=javabin} {delete=[10011 (-1414006035186712576)]} 0 1
[junit4:junit4]   2> 7792 T258 C16 P51456 REQ /update {update.distrib=FROMLEADER&distrib.from=http://127.0.0.1:42661/solr/collection1/&version=2&wt=javabin} status=0 QTime=2 
[junit4:junit4]   2> 7793 T248 C17 P42661 /update {version=2&wt=javabin} {add=[15 (1414006035183566848)]} 0 8
[junit4:junit4]   2> 7795 T259 C16 P51456 REQ /update {update.distrib=FROMLEADER&distrib.from=http://127.0.0.1:42661/solr/collection1/&version=2&wt=javabin} status=0 QTime=1 
[junit4:junit4]   2> 7796 T249 C17 P42661 /update {version=2&wt=javabin} {delete=[10011 (-1414006035189858304)]} 0 5
[junit4:junit4]   2> 7798 T232 C18 P55918 /update {version=2&wt=javabin} {add=[16 (1414006035196149760)]} 0 1
[junit4:junit4]   2> 7800 T233 C18 P55918 /update {version=2&wt=javabin} {add=[10014 (1414006035198246912)]} 0 1
[junit4:junit4]   2> 7807 T259 C16 P51456 REQ /update {update.distrib=FROMLEADER&distrib.from=http://127.0.0.1:42661/solr/collection1/&version=2&wt=javabin} status=0 QTime=2 
[junit4:junit4]   2> 7808 T249 C17 P42661 /update {version=2&wt=javabin} {add=[16 (1414006035201392640)]} 0 7
[junit4:junit4]   2> 7811 T258 C16 P51456 REQ /update {update.distrib=FROMLEADER&distrib.from=http://127.0.0.1:42661/solr/collection1/&version=2&wt=javabin} status=0 QTime=3 
[junit4:junit4]   2> 7811 T233 C18 P55918 /update {version=2&wt=javabin} {delete=[12 (-1414006035210829824)]} 0 0
[junit4:junit4]   2> 7812 T248 C17 P42661 /update {version=2&wt=javabin} {add=[10014 (1414006035203489792)]} 0 9
[junit4:junit4]   2> 7817 T233 C18 P55918 /update {version=2&wt=javabin} {add=[10015 (1414006035216072704)]} 0 1
[junit4:junit4]   2> 7818 T258 C16 P51456 REQ /update {update.distrib=FROMLEADER&distrib.from=http://127.0.0.1:42661/solr/collection1/&version=2&wt=javabin} status=0 QTime=0 
[junit4:junit4]   2> 7819 T249 C17 P42661 /update {version=2&wt=javabin} {delete=[12 (-1414006035215024128)]} 0 4
[junit4:junit4]   2> 7825 T233 C18 P55918 /update {version=2&wt=javabin} {add=[17 (1414006035224461312)]} 0 1
[junit4:junit4]   2> 7827 T258 C16 P51456 REQ /update {update.distrib=FROMLEADER&distrib.from=http://127.0.0.1:42661/solr/collection1/&version=2&wt=javabin} status=0 QTime=1 
[junit4:junit4]   2> 7828 T248 C17 P42661 /update {version=2&wt=javabin} {add=[10015 (1414006035222364160)]} 0 6
[junit4:junit4]   2> 7833 T233 C18 P55918 /update {version=2&wt=javabin} {add=[10016 (1414006035232849920)]} 0 1
[junit4:junit4]   2> 7838 T258 C16 P51456 REQ /update {update.distrib=FROMLEADER&distrib.from=http://127.0.0.1:42661/solr/collection1/&version=2&wt=javabin} status=0 QTime=1 
[junit4:junit4]   2> 7840 T249 C17 P42661 /update {version=2&wt=javabin} {add=[17 (1414006035229704192)]} 0 11
[junit4:junit4]   2> 7841 T259 C16 P51456 REQ /update {update.distrib=FROMLEADER&distrib.from=http://127.0.0.1:42661/solr/collection1/&version=2&wt=javabin} status=0 QTime=1 
[junit4:junit4]   2> 7842 T248 C17 P42661 /update {version=2&wt=javabin} {add=[10016 (1414006035238092800)]} 0 6
[junit4:junit4]   2> 7844 T233 C18 P55918 /update {version=2&wt=javabin} {delete=[13 (-1414006035245432832)]} 0 0
[junit4:junit4]   2> 7845 T232 C18 P55918 /update {version=2&wt=javabin} {delete=[10012 (-1414006035246481408)]} 0 0
[junit4:junit4]   2> 7852 T259 C16 P51456 REQ /update {update.distrib=FROMLEADER&distrib.from=http://127.0.0.1:42661/solr/collection1/&version=2&wt=javabin} status=0 QTime=0 
[junit4:junit4]   2> 7853 T249 C17 P42661 /update {version=2&wt=javabin} {delete=[13 (-1414006035250675712)]} 0 4
[junit4:junit4]   2> 7854 T258 C16 P51456 REQ /update {update.distrib=FROMLEADER&distrib.from=http://127.0.0.1:42661/solr/collection1/&version=2&wt=javabin} status=0 QTime=0 
[junit4:junit4]   2> 7854 T248 C17 P42661 /update {version=2&wt=javabin} {delete=[10012 (-1414006035252772864)]} 0 3
[junit4:junit4]   2> 7857 T233 C18 P55918 /update {version=2&wt=javabin} {add=[18 (1414006035258015744)]} 0 1
[junit4:junit4]   2> 7859 T232 C18 P55918 /update {version=2&wt=javabin} {add=[10017 (1414006035260112896)]} 0 1
[junit4:junit4]   2> 7871 T258 C16 P51456 REQ /update {update.distrib=FROMLEADER&distrib.from=http://127.0.0.1:42661/solr/collection1/&version=2&wt=javabin} status=0 QTime=1 
[junit4:junit4]   2> 7872 T249 C17 P42661 /update {version=2&wt=javabin} {add=[10017 (1414006035266404352)]} 0 9
[junit4:junit4]   2> 7876 T232 C18 P55918 /update {version=2&wt=javabin} {delete=[10013 (-1414006035278987264)]} 0 0
[junit4:junit4]   2> 7882 T258 C16 P51456 REQ /update {update.distrib=FROMLEADER&distrib.from=http://127.0.0.1:42661/solr/collection1/&version=2&wt=javabin} status=0 QTime=1 
[junit4:junit4]   2> 7884 T248 C17 P42661 /update {version=2&wt=javabin} {add=[18 (1414006035265355776)]} 0 22
[junit4:junit4]   2> 7884 T259 C16 P51456 REQ /update {update.distrib=FROMLEADER&distrib.from=http://127.0.0.1:42661/solr/collection1/&version=2&wt=javabin} status=0 QTime=0 
[junit4:junit4]   2> 7885 T249 C17 P42661 /update {version=2&wt=javabin} {delete=[10013 (-1414006035283181568)]} 0 5
[junit4:junit4]   2> 7889 T233 C18 P55918 /update {version=2&wt=javabin} {add=[10018 (1414006035292618752)]} 0 1
[junit4:junit4]   2> 7889 T232 C18 P55918 /update {version=2&wt=javabin} {add=[19 (1414006035291570176)]} 0 1
[junit4:junit4]   2> 7899 T258 C16 P51456 REQ /update {update.distrib=FROMLEADER&distrib.from=http://127.0.0.1:42661/solr/collection1/&version=2&wt=javabin} status=0 QTime=2 
[junit4:junit4]   2> 7900 T248 C17 P42661 /update {version=2&wt=javabin} {add=[19 (1414006035296813057)]} 0 7
[junit4:junit4]   2> 7905 T259 C16 P51456 REQ /update {update.distrib=FROMLEADER&distrib.from=http://127.0.0.1:42661/solr/collection1/&version=2&wt=javabin} status=0 QTime=9 
[junit4:junit4]   2> 7906 T249 C17 P42661 /update {version=2&wt=javabin} {add=[10018 (1414006035296813056)]} 0 14
[junit4:junit4]   2> 7910 T233 C18 P55918 /update {version=2&wt=javabin} {add=[10019 (1414006035313590272)]} 0 1
[junit4:junit4]   2> 7916 T232 C18 P55918 /update {version=2&wt=javabin} {add=[20 (1414006035308347392)]} 0 12
[junit4:junit4]   2> 7918 T259 C16 P51456 REQ /update {update.distrib=FROMLEADER&distrib.from=http://127.0.0.1:42661/solr/collection1/&version=2&wt=javabin} status=0 QTime=1 
[junit4:junit4]   2> 7919 T249 C17 P42661 /update {version=2&wt=javabin} {add=[10019 (1414006035317784576)]} 0 6
[junit4:junit4]   2> 7925 T232 C18 P55918 /update {version=2&wt=javabin} {add=[10020 (1414006035329318912)]} 0 2
[junit4:junit4]   2> 7925 T259 C16 P51456 REQ /update {update.distrib=FROMLEADER&distrib.from=http://127.0.0.1:42661/solr/collection1/&version=2&wt=javabin} status=0 QTime=1 
[junit4:junit4]   2> 7927 T248 C17 P42661 /update {version=2&wt=javabin} {add=[20 (1414006035325124608)]} 0 7
[junit4:junit4]   2> 7931 T232 C18 P55918 /update {version=2&wt=javabin} {delete=[17 (-1414006035336658944)]} 0 0
[junit4:junit4]   2> 7934 T259 C16 P51456 REQ /update {update.distrib=FROMLEADER&distrib.from=http://127.0.0.1:42661/solr/collection1/&version=2&wt=javabin} status=0 QTime=2 
[junit4:junit4]   2> 7935 T249 C17 P42661 /update {version=2&wt=javabin} {add=[10020 (1414006035334561792)]} 0 6
[junit4:junit4]   2> 7939 T259 C16 P51456 REQ /update {update.distrib=FROMLEADER&distrib.from=http://127.0.0.1:42661/solr/collection1/&version=2&wt=javabin} status=0 QTime=1 
[junit4:junit4]   2> 7939 T232 C18 P55918 /update {version=2&wt=javabin} {delete=[10017 (-1414006035345047552)]} 0 0
[junit4:junit4]   2> 7940 T248 C17 P42661 /update {version=2&wt=javabin} {delete=[17 (-1414006035340853248)]} 0 5
[junit4:junit4]   2> 7950 T259 C16 P51456 REQ /update {update.distrib=FROMLEADER&distrib.from=http://127.0.0.1:42661/solr/collection1/&version=2&wt=javabin} status=0 QTime=0 
[junit4:junit4]   2> 7957 T233 C18 P55918 /update {version=2&wt=javabin} {add=[21 (1414006035349241856)]} 0 14
[junit4:junit4]   2> 7958 T248 C17 P42661 /update {version=2&wt=javabin} {delete=[10017 (-1414006035353436160)]} 0 11
[junit4:junit4]   2> 7964 T233 C18 P55918 /update {version=2&wt=javabin} {add=[10021 (1414006035368116224)]} 0 3
[junit4:junit4]   2> 7967 T259 C16 P51456 REQ /update {update.distrib=FROMLEADER&distrib.from=http://127.0.0.1:42661/solr/collection1/&version=2&wt=javabin} status=0 QTime=2 
[junit4:junit4]   2> 7968 T249 C17 P42661 /update {version=2&wt=javabin} {add=[21 (1414006035368116224)]} 0 7
[junit4:junit4]   2> 7973 T233 C18 P55918 /update {version=2&wt=javabin} {delete=[18 (-1414006035379650560)]} 0 1
[junit4:junit4]   2> 7977 T259 C16 P51456 REQ /update {update.distrib=FROMLEADER&distrib.from=http://127.0.0.1:42661/solr/collection1/&version=2&wt=javabin} status=0 QTime=2 
[junit4:junit4]   2> 7978 T248 C17 P42661 /update {version=2&wt=javabin} {add=[10021 (1414006035376504832)]} 0 10
[junit4:junit4]   2> 7981 T259 C16 P51456 REQ /update {update.distrib=FROMLEADER&distrib.from=http://127.0.0.1:42661/solr/collection1/&version=2&wt=javabin} status=0 QTime=1 
[junit4:junit4]   2> 7982 T233 C18 P55918 /update {version=2&wt=javabin} {delete=[10018 (-1414006035390136320)]} 0 1
[junit4:junit4]   2> 7982 T249 C17 P42661 /update {version=2&wt=javabin} {delete=[18 (-1414006035384893440)]} 0 5
[junit4:junit4]   2> 7986 T233 C18 P55918 /update {version=2&wt=javabin} {add=[22 (1414006035394330624)]} 0 1
[junit4:junit4]   2> 7988 T259 C16 P51456 REQ /update {update.distrib=FROMLEADER&distrib.from=http://127.0.0.1:42661/solr/collection1/&version=2&wt=javabin} status=0 QTime=0 
[junit4:junit4]   2> 7989 T248 C17 P42661 /update {version=2&wt=javabin} {delete=[10018 (-1414006035393282048)]} 0 4
[junit4:junit4]   2> 7993 T233 C18 P55918 /update {version=2&wt=javabin} {add=[10022 (1414006035400622080)]} 0 1
[junit4:junit4]   2> 8001 T259 C16 P51456 REQ /update {update.distrib=FROMLEADER&distrib.from=http://127.0.0.1:42661/solr/collection1/&version=2&wt=javabin} status=0 QTime=1 
[junit4:junit4]   2> 8002 T248 C17 P42661 /update {version=2&wt=javabin} {add=[10022 (1414006035404816384)]} 0 6
[junit4:junit4]   2> 8005 T233 C18 P55918 /update {version=2&wt=javabin} {delete=[10019 (-1414006035414253568)]} 0 1
[junit4:junit4]   2> 8006 T259 C16 P51456 REQ /update {update.distrib=FROMLEADER&distrib.from=http://127.0.0.1:42661/solr/collection1/&version=2&wt=javabin} status=0 QTime=1 
[junit4:junit4]   2> 8007 T249 C17 P42661 /update {version=2&wt=javabin} {add=[22 (1414006035398524928)]} 0 17
[junit4:junit4]   2> 8011 T233 C18 P55918 /update {version=2&wt=javabin} {delete=[19 (-1414006035419496448)]} 0 1
[junit4:junit4]   2> 8011 T259 C16 P51456 REQ /update {update.distrib=FROMLEADER&distrib.from=http://127.0.0.1:42661/solr/collection1/&version=2&wt=javabin} status=0 QTime=1 
[junit4:junit4]   2> 8012 T248 C17 P42661 /update {version=2&wt=javabin} {delete=[10019 (-1414006035417399296)]} 0 4
[junit4:junit4]   2> 8016 T233 C18 P55918 /update {version=2&wt=javabin} {add=[10023 (1414006035424739328)]} 0 1
[junit4:junit4]   2> 8017 T259 C16 P51456 REQ /update {update.distrib=FROMLEADER&distrib.from=http://127.0.0.1:42661/solr/collection1/&version=2&wt=javabin} status=0 QTime=1 
[junit4:junit4]   2> 8017 T249 C17 P42661 /update {version=2&wt=javabin} {delete=[19 (-1414006035423690752)]} 0 3
[junit4:junit4]   2> 8021 T233 C18 P55918 /update {version=2&wt=javabin} {add=[23 (1414006035429982208)]} 0 1
[junit4:junit4]   2> 8023 T259 C16 P51456 REQ /update {update.distrib=FROMLEADER&distrib.from=http://127.0.0.1:42661/solr/collection1/&version=2&wt=javabin} status=0 QTime=1 
[junit4:junit4]   2> 8023 T248 C17 P42661 /update {version=2&wt=javabin} {add=[10023 (1414006035428933632)]} 0 4
[junit4:junit4]   2> 8027 T233 C18 P55918 /update {version=2&wt=javabin} {delete=[10020 (-1414006035436273664)]} 0 1
[junit4:junit4]   2> 8034 T258 C16 P51456 REQ /update {update.distrib=FROMLEADER&distrib.from=http://127.0.0.1:42661/solr/collection1/&version=2&wt=javabin} status=0 QTime=0 
[junit4:junit4]   2> 8036 T248 C17 P42661 /update {version=2&wt=javabin} {delete=[10020 (-1414006035440467968)]} 0 6
[junit4:junit4]   2> 8038 T259 C16 P51456 REQ /update {update.distrib=FROMLEADER&distrib.from=http://127.0.0.1:42661/solr/collection1/&version=2&wt=javabin} status=0 QTime=10 
[junit4:junit4]   2> 8039 T249 C17 P42661 /update {version=2&wt=javabin} {add=[23 (1414006035434176512)]} 0 15
[junit4:junit4]   2> 8040 T233 C18 P55918 /update {version=2&wt=javabin} {add=[10024 (1414006035449905152)]} 0 1
[junit4:junit4]   2> 8042 T232 C18 P55918 /update {version=2&wt=javabin} {delete=[20 (-1414006035453050880)]} 0 0
[junit4:junit4]   2> 8050 T258 C16 P51456 REQ /update {update.distrib=FROMLEADER&distrib.from=http://127.0.0.1:42661/solr/collection1/&version=2&wt=javabin} status=0 QTime=1 
[junit4:junit4]   2> 8051 T259 C16 P51456 REQ /update {update.distrib=FROMLEADER&distrib.from=http://127.0.0.1:42661/solr/collection1/&version=2&wt=javabin} status=0 QTime=2 
[junit4:junit4]   2> 8051 T248 C17 P42661 /update {version=2&wt=javabin} {delete=[20 (-1414006035457245184)]} 0 5
[junit4:junit4]   2> 8052 T249 C17 P42661 /update {version=2&wt=javabin} {add=[10024 (1414006035454099456)]} 0 9
[junit4:junit4]   2> 8055 T233 C18 P55918 /update {version=2&wt=javabin} {delete=[10023 (-1414006035466682368)]} 0 0
[junit4:junit4]   2> 8056 T232 C18 P55918 /update {version=2&wt=javabin} {add=[24 (1414006035466682369)]} 0 1
[junit4:junit4]   2> 8063 T259 C16 P51456 REQ /update {update.distrib=FROMLEADER&distrib.from=http://127.0.0.1:42661/solr/collection1/&version=2&wt=javabin} status=0 QTime=0 
[junit4:junit4]   2> 8065 T249 C17 P42661 /update {version=2&wt=javabin} {delete=[10023 (-1414006035470876672)]} 0 6
[junit4:junit4]   2> 8065 T258 C16 P51456 REQ /update {update.distrib=FROMLEADER&distrib.from=http://127.0.0.1:42661/solr/collection1/&version=2&wt=javabin} status=0 QTime=1 
[junit4:junit4]   2> 8067 T248 C17 P42661 /update {version=2&wt=javabin} {add=[24 (1414006035471925248)]} 0 8
[junit4:junit4]   2> 8070 T232 C18 P55918 /update {version=2&wt=javabin} {add=[10025 (1414006035481362432)]} 0 1
[junit4:junit4]   2> 8070 T233 C18 P55918 /update {version=2&wt=javabin} {delete=[23 (-1414006035482411008)]} 0 0
[junit4:junit4]   2> 8079 T258 C16 P51456 REQ /update {update.distrib=FROMLEADER&distrib.from=http://127.0.0.1:42661/solr/collection1/&version=2&wt=javabin} status=0 QTime=1 
[junit4:junit4]   2> 8080 T248 C17 P42661 /update {version=2&wt=javabin} {add=[10025 (1414006035486605313)]} 0 6
[junit4:junit4]   2> 8081 T259 C16 P51456 REQ /update {update.distrib=FROMLEADER&distrib.from=http://127.0.0.1:42661/solr/collection1/&version=2&wt=javabin} status=0 QTime=0 
[junit4:junit4]   2> 8082 T249 C17 P42661 /update {version=2&wt=javabin} {delete=[23 (-1414006035486605312)]} 0 8
[junit4:junit4]   2> 8085 T233 C18 P55918 /update {version=2&wt=javabin} {add=[10026 (1414006035497091072)]} 0 1
[junit4:junit4]   2> 8086 T232 C18 P55918 /update {version=2&wt=javabin} {add=[25 (1414006035498139648)]} 0 1
[junit4:junit4]   2> 8094 T258 C16 P51456 REQ /update {update.distrib=FROMLEADER&distrib.from=http://127.0.0.1:42661/solr/collection1/&version=2&wt=javabin} status=0 QTime=1 
[junit4:junit4]   2> 8096 T259 C16 P51456 REQ /update {update.distrib=FROMLEADER&distrib.from=http://127.0.0.1:42661/solr/collection1/&version=2&wt=javabin} status=0 QTime=1 
[junit4:junit4]   2> 8096 T249 C17 P42661 /update {version=2&wt=javabin} {add=[10026 (1414006035502333952)]} 0 8
[junit4:junit4]   2> 8097 T248 C17 P42661 /update {version=2&wt=javabin} {add=[25 (1414006035502333953)]} 0 8
[junit4:junit4]   2> 8099 T232 C18 P55918 /update {version=2&wt=javabin} {delete=[10025 (-1414006035512819712)]} 0 0
[junit4:junit4]   2> 8102 T233 C18 P55918 /update {version=2&wt=javabin} {add=[26 (1414006035514916864)]} 0 1
[junit4:junit4]   2> 8108 T259 C16 P51456 REQ /update {update.distrib=FROMLEADER&distrib.from=http://127.0.0.1:42661/solr/collection1/&version=2&wt=javabin} status=0 QTime=1 
[junit4:junit4]   2> 8109 T248 C17 P42661 /update {version=2&wt=javabin} {delete=[10025 (-1414006035518062592)]} 0 5
[junit4:junit4]   2> 8112 T258 C16 P51456 REQ /update {update.distrib=FROMLEADER&distrib.from=http://127.0.0.1:42661/solr/collection1/&version=2&wt=javabin} status=0 QTime=2 
[junit4:junit4]   2> 8113 T249 C17 P42661 /update {version=2&wt=javabin} {add=[26 (1414006035520159744)]} 0 7
[junit4:junit4]   2> 8113 T233 C18 P55918 /update {version=2&wt=javabin} {add=[10027 (1414006035526451200)]} 0 1
[junit4:junit4]   2> 8116 T232 C18 P55918 /update {version=2&wt=javabin} {delete=[25 (-1414006035530645504)]} 0 0
[junit4:junit4]   2> 8124 T258 C16 P51456 REQ /update {update.distrib=FROMLEADER&distrib.from=http://127.0.0.1:42661/solr/collection1/&version=2&wt=javabin} status=0 QTime=1 
[junit4:junit4]   2> 8125 T259 C16 P51456 REQ /update {update.distrib=FROMLEADER&distrib.from=http://127.0.0.1:42661/solr/collection1/&version=2&wt=javabin} status=0 QTime=1 
[junit4:junit4]   2> 8125 T248 C17 P42661 /update {version=2&wt=javabin} {delete=[25 (-1414006035533791232)]} 0 6
[junit4:junit4]   2> 8126 T249 C17 P42661 /update {version=2&wt=javabin} {add=[10027 (1414006035532742656)]} 0 8
[junit4:junit4]   2> 8129 T232 C18 P55918 /update {version=2&wt=javabin} {add=[27 (1414006035543228416)]} 0 1
[junit4:junit4]   2> 8139 T259 C16 P51456 REQ /update {update.distrib=FROMLEADER&distrib.from=http://127.0.0.1:42661/solr/collection1/&version=2&wt=javabin} status=0 QTime=1 
[junit4:junit4]   2> 8140 T249 C17 P42661 /update {version=2&wt=javabin} {add=[27 (1414006035548471296)]} 0 7
[junit4:junit4]   2> 8141 T233 C18 P55918 /update {version=2&wt=javabin} {add=[10028 (1414006035544276992)]} 0 12
[junit4:junit4]   2> 8144 T232 C18 P55918 /update {version=2&wt=javabin} {add=[28 (1414006035558957056)]} 0 1
[junit4:junit4]   2> 8152 T259 C16 P51456 REQ /update {update.distrib=FROMLEADER&distrib.from=http://127.0.0.1:42661/solr/collection1/&version=2&wt=javabin} status=0 QTime=2 
[junit4:junit4]   2> 8153 T249 C17 P42661 /update {version=2&wt=javabin} {add=[10028 (1414006035561054208)]} 0 8
[junit4:junit4]   2> 8156 T232 C18 P55918 /update {version=2&wt=javabin} {delete=[10028 (-1414006035572588544)]} 0 0
[junit4:junit4]   2> 8165 T258 C16 P51456 REQ /update {update.distrib=FROMLEADER&distrib.from=http://127.0.0.1:42661/solr/collection1/&version=2&wt=javabin} status=0 QTime=13 
[junit4:junit4]   2> 8166 T248 C17 P42661 /update {version=2&wt=javabin} {add=[28 (1414006035564199936)]} 0 18
[junit4:junit4]   2> 8168 T259 C16 P51456 REQ /update {update.distrib=FROMLEADER&distrib.from=http://127.0.0.1:42661/solr/collection1/&version=2&wt=javabin} status=0 QTime=1 
[junit4:junit4]   2> 8169 T232 C18 P55918 /update {version=2&wt=javabin} {delete=[28 (-1414006035586220032)]} 0 0
[junit4:junit4]   2> 8171 T249 C17 P42661 /update {version=2&wt=javabin} {delete=[10028 (-1414006035578880000)]} 0 9
[junit4:junit4]   2> 8175 T259 C16 P51456 REQ /update {update.distrib=FROMLEADER&distrib.from=http://127.0.0.1:42661/solr/collection1/&version=2&wt=javabin} status=0 QTime=0 
[junit4:junit4]   2> 8176 T248 C17 P42661 /update {version=2&wt=javabin} {delete=[28 (-1414006035589365760)]} 0 4
[junit4:junit4]   2> 8178 T232 C18 P55918 /update {version=2&wt=javabin} {add=[10029 (1414006035594608640)]} 0 1
[junit4:junit4]   2> 8182 T233 C18 P55918 /update {version=2&wt=javabin} {add=[29 (1414006035597754368)]} 0 2
[junit4:junit4]   2> 8194 T259 C16 P51456 REQ /update {update.distrib=FROMLEADER&distrib.from=http://127.0.0.1:42661/solr/collection1/&version=2&wt=javabin} status=0 QTime=3 
[junit4:junit4]   2> 8195 T249 C17 P42661 /update {version=2&wt=javabin} {add=[29 (1414006035602997248)]} 0 10
[junit4:junit4]   2> 8200 T233 C18 P55918 /update {version=2&wt=javabin} {add=[30 (1414006035617677312)]} 0 2
[junit4:junit4]   2> 8200 T259 C16 P51456 REQ /update {update.distrib=FROMLEADER&distrib.from=http://127.0.0.1:42661/solr/collection1/&version=2&wt=javabin} status=0 QTime=1 
[junit4:junit4]   2> 8201 T248 C17 P42661 /update {version=2&wt=javabin} {add=[10029 (1414006035599851520)]} 0 19
[junit4:junit4]   2> 8205 T233 C18 P55918 /update {version=2&wt=javabin} {add=[10030 (1414006035622920192)]} 0 1
[junit4:junit4]   2> 8208 T259 C16 P51456 REQ /update {update.distrib=FROMLEADER&distrib.from=http://127.0.0.1:42661/solr/collection1/&version=2&wt=javabin} status=0 QTime=1 
[junit4:junit4]   2> 8209 T249 C17 P42661 /update {version=2&wt=javabin} {add=[30 (1414006035621871616)]} 0 6
[junit4:junit4]   2> 8213 T233 C18 P55918 /update {version=2&wt=javabin} {add=[31 (1414006035631308800)]} 0 1
[junit4:junit4]   2> 8214 T259 C16 P51456 REQ /update {update.distrib=FROMLEADER&distrib.from=http://127.0.0.1:42661/solr/collection1/&version=2&wt=javabin} status=0 QTime=1 
[junit4:junit4]   2> 8215 T248 C17 P42661 /update {version=2&wt=javabin} {add=[10030 (1414006035628163072)]} 0 7
[junit4:junit4]   2> 8219 T233 C18 P55918 /update {version=2&wt=javabin} {add=[10031 (1414006035638648832)]} 0 1
[junit4:junit4]   2> 8229 T259 C16 P51456 REQ /update {update.distrib=FROMLEADER&distrib.from=http://127.0.0.1:42661/solr/collection1/&version=2&wt=javabin} status=0 QTime=1 
[junit4:junit4]   2> 8230 T248 C17 P42661 /update {version=2&wt=javabin} {add=[10031 (1414006035642843136)]} 0 7
[junit4:junit4]   2> 8231 T258 C16 P51456 REQ /update {update.distrib=FROMLEADER&distrib.from=http://127.0.0.1:42661/solr/collection1/&version=2&wt=javabin} status=0 QTime=1 
[junit4:junit4]   2> 8232 T249 C17 P42661 /update {version=2&wt=javabin} {add=[31 (1414006035635503104)]} 0 16
[junit4:junit4]   2> 8234 T233 C18 P55918 /update {version=2&wt=javabin} {add=[10032 (1414006035653328896)]} 0 1
[junit4:junit4]   2> 8235 T232 C18 P55918 /update {version=2&wt=javabin} {add=[32 (1414006035655426048)]} 0 1
[junit4:junit4]   2> 8243 T258 C16 P51456 REQ /update {update.distrib=FROMLEADER&distrib.from=http://127.0.0.1:42661/solr/collection1/&version=2&wt=javabin} status=0 QTime=1 
[junit4:junit4]   2> 8243 T259 C16 P51456 REQ /update {update.distrib=FROMLEADER&distrib.from=http://127.0.0.1:42661/solr/collection1/&version=2&wt=javabin} status=0 QTime=1 
[junit4:junit4]   2> 8244 T249 C17 P42661 /update {version=2&wt=javabin} {add=[10032 (1414006035658571776)]} 0 7
[junit4:junit4]   2> 8244 T248 C17 P42661 /update {version=2&wt=javabin} {add=[32 (1414006035658571777)]} 0 6
[junit4:junit4]   2> 8248 T232 C18 P55918 /update {version=2&wt=javabin} {add=[10033 (1414006035668008960)]} 0 0
[junit4:junit4]   2> 8249 T233 C18 P55918 /update {version=2&wt=javabin} {add=[33 (1414006035670106112)]} 0 0
[junit4:junit4]   2> 8254 T259 C16 P51456 REQ /update {update.distrib=FROMLEADER&distrib.from=http://127.0.0.1:42661/solr/collection1/&version=2&wt=javabin} status=0 QTime=0 
[junit4:junit4]   2> 8255 T248 C17 P42661 /update {version=2&wt=javabin} {add=[10033 (1414006035672203264)]} 0 4
[junit4:junit4]   2> 8260 T233 C18 P55918 /update {version=2&wt=javabin} {delete=[10032 (-1414006035681640448)]} 0 1
[junit4:junit4]   2> 8265 T258 C16 P51456 REQ /update {update.distrib=FROMLEADER&distrib.from=http://127.0.0.1:42661/solr/collection1/&version=2&wt=javabin} status=0 QTime=10 
[junit4:junit4]   2> 8266 T249 C17 P42661 /update {version=2&wt=javabin} {add=[33 (1414006035673251840)]} 0 14
[junit4:junit4]   2> 8266 T259 C16 P51456 REQ /update {update.distrib=FROMLEADER&distrib.from=http://127.0.0.1:42661/solr/collection1/&version=2&wt=javabin} status=0 QTime=0 
[junit4:junit4]   2> 8267 T248 C17 P42661 /update {version=2&wt=javabin} {delete=[10032 (-1414006035684786176)]} 0 4
[junit4:junit4]   2> 8269 T233 C18 P55918 /update {version=2&wt=javabin} {delete=[32 (-1414006035691077632)]} 0 1
[junit4:junit4]   2> 8275 T233 C18 P55918 /update {version=2&wt=javabin} {add=[10034 (1414006035695271936)]} 0 2
[junit4:junit4]   2> 8282 T258 C16 P51456 REQ /update {update.distrib=FROMLEADER&distrib.from=http://127.0.0.1:42661/solr/collection1/&version=2&wt=javabin} status=0 QTime=1 
[junit4:junit4]   2> 8283 T248 C17 P42661 /update {version=2&wt=javabin} {add=[10034 (1414006035700514816)]} 0 5
[junit4:junit4]   2> 8287 T233 C18 P55918 /update {version=2&wt=javabin} {add=[10035 (1414006035708903424)]} 0 1
[junit4:junit4]   2> 8294 T258 C16 P51456 REQ /update {update.distrib=FROMLEADER&distrib.from=http://127.0.0.1:42661/solr/collection1/&version=2&wt=javabin} status=0 QTime=1 
[junit4:junit4]   2> 8295 T248 C17 P42661 /update {version=2&wt=javabin} {add=[10035 (1414006035713097728)]} 0 5
[junit4:junit4]   2> 8298 T233 C18 P55918 /update {version=2&wt=javabin} {delete=[10033 (-1414006035721486336)]} 0 0
[junit4:junit4]   2> 8287 T259 C16 P51456 REQ /update {update.distrib=FROMLEADER&distrib.from=http://127.0.0.1:42661/solr/collection1/&version=2&wt=javabin} status=0 QTime=0 
[junit4:junit4]   2> 8303 T249 C17 P42661 /update {version=2&wt=javabin} {delete=[32 (-1414006035694223360)]} 0 31
[junit4:junit4]   2> 8304 T258 C16 P51456 REQ /update {update.distrib=FROMLEADER&distrib.from=http://127.0.0.1:42661/solr/collection1/&version=2&wt=javabin} status=0 QTime=0 
[junit4:junit4]   2> 8305 T248 C17 P42661 /update {version=2&wt=javabin} {delete=[10033 (-1414006035724632064)]} 0 4
[junit4:junit4]   2> 8319 T232 C18 P55918 /update {version=2&wt=javabin} {add=[10036 (1414006035731972096)]} 0 11
[junit4:junit4]   2> 8323 T233 C18 P55918 /update {version=2&wt=javabin} {add=[34 (1414006035729874944)]} 0 17
[junit4:junit4]   2> 8327 T258 C16 P51456 REQ /update {update.distrib=FROMLEADER&distrib.from=http://127.0.0.1:42661/solr/collection1/&version=2&wt=javabin} status=0 QTime=1 
[junit4:junit4]   2> 8328 T248 C17 P42661 /update {version=2&wt=javabin} {add=[10036 (1414006035746652160)]} 0 6
[junit4:junit4]   2> 8330 T259 C16 P51456 REQ /update {update.distrib=FROMLEADER&distrib.from=http://127.0.0.1:42661/solr/collection1/&version=2&wt=javabin} status=0 QTime=1 
[junit4:junit4]   2> 8334 T249 C17 P42661 /update {version=2&wt=javabin} {add=[34 (1414006035750846464)]} 0 8
[junit4:junit4]   2> 8337 T233 C18 P55918 /update {version=2&wt=javabin} {add=[10037 (1414006035760283648)]} 0 2
[junit4:junit4]   2> 8339 T232 C18 P55918 /update {version=2&wt=javabin} {add=[35 (1414006035763429376)]} 0 2
[junit4:junit4]   2> 8345 T259 C16 P51456 REQ /update {update.distrib=FROMLEADER&distrib.from=http://127.0.0.1:42661/solr/collection1/&version=2&wt=javabin} status=0 QTime=1 
[junit4:junit4]   2> 8345 T249 C17 P42661 /update {version=2&wt=javabin} {add=[10037 (1414006035765526528)]} 0 5
[junit4:junit4]   2> 8350 T232 C18 P55918 /update {version=2&wt=javabin} {add=[10038 (1414006035774963712)]} 0 1
[junit4:junit4]   2> 8352 T259 C16 P51456 REQ /update {update.distrib=FROMLEADER&distrib.from=http://127.0.0.1:42661/solr/collection1/&version=2&wt=javabin} status=0 QTime=1 
[junit4:junit4]   2> 8353 T248 C17 P42661 /update {version=2&wt=javabin} {add=[35 (1414006035772866560)]} 0 6
[junit4:junit4]   2> 8357 T232 C18 P55918 /update {version=2&wt=javabin} {delete=[33 (-1414006035783352320)]} 0 1
[junit4:junit4]   2> 8360 T259 C16 P51456 REQ /update {update.distrib=FROMLEADER&distrib.from=http://127.0.0.1:42661/solr/collection1/&version=2&wt=javabin} status=0 QTime=1 
[junit4:junit4]   2> 8361 T249 C17 P42661 /update {version=2&wt=javabin} {add=[10038 (1414006035781255168)]} 0 6
[junit4:junit4]   2> 8363 T258 C16 P51456 REQ /update {update.distrib=FROMLEADER&distrib.from=http://127.0.0.1:42661/solr/collection1/&version=2&wt=javabin} status=0 QTime=1 
[junit4:junit4]   2> 8364 T248 C17 P42661 /update {version=2&wt=javabin} {delete=[33 (-1414006035786498048)]} 0 4
[junit4:junit4]   2> 8364 T232 C18 P55918 /update {version=2&wt=javabin} {delete=[10037 (-1414006035790692352)]} 0 0
[junit4:junit4]   2> 8368 T233 C18 P55918 /update {version=2&wt=javabin} {add=[36 (1414006035793838080)]} 0 1
[junit4:junit4]   2> 8370 T258 C16 P51456 REQ /update {update.distrib=FROMLEADER&distrib.from=http://127.0.0.1:42661/solr/collection1/&version=2&wt=javabin} status=0 QTime=0 
[junit4:junit4]   2> 8371 T248 C17 P42661 /update {version=2&wt=javabin} {delete=[10037 (-1414006035793838080)]} 0 4
[junit4:junit4]   2> 8376 T233 C18 P55918 /update {version=2&wt=javabin} {add=[10039 (1414006035802226688)]} 0 1
[junit4:junit4]   2> 8376 T258 C16 P51456 REQ /update {update.distrib=FROMLEADER&distrib.from=http://127.0.0.1:42661/solr/collection1/&version=2&wt=javabin} status=0 QTime=1 
[junit4:junit4]   2> 8377 T249 C17 P42661 /update {version=2&wt=javabin} {add=[36 (1414006035799080960)]} 0 6
[junit4:junit4]   2> 8382 T233 C18 P55918 /update {version=2&wt=javabin} {add=[37 (1414006035808518144)]} 0 1
[junit4:junit4]   2> 8385 T258 C16 P51456 REQ /update {update.distrib=FROMLEADER&distrib.from=http://127.0.0.1:42661/solr/collection1/&version=2&wt=javabin} status=0 QTime=1 
[junit4:junit4]   2> 8386 T248 C17 P42661 /update {version=2&wt=javabin} {add=[10039 (1414006035807469568)]} 0 7
[junit4:junit4]   2> 8390 T233 C18 P55918 /update {version=2&wt=javabin} {add=[10040 (1414006035817955328)]} 0 0
[junit4:junit4]   2> 8404 T258 C16 P51456 REQ /update {update.distrib=FROMLEADER&distrib.from=http://127.0.0.1:42661/solr/collection1/&version=2&wt=javabin} status=0 QTime=15 
[junit4:junit4]   2> 8405 T249 C17 P42661 /update {version=2&wt=javabin} {add=[37 (1414006035813761024)]} 0 20
[junit4:junit4]   2> 8410 T233 C18 P55918 /update {version=2&wt=javabin} {add=[38 (1414006035838926848)]} 0 1
[junit4:junit4]   2> 8416 T258 C16 P51456 REQ /update {update.distrib=FROMLEADER&distrib.from=http://127.0.0.1:42661/solr/collection1/&version=2&wt=javabin} status=0 QTime=2 
[junit4:junit4]   2> 8418 T248 C17 P42661 /update {version=2&wt=javabin} {add=[10040 (1414006035823198208)]} 0 23
[junit4:junit4]   2> 8420 T259 C16 P51456 REQ /update {update.distrib=FROMLEADER&distrib.from=http://127.0.0.1:42661/solr/collection1/&version=2&wt=javabin} status=0 QTime=1 
[junit4:junit4]   2> 8422 T249 C17 P42661 /update {version=2&wt=javabin} {add=[38 (1414006035845218304)]} 0 6
[junit4:junit4]   2> 8422 T233 C18 P55918 /update {version=2&wt=javabin} {add=[10041 (1414006035850461184)]} 0 1
[junit4:junit4]   2> 8425 T232 C18 P55918 /update {version=2&wt=javabin} {delete=[37 (-1414006035854655488)]} 0 0
[junit4:junit4]   2> 8431 T259 C16 P51456 REQ /update {update.distrib=FROMLEADER&distrib.from=http://127.0.0.1:42661/solr/collection1/&version=2&wt=javabin} status=0 QTime=1 
[junit4:junit4]   2> 8432 T249 C17 P42661 /update {version=2&wt=javabin} {add=[10041 (1414006035856752640)]} 0 6
[junit4:junit4]   2> 8433 T258 C16 P51456 REQ /update {update.distrib=FROMLEADER&distrib.from=http://127.0.0.1:42661/solr/collection1/&version=2&wt=javabin} status=0 QTime=1 
[junit4:junit4]   2> 8433 T248 C17 P42661 /update {version=2&wt=javabin} {delete=[37 (-1414006035857801216)]} 0 5
[junit4:junit4]   2> 8436 T232 C18 P55918 /update {version=2&wt=javabin} {add=[10042 (1414006035865141248)]} 0 1
[junit4:junit4]   2> 8438 T233 C18 P55918 /update {version=2&wt=javabin} {add=[39 (1414006035867238400)]} 0 1
[junit4:junit4]   2> 8447 T258 C16 P51456 REQ /update {update.distrib=FROMLEADER&distrib.from=http://127.0.0.1:42661/solr/collection1/&version=2&wt=javabin} status=0 QTime=0 
[junit4:junit4]   2> 8449 T248 C17 P42661 /update {version=2&wt=javabin} {add=[10042 (1414006035870384128)]} 0 10
[junit4:junit4]   2> 8459 T233 C18 P55918 /update {version=2&wt=javabin} {add=[10043 (1414006035889258496)]} 0 2
[junit4:junit4]   2> 8469 T258 C16 P51456 REQ /update {update.distrib=FROMLEADER&distrib.from=http://127.0.0.1:42661/solr/collection1/&version=2&wt=javabin} status=0 QTime=1 
[junit4:junit4]   2> 8470 T248 C17 P42661 /update {version=2&wt=javabin} {add=[10043 (1414006035894501376)]} 0 7
[junit4:junit4]   2> 8539 T258 C16 P51456 REQ /update {update.distrib=FROMLEADER&distrib.from=http://127.0.0.1:42661/solr/collection1/&version=2&wt=javabin} status=0 QTime=2 
[junit4:junit4]   2> 8540 T249 C17 P42661 /update {version=2&wt=javabin} {add=[39 (1414006035871432704)]} 0 99
[junit4:junit4]   2> 8548 T232 C18 P55918 /update {version=2&wt=javabin} {add=[40 (1414006035983630336)]} 0 1
[junit4:junit4]   2> 8569 T258 C16 P51456 REQ /update {update.distrib=FROMLEADER&distrib.from=http://127.0.0.1:42661/solr/collection1/&version=2&wt=javabin} status=0 QTime=3 
[junit4:junit4]   2> 8571 T249 C17 P42661 /update {version=2&wt=javabin} {add=[40 (1414006035987824640)]} 0 19
[junit4:junit4]   2> 8576 T232 C18 P55918 /update {version=2&wt=javabin} {add=[41 (1414006036011941888)]} 0 1
[junit4:junit4]   2> 8586 T258 C16 P51456 REQ /update {update.distrib=FROMLEADER&distrib.from=http://127.0.0.1:42661/solr/collection1/&version=2&wt=javabin} status=0 QTime=1 
[junit4:junit4]   2> 8587 T249 C17 P42661 /update {version=2&wt=javabin} {add=[41 (1414006036018233344)]} 0 6
[junit4:junit4]   2> 8591 T232 C18 P55918 /update {version=2&wt=javabin} {add=[42 (1414006036027670528)]} 0 1
[junit4:junit4]   2> 8609 T258 C16 P51456 REQ /update {update.distrib=FROMLEADER&distrib.from=http://127.0.0.1:42661/solr/collection1/&version=2&wt=javabin} status=0 QTime=1 
[junit4:junit4]   2> 8612 T249 C17 P42661 /update {version=2&wt=javabin} {add=[42 (1414006036032913408)]} 0 17
[junit4:junit4]   2> 8616 T233 C18 P55918 /update {version=2&wt=javabin} {add=[10044 (1414006035906035712)]} 0 142
[junit4:junit4]   2> 8617 T232 C18 P55918 /update {version=2&wt=javabin} {add=[43 (1414006036054933504)]} 0 2
[junit4:junit4]   2> 8628 T259 C16 P51456 REQ /update {update.distrib=FROMLEADER&distrib.from=http://127.0.0.1:42661/solr/collection1/&version=2&wt=javabin} status=0 QTime=2 
[junit4:junit4]   2> 8643 T248 C17 P42661 /update {version=2&wt=javabin} {add=[43 (1414006036062273536)]} 0 21
[junit4:junit4]   2> 8647 T232 C18 P55918 /update {version=2&wt=javabin} {add=[44 (1414006036086390784)]} 0 1
[junit4:junit4]   2> 8655 T258 C16 P51456 REQ /update {update.distrib=FROMLEADER&distrib.from=http://127.0.0.1:42661/solr/collection1/&version=2&wt=javabin} status=0 QTime=30 
[junit4:junit4]   2> 8656 T249 C17 P42661 /update {version=2&wt=javabin} {add=[10044 (1414006036059127808)]} 0 36
[junit4:junit4]   2> 8664 T258 C16 P51456 REQ /update {update.distrib=FROMLEADER&distrib.from=http://127.0.0.1:42661/solr/collection1/&version=2&wt=javabin} status=0 QTime=1 
[junit4:junit4]   2> 8666 T248 C17 P42661 /update {version=2&wt=javabin} {add=[44 (1414006036096876544)]} 0 10
[junit4:junit4]   2> 8667 T232 C18 P55918 /update {version=2&wt=javabin} {add=[10045 (1414006036108410880)]} 0 0
[junit4:junit4]   2> 8672 T233 C18 P55918 /update {version=2&wt=javabin} {add=[45 (1414006036111556608)]} 0 2
[junit4:junit4]   2> 8681 T259 C16 P51456 REQ /update {update.distrib=FROMLEADER&distrib.from=http://127.0.0.1:42661/solr/collection1/&version=2&wt=javabin} status=0 QTime=1 
[junit4:junit4]   2> 8682 T249 C17 P42661 /update {version=2&wt=javabin} {add=[10045 (1414006036118896640)]} 0 5
[junit4:junit4]   2> 8683 T258 C16 P51456 REQ /update {update.distrib=FROMLEADER&distrib.from=http://127.0.0.1:42661/solr/collection1/&version=2&wt=javabin} status=0 QTime=0 
[junit4:junit4]   2> 8686 T232 C18 P55918 /update {version=2&wt=javabin} {delete=[10041 (-1414006036127285248)]} 0 1
[junit4:junit4]   2> 8686 T248 C17 P42661 /update {version=2&wt=javabin} {add=[45 (1414006036117848064)]} 0 10
[junit4:junit4]   2> 8689 T232 C18 P55918 /update {version=2&wt=javabin} {delete=[41 (-1414006036131479552)]} 0 0
[junit4:junit4]   2> 8692 T258 C16 P51456 REQ /update {update.distrib=FROMLEADER&distrib.from=http://127.0.0.1:42661/solr/collection1/&version=2&wt=javabin} status=0 QTime=0 
[junit4:junit4]   2> 8695 T249 C17 P42661 /update {version=2&wt=javabin} {delete=[10041 (-1414006036131479552)]} 0 6
[junit4:junit4]   2> 8698 T258 C16 P51456 REQ /update {update.distrib=FROMLEADER&distrib.from=http://127.0.0.1:42661/solr/collection1/&version=2&wt=javabin} status=0 QTime=1 
[junit4:junit4]   2> 8699 T248 C17 P42661 /update {version=2&wt=javabin} {delete=[41 (-1414006036135673856)]} 0 6
[junit4:junit4]   2> 8704 T233 C18 P55918 /update {version=2&wt=javabin} {add=[46 (1414006036146159616)]} 0 1
[junit4:junit4]   2> 8714 T232 C18 P55918 /update {version=2&wt=javabin} {add=[10046 (1414006036141965312)]} 0 15
[junit4:junit4]   2> 8715 T258 C16 P51456 REQ /update {update.distrib=FROMLEADER&distrib.from=http://127.0.0.1:42661/solr/collection1/&version=2&wt=javabin} status=0 QTime=1 
[junit4:junit4]   2> 8717 T248 C17 P42661 /update {version=2&wt=javabin} {add=[46 (1414006036152451072)]} 0 8
[junit4:junit4]   2> 8728 T258 C16 P51456 REQ /update {update.distrib=FROMLEADER&distrib.from=http://127.0.0.1:42661/solr/collection1/&version=2&wt=javabin} status=0 QTime=2 
[junit4:junit4]   2> 8729 T249 C17 P42661 /update {version=2&wt=javabin} {add=[10046 (1414006036161888256)]} 0 11
[junit4:junit4]   2> 8731 T232 C18 P55918 /update {version=2&wt=javabin} {add=[47 (1414006036165033984)]} 0 10
[junit4:junit4]   2> 8733 T233 C18 P55918 /update {version=2&wt=javabin} {add=[10047 (1414006036176568320)]} 0 1
[junit4:junit4]   2> 8741 T259 C16 P51456 REQ /update {update.distrib=FROMLEADER&distrib.from=http://127.0.0.1:42661/solr/collection1/&version=2&wt=javabin} status=0 QTime=1 
[junit4:junit4]   2> 8742 T248 C17 P42661 /update {version=2&wt=javabin} {add=[10047 (1414006036180762624)]} 0 6
[junit4:junit4]   2> 8743 T258 C16 P51456 REQ /update {update.distrib=FROMLEADER&distrib.from=http://127.0.0.1:42661/solr/collection1/&version=2&wt=javabin} status=0 QTime=1 
[junit4:junit4]   2> 8744 T249 C17 P42661 /update {version=2&wt=javabin} {add=[47 (1414006036179714048)]} 0 9
[junit4:junit4]   2> 8746 T233 C18 P55918 /update {version=2&wt=javabin} {add=[10048 (1414006036190199808)]} 0 1
[junit4:junit4]   2> 8748 T232 C18 P55918 /update {version=2&wt=javabin} {add=[48 (1414006036192296960)]} 0 1
[junit4:junit4]   2> 8753 T258 C16 P51456 REQ /update {update.distrib=FROMLEADER&distrib.from=http://127.0.0.1:42661/solr/collection1/&version=2&wt=javabin} status=0 QTime=0 
[junit4:junit4]   2> 8755 T249 C17 P42661 /update {version=2&wt=javabin} {add=[10048 (1414006036194394112)]} 0 6
[junit4:junit4]   2> 8764 T232 C18 P55918 /update {version=2&wt=javabin} {delete=[10042 (-1414006036204879872)]} 0 5
[junit4:junit4]   2> 8776 T258 C16 P51456 REQ /update {update.distrib=FROMLEADER&distrib.from=http://127.0.0.1:42661/solr/collection1/&version=2&wt=javabin} status=0 QTime=0 
[junit4:junit4]   2> 8779 T249 C17 P42661 /update {version=2&wt=javabin} {delete=[10042 (-1414006036216414208)]} 0 9
[junit4:junit4]   2> 8783 T232 C18 P55918 /update {version=2&wt=javabin} {add=[10049 (1414006036230045696)]} 0 1
[junit4:junit4]   2> 8796 T258 C16 P51456 REQ /update {update.distrib=FROMLEADER&distrib.from=http://127.0.0.1:42661/solr/collection1/&version=2&wt=javabin} status=0 QTime=2 
[junit4:junit4]   2> 8798 T249 C17 P42661 /update {version=2&wt=javabin} {add=[10049 (1414006036235288576)]} 0 10
[junit4:junit4]   2> 8802 T232 C18 P55918 /update {version=2&wt=javabin} {delete=[10043 (-1414006036249968640)]} 0 1
[junit4:junit4]   2> 8809 T258 C16 P51456 REQ /update {update.distrib=FROMLEADER&distrib.from=http://127.0.0.1:42661/solr/collection1/&version=2&wt=javabin} status=0 QTime=0 
[junit4:junit4]   2> 8810 T249 C17 P42661 /update {version=2&wt=javabin} {delete=[10043 (-1414006036254162944)]} 0 4
[junit4:junit4]   2> 8814 T232 C18 P55918 /update {version=2&wt=javabin} {add=[10050 (1414006036261502976)]} 0 1
[junit4:junit4]   2> 8837 T258 C16 P51456 REQ /update {update.distrib=FROMLEADER&distrib.from=http://127.0.0.1:42661/solr/collection1/&version=2&wt=javabin} status=0 QTime=1 
[junit4:junit4]   2> 8838 T249 C17 P42661 /update {version=2&wt=javabin} {add=[10050 (1414006036265697280)]} 0 21
[junit4:junit4]   2> 8841 T232 C18 P55918 /update {version=2&wt=javabin} {add=[10051 (1414006036290863104)]} 0 0
[junit4:junit4]   2> 8848 T258 C16 P51456 REQ /update {update.distrib=FROMLEADER&distrib.from=http://127.0.0.1:42661/solr/collection1/&version=2&wt=javabin} status=0 QTime=1 
[junit4:junit4]   2> 8849 T249 C17 P42661 /update {version=2&wt=javabin} {add=[10051 (1414006036294008832)]} 0 5
[junit4:junit4]   2> 8852 T232 C18 P55918 /update {version=2&wt=javabin} {add=[10052 (1414006036301348864)]} 0 1
[junit4:junit4]   2> 8858 T258 C16 P51456 REQ /update {update.distrib=FROMLEADER&distrib.from=http://127.0.0.1:42661/solr/collection1/&version=2&wt=javabin} status=0 QTime=0 
[junit4:junit4]   2> 8859 T249 C17 P42661 /update {version=2&wt=javabin} {add=[10052 (1414006036305543168)]} 0 4
[junit4:junit4]   2> 8862 T232 C18 P55918 /update {version=2&wt=javabin} {delete=[10044 (-1414006036312883200)]} 0 0
[junit4:junit4]   2> 8863 T259 C16 P51456 REQ /update {update.distrib=FROMLEADER&distrib.from=http://127.0.0.1:42661/solr/collection1/&version=2&wt=javabin} status=0 QTime=108 
[junit4:junit4]   2> 8864 T248 C17 P42661 /update {version=2&wt=javabin} {add=[48 (1414006036196491264)]} 0 113
[junit4:junit4]   2> 8867 T232 C18 P55918 /update {version=2&wt=javabin} {delete=[42 (-1414006036318126080)]} 0 0
[junit4:junit4]   2> 8868 T259 C16 P51456 REQ /update {update.distrib=FROMLEADER&distrib.from=http://127.0.0.1:42661/solr/collection1/&version=2&wt=javabin} status=0 QTime=0 
[junit4:junit4]   2> 8869 T249 C17 P42661 /update {version=2&wt=javabin} {delete=[10044 (-1414006036317077504)]} 0 4
[junit4:junit4]   2> 8873 T259 C16 P51456 REQ /update {update.distrib=FROMLEADER&distrib.from=http://127.0.0.1:42661/solr/collection1/&version=2&wt=javabin} status=0 QTime=0 
[junit4:junit4]   2> 8874 T232 C18 P55918 /update {version=2&wt=javabin} {add=[10053 (1414006036324417536)]} 0 1
[junit4:junit4]   2> 8874 T248 C17 P42661 /update {version=2&wt=javabin} {delete=[42 (-1414006036321271808)]} 0 4
[junit4:junit4]   2> 8878 T232 C18 P55918 /update {version=2&wt=javabin} {add=[49 (1414006036328611840)]} 0 1
[junit4:junit4]   2> 8883 T259 C16 P51456 REQ /update {update.distrib=FROMLEADER&distrib.from=http://127.0.0.1:42661/solr/collection1/&version=2&wt=javabin} status=0 QTime=1 
[junit4:junit4]   2> 8885 T258 C16 P51456 REQ /update {update.distrib=FROMLEADER&distrib.from=http://127.0.0.1:42661/solr/collection1/&version=2&wt=javabin} status=0 QTime=1 
[junit4:junit4]   2> 8886 T248 C17 P42661 /update {version=2&wt=javabin} {add=[49 (1414006036332806144)]} 0 5
[junit4:junit4]   2> 8886 T249 C17 P42661 /update {version=2&wt=javabin} {add=[10053 (1414006036328611840)]} 0 9
[junit4:junit4]   2> 8889 T232 C18 P55918 /update {version=2&wt=javabin} {delete=[43 (-1414006036341194752)]} 0 0
[junit4:junit4]   2> 8891 T233 C18 P55918 /update {version=2&wt=javabin} {add=[10054 (1414006036342243328)]} 0 2
[junit4:junit4]   2> 8895 T258 C16 P51456 REQ /update {update.distrib=FROMLEADER&distrib.from=http://127.0.0.1:42661/solr/collection1/&version=2&wt=javabin} status=0 QTime=0 
[junit4:junit4]   2> 8896 T249 C17 P42661 /update {version=2&wt=javabin} {delete=[43 (-1414006036345389056)]} 0 4
[junit4:junit4]   2> 8901 T233 C18 P55918 /update {version=2&wt=javabin} {add=[50 (1414006036352729088)]} 0 1
[junit4:junit4]   2> 8908 T258 C16 P51456 REQ /update {update.distrib=FROMLEADER&distrib.from=http://127.0.0.1:42661/solr/collection1/&version=2&wt=javabin} status=0 QTime=1 
[junit4:junit4]   2> 8910 T249 C17 P42661 /update {version=2&wt=javabin} {add=[50 (1414006036356923392)]} 0 6
[junit4:junit4]   2> 8914 T258 C16 P51456 REQ /update {update.distrib=FROMLEADER&distrib.from=http://127.0.0.1:42661/solr/collection1/&version=2&wt=javabin} status=0 QTime=1 
[junit4:junit4]   2> 8914 T233 C18 P55918 /update {version=2&wt=javabin} {add=[51 (1414006036366360576)]} 0 1
[junit4:junit4]   2> 8915 T248 C17 P42661 /update {version=2&wt=javabin} {add=[10054 (1414006036346437632)]} 0 21
[junit4:junit4]   2> 8919 T233 C18 P55918 /update {version=2&wt=javabin} {delete=[10048 (-1414006036372652032)]} 0 0
[junit4:junit4]   2> 8924 T258 C16 P51456 REQ /update {update.distrib=FROMLEADER&distrib.from=http://127.0.0.1:42661/solr/collection1/&version=2&wt=javabin} status=0 QTime=2 
[junit4:junit4]   2> 8926 T259 C16 P51456 REQ /update {update.distrib=FROMLEADER&distrib.from=http://127.0.0.1:42661/solr/collection1/&version=2&wt=javabin} status=0 QTime=0 
[junit4:junit4]   2> 8926 T249 C17 P42661 /update {version=2&wt=javabin} {add=[51 (1414006036370554880)]} 0 9
[junit4:junit4]   2> 8927 T248 C17 P42661 /update {version=2&wt=javabin} {delete=[10048 (-1414006036375797760)]} 0 5
[junit4:junit4]   2> 8931 T233 C18 P55918 /update {version=2&wt=javabin} {add=[52 (1414006036384186368)]} 0 1
[junit4:junit4]   2> 8931 T232 C18 P55918 /update {version=2&wt=javabin} {add=[10055 (1414006036384186369)]} 0 1
[junit4:junit4]   2> 8941 T258 C16 P51456 REQ /update {update.distrib=FROMLEADER&distrib.from=http://127.0.0.1:42661/solr/collection1/&version=2&wt=javabin} status=0 QTime=2 
[junit4:junit4]   2> 8944 T248 C17 P42661 /update {version=2&wt=javabin} {add=[52 (1414006036388380673)]} 0 10
[junit4:junit4]   2> 8952 T232 C18 P55918 /update {version=2&wt=javabin} {delete=[44 (-1414006036407255040)]} 0 1
[junit4:junit4]   2> 8960 T258 C16 P51456 REQ /update {update.distrib=FROMLEADER&distrib.from=http://127.0.0.1:42661/solr/collection1/&version=2&wt=javabin} status=0 QTime=0 
[junit4:junit4]   2> 8961 T248 C17 P42661 /update {version=2&wt=javabin} {delete=[44 (-1414006036411449344)]} 0 5
[junit4:junit4]   2> 8979 T232 C18 P55918 /update {version=2&wt=javabin} {add=[53 (1414006036420886528)]} 0 14
[junit4:junit4]   2> 8987 T259 C16 P51456 REQ /update {update.distrib=FROMLEADER&distrib.from=http://127.0.0.1:42661/solr/collection1/&version=2&wt=javabin} status=0 QTime=48 
[junit4:junit4]   2> 8987 T258 C16 P51456 REQ /update {update.distrib=FROMLEADER&distrib.from=http://127.0.0.1:42661/solr/collection1/&version=2&wt=javabin} status=0 QTime=1 
[junit4:junit4]   2> 8988 T249 C17 P42661 /update {version=2&wt=javabin} {add=[10055 (1414006036388380672)]} 0 54
[junit4:junit4]   2> 8988 T248 C17 P42661 /update {version=2&wt=javabin} {add=[53 (1414006036439760896)]} 0 5
[junit4:junit4]   2> 8993 T233 C18 P55918 /update {version=2&wt=javabin} {add=[54 (1414006036449198080)]} 0 1
[junit4:junit4]   2> 8995 T232 C18 P55918 /update {version=2&wt=javabin} {delete=[10049 (-1414006036451295232)]} 0 1
[junit4:junit4]   2> 9000 T259 C16 P51456 REQ /update {update.distrib=FROMLEADER&distrib.from=http://127.0.0.1:42661/solr/collection1/&version=2&wt=javabin} status=0 QTime=0 
[junit4:junit4]   2> 9000 T258 C16 P51456 REQ /update {update.distrib=FROMLEADER&distrib.from=http://127.0.0.1:42661/solr/collection1/&version=2&wt=javabin} status=0 QTime=1 
[junit4:junit4]   2> 9001 T249 C17 P42661 /update {version=2&wt=javabin} {delete=[10049 (-1414006036455489536)]} 0 4
[junit4:junit4]   2> 9001 T248 C17 P42661 /update {version=2&wt=javabin} {add=[54 (1414006036453392384)]} 0 5
[junit4:junit4]   2> 9004 T233 C18 P55918 /update {version=2&wt=javabin} {delete=[48 (-1414006036461780993)]} 0 0
[junit4:junit4]   2> 9006 T232 C18 P55918 /update {version=2&wt=javabin} {add=[10056 (1414006036461780992)]} 0 2
[junit4:junit4]   2> 9009 T258 C16 P51456 REQ /update {update.distrib=FROMLEADER&distrib.from=http://127.0.0.1:42661/solr/collection1/&version=2&wt=javabin} status=0 QTime=0 
[junit4:junit4]   2> 9010 T248 C17 P42661 /update {version=2&wt=javabin} {delete=[48 (-1414006036464926720)]} 0 3
[junit4:junit4]   2> 9012 T259 C16 P51456 REQ /update {update.distrib=FROMLEADER&distrib.from=http://127.0.0.1:42661/solr/collection1/&version=2&wt=javabin} status=0 QTime=1 
[junit4:junit4]   2> 9012 T249 C17 P42661 /update {version=2&wt=javabin} {add=[10056 (1414006036465975296)]} 0 4
[junit4:junit4]   2> 9014 T232 C18 P55918 /update {version=2&wt=javabin} {add=[55 (1414006036471218176)]} 0 1
[junit4:junit4]   2> 9022 T259 C16 P51456 REQ /update {update.distrib=FROMLEADER&distrib.from=http://127.0.0.1:42661/solr/collection1/&version=2&wt=javabin} status=0 QTime=1 
[junit4:junit4]   2> 9024 T249 C17 P42661 /update {version=2&wt=javabin} {add=[55 (1414006036475412480)]} 0 7
[junit4:junit4]   2> 9027 T232 C18 P55918 /update {version=2&wt=javabin} {delete=[49 (-1414006036485898240)]} 0 0
[junit4:junit4]   2> 9030 T233 C18 P55918 /update {version=2&wt=javabin} {add=[10057 (1414006036475412480)]} 0 14
[junit4:junit4]   2> 9033 T259 C16 P51456 REQ /update {update.distrib=FROMLEADER&distrib.from=http://127.0.0.1:42661/solr/collection1/&version=2&wt=javabin} status=0 QTime=1 
[junit4:junit4]   2> 9034 T249 C17 P42661 /update {version=2&wt=javabin} {delete=[49 (-1414006036489043968)]} 0 4
[junit4:junit4]   2> 9037 T259 C16 P51456 REQ /update {update.distrib=FROMLEADER&distrib.from=http://127.0.0.1:42661/solr/collection1/&version=2&wt=javabin} status=0 QTime=1 
[junit4:junit4]   2> 9038 T233 C18 P55918 /update {version=2&wt=javabin} {add=[56 (1414006036496384000)]} 0 2
[junit4:junit4]   2> 9038 T248 C17 P42661 /update {version=2&wt=javabin} {add=[10057 (1414006036492189696)]} 0 5
[junit4:junit4]   2> 9042 T233 C18 P55918 /update {version=2&wt=javabin} {delete=[10050 (-1414006036501626880)]} 0 0
[junit4:junit4]   2> 9046 T259 C16 P51456 REQ /update {update.distrib=FROMLEADER&distrib.from=http://127.0.0.1:42661/solr/collection1/&version=2&wt=javabin} status=0 QTime=1 
[junit4:junit4]   2> 9048 T258 C16 P51456 REQ /update {update.distrib=FROMLEADER&distrib.from=http://127.0.0.1:42661/solr/collection1/&version=2&wt=javabin} status=0 QTime=0 
[junit4:junit4]   2> 9049 T248 C17 P42661 /update {version=2&wt=javabin} {add=[56 (1414006036501626880)]} 0 7
[junit4:junit4]   2> 9049 T249 C17 P42661 /update {version=2&wt=javabin} {delete=[10050 (-1414006036504772608)]} 0 4
[junit4:junit4]   2> 9052 T232 C18 P55918 /update {version=2&wt=javabin} {add=[10058 (1414006036512112640)]} 0 0
[junit4:junit4]   2> 9052 T233 C18 P55918 /update {version=2&wt=javabin} {add=[57 (1414006036512112641)]} 0 0
[junit4:junit4]   2> 9058 T258 C16 P51456 REQ /update {update.distrib=FROMLEADER&distrib.from=http://127.0.0.1:42661/solr/collection1/&version=2&wt=javabin} status=0 QTime=1 
[junit4:junit4]   2> 9059 T259 C16 P51456 REQ /update {update.distrib=FROMLEADER&distrib.from=http://127.0.0.1:42661/solr/collection1/&version=2&wt=javabin} status=0 QTime=1 
[junit4:junit4]   2> 9060 T249 C17 P42661 /update {version=2&wt=javabin} {add=[10058 (1414006036515258368)]} 0 5
[junit4:junit4]   2> 9060 T248 C17 P42661 /update {version=2&wt=javabin} {add=[57 (1414006036515258369)]} 0 5
[junit4:junit4]   2> 9063 T232 C18 P55918 /update {version=2&wt=javabin} {delete=[50 (-1414006036523646977)]} 0 0
[junit4:junit4]   2> 9063 T233 C18 P55918 /update {version=2&wt=javabin} {add=[10059 (1414006036523646976)]} 0 1
[junit4:junit4]   2> 9068 T259 C16 P51456 REQ /update {update.distrib=FROMLEADER&distrib.from=http://127.0.0.1:42661/solr/collection1/&version=2&wt=javabin} status=0 QTime=0 
[junit4:junit4]   2> 9070 T248 C17 P42661 /update {version=2&wt=javabin} {delete=[50 (-1414006036526792704)]} 0 4
[junit4:junit4]   2> 9074 T233 C18 P55918 /update {version=2&wt=javabin} {add=[58 (1414006036534132736)]} 0 1
[junit4:junit4]   2> 9081 T258 C16 P51456 REQ /update {update.distrib=FROMLEADER&distrib.from=http://127.0.0.1:42661/solr/collection1/&version=2&wt=javabin} status=0 QTime=2 
[junit4:junit4]   2> 9082 T248 C17 P42661 /update {version=2&wt=javabin} {add=[58 (1414006036538327040)]} 0 5
[junit4:junit4]   2> 9086 T233 C18 P55918 /update {version=2&wt=javabin} {add=[59 (1414006036547764224)]} 0 1
[junit4:junit4]   2> 9087 T259 C16 P51456 REQ /update {update.distrib=FROMLEADER&distrib.from=http://127.0.0.1:42661/solr/collection1/&version=2&wt=javabin} status=0 QTime=10 
[junit4:junit4]   2> 9088 T249 C17 P42661 /update {version=2&wt=javabin} {add=[10059 (1414006036526792705)]} 0 22
[junit4:junit4]   2> 9091 T233 C18 P55918 /update {version=2&wt=javabin} {delete=[10054 (-1414006036553007104)]} 0 1
[junit4:junit4]   2> 9093 T259 C16 P51456 REQ /update {update.distrib=FROMLEADER&distrib.from=http://127.0.0.1:42661/solr/collection1/&version=2&wt=javabin} status=0 QTime=1 
[junit4:junit4]   2> 9094 T248 C17 P42661 /update {version=2&wt=javabin} {add=[59 (1414006036551958528)]} 0 5
[junit4:junit4]   2> 9096 T259 C16 P51456 REQ /update {update.distrib=FROMLEADER&distrib.from=http://127.0.0.1:42661/solr/collection1/&version=2&wt=javabin} status=0 QTime=0 
[junit4:junit4]   2> 9097 T249 C17 P42661 /update {version=2&wt=javabin} {delete=[10054 (-1414006036556152832)]} 0 3
[junit4:junit4]   2> 9097 T233 C18 P55918 /update {version=2&wt=javabin} {delete=[54 (-1414006036559298560)]} 0 0
[junit4:junit4]   2> 9100 T232 C18 P55918 /update {version=2&wt=javabin} {add=[10060 (1414006036561395712)]} 0 1
[junit4:junit4]   2> 9104 T259 C16 P51456 REQ /update {update.distrib=FROMLEADER&distrib.from=http://127.0.0.1:42661/solr/collection1/&version=2&wt=javabin} status=0 QTime=0 
[junit4:junit4]   2> 9105 T249 C17 P42661 /update {version=2&wt=javabin} {delete=[54 (-1414006036563492864)]} 0 4
[junit4:junit4]   2> 9107 T258 C16 P51456 REQ /update {update.distrib=FROMLEADER&distrib.from=http://127.0.0.1:42661/solr/collection1/&version=2&wt=javabin} status=0 QTime=1 
[junit4:junit4]   2> 9107 T248 C17 P42661 /update {version=2&wt=javabin} {add=[10060 (1414006036565590016)]} 0 5
[junit4:junit4]   2> 9109 T232 C18 P55918 /update {version=2&wt=javabin} {add=[60 (1414006036570832896)]} 0 1
[junit4:junit4]   2> 9113 T233 C18 P55918 /update {version=2&wt=javabin} {add=[10061 (1414006036575027200)]} 0 1
[junit4:junit4]   2> 9122 T258 C16 P51456 REQ /update {update.distrib=FROMLEADER&distrib.from=http://127.0.0.1:42661/solr/collection1/&version=2&wt=javabin} status=0 QTime=1 
[junit4:junit4]   2> 9123 T249 C17 P42661 /update {version=2&wt=javabin} {add=[10061 (1414006036579221504)]} 0 7
[junit4:junit4]   2> 9126 T259 C16 P51456 REQ /update {update.distrib=FROMLEADER&distrib.from=http://127.0.0.1:42661/solr/collection1/&version=2&wt=javabin} status=0 QTime=1 
[junit4:junit4]   2> 9126 T233 C18 P55918 /update {version=2&wt=javabin} {delete=[10056 (-1414006036589707264)]} 0 0
[junit4:junit4]   2> 9127 T248 C17 P42661 /update {version=2&wt=javabin} {add=[60 (1414006036575027200)]} 0 15
[junit4:junit4]   2> 9130 T233 C18 P55918 /update {version=2&wt=javabin} {add=[61 (1414006036592852992)]} 0 1
[junit4:junit4]   2> 9132 T259 C16 P51456 REQ /update {update.distrib=FROMLEADER&distrib.from=http://127.0.0.1:42661/solr/collection1/&version=2&wt=javabin} status=0 QTime=1 
[junit4:junit4]   2> 9133 T248 C17 P42661 /update {version=2&wt=javabin} {delete=[10056 (-1414006036592852992)]} 0 4
[junit4:junit4]   2> 9136 T233 C18 P55918 /update {version=2&wt=javabin} {add=[10062 (1414006036599144448)]} 0 1
[junit4:junit4]   2> 9136 T259 C16 P51456 REQ /update {update.distrib=FROMLEADER&distrib.from=http://127.0.0.1:42661/solr/collection1/&version=2&wt=javabin} status=0 QTime=0 
[junit4:junit4]   2> 9137 T249 C17 P42661 /update {version=2&wt=javabin} {add=[61 (1414006036597047296)]} 0 4
[junit4:junit4]   2> 9140 T233 C18 P55918 /update {version=2&wt=javabin} {delete=[56 (-1414006036604387328)]} 0 0
[junit4:junit4]   2> 9144 T259 C16 P51456 REQ /update {update.distrib=FROMLEADER&distrib.from=http://127.0.0.1:42661/solr/collection1/&version=2&wt=javabin} status=0 QTime=1 
[junit4:junit4]   2> 9145 T248 C17 P42661 /update {version=2&wt=javabin} {add=[10062 (1414006036602290176)]} 0 7
[junit4:junit4]   2> 9145 T258 C16 P51456 REQ /update {update.distrib=FROMLEADER&distrib.from=http://127.0.0.1:42661/solr/collection1/&version=2&wt=javabin} status=0 QTime=0 
[junit4:junit4]   2> 9146 T249 C17 P42661 /update {version=2&wt=javabin} {delete=[56 (-1414006036607533056)]} 0 3
[junit4:junit4]   2> 9148 T233 C18 P55918 /update {version=2&wt=javabin} {delete=[10057 (-1414006036611727360)]} 0 1
[junit4:junit4]   2> 9149 T232 C18 P55918 /update {version=2&wt=javabin} {add=[62 (1414006036613824512)]} 0 0
[junit4:junit4]   2> 9153 T258 C16 P51456 REQ /update {update.distrib=FROMLEADER&distrib.from=http://127.0.0.1:42661/solr/collection1/&version=2&wt=javabin} status=0 QTime=1 
[junit4:junit4]   2> 9153 T249 C17 P42661 /update {version=2&wt=javabin} {delete=[10057 (-1414006036614873088)]} 0 3
[junit4:junit4]   2> 9157 T258 C16 P51456 REQ /update {update.distrib=FROMLEADER&distrib.from=http://127.0.0.1:42661/solr/collection1/&version=2&wt=javabin} status=0 QTime=1 
[junit4:junit4]   2> 9157 T248 C17 P42661 /update {version=2&wt=javabin} {add=[62 (1414006036616970240)]} 0 5
[junit4:junit4]   2> 9158 T232 C18 P55918 /update {version=2&wt=javabin} {add=[10063 (1414006036623261696)]} 0 1
[junit4:junit4]   2> 9160 T233 C18 P55918 /update {version=2&wt=javabin} {delete=[57 (-1414006036625358848)]} 0 0
[junit4:junit4]   2> 9165 T258 C16 P51456 REQ /update {update.distrib=FROMLEADER&distrib.from=http://127.0.0.1:42661/solr/collection1/&version=2&wt=javabin} status=0 QTime=1 
[junit4:junit4]   2> 9166 T248 C17 P42661 /update {version=2&wt=javabin} {add=[10063 (1414006036626407424)]} 0 5
[junit4:junit4]   2> 9170 T233 C18 P55918 /update {version=2&wt=javabin} {add=[10064 (1414006036634796032)]} 0 1
[junit4:junit4]   2> 9172 T259 C16 P51456 REQ /update {update.distrib=FROMLEADER&distrib.from=http://127.0.0.1:42661/solr/collection1/&version=2&wt=javabin} status=0 QTime=1 
[junit4:junit4]   2> 9174 T249 C17 P42661 /update {version=2&wt=javabin} {delete=[57 (-1414006036628504576)]} 0 11
[junit4:junit4]   2> 9190 T259 C16 P51456 REQ /update {update.distrib=FROMLEADER&distrib.from=http://127.0.0.1:42661/solr/collection1/&version=2&wt=javabin} status=0 QTime=12 
[junit4:junit4]   2> 9191 T248 C17 P42661 /update {version=2&wt=javabin} {add=[10064 (1414006036638990336)]} 0 18
[junit4:junit4]   2> 9194 T232 C18 P55918 /update {version=2&wt=javabin} {delete=[10059 (-1414006036661010432)]} 0 0
[junit4:junit4]   2> 9196 T233 C18 P55918 /update {version=2&wt=javabin} {add=[63 (1414006036646330368)]} 0 16
[junit4:junit4]   2> 9200 T259 C16 P51456 REQ /update {update.distrib=FROMLEADER&distrib.from=http://127.0.0.1:42661/solr/collection1/&version=2&wt=javabin} status=0 QTime=0 
[junit4:junit4]   2> 9203 T258 C16 P51456 REQ /update {update.distrib=FROMLEADER&distrib.from=http://127.0.0.1:42661/solr/collection1/&version=2&wt=javabin} status=0 QTime=1 
[junit4:junit4]   2> 9204 T248 C17 P42661 /update {version=2&wt=javabin} {delete=[10059 (-1414006036665204736)]} 0 7
[junit4:junit4]   2> 9204 T249 C17 P42661 /update {version=2&wt=javabin} {add=[63 (1414006036666253312)]} 0 5
[junit4:junit4]   2> 9208 T232 C18 P55918 /update {version=2&wt=javabin} {add=[64 (1414006036674641921)]} 0 1
[junit4:junit4]   2> 9209 T233 C18 P55918 /update {version=2&wt=javabin} {add=[10065 (1414006036674641920)]} 0 2
[junit4:junit4]   2> 9215 T258 C16 P51456 REQ /update {update.distrib=FROMLEADER&distrib.from=http://127.0.0.1:42661/solr/collection1/&version=2&wt=javabin} status=0 QTime=1 
[junit4:junit4]   2> 9216 T249 C17 P42661 /update {version=2&wt=javabin} {add=[64 (1414006036678836224)]} 0 5
[junit4:junit4]   2> 9219 T258 C16 P51456 REQ /update {update.distrib=FROMLEADER&distrib.from=http://127.0.0.1:42661/solr/collection1/&version=2&wt=javabin} status=0 QTime=1 
[junit4:junit4]   2> 9221 T248 C17 P42661 /update {version=2&wt=javabin} {add=[10065 (1414006036679884800)]} 0 9
[junit4:junit4]   2> 9221 T233 C18 P55918 /update {version=2&wt=javabin} {delete=[59 (-1414006036689321984)]} 0 1
[junit4:junit4]   2> 9224 T232 C18 P55918 /update {version=2&wt=javabin} {add=[10066 (1414006036691419136)]} 0 1
[junit4:junit4]   2> 9226 T258 C16 P51456 REQ /update {update.distrib=FROMLEADER&distrib.from=http://127.0.0.1:42661/solr/collection1/&version=2&wt=javabin} status=0 QTime=0 
[junit4:junit4]   2> 9227 T248 C17 P42661 /update {version=2&wt=javabin} {delete=[59 (-1414006036692467712)]} 0 3
[junit4:junit4]   2> 9231 T258 C16 P51456 REQ /update {update.distrib=FROMLEADER&distrib.from=http://127.0.0.1:42661/solr/collection1/&version=2&wt=javabin} status=0 QTime=1 
[junit4:junit4]   2> 9232 T249 C17 P42661 /update {version=2&wt=javabin} {add=[10066 (1414006036695613440)]} 0 5
[junit4:junit4]   2> 9236 T233 C18 P55918 /update {version=2&wt=javabin} {add=[10067 (1414006036704002048)]} 0 1
[junit4:junit4]   2> 9238 T232 C18 P55918 /update {version=2&wt=javabin} {add=[65 (1414006036697710592)]} 0 9
[junit4:junit4]   2> 9244 T258 C16 P51456 REQ /update {update.distrib=FROMLEADER&distrib.from=http://127.0.0.1:42661/solr/collection1/&version=2&wt=javabin} status=0 QTime=1 
[junit4:junit4]   2> 9245 T249 C17 P42661 /update {version=2&wt=javabin} {add=[10067 (1414006036709244928)]} 0 5
[junit4:junit4]   2> 9247 T259 C16 P51456 REQ /update {update.distrib=FROMLEADER&distrib.from=http://127.0.0.1:42661/solr/collection1/&version=2&wt=javabin} status=0 QTime=4 
[junit4:junit4]   2> 9250 T232 C18 P55918 /update {version=2&wt=javabin} {add=[10068 (1414006036717633536)]} 0 2
[junit4:junit4]   2> 9251 T248 C17 P42661 /update {version=2&wt=javabin} {add=[65 (1414006036710293504)]} 0 10
[junit4:junit4]   2> 9254 T232 C18 P55918 /update {version=2&wt=javabin} {add=[66 (1414006036723924992)]} 0 1
[junit4:junit4]   2> 9258 T259 C16 P51456 REQ /update {update.distrib=FROMLEADER&distrib.from=http://127.0.0.1:42661/solr/collection1/&version=2&wt=javabin} status=0 QTime=1 
[junit4:junit4]   2> 9258 T249 C17 P42661 /update {version=2&wt=javabin} {add=[10068 (1414006036722876416)]} 0 5
[junit4:junit4]   2> 9261 T259 C16 P51456 REQ /update {update.distrib=FROMLEADER&distrib.from=http://127.0.0.1:42661/solr/collection1/&version=2&wt=javabin} status=0 QTime=1 
[junit4:junit4]   2> 9262 T232 C18 P55918 /update {version=2&wt=javabin} {add=[10069 (1414006036731265024)]} 0 1
[junit4:junit4]   2> 9262 T248 C17 P42661 /update {version=2&wt=javabin} {add=[66 (1414006036727070720)]} 0 5
[junit4:junit4]   2> 9265 T232 C18 P55918 /update {version=2&wt=javabin} {add=[67 (1414006036735459328)]} 0 0
[junit4:junit4]   2> 9269 T259 C16 P51456 REQ /update {update.distrib=FROMLEADER&distrib.from=http://127.0.0.1:42661/solr/collection1/&version=2&wt=javabin} status=0 QTime=1 
[junit4:junit4]   2> 9270 T249 C17 P42661 /update {version=2&wt=javabin} {add=[10069 (1414006036735459328)]} 0 5
[junit4:junit4]   2> 9274 T232 C18 P55918 /update {version=2&wt=javabin} {add=[10070 (1414006036743847936)]} 0 1
[junit4:junit4]   2> 9281 T258 C16 P51456 REQ /update {update.distrib=FROMLEADER&distrib.from=http://127.0.0.1:42661/solr/collection1/&version=2&wt=javabin} status=0 QTime=10 
[junit4:junit4]   2> 9281 T259 C16 P51456 REQ /update {update.distrib=FROMLEADER&distrib.from=http://127.0.0.1:42661/solr/collection1/&version=2&wt=javabin} status=0 QTime=1 
[junit4:junit4]   2> 9282 T248 C17 P42661 /update {version=2&wt=javabin} {add=[67 (1414006036739653632)]} 0 14
[junit4:junit4]   2> 9283 T249 C17 P42661 /update {version=2&wt=javabin} {add=[10070 (1414006036748042240)]} 0 6
[junit4:junit4]   2> 9286 T232 C18 P55918 /update {version=2&wt=javabin} {add=[68 (1414006036756430848)]} 0 1
[junit4:junit4]   2> 9286 T233 C18 P55918 /update {version=2&wt=javabin} {add=[10071 (1414006036756430849)]} 0 1
[junit4:junit4]   2> 9297 T259 C16 P51456 REQ /update {update.distrib=FROMLEADER&distrib.from=http://127.0.0.1:42661/solr/collection1/&version=2&wt=javabin} status=0 QTime=2 
[junit4:junit4]   2> 9299 T248 C17 P42661 /update {version=2&wt=javabin} {add=[10071 (1414006036761673728)]} 0 10
[junit4:junit4]   2> 9302 T233 C18 P55918 /update {version=2&wt=javabin} {delete=[10060 (-1414006036774256640)]} 0 0
[junit4:junit4]   2> 9307 T259 C16 P51456 REQ /update {update.distrib=FROMLEADER&distrib.from=http://127.0.0.1:42661/solr/collection1/&version=2&wt=javabin} status=0 QTime=2 
[junit4:junit4]   2> 9308 T249 C17 P42661 /update {version=2&wt=javabin} {add=[68 (1414006036760625152)]} 0 19
[junit4:junit4]   2> 9309 T258 C16 P51456 REQ /update {update.distrib=FROMLEADER&distrib.from=http://127.0.0.1:42661/solr/collection1/&version=2&wt=javabin} status=0 QTime=0 
[junit4:junit4]   2> 9312 T248 C17 P42661 /update {version=2&wt=javabin} {delete=[10060 (-1414006036778450944)]} 0 6
[junit4:junit4]   2> 9312 T233 C18 P55918 /update {version=2&wt=javabin} {add=[69 (1414006036783693824)]} 0 1
[junit4:junit4]   2> 9318 T233 C18 P55918 /update {version=2&wt=javabin} {add=[10072 (1414006036791033856)]} 0 1
[junit4:junit4]   2> 9335 T258 C16 P51456 REQ /update {update.distrib=FROMLEADER&distrib.from=http://127.0.0.1:42661/solr/collection1/&version=2&wt=javabin} status=0 QTime=3 
[junit4:junit4]   2> 9336 T248 C17 P42661 /update {version=2&wt=javabin} {add=[69 (1414006036787888128)]} 0 21
[junit4:junit4]   2> 9340 T233 C18 P55918 /update {version=2&wt=javabin} {add=[70 (1414006036813053952)]} 0 1
[junit4:junit4]   2> 9340 T258 C16 P51456 REQ /update {update.distrib=FROMLEADER&distrib.from=http://127.0.0.1:42661/solr/collection1/&version=2&wt=javabin} status=0 QTime=1 
[junit4:junit4]   2> 9341 T249 C17 P42661 /update {version=2&wt=javabin} {add=[10072 (1414006036804665344)]} 0 19
[junit4:junit4]   2> 9345 T233 C18 P55918 /update {version=2&wt=javabin} {delete=[10062 (-1414006036818296832)]} 0 1
[junit4:junit4]   2> 9350 T258 C16 P51456 REQ /update {update.distrib=FROMLEADER&distrib.from=http://127.0.0.1:42661/solr/collection1/&version=2&wt=javabin} status=0 QTime=1 
[junit4:junit4]   2> 9352 T248 C17 P42661 /update {version=2&wt=javabin} {add=[70 (1414006036817248256)]} 0 9
[junit4:junit4]   2> 9370 T233 C18 P55918 /update {version=2&wt=javabin} {add=[71 (1414006036845559808)]} 0 1
[junit4:junit4]   2> 9372 T259 C16 P51456 REQ /update {update.distrib=FROMLEADER&distrib.from=http://127.0.0.1:42661/solr/collection1/&version=2&wt=javabin} status=0 QTime=19 
[junit4:junit4]   2> 9373 T249 C17 P42661 /update {version=2&wt=javabin} {delete=[10062 (-1414006036823539712)]} 0 23
[junit4:junit4]   2> 9376 T233 C18 P55918 /update {version=2&wt=javabin} {add=[10073 (1414006036850802688)]} 0 1
[junit4:junit4]   2> 9378 T259 C16 P51456 REQ /update {update.distrib=FROMLEADER&distrib.from=http://127.0.0.1:42661/solr/collection1/&version=2&wt=javabin} status=0 QTime=1 
[junit4:junit4]   2> 9379 T248 C17 P42661 /update {version=2&wt=javabin} {add=[71 (1414006036850802688)]} 0 4
[junit4:junit4]   2> 9382 T259 C16 P51456 REQ /update {update.distrib=FROMLEADER&distrib.from=http://127.0.0.1:42661/solr/collection1/&version=2&wt=javabin} status=0 QTime=1 
[junit4:junit4]   2> 9382 T249 C17 P42661 /update {version=2&wt=javabin} {add=[10073 (1414006036854996992)]} 0 4
[junit4:junit4]   2> 9383 T233 C18 P55918 /update {version=2&wt=javabin} {delete=[60 (-1414006036859191296)]} 0 1
[junit4:junit4]   2> 9385 T232 C18 P55918 /update {version=2&wt=javabin} {delete=[10063 (-1414006036861288448)]} 0 0
[junit4:junit4]   2> 9388 T259 C16 P51456 REQ /update {update.distrib=FROMLEADER&distrib.from=http://127.0.0.1:42661/solr/collection1/&version=2&wt=javabin} status=0 QTime=1 
[junit4:junit4]   2> 9388 T249 C17 P42661 /update {version=2&wt=javabin} {delete=[60 (-1414006036861288448)]} 0 3
[junit4:junit4]   2> 9390 T258 C16 P51456 REQ /update {update.distrib=FROMLEADER&distrib.from=http://127.0.0.1:42661/solr/collection1/&version=2&wt=javabin} status=0 QTime=0 
[junit4:junit4]   2> 9391 T248 C17 P42661 /update {version=2&wt=javabin} {delete=[10063 (-1414006036864434176)]} 0 3
[junit4:junit4]   2> 9392 T232 C18 P55918 /update {version=2&wt=javabin} {add=[72 (1414006036867579904)]} 0 1
[junit4:junit4]   2> 9394 T233 C18 P55918 /update {version=2&wt=javabin} {add=[10074 (1414006036870725632)]} 0 1
[junit4:junit4]   2> 9397 T258 C16 P51456 REQ /update {update.distrib=FROMLEADER&distrib.from=http://127.0.0.1:42661/solr/collection1/&version=2&wt=javabin} status=0 QTime=0 
[junit4:junit4]   2> 9398 T248 C17 P42661 /update {version=2&wt=javabin} {add=[72 (1414006036870725632)]} 0 4
[junit4:junit4]   2> 9401 T233 C18 P55918 /update {version=2&wt=javabin} {delete=[62 (-1414006036878065664)]} 0 1
[junit4:junit4]   2> 9406 T258 C16 P51456 REQ /update {update.distrib=FROMLEADER&distrib.from=http://127.0.0.1:42661/solr/collection1/&version=2&wt=javabin} status=0 QTime=0 
[junit4:junit4]   2> 9407 T248 C17 P42661 /update {version=2&wt=javabin} {delete=[62 (-1414006036881211392)]} 0 3
[junit4:junit4]   2> 9409 T259 C16 P51456 REQ /update {update.distrib=FROMLEADER&distrib.from=http://127.0.0.1:42661/solr/collection1/&version=2&wt=javabin} status=0 QTime=10 
[junit4:junit4]   2> 9410 T249 C17 P42661 /update {version=2&wt=javabin} {add=[10074 (1414006036872822784)]} 0 14
[junit4:junit4]   2> 9413 T232 C18 P55918 /update {version=2&wt=javabin} {delete=[10064 (-1414006036890648576)]} 0 1
[junit4:junit4]   2> 9418 T259 C16 P51456 REQ /update {update.distrib=FROMLEADER&distrib.from=http://127.0.0.1:42661/solr/collection1/&version=2&wt=javabin} status=0 QTime=0 
[junit4:junit4]   2> 9418 T233 C18 P55918 /update {version=2&wt=javabin} {add=[73 (1414006036887502848)]} 0 8
[junit4:junit4]   2> 9419 T249 C17 P42661 /update {version=2&wt=javabin} {delete=[10064 (-1414006036893794304)]} 0 3
[junit4:junit4]   2> 9423 T233 C18 P55918 /update {version=2&wt=javabin} {add=[10075 (1414006036900085760)]} 0 1
[junit4:junit4]   2> 9425 T259 C16 P51456 REQ /update {update.distrib=FROMLEADER&distrib.from=http://127.0.0.1:42661/solr/collection1/&version=2&wt=javabin} status=0 QTime=1 
[junit4:junit4]   2> 9426 T248 C17 P42661 /update {version=2&wt=javabin} {add=[73 (1414006036899037184)]} 0 5
[junit4:junit4]   2> 9429 T233 C18 P55918 /update {version=2&wt=javabin} {delete=[63 (-1414006036907425792)]} 0 0
[junit4:junit4]   2> 9430 T259 C16 P51456 REQ /update {update.distrib=FROMLEADER&distrib.from=http://127.0.0.1:42661/solr/collection1/&version=2&wt=javabin} status=0 QTime=1 
[junit4:junit4]   2> 9431 T249 C17 P42661 /update {version=2&wt=javabin} {add=[10075 (1414006036904280064)]} 0 5
[junit4:junit4]   2> 9434 T233 C18 P55918 /update {version=2&wt=javabin} {add=[10076 (1414006036911620096)]} 0 1
[junit4:junit4]   2> 9434 T259 C16 P51456 REQ /update {update.distrib=FROMLEADER&distrib.from=http://127.0.0.1:42661/solr/collection1/&version=2&wt=javabin} status=0 QTime=0 
[junit4:junit4]   2> 9435 T248 C17 P42661 /update {version=2&wt=javabin} {delete=[63 (-1414006036910571520)]} 0 3
[junit4:junit4]   2> 9438 T233 C18 P55918 /update {version=2&wt=javabin} {add=[74 (1414006036916862976)]} 0 0
[junit4:junit4]   2> 9440 T259 C16 P51456 REQ /update {update.distrib=FROMLEADER&distrib.from=http://127.0.0.1:42661/solr/collection1/&version=2&wt=javabin} status=0 QTime=1 
[junit4:junit4]   2> 9441 T249 C17 P42661 /update {version=2&wt=javabin} {add=[10076 (1414006036915814400)]} 0 4
[junit4:junit4]   2> 9444 T233 C18

[...truncated too long message...]

junit4:junit4]    > 	at org.apache.solr.client.solrj.request.QueryRequest.process(QueryRequest.java:90)
[junit4:junit4]    > 	at org.apache.solr.client.solrj.SolrServer.query(SolrServer.java:301)
[junit4:junit4]    > 	at org.apache.solr.BaseDistributedSearchTestCase.queryServer(BaseDistributedSearchTestCase.java:371)
[junit4:junit4]    > 	at org.apache.solr.BaseDistributedSearchTestCase.query(BaseDistributedSearchTestCase.java:394)
[junit4:junit4]    > 	at org.apache.solr.BaseDistributedSearchTestCase.query(BaseDistributedSearchTestCase.java:376)
[junit4:junit4]    > 	at org.apache.solr.TestDistributedSearch.doTest(TestDistributedSearch.java:134)
[junit4:junit4]    > 	at org.apache.solr.BaseDistributedSearchTestCase.testDistribSearch(BaseDistributedSearchTestCase.java:701)
[junit4:junit4]    > 	at sun.reflect.NativeMethodAccessorImpl.invoke0(Native Method)
[junit4:junit4]    > 	at sun.reflect.NativeMethodAccessorImpl.invoke(NativeMethodAccessorImpl.java:88)
[junit4:junit4]    > 	at sun.reflect.DelegatingMethodAccessorImpl.invoke(DelegatingMethodAccessorImpl.java:55)
[junit4:junit4]    > 	at java.lang.reflect.Method.invoke(Method.java:613)
[junit4:junit4]    > 	at com.carrotsearch.randomizedtesting.RandomizedRunner.invoke(RandomizedRunner.java:1559)
[junit4:junit4]    > 	at com.carrotsearch.randomizedtesting.RandomizedRunner.access$600(RandomizedRunner.java:79)
[junit4:junit4]    > 	at com.carrotsearch.randomizedtesting.RandomizedRunner$6.evaluate(RandomizedRunner.java:737)
[junit4:junit4]    > 	at com.carrotsearch.randomizedtesting.RandomizedRunner$7.evaluate(RandomizedRunner.java:773)
[junit4:junit4]    > 	at com.carrotsearch.randomizedtesting.RandomizedRunner$8.evaluate(RandomizedRunner.java:787)
[junit4:junit4]    > 	at com.carrotsearch.randomizedtesting.rules.SystemPropertiesRestoreRule$1.evaluate(SystemPropertiesRestoreRule.java:53)
[junit4:junit4]    > 	at org.apache.lucene.util.TestRuleSetupTeardownChained$1.evaluate(TestRuleSetupTeardownChained.java:50)
[junit4:junit4]    > 	at org.apache.lucene.util.TestRuleFieldCacheSanity$1.evaluate(TestRuleFieldCacheSanity.java:51)
[junit4:junit4]    > 	at org.apache.lucene.util.AbstractBeforeAfterRule$1.evaluate(AbstractBeforeAfterRule.java:45)
[junit4:junit4]    > 	at com.carrotsearch.randomizedtesting.rules.SystemPropertiesInvariantRule$1.evaluate(SystemPropertiesInvariantRule.java:55)
[junit4:junit4]    > 	at org.apache.lucene.util.TestRuleThreadAndTestName$1.evaluate(TestRuleThreadAndTestName.java:48)
[junit4:junit4]    > 	at org.apache.lucene.util.TestRuleIgnoreAfterMaxFailures$1.evaluate(TestRuleIgnoreAfterMaxFailures.java:70)
[junit4:junit4]    > 	at org.apache.lucene.util.TestRuleMarkFailure$1.evaluate(TestRuleMarkFailure.java:48)
[junit4:junit4]    > 	at com.carrotsearch.randomizedtesting.rules.StatementAdapter.evaluate(StatementAdapter.java:36)
[junit4:junit4]    > 	at com.carrotsearch.randomizedtesting.ThreadLeakControl$StatementRunner.run(ThreadLeakControl.java:358)
[junit4:junit4]    > 	at com.carrotsearch.randomizedtesting.ThreadLeakControl.forkTimeoutingTask(ThreadLeakControl.java:782)
[junit4:junit4]    > 	at com.carrotsearch.randomizedtesting.ThreadLeakControl$3.evaluate(ThreadLeakControl.java:442)
[junit4:junit4]    > 	at com.carrotsearch.randomizedtesting.RandomizedRunner.runSingleTest(RandomizedRunner.java:746)
[junit4:junit4]    > 	at com.carrotsearch.randomizedtesting.RandomizedRunner$3.evaluate(RandomizedRunner.java:648)
[junit4:junit4]    > 	at com.carrotsearch.randomizedtesting.RandomizedRunner$4.evaluate(RandomizedRunner.java:682)
[junit4:junit4]    > 	at com.carrotsearch.randomizedtesting.RandomizedRunner$5.evaluate(RandomizedRunner.java:693)
[junit4:junit4]    > 	at com.carrotsearch.randomizedtesting.rules.StatementAdapter.evaluate(StatementAdapter.java:36)
[junit4:junit4]    > 	at com.carrotsearch.randomizedtesting.rules.SystemPropertiesRestoreRule$1.evaluate(SystemPropertiesRestoreRule.java:53)
[junit4:junit4]    > 	at org.apache.lucene.util.AbstractBeforeAfterRule$1.evaluate(AbstractBeforeAfterRule.java:45)
[junit4:junit4]    > 	at org.apache.lucene.util.TestRuleStoreClassName$1.evaluate(TestRuleStoreClassName.java:42)
[junit4:junit4]    > 	at com.carrotsearch.randomizedtesting.rules.SystemPropertiesInvariantRule$1.evaluate(SystemPropertiesInvariantRule.java:55)
[junit4:junit4]    > 	at com.carrotsearch.randomizedtesting.rules.NoShadowingOrOverridesOnMethodsRule$1.evaluate(NoShadowingOrOverridesOnMethodsRule.java:39)
[junit4:junit4]    > 	at com.carrotsearch.randomizedtesting.rules.NoShadowingOrOverridesOnMethodsRule$1.evaluate(NoShadowingOrOverridesOnMethodsRule.java:39)
[junit4:junit4]    > 	at com.carrotsearch.randomizedtesting.rules.StatementAdapter.evaluate(StatementAdapter.java:36)
[junit4:junit4]    > 	at org.apache.lucene.util.TestRuleAssertionsRequired$1.evaluate(TestRuleAssertionsRequired.java:43)
[junit4:junit4]    > 	at org.apache.lucene.util.TestRuleMarkFailure$1.evaluate(TestRuleMarkFailure.java:48)
[junit4:junit4]    > 	at org.apache.lucene.util.TestRuleIgnoreAfterMaxFailures$1.evaluate(TestRuleIgnoreAfterMaxFailures.java:70)
[junit4:junit4]    > 	at org.apache.lucene.util.TestRuleIgnoreTestSuites$1.evaluate(TestRuleIgnoreTestSuites.java:55)
[junit4:junit4]    > 	at com.carrotsearch.randomizedtesting.rules.StatementAdapter.evaluate(StatementAdapter.java:36)
[junit4:junit4]    > 	at com.carrotsearch.randomizedtesting.ThreadLeakControl$StatementRunner.run(ThreadLeakControl.java:358)
[junit4:junit4]    > 	at java.lang.Thread.run(Thread.java:777)
[junit4:junit4]   2> 2383 T1774 oas.SolrTestCaseJ4.deleteCore ###deleteCore
[junit4:junit4]   2> NOTE: test params are: codec=Lucene40: {multiDefault=Pulsing40(freqCutoff=17 minBlockSize=76 maxBlockSize=170), other_tl1=PostingsFormat(name=Memory doPackFST= false), n_ti1=PostingsFormat(name=TestBloomFilteredLucene40Postings), rnd_b=PostingsFormat(name=TestBloomFilteredLucene40Postings), SubjectTerms_mfacet=PostingsFormat(name=Memory doPackFST= false), n_dt1=PostingsFormat(name=Memory doPackFST= false), intDefault=PostingsFormat(name=Memory doPackFST= false), a_n_tdt=PostingsFormat(name=MockSep), timestamp=Pulsing40(freqCutoff=17 minBlockSize=76 maxBlockSize=170), b_n_tdt=PostingsFormat(name=Memory doPackFST= false), a_t=Pulsing40(freqCutoff=17 minBlockSize=76 maxBlockSize=170), id=PostingsFormat(name=TestBloomFilteredLucene40Postings), n_tdt1=PostingsFormat(name=Memory doPackFST= false), range_facet_si=Pulsing40(freqCutoff=17 minBlockSize=76 maxBlockSize=170), range_facet_l=Pulsing40(freqCutoff=17 minBlockSize=76 maxBlockSize=170), range_facet_sl=PostingsFormat(name=TestBloomFilteredLucene40Postings), n_tl1=PostingsFormat(name=Memory doPackFST= false), foo_b=PostingsFormat(name=MockSep), foo_d=PostingsFormat(name=TestBloomFilteredLucene40Postings), foo_f=PostingsFormat(name=MockSep), text=PostingsFormat(name=MockSep), n_tf1=Pulsing40(freqCutoff=17 minBlockSize=76 maxBlockSize=170), n_td1=PostingsFormat(name=Memory doPackFST= false), a_si=PostingsFormat(name=Memory doPackFST= false), n_l1=Pulsing40(freqCutoff=17 minBlockSize=76 maxBlockSize=170), n_f1=PostingsFormat(name=Memory doPackFST= false), n_d1=Pulsing40(freqCutoff=17 minBlockSize=76 maxBlockSize=170), oddField_s=PostingsFormat(name=TestBloomFilteredLucene40Postings)}, sim=RandomSimilarityProvider(queryNorm=true,coord=no): {}, locale=nl_NL_PREEURO, timezone=America/Indiana/Indianapolis
[junit4:junit4]   2> NOTE: Linux 3.2.0-31-generic amd64/IBM Corporation 1.7.0 (64-bit)/cpus=8,threads=1,free=7800440,total=172687360
[junit4:junit4]   2> NOTE: All tests run in this JVM: [BasicFunctionalityTest, TestStressRecovery, TestSolrDeletionPolicy1, PolyFieldTest, TestPluginEnable, TestStressLucene, UpdateParamsTest, TestSolrXMLSerializer, TestRTGBase, SolrIndexConfigTest, ZkNodePropsTest, TestQueryUtils, SimplePostToolTest, TestRealTimeGet, DirectSolrSpellCheckerTest, PingRequestHandlerTest, RAMDirectoryFactoryTest, IndexReaderFactoryTest, TestSolrCoreProperties, TestSort, StandardRequestHandlerTest, DisMaxRequestHandlerTest, TestFunctionQuery, PrimitiveFieldTypeTest, RequiredFieldsTest, SuggesterTest, TestFoldingMultitermQuery, ScriptEngineTest, TestMergePolicyConfig, TestBM25SimilarityFactory, FileUtilsTest, TestOmitPositions, RecoveryZkTest, TestQuerySenderListener, ZkSolrClientTest, LegacyHTMLStripCharFilterTest, HighlighterTest, TestFastWriter, TestTrie, TestRecovery, OpenExchangeRatesOrgProviderTest, PeerSyncTest, BadIndexSchemaTest, TestWriterPerf, TestSolr4Spatial, TimeZoneUtilsTest, TestCSVLoader, StatsComponentTest, ReturnFieldsTest, TestValueSourceCache, AnalysisAfterCoreReloadTest, SignatureUpdateProcessorFactoryTest, ShowFileRequestHandlerTest, SolrCoreTest, OverseerTest, FullSolrCloudDistribCmdsTest, TestReplicationHandler, LeaderElectionIntegrationTest, LeaderElectionTest, ZkControllerTest, TestDistributedGrouping, TestDistributedSearch]
[junit4:junit4] Completed on J1 in 2.40s, 1 test, 1 error <<< FAILURES!

[...truncated 393 lines...]
BUILD FAILED
/mnt/ssd/jenkins/workspace/Lucene-Solr-trunk-Linux/build.xml:32: The following error occurred while executing this line:
/mnt/ssd/jenkins/workspace/Lucene-Solr-trunk-Linux/solr/build.xml:179: The following error occurred while executing this line:
/mnt/ssd/jenkins/workspace/Lucene-Solr-trunk-Linux/lucene/module-build.xml:61: The following error occurred while executing this line:
/mnt/ssd/jenkins/workspace/Lucene-Solr-trunk-Linux/lucene/common-build.xml:1142: The following error occurred while executing this line:
/mnt/ssd/jenkins/workspace/Lucene-Solr-trunk-Linux/lucene/common-build.xml:815: There were test failures: 230 suites, 950 tests, 3 errors, 7 ignored (2 assumptions)

Total time: 22 minutes 19 seconds
Build step 'Invoke Ant' marked build as failure
Recording test results
Description set: Java: 64bit/ibm-j9-jdk7 -Xjit:exclude={org/apache/lucene/util/fst/FST.pack(IIF)Lorg/apache/lucene/util/fst/FST;}
Email was triggered for: Failure
Sending email for trigger: Failure



Mime
View raw message