lucene-dev mailing list archives

Site index · List index
Message view « Date » · « Thread »
Top « Date » · « Thread »
From Apache Jenkins Server <jenk...@builds.apache.org>
Subject [JENKINS-MAVEN] Lucene-Solr-Maven-trunk #620: POMs out of sync
Date Fri, 21 Sep 2012 17:08:16 GMT
Build: https://builds.apache.org/job/Lucene-Solr-Maven-trunk/620/

1 tests failed.
FAILED:  org.apache.solr.cloud.SyncSliceTest.testDistribSearch

Error Message:
There are still nodes recoverying

Stack Trace:
java.lang.AssertionError: There are still nodes recoverying
	at __randomizedtesting.SeedInfo.seed([30F578979CB00ACC:B113F68FEBEF6AF0]:0)
	at org.junit.Assert.fail(Assert.java:93)
	at org.apache.solr.cloud.AbstractDistribZkTestBase.waitForRecoveriesToFinish(AbstractDistribZkTestBase.java:154)
	at org.apache.solr.cloud.AbstractFullDistribZkTestBase.waitForRecoveriesToFinish(AbstractFullDistribZkTestBase.java:565)
	at org.apache.solr.cloud.AbstractFullDistribZkTestBase.waitForThingsToLevelOut(AbstractFullDistribZkTestBase.java:1140)
	at org.apache.solr.cloud.SyncSliceTest.doTest(SyncSliceTest.java:162)
	at org.apache.solr.BaseDistributedSearchTestCase.testDistribSearch(BaseDistributedSearchTestCase.java:695)
	at sun.reflect.NativeMethodAccessorImpl.invoke0(Native Method)
	at sun.reflect.NativeMethodAccessorImpl.invoke(NativeMethodAccessorImpl.java:57)
	at sun.reflect.DelegatingMethodAccessorImpl.invoke(DelegatingMethodAccessorImpl.java:43)
	at java.lang.reflect.Method.invoke(Method.java:616)
	at com.carrotsearch.randomizedtesting.RandomizedRunner.invoke(RandomizedRunner.java:1559)
	at com.carrotsearch.randomizedtesting.RandomizedRunner.access$600(RandomizedRunner.java:79)
	at com.carrotsearch.randomizedtesting.RandomizedRunner$6.evaluate(RandomizedRunner.java:737)
	at com.carrotsearch.randomizedtesting.RandomizedRunner$7.evaluate(RandomizedRunner.java:773)
	at com.carrotsearch.randomizedtesting.RandomizedRunner$8.evaluate(RandomizedRunner.java:787)
	at com.carrotsearch.randomizedtesting.rules.SystemPropertiesRestoreRule$1.evaluate(SystemPropertiesRestoreRule.java:53)
	at org.apache.lucene.util.TestRuleSetupTeardownChained$1.evaluate(TestRuleSetupTeardownChained.java:50)
	at org.apache.lucene.util.TestRuleFieldCacheSanity$1.evaluate(TestRuleFieldCacheSanity.java:51)
	at org.apache.lucene.util.AbstractBeforeAfterRule$1.evaluate(AbstractBeforeAfterRule.java:45)
	at com.carrotsearch.randomizedtesting.rules.SystemPropertiesInvariantRule$1.evaluate(SystemPropertiesInvariantRule.java:55)
	at org.apache.lucene.util.TestRuleThreadAndTestName$1.evaluate(TestRuleThreadAndTestName.java:48)
	at org.apache.lucene.util.TestRuleIgnoreAfterMaxFailures$1.evaluate(TestRuleIgnoreAfterMaxFailures.java:70)
	at org.apache.lucene.util.TestRuleMarkFailure$1.evaluate(TestRuleMarkFailure.java:48)
	at com.carrotsearch.randomizedtesting.rules.StatementAdapter.evaluate(StatementAdapter.java:36)
	at com.carrotsearch.randomizedtesting.ThreadLeakControl$StatementRunner.run(ThreadLeakControl.java:358)
	at com.carrotsearch.randomizedtesting.ThreadLeakControl.forkTimeoutingTask(ThreadLeakControl.java:782)
	at com.carrotsearch.randomizedtesting.ThreadLeakControl$3.evaluate(ThreadLeakControl.java:442)
	at com.carrotsearch.randomizedtesting.RandomizedRunner.runSingleTest(RandomizedRunner.java:746)
	at com.carrotsearch.randomizedtesting.RandomizedRunner$3.evaluate(RandomizedRunner.java:648)
	at com.carrotsearch.randomizedtesting.RandomizedRunner$4.evaluate(RandomizedRunner.java:682)
	at com.carrotsearch.randomizedtesting.RandomizedRunner$5.evaluate(RandomizedRunner.java:693)
	at com.carrotsearch.randomizedtesting.rules.StatementAdapter.evaluate(StatementAdapter.java:36)
	at com.carrotsearch.randomizedtesting.rules.SystemPropertiesRestoreRule$1.evaluate(SystemPropertiesRestoreRule.java:53)
	at org.apache.lucene.util.AbstractBeforeAfterRule$1.evaluate(AbstractBeforeAfterRule.java:45)
	at org.apache.lucene.util.TestRuleStoreClassName$1.evaluate(TestRuleStoreClassName.java:42)
	at com.carrotsearch.randomizedtesting.rules.SystemPropertiesInvariantRule$1.evaluate(SystemPropertiesInvariantRule.java:55)
	at com.carrotsearch.randomizedtesting.rules.NoShadowingOrOverridesOnMethodsRule$1.evaluate(NoShadowingOrOverridesOnMethodsRule.java:39)
	at com.carrotsearch.randomizedtesting.rules.NoShadowingOrOverridesOnMethodsRule$1.evaluate(NoShadowingOrOverridesOnMethodsRule.java:39)
	at com.carrotsearch.randomizedtesting.rules.StatementAdapter.evaluate(StatementAdapter.java:36)
	at org.apache.lucene.util.TestRuleAssertionsRequired$1.evaluate(TestRuleAssertionsRequired.java:43)
	at org.apache.lucene.util.TestRuleMarkFailure$1.evaluate(TestRuleMarkFailure.java:48)
	at org.apache.lucene.util.TestRuleIgnoreAfterMaxFailures$1.evaluate(TestRuleIgnoreAfterMaxFailures.java:70)
	at org.apache.lucene.util.TestRuleIgnoreTestSuites$1.evaluate(TestRuleIgnoreTestSuites.java:55)
	at com.carrotsearch.randomizedtesting.rules.StatementAdapter.evaluate(StatementAdapter.java:36)
	at com.carrotsearch.randomizedtesting.ThreadLeakControl$StatementRunner.run(ThreadLeakControl.java:358)
	at java.lang.Thread.run(Thread.java:679)




Build Log:
[...truncated 3270 lines...]
      [mvn] 1387 T3 oasc.SolrCore.finalize SEVERE REFCOUNT ERROR: unreferenced org.apache.solr.core.SolrCore@6153e0c0 (collection1) has a reference count of 1
      [mvn] Creating dataDir: /usr/home/hudson/hudson-slave/workspace/Lucene-Solr-Maven-trunk/maven-build/solr/core/src/test/target/test/./solrtest-BadIndexSchemaTest-1348245933041
      [mvn] Creating dataDir: /usr/home/hudson/hudson-slave/workspace/Lucene-Solr-Maven-trunk/maven-build/solr/core/src/test/target/test/./solrtest-BadIndexSchemaTest-1348245933118
      [mvn] 1587 T14 oass.IndexSchema.readSchema SEVERE FieldType 'sim1' is configured with a similarity, but the global similarity does not support it: class org.apache.solr.search.similarities.DefaultSimilarityFactory
      [mvn] Tests run: 10, Failures: 0, Errors: 0, Skipped: 0, Time elapsed: 1.631 sec
      [mvn] Running org.apache.solr.search.TestSolr4Spatial
      [mvn] Creating dataDir: /usr/home/hudson/hudson-slave/workspace/Lucene-Solr-Maven-trunk/maven-build/solr/core/src/test/target/test/./solrtest-TestSolr4Spatial-1348245933218
      [mvn] Tests run: 24, Failures: 0, Errors: 0, Skipped: 1, Time elapsed: 3.37 sec
      [mvn] Running org.apache.solr.search.TestStressRecovery
      [mvn] Creating dataDir: /usr/home/hudson/hudson-slave/workspace/Lucene-Solr-Maven-trunk/maven-build/solr/core/src/test/target/test/./solrtest-TestStressRecovery-1348245936582
      [mvn] Tests run: 1, Failures: 0, Errors: 0, Skipped: 0, Time elapsed: 4 sec
      [mvn] Running org.apache.solr.core.TestSolrXMLSerializer
      [mvn] Tests run: 1, Failures: 0, Errors: 0, Skipped: 0, Time elapsed: 0.03 sec
      [mvn] Running org.apache.solr.servlet.CacheHeaderTest
      [mvn] Creating dataDir: /usr/home/hudson/hudson-slave/workspace/Lucene-Solr-Maven-trunk/maven-build/solr/core/src/test/target/test/./solrtest-CacheHeaderTest-1348245940611
      [mvn] Tests run: 5, Failures: 0, Errors: 0, Skipped: 0, Time elapsed: 1.153 sec
      [mvn] Running org.apache.solr.handler.XsltUpdateRequestHandlerTest
      [mvn] Creating dataDir: /usr/home/hudson/hudson-slave/workspace/Lucene-Solr-Maven-trunk/maven-build/solr/core/src/test/target/test/./solrtest-XsltUpdateRequestHandlerTest-1348245941762
      [mvn] Tests run: 1, Failures: 0, Errors: 0, Skipped: 0, Time elapsed: 0.648 sec
      [mvn] Running org.apache.solr.search.TestRangeQuery
      [mvn] Creating dataDir: /usr/home/hudson/hudson-slave/workspace/Lucene-Solr-Maven-trunk/maven-build/solr/core/src/test/target/test/./solrtest-TestRangeQuery-1348245942411
      [mvn] Tests run: 2, Failures: 0, Errors: 0, Skipped: 0, Time elapsed: 2.923 sec
      [mvn] Running org.apache.solr.search.TestLFUCache
      [mvn] Creating dataDir: /usr/home/hudson/hudson-slave/workspace/Lucene-Solr-Maven-trunk/maven-build/solr/core/src/test/target/test/./solrtest-TestLFUCache-1348245945334
      [mvn] {39=39, 38=38, 37=37, 36=36, 35=35, 34=34, 33=33, 32=32, 31=31, 30=30}
      [mvn] Tests run: 5, Failures: 0, Errors: 0, Skipped: 0, Time elapsed: 0.345 sec
      [mvn] Running org.apache.solr.update.PeerSyncTest
      [mvn] Tests run: 1, Failures: 0, Errors: 0, Skipped: 0, Time elapsed: 2.804 sec
      [mvn] Running org.apache.solr.cloud.ZkSolrClientTest
      [mvn] Tests run: 4, Failures: 0, Errors: 0, Skipped: 0, Time elapsed: 9.107 sec
      [mvn] Running org.apache.solr.response.TestPHPSerializedResponseWriter
      [mvn] Creating dataDir: /usr/home/hudson/hudson-slave/workspace/Lucene-Solr-Maven-trunk/maven-build/solr/core/src/test/target/test/./solrtest-TestPHPSerializedResponseWriter-1348245957595
      [mvn] Tests run: 2, Failures: 0, Errors: 0, Skipped: 0, Time elapsed: 0.531 sec
      [mvn] Running org.apache.solr.util.FileUtilsTest
      [mvn] Tests run: 1, Failures: 0, Errors: 0, Skipped: 0, Time elapsed: 0.027 sec
      [mvn] Running org.apache.solr.spelling.TestSuggestSpellingConverter
      [mvn] Tests run: 2, Failures: 0, Errors: 0, Skipped: 0, Time elapsed: 0.051 sec
      [mvn] Running org.apache.solr.update.processor.SignatureUpdateProcessorFactoryTest
      [mvn] Creating dataDir: /usr/home/hudson/hudson-slave/workspace/Lucene-Solr-Maven-trunk/maven-build/solr/core/src/test/target/test/./solrtest-SignatureUpdateProcessorFactoryTest-1348245958250
      [mvn] Tests run: 6, Failures: 0, Errors: 0, Skipped: 0, Time elapsed: 1.234 sec
      [mvn] Running org.apache.solr.handler.admin.LoggingHandlerTest
      [mvn] Creating dataDir: /usr/home/hudson/hudson-slave/workspace/Lucene-Solr-Maven-trunk/maven-build/solr/core/src/test/target/test/./solrtest-LoggingHandlerTest-1348245959444
      [mvn] Tests run: 1, Failures: 0, Errors: 0, Skipped: 0, Time elapsed: 0.503 sec
      [mvn] Running org.apache.solr.schema.PolyFieldTest
      [mvn] Creating dataDir: /usr/home/hudson/hudson-slave/workspace/Lucene-Solr-Maven-trunk/maven-build/solr/core/src/test/target/test/./solrtest-PolyFieldTest-1348245959941
      [mvn] Tests run: 4, Failures: 0, Errors: 0, Skipped: 0, Time elapsed: 0.62 sec
      [mvn] Running org.apache.solr.core.TestPropInject
      [mvn] Tests run: 2, Failures: 0, Errors: 0, Skipped: 0, Time elapsed: 0.636 sec
      [mvn] Running org.apache.solr.cloud.LeaderElectionIntegrationTest
      [mvn] Creating dataDir: /usr/home/hudson/hudson-slave/workspace/Lucene-Solr-Maven-trunk/maven-build/solr/core/src/test/target/test/./solrtest-LeaderElectionIntegrationTest-1348245961206
      [mvn] Creating dataDir: /usr/home/hudson/hudson-slave/workspace/Lucene-Solr-Maven-trunk/maven-build/solr/core/src/test/target/test/./solrtest-LeaderElectionIntegrationTest-1348245969754
      [mvn] Tests run: 2, Failures: 0, Errors: 0, Skipped: 0, Time elapsed: 22.511 sec
      [mvn] Running org.apache.solr.util.CircularListTest
      [mvn] Tests run: 1, Failures: 0, Errors: 0, Skipped: 0, Time elapsed: 0.014 sec
      [mvn] Running org.apache.solr.handler.admin.LukeRequestHandlerTest
      [mvn] Tests run: 4, Failures: 0, Errors: 0, Skipped: 0, Time elapsed: 2.053 sec
      [mvn] Running org.apache.solr.spelling.WordBreakSolrSpellCheckerTest
      [mvn] Creating dataDir: /usr/home/hudson/hudson-slave/workspace/Lucene-Solr-Maven-trunk/maven-build/solr/core/src/test/target/test/./solrtest-WordBreakSolrSpellCheckerTest-1348245985786
      [mvn] Tests run: 3, Failures: 0, Errors: 0, Skipped: 0, Time elapsed: 1.236 sec
      [mvn] Running org.apache.solr.handler.MoreLikeThisHandlerTest
      [mvn] Creating dataDir: /usr/home/hudson/hudson-slave/workspace/Lucene-Solr-Maven-trunk/maven-build/solr/core/src/test/target/test/./solrtest-MoreLikeThisHandlerTest-1348245987027
      [mvn] Tests run: 1, Failures: 0, Errors: 0, Skipped: 0, Time elapsed: 0.644 sec
      [mvn] Running org.apache.solr.update.processor.ScriptEngineTest
      [mvn] Tests run: 6, Failures: 0, Errors: 0, Skipped: 1, Time elapsed: 0.231 sec
      [mvn] Running org.apache.solr.update.SolrCmdDistributorTest
      [mvn] node props:{
      [mvn]   "base_url":"http://127.0.0.1:35538/solr",
      [mvn]   "core":""}
      [mvn] node props:{
      [mvn]   "base_url":"http://127.0.0.1:29406/solr",
      [mvn]   "core":""}
      [mvn] node props:{
      [mvn]   "base_url":"http://127.0.0.1:39776/solr",
      [mvn]   "core":""}
      [mvn] node props:{
      [mvn]   "base_url":"http://127.0.0.1:35538/solr",
      [mvn]   "core":""}
      [mvn] node props:{
      [mvn]   "base_url":"http://127.0.0.1:29406/solr",
      [mvn]   "core":""}
      [mvn] node props:{
      [mvn]   "base_url":"http://127.0.0.1:35538/solr",
      [mvn]   "core":""}
      [mvn] node props:{
      [mvn]   "base_url":"http://127.0.0.1:39776/solr",
      [mvn]   "core":""}
      [mvn] node props:{
      [mvn]   "base_url":"http://127.0.0.1:39776/solr",
      [mvn]   "core":""}
      [mvn] node props:{
      [mvn]   "base_url":"http://127.0.0.1:29406/solr",
      [mvn]   "core":""}
      [mvn] node props:{
      [mvn]   "base_url":"http://127.0.0.1:37985/solr",
      [mvn]   "core":""}
      [mvn] node props:{
      [mvn]   "base_url":"http://127.0.0.1:39776/solr",
      [mvn]   "core":""}
      [mvn] node props:{
      [mvn]   "base_url":"http://127.0.0.1:39776/solr",
      [mvn]   "core":""}
      [mvn] node props:{
      [mvn]   "base_url":"http://127.0.0.1:35538/solr",
      [mvn]   "core":""}
      [mvn] node props:{
      [mvn]   "base_url":"http://127.0.0.1:37985/solr",
      [mvn]   "core":""}
      [mvn] node props:{
      [mvn]   "base_url":"http://127.0.0.1:35538/solr",
      [mvn]   "core":""}
      [mvn] node props:{
      [mvn]   "base_url":"http://127.0.0.1:29406/solr",
      [mvn]   "core":""}
      [mvn] node props:{
      [mvn]   "base_url":"http://127.0.0.1:39776/solr",
      [mvn]   "core":""}
      [mvn] node props:{
      [mvn]   "base_url":"http://127.0.0.1:37985/solr",
      [mvn]   "core":""}
      [mvn] node props:{
      [mvn]   "base_url":"http://127.0.0.1:39776/solr",
      [mvn]   "core":""}
      [mvn] node props:{
      [mvn]   "base_url":"http://127.0.0.1:29406/solr",
      [mvn]   "core":""}
      [mvn] node props:{
      [mvn]   "base_url":"http://127.0.0.1:37985/solr",
      [mvn]   "core":""}
      [mvn] node props:{
      [mvn]   "base_url":"http://127.0.0.1:29406/solr",
      [mvn]   "core":""}
      [mvn] node props:{
      [mvn]   "base_url":"http://127.0.0.1:37985/solr",
      [mvn]   "core":""}
      [mvn] node props:{
      [mvn]   "base_url":"http://127.0.0.1:39776/solr",
      [mvn]   "core":""}
      [mvn] node props:{
      [mvn]   "base_url":"http://127.0.0.1:29406/solr",
      [mvn]   "core":""}
      [mvn] node props:{
      [mvn]   "base_url":"http://127.0.0.1:37985/solr",
      [mvn]   "core":""}
      [mvn] node props:{
      [mvn]   "base_url":"http://127.0.0.1:35538/solr",
      [mvn]   "core":""}
      [mvn] node props:{
      [mvn]   "base_url":"http://127.0.0.1:37985/solr",
      [mvn]   "core":""}
      [mvn] node props:{
      [mvn]   "base_url":"http://127.0.0.1:39776/solr",
      [mvn]   "core":""}
      [mvn] node props:{
      [mvn]   "base_url":"http://127.0.0.1:35538/solr",
      [mvn]   "core":""}
      [mvn] node props:{
      [mvn]   "base_url":"http://127.0.0.1:39776/solr",
      [mvn]   "core":""}
      [mvn] node props:{
      [mvn]   "base_url":"http://127.0.0.1:39776/solr",
      [mvn]   "core":""}
      [mvn] node props:{
      [mvn]   "base_url":"http://127.0.0.1:35538/solr",
      [mvn]   "core":""}
      [mvn] node props:{
      [mvn]   "base_url":"http://127.0.0.1:35538/solr",
      [mvn]   "core":""}
      [mvn] node props:{
      [mvn]   "base_url":"http://127.0.0.1:39776/solr",
      [mvn]   "core":""}
      [mvn] node props:{
      [mvn]   "base_url":"http://127.0.0.1:37985/solr",
      [mvn]   "core":""}
      [mvn] node props:{
      [mvn]   "base_url":"http://127.0.0.1:39776/solr",
      [mvn]   "core":""}
      [mvn] node props:{
      [mvn]   "base_url":"http://127.0.0.1:35538/solr",
      [mvn]   "core":""}
      [mvn] node props:{
      [mvn]   "base_url":"http://127.0.0.1:37985/solr",
      [mvn]   "core":""}
      [mvn] node props:{
      [mvn]   "base_url":"http://127.0.0.1:39776/solr",
      [mvn]   "core":""}
      [mvn] node props:{
      [mvn]   "base_url":"http://127.0.0.1:35538/solr",
      [mvn]   "core":""}
      [mvn] node props:{
      [mvn]   "base_url":"http://127.0.0.1:29406/solr",
      [mvn]   "core":""}
      [mvn] node props:{
      [mvn]   "base_url":"http://127.0.0.1:37985/solr",
      [mvn]   "core":""}
      [mvn] node props:{
      [mvn]   "base_url":"http://127.0.0.1:35538/solr",
      [mvn]   "core":""}
      [mvn] node props:{
      [mvn]   "base_url":"http://127.0.0.1:37985/solr",
      [mvn]   "core":""}
      [mvn] node props:{
      [mvn]   "base_url":"http://127.0.0.1:29406/solr",
      [mvn]   "core":""}
      [mvn] node props:{
      [mvn]   "base_url":"http://127.0.0.1:37985/solr",
      [mvn]   "core":""}
      [mvn] node props:{
      [mvn]   "base_url":"http://127.0.0.1:35538/solr",
      [mvn]   "core":""}
      [mvn] node props:{
      [mvn]   "base_url":"http://127.0.0.1:29406/solr",
      [mvn]   "core":""}
      [mvn] node props:{
      [mvn]   "base_url":"http://127.0.0.1:35538/solr",
      [mvn]   "core":""}
      [mvn] node props:{
      [mvn]   "base_url":"http://127.0.0.1:39776/solr",
      [mvn]   "core":""}
      [mvn] node props:{
      [mvn]   "base_url":"http://127.0.0.1:35538/solr",
      [mvn]   "core":""}
      [mvn] node props:{
      [mvn]   "base_url":"http://127.0.0.1:29406/solr",
      [mvn]   "core":""}
      [mvn] node props:{
      [mvn]   "base_url":"http://127.0.0.1:35538/solr",
      [mvn]   "core":""}
      [mvn] node props:{
      [mvn]   "base_url":"http://127.0.0.1:29406/solr",
      [mvn]   "core":""}
      [mvn] node props:{
      [mvn]   "base_url":"http://127.0.0.1:37985/solr",
      [mvn]   "core":""}
      [mvn] node props:{
      [mvn]   "base_url":"http://127.0.0.1:39776/solr",
      [mvn]   "core":""}
      [mvn] node props:{
      [mvn]   "base_url":"http://127.0.0.1:35538/solr",
      [mvn]   "core":""}
      [mvn] node props:{
      [mvn]   "base_url":"http://127.0.0.1:29406/solr",
      [mvn]   "core":""}
      [mvn] node props:{
      [mvn]   "base_url":"http://127.0.0.1:39776/solr",
      [mvn]   "core":""}
      [mvn] node props:{
      [mvn]   "base_url":"http://127.0.0.1:35538/solr",
      [mvn]   "core":""}
      [mvn] node props:{
      [mvn]   "base_url":"http://127.0.0.1:37985/solr",
      [mvn]   "core":""}
      [mvn] node props:{
      [mvn]   "base_url":"http://127.0.0.1:29406/solr",
      [mvn]   "core":""}
      [mvn] node props:{
      [mvn]   "base_url":"http://127.0.0.1:37985/solr",
      [mvn]   "core":""}
      [mvn] node props:{
      [mvn]   "base_url":"http://127.0.0.1:39776/solr",
      [mvn]   "core":""}
      [mvn] node props:{
      [mvn]   "base_url":"http://127.0.0.1:29406/solr",
      [mvn]   "core":""}
      [mvn] node props:{
      [mvn]   "base_url":"http://127.0.0.1:39776/solr",
      [mvn]   "core":""}
      [mvn] node props:{
      [mvn]   "base_url":"http://127.0.0.1:37985/solr",
      [mvn]   "core":""}
      [mvn] node props:{
      [mvn]   "base_url":"http://127.0.0.1:39776/solr",
      [mvn]   "core":""}
      [mvn] node props:{
      [mvn]   "base_url":"http://127.0.0.1:35538/solr",
      [mvn]   "core":""}
      [mvn] node props:{
      [mvn]   "base_url":"http://127.0.0.1:37985/solr",
      [mvn]   "core":""}
      [mvn] node props:{
      [mvn]   "base_url":"http://127.0.0.1:39776/solr",
      [mvn]   "core":""}
      [mvn] node props:{
      [mvn]   "base_url":"http://127.0.0.1:39776/solr",
      [mvn]   "core":""}
      [mvn] node props:{
      [mvn]   "base_url":"http://127.0.0.1:29406/solr",
      [mvn]   "core":""}
      [mvn] node props:{
      [mvn]   "base_url":"http://127.0.0.1:29406/solr",
      [mvn]   "core":""}
      [mvn] node props:{
      [mvn]   "base_url":"http://127.0.0.1:39776/solr",
      [mvn]   "core":""}
      [mvn] node props:{
      [mvn]   "base_url":"http://127.0.0.1:35538/solr",
      [mvn]   "core":""}
      [mvn] node props:{
      [mvn]   "base_url":"http://127.0.0.1:29406/solr",
      [mvn]   "core":""}
      [mvn] node props:{
      [mvn]   "base_url":"http://127.0.0.1:39776/solr",
      [mvn]   "core":""}
      [mvn] node props:{
      [mvn]   "base_url":"http://127.0.0.1:35538/solr",
      [mvn]   "core":""}
      [mvn] node props:{
      [mvn]   "base_url":"http://127.0.0.1:37985/solr",
      [mvn]   "core":""}
      [mvn] node props:{
      [mvn]   "base_url":"http://127.0.0.1:39776/solr",
      [mvn]   "core":""}
      [mvn] node props:{
      [mvn]   "base_url":"http://127.0.0.1:37985/solr",
      [mvn]   "core":""}
      [mvn] node props:{
      [mvn]   "base_url":"http://127.0.0.1:35538/solr",
      [mvn]   "core":""}
      [mvn] node props:{
      [mvn]   "base_url":"http://127.0.0.1:29406/solr",
      [mvn]   "core":""}
      [mvn] node props:{
      [mvn]   "base_url":"http://127.0.0.1:37985/solr",
      [mvn]   "core":""}
      [mvn] node props:{
      [mvn]   "base_url":"http://127.0.0.1:39776/solr",
      [mvn]   "core":""}
      [mvn] node props:{
      [mvn]   "base_url":"http://127.0.0.1:35538/solr",
      [mvn]   "core":""}
      [mvn] node props:{
      [mvn]   "base_url":"http://127.0.0.1:29406/solr",
      [mvn]   "core":""}
      [mvn] node props:{
      [mvn]   "base_url":"http://127.0.0.1:37985/solr",
      [mvn]   "core":""}
      [mvn] node props:{
      [mvn]   "base_url":"http://127.0.0.1:39776/solr",
      [mvn]   "core":""}
      [mvn] node props:{
      [mvn]   "base_url":"http://127.0.0.1:29406/solr",
      [mvn]   "core":""}
      [mvn] node props:{
      [mvn]   "base_url":"http://127.0.0.1:29406/solr",
      [mvn]   "core":""}
      [mvn] node props:{
      [mvn]   "base_url":"http://127.0.0.1:35538/solr",
      [mvn]   "core":""}
      [mvn] node props:{
      [mvn]   "base_url":"http://127.0.0.1:29406/solr",
      [mvn]   "core":""}
      [mvn] node props:{
      [mvn]   "base_url":"http://127.0.0.1:39776/solr",
      [mvn]   "core":""}
      [mvn] node props:{
      [mvn]   "base_url":"http://127.0.0.1:35538/solr",
      [mvn]   "core":""}
      [mvn] node props:{
      [mvn]   "base_url":"http://127.0.0.1:35538/solr",
      [mvn]   "core":""}
      [mvn] node props:{
      [mvn]   "base_url":"http://127.0.0.1:39776/solr",
      [mvn]   "core":""}
      [mvn] node props:{
      [mvn]   "base_url":"http://127.0.0.1:29406/solr",
      [mvn]   "core":""}
      [mvn] node props:{
      [mvn]   "base_url":"http://127.0.0.1:37985/solr",
      [mvn]   "core":""}
      [mvn] node props:{
      [mvn]   "base_url":"http://127.0.0.1:29406/solr",
      [mvn]   "core":""}
      [mvn] node props:{
      [mvn]   "base_url":"http://127.0.0.1:37985/solr",
      [mvn]   "core":""}
      [mvn] node props:{
      [mvn]   "base_url":"http://127.0.0.1:39776/solr",
      [mvn]   "core":""}
      [mvn] node props:{
      [mvn]   "base_url":"http://127.0.0.1:35538/solr",
      [mvn]   "core":""}
      [mvn] node props:{
      [mvn]   "base_url":"http://127.0.0.1:37985/solr",
      [mvn]   "core":""}
      [mvn] node props:{
      [mvn]   "base_url":"http://127.0.0.1:29406/solr",
      [mvn]   "core":""}
      [mvn] node props:{
      [mvn]   "base_url":"http://127.0.0.1:29406/solr",
      [mvn]   "core":""}
      [mvn] node props:{
      [mvn]   "base_url":"http://127.0.0.1:37985/solr",
      [mvn]   "core":""}
      [mvn] node props:{
      [mvn]   "base_url":"http://127.0.0.1:35538/solr",
      [mvn]   "core":""}
      [mvn] node props:{
      [mvn]   "base_url":"http://127.0.0.1:37985/solr",
      [mvn]   "core":""}
      [mvn] node props:{
      [mvn]   "base_url":"http://127.0.0.1:35538/solr",
      [mvn]   "core":""}
      [mvn] node props:{
      [mvn]   "base_url":"http://127.0.0.1:29406/solr",
      [mvn]   "core":""}
      [mvn] node props:{
      [mvn]   "base_url":"http://127.0.0.1:37985/solr",
      [mvn]   "core":""}
      [mvn] node props:{
      [mvn]   "base_url":"http://127.0.0.1:35538/solr",
      [mvn]   "core":""}
      [mvn] node props:{
      [mvn]   "base_url":"http://127.0.0.1:29406/solr",
      [mvn]   "core":""}
      [mvn] node props:{
      [mvn]   "base_url":"http://127.0.0.1:37985/solr",
      [mvn]   "core":""}
      [mvn] node props:{
      [mvn]   "base_url":"http://127.0.0.1:39776/solr",
      [mvn]   "core":""}
      [mvn] node props:{
      [mvn]   "base_url":"http://127.0.0.1:35538/solr",
      [mvn]   "core":""}
      [mvn] node props:{
      [mvn]   "base_url":"http://127.0.0.1:39776/solr",
      [mvn]   "core":""}
      [mvn] node props:{
      [mvn]   "base_url":"http://127.0.0.1:35538/solr",
      [mvn]   "core":""}
      [mvn] node props:{
      [mvn]   "base_url":"http://127.0.0.1:29406/solr",
      [mvn]   "core":""}
      [mvn] node props:{
      [mvn]   "base_url":"http://127.0.0.1:39776/solr",
      [mvn]   "core":""}
      [mvn] node props:{
      [mvn]   "base_url":"http://127.0.0.1:37985/solr",
      [mvn]   "core":""}
      [mvn] node props:{
      [mvn]   "base_url":"http://127.0.0.1:39776/solr",
      [mvn]   "core":""}
      [mvn] node props:{
      [mvn]   "base_url":"http://127.0.0.1:29406/solr",
      [mvn]   "core":""}
      [mvn] node props:{
      [mvn]   "base_url":"http://127.0.0.1:39776/solr",
      [mvn]   "core":""}
      [mvn] node props:{
      [mvn]   "base_url":"http://127.0.0.1:37985/solr",
      [mvn]   "core":""}
      [mvn] node props:{
      [mvn]   "base_url":"http://127.0.0.1:39776/solr",
      [mvn]   "core":""}
      [mvn] node props:{
      [mvn]   "base_url":"http://127.0.0.1:29406/solr",
      [mvn]   "core":""}
      [mvn] node props:{
      [mvn]   "base_url":"http://127.0.0.1:35538/solr",
      [mvn]   "core":""}
      [mvn] node props:{
      [mvn]   "base_url":"http://127.0.0.1:29406/solr",
      [mvn]   "core":""}
      [mvn] node props:{
      [mvn]   "base_url":"http://127.0.0.1:37985/solr",
      [mvn]   "core":""}
      [mvn] node props:{
      [mvn]   "base_url":"http://127.0.0.1:29406/solr",
      [mvn]   "core":""}
      [mvn] node props:{
      [mvn]   "base_url":"http://127.0.0.1:37985/solr",
      [mvn]   "core":""}
      [mvn] node props:{
      [mvn]   "base_url":"http://127.0.0.1:35538/solr",
      [mvn]   "core":""}
      [mvn] node props:{
      [mvn]   "base_url":"http://127.0.0.1:39776/solr",
      [mvn]   "core":""}
      [mvn] node props:{
      [mvn]   "base_url":"http://127.0.0.1:29406/solr",
      [mvn]   "core":""}
      [mvn] node props:{
      [mvn]   "base_url":"http://127.0.0.1:35538/solr",
      [mvn]   "core":""}
      [mvn] node props:{
      [mvn]   "base_url":"http://127.0.0.1:29406/solr",
      [mvn]   "core":""}
      [mvn] node props:{
      [mvn]   "base_url":"http://127.0.0.1:37985/solr",
      [mvn]   "core":""}
      [mvn] node props:{
      [mvn]   "base_url":"http://127.0.0.1:29406/solr",
      [mvn]   "core":""}
      [mvn] node props:{
      [mvn]   "base_url":"http://127.0.0.1:39776/solr",
      [mvn]   "core":""}
      [mvn] node props:{
      [mvn]   "base_url":"http://127.0.0.1:35538/solr",
      [mvn]   "core":""}
      [mvn] node props:{
      [mvn]   "base_url":"http://127.0.0.1:37985/solr",
      [mvn]   "core":""}
      [mvn] node props:{
      [mvn]   "base_url":"http://127.0.0.1:39776/solr",
      [mvn]   "core":""}
      [mvn] node props:{
      [mvn]   "base_url":"http://127.0.0.1:29406/solr",
      [mvn]   "core":""}
      [mvn] node props:{
      [mvn]   "base_url":"http://127.0.0.1:37985/solr",
      [mvn]   "core":""}
      [mvn] node props:{
      [mvn]   "base_url":"http://127.0.0.1:35538/solr",
      [mvn]   "core":""}
      [mvn] node props:{
      [mvn]   "base_url":"http://127.0.0.1:37985/solr",
      [mvn]   "core":""}
      [mvn] node props:{
      [mvn]   "base_url":"http://127.0.0.1:29406/solr",
      [mvn]   "core":""}
      [mvn] node props:{
      [mvn]   "base_url":"http://127.0.0.1:37985/solr",
      [mvn]   "core":""}
      [mvn] node props:{
      [mvn]   "base_url":"http://127.0.0.1:39776/solr",
      [mvn]   "core":""}
      [mvn] node props:{
      [mvn]   "base_url":"http://127.0.0.1:37985/solr",
      [mvn]   "core":""}
      [mvn] node props:{
      [mvn]   "base_url":"http://127.0.0.1:37985/solr",
      [mvn]   "core":""}
      [mvn] node props:{
      [mvn]   "base_url":"http://127.0.0.1:39776/solr",
      [mvn]   "core":""}
      [mvn] node props:{
      [mvn]   "base_url":"http://127.0.0.1:29406/solr",
      [mvn]   "core":""}
      [mvn] node props:{
      [mvn]   "base_url":"http://127.0.0.1:37985/solr",
      [mvn]   "core":""}
      [mvn] node props:{
      [mvn]   "base_url":"http://127.0.0.1:39776/solr",
      [mvn]   "core":""}
      [mvn] node props:{
      [mvn]   "base_url":"http://127.0.0.1:29406/solr",
      [mvn]   "core":""}
      [mvn] node props:{
      [mvn]   "base_url":"http://127.0.0.1:37985/solr",
      [mvn]   "core":""}
      [mvn] node props:{
      [mvn]   "base_url":"http://127.0.0.1:29406/solr",
      [mvn]   "core":""}
      [mvn] node props:{
      [mvn]   "base_url":"http://127.0.0.1:29406/solr",
      [mvn]   "core":""}
      [mvn] node props:{
      [mvn]   "base_url":"http://127.0.0.1:37985/solr",
      [mvn]   "core":""}
      [mvn] node props:{
      [mvn]   "base_url":"http://127.0.0.1:35538/solr",
      [mvn]   "core":""}
      [mvn] node props:{
      [mvn]   "base_url":"http://127.0.0.1:35538/solr",
      [mvn]   "core":""}
      [mvn] node props:{
      [mvn]   "base_url":"http://127.0.0.1:29406/solr",
      [mvn]   "core":""}
      [mvn] node props:{
      [mvn]   "base_url":"http://127.0.0.1:37985/solr",
      [mvn]   "core":""}
      [mvn] node props:{
      [mvn]   "base_url":"http://127.0.0.1:35538/solr",
      [mvn]   "core":""}
      [mvn] node props:{
      [mvn]   "base_url":"http://127.0.0.1:37985/solr",
      [mvn]   "core":""}
      [mvn] node props:{
      [mvn]   "base_url":"http://127.0.0.1:39776/solr",
      [mvn]   "core":""}
      [mvn] node props:{
      [mvn]   "base_url":"http://127.0.0.1:29406/solr",
      [mvn]   "core":""}
      [mvn] node props:{
      [mvn]   "base_url":"http://127.0.0.1:37985/solr",
      [mvn]   "core":""}
      [mvn] node props:{
      [mvn]   "base_url":"http://127.0.0.1:35538/solr",
      [mvn]   "core":""}
      [mvn] node props:{
      [mvn]   "base_url":"http://127.0.0.1:37985/solr",
      [mvn]   "core":""}
      [mvn] node props:{
      [mvn]   "base_url":"http://127.0.0.1:39776/solr",
      [mvn]   "core":""}
      [mvn] node props:{
      [mvn]   "base_url":"http://127.0.0.1:29406/solr",
      [mvn]   "core":""}
      [mvn] node props:{
      [mvn]   "base_url":"http://127.0.0.1:37985/solr",
      [mvn]   "core":""}
      [mvn] node props:{
      [mvn]   "base_url":"http://127.0.0.1:39776/solr",
      [mvn]   "core":""}
      [mvn] node props:{
      [mvn]   "base_url":"http://127.0.0.1:29406/solr",
      [mvn]   "core":""}
      [mvn] node props:{
      [mvn]   "base_url":"http://127.0.0.1:37985/solr",
      [mvn]   "core":""}
      [mvn] node props:{
      [mvn]   "base_url":"http://127.0.0.1:39776/solr",
      [mvn]   "core":""}
      [mvn] node props:{
      [mvn]   "base_url":"http://127.0.0.1:35538/solr",
      [mvn]   "core":""}
      [mvn] node props:{
      [mvn]   "base_url":"http://127.0.0.1:29406/solr",
      [mvn]   "core":""}
      [mvn] node props:{
      [mvn]   "base_url":"http://127.0.0.1:37985/solr",
      [mvn]   "core":""}
      [mvn] node props:{
      [mvn]   "base_url":"http://127.0.0.1:39776/solr",
      [mvn]   "core":""}
      [mvn] node props:{
      [mvn]   "base_url":"http://127.0.0.1:35538/solr",
      [mvn]   "core":""}
      [mvn] node props:{
      [mvn]   "base_url":"http://127.0.0.1:37985/solr",
      [mvn]   "core":""}
      [mvn] node props:{
      [mvn]   "base_url":"http://127.0.0.1:29406/solr",
      [mvn]   "core":""}
      [mvn] node props:{
      [mvn]   "base_url":"http://127.0.0.1:39776/solr",
      [mvn]   "core":""}
      [mvn] node props:{
      [mvn]   "base_url":"http://127.0.0.1:37985/solr",
      [mvn]   "core":""}
      [mvn] node props:{
      [mvn]   "base_url":"http://127.0.0.1:39776/solr",
      [mvn]   "core":""}
      [mvn] node props:{
      [mvn]   "base_url":"http://127.0.0.1:35538/solr",
      [mvn]   "core":""}
      [mvn] node props:{
      [mvn]   "base_url":"http://127.0.0.1:29406/solr",
      [mvn]   "core":""}
      [mvn] node props:{
      [mvn]   "base_url":"http://127.0.0.1:37985/solr",
      [mvn]   "core":""}
      [mvn] node props:{
      [mvn]   "base_url":"http://127.0.0.1:37985/solr",
      [mvn]   "core":""}
      [mvn] node props:{
      [mvn]   "base_url":"http://127.0.0.1:39776/solr",
      [mvn]   "core":""}
      [mvn] node props:{
      [mvn]   "base_url":"http://127.0.0.1:29406/solr",
      [mvn]   "core":""}
      [mvn] node props:{
      [mvn]   "base_url":"http://127.0.0.1:37985/solr",
      [mvn]   "core":""}
      [mvn] node props:{
      [mvn]   "base_url":"http://127.0.0.1:35538/solr",
      [mvn]   "core":""}
      [mvn] node props:{
      [mvn]   "base_url":"http://127.0.0.1:37985/solr",
      [mvn]   "core":""}
      [mvn] node props:{
      [mvn]   "base_url":"http://127.0.0.1:35538/solr",
      [mvn]   "core":""}
      [mvn] node props:{
      [mvn]   "base_url":"http://127.0.0.1:37985/solr",
      [mvn]   "core":""}
      [mvn] node props:{
      [mvn]   "base_url":"http://127.0.0.1:37985/solr",
      [mvn]   "core":""}
      [mvn] node props:{
      [mvn]   "base_url":"http://127.0.0.1:35538/solr",
      [mvn]   "core":""}
      [mvn] node props:{
      [mvn]   "base_url":"http://127.0.0.1:37985/solr",
      [mvn]   "core":""}
      [mvn] node props:{
      [mvn]   "base_url":"http://127.0.0.1:29406/solr",
      [mvn]   "core":""}
      [mvn] node props:{
      [mvn]   "base_url":"http://127.0.0.1:39776/solr",
      [mvn]   "core":""}
      [mvn] node props:{
      [mvn]   "base_url":"http://127.0.0.1:35538/solr",
      [mvn]   "core":""}
      [mvn] node props:{
      [mvn]   "base_url":"http://127.0.0.1:37985/solr",
      [mvn]   "core":""}
      [mvn] node props:{
      [mvn]   "base_url":"http://127.0.0.1:29406/solr",
      [mvn]   "core":""}
      [mvn] node props:{
      [mvn]   "base_url":"http://127.0.0.1:37985/solr",
      [mvn]   "core":""}
      [mvn] node props:{
      [mvn]   "base_url":"http://127.0.0.1:35538/solr",
      [mvn]   "core":""}
      [mvn] node props:{
      [mvn]   "base_url":"http://127.0.0.1:29406/solr",
      [mvn]   "core":""}
      [mvn] node props:{
      [mvn]   "base_url":"http://127.0.0.1:39776/solr",
      [mvn]   "core":""}
      [mvn] node props:{
      [mvn]   "base_url":"http://127.0.0.1:35538/solr",
      [mvn]   "core":""}
      [mvn] node props:{
      [mvn]   "base_url":"http://127.0.0.1:29406/solr",
      [mvn]   "core":""}
      [mvn] node props:{
      [mvn]   "base_url":"http://127.0.0.1:39776/solr",
      [mvn]   "core":""}
      [mvn] node props:{
      [mvn]   "base_url":"http://127.0.0.1:35538/solr",
      [mvn]   "core":""}
      [mvn] node props:{
      [mvn]   "base_url":"http://127.0.0.1:37985/solr",
      [mvn]   "core":""}
      [mvn] node props:{
      [mvn]   "base_url":"http://127.0.0.1:39776/solr",
      [mvn]   "core":""}
      [mvn] node props:{
      [mvn]   "base_url":"http://127.0.0.1:37985/solr",
      [mvn]   "core":""}
      [mvn] node props:{
      [mvn]   "base_url":"http://127.0.0.1:39776/solr",
      [mvn]   "core":""}
      [mvn] node props:{
      [mvn]   "base_url":"http://127.0.0.1:35538/solr",
      [mvn]   "core":""}
      [mvn] node props:{
      [mvn]   "base_url":"http://127.0.0.1:37985/solr",
      [mvn]   "core":""}
      [mvn] node props:{
      [mvn]   "base_url":"http://127.0.0.1:39776/solr",
      [mvn]   "core":""}
      [mvn] node props:{
      [mvn]   "base_url":"http://127.0.0.1:35538/solr",
      [mvn]   "core":""}
      [mvn] node props:{
      [mvn]   "base_url":"http://127.0.0.1:29406/solr",
      [mvn]   "core":""}
      [mvn] node props:{
      [mvn]   "base_url":"http://127.0.0.1:35538/solr",
      [mvn]   "core":""}
      [mvn] node props:{
      [mvn]   "base_url":"http://127.0.0.1:29406/solr",
      [mvn]   "core":""}
      [mvn] node props:{
      [mvn]   "base_url":"http://127.0.0.1:37985/solr",
      [mvn]   "core":""}
      [mvn] node props:{
      [mvn]   "base_url":"http://127.0.0.1:39776/solr",
      [mvn]   "core":""}
      [mvn] node props:{
      [mvn]   "base_url":"http://127.0.0.1:39776/solr",
      [mvn]   "core":""}
      [mvn] node props:{
      [mvn]   "base_url":"http://127.0.0.1:29406/solr",
      [mvn]   "core":""}
      [mvn] node props:{
      [mvn]   "base_url":"http://127.0.0.1:35538/solr",
      [mvn]   "core":""}
      [mvn] node props:{
      [mvn]   "base_url":"http://127.0.0.1:39776/solr",
      [mvn]   "core":""}
      [mvn] node props:{
      [mvn]   "base_url":"http://127.0.0.1:29406/solr",
      [mvn]   "core":""}
      [mvn] node props:{
      [mvn]   "base_url":"http://127.0.0.1:35538/solr",
      [mvn]   "core":""}
      [mvn] node props:{
      [mvn]   "base_url":"http://127.0.0.1:29406/solr",
      [mvn]   "core":""}
      [mvn] node props:{
      [mvn]   "base_url":"http://127.0.0.1:37985/solr",
      [mvn]   "core":""}
      [mvn] node props:{
      [mvn]   "base_url":"http://127.0.0.1:39776/solr",
      [mvn]   "core":""}
      [mvn] node props:{
      [mvn]   "base_url":"http://127.0.0.1:37985/solr",
      [mvn]   "core":""}
      [mvn] node props:{
      [mvn]   "base_url":"http://127.0.0.1:29406/solr",
      [mvn]   "core":""}
      [mvn] node props:{
      [mvn]   "base_url":"http://127.0.0.1:37985/solr",
      [mvn]   "core":""}
      [mvn] node props:{
      [mvn]   "base_url":"http://127.0.0.1:35538/solr",
      [mvn]   "core":""}
      [mvn] node props:{
      [mvn]   "base_url":"http://127.0.0.1:29406/solr",
      [mvn]   "core":""}
      [mvn] node props:{
      [mvn]   "base_url":"http://127.0.0.1:37985/solr",
      [mvn]   "core":""}
      [mvn] node props:{
      [mvn]   "base_url":"http://127.0.0.1:39776/solr",
      [mvn]   "core":""}
      [mvn] node props:{
      [mvn]   "base_url":"http://127.0.0.1:37985/solr",
      [mvn]   "core":""}
      [mvn] node props:{
      [mvn]   "base_url":"http://127.0.0.1:39776/solr",
      [mvn]   "core":""}
      [mvn] node props:{
      [mvn]   "base_url":"http://127.0.0.1:35538/solr",
      [mvn]   "core":""}
      [mvn] node props:{
      [mvn]   "base_url":"http://127.0.0.1:39776/solr",
      [mvn]   "core":""}
      [mvn] node props:{
      [mvn]   "base_url":"http://127.0.0.1:35538/solr",
      [mvn]   "core":""}
      [mvn] node props:{
      [mvn]   "base_url":"http://127.0.0.1:39776/solr",
      [mvn]   "core":""}
      [mvn] node props:{
      [mvn]   "base_url":"http://127.0.0.1:35538/solr",
      [mvn]   "core":""}
      [mvn] node props:{
      [mvn]   "base_url":"http://127.0.0.1:29406/solr",
      [mvn]   "core":""}
      [mvn] node props:{
      [mvn]   "base_url":"http://127.0.0.1:39776/solr",
      [mvn]   "core":""}
      [mvn] node props:{
      [mvn]   "base_url":"http://127.0.0.1:37985/solr",
      [mvn]   "core":""}
      [mvn] node props:{
      [mvn]   "base_url":"http://127.0.0.1:35538/solr",
      [mvn]   "core":""}
      [mvn] node props:{
      [mvn]   "base_url":"http://127.0.0.1:29406/solr",
      [mvn]   "core":""}
      [mvn] node props:{
      [mvn]   "base_url":"http://127.0.0.1:37985/solr",
      [mvn]   "core":""}
      [mvn] node props:{
      [mvn]   "base_url":"http://127.0.0.1:39776/solr",
      [mvn]   "core":""}
      [mvn] node props:{
      [mvn]   "base_url":"http://127.0.0.1:35538/solr",
      [mvn]   "core":""}
      [mvn] node props:{
      [mvn]   "base_url":"http://127.0.0.1:29406/solr",
      [mvn]   "core":""}
      [mvn] node props:{
      [mvn]   "base_url":"http://127.0.0.1:37985/solr",
      [mvn]   "core":""}
      [mvn] node props:{
      [mvn]   "base_url":"http://127.0.0.1:35538/solr",
      [mvn]   "core":""}
      [mvn] node props:{
      [mvn]   "base_url":"http://127.0.0.1:29406/solr",
      [mvn]   "core":""}
      [mvn] node props:{
      [mvn]   "base_url":"http://127.0.0.1:37985/solr",
      [mvn]   "core":""}
      [mvn] node props:{
      [mvn]   "base_url":"http://127.0.0.1:37985/solr",
      [mvn]   "core":""}
      [mvn] node props:{
      [mvn]   "base_url":"http://127.0.0.1:35538/solr",
      [mvn]   "core":""}
      [mvn] node props:{
      [mvn]   "base_url":"http://127.0.0.1:37985/solr",
      [mvn]   "core":""}
      [mvn] node props:{
      [mvn]   "base_url":"http://127.0.0.1:35538/solr",
      [mvn]   "core":""}
      [mvn] node props:{
      [mvn]   "base_url":"http://127.0.0.1:29406/solr",
      [mvn]   "core":""}
      [mvn] node props:{
      [mvn]   "base_url":"http://127.0.0.1:35538/solr",
      [mvn]   "core":""}
      [mvn] node props:{
      [mvn]   "base_url":"http://127.0.0.1:29406/solr",
      [mvn]   "core":""}
      [mvn] node props:{
      [mvn]   "base_url":"http://127.0.0.1:39776/solr",
      [mvn]   "core":""}
      [mvn] node props:{
      [mvn]   "base_url":"http://127.0.0.1:35538/solr",
      [mvn]   "core":""}
      [mvn] node props:{
      [mvn]   "base_url":"http://127.0.0.1:37985/solr",
      [mvn]   "core":""}
      [mvn] node props:{
      [mvn]   "base_url":"http://127.0.0.1:39776/solr",
      [mvn]   "core":""}
      [mvn] node props:{
      [mvn]   "base_url":"http://127.0.0.1:29406/solr",
      [mvn]   "core":""}
      [mvn] node props:{
      [mvn]   "base_url":"http://127.0.0.1:39776/solr",
      [mvn]   "core":""}
      [mvn] node props:{
      [mvn]   "base_url":"http://127.0.0.1:35538/solr",
      [mvn]   "core":""}
      [mvn] node props:{
      [mvn]   "base_url":"http://127.0.0.1:29406/solr",
      [mvn]   "core":""}
      [mvn] node props:{
      [mvn]   "base_url":"http://127.0.0.1:35538/solr",
      [mvn]   "core":""}
      [mvn] node props:{
      [mvn]   "base_url":"http://127.0.0.1:29406/solr",
      [mvn]   "core":""}
      [mvn] node props:{
      [mvn]   "base_url":"http://127.0.0.1:37985/solr",
      [mvn]   "core":""}
      [mvn] node props:{
      [mvn]   "base_url":"http://127.0.0.1:35538/solr",
      [mvn]   "core":""}
      [mvn] node props:{
      [mvn]   "base_url":"http://127.0.0.1:29406/solr",
      [mvn]   "core":""}
      [mvn] node props:{
      [mvn]   "base_url":"http://127.0.0.1:39776/solr",
      [mvn]   "core":""}
      [mvn] node props:{
      [mvn]   "base_url":"http://127.0.0.1:35538/solr",
      [mvn]   "core":""}
      [mvn] node props:{
      [mvn]   "base_url":"http://127.0.0.1:35538/solr",
      [mvn]   "core":""}
      [mvn] node props:{
      [mvn]   "base_url":"http://127.0.0.1:29406/solr",
      [mvn]   "core":""}
      [mvn] node props:{
      [mvn]   "base_url":"http://127.0.0.1:37985/solr",
      [mvn]   "core":""}
      [mvn] node props:{
      [mvn]   "base_url":"http://127.0.0.1:39776/solr",
      [mvn]   "core":""}
      [mvn] node props:{
      [mvn]   "base_url":"http://127.0.0.1:35538/solr",
      [mvn]   "core":""}
      [mvn] node props:{
      [mvn]   "base_url":"http://127.0.0.1:37985/solr",
      [mvn]   "core":""}
      [mvn] node props:{
      [mvn]   "base_url":"http://127.0.0.1:29406/solr",
      [mvn]   "core":""}
      [mvn] node props:{
      [mvn]   "base_url":"http://127.0.0.1:37985/solr",
      [mvn]   "core":""}
      [mvn] node props:{
      [mvn]   "base_url":"http://127.0.0.1:35538/solr",
      [mvn]   "core":""}
      [mvn] node props:{
      [mvn]   "base_url":"http://127.0.0.1:39776/solr",
      [mvn]   "core":""}
      [mvn] node props:{
      [mvn]   "base_url":"http://127.0.0.1:35538/solr",
      [mvn]   "core":""}
      [mvn] node props:{
      [mvn]   "base_url":"http://127.0.0.1:35538/solr",
      [mvn]   "core":""}
      [mvn] node props:{
      [mvn]   "base_url":"http://127.0.0.1:29406/solr",
      [mvn]   "core":""}
      [mvn] node props:{
      [mvn]   "base_url":"http://127.0.0.1:29406/solr",
      [mvn]   "core":""}
      [mvn] node props:{
      [mvn]   "base_url":"http://127.0.0.1:39776/solr",
      [mvn]   "core":""}
      [mvn] node props:{
      [mvn]   "base_url":"http://127.0.0.1:29406/solr",
      [mvn]   "core":""}
      [mvn] node props:{
      [mvn]   "base_url":"http://127.0.0.1:37985/solr",
      [mvn]   "core":""}
      [mvn] node props:{
      [mvn]   "base_url":"http://127.0.0.1:35538/solr",
      [mvn]   "core":""}
      [mvn] node props:{
      [mvn]   "base_url":"http://127.0.0.1:37985/solr",
      [mvn]   "core":""}
      [mvn] node props:{
      [mvn]   "base_url":"http://127.0.0.1:39776/solr",
      [mvn]   "core":""}
      [mvn] node props:{
      [mvn]   "base_url":"http://127.0.0.1:29406/solr",
      [mvn]   "core":""}
      [mvn] node props:{
      [mvn]   "base_url":"http://127.0.0.1:37985/solr",
      [mvn]   "core":""}
      [mvn] node props:{
      [mvn]   "base_url":"http://127.0.0.1:39776/solr",
      [mvn]   "core":""}
      [mvn] node props:{
      [mvn]   "base_url":"http://127.0.0.1:37985/solr",
      [mvn]   "core":""}
      [mvn] node props:{
      [mvn]   "base_url":"http://127.0.0.1:35538/solr",
      [mvn]   "core":""}
      [mvn] node props:{
      [mvn]   "base_url":"http://127.0.0.1:29406/solr",
      [mvn]   "core":""}
      [mvn] node props:{
      [mvn]   "base_url":"http://127.0.0.1:39776/solr",
      [mvn]   "core":""}
      [mvn] node props:{
      [mvn]   "base_url":"http://127.0.0.1:35538/solr",
      [mvn]   "core":""}
      [mvn] node props:{
      [mvn]   "base_url":"http://127.0.0.1:29406/solr",
      [mvn]   "core":""}
      [mvn] node props:{
      [mvn]   "base_url":"http://127.0.0.1:37985/solr",
      [mvn]   "core":""}
      [mvn] node props:{
      [mvn]   "base_url":"http://127.0.0.1:35538/solr",
      [mvn]   "core":""}
      [mvn] node props:{
      [mvn]   "base_url":"http://127.0.0.1:29406/solr",
      [mvn]   "core":""}
      [mvn] node props:{
      [mvn]   "base_url":"http://127.0.0.1:39776/solr",
      [mvn]   "core":""}
      [mvn] node props:{
      [mvn]   "base_url":"http://127.0.0.1:37985/solr",
      [mvn]   "core":""}
      [mvn] node props:{
      [mvn]   "base_url":"http://127.0.0.1:39776/solr",
      [mvn]   "core":""}
      [mvn] node props:{
      [mvn]   "base_url":"http://127.0.0.1:39776/solr",
      [mvn]   "core":""}
      [mvn] node props:{
      [mvn]   "base_url":"http://127.0.0.1:39776/solr",
      [mvn]   "core":""}
      [mvn] node props:{
      [mvn]   "base_url":"http://127.0.0.1:35538/solr",
      [mvn]   "core":""}
      [mvn] node props:{
      [mvn]   "base_url":"http://127.0.0.1:29406/solr",
      [mvn]   "core":""}
      [mvn] node props:{
      [mvn]   "base_url":"http://127.0.0.1:37985/solr",
      [mvn]   "core":""}
      [mvn] node props:{
      [mvn]   "base_url":"http://127.0.0.1:29406/solr",
      [mvn]   "core":""}
      [mvn] node props:{
      [mvn]   "base_url":"http://127.0.0.1:37985/solr",
      [mvn]   "core":""}
      [mvn] node props:{
      [mvn]   "base_url":"http://127.0.0.1:37985/solr",
      [mvn]   "core":""}
      [mvn] node props:{
      [mvn]   "base_url":"http://127.0.0.1:35538/solr",
      [mvn]   "core":""}
      [mvn] node props:{
      [mvn]   "base_url":"http://127.0.0.1:29406/solr",
      [mvn]   "core":""}
      [mvn] node props:{
      [mvn]   "base_url":"http://127.0.0.1:35538/solr",
      [mvn]   "core":""}
      [mvn] node props:{
      [mvn]   "base_url":"http://127.0.0.1:29406/solr",
      [mvn]   "core":""}
      [mvn] node props:{
      [mvn]   "base_url":"http://127.0.0.1:37985/solr",
      [mvn]   "core":""}
      [mvn] node props:{
      [mvn]   "base_url":"http://127.0.0.1:39776/solr",
      [mvn]   "core":""}
      [mvn] node props:{
      [mvn]   "base_url":"http://127.0.0.1:35538/solr",
      [mvn]   "core":""}
      [mvn] node props:{
      [mvn]   "base_url":"http://127.0.0.1:39776/solr",
      [mvn]   "core":""}
      [mvn] node props:{
      [mvn]   "base_url":"http://127.0.0.1:37985/solr",
      [mvn]   "core":""}
      [mvn] node props:{
      [mvn]   "base_url":"http://127.0.0.1:39776/solr",
      [mvn]   "core":""}
      [mvn] node props:{
      [mvn]   "base_url":"http://127.0.0.1:35538/solr",
      [mvn]   "core":""}
      [mvn] node props:{
      [mvn]   "base_url":"http://127.0.0.1:29406/solr",
      [mvn]   "core":""}
      [mvn] node props:{
      [mvn]   "base_url":"http://127.0.0.1:35538/solr",
      [mvn]   "core":""}
      [mvn] node props:{
      [mvn]   "base_url":"http://127.0.0.1:37985/solr",
      [mvn]   "core":""}
      [mvn] node props:{
      [mvn]   "base_url":"http://127.0.0.1:35538/solr",
      [mvn]   "core":""}
      [mvn] node props:{
      [mvn]   "base_url":"http://127.0.0.1:37985/solr",
      [mvn]   "core":""}
      [mvn] node props:{
      [mvn]   "base_url":"http://127.0.0.1:35538/solr",
      [mvn]   "core":""}
      [mvn] node props:{
      [mvn]   "base_url":"http://127.0.0.1:37985/solr",
      [mvn]   "core":""}
      [mvn] node props:{
      [mvn]   "base_url":"http://127.0.0.1:37985/solr",
      [mvn]   "core":""}
      [mvn] node props:{
      [mvn]   "base_url":"http://127.0.0.1:35538/solr",
      [mvn]   "core":""}
      [mvn] node props:{
      [mvn]   "base_url":"http://127.0.0.1:29406/solr",
      [mvn]   "core":""}
      [mvn] node props:{
      [mvn]   "base_url":"http://127.0.0.1:29406/solr",
      [mvn]   "core":""}
      [mvn] node props:{
      [mvn]   "base_url":"http://127.0.0.1:37985/solr",
      [mvn]   "core":""}
      [mvn] node props:{
      [mvn]   "base_url":"http://127.0.0.1:29406/solr",
      [mvn]   "core":""}
      [mvn] node props:{
      [mvn]   "base_url":"http://127.0.0.1:37985/solr",
      [mvn]   "core":""}
      [mvn] node props:{
      [mvn]   "base_url":"http://127.0.0.1:39776/solr",
      [mvn]   "core":""}
      [mvn] node props:{
      [mvn]   "base_url":"http://127.0.0.1:29406/solr",
      [mvn]   "core":""}
      [mvn] node props:{
      [mvn]   "base_url":"http://127.0.0.1:37985/solr",
      [mvn]   "core":""}
      [mvn] node props:{
      [mvn]   "base_url":"http://127.0.0.1:35538/solr",
      [mvn]   "core":""}
      [mvn] node props:{
      [mvn]   "base_url":"http://127.0.0.1:29406/solr",
      [mvn]   "core":""}
      [mvn] node props:{
      [mvn]   "base_url":"http://127.0.0.1:39776/solr",
      [mvn]   "core":""}
      [mvn] node props:{
      [mvn]   "base_url":"http://127.0.0.1:37985/solr",
      [mvn]   "core":""}
      [mvn] node props:{
      [mvn]   "base_url":"http://127.0.0.1:35538/solr",
      [mvn]   "core":""}
      [mvn] node props:{
      [mvn]   "base_url":"http://127.0.0.1:37985/solr",
      [mvn]   "core":""}
      [mvn] node props:{
      [mvn]   "base_url":"http://127.0.0.1:29406/solr",
      [mvn]   "core":""}
      [mvn] node props:{
      [mvn]   "base_url":"http://127.0.0.1:37985/solr",
      [mvn]   "core":""}
      [mvn] node props:{
      [mvn]   "base_url":"http://127.0.0.1:39776/solr",
      [mvn]   "core":""}
      [mvn] node props:{
      [mvn]   "base_url":"http://127.0.0.1:35538/solr",
      [mvn]   "core":""}
      [mvn] node props:{
      [mvn]   "base_url":"http://127.0.0.1:29406/solr",
      [mvn]   "core":""}
      [mvn] node props:{
      [mvn]   "base_url":"http://127.0.0.1:37985/solr",
      [mvn]   "core":""}
      [mvn] node props:{
      [mvn]   "base_url":"http://127.0.0.1:39776/solr",
      [mvn]   "core":""}
      [mvn] node props:{
      [mvn]   "base_url":"http://127.0.0.1:37985/solr",
      [mvn]   "core":""}
      [mvn] node props:{
      [mvn]   "base_url":"http://127.0.0.1:39776/solr",
      [mvn]   "core":""}
      [mvn] node props:{
      [mvn]   "base_url":"http://127.0.0.1:35538/solr",
      [mvn]   "core":""}
      [mvn] node props:{
      [mvn]   "base_url":"http://127.0.0.1:29406/solr",
      [mvn]   "core":""}
      [mvn] node props:{
      [mvn]   "base_url":"http://127.0.0.1:29406/solr",
      [mvn]   "core":""}
      [mvn] node props:{
      [mvn]   "base_url":"http://127.0.0.1:37985/solr",
      [mvn]   "core":""}
      [mvn] node props:{
      [mvn]   "base_url":"http://127.0.0.1:35538/solr",
      [mvn]   "core":""}
      [mvn] node props:{
      [mvn]   "base_url":"http://127.0.0.1:29406/solr",
      [mvn]   "core":""}
      [mvn] node props:{
      [mvn]   "base_url":"http://127.0.0.1:35538/solr",
      [mvn]   "core":""}
      [mvn] node props:{
      [mvn]   "base_url":"http://127.0.0.1:29406/solr",
      [mvn]   "core":""}
      [mvn] node props:{
      [mvn]   "base_url":"http://127.0.0.1:39776/solr",
      [mvn]   "core":""}
      [mvn] node props:{
      [mvn]   "base_url":"http://127.0.0.1:29406/solr",
      [mvn]   "core":""}
      [mvn] node props:{
      [mvn]   "base_url":"http://127.0.0.1:37985/solr",
      [mvn]   "core":""}
      [mvn] node props:{
      [mvn]   "base_url":"http://127.0.0.1:29406/solr",
      [mvn]   "core":""}
      [mvn] node props:{
      [mvn]   "base_url":"http://127.0.0.1:37985/solr",
      [mvn]   "core":""}
      [mvn] node props:{
      [mvn]   "base_url":"http://127.0.0.1:37985/solr",
      [mvn]   "core":""}
      [mvn] node props:{
      [mvn]   "base_url":"http://127.0.0.1:39776/solr",
      [mvn]   "core":""}
      [mvn] node props:{
      [mvn]   "base_url":"http://127.0.0.1:35538/solr",
      [mvn]   "core":""}
      [mvn] node props:{
      [mvn]   "base_url":"http://127.0.0.1:29406/solr",
      [mvn]   "core":""}
      [mvn] node props:{
      [mvn]   "base_url":"http://127.0.0.1:37985/solr",
      [mvn]   "core":""}
      [mvn] node props:{
      [mvn]   "base_url":"http://127.0.0.1:35538/solr",
      [mvn]   "core":""}
      [mvn] node props:{
      [mvn]   "base_url":"http://127.0.0.1:29406/solr",
      [mvn]   "core":""}
      [mvn] node props:{
      [mvn]   "base_url":"http://127.0.0.1:39776/solr",
      [mvn]   "core":""}
      [mvn] node props:{
      [mvn]   "base_url":"http://127.0.0.1:37985/solr",
      [mvn]   "core":""}
      [mvn] node props:{
      [mvn]   "base_url":"http://127.0.0.1:39776/solr",
      [mvn]   "core":""}
      [mvn] node props:{
      [mvn]   "base_url":"http://127.0.0.1:35538/solr",
      [mvn]   "core":""}
      [mvn] node props:{
      [mvn]   "base_url":"http://127.0.0.1:37985/solr",
      [mvn]   "core":""}
      [mvn] node props:{
      [mvn]   "base_url":"http://127.0.0.1:37985/solr",
      [mvn]   "core":""}
      [mvn] node props:{
      [mvn]   "base_url":"http://127.0.0.1:39776/solr",
      [mvn]   "core":""}
      [mvn] node props:{
      [mvn]   "base_url":"http://127.0.0.1:37985/solr",
      [mvn]   "core":""}
      [mvn] node props:{
      [mvn]   "base_url":"http://127.0.0.1:29406/solr",
      [mvn]   "core":""}
      [mvn] node props:{
      [mvn]   "base_url":"http://127.0.0.1:37985/solr",
      [mvn]   "core":""}
      [mvn] node props:{
      [mvn]   "base_url":"http://127.0.0.1:39776/solr",
      [mvn]   "core":""}
      [mvn] node props:{
      [mvn]   "base_url":"http://127.0.0.1:35538/solr",
      [mvn]   "core":""}
      [mvn] node props:{
      [mvn]   "base_url":"http://127.0.0.1:35538/solr",
      [mvn]   "core":""}
      [mvn] node props:{
      [mvn]   "base_url":"http://127.0.0.1:37985/solr",
      [mvn]   "core":""}
      [mvn] node props:{
      [mvn]   "base_url":"http://127.0.0.1:35538/solr",
      [mvn]   "core":""}
      [mvn] node props:{
      [mvn]   "base_url":"http://127.0.0.1:37985/solr",
      [mvn]   "core":""}
      [mvn] node props:{
      [mvn]   "base_url":"http://127.0.0.1:39776/solr",
      [mvn]   "core":""}
      [mvn] node props:{
      [mvn]   "base_url":"http://127.0.0.1:29406/solr",
      [mvn]   "core":""}
      [mvn] node props:{
      [mvn]   "base_url":"http://127.0.0.1:39776/solr",
      [mvn]   "core":""}
      [mvn] node props:{
      [mvn]   "base_url":"http://127.0.0.1:29406/solr",
      [mvn]   "core":""}
      [mvn] node props:{
      [mvn]   "base_url":"http://127.0.0.1:37985/solr",
      [mvn]   "core":""}
      [mvn] node props:{
      [mvn]   "base_url":"http://127.0.0.1:39776/solr",
      [mvn]   "core":""}
      [mvn] node props:{
      [mvn]   "base_url":"http://127.0.0.1:35538/solr",
      [mvn]   "core":""}
      [mvn] node props:{
      [mvn]   "base_url":"http://127.0.0.1:37985/solr",
      [mvn]   "core":""}
      [mvn] node props:{
      [mvn]   "base_url":"http://127.0.0.1:39776/solr",
      [mvn]   "core":""}
      [mvn] node props:{
      [mvn]   "base_url":"http://127.0.0.1:35538/solr",
      [mvn]   "core":""}
      [mvn] node props:{
      [mvn]   "base_url":"http://127.0.0.1:29406/solr",
      [mvn]   "core":""}
      [mvn] node props:{
      [mvn]   "base_url":"http://127.0.0.1:37985/solr",
      [mvn]   "core":""}
      [mvn] node props:{
      [mvn]   "base_url":"http://127.0.0.1:39776/solr",
      [mvn]   "core":""}
      [mvn] node props:{
      [mvn]   "base_url":"http://127.0.0.1:35538/solr",
      [mvn]   "core":""}
      [mvn] node props:{
      [mvn]   "base_url":"http://127.0.0.1:37985/solr",
      [mvn]   "core":""}
      [mvn] node props:{
      [mvn]   "base_url":"http://127.0.0.1:35538/solr",
      [mvn]   "core":""}
      [mvn] node props:{
      [mvn]   "base_url":"http://127.0.0.1:29406/solr",
      [mvn]   "core":""}
      [mvn] node props:{
      [mvn]   "base_url":"http://127.0.0.1:39776/solr",
      [mvn]   "core":""}
      [mvn] node props:{
      [mvn]   "base_url":"http://127.0.0.1:39776/solr",
      [mvn]   "core":""}
      [mvn] node props:{
      [mvn]   "base_url":"http://127.0.0.1:29406/solr",
      [mvn]   "core":""}
      [mvn] node props:{
      [mvn]   "base_url":"http://127.0.0.1:37985/solr",
      [mvn]   "core":""}
      [mvn] node props:{
      [mvn]   "base_url":"http://127.0.0.1:39776/solr",
      [mvn]   "core":""}
      [mvn] node props:{
      [mvn]   "base_url":"http://127.0.0.1:35538/solr",
      [mvn]   "core":""}
      [mvn] node props:{
      [mvn]   "base_url":"http://127.0.0.1:35538/solr",
      [mvn]   "core":""}
      [mvn] node props:{
      [mvn]   "base_url":"http://127.0.0.1:29406/solr",
      [mvn]   "core":""}
      [mvn] node props:{
      [mvn]   "base_url":"http://127.0.0.1:35538/solr",
      [mvn]   "core":""}
      [mvn] node props:{
      [mvn]   "base_url":"http://127.0.0.1:39776/solr",
      [mvn]   "core":""}
      [mvn] node props:{
      [mvn]   "base_url":"http://127.0.0.1:29406/solr",
      [mvn]   "core":""}
      [mvn] node props:{
      [mvn]   "base_url":"http://127.0.0.1:37985/solr",
      [mvn]   "core":""}
      [mvn] node props:{
      [mvn]   "base_url":"http://127.0.0.1:39776/solr",
      [mvn]   "core":""}
      [mvn] node props:{
      [mvn]   "base_url":"http://127.0.0.1:35538/solr",
      [mvn]   "core":""}
      [mvn] node props:{
      [mvn]   "base_url":"http://127.0.0.1:37985/solr",
      [mvn]   "core":""}
      [mvn] node props:{
      [mvn]   "base_url":"http://127.0.0.1:39776/solr",
      [mvn]   "core":""}
      [mvn] node props:{
      [mvn]   "base_url":"http://127.0.0.1:29406/solr",
      [mvn]   "core":""}
      [mvn] node props:{
      [mvn]   "base_url":"http://127.0.0.1:37985/solr",
      [mvn]   "core":""}
      [mvn] node props:{
      [mvn]   "base_url":"http://127.0.0.1:39776/solr",
      [mvn]   "core":""}
      [mvn] node props:{
      [mvn]   "base_url":"http://127.0.0.1:37985/solr",
      [mvn]   "core":""}
      [mvn] node props:{
      [mvn]   "base_url":"http://127.0.0.1:39776/solr",
      [mvn]   "core":""}
      [mvn] node props:{
      [mvn]   "base_url":"http://127.0.0.1:35538/solr",
      [mvn]   "core":""}
      [mvn] node props:{
      [mvn]   "base_url":"http://127.0.0.1:29406/solr",
      [mvn]   "core":""}
      [mvn] node props:{
      [mvn]   "base_url":"http://127.0.0.1:37985/solr",
      [mvn]   "core":""}
      [mvn] node props:{
      [mvn]   "base_url":"http://127.0.0.1:39776/solr",
      [mvn]   "core":""}
      [mvn] node props:{
      [mvn]   "base_url":"http://127.0.0.1:35538/solr",
      [mvn]   "core":""}
      [mvn] node props:{
      [mvn]   "base_url":"http://127.0.0.1:29406/solr",
      [mvn]   "core":""}
      [mvn] node props:{
      [mvn]   "base_url":"http://127.0.0.1:37985/solr",
      [mvn]   "core":""}
      [mvn] node props:{
      [mvn]   "base_url":"http://127.0.0.1:35538/solr",
      [mvn]   "core":""}
      [mvn] node props:{
      [mvn]   "base_url":"http://127.0.0.1:29406/solr",
      [mvn]   "core":""}
      [mvn] node props:{
      [mvn]   "base_url":"http://127.0.0.1:39776/solr",
      [mvn]   "core":""}
      [mvn] node props:{
      [mvn]   "base_url":"http://127.0.0.1:35538/solr",
      [mvn]   "core":""}
      [mvn] node props:{
      [mvn]   "base_url":"http://127.0.0.1:35538/solr",
      [mvn]   "core":""}
      [mvn] node props:{
      [mvn]   "base_url":"http://127.0.0.1:29406/solr",
      [mvn]   "core":""}
      [mvn] node props:{
      [mvn]   "base_url":"http://127.0.0.1:39776/solr",
      [mvn]   "core":""}
      [mvn] node props:{
      [mvn]   "base_url":"http://127.0.0.1:35538/solr",
      [mvn]   "core":""}
      [mvn] node props:{
      [mvn]   "base_url":"http://127.0.0.1:29406/solr",
      [mvn]   "core":""}
      [mvn] node props:{
      [mvn]   "base_url":"http://127.0.0.1:39776/solr",
      [mvn]   "core":""}
      [mvn] node props:{
      [mvn]   "base_url":"http://127.0.0.1:35538/solr",
      [mvn]   "core":""}
      [mvn] node props:{
      [mvn]   "base_url":"http://127.0.0.1:29406/solr",
      [mvn]   "core":""}
      [mvn] node props:{
      [mvn]   "base_url":"http://127.0.0.1:39776/solr",
      [mvn]   "core":""}
      [mvn] node props:{
      [mvn]   "base_url":"http://127.0.0.1:39776/solr",
      [mvn]   "core":""}
      [mvn] node props:{
      [mvn]   "base_url":"http://127.0.0.1:29406/solr",
      [mvn]   "core":""}
      [mvn] node props:{
      [mvn]   "base_url":"http://127.0.0.1:39776/solr",
      [mvn]   "core":""}
      [mvn] node props:{
      [mvn]   "base_url":"http://127.0.0.1:29406/solr",
      [mvn]   "core":""}
      [mvn] node props:{
      [mvn]   "base_url":"http://127.0.0.1:35538/solr",
      [mvn]   "core":""}
      [mvn] node props:{
      [mvn]   "base_url":"http://127.0.0.1:29406/solr",
      [mvn]   "core":""}
      [mvn] node props:{
      [mvn]   "base_url":"http://127.0.0.1:39776/solr",
      [mvn]   "core":""}
      [mvn] node props:{
      [mvn]   "base_url":"http://127.0.0.1:35538/solr",
      [mvn]   "core":""}
      [mvn] node props:{
      [mvn]   "base_url":"http://127.0.0.1:35538/solr",
      [mvn]   "core":""}
      [mvn] node props:{
      [mvn]   "base_url":"http://127.0.0.1:29406/solr",
      [mvn]   "core":""}
      [mvn] node props:{
      [mvn]   "base_url":"http://127.0.0.1:37985/solr",
      [mvn]   "core":""}
      [mvn] node props:{
      [mvn]   "base_url":"http://127.0.0.1:29406/solr",
      [mvn]   "core":""}
      [mvn] node props:{
      [mvn]   "base_url":"http://127.0.0.1:29406/solr",
      [mvn]   "core":""}
      [mvn] node props:{
      [mvn]   "base_url":"http://127.0.0.1:37985/solr",
      [mvn]   "core":""}
      [mvn] node props:{
      [mvn]   "base_url":"http://127.0.0.1:35538/solr",
      [mvn]   "core":""}
      [mvn] node props:{
      [mvn]   "base_url":"http://127.0.0.1:29406/solr",
      [mvn]   "core":""}
      [mvn] node props:{
      [mvn]   "base_url":"http://127.0.0.1:37985/solr",
      [mvn]   "core":""}
      [mvn] node props:{
      [mvn]   "base_url":"http://127.0.0.1:39776/solr",
      [mvn]   "core":""}
      [mvn] node props:{
      [mvn]   "base_url":"http://127.0.0.1:35538/solr",
      [mvn]   "core":""}
      [mvn] node props:{
      [mvn]   "base_url":"http://127.0.0.1:37985/solr",
      [mvn]   "core":""}
      [mvn] node props:{
      [mvn]   "base_url":"http://127.0.0.1:35538/solr",
      [mvn]   "core":""}
      [mvn] node props:{
      [mvn]   "base_url":"http://127.0.0.1:29406/solr",
      [mvn]   "core":""}
      [mvn] node props:{
      [mvn]   "base_url":"http://127.0.0.1:37985/solr",
      [mvn]   "core":""}
      [mvn] node props:{
      [mvn]   "base_url":"http://127.0.0.1:39776/solr",
      [mvn]   "core":""}
      [mvn] node props:{
      [mvn]   "base_url":"http://127.0.0.1:35538/solr",
      [mvn]   "core":""}
      [mvn] node props:{
      [mvn]   "base_url":"http://127.0.0.1:37985/solr",
      [mvn]   "core":""}
      [mvn] node props:{
      [mvn]   "base_url":"http://127.0.0.1:35538/solr",
      [mvn]   "core":""}
      [mvn] node props:{
      [mvn]   "base_url":"http://127.0.0.1:37985/solr",
      [mvn]   "core":""}
      [mvn] node props:{
      [mvn]   "base_url":"http://127.0.0.1:39776/solr",
      [mvn]   "core":""}
      [mvn] node props:{
      [mvn]   "base_url":"http://127.0.0.1:35538/solr",
      [mvn]   "core":""}
      [mvn] node props:{
      [mvn]   "base_url":"http://127.0.0.1:29406/solr",
      [mvn]   "core":""}
      [mvn] node props:{
      [mvn]   "base_url":"http://127.0.0.1:29406/solr",
      [mvn]   "core":""}
      [mvn] node props:{
      [mvn]   "base_url":"http://127.0.0.1:39776/solr",
      [mvn]   "core":""}
      [mvn] node props:{
      [mvn]   "base_url":"http://127.0.0.1:35538/solr",
      [mvn]   "core":""}
      [mvn] node props:{
      [mvn]   "base_url":"http://127.0.0.1:39776/solr",
      [mvn]   "core":""}
      [mvn] node props:{
      [mvn]   "base_url":"http://127.0.0.1:35538/solr",
      [mvn]   "core":""}
      [mvn] node props:{
      [mvn]   "base_url":"http://127.0.0.1:29406/solr",
      [mvn]   "core":""}
      [mvn] node props:{
      [mvn]   "base_url":"http://127.0.0.1:37985/solr",
      [mvn]   "core":""}
      [mvn] node props:{
      [mvn]   "base_url":"http://127.0.0.1:35538/solr",
      [mvn]   "core":""}
      [mvn] node props:{
      [mvn]   "base_url":"http://127.0.0.1:39776/solr",
      [mvn]   "core":""}
      [mvn] node props:{
      [mvn]   "base_url":"http://127.0.0.1:35538/solr",
      [mvn]   "core":""}
      [mvn] node props:{
      [mvn]   "base_url":"http://127.0.0.1:29406/solr",
      [mvn]   "core":""}
      [mvn] node props:{
      [mvn]   "base_url":"http://127.0.0.1:37985/solr",
      [mvn]   "core":""}
      [mvn] node props:{
      [mvn]   "base_url":"http://127.0.0.1:39776/solr",
      [mvn]   "core":""}
      [mvn] node props:{
      [mvn]   "base_url":"http://127.0.0.1:35538/solr",
      [mvn]   "core":""}
      [mvn] node props:{
      [mvn]   "base_url":"http://127.0.0.1:39776/solr",
      [mvn]   "core":""}
      [mvn] node props:{
      [mvn]   "base_url":"http://127.0.0.1:29406/solr",
      [mvn]   "core":""}
      [mvn] node props:{
      [mvn]   "base_url":"http://127.0.0.1:39776/solr",
      [mvn]   "core":""}
      [mvn] node props:{
      [mvn]   "base_url":"http://127.0.0.1:35538/solr",
      [mvn]   "core":""}
      [mvn] node props:{
      [mvn]   "base_url":"http://127.0.0.1:29406/solr",
      [mvn]   "core":""}
      [mvn] node props:{
      [mvn]   "base_url":"http://127.0.0.1:39776/solr",
      [mvn]   "core":""}
      [mvn] node props:{
      [mvn]   "base_url":"http://127.0.0.1:35538/solr",
      [mvn]   "core":""}
      [mvn] node props:{
      [mvn]   "base_url":"http://127.0.0.1:29406/solr",
      [mvn]   "core":""}
      [mvn] node props:{
      [mvn]   "base_url":"http://127.0.0.1:37985/solr",
      [mvn]   "core":""}
      [mvn] node props:{
      [mvn]   "base_url":"http://127.0.0.1:35538/solr",
      [mvn]   "core":""}
      [mvn] node props:{
      [mvn]   "base_url":"http://127.0.0.1:29406/solr",
      [mvn]   "core":""}
      [mvn] node props:{
      [mvn]   "base_url":"http://127.0.0.1:39776/solr",
      [mvn]   "core":""}
      [mvn] node props:{
      [mvn]   "base_url":"http://127.0.0.1:39776/solr",
      [mvn]   "core":""}
      [mvn] node props:{
      [mvn]   "base_url":"http://127.0.0.1:35538/solr",
      [mvn]   "core":""}
      [mvn] node props:{
      [mvn]   "base_url":"http://127.0.0.1:29406/solr",
      [mvn]   "core":""}
      [mvn] node props:{
      [mvn]   "base_url":"http://127.0.0.1:37985/solr",
      [mvn]   "core":""}
      [mvn] node props:{
      [mvn]   "base_url":"http://127.0.0.1:39776/solr",
      [mvn]   "core":""}
      [mvn] node props:{
      [mvn]   "base_url":"http://127.0.0.1:29406/solr",
      [mvn]   "core":""}
      [mvn] node props:{
      [mvn]   "base_url":"http://127.0.0.1:37985/solr",
      [mvn]   "core":""}
      [mvn] node props:{
      [mvn]   "base_url":"http://127.0.0.1:39776/solr",
      [mvn]   "core":""}
      [mvn] node props:{
      [mvn]   "base_url":"http://127.0.0.1:35538/solr",
      [mvn]   "core":""}
      [mvn] node props:{
      [mvn]   "base_url":"http://127.0.0.1:39776/solr",
      [mvn]   "core":""}
      [mvn] node props:{
      [mvn]   "base_url":"http://127.0.0.1:29406/solr",
      [mvn]   "core":""}
      [mvn] node props:{
      [mvn]   "base_url":"http://127.0.0.1:37985/solr",
      [mvn]   "core":""}
      [mvn] node props:{
      [mvn]   "base_url":"http://127.0.0.1:39776/solr",
      [mvn]   "core":""}
      [mvn] node props:{
      [mvn]   "base_url":"http://127.0.0.1:29406/solr",
      [mvn]   "core":""}
      [mvn] node props:{
      [mvn]   "base_url":"http://127.0.0.1:39776/solr",
      [mvn]   "core":""}
      [mvn] node props:{
      [mvn]   "base_url":"http://127.0.0.1:35538/solr",
      [mvn]   "core":""}
      [mvn] node props:{
      [mvn]   "base_url":"http://127.0.0.1:37985/solr",
      [mvn]   "core":""}
      [mvn] node props:{
      [mvn]   "base_url":"http://127.0.0.1:35538/solr",
      [mvn]   "core":""}
      [mvn] node props:{
      [mvn]   "base_url":"http://127.0.0.1:39776/solr",
      [mvn]   "core":""}
      [mvn] node props:{
      [mvn]   "base_url":"http://127.0.0.1:35538/solr",
      [mvn]   "core":""}
      [mvn] node props:{
      [mvn]   "base_url":"http://127.0.0.1:29406/solr",
      [mvn]   "core":""}
      [mvn] node props:{
      [mvn]   "base_url":"http://127.0.0.1:39776/solr",
      [mvn]   "core":""}
      [mvn] node props:{
      [mvn]   "base_url":"http://127.0.0.1:37985/solr",
      [mvn]   "core":""}
      [mvn] node props:{
      [mvn]   "base_url":"http://127.0.0.1:39776/solr",
      [mvn]   "core":""}
      [mvn] node props:{
      [mvn]   "base_url":"http://127.0.0.1:29406/solr",
      [mvn]   "core":""}
      [mvn] node props:{
      [mvn]   "base_url":"http://127.0.0.1:37985/solr",
      [mvn]   "core":""}
      [mvn] node props:{
      [mvn]   "base_url":"http://127.0.0.1:37985/solr",
      [mvn]   "core":""}
      [mvn] node props:{
      [mvn]   "base_url":"http://127.0.0.1:39776/solr",
      [mvn]   "core":""}
      [mvn] node props:{
      [mvn]   "base_url":"http://127.0.0.1:39776/solr",
      [mvn]   "core":""}
      [mvn] node props:{
      [mvn]   "base_url":"http://127.0.0.1:37985/solr",
      [mvn]   "core":""}
      [mvn] node props:{
      [mvn]   "base_url":"http://127.0.0.1:39776/solr",
      [mvn]   "core":""}
      [mvn] node props:{
      [mvn]   "base_url":"http://127.0.0.1:37985/solr",
      [mvn]   "core":""}
      [mvn] node props:{
      [mvn]   "base_url":"http://127.0.0.1:29406/solr",
      [mvn]   "core":""}
      [mvn] node props:{
      [mvn]   "base_url":"http://127.0.0.1:29406/solr",
      [mvn]   "core":""}
      [mvn] node props:{
      [mvn]   "base_url":"http://127.0.0.1:37985/solr",
      [mvn]   "core":""}
      [mvn] node props:{
      [mvn]   "base_url":"http://127.0.0.1:39776/solr",
      [mvn]   "core":""}
      [mvn] node props:{
      [mvn]   "base_url":"http://127.0.0.1:29406/solr",
      [mvn]   "core":""}
      [mvn] node props:{
      [mvn]   "base_url":"http://127.0.0.1:37985/solr",
      [mvn]   "core":""}
      [mvn] Tests run: 1, Failures: 0, Errors: 0, Skipped: 0, Time elapsed: 3.115 sec
      [mvn] Running org.apache.solr.spelling.FileBasedSpellCheckerTest
      [mvn] Creating dataDir: /usr/home/hudson/hudson-slave/workspace/Lucene-Solr-Maven-trunk/maven-build/solr/core/src/test/target/test/./solrtest-FileBasedSpellCheckerTest-1348245991015
      [mvn] Tests run: 3, Failures: 0, Errors: 0, Skipped: 0, Time elapsed: 0.6 sec
      [mvn] Running org.apache.solr.util.TestFastWriter
      [mvn] Tests run: 1, Failures: 0, Errors: 0, Skipped: 0, Time elapsed: 0.242 sec
      [mvn] Running org.apache.solr.handler.XmlUpdateRequestHandlerTest
      [mvn] Creating dataDir: /usr/home/hudson/hudson-slave/workspace/Lucene-Solr-Maven-trunk/maven-build/solr/core/src/test/target/test/./solrtest-XmlUpdateRequestHandlerTest-1348245991857
      [mvn] Tests run: 3, Failures: 0, Errors: 0, Skipped: 0, Time elapsed: 0.348 sec
      [mvn] Running org.apache.solr.search.SpatialFilterTest
      [mvn] Creating dataDir: /usr/home/hudson/hudson-slave/workspace/Lucene-Solr-Maven-trunk/maven-build/solr/core/src/test/target/test/./solrtest-SpatialFilterTest-1348245992205
      [mvn] Tests run: 3, Failures: 0, Errors: 0, Skipped: 0, Time elapsed: 0.691 sec
      [mvn] Running org.apache.solr.request.TestBinaryResponseWriter
      [mvn] Tests run: 2, Failures: 0, Errors: 0, Skipped: 0, Time elapsed: 1.144 sec
      [mvn] Running org.apache.solr.core.TestXIncludeConfig
      [mvn] Tests run: 1, Failures: 0, Errors: 0, Skipped: 0, Time elapsed: 0.104 sec
      [mvn] Running org.apache.solr.highlight.HighlighterTest
      [mvn] Creating dataDir: /usr/home/hudson/hudson-slave/workspace/Lucene-Solr-Maven-trunk/maven-build/solr/core/src/test/target/test/./solrtest-HighlighterTest-1348245994152
      [mvn] Tests run: 27, Failures: 0, Errors: 0, Skipped: 0, Time elapsed: 1.524 sec
      [mvn] Running org.apache.solr.spelling.SpellCheckCollatorTest
      [mvn] Creating dataDir: /usr/home/hudson/hudson-slave/workspace/Lucene-Solr-Maven-trunk/maven-build/solr/core/src/test/target/test/./solrtest-SpellCheckCollatorTest-1348245995679
      [mvn] Tests run: 7, Failures: 0, Errors: 0, Skipped: 0, Time elapsed: 1.897 sec
      [mvn] Running org.apache.solr.core.TestSolrDeletionPolicy2
      [mvn] Creating dataDir: /usr/home/hudson/hudson-slave/workspace/Lucene-Solr-Maven-trunk/maven-build/solr/core/src/test/target/test/./solrtest-TestSolrDeletionPolicy2-1348245997580
      [mvn] Tests run: 1, Failures: 0, Errors: 0, Skipped: 0, Time elapsed: 0.433 sec
      [mvn] Running org.apache.solr.search.function.distance.DistanceFunctionTest
      [mvn] Creating dataDir: /usr/home/hudson/hudson-slave/workspace/Lucene-Solr-Maven-trunk/maven-build/solr/core/src/test/target/test/./solrtest-DistanceFunctionTest-1348245998009
      [mvn] Tests run: 3, Failures: 0, Errors: 0, Skipped: 0, Time elapsed: 0.615 sec
      [mvn] Running org.apache.solr.spelling.suggest.SuggesterTest
      [mvn] Creating dataDir: /usr/home/hudson/hudson-slave/workspace/Lucene-Solr-Maven-trunk/maven-build/solr/core/src/test/target/test/./solrtest-SuggesterTest-1348245998621
      [mvn] NOTE: per solr.test.leavedatadir, dataDir will not be removed: /usr/home/hudson/hudson-slave/workspace/Lucene-Solr-Maven-trunk/maven-build/solr/core/src/test/target/test/./solrtest-SuggesterTest-1348245998621
      [mvn] Tests run: 4, Failures: 0, Errors: 0, Skipped: 0, Time elapsed: 0.816 sec
      [mvn] Running org.apache.solr.request.SimpleFacetsTest
      [mvn] Creating dataDir: /usr/home/hudson/hudson-slave/workspace/Lucene-Solr-Maven-trunk/maven-build/solr/core/src/test/target/test/./solrtest-SimpleFacetsTest-1348245999450
      [mvn] ASYNC  NEW_CORE C0 name=collection1 org.apache.solr.core.SolrCore@3fa76a13
      [mvn] 3185 T432 C0 oasc.SolrException.log SEVERE org.apache.solr.common.SolrException: Specify the group.field as parameter or local parameter
      [mvn] 		at org.apache.solr.request.SimpleFacets.getGroupedCounts(SimpleFacets.java:360)
      [mvn] 		at org.apache.solr.request.SimpleFacets.getTermCounts(SimpleFacets.java:319)
      [mvn] 		at org.apache.solr.request.SimpleFacets.getFacetFieldCounts(SimpleFacets.java:423)
      [mvn] 		at org.apache.solr.request.SimpleFacets.getFacetCounts(SimpleFacets.java:206)
      [mvn] 		at org.apache.solr.handler.component.FacetComponent.process(FacetComponent.java:87)
      [mvn] 		at org.apache.solr.handler.component.SearchHandler.handleRequestBody(SearchHandler.java:206)
      [mvn] 		at org.apache.solr.handler.RequestHandlerBase.handleRequest(RequestHandlerBase.java:129)
      [mvn] 		at org.apache.solr.core.SolrCore.execute(SolrCore.java:1701)
      [mvn] 		at org.apache.solr.util.TestHarness.query(TestHarness.java:364)
      [mvn] 		at org.apache.solr.util.TestHarness.query(TestHarness.java:346)
      [mvn] 		at org.apache.solr.request.SimpleFacetsTest.testSimpleGroupedFacets(SimpleFacetsTest.java:245)
      [mvn] 		at sun.reflect.NativeMethodAccessorImpl.invoke0(Native Method)
      [mvn] 		at sun.reflect.NativeMethodAccessorImpl.invoke(NativeMethodAccessorImpl.java:57)
      [mvn] 		at sun.reflect.DelegatingMethodAccessorImpl.invoke(DelegatingMethodAccessorImpl.java:43)
      [mvn] 		at java.lang.reflect.Method.invoke(Method.java:616)
      [mvn] 		at com.carrotsearch.randomizedtesting.RandomizedRunner.invoke(RandomizedRunner.java:1559)
      [mvn] 		at com.carrotsearch.randomizedtesting.RandomizedRunner.access$600(RandomizedRunner.java:79)
      [mvn] 		at com.carrotsearch.randomizedtesting.RandomizedRunner$6.evaluate(RandomizedRunner.java:737)
      [mvn] 		at com.carrotsearch.randomizedtesting.RandomizedRunner$7.evaluate(RandomizedRunner.java:773)
      [mvn] 		at com.carrotsearch.randomizedtesting.RandomizedRunner$8.evaluate(RandomizedRunner.java:787)
      [mvn] 		at com.carrotsearch.randomizedtesting.rules.SystemPropertiesRestoreRule$1.evaluate(SystemPropertiesRestoreRule.java:53)
      [mvn] 		at org.apache.lucene.util.TestRuleSetupTeardownChained$1.evaluate(TestRuleSetupTeardownChained.java:50)
      [mvn] 		at org.apache.lucene.util.TestRuleFieldCacheSanity$1.evaluate(TestRuleFieldCacheSanity.java:51)
      [mvn] 		at org.apache.lucene.util.AbstractBeforeAfterRule$1.evaluate(AbstractBeforeAfterRule.java:45)
      [mvn] 		at com.carrotsearch.randomizedtesting.rules.SystemPropertiesInvariantRule$1.evaluate(SystemPropertiesInvariantRule.java:55)
      [mvn] 		at org.apache.lucene.util.TestRuleThreadAndTestName$1.evaluate(TestRuleThreadAndTestName.java:48)
      [mvn] 		at org.apache.lucene.util.TestRuleIgnoreAfterMaxFailures$1.evaluate(TestRuleIgnoreAfterMaxFailures.java:70)
      [mvn] 		at org.apache.lucene.util.TestRuleMarkFailure$1.evaluate(TestRuleMarkFailure.java:48)
      [mvn] 		at com.carrotsearch.randomizedtesting.rules.StatementAdapter.evaluate(StatementAdapter.java:36)
      [mvn] 		at com.carrotsearch.randomizedtesting.ThreadLeakControl$StatementRunner.run(ThreadLeakControl.java:358)
      [mvn] 		at com.carrotsearch.randomizedtesting.ThreadLeakControl.forkTimeoutingTask(ThreadLeakControl.java:782)
      [mvn] 		at com.carrotsearch.randomizedtesting.ThreadLeakControl$3.evaluate(ThreadLeakControl.java:442)
      [mvn] 		at com.carrotsearch.randomizedtesting.RandomizedRunner.runSingleTest(RandomizedRunner.java:746)
      [mvn] 		at com.carrotsearch.randomizedtesting.RandomizedRunner$3.evaluate(RandomizedRunner.java:648)
      [mvn] 		at com.carrotsearch.randomizedtesting.RandomizedRunner$4.evaluate(RandomizedRunner.java:682)
      [mvn] 		at com.carrotsearch.randomizedtesting.RandomizedRunner$5.evaluate(RandomizedRunner.java:693)
      [mvn] 		at com.carrotsearch.randomizedtesting.rules.StatementAdapter.evaluate(StatementAdapter.java:36)
      [mvn] 		at com.carrotsearch.randomizedtesting.rules.SystemPropertiesRestoreRule$1.evaluate(SystemPropertiesRestoreRule.java:53)
      [mvn] 		at org.apache.lucene.util.AbstractBeforeAfterRule$1.evaluate(AbstractBeforeAfterRule.java:45)
      [mvn] 		at org.apache.lucene.util.TestRuleStoreClassName$1.evaluate(TestRuleStoreClassName.java:42)
      [mvn] 		at com.carrotsearch.randomizedtesting.rules.SystemPropertiesInvariantRule$1.evaluate(SystemPropertiesInvariantRule.java:55)
      [mvn] 		at com.carrotsearch.randomizedtesting.rules.NoShadowingOrOverridesOnMethodsRule$1.evaluate(NoShadowingOrOverridesOnMethodsRule.java:39)
      [mvn] 		at com.carrotsearch.randomizedtesting.rules.NoShadowingOrOverridesOnMethodsRule$1.evaluate(NoShadowingOrOverridesOnMethodsRule.java:39)
      [mvn] 		at com.carrotsearch.randomizedtesting.rules.StatementAdapter.evaluate(StatementAdapter.java:36)
      [mvn] 		at org.apache.lucene.util.TestRuleAssertionsRequired$1.evaluate(TestRuleAssertionsRequired.java:43)
      [mvn] 		at org.apache.lucene.util.TestRuleMarkFailure$1.evaluate(TestRuleMarkFailure.java:48)
      [mvn] 		at org.apache.lucene.util.TestRuleIgnoreAfterMaxFailures$1.evaluate(TestRuleIgnoreAfterMaxFailures.java:70)
      [mvn] 		at org.apache.lucene.util.TestRuleIgnoreTestSuites$1.evaluate(TestRuleIgnoreTestSuites.java:55)
      [mvn] 		at com.carrotsearch.randomizedtesting.rules.StatementAdapter.evaluate(StatementAdapter.java:36)
      [mvn] 		at com.carrotsearch.randomizedtesting.ThreadLeakControl$StatementRunner.run(ThreadLeakControl.java:358)
      [mvn] 		at java.lang.Thread.run(Thread.java:679)
      [mvn] 	
      [mvn] 3237 T432 C0 oasc.SolrException.log SEVERE org.apache.solr.common.SolrException: range facet infinite loop: gap is either zero, or too small relative start/end and caused underflow: 23.0 + 0 = 23.0
      [mvn] 		at org.apache.solr.request.SimpleFacets.getFacetRangeCounts(SimpleFacets.java:1122)
      [mvn] 		at org.apache.solr.request.SimpleFacets.getFacetRangeCounts(SimpleFacets.java:1074)
      [mvn] 		at org.apache.solr.request.SimpleFacets.getFacetRangeCounts(SimpleFacets.java:1018)
      [mvn] 		at org.apache.solr.request.SimpleFacets.getFacetCounts(SimpleFacets.java:208)
      [mvn] 		at org.apache.solr.handler.component.FacetComponent.process(FacetComponent.java:87)
      [mvn] 		at org.apache.solr.handler.component.SearchHandler.handleRequestBody(SearchHandler.java:206)
      [mvn] 		at org.apache.solr.handler.RequestHandlerBase.handleRequest(RequestHandlerBase.java:129)
      [mvn] 		at org.apache.solr.core.SolrCore.execute(SolrCore.java:1701)
      [mvn] 		at org.apache.solr.util.TestHarness.query(TestHarness.java:364)
      [mvn] 		at org.apache.solr.util.TestHarness.query(TestHarness.java:346)
      [mvn] 		at org.apache.solr.SolrTestCaseJ4.assertQEx(SolrTestCaseJ4.java:618)
      [mvn] 		at org.apache.solr.request.SimpleFacetsTest.testRangeFacetInfiniteLoopDetection(SimpleFacetsTest.java:2052)
      [mvn] 		at sun.reflect.NativeMethodAccessorImpl.invoke0(Native Method)
      [mvn] 		at sun.reflect.NativeMethodAccessorImpl.invoke(NativeMethodAccessorImpl.java:57)
      [mvn] 		at sun.reflect.DelegatingMethodAccessorImpl.invoke(DelegatingMethodAccessorImpl.java:43)
      [mvn] 		at java.lang.reflect.Method.invoke(Method.java:616)
      [mvn] 		at com.carrotsearch.randomizedtesting.RandomizedRunner.invoke(RandomizedRunner.java:1559)
      [mvn] 		at com.carrotsearch.randomizedtesting.RandomizedRunner.access$600(RandomizedRunner.java:79)
      [mvn] 		at com.carrotsearch.randomizedtesting.RandomizedRunner$6.evaluate(RandomizedRunner.java:737)
      [mvn] 		at com.carrotsearch.randomizedtesting.RandomizedRunner$7.evaluate(RandomizedRunner.java:773)
      [mvn] 		at com.carrotsearch.randomizedtesting.RandomizedRunner$8.evaluate(RandomizedRunner.java:787)
      [mvn] 		at com.carrotsearch.randomizedtesting.rules.SystemPropertiesRestoreRule$1.evaluate(SystemPropertiesRestoreRule.java:53)
      [mvn] 		at org.apache.lucene.util.TestRuleSetupTeardownChained$1.evaluate(TestRuleSetupTeardownChained.java:50)
      [mvn] 		at org.apache.lucene.util.TestRuleFieldCacheSanity$1.evaluate(TestRuleFieldCacheSanity.java:51)
      [mvn] 		at org.apache.lucene.util.AbstractBeforeAfterRule$1.evaluate(AbstractBeforeAfterRule.java:45)
      [mvn] 		at com.carrotsearch.randomizedtesting.rules.SystemPropertiesInvariantRule$1.evaluate(SystemPropertiesInvariantRule.java:55)
      [mvn] 		at org.apache.lucene.util.TestRuleThreadAndTestName$1.evaluate(TestRuleThreadAndTestName.java:48)
      [mvn] 		at org.apache.lucene.util.TestRuleIgnoreAfterMaxFailures$1.evaluate(TestRuleIgnoreAfterMaxFailures.java:70)
      [mvn] 		at org.apache.lucene.util.TestRuleMarkFailure$1.evaluate(TestRuleMarkFailure.java:48)
      [mvn] 		at com.carrotsearch.randomizedtesting.rules.StatementAdapter.evaluate(StatementAdapter.java:36)
      [mvn] 		at com.carrotsearch.randomizedtesting.ThreadLeakControl$StatementRunner.run(ThreadLeakControl.java:358)
      [mvn] 		at com.carrotsearch.randomizedtesting.ThreadLeakControl.forkTimeoutingTask(ThreadLeakControl.java:782)
      [mvn] 		at com.carrotsearch.randomizedtesting.ThreadLeakControl$3.evaluate(ThreadLeakControl.java:442)
      [mvn] 		at com.carrotsearch.randomizedtesting.RandomizedRunner.runSingleTest(RandomizedRunner.java:746)
      [mvn] 		at com.carrotsearch.randomizedtesting.RandomizedRunner$3.evaluate(RandomizedRunner.java:648)
      [mvn] 		at com.carrotsearch.randomizedtesting.RandomizedRunner$4.evaluate(RandomizedRunner.java:682)
      [mvn] 		at com.carrotsearch.randomizedtesting.RandomizedRunner$5.evaluate(RandomizedRunner.java:693)
      [mvn] 		at com.carrotsearch.randomizedtesting.rules.StatementAdapter.evaluate(StatementAdapter.java:36)
      [mvn] 		at com.carrotsearch.randomizedtesting.rules.SystemPropertiesRestoreRule$1.evaluate(SystemPropertiesRestoreRule.java:53)
      [mvn] 		at org.apache.lucene.util.AbstractBeforeAfterRule$1.evaluate(AbstractBeforeAfterRule.java:45)
      [mvn] 		at org.apache.lucene.util.TestRuleStoreClassName$1.evaluate(TestRuleStoreClassName.java:42)
      [mvn] 		at com.carrotsearch.randomizedtesting.rules.SystemPropertiesInvariantRule$1.evaluate(SystemPropertiesInvariantRule.java:55)
      [mvn] 		at com.carrotsearch.randomizedtesting.rules.NoShadowingOrOverridesOnMethodsRule$1.evaluate(NoShadowingOrOverridesOnMethodsRule.java:39)
      [mvn] 		at com.carrotsearch.randomizedtesting.rules.NoShadowingOrOverridesOnMethodsRule$1.evaluate(NoShadowingOrOverridesOnMethodsRule.java:39)
      [mvn] 		at com.carrotsearch.randomizedtesting.rules.StatementAdapter.evaluate(StatementAdapter.java:36)
      [mvn] 		at org.apache.lucene.util.TestRuleAssertionsRequired$1.evaluate(TestRuleAssertionsRequired.java:43)
      [mvn] 		at org.apache.lucene.util.TestRuleMarkFailure$1.evaluate(TestRuleMarkFailure.java:48)
      [mvn] 		at org.apache.lucene.util.TestRuleIgnoreAfterMaxFailures$1.evaluate(TestRuleIgnoreAfterMaxFailures.java:70)
      [mvn] 		at org.apache.lucene.util.TestRuleIgnoreTestSuites$1.evaluate(TestRuleIgnoreTestSuites.java:55)
      [mvn] 		at com.carrotsearch.randomizedtesting.rules.StatementAdapter.evaluate(StatementAdapter.java:36)
      [mvn] 		at com.carrotsearch.randomizedtesting.ThreadLeakControl$StatementRunner.run(ThreadLeakControl.java:358)
      [mvn] 		at java.lang.Thread.run(Thread.java:679)
      [mvn] 	
      [mvn] 3238 T432 C0 oasc.SolrException.log SEVERE org.apache.solr.common.SolrException: range facet infinite loop: gap is either zero, or too small relative start/end and caused underflow: 23.0 + 0 = 23.0
      [mvn] 		at org.apache.solr.request.SimpleFacets.getFacetRangeCounts(SimpleFacets.java:1122)
      [mvn] 		at org.apache.solr.request.SimpleFacets.getFacetRangeCounts(SimpleFacets.java:1074)
      [mvn] 		at org.apache.solr.request.SimpleFacets.getFacetRangeCounts(SimpleFacets.java:1018)
      [mvn] 		at org.apache.solr.request.SimpleFacets.getFacetCounts(SimpleFacets.java:208)
      [mvn] 		at org.apache.solr.handler.component.FacetComponent.process(FacetComponent.java:87)
      [mvn] 		at org.apache.solr.handler.component.SearchHandler.handleRequestBody(SearchHandler.java:206)
      [mvn] 		at org.apache.solr.handler.RequestHandlerBase.handleRequest(RequestHandlerBase.java:129)
      [mvn] 		at org.apache.solr.core.SolrCore.execute(SolrCore.java:1701)
      [mvn] 		at org.apache.solr.util.TestHarness.query(TestHarness.java:364)
      [mvn] 		at org.apache.solr.util.TestHarness.query(TestHarness.java:346)
      [mvn] 		at org.apache.solr.SolrTestCaseJ4.assertQEx(SolrTestCaseJ4.java:618)
      [mvn] 		at org.apache.solr.request.SimpleFacetsTest.testRangeFacetInfiniteLoopDetection(SimpleFacetsTest.java:2052)
      [mvn] 		at sun.reflect.NativeMethodAccessorImpl.invoke0(Native Method)
      [mvn] 		at sun.reflect.NativeMethodAccessorImpl.invoke(NativeMethodAccessorImpl.java:57)
      [mvn] 		at sun.reflect.DelegatingMethodAccessorImpl.invoke(DelegatingMethodAccessorImpl.java:43)
      [mvn] 		at java.lang.reflect.Method.invoke(Method.java:616)
      [mvn] 		at com.carrotsearch.randomizedtesting.RandomizedRunner.invoke(RandomizedRunner.java:1559)
      [mvn] 		at com.carrotsearch.randomizedtesting.RandomizedRunner.access$600(RandomizedRunner.java:79)
      [mvn] 		at com.carrotsearch.randomizedtesting.RandomizedRunner$6.evaluate(RandomizedRunner.java:737)
      [mvn] 		at com.carrotsearch.randomizedtesting.RandomizedRunner$7.evaluate(RandomizedRunner.java:773)
      [mvn] 		at com.carrotsearch.randomizedtesting.RandomizedRunner$8.evaluate(RandomizedRunner.java:787)
      [mvn] 		at com.carrotsearch.randomizedtesting.rules.SystemPropertiesRestoreRule$1.evaluate(SystemPropertiesRestoreRule.java:53)
      [mvn] 		at org.apache.lucene.util.TestRuleSetupTeardownChained$1.evaluate(TestRuleSetupTeardownChained.java:50)
      [mvn] 		at org.apache.lucene.util.TestRuleFieldCacheSanity$1.evaluate(TestRuleFieldCacheSanity.java:51)
      [mvn] 		at org.apache.lucene.util.AbstractBeforeAfterRule$1.evaluate(AbstractBeforeAfterRule.java:45)
      [mvn] 		at com.carrotsearch.randomizedtesting.rules.SystemPropertiesInvariantRule$1.evaluate(SystemPropertiesInvariantRule.java:55)
      [mvn] 		at org.apache.lucene.util.TestRuleThreadAndTestName$1.evaluate(TestRuleThreadAndTestName.java:48)
      [mvn] 		at org.apache.lucene.util.TestRuleIgnoreAfterMaxFailures$1.evaluate(TestRuleIgnoreAfterMaxFailures.java:70)
      [mvn] 		at org.apache.lucene.util.TestRuleMarkFailure$1.evaluate(TestRuleMarkFailure.java:48)
      [mvn] 		at com.carrotsearch.randomizedtesting.rules.StatementAdapter.evaluate(StatementAdapter.java:36)
      [mvn] 		at com.carrotsearch.randomizedtesting.ThreadLeakControl$StatementRunner.run(ThreadLeakControl.java:358)
      [mvn] 		at com.carrotsearch.randomizedtesting.ThreadLeakControl.forkTimeoutingTask(ThreadLeakControl.java:782)
      [mvn] 		at com.carrotsearch.randomizedtesting.ThreadLeakControl$3.evaluate(ThreadLeakControl.java:442)
      [mvn] 		at com.carrotsearch.randomizedtesting.RandomizedRunner.runSingleTest(RandomizedRunner.java:746)
      [mvn] 		at com.carrotsearch.randomizedtesting.RandomizedRunner$3.evaluate(RandomizedRunner.java:648)
      [mvn] 		at com.carrotsearch.randomizedtesting.RandomizedRunner$4.evaluate(RandomizedRunner.java:682)
      [mvn] 		at com.carrotsearch.randomizedtesting.RandomizedRunner$5.evaluate(RandomizedRunner.java:693)
      [mvn] 		at com.carrotsearch.randomizedtesting.rules.StatementAdapter.evaluate(StatementAdapter.java:36)
      [mvn] 		at com.carrotsearch.randomizedtesting.rules.SystemPropertiesRestoreRule$1.evaluate(SystemPropertiesRestoreRule.java:53)
      [mvn] 		at org.apache.lucene.util.AbstractBeforeAfterRule$1.evaluate(AbstractBeforeAfterRule.java:45)
      [mvn] 		at org.apache.lucene.util.TestRuleStoreClassName$1.evaluate(TestRuleStoreClassName.java:42)
      [mvn] 		at com.carrotsearch.randomizedtesting.rules.SystemPropertiesInvariantRule$1.evaluate(SystemPropertiesInvariantRule.java:55)
      [mvn] 		at com.carrotsearch.randomizedtesting.rules.NoShadowingOrOverridesOnMethodsRule$1.evaluate(NoShadowingOrOverridesOnMethodsRule.java:39)
      [mvn] 		at com.carrotsearch.randomizedtesting.rules.NoShadowingOrOverridesOnMethodsRule$1.evaluate(NoShadowingOrOverridesOnMethodsRule.java:39)
      [mvn] 		at com.carrotsearch.randomizedtesting.rules.StatementAdapter.evaluate(StatementAdapter.java:36)
      [mvn] 		at org.apache.lucene.util.TestRuleAssertionsRequired$1.evaluate(TestRuleAssertionsRequired.java:43)
      [mvn] 		at org.apache.lucene.util.TestRuleMarkFailure$1.evaluate(TestRuleMarkFailure.java:48)
      [mvn] 		at org.apache.lucene.util.TestRuleIgnoreAfterMaxFailures$1.evaluate(TestRuleIgnoreAfterMaxFailures.java:70)
      [mvn] 		at org.apache.lucene.util.TestRuleIgnoreTestSuites$1.evaluate(TestRuleIgnoreTestSuites.java:55)
      [mvn] 		at com.carrotsearch.randomizedtesting.rules.StatementAdapter.evaluate(StatementAdapter.java:36)
      [mvn] 		at com.carrotsearch.randomizedtesting.ThreadLeakControl$StatementRunner.run(ThreadLeakControl.java:358)
      [mvn] 		at java.lang.Thread.run(Thread.java:679)
      [mvn] 	
      [mvn] 3239 T432 C0 oasc.SolrException.log SEVERE org.apache.solr.common.SolrException: range facet infinite loop: gap is either zero, or too small relative start/end and caused underflow: 23.0 + 0 = 23.0
      [mvn] 		at org.apache.solr.request.SimpleFacets.getFacetRangeCounts(SimpleFacets.java:1122)
      [mvn] 		at org.apache.solr.request.SimpleFacets.getFacetRangeCounts(SimpleFacets.java:1074)
      [mvn] 		at org.apache.solr.request.SimpleFacets.getFacetRangeCounts(SimpleFacets.java:1018)
      [mvn] 		at org.apache.solr.request.SimpleFacets.getFacetCounts(SimpleFacets.java:208)
      [mvn] 		at org.apache.solr.handler.component.FacetComponent.process(FacetComponent.java:87)
      [mvn] 		at org.apache.solr.handler.component.SearchHandler.handleRequestBody(SearchHandler.java:206)
      [mvn] 		at org.apache.solr.handler.RequestHandlerBase.handleRequest(RequestHandlerBase.java:129)
      [mvn] 		at org.apache.solr.core.SolrCore.execute(SolrCore.java:1701)
      [mvn] 		at org.apache.solr.util.TestHarness.query(TestHarness.java:364)
      [mvn] 		at org.apache.solr.util.TestHarness.query(TestHarness.java:346)
      [mvn] 		at org.apache.solr.SolrTestCaseJ4.assertQEx(SolrTestCaseJ4.java:618)
      [mvn] 		at org.apache.solr.request.SimpleFacetsTest.testRangeFacetInfiniteLoopDetection(SimpleFacetsTest.java:2052)
      [mvn] 		at sun.reflect.NativeMethodAccessorImpl.invoke0(Native Method)
      [mvn] 		at sun.reflect.NativeMethodAccessorImpl.invoke(NativeMethodAccessorImpl.java:57)
      [mvn] 		at sun.reflect.DelegatingMethodAccessorImpl.invoke(DelegatingMethodAccessorImpl.java:43)
      [mvn] 		at java.lang.reflect.Method.invoke(Method.java:616)
      [mvn] 		at com.carrotsearch.randomizedtesting.RandomizedRunner.invoke(RandomizedRunner.java:1559)
      [mvn] 		at com.carrotsearch.randomizedtesting.RandomizedRunner.access$600(RandomizedRunner.java:79)
      [mvn] 		at com.carrotsearch.randomizedtesting.RandomizedRunner$6.evaluate(RandomizedRunner.java:737)
      [mvn] 		at com.carrotsearch.randomizedtesting.RandomizedRunner$7.evaluate(RandomizedRunner.java:773)
      [mvn] 		at com.carrotsearch.randomizedtesting.RandomizedRunner$8.evaluate(RandomizedRunner.java:787)
      [mvn] 		at com.carrotsearch.randomizedtesting.rules.SystemPropertiesRestoreRule$1.evaluate(SystemPropertiesRestoreRule.java:53)
      [mvn] 		at org.apache.lucene.util.TestRuleSetupTeardownChained$1.evaluate(TestRuleSetupTeardownChained.java:50)
      [mvn] 		at org.apache.lucene.util.TestRuleFieldCacheSanity$1.evaluate(TestRuleFieldCacheSanity.java:51)
      [mvn] 		at org.apache.lucene.util.AbstractBeforeAfterRule$1.evaluate(AbstractBeforeAfterRule.java:45)
      [mvn] 		at com.carrotsearch.randomizedtesting.rules.SystemPropertiesInvariantRule$1.evaluate(SystemPropertiesInvariantRule.java:55)
      [mvn] 		at org.apache.lucene.util.TestRuleThreadAndTestName$1.evaluate(TestRuleThreadAndTestName.java:48)
      [mvn] 		at org.apache.lucene.util.TestRuleIgnoreAfterMaxFailures$1.evaluate(TestRuleIgnoreAfterMaxFailures.java:70)
      [mvn] 		at org.apache.lucene.util.TestRuleMarkFailure$1.evaluate(TestRuleMarkFailure.java:48)
      [mvn] 		at com.carrotsearch.randomizedtesting.rules.StatementAdapter.evaluate(StatementAdapter.java:36)
      [mvn] 		at com.carrotsearch.randomizedtesting.ThreadLeakControl$StatementRunner.run(ThreadLeakControl.java:358)
      [mvn] 		at com.carrotsearch.randomizedtesting.ThreadLeakControl.forkTimeoutingTask(ThreadLeakControl.java:782)
      [mvn] 		at com.carrotsearch.randomizedtesting.ThreadLeakControl$3.evaluate(ThreadLeakControl.java:442)
      [mvn] 		at com.carrotsearch.randomizedtesting.RandomizedRunner.runSingleTest(RandomizedRunner.java:746)
      [mvn] 		at com.carrotsearch.randomizedtesting.RandomizedRunner$3.evaluate(RandomizedRunner.java:648)
      [mvn] 		at com.carrotsearch.randomizedtesting.RandomizedRunner$4.evaluate(RandomizedRunner.java:682)
      [mvn] 		at com.carrotsearch.randomizedtesting.RandomizedRunner$5.evaluate(RandomizedRunner.java:693)
      [mvn] 		at com.carrotsearch.randomizedtesting.rules.StatementAdapter.evaluate(StatementAdapter.java:36)
      [mvn] 		at com.carrotsearch.randomizedtesting.rules.SystemPropertiesRestoreRule$1.evaluate(SystemPropertiesRestoreRule.java:53)
      [mvn] 		at org.apache.lucene.util.AbstractBeforeAfterRule$1.evaluate(AbstractBeforeAfterRule.java:45)
      [mvn] 		at org.apache.lucene.util.TestRuleStoreClassName$1.evaluate(TestRuleStoreClassName.java:42)
      [mvn] 		at com.carrotsearch.randomizedtesting.rules.SystemPropertiesInvariantRule$1.evaluate(SystemPropertiesInvariantRule.java:55)
      [mvn] 		at com.carrotsearch.randomizedtesting.rules.NoShadowingOrOverridesOnMethodsRule$1.evaluate(NoShadowingOrOverridesOnMethodsRule.java:39)
      [mvn] 		at com.carrotsearch.randomizedtesting.rules.NoShadowingOrOverridesOnMethodsRule$1.evaluate(NoShadowingOrOverridesOnMethodsRule.java:39)
      [mvn] 		at com.carrotsearch.randomizedtesting.rules.StatementAdapter.evaluate(StatementAdapter.java:36)
      [mvn] 		at org.apache.lucene.util.TestRuleAssertionsRequired$1.evaluate(TestRuleAssertionsRequired.java:43)
      [mvn] 		at org.apache.lucene.util.TestRuleMarkFailure$1.evaluate(TestRuleMarkFailure.java:48)
      [mvn] 		at org.apache.lucene.util.TestRuleIgnoreAfterMaxFailures$1.evaluate(TestRuleIgnoreAfterMaxFailures.java:70)
      [mvn] 		at org.apache.lucene.util.TestRuleIgnoreTestSuites$1.evaluate(TestRuleIgnoreTestSuites.java:55)
      [mvn] 		at com.carrotsearch.randomizedtesting.rules.StatementAdapter.evaluate(StatementAdapter.java:36)
      [mvn] 		at com.carrotsearch.randomizedtesting.ThreadLeakControl$StatementRunner.run(ThreadLeakControl.java:358)
      [mvn] 		at java.lang.Thread.run(Thread.java:679)
      [mvn] 	
      [mvn] 3239 T432 C0 oasc.SolrException.log SEVERE org.apache.solr.common.SolrException: range facet infinite loop: gap is either zero, or too small relative start/end and caused underflow: 23.0 + 0 = 23.0
      [mvn] 		at org.apache.solr.request.SimpleFacets.getFacetRangeCounts(SimpleFacets.java:1122)
      [mvn] 		at org.apache.solr.request.SimpleFacets.getFacetRangeCounts(SimpleFacets.java:1074)
      [mvn] 		at org.apache.solr.request.SimpleFacets.getFacetRangeCounts(SimpleFacets.java:1018)
      [mvn] 		at org.apache.solr.request.SimpleFacets.getFacetCounts(SimpleFacets.java:208)
      [mvn] 		at org.apache.solr.handler.component.FacetComponent.process(FacetComponent.java:87)
      [mvn] 		at org.apache.solr.handler.component.SearchHandler.handleRequestBody(SearchHandler.java:206)
      [mvn] 		at org.apache.solr.handler.RequestHandlerBase.handleRequest(RequestHandlerBase.java:129)
      [mvn] 		at org.apache.solr.core.SolrCore.execute(SolrCore.java:1701)
      [mvn] 		at org.apache.solr.util.TestHarness.query(TestHarness.java:364)
      [mvn] 		at org.apache.solr.util.TestHarness.query(TestHarness.java:346)
      [mvn] 		at org.apache.solr.SolrTestCaseJ4.assertQEx(SolrTestCaseJ4.java:618)
      [mvn] 		at org.apache.solr.request.SimpleFacetsTest.testRangeFacetInfiniteLoopDetection(SimpleFacetsTest.java:2052)
      [mvn] 		at sun.reflect.NativeMethodAccessorImpl.invoke0(Native Method)
      [mvn] 		at sun.reflect.NativeMethodAccessorImpl.invoke(NativeMethodAccessorImpl.java:57)
      [mvn] 		at sun.reflect.DelegatingMethodAccessorImpl.invoke(DelegatingMethodAccessorImpl.java:43)
      [mvn] 		at java.lang.reflect.Method.invoke(Method.java:616)
      [mvn] 		at com.carrotsearch.randomizedtesting.RandomizedRunner.invoke(RandomizedRunner.java:1559)
      [mvn] 		at com.carrotsearch.randomizedtesting.RandomizedRunner.access$600(RandomizedRunner.java:79)
      [mvn] 		at com.carrotsearch.randomizedtesting.RandomizedRunner$6.evaluate(RandomizedRunner.java:737)
      [mvn] 		at com.carrotsearch.randomizedtesting.RandomizedRunner$7.evaluate(RandomizedRunner.java:773)
      [mvn] 		at com.carrotsearch.randomizedtesting.RandomizedRunner$8.evaluate(RandomizedRunner.java:787)
      [mvn] 		at com.carrotsearch.randomizedtesting.rules.SystemPropertiesRestoreRule$1.evaluate(SystemPropertiesRestoreRule.java:53)
      [mvn] 		at org.apache.lucene.util.TestRuleSetupTeardownChained$1.evaluate(TestRuleSetupTeardownChained.java:50)
      [mvn] 		at org.apache.lucene.util.TestRuleFieldCacheSanity$1.evaluate(TestRuleFieldCacheSanity.java:51)
      [mvn] 		at org.apache.lucene.util.AbstractBeforeAfterRule$1.evaluate(AbstractBeforeAfterRule.java:45)
      [mvn] 		at com.carrotsearch.randomizedtesting.rules.SystemPropertiesInvariantRule$1.evaluate(SystemPropertiesInvariantRule.java:55)
      [mvn] 		at org.apache.lucene.util.TestRuleThreadAndTestName$1.evaluate(TestRuleThreadAndTestName.java:48)
      [mvn] 		at org.apache.lucene.util.TestRuleIgnoreAfterMaxFailures$1.evaluate(TestRuleIgnoreAfterMaxFailures.java:70)
      [mvn] 		at org.apache.lucene.util.TestRuleMarkFailure$1.evaluate(TestRuleMarkFailure.java:48)
      [mvn] 		at com.carrotsearch.randomizedtesting.rules.StatementAdapter.evaluate(StatementAdapter.java:36)
      [mvn] 		at com.carrotsearch.randomizedtesting.ThreadLeakControl$StatementRunner.run(ThreadLeakControl.java:358)
      [mvn] 		at com.carrotsearch.randomizedtesting.ThreadLeakControl.forkTimeoutingTask(ThreadLeakControl.java:782)
      [mvn] 		at com.carrotsearch.randomizedtesting.ThreadLeakControl$3.evaluate(ThreadLeakControl.java:442)
      [mvn] 		at com.carrotsearch.randomizedtesting.RandomizedRunner.runSingleTest(RandomizedRunner.java:746)
      [mvn] 		at com.carrotsearch.randomizedtesting.RandomizedRunner$3.evaluate(RandomizedRunner.java:648)
      [mvn] 		at com.carrotsearch.randomizedtesting.RandomizedRunner$4.evaluate(RandomizedRunner.java:682)
      [mvn] 		at com.carrotsearch.randomizedtesting.RandomizedRunner$5.evaluate(RandomizedRunner.java:693)
      [mvn] 		at com.carrotsearch.randomizedtesting.rules.StatementAdapter.evaluate(StatementAdapter.java:36)
      [mvn] 		at com.carrotsearch.randomizedtesting.rules.SystemPropertiesRestoreRule$1.evaluate(SystemPropertiesRestoreRule.java:53)
      [mvn] 		at org.apache.lucene.util.AbstractBeforeAfterRule$1.evaluate(AbstractBeforeAfterRule.java:45)
      [mvn] 		at org.apache.lucene.util.TestRuleStoreClassName$1.evaluate(TestRuleStoreClassName.java:42)
      [mvn] 		at com.carrotsearch.randomizedtesting.rules.SystemPropertiesInvariantRule$1.evaluate(SystemPropertiesInvariantRule.java:55)
      [mvn] 		at com.carrotsearch.randomizedtesting.rules.NoShadowingOrOverridesOnMethodsRule$1.evaluate(NoShadowingOrOverridesOnMethodsRule.java:39)
      [mvn] 		at com.carrotsearch.randomizedtesting.rules.NoShadowingOrOverridesOnMethodsRule$1.evaluate(NoShadowingOrOverridesOnMethodsRule.java:39)
      [mvn] 		at com.carrotsearch.randomizedtesting.rules.StatementAdapter.evaluate(StatementAdapter.java:36)
      [mvn] 		at org.apache.lucene.util.TestRuleAssertionsRequired$1.evaluate(TestRuleAssertionsRequired.java:43)
      [mvn] 		at org.apache.lucene.util.TestRuleMarkFailure$1.evaluate(TestRuleMarkFailure.java:48)
      [mvn] 		at org.apache.lucene.util.TestRuleIgnoreAfterMaxFailures$1.evaluate(TestRuleIgnoreAfterMaxFailures.java:70)
      [mvn] 		at org.apache.lucene.util.TestRuleIgnoreTestSuites$1.evaluate(TestRuleIgnoreTestSuites.java:55)
      [mvn] 		at com.carrotsearch.randomizedtesting.rules.StatementAdapter.evaluate(StatementAdapter.java:36)
      [mvn] 		at com.carrotsearch.randomizedtesting.ThreadLeakControl$StatementRunner.run(ThreadLeakControl.java:358)
      [mvn] 		at java.lang.Thread.run(Thread.java:679)
      [mvn] 	
      [mvn] 3240 T432 C0 oasc.SolrException.log SEVERE org.apache.solr.common.SolrException: range facet infinite loop: gap is either zero, or too small relative start/end and caused underflow: 23 + 0 = 23
      [mvn] 		at org.apache.solr.request.SimpleFacets.getFacetRangeCounts(SimpleFacets.java:1122)
      [mvn] 		at org.apache.solr.request.SimpleFacets.getFacetRangeCounts(SimpleFacets.java:1074)
      [mvn] 		at org.apache.solr.request.SimpleFacets.getFacetRangeCounts(SimpleFacets.java:1018)
      [mvn] 		at org.apache.solr.request.SimpleFacets.getFacetCounts(SimpleFacets.java:208)
      [mvn] 		at org.apache.solr.handler.component.FacetComponent.process(FacetComponent.java:87)
      [mvn] 		at org.apache.solr.handler.component.SearchHandler.handleRequestBody(SearchHandler.java:206)
      [mvn] 		at org.apache.solr.handler.RequestHandlerBase.handleRequest(RequestHandlerBase.java:129)
      [mvn] 		at org.apache.solr.core.SolrCore.execute(SolrCore.java:1701)
      [mvn] 		at org.apache.solr.util.TestHarness.query(TestHarness.java:364)
      [mvn] 		at org.apache.solr.util.TestHarness.query(TestHarness.java:346)
      [mvn] 		at org.apache.solr.SolrTestCaseJ4.assertQEx(SolrTestCaseJ4.java:618)
      [mvn] 		at org.apache.solr.request.SimpleFacetsTest.testRangeFacetInfiniteLoopDetection(SimpleFacetsTest.java:2052)
      [mvn] 		at sun.reflect.NativeMethodAccessorImpl.invoke0(Native Method)
      [mvn] 		at sun.reflect.NativeMethodAccessorImpl.invoke(NativeMethodAccessorImpl.java:57)
      [mvn] 		at sun.reflect.DelegatingMethodAccessorImpl.invoke(DelegatingMethodAccessorImpl.java:43)
      [mvn] 		at java.lang.reflect.Method.invoke(Method.java:616)
      [mvn] 		at com.carrotsearch.randomizedtesting.RandomizedRunner.invoke(RandomizedRunner.java:1559)
      [mvn] 		at com.carrotsearch.randomizedtesting.RandomizedRunner.access$600(RandomizedRunner.java:79)
      [mvn] 		at com.carrotsearch.randomizedtesting.RandomizedRunner$6.evaluate(RandomizedRunner.java:737)
      [mvn] 		at com.carrotsearch.randomizedtesting.RandomizedRunner$7.evaluate(RandomizedRunner.java:773)
      [mvn] 		at com.carrotsearch.randomizedtesting.RandomizedRunner$8.evaluate(RandomizedRunner.java:787)
      [mvn] 		at com.carrotsearch.randomizedtesting.rules.SystemPropertiesRestoreRule$1.evaluate(SystemPropertiesRestoreRule.java:53)
      [mvn] 		at org.apache.lucene.util.TestRuleSetupTeardownChained$1.evaluate(TestRuleSetupTeardownChained.java:50)
      [mvn] 		at org.apache.lucene.util.TestRuleFieldCacheSanity$1.evaluate(TestRuleFieldCacheSanity.java:51)
      [mvn] 		at org.apache.lucene.util.AbstractBeforeAfterRule$1.evaluate(AbstractBeforeAfterRule.java:45)
      [mvn] 		at com.carrotsearch.randomizedtesting.rules.SystemPropertiesInvariantRule$1.evaluate(SystemPropertiesInvariantRule.java:55)
      [mvn] 		at org.apache.lucene.util.TestRuleThreadAndTestName$1.evaluate(TestRuleThreadAndTestName.java:48)
      [mvn] 		at org.apache.lucene.util.TestRuleIgnoreAfterMaxFailures$1.evaluate(TestRuleIgnoreAfterMaxFailures.java:70)
      [mvn] 		at org.apache.lucene.util.TestRuleMarkFailure$1.evaluate(TestRuleMarkFailure.java:48)
      [mvn] 		at com.carrotsearch.randomizedtesting.rules.StatementAdapter.evaluate(StatementAdapter.java:36)
      [mvn] 		at com.carrotsearch.randomizedtesting.ThreadLeakControl$StatementRunner.run(ThreadLeakControl.java:358)
      [mvn] 		at com.carrotsearch.randomizedtesting.ThreadLeakControl.forkTimeoutingTask(ThreadLeakControl.java:782)
      [mvn] 		at com.carrotsearch.randomizedtesting.ThreadLeakControl$3.evaluate(ThreadLeakControl.java:442)
      [mvn] 		at com.carrotsearch.randomizedtesting.RandomizedRunner.runSingleTest(RandomizedRunner.java:746)
      [mvn] 		at com.carrotsearch.randomizedtesting.RandomizedRunner$3.evaluate(RandomizedRunner.java:648)
      [mvn] 		at com.carrotsearch.randomizedtesting.RandomizedRunner$4.evaluate(RandomizedRunner.java:682)
      [mvn] 		at com.carrotsearch.randomizedtesting.RandomizedRunner$5.evaluate(RandomizedRunner.java:693)
      [mvn] 		at com.carrotsearch.randomizedtesting.rules.StatementAdapter.evaluate(StatementAdapter.java:36)
      [mvn] 		at com.carrotsearch.randomizedtesting.rules.SystemPropertiesRestoreRule$1.evaluate(SystemPropertiesRestoreRule.java:53)
      [mvn] 		at org.apache.lucene.util.AbstractBeforeAfterRule$1.evaluate(AbstractBeforeAfterRule.java:45)
      [mvn] 		at org.apache.lucene.util.TestRuleStoreClassName$1.evaluate(TestRuleStoreClassName.java:42)
      [mvn] 		at com.carrotsearch.randomizedtesting.rules.SystemPropertiesInvariantRule$1.evaluate(SystemPropertiesInvariantRule.java:55)
      [mvn] 		at com.carrotsearch.randomizedtesting.rules.NoShadowingOrOverridesOnMethodsRule$1.evaluate(NoShadowingOrOverridesOnMethodsRule.java:39)
      [mvn] 		at com.carrotsearch.randomizedtesting.rules.NoShadowingOrOverridesOnMethodsRule$1.evaluate(NoShadowingOrOverridesOnMethodsRule.java:39)
      [mvn] 		at com.carrotsearch.randomizedtesting.rules.StatementAdapter.evaluate(StatementAdapter.java:36)
      [mvn] 		at org.apache.lucene.util.TestRuleAssertionsRequired$1.evaluate(TestRuleAssertionsRequired.java:43)
      [mvn] 		at org.apache.lucene.util.TestRuleMarkFailure$1.evaluate(TestRuleMarkFailure.java:48)
      [mvn] 		at org.apache.lucene.util.TestRuleIgnoreAfterMaxFailures$1.evaluate(TestRuleIgnoreAfterMaxFailures.java:70)
      [mvn] 		at org.apache.lucene.util.TestRuleIgnoreTestSuites$1.evaluate(TestRuleIgnoreTestSuites.java:55)
      [mvn] 		at com.carrotsearch.randomizedtesting.rules.StatementAdapter.evaluate(StatementAdapter.java:36)
      [mvn] 		at com.carrotsearch.randomizedtesting.ThreadLeakControl$StatementRunner.run(ThreadLeakControl.java:358)
      [mvn] 		at java.lang.Thread.run(Thread.java:679)
      [mvn] 	
      [mvn] 3241 T432 C0 oasc.SolrException.log SEVERE org.apache.solr.common.SolrException: range facet infinite loop: gap is either zero, or too small relative start/end and caused underflow: 23 + 0 = 23
      [mvn] 		at org.apache.solr.request.SimpleFacets.getFacetRangeCounts(SimpleFacets.java:1122)
      [mvn] 		at org.apache.solr.request.SimpleFacets.getFacetRangeCounts(SimpleFacets.java:1074)
      [mvn] 		at org.apache.solr.request.SimpleFacets.getFacetRangeCounts(SimpleFacets.java:1018)
      [mvn] 		at org.apache.solr.request.SimpleFacets.getFacetCounts(SimpleFacets.java:208)
      [mvn] 		at org.apache.solr.handler.component.FacetComponent.process(FacetComponent.java:87)
      [mvn] 		at org.apache.solr.handler.component.SearchHandler.handleRequestBody(SearchHandler.java:206)
      [mvn] 		at org.apache.solr.handler.RequestHandlerBase.handleRequest(RequestHandlerBase.java:129)
      [mvn] 		at org.apache.solr.core.SolrCore.execute(SolrCore.java:1701)
      [mvn] 		at org.apache.solr.util.TestHarness.query(TestHarness.java:364)
      [mvn] 		at org.apache.solr.util.TestHarness.query(TestHarness.java:346)
      [mvn] 		at org.apache.solr.SolrTestCaseJ4.assertQEx(SolrTestCaseJ4.java:618)
      [mvn] 		at org.apache.solr.request.SimpleFacetsTest.testRangeFacetInfiniteLoopDetection(SimpleFacetsTest.java:2052)
      [mvn] 		at sun.reflect.NativeMethodAccessorImpl.invoke0(Native Method)
      [mvn] 		at sun.reflect.NativeMethodAccessorImpl.invoke(NativeMethodAccessorImpl.java:57)
      [mvn] 		at sun.reflect.DelegatingMethodAccessorImpl.invoke(DelegatingMethodAccessorImpl.java:43)
      [mvn] 		at java.lang.reflect.Method.invoke(Method.java:616)
      [mvn] 		at com.carrotsearch.randomizedtesting.RandomizedRunner.invoke(RandomizedRunner.java:1559)
      [mvn] 		at com.carrotsearch.randomizedtesting.RandomizedRunner.access$600(RandomizedRunner.java:79)
      [mvn] 		at com.carrotsearch.randomizedtesting.RandomizedRunner$6.evaluate(RandomizedRunner.java:737)
      [mvn] 		at com.carrotsearch.randomizedtesting.RandomizedRunner$7.evaluate(RandomizedRunner.java:773)
      [mvn] 		at com.carrotsearch.randomizedtesting.RandomizedRunner$8.evaluate(RandomizedRunner.java:787)
      [mvn] 		at com.carrotsearch.randomizedtesting.rules.SystemPropertiesRestoreRule$1.evaluate(SystemPropertiesRestoreRule.java:53)
      [mvn] 		at org.apache.lucene.util.TestRuleSetupTeardownChained$1.evaluate(TestRuleSetupTeardownChained.java:50)
      [mvn] 		at org.apache.lucene.util.TestRuleFieldCacheSanity$1.evaluate(TestRuleFieldCacheSanity.java:51)
      [mvn] 		at org.apache.lucene.util.AbstractBeforeAfterRule$1.evaluate(AbstractBeforeAfterRule.java:45)
      [mvn] 		at com.carrotsearch.randomizedtesting.rules.SystemPropertiesInvariantRule$1.evaluate(SystemPropertiesInvariantRule.java:55)
      [mvn] 		at org.apache.lucene.util.TestRuleThreadAndTestName$1.evaluate(TestRuleThreadAndTestName.java:48)
      [mvn] 		at org.apache.lucene.util.TestRuleIgnoreAfterMaxFailures$1.evaluate(TestRuleIgnoreAfterMaxFailures.java:70)
      [mvn] 		at org.apache.lucene.util.TestRuleMarkFailure$1.evaluate(TestRuleMarkFailure.java:48)
      [mvn] 		at com.carrotsearch.randomizedtesting.rules.StatementAdapter.evaluate(StatementAdapter.java:36)
      [mvn] 		at com.carrotsearch.randomizedtesting.ThreadLeakControl$StatementRunner.run(ThreadLeakControl.java:358)
      [mvn] 		at com.carrotsearch.randomizedtesting.ThreadLeakControl.forkTimeoutingTask(ThreadLeakControl.java:782)
      [mvn] 		at com.carrotsearch.randomizedtesting.ThreadLeakControl$3.evaluate(ThreadLeakControl.java:442)
      [mvn] 		at com.carrotsearch.randomizedtesting.RandomizedRunner.runSingleTest(RandomizedRunner.java:746)
      [mvn] 		at com.carrotsearch.randomizedtesting.RandomizedRunner$3.evaluate(RandomizedRunner.java:648)
      [mvn] 		at com.carrotsearch.randomizedtesting.RandomizedRunner$4.evaluate(RandomizedRunner.java:682)
      [mvn] 		at com.carrotsearch.randomizedtesting.RandomizedRunner$5.evaluate(RandomizedRunner.java:693)
      [mvn] 		at com.carrotsearch.randomizedtesting.rules.StatementAdapter.evaluate(StatementAdapter.java:36)
      [mvn] 		at com.carrotsearch.randomizedtesting.rules.SystemPropertiesRestoreRule$1.evaluate(SystemPropertiesRestoreRule.java:53)
      [mvn] 		at org.apache.lucene.util.AbstractBeforeAfterRule$1.evaluate(AbstractBeforeAfterRule.java:45)
      [mvn] 		at org.apache.lucene.util.TestRuleStoreClassName$1.evaluate(TestRuleStoreClassName.java:42)
      [mvn] 		at com.carrotsearch.randomizedtesting.rules.SystemPropertiesInvariantRule$1.evaluate(SystemPropertiesInvariantRule.java:55)
      [mvn] 		at com.carrotsearch.randomizedtesting.rules.NoShadowingOrOverridesOnMethodsRule$1.evaluate(NoShadowingOrOverridesOnMethodsRule.java:39)
      [mvn] 		at com.carrotsearch.randomizedtesting.rules.NoShadowingOrOverridesOnMethodsRule$1.evaluate(NoShadowingOrOverridesOnMethodsRule.java:39)
      [mvn] 		at com.carrotsearch.randomizedtesting.rules.StatementAdapter.evaluate(StatementAdapter.java:36)
      [mvn] 		at org.apache.lucene.util.TestRuleAssertionsRequired$1.evaluate(TestRuleAssertionsRequired.java:43)
      [mvn] 		at org.apache.lucene.util.TestRuleMarkFailure$1.evaluate(TestRuleMarkFailure.java:48)
      [mvn] 		at org.apache.lucene.util.TestRuleIgnoreAfterMaxFailures$1.evaluate(TestRuleIgnoreAfterMaxFailures.java:70)
      [mvn] 		at org.apache.lucene.util.TestRuleIgnoreTestSuites$1.evaluate(TestRuleIgnoreTestSuites.java:55)
      [mvn] 		at com.carrotsearch.randomizedtesting.rules.StatementAdapter.evaluate(StatementAdapter.java:36)
      [mvn] 		at com.carrotsearch.randomizedtesting.ThreadLeakControl$StatementRunner.run(ThreadLeakControl.java:358)
      [mvn] 		at java.lang.Thread.run(Thread.java:679)
      [mvn] 	
      [mvn] 3242 T432 C0 oasc.SolrException.log SEVERE org.apache.solr.common.SolrException: date facet infinite loop: gap is effectively zero
      [mvn] 		at org.apache.solr.request.SimpleFacets.getFacetDateCounts(SimpleFacets.java:928)
      [mvn] 		at org.apache.solr.request.SimpleFacets.getFacetDateCounts(SimpleFacets.java:837)
      [mvn] 		at org.apache.solr.request.SimpleFacets.getFacetCounts(SimpleFacets.java:207)
      [mvn] 		at org.apache.solr.handler.component.FacetComponent.process(FacetComponent.java:87)
      [mvn] 		at org.apache.solr.handler.component.SearchHandler.handleRequestBody(SearchHandler.java:206)
      [mvn] 		at org.apache.solr.handler.RequestHandlerBase.handleRequest(RequestHandlerBase.java:129)
      [mvn] 		at org.apache.solr.core.SolrCore.execute(SolrCore.java:1701)
      [mvn] 		at org.apache.solr.util.TestHarness.query(TestHarness.java:364)
      [mvn] 		at org.apache.solr.util.TestHarness.query(TestHarness.java:346)
      [mvn] 		at org.apache.solr.SolrTestCaseJ4.assertQEx(SolrTestCaseJ4.java:618)
      [mvn] 		at org.apache.solr.request.SimpleFacetsTest.testRangeFacetInfiniteLoopDetection(SimpleFacetsTest.java:2063)
      [mvn] 		at sun.reflect.NativeMethodAccessorImpl.invoke0(Native Method)
      [mvn] 		at sun.reflect.NativeMethodAccessorImpl.invoke(NativeMethodAccessorImpl.java:57)
      [mvn] 		at sun.reflect.DelegatingMethodAccessorImpl.invoke(DelegatingMethodAccessorImpl.java:43)
      [mvn] 		at java.lang.reflect.Method.invoke(Method.java:616)
      [mvn] 		at com.carrotsearch.randomizedtesting.RandomizedRunner.invoke(RandomizedRunner.java:1559)
      [mvn] 		at com.carrotsearch.randomizedtesting.RandomizedRunner.access$600(RandomizedRunner.java:79)
      [mvn] 		at com.carrotsearch.randomizedtesting.RandomizedRunner$6.evaluate(RandomizedRunner.java:737)
      [mvn] 		at com.carrotsearch.randomizedtesting.RandomizedRunner$7.evaluate(RandomizedRunner.java:773)
      [mvn] 		at com.carrotsearch.randomizedtesting.RandomizedRunner$8.evaluate(RandomizedRunner.java:787)
      [mvn] 		at com.carrotsearch.randomizedtesting.rules.SystemPropertiesRestoreRule$1.evaluate(SystemPropertiesRestoreRule.java:53)
      [mvn] 		at org.apache.lucene.util.TestRuleSetupTeardownChained$1.evaluate(TestRuleSetupTeardownChained.java:50)
      [mvn] 		at org.apache.lucene.util.TestRuleFieldCacheSanity$1.evaluate(TestRuleFieldCacheSanity.java:51)
      [mvn] 		at org.apache.lucene.util.AbstractBeforeAfterRule$1.evaluate(AbstractBeforeAfterRule.java:45)
      [mvn] 		at com.carrotsearch.randomizedtesting.rules.SystemPropertiesInvariantRule$1.evaluate(SystemPropertiesInvariantRule.java:55)
      [mvn] 		at org.apache.lucene.util.TestRuleThreadAndTestName$1.evaluate(TestRuleThreadAndTestName.java:48)
      [mvn] 		at org.apache.lucene.util.TestRuleIgnoreAfterMaxFailures$1.evaluate(TestRuleIgnoreAfterMaxFailures.java:70)
      [mvn] 		at org.apache.lucene.util.TestRuleMarkFailure$1.evaluate(TestRuleMarkFailure.java:48)
      [mvn] 		at com.carrotsearch.randomizedtesting.rules.StatementAdapter.evaluate(StatementAdapter.java:36)
      [mvn] 		at com.carrotsearch.randomizedtesting.ThreadLeakControl$StatementRunner.run(ThreadLeakControl.java:358)
      [mvn] 		at com.carrotsearch.randomizedtesting.ThreadLeakControl.forkTimeoutingTask(ThreadLeakControl.java:782)
      [mvn] 		at com.carrotsearch.randomizedtesting.ThreadLeakControl$3.evaluate(ThreadLeakControl.java:442)
      [mvn] 		at com.carrotsearch.randomizedtesting.RandomizedRunner.runSingleTest(RandomizedRunner.java:746)
      [mvn] 		at com.carrotsearch.randomizedtesting.RandomizedRunner$3.evaluate(RandomizedRunner.java:648)
      [mvn] 		at com.carrotsearch.randomizedtesting.RandomizedRunner$4.evaluate(RandomizedRunner.java:682)
      [mvn] 		at com.carrotsearch.randomizedtesting.RandomizedRunner$5.evaluate(RandomizedRunner.java:693)
      [mvn] 		at com.carrotsearch.randomizedtesting.rules.StatementAdapter.evaluate(StatementAdapter.java:36)
      [mvn] 		at com.carrotsearch.randomizedtesting.rules.SystemPropertiesRestoreRule$1.evaluate(SystemPropertiesRestoreRule.java:53)
      [mvn] 		at org.apache.lucene.util.AbstractBeforeAfterRule$1.evaluate(AbstractBeforeAfterRule.java:45)
      [mvn] 		at org.apache.lucene.util.TestRuleStoreClassName$1.evaluate(TestRuleStoreClassName.java:42)
      [mvn] 		at com.carrotsearch.randomizedtesting.rules.SystemPropertiesInvariantRule$1.evaluate(SystemPropertiesInvariantRule.java:55)
      [mvn] 		at com.carrotsearch.randomizedtesting.rules.NoShadowingOrOverridesOnMethodsRule$1.evaluate(NoShadowingOrOverridesOnMethodsRule.java:39)
      [mvn] 		at com.carrotsearch.randomizedtesting.rules.NoShadowingOrOverridesOnMethodsRule$1.evaluate(NoShadowingOrOverridesOnMethodsRule.java:39)
      [mvn] 		at com.carrotsearch.randomizedtesting.rules.StatementAdapter.evaluate(StatementAdapter.java:36)
      [mvn] 		at org.apache.lucene.util.TestRuleAssertionsRequired$1.evaluate(TestRuleAssertionsRequired.java:43)
      [mvn] 		at org.apache.lucene.util.TestRuleMarkFailure$1.evaluate(TestRuleMarkFailure.java:48)
      [mvn] 		at org.apache.lucene.util.TestRuleIgnoreAfterMaxFailures$1.evaluate(TestRuleIgnoreAfterMaxFailures.java:70)
      [mvn] 		at org.apache.lucene.util.TestRuleIgnoreTestSuites$1.evaluate(TestRuleIgnoreTestSuites.java:55)
      [mvn] 		at com.carrotsearch.randomizedtesting.rules.StatementAdapter.evaluate(StatementAdapter.java:36)
      [mvn] 		at com.carrotsearch.randomizedtesting.ThreadLeakControl$StatementRunner.run(ThreadLeakControl.java:358)
      [mvn] 		at java.lang.Thread.run(Thread.java:679)
      [mvn] 	
      [mvn] 3242 T432 C0 oasc.SolrException.log SEVERE org.apache.solr.common.SolrException: range facet infinite loop: gap is either zero, or too small relative start/end and caused underflow: Fri Sep 21 12:46:42 AST 2012 + +0DAYS = Fri Sep 21 12:46:42 AST 2012
      [mvn] 		at org.apache.solr.request.SimpleFacets.getFacetRangeCounts(SimpleFacets.java:1122)
      [mvn] 		at org.apache.solr.request.SimpleFacets.getFacetRangeCounts(SimpleFacets.java:1074)
      [mvn] 		at org.apache.solr.request.SimpleFacets.getFacetRangeCounts(SimpleFacets.java:1018)
      [mvn] 		at org.apache.solr.request.SimpleFacets.getFacetCounts(SimpleFacets.java:208)
      [mvn] 		at org.apache.solr.handler.component.FacetComponent.process(FacetComponent.java:87)
      [mvn] 		at org.apache.solr.handler.component.SearchHandler.handleRequestBody(SearchHandler.java:206)
      [mvn] 		at org.apache.solr.handler.RequestHandlerBase.handleRequest(RequestHandlerBase.java:129)
      [mvn] 		at org.apache.solr.core.SolrCore.execute(SolrCore.java:1701)
      [mvn] 		at org.apache.solr.util.TestHarness.query(TestHarness.java:364)
      [mvn] 		at org.apache.solr.util.TestHarness.query(TestHarness.java:346)
      [mvn] 		at org.apache.solr.SolrTestCaseJ4.assertQEx(SolrTestCaseJ4.java:618)
      [mvn] 		at org.apache.solr.request.SimpleFacetsTest.testRangeFacetInfiniteLoopDetection(SimpleFacetsTest.java:2063)
      [mvn] 		at sun.reflect.NativeMethodAccessorImpl.invoke0(Native Method)
      [mvn] 		at sun.reflect.NativeMethodAccessorImpl.invoke(NativeMethodAccessorImpl.java:57)
      [mvn] 		at sun.reflect.DelegatingMethodAccessorImpl.invoke(DelegatingMethodAccessorImpl.java:43)
      [mvn] 		at java.lang.reflect.Method.invoke(Method.java:616)
      [mvn] 		at com.carrotsearch.randomizedtesting.RandomizedRunner.invoke(RandomizedRunner.java:1559)
      [mvn] 		at com.carrotsearch.randomizedtesting.RandomizedRunner.access$600(RandomizedRunner.java:79)
      [mvn] 		at com.carrotsearch.randomizedtesting.RandomizedRunner$6.evaluate(RandomizedRunner.java:737)
      [mvn] 		at com.carrotsearch.randomizedtesting.RandomizedRunner$7.evaluate(RandomizedRunner.java:773)
      [mvn] 		at com.carrotsearch.randomizedtesting.RandomizedRunner$8.evaluate(RandomizedRunner.java:787)
      [mvn] 		at com.carrotsearch.randomizedtesting.rules.SystemPropertiesRestoreRule$1.evaluate(SystemPropertiesRestoreRule.java:53)
      [mvn] 		at org.apache.lucene.util.TestRuleSetupTeardownChained$1.evaluate(TestRuleSetupTeardownChained.java:50)
      [mvn] 		at org.apache.lucene.util.TestRuleFieldCacheSanity$1.evaluate(TestRuleFieldCacheSanity.java:51)
      [mvn] 		at org.apache.lucene.util.AbstractBeforeAfterRule$1.evaluate(AbstractBeforeAfterRule.java:45)
      [mvn] 		at com.carrotsearch.randomizedtesting.rules.SystemPropertiesInvariantRule$1.evaluate(SystemPropertiesInvariantRule.java:55)
      [mvn] 		at org.apache.lucene.util.TestRuleThreadAndTestName$1.evaluate(TestRuleThreadAndTestName.java:48)
      [mvn] 		at org.apache.lucene.util.TestRuleIgnoreAfterMaxFailures$1.evaluate(TestRuleIgnoreAfterMaxFailures.java:70)
      [mvn] 		at org.apache.lucene.util.TestRuleMarkFailure$1.evaluate(TestRuleMarkFailure.java:48)
      [mvn] 		at com.carrotsearch.randomizedtesting.rules.StatementAdapter.evaluate(StatementAdapter.java:36)
      [mvn] 		at com.carrotsearch.randomizedtesting.ThreadLeakControl$StatementRunner.run(ThreadLeakControl.java:358)
      [mvn] 		at com.carrotsearch.randomizedtesting.ThreadLeakControl.forkTimeoutingTask(ThreadLeakControl.java:782)
      [mvn] 		at com.carrotsearch.randomizedtesting.ThreadLeakControl$3.evaluate(ThreadLeakControl.java:442)
      [mvn] 		at com.carrotsearch.randomizedtesting.RandomizedRunner.runSingleTest(RandomizedRunner.java:746)
      [mvn] 		at com.carrotsearch.randomizedtesting.RandomizedRunner$3.evaluate(RandomizedRunner.java:648)
      [mvn] 		at com.carrotsearch.randomizedtesting.RandomizedRunner$4.evaluate(RandomizedRunner.java:682)
      [mvn] 		at com.carrotsearch.randomizedtesting.RandomizedRunner$5.evaluate(RandomizedRunner.java:693)
      [mvn] 		at com.carrotsearch.randomizedtesting.rules.StatementAdapter.evaluate(StatementAdapter.java:36)
      [mvn] 		at com.carrotsearch.randomizedtesting.rules.SystemPropertiesRestoreRule$1.evaluate(SystemPropertiesRestoreRule.java:53)
      [mvn] 		at org.apache.lucene.util.AbstractBeforeAfterRule$1.evaluate(AbstractBeforeAfterRule.java:45)
      [mvn] 		at org.apache.lucene.util.TestRuleStoreClassName$1.evaluate(TestRuleStoreClassName.java:42)
      [mvn] 		at com.carrotsearch.randomizedtesting.rules.SystemPropertiesInvariantRule$1.evaluate(SystemPropertiesInvariantRule.java:55)
      [mvn] 		at com.carrotsearch.randomizedtesting.rules.NoShadowingOrOverridesOnMethodsRule$1.evaluate(NoShadowingOrOverridesOnMethodsRule.java:39)
      [mvn] 		at com.carrotsearch.randomizedtesting.rules.NoShadowingOrOverridesOnMethodsRule$1.evaluate(NoShadowingOrOverridesOnMethodsRule.java:39)
      [mvn] 		at com.carrotsearch.randomizedtesting.rules.StatementAdapter.evaluate(StatementAdapter.java:36)
      [mvn] 		at org.apache.lucene.util.TestRuleAssertionsRequired$1.evaluate(TestRuleAssertionsRequired.java:43)
      [mvn] 		at org.apache.lucene.util.TestRuleMarkFailure$1.evaluate(TestRuleMarkFailure.java:48)
      [mvn] 		at org.apache.lucene.util.TestRuleIgnoreAfterMaxFailures$1.evaluate(TestRuleIgnoreAfterMaxFailures.java:70)
      [mvn] 		at org.apache.lucene.util.TestRuleIgnoreTestSuites$1.evaluate(TestRuleIgnoreTestSuites.java:55)
      [mvn] 		at com.carrotsearch.randomizedtesting.rules.StatementAdapter.evaluate(StatementAdapter.java:36)
      [mvn] 		at com.carrotsearch.randomizedtesting.ThreadLeakControl$StatementRunner.run(ThreadLeakControl.java:358)
      [mvn] 		at java.lang.Thread.run(Thread.java:679)
      [mvn] 	
      [mvn] 3243 T432 C0 oasc.SolrException.log SEVERE org.apache.solr.common.SolrException: date facet infinite loop: gap is effectively zero
      [mvn] 		at org.apache.solr.request.SimpleFacets.getFacetDateCounts(SimpleFacets.java:928)
      [mvn] 		at org.apache.solr.request.SimpleFacets.getFacetDateCounts(SimpleFacets.java:837)
      [mvn] 		at org.apache.solr.request.SimpleFacets.getFacetCounts(SimpleFacets.java:207)
      [mvn] 		at org.apache.solr.handler.component.FacetComponent.process(FacetComponent.java:87)
      [mvn] 		at org.apache.solr.handler.component.SearchHandler.handleRequestBody(SearchHandler.java:206)
      [mvn] 		at org.apache.solr.handler.RequestHandlerBase.handleRequest(RequestHandlerBase.java:129)
      [mvn] 		at org.apache.solr.core.SolrCore.execute(SolrCore.java:1701)
      [mvn] 		at org.apache.solr.util.TestHarness.query(TestHarness.java:364)
      [mvn] 		at org.apache.solr.util.TestHarness.query(TestHarness.java:346)
      [mvn] 		at org.apache.solr.SolrTestCaseJ4.assertQEx(SolrTestCaseJ4.java:618)
      [mvn] 		at org.apache.solr.request.SimpleFacetsTest.testRangeFacetInfiniteLoopDetection(SimpleFacetsTest.java:2063)
      [mvn] 		at sun.reflect.NativeMethodAccessorImpl.invoke0(Native Method)
      [mvn] 		at sun.reflect.NativeMethodAccessorImpl.invoke(NativeMethodAccessorImpl.java:57)
      [mvn] 		at sun.reflect.DelegatingMethodAccessorImpl.invoke(DelegatingMethodAccessorImpl.java:43)
      [mvn] 		at java.lang.reflect.Method.invoke(Method.java:616)
      [mvn] 		at com.carrotsearch.randomizedtesting.RandomizedRunner.invoke(RandomizedRunner.java:1559)
      [mvn] 		at com.carrotsearch.randomizedtesting.RandomizedRunner.access$600(RandomizedRunner.java:79)
      [mvn] 		at com.carrotsearch.randomizedtesting.RandomizedRunner$6.evaluate(RandomizedRunner.java:737)
      [mvn] 		at com.carrotsearch.randomizedtesting.RandomizedRunner$7.evaluate(RandomizedRunner.java:773)
      [mvn] 		at com.carrotsearch.randomizedtesting.RandomizedRunner$8.evaluate(RandomizedRunner.java:787)
      [mvn] 		at com.carrotsearch.randomizedtesting.rules.SystemPropertiesRestoreRule$1.evaluate(SystemPropertiesRestoreRule.java:53)
      [mvn] 		at org.apache.lucene.util.TestRuleSetupTeardownChained$1.evaluate(TestRuleSetupTeardownChained.java:50)
      [mvn] 		at org.apache.lucene.util.TestRuleFieldCacheSanity$1.evaluate(TestRuleFieldCacheSanity.java:51)
      [mvn] 		at org.apache.lucene.util.AbstractBeforeAfterRule$1.evaluate(AbstractBeforeAfterRule.java:45)
      [mvn] 		at com.carrotsearch.randomizedtesting.rules.SystemPropertiesInvariantRule$1.evaluate(SystemPropertiesInvariantRule.java:55)
      [mvn] 		at org.apache.lucene.util.TestRuleThreadAndTestName$1.evaluate(TestRuleThreadAndTestName.java:48)
      [mvn] 		at org.apache.lucene.util.TestRuleIgnoreAfterMaxFailures$1.evaluate(TestRuleIgnoreAfterMaxFailures.java:70)
      [mvn] 		at org.apache.lucene.util.TestRuleMarkFailure$1.evaluate(TestRuleMarkFailure.java:48)
      [mvn] 		at com.carrotsearch.randomizedtesting.rules.StatementAdapter.evaluate(StatementAdapter.java:36)
      [mvn] 		at com.carrotsearch.randomizedtesting.ThreadLeakControl$StatementRunner.run(ThreadLeakControl.java:358)
      [mvn] 		at com.carrotsearch.randomizedtesting.ThreadLeakControl.forkTimeoutingTask(ThreadLeakControl.java:782)
      [mvn] 		at com.carrotsearch.randomizedtesting.ThreadLeakControl$3.evaluate(ThreadLeakControl.java:442)
      [mvn] 		at com.carrotsearch.randomizedtesting.RandomizedRunner.runSingleTest(RandomizedRunner.java:746)
      [mvn] 		at com.carrotsearch.randomizedtesting.RandomizedRunner$3.evaluate(RandomizedRunner.java:648)
      [mvn] 		at com.carrotsearch.randomizedtesting.RandomizedRunner$4.evaluate(RandomizedRunner.java:682)
      [mvn] 		at com.carrotsearch.randomizedtesting.RandomizedRunner$5.evaluate(RandomizedRunner.java:693)
      [mvn] 		at com.carrotsearch.randomizedtesting.rules.StatementAdapter.evaluate(StatementAdapter.java:36)
      [mvn] 		at com.carrotsearch.randomizedtesting.rules.SystemPropertiesRestoreRule$1.evaluate(SystemPropertiesRestoreRule.java:53)
      [mvn] 		at org.apache.lucene.util.AbstractBeforeAfterRule$1.evaluate(AbstractBeforeAfterRule.java:45)
      [mvn] 		at org.apache.lucene.util.TestRuleStoreClassName$1.evaluate(TestRuleStoreClassName.java:42)
      [mvn] 		at com.carrotsearch.randomizedtesting.rules.SystemPropertiesInvariantRule$1.evaluate(SystemPropertiesInvariantRule.java:55)
      [mvn] 		at com.carrotsearch.randomizedtesting.rules.NoShadowingOrOverridesOnMethodsRule$1.evaluate(NoShadowingOrOverridesOnMethodsRule.java:39)
      [mvn] 		at com.carrotsearch.randomizedtesting.rules.NoShadowingOrOverridesOnMethodsRule$1.evaluate(NoShadowingOrOverridesOnMethodsRule.java:39)
      [mvn] 		at com.carrotsearch.randomizedtesting.rules.StatementAdapter.evaluate(StatementAdapter.java:36)
      [mvn] 		at org.apache.lucene.util.TestRuleAssertionsRequired$1.evaluate(TestRuleAssertionsRequired.java:43)
      [mvn] 		at org.apache.lucene.util.TestRuleMarkFailure$1.evaluate(TestRuleMarkFailure.java:48)
      [mvn] 		at org.apache.lucene.util.TestRuleIgnoreAfterMaxFailures$1.evaluate(TestRuleIgnoreAfterMaxFailures.java:70)
      [mvn] 		at org.apache.lucene.util.TestRuleIgnoreTestSuites$1.evaluate(TestRuleIgnoreTestSuites.java:55)
      [mvn] 		at com.carrotsearch.randomizedtesting.rules.StatementAdapter.evaluate(StatementAdapter.java:36)
      [mvn] 		at com.carrotsearch.randomizedtesting.ThreadLeakControl$StatementRunner.run(ThreadLeakControl.java:358)
      [mvn] 		at java.lang.Thread.run(Thread.java:679)
      [mvn] 	
      [mvn] 3244 T432 C0 oasc.SolrException.log SEVERE org.apache.solr.common.SolrException: range facet infinite loop: gap is either zero, or too small relative start/end and caused underflow: Fri Sep 21 12:46:42 AST 2012 + +0DAYS = Fri Sep 21 12:46:42 AST 2012
      [mvn] 		at org.apache.solr.request.SimpleFacets.getFacetRangeCounts(SimpleFacets.java:1122)
      [mvn] 		at org.apache.solr.request.SimpleFacets.getFacetRangeCounts(SimpleFacets.java:1074)
      [mvn] 		at org.apache.solr.request.SimpleFacets.getFacetRangeCounts(SimpleFacets.java:1018)
      [mvn] 		at org.apache.solr.request.SimpleFacets.getFacetCounts(SimpleFacets.java:208)
      [mvn] 		at org.apache.solr.handler.component.FacetComponent.process(FacetComponent.java:87)
      [mvn] 		at org.apache.solr.handler.component.SearchHandler.handleRequestBody(SearchHandler.java:206)
      [mvn] 		at org.apache.solr.handler.RequestHandlerBase.handleRequest(RequestHandlerBase.java:129)
      [mvn] 		at org.apache.solr.core.SolrCore.execute(SolrCore.java:1701)
      [mvn] 		at org.apache.solr.util.TestHarness.query(TestHarness.java:364)
      [mvn] 		at org.apache.solr.util.TestHarness.query(TestHarness.java:346)
      [mvn] 		at org.apache.solr.SolrTestCaseJ4.assertQEx(SolrTestCaseJ4.java:618)
      [mvn] 		at org.apache.solr.request.SimpleFacetsTest.testRangeFacetInfiniteLoopDetection(SimpleFacetsTest.java:2063)
      [mvn] 		at sun.reflect.NativeMethodAccessorImpl.invoke0(Native Method)
      [mvn] 		at sun.reflect.NativeMethodAccessorImpl.invoke(NativeMethodAccessorImpl.java:57)
      [mvn] 		at sun.reflect.DelegatingMethodAccessorImpl.invoke(DelegatingMethodAccessorImpl.java:43)
      [mvn] 		at java.lang.reflect.Method.invoke(Method.java:616)
      [mvn] 		at com.carrotsearch.randomizedtesting.RandomizedRunner.invoke(RandomizedRunner.java:1559)
      [mvn] 		at com.carrotsearch.randomizedtesting.RandomizedRunner.access$600(RandomizedRunner.java:79)
      [mvn] 		at com.carrotsearch.randomizedtesting.RandomizedRunner$6.evaluate(RandomizedRunner.java:737)
      [mvn] 		at com.carrotsearch.randomizedtesting.RandomizedRunner$7.evaluate(RandomizedRunner.java:773)
      [mvn] 		at com.carrotsearch.randomizedtesting.RandomizedRunner$8.evaluate(RandomizedRunner.java:787)
      [mvn] 		at com.carrotsearch.randomizedtesting.rules.SystemPropertiesRestoreRule$1.evaluate(SystemPropertiesRestoreRule.java:53)
      [mvn] 		at org.apache.lucene.util.TestRuleSetupTeardownChained$1.evaluate(TestRuleSetupTeardownChained.java:50)
      [mvn] 		at org.apache.lucene.util.TestRuleFieldCacheSanity$1.evaluate(TestRuleFieldCacheSanity.java:51)
      [mvn] 		at org.apache.lucene.util.AbstractBeforeAfterRule$1.evaluate(AbstractBeforeAfterRule.java:45)
      [mvn] 		at com.carrotsearch.randomizedtesting.rules.SystemPropertiesInvariantRule$1.evaluate(SystemPropertiesInvariantRule.java:55)
      [mvn] 		at org.apache.lucene.util.TestRuleThreadAndTestName$1.evaluate(TestRuleThreadAndTestName.java:48)
      [mvn] 		at org.apache.lucene.util.TestRuleIgnoreAfterMaxFailures$1.evaluate(TestRuleIgnoreAfterMaxFailures.java:70)
      [mvn] 		at org.apache.lucene.util.TestRuleMarkFailure$1.evaluate(TestRuleMarkFailure.java:48)
      [mvn] 		at com.carrotsearch.randomizedtesting.rules.StatementAdapter.evaluate(StatementAdapter.java:36)
      [mvn] 		at com.carrotsearch.randomizedtesting.ThreadLeakControl$StatementRunner.run(ThreadLeakControl.java:358)
      [mvn] 		at com.carrotsearch.randomizedtesting.ThreadLeakControl.forkTimeoutingTask(ThreadLeakControl.java:782)
      [mvn] 		at com.carrotsearch.randomizedtesting.ThreadLeakControl$3.evaluate(ThreadLeakControl.java:442)
      [mvn] 		at com.carrotsearch.randomizedtesting.RandomizedRunner.runSingleTest(RandomizedRunner.java:746)
      [mvn] 		at com.carrotsearch.randomizedtesting.RandomizedRunner$3.evaluate(RandomizedRunner.java:648)
      [mvn] 		at com.carrotsearch.randomizedtesting.RandomizedRunner$4.evaluate(RandomizedRunner.java:682)
      [mvn] 		at com.carrotsearch.randomizedtesting.RandomizedRunner$5.evaluate(RandomizedRunner.java:693)
      [mvn] 		at com.carrotsearch.randomizedtesting.rules.StatementAdapter.evaluate(StatementAdapter.java:36)
      [mvn] 		at com.carrotsearch.randomizedtesting.rules.SystemPropertiesRestoreRule$1.evaluate(SystemPropertiesRestoreRule.java:53)
      [mvn] 		at org.apache.lucene.util.AbstractBeforeAfterRule$1.evaluate(AbstractBeforeAfterRule.java:45)
      [mvn] 		at org.apache.lucene.util.TestRuleStoreClassName$1.evaluate(TestRuleStoreClassName.java:42)
      [mvn] 		at com.carrotsearch.randomizedtesting.rules.SystemPropertiesInvariantRule$1.evaluate(SystemPropertiesInvariantRule.java:55)
      [mvn] 		at com.carrotsearch.randomizedtesting.rules.NoShadowingOrOverridesOnMethodsRule$1.evaluate(NoShadowingOrOverridesOnMethodsRule.java:39)
      [mvn] 		at com.carrotsearch.randomizedtesting.rules.NoShadowingOrOverridesOnMethodsRule$1.evaluate(NoShadowingOrOverridesOnMethodsRule.java:39)
      [mvn] 		at com.carrotsearch.randomizedtesting.rules.StatementAdapter.evaluate(StatementAdapter.java:36)
      [mvn] 		at org.apache.lucene.util.TestRuleAssertionsRequired$1.evaluate(TestRuleAssertionsRequired.java:43)
      [mvn] 		at org.apache.lucene.util.TestRuleMarkFailure$1.evaluate(TestRuleMarkFailure.java:48)
      [mvn] 		at org.apache.lucene.util.TestRuleIgnoreAfterMaxFailures$1.evaluate(TestRuleIgnoreAfterMaxFailures.java:70)
      [mvn] 		at org.apache.lucene.util.TestRuleIgnoreTestSuites$1.evaluate(TestRuleIgnoreTestSuites.java:55)
      [mvn] 		at com.carrotsearch.randomizedtesting.rules.StatementAdapter.evaluate(StatementAdapter.java:36)
      [mvn] 		at com.carrotsearch.randomizedtesting.ThreadLeakControl$StatementRunner.run(ThreadLeakControl.java:358)
      [mvn] 		at java.lang.Thread.run(Thread.java:679)
      [mvn] 	
      [mvn] 3245 T432 C0 oasc.SolrException.log SEVERE org.apache.solr.common.SolrException: range facet infinite loop: gap is either zero, or too small relative start/end and caused underflow: 9.9999998E10 + 2160 = 9.9999998E10
      [mvn] 		at org.apache.solr.request.SimpleFacets.getFacetRangeCounts(SimpleFacets.java:1122)
      [mvn] 		at org.apache.solr.request.SimpleFacets.getFacetRangeCounts(SimpleFacets.java:1074)
      [mvn] 		at org.apache.solr.request.SimpleFacets.getFacetRangeCounts(SimpleFacets.java:1018)
      [mvn] 		at org.apache.solr.request.SimpleFacets.getFacetCounts(SimpleFacets.java:208)
      [mvn] 		at org.apache.solr.handler.component.FacetComponent.process(FacetComponent.java:87)
      [mvn] 		at org.apache.solr.handler.component.SearchHandler.handleRequestBody(SearchHandler.java:206)
      [mvn] 		at org.apache.solr.handler.RequestHandlerBase.handleRequest(RequestHandlerBase.java:129)
      [mvn] 		at org.apache.solr.core.SolrCore.execute(SolrCore.java:1701)
      [mvn] 		at org.apache.solr.util.TestHarness.query(TestHarness.java:364)
      [mvn] 		at org.apache.solr.util.TestHarness.query(TestHarness.java:346)
      [mvn] 		at org.apache.solr.SolrTestCaseJ4.assertQEx(SolrTestCaseJ4.java:618)
      [mvn] 		at org.apache.solr.request.SimpleFacetsTest.testRangeFacetInfiniteLoopDetection(SimpleFacetsTest.java:2075)
      [mvn] 		at sun.reflect.NativeMethodAccessorImpl.invoke0(Native Method)
      [mvn] 		at sun.reflect.NativeMethodAccessorImpl.invoke(NativeMethodAccessorImpl.java:57)
      [mvn] 		at sun.reflect.DelegatingMethodAccessorImpl.invoke(DelegatingMethodAccessorImpl.java:43)
      [mvn] 		at java.lang.reflect.Method.invoke(Method.java:616)
      [mvn] 		at com.carrotsearch.randomizedtesting.RandomizedRunner.invoke(RandomizedRunner.java:1559)
      [mvn] 		at com.carrotsearch.randomizedtesting.RandomizedRunner.access$600(RandomizedRunner.java:79)
      [mvn] 		at com.carrotsearch.randomizedtesting.RandomizedRunner$6.evaluate(RandomizedRunner.java:737)
      [mvn] 		at com.carrotsearch.randomizedtesting.RandomizedRunner$7.evaluate(RandomizedRunner.java:773)
      [mvn] 		at com.carrotsearch.randomizedtesting.RandomizedRunner$8.evaluate(RandomizedRunner.java:787)
      [mvn] 		at com.carrotsearch.randomizedtesting.rules.SystemPropertiesRestoreRule$1.evaluate(SystemPropertiesRestoreRule.java:53)
      [mvn] 		at org.apache.lucene.util.TestRuleSetupTeardownChained$1.evaluate(TestRuleSetupTeardownChained.java:50)
      [mvn] 		at org.apache.lucene.util.TestRuleFieldCacheSanity$1.evaluate(TestRuleFieldCacheSanity.java:51)
      [mvn] 		at org.apache.lucene.util.AbstractBeforeAfterRule$1.evaluate(AbstractBeforeAfterRule.java:45)
      [mvn] 		at com.carrotsearch.randomizedtesting.rules.SystemPropertiesInvariantRule$1.evaluate(SystemPropertiesInvariantRule.java:55)
      [mvn] 		at org.apache.lucene.util.TestRuleThreadAndTestName$1.evaluate(TestRuleThreadAndTestName.java:48)
      [mvn] 		at org.apache.lucene.util.TestRuleIgnoreAfterMaxFailures$1.evaluate(TestRuleIgnoreAfterMaxFailures.java:70)
      [mvn] 		at org.apache.lucene.util.TestRuleMarkFailure$1.evaluate(TestRuleMarkFailure.java:48)
      [mvn] 		at com.carrotsearch.randomizedtesting.rules.StatementAdapter.evaluate(StatementAdapter.java:36)
      [mvn] 		at com.carrotsearch.randomizedtesting.ThreadLeakControl$StatementRunner.run(ThreadLeakControl.java:358)
      [mvn] 		at com.carrotsearch.randomizedtesting.ThreadLeakControl.forkTimeoutingTask(ThreadLeakControl.java:782)
      [mvn] 		at com.carrotsearch.randomizedtesting.ThreadLeakControl$3.evaluate(ThreadLeakControl.java:442)
      [mvn] 		at com.carrotsearch.randomizedtesting.RandomizedRunner.runSingleTest(RandomizedRunner.java:746)
      [mvn] 		at com.carrotsearch.randomizedtesting.RandomizedRunner$3.evaluate(RandomizedRunner.java:648)
      [mvn] 		at com.carrotsearch.randomizedtesting.RandomizedRunner$4.evaluate(RandomizedRunner.java:682)
      [mvn] 		at com.carrotsearch.randomizedtesting.RandomizedRunner$5.evaluate(RandomizedRunner.java:693)
      [mvn] 		at com.carrotsearch.randomizedtesting.rules.StatementAdapter.evaluate(StatementAdapter.java:36)
      [mvn] 		at com.carrotsearch.randomizedtesting.rules.SystemPropertiesRestoreRule$1.evaluate(SystemPropertiesRestoreRule.java:53)
      [mvn] 		at org.apache.lucene.util.AbstractBeforeAfterRule$1.evaluate(AbstractBeforeAfterRule.java:45)
      [mvn] 		at org.apache.lucene.util.TestRuleStoreClassName$1.evaluate(TestRuleStoreClassName.java:42)
      [mvn] 		at com.carrotsearch.randomizedtesting.rules.SystemPropertiesInvariantRule$1.evaluate(SystemPropertiesInvariantRule.java:55)
      [mvn] 		at com.carrotsearch.randomizedtesting.rules.NoShadowingOrOverridesOnMethodsRule$1.evaluate(NoShadowingOrOverridesOnMethodsRule.java:39)
      [mvn] 		at com.carrotsearch.randomizedtesting.rules.NoShadowingOrOverridesOnMethodsRule$1.evaluate(NoShadowingOrOverridesOnMethodsRule.java:39)
      [mvn] 		at com.carrotsearch.randomizedtesting.rules.StatementAdapter.evaluate(StatementAdapter.java:36)
      [mvn] 		at org.apache.lucene.util.TestRuleAssertionsRequired$1.evaluate(TestRuleAssertionsRequired.java:43)
      [mvn] 		at org.apache.lucene.util.TestRuleMarkFailure$1.evaluate(TestRuleMarkFailure.java:48)
      [mvn] 		at org.apache.lucene.util.TestRuleIgnoreAfterMaxFailures$1.evaluate(TestRuleIgnoreAfterMaxFailures.java:70)
      [mvn] 		at org.apache.lucene.util.TestRuleIgnoreTestSuites$1.evaluate(TestRuleIgnoreTestSuites.java:55)
      [mvn] 		at com.carrotsearch.randomizedtesting.rules.StatementAdapter.evaluate(StatementAdapter.java:36)
      [mvn] 		at com.carrotsearch.randomizedtesting.ThreadLeakControl$StatementRunner.run(ThreadLeakControl.java:358)
      [mvn] 		at java.lang.Thread.run(Thread.java:679)
      [mvn] 	
      [mvn] 3246 T432 C0 oasc.SolrException.log SEVERE org.apache.solr.common.SolrException: range facet infinite loop: gap is either zero, or too small relative start/end and caused underflow: 9.9999998E10 + 2160 = 9.9999998E10
      [mvn] 		at org.apache.solr.request.SimpleFacets.getFacetRangeCounts(SimpleFacets.java:1122)
      [mvn] 		at org.apache.solr.request.SimpleFacets.getFacetRangeCounts(SimpleFacets.java:1074)
      [mvn] 		at org.apache.solr.request.SimpleFacets.getFacetRangeCounts(SimpleFacets.java:1018)
      [mvn] 		at org.apache.solr.request.SimpleFacets.getFacetCounts(SimpleFacets.java:208)
      [mvn] 		at org.apache.solr.handler.component.FacetComponent.process(FacetComponent.java:87)
      [mvn] 		at org.apache.solr.handler.component.SearchHandler.handleRequestBody(SearchHandler.java:206)
      [mvn] 		at org.apache.solr.handler.RequestHandlerBase.handleRequest(RequestHandlerBase.java:129)
      [mvn] 		at org.apache.solr.core.SolrCore.execute(SolrCore.java:1701)
      [mvn] 		at org.apache.solr.util.TestHarness.query(TestHarness.java:364)
      [mvn] 		at org.apache.solr.util.TestHarness.query(TestHarness.java:346)
      [mvn] 		at org.apache.solr.SolrTestCaseJ4.assertQEx(SolrTestCaseJ4.java:618)
      [mvn] 		at org.apache.solr.request.SimpleFacetsTest.testRangeFacetInfiniteLoopDetection(SimpleFacetsTest.java:2075)
      [mvn] 		at sun.reflect.NativeMethodAccessorImpl.invoke0(Native Method)
      [mvn] 		at sun.reflect.NativeMethodAccessorImpl.invoke(NativeMethodAccessorImpl.java:57)
      [mvn] 		at sun.reflect.DelegatingMethodAccessorImpl.invoke(DelegatingMethodAccessorImpl.java:43)
      [mvn] 		at java.lang.reflect.Method.invoke(Method.java:616)
      [mvn] 		at com.carrotsearch.randomizedtesting.RandomizedRunner.invoke(RandomizedRunner.java:1559)
      [mvn] 		at com.carrotsearch.randomizedtesting.RandomizedRunner.access$600(RandomizedRunner.java:79)
      [mvn] 		at com.carrotsearch.randomizedtesting.RandomizedRunner$6.evaluate(RandomizedRunner.java:737)
      [mvn] 		at com.carrotsearch.randomizedtesting.RandomizedRunner$7.evaluate(RandomizedRunner.java:773)
      [mvn] 		at com.carrotsearch.randomizedtesting.RandomizedRunner$8.evaluate(RandomizedRunner.java:787)
      [mvn] 		at com.carrotsearch.randomizedtesting.rules.SystemPropertiesRestoreRule$1.evaluate(SystemPropertiesRestoreRule.java:53)
      [mvn] 		at org.apache.lucene.util.TestRuleSetupTeardownChained$1.evaluate(TestRuleSetupTeardownChained.java:50)
      [mvn] 		at org.apache.lucene.util.TestRuleFieldCacheSanity$1.evaluate(TestRuleFieldCacheSanity.java:51)
      [mvn] 		at org.apache.lucene.util.AbstractBeforeAfterRule$1.evaluate(AbstractBeforeAfterRule.java:45)
      [mvn] 		at com.carrotsearch.randomizedtesting.rules.SystemPropertiesInvariantRule$1.evaluate(SystemPropertiesInvariantRule.java:55)
      [mvn] 		at org.apache.lucene.util.TestRuleThreadAndTestName$1.evaluate(TestRuleThreadAndTestName.java:48)
      [mvn] 		at org.apache.lucene.util.TestRuleIgnoreAfterMaxFailures$1.evaluate(TestRuleIgnoreAfterMaxFailures.java:70)
      [mvn] 		at org.apache.lucene.util.TestRuleMarkFailure$1.evaluate(TestRuleMarkFailure.java:48)
      [mvn] 		at com.carrotsearch.randomizedtesting.rules.StatementAdapter.evaluate(StatementAdapter.java:36)
      [mvn] 		at com.carrotsearch.randomizedtesting.ThreadLeakControl$StatementRunner.run(ThreadLeakControl.java:358)
      [mvn] 		at com.carrotsearch.randomizedtesting.ThreadLeakControl.forkTimeoutingTask(ThreadLeakControl.java:782)
      [mvn] 		at com.carrotsearch.randomizedtesting.ThreadLeakControl$3.evaluate(ThreadLeakControl.java:442)
      [mvn] 		at com.carrotsearch.randomizedtesting.RandomizedRunner.runSingleTest(RandomizedRunner.java:746)
      [mvn] 		at com.carrotsearch.randomizedtesting.RandomizedRunner$3.evaluate(RandomizedRunner.java:648)
      [mvn] 		at com.carrotsearch.randomizedtesting.RandomizedRunner$4.evaluate(RandomizedRunner.java:682)
      [mvn] 		at com.carrotsearch.randomizedtesting.RandomizedRunner$5.evaluate(RandomizedRunner.java:693)
      [mvn] 		at com.carrotsearch.randomizedtesting.rules.StatementAdapter.evaluate(StatementAdapter.java:36)
      [mvn] 		at com.carrotsearch.randomizedtesting.rules.SystemPropertiesRestoreRule$1.evaluate(SystemPropertiesRestoreRule.java:53)
      [mvn] 		at org.apache.lucene.util.AbstractBeforeAfterRule$1.evaluate(AbstractBeforeAfterRule.java:45)
      [mvn] 		at org.apache.lucene.util.TestRuleStoreClassName$1.evaluate(TestRuleStoreClassName.java:42)
      [mvn] 		at com.carrotsearch.randomizedtesting.rules.SystemPropertiesInvariantRule$1.evaluate(SystemPropertiesInvariantRule.java:55)
      [mvn] 		at com.carrotsearch.randomizedtesting.rules.NoShadowingOrOverridesOnMethodsRule$1.evaluate(NoShadowingOrOverridesOnMethodsRule.java:39)
      [mvn] 		at com.carrotsearch.randomizedtesting.rules.NoShadowingOrOverridesOnMethodsRule$1.evaluate(NoShadowingOrOverridesOnMethodsRule.java:39)
      [mvn] 		at com.carrotsearch.randomizedtesting.rules.StatementAdapter.evaluate(StatementAdapter.java:36)
      [mvn] 		at org.apache.lucene.util.TestRuleAssertionsRequired$1.evaluate(TestRuleAssertionsRequired.java:43)
      [mvn] 		at org.apache.lucene.util.TestRuleMarkFailure$1.evaluate(TestRuleMarkFailure.java:48)
      [mvn] 		at org.apache.lucene.util.TestRuleIgnoreAfterMaxFailures$1.evaluate(TestRuleIgnoreAfterMaxFailures.java:70)
      [mvn] 		at org.apache.lucene.util.TestRuleIgnoreTestSuites$1.evaluate(TestRuleIgnoreTestSuites.java:55)
      [mvn] 		at com.carrotsearch.randomizedtesting.rules.StatementAdapter.evaluate(StatementAdapter.java:36)
      [mvn] 		at com.carrotsearch.randomizedtesting.ThreadLeakControl$StatementRunner.run(ThreadLeakControl.java:358)
      [mvn] 		at java.lang.Thread.run(Thread.java:679)
      [mvn] 	
      [mvn] 3246 T432 C0 oasc.SolrException.log SEVERE org.apache.solr.common.SolrException: range facet infinite loop: gap is either zero, or too small relative start/end and caused underflow: 9.9E12 + 0.0003 = 9.9E12
      [mvn] 		at org.apache.solr.request.SimpleFacets.getFacetRangeCounts(SimpleFacets.java:1122)
      [mvn] 		at org.apache.solr.request.SimpleFacets.getFacetRangeCounts(SimpleFacets.java:1074)
      [mvn] 		at org.apache.solr.request.SimpleFacets.getFacetRangeCounts(SimpleFacets.java:1018)
      [mvn] 		at org.apache.solr.request.SimpleFacets.getFacetCounts(SimpleFacets.java:208)
      [mvn] 		at org.apache.solr.handler.component.FacetComponent.process(FacetComponent.java:87)
      [mvn] 		at org.apache.solr.handler.component.SearchHandler.handleRequestBody(SearchHandler.java:206)
      [mvn] 		at org.apache.solr.handler.RequestHandlerBase.handleRequest(RequestHandlerBase.java:129)
      [mvn] 		at org.apache.solr.core.SolrCore.execute(SolrCore.java:1701)
      [mvn] 		at org.apache.solr.util.TestHarness.query(TestHarness.java:364)
      [mvn] 		at org.apache.solr.util.TestHarness.query(TestHarness.java:346)
      [mvn] 		at org.apache.solr.SolrTestCaseJ4.assertQEx(SolrTestCaseJ4.java:618)
      [mvn] 		at org.apache.solr.request.SimpleFacetsTest.testRangeFacetInfiniteLoopDetection(SimpleFacetsTest.java:2086)
      [mvn] 		at sun.reflect.NativeMethodAccessorImpl.invoke0(Native Method)
      [mvn] 		at sun.reflect.NativeMethodAccessorImpl.invoke(NativeMethodAccessorImpl.java:57)
      [mvn] 		at sun.reflect.DelegatingMethodAccessorImpl.invoke(DelegatingMethodAccessorImpl.java:43)
      [mvn] 		at java.lang.reflect.Method.invoke(Method.java:616)
      [mvn] 		at com.carrotsearch.randomizedtesting.RandomizedRunner.invoke(RandomizedRunner.java:1559)
      [mvn] 		at com.carrotsearch.randomizedtesting.RandomizedRunner.access$600(RandomizedRunner.java:79)
      [mvn] 		at com.carrotsearch.randomizedtesting.RandomizedRunner$6.evaluate(RandomizedRunner.java:737)
      [mvn] 		at com.carrotsearch.randomizedtesting.RandomizedRunner$7.evaluate(RandomizedRunner.java:773)
      [mvn] 		at com.carrotsearch.randomizedtesting.RandomizedRunner$8.evaluate(RandomizedRunner.java:787)
      [mvn] 		at com.carrotsearch.randomizedtesting.rules.SystemPropertiesRestoreRule$1.evaluate(SystemPropertiesRestoreRule.java:53)
      [mvn] 		at org.apache.lucene.util.TestRuleSetupTeardownChained$1.evaluate(TestRuleSetupTeardownChained.java:50)
      [mvn] 		at org.apache.lucene.util.TestRuleFieldCacheSanity$1.evaluate(TestRuleFieldCacheSanity.java:51)
      [mvn] 		at org.apache.lucene.util.AbstractBeforeAfterRule$1.evaluate(AbstractBeforeAfterRule.java:45)
      [mvn] 		at com.carrotsearch.randomizedtesting.rules.SystemPropertiesInvariantRule$1.evaluate(SystemPropertiesInvariantRule.java:55)
      [mvn] 		at org.apache.lucene.util.TestRuleThreadAndTestName$1.evaluate(TestRuleThreadAndTestName.java:48)
      [mvn] 		at org.apache.lucene.util.TestRuleIgnoreAfterMaxFailures$1.evaluate(TestRuleIgnoreAfterMaxFailures.java:70)
      [mvn] 		at org.apache.lucene.util.TestRuleMarkFailure$1.evaluate(TestRuleMarkFailure.java:48)
      [mvn] 		at com.carrotsearch.randomizedtesting.rules.StatementAdapter.evaluate(StatementAdapter.java:36)
      [mvn] 		at com.carrotsearch.randomizedtesting.ThreadLeakControl$StatementRunner.run(ThreadLeakControl.java:358)
      [mvn] 		at com.carrotsearch.randomizedtesting.ThreadLeakControl.forkTimeoutingTask(ThreadLeakControl.java:782)
      [mvn] 		at com.carrotsearch.randomizedtesting.ThreadLeakControl$3.evaluate(ThreadLeakControl.java:442)
      [mvn] 		at com.carrotsearch.randomizedtesting.RandomizedRunner.runSingleTest(RandomizedRunner.java:746)
      [mvn] 		at com.carrotsearch.randomizedtesting.RandomizedRunner$3.evaluate(RandomizedRunner.java:648)
      [mvn] 		at com.carrotsearch.randomizedtesting.RandomizedRunner$4.evaluate(RandomizedRunner.java:682)
      [mvn] 		at com.carrotsearch.randomizedtesting.RandomizedRunner$5.evaluate(RandomizedRunner.java:693)
      [mvn] 		at com.carrotsearch.randomizedtesting.rules.StatementAdapter.evaluate(StatementAdapter.java:36)
      [mvn] 		at com.carrotsearch.randomizedtesting.rules.SystemPropertiesRestoreRule$1.evaluate(SystemPropertiesRestoreRule.java:53)
      [mvn] 		at org.apache.lucene.util.AbstractBeforeAfterRule$1.evaluate(AbstractBeforeAfterRule.java:45)
      [mvn] 		at org.apache.lucene.util.TestRuleStoreClassName$1.evaluate(TestRuleStoreClassName.java:42)
      [mvn] 		at com.carrotsearch.randomizedtesting.rules.SystemPropertiesInvariantRule$1.evaluate(SystemPropertiesInvariantRule.java:55)
      [mvn] 		at com.carrotsearch.randomizedtesting.rules.NoShadowingOrOverridesOnMethodsRule$1.evaluate(NoShadowingOrOverridesOnMethodsRule.java:39)
      [mvn] 		at com.carrotsearch.randomizedtesting.rules.NoShadowingOrOverridesOnMethodsRule$1.evaluate(NoShadowingOrOverridesOnMethodsRule.java:39)
      [mvn] 		at com.carrotsearch.randomizedtesting.rules.StatementAdapter.evaluate(StatementAdapter.java:36)
      [mvn] 		at org.apache.lucene.util.TestRuleAssertionsRequired$1.evaluate(TestRuleAssertionsRequired.java:43)
      [mvn] 		at org.apache.lucene.util.TestRuleMarkFailure$1.evaluate(TestRuleMarkFailure.java:48)
      [mvn] 		at org.apache.lucene.util.TestRuleIgnoreAfterMaxFailures$1.evaluate(TestRuleIgnoreAfterMaxFailures.java:70)
      [mvn] 		at org.apache.lucene.util.TestRuleIgnoreTestSuites$1.evaluate(TestRuleIgnoreTestSuites.java:55)
      [mvn] 		at com.carrotsearch.randomizedtesting.rules.StatementAdapter.evaluate(StatementAdapter.java:36)
      [mvn] 		at com.carrotsearch.randomizedtesting.ThreadLeakControl$StatementRunner.run(ThreadLeakControl.java:358)
      [mvn] 		at java.lang.Thread.run(Thread.java:679)
      [mvn] 	
      [mvn] 3247 T432 C0 oasc.SolrException.log SEVERE org.apache.solr.common.SolrException: range facet infinite loop: gap is either zero, or too small relative start/end and caused underflow: 9.9E12 + 0.0003 = 9.9E12
      [mvn] 		at org.apache.solr.request.SimpleFacets.getFacetRangeCounts(SimpleFacets.java:1122)
      [mvn] 		at org.apache.solr.request.SimpleFacets.getFacetRangeCounts(SimpleFacets.java:1074)
      [mvn] 		at org.apache.solr.request.SimpleFacets.getFacetRangeCounts(SimpleFacets.java:1018)
      [mvn] 		at org.apache.solr.request.SimpleFacets.getFacetCounts(SimpleFacets.java:208)
      [mvn] 		at org.apache.solr.handler.component.FacetComponent.process(FacetComponent.java:87)
      [mvn] 		at org.apache.solr.handler.component.SearchHandler.handleRequestBody(SearchHandler.java:206)
      [mvn] 		at org.apache.solr.handler.RequestHandlerBase.handleRequest(RequestHandlerBase.java:129)
      [mvn] 		at org.apache.solr.core.SolrCore.execute(SolrCore.java:1701)
      [mvn] 		at org.apache.solr.util.TestHarness.query(TestHarness.java:364)
      [mvn] 		at org.apache.solr.util.TestHarness.query(TestHarness.java:346)
      [mvn] 		at org.apache.solr.SolrTestCaseJ4.assertQEx(SolrTestCaseJ4.java:618)
      [mvn] 		at org.apache.solr.request.SimpleFacetsTest.testRangeFacetInfiniteLoopDetection(SimpleFacetsTest.java:2086)
      [mvn] 		at sun.reflect.NativeMethodAccessorImpl.invoke0(Native Method)
      [mvn] 		at sun.reflect.NativeMethodAccessorImpl.invoke(NativeMethodAccessorImpl.java:57)
      [mvn] 		at sun.reflect.DelegatingMethodAccessorImpl.invoke(DelegatingMethodAccessorImpl.java:43)
      [mvn] 		at java.lang.reflect.Method.invoke(Method.java:616)
      [mvn] 		at com.carrotsearch.randomizedtesting.RandomizedRunner.invoke(RandomizedRunner.java:1559)
      [mvn] 		at com.carrotsearch.randomizedtesting.RandomizedRunner.access$600(RandomizedRunner.java:79)
      [mvn] 		at com.carrotsearch.randomizedtesting.RandomizedRunner$6.evaluate(RandomizedRunner.java:737)
      [mvn] 		at com.carrotsearch.randomizedtesting.RandomizedRunner$7.evaluate(RandomizedRunner.java:773)
      [mvn] 		at com.carrotsearch.randomizedtesting.RandomizedRunner$8.evaluate(RandomizedRunner.java:787)
      [mvn] 		at com.carrotsearch.randomizedtesting.rules.SystemPropertiesRestoreRule$1.evaluate(SystemPropertiesRestoreRule.java:53)
      [mvn] 		at org.apache.lucene.util.TestRuleSetupTeardownChained$1.evaluate(TestRuleSetupTeardownChained.java:50)
      [mvn] 		at org.apache.lucene.util.TestRuleFieldCacheSanity$1.evaluate(TestRuleFieldCacheSanity.java:51)
      [mvn] 		at org.apache.lucene.util.AbstractBeforeAfterRule$1.evaluate(AbstractBeforeAfterRule.java:45)
      [mvn] 		at com.carrotsearch.randomizedtesting.rules.SystemPropertiesInvariantRule$1.evaluate(SystemPropertiesInvariantRule.java:55)
      [mvn] 		at org.apache.lucene.util.TestRuleThreadAndTestName$1.evaluate(TestRuleThreadAndTestName.java:48)
      [mvn] 		at org.apache.lucene.util.TestRuleIgnoreAfterMaxFailures$1.evaluate(TestRuleIgnoreAfterMaxFailures.java:70)
      [mvn] 		at org.apache.lucene.util.TestRuleMarkFailure$1.evaluate(TestRuleMarkFailure.java:48)
      [mvn] 		at com.carrotsearch.randomizedtesting.rules.StatementAdapter.evaluate(StatementAdapter.java:36)
      [mvn] 		at com.carrotsearch.randomizedtesting.ThreadLeakControl$StatementRunner.run(ThreadLeakControl.java:358)
      [mvn] 		at com.carrotsearch.randomizedtesting.ThreadLeakControl.forkTimeoutingTask(ThreadLeakControl.java:782)
      [mvn] 		at com.carrotsearch.randomizedtesting.ThreadLeakControl$3.evaluate(ThreadLeakControl.java:442)
      [mvn] 		at com.carrotsearch.randomizedtesting.RandomizedRunner.runSingleTest(RandomizedRunner.java:746)
      [mvn] 		at com.carrotsearch.randomizedtesting.RandomizedRunner$3.evaluate(RandomizedRunner.java:648)
      [mvn] 		at com.carrotsearch.randomizedtesting.RandomizedRunner$4.evaluate(RandomizedRunner.java:682)
      [mvn] 		at com.carrotsearch.randomizedtesting.RandomizedRunner$5.evaluate(RandomizedRunner.java:693)
      [mvn] 		at com.carrotsearch.randomizedtesting.rules.StatementAdapter.evaluate(StatementAdapter.java:36)
      [mvn] 		at com.carrotsearch.randomizedtesting.rules.SystemPropertiesRestoreRule$1.evaluate(SystemPropertiesRestoreRule.java:53)
      [mvn] 		at org.apache.lucene.util.AbstractBeforeAfterRule$1.evaluate(AbstractBeforeAfterRule.java:45)
      [mvn] 		at org.apache.lucene.util.TestRuleStoreClassName$1.evaluate(TestRuleStoreClassName.java:42)
      [mvn] 		at com.carrotsearch.randomizedtesting.rules.SystemPropertiesInvariantRule$1.evaluate(SystemPropertiesInvariantRule.java:55)
      [mvn] 		at com.carrotsearch.randomizedtesting.rules.NoShadowingOrOverridesOnMethodsRule$1.evaluate(NoShadowingOrOverridesOnMethodsRule.java:39)
      [mvn] 		at com.carrotsearch.randomizedtesting.rules.NoShadowingOrOverridesOnMethodsRule$1.evaluate(NoShadowingOrOverridesOnMethodsRule.java:39)
      [mvn] 		at com.carrotsearch.randomizedtesting.rules.StatementAdapter.evaluate(StatementAdapter.java:36)
      [mvn] 		at org.apache.lucene.util.TestRuleAssertionsRequired$1.evaluate(TestRuleAssertionsRequired.java:43)
      [mvn] 		at org.apache.lucene.util.TestRuleMarkFailure$1.evaluate(TestRuleMarkFailure.java:48)
      [mvn] 		at org.apache.lucene.util.TestRuleIgnoreAfterMaxFailures$1.evaluate(TestRuleIgnoreAfterMaxFailures.java:70)
      [mvn] 		at org.apache.lucene.util.TestRuleIgnoreTestSuites$1.evaluate(TestRuleIgnoreTestSuites.java:55)
      [mvn] 		at com.carrotsearch.randomizedtesting.rules.StatementAdapter.evaluate(StatementAdapter.java:36)
      [mvn] 		at com.carrotsearch.randomizedtesting.ThreadLeakControl$StatementRunner.run(ThreadLeakControl.java:358)
      [mvn] 		at java.lang.Thread.run(Thread.java:679)
      [mvn] 	
      [mvn] Tests run: 32, Failures: 0, Errors: 0, Skipped: 0, Time elapsed: 3.381 sec
      [mvn] Running org.apache.solr.handler.component.StatsComponentTest
      [mvn] ASYNC  NEW_CORE C1 name=collection1 org.apache.solr.core.SolrCore@223755c6
      [mvn] 3582 T447 C1 oasc.SolrException.log SEVERE org.apache.solr.common.SolrException: Stats can only facet on single-valued fields, not: foo_ss
      [mvn] 		at org.apache.solr.handler.component.SimpleStats.getFieldCacheStats(StatsComponent.java:261)
      [mvn] 		at org.apache.solr.handler.component.SimpleStats.getStatsFields(StatsComponent.java:227)
      [mvn] 		at org.apache.solr.handler.component.SimpleStats.getStatsCounts(StatsComponent.java:201)
      [mvn] 		at org.apache.solr.handler.component.StatsComponent.process(StatsComponent.java:70)
      [mvn] 		at org.apache.solr.handler.component.SearchHandler.handleRequestBody(SearchHandler.java:206)
      [mvn] 		at org.apache.solr.handler.RequestHandlerBase.handleRequest(RequestHandlerBase.java:129)
      [mvn] 		at org.apache.solr.core.SolrCore.execute(SolrCore.java:1701)
      [mvn] 		at org.apache.solr.util.TestHarness.query(TestHarness.java:364)
      [mvn] 		at org.apache.solr.util.TestHarness.query(TestHarness.java:346)
      [mvn] 		at org.apache.solr.util.AbstractSolrTestCase.assertQEx(AbstractSolrTestCase.java:290)
      [mvn] 		at org.apache.solr.handler.component.StatsComponentTest.testStatsFacetMultivaluedErrorHandling(StatsComponentTest.java:363)
      [mvn] 		at sun.reflect.NativeMethodAccessorImpl.invoke0(Native Method)
      [mvn] 		at sun.reflect.NativeMethodAccessorImpl.invoke(NativeMethodAccessorImpl.java:57)
      [mvn] 		at sun.reflect.DelegatingMethodAccessorImpl.invoke(DelegatingMethodAccessorImpl.java:43)
      [mvn] 		at java.lang.reflect.Method.invoke(Method.java:616)
      [mvn] 		at com.carrotsearch.randomizedtesting.RandomizedRunner.invoke(RandomizedRunner.java:1559)
      [mvn] 		at com.carrotsearch.randomizedtesting.RandomizedRunner.access$600(RandomizedRunner.java:79)
      [mvn] 		at com.carrotsearch.randomizedtesting.RandomizedRunner$6.evaluate(RandomizedRunner.java:737)
      [mvn] 		at com.carrotsearch.randomizedtesting.RandomizedRunner$7.evaluate(RandomizedRunner.java:773)
      [mvn] 		at com.carrotsearch.randomizedtesting.RandomizedRunner$8.evaluate(RandomizedRunner.java:787)
      [mvn] 		at com.carrotsearch.randomizedtesting.rules.SystemPropertiesRestoreRule$1.evaluate(SystemPropertiesRestoreRule.java:53)
      [mvn] 		at org.apache.lucene.util.TestRuleSetupTeardownChained$1.evaluate(TestRuleSetupTeardownChained.java:50)
      [mvn] 		at org.apache.lucene.util.TestRuleFieldCacheSanity$1.evaluate(TestRuleFieldCacheSanity.java:51)
      [mvn] 		at org.apache.lucene.util.AbstractBeforeAfterRule$1.evaluate(AbstractBeforeAfterRule.java:45)
      [mvn] 		at com.carrotsearch.randomizedtesting.rules.SystemPropertiesInvariantRule$1.evaluate(SystemPropertiesInvariantRule.java:55)
      [mvn] 		at org.apache.lucene.util.TestRuleThreadAndTestName$1.evaluate(TestRuleThreadAndTestName.java:48)
      [mvn] 		at org.apache.lucene.util.TestRuleIgnoreAfterMaxFailures$1.evaluate(TestRuleIgnoreAfterMaxFailures.java:70)
      [mvn] 		at org.apache.lucene.util.TestRuleMarkFailure$1.evaluate(TestRuleMarkFailure.java:48)
      [mvn] 		at com.carrotsearch.randomizedtesting.rules.StatementAdapter.evaluate(StatementAdapter.java:36)
      [mvn] 		at com.carrotsearch.randomizedtesting.ThreadLeakControl$StatementRunner.run(ThreadLeakControl.java:358)
      [mvn] 		at com.carrotsearch.randomizedtesting.ThreadLeakControl.forkTimeoutingTask(ThreadLeakControl.java:782)
      [mvn] 		at com.carrotsearch.randomizedtesting.ThreadLeakControl$3.evaluate(ThreadLeakControl.java:442)
      [mvn] 		at com.carrotsearch.randomizedtesting.RandomizedRunner.runSingleTest(RandomizedRunner.java:746)
      [mvn] 		at com.carrotsearch.randomizedtesting.RandomizedRunner$3.evaluate(RandomizedRunner.java:648)
      [mvn] 		at com.carrotsearch.randomizedtesting.RandomizedRunner$4.evaluate(RandomizedRunner.java:682)
      [mvn] 		at com.carrotsearch.randomizedtesting.RandomizedRunner$5.evaluate(RandomizedRunner.java:693)
      [mvn] 		at com.carrotsearch.randomizedtesting.rules.StatementAdapter.evaluate(StatementAdapter.java:36)
      [mvn] 		at com.carrotsearch.randomizedtesting.rules.SystemPropertiesRestoreRule$1.evaluate(SystemPropertiesRestoreRule.java:53)
      [mvn] 		at org.apache.lucene.util.AbstractBeforeAfterRule$1.evaluate(AbstractBeforeAfterRule.java:45)
      [mvn] 		at org.apache.lucene.util.TestRuleStoreClassName$1.evaluate(TestRuleStoreClassName.java:42)
      [mvn] 		at com.carrotsearch.randomizedtesting.rules.SystemPropertiesInvariantRule$1.evaluate(SystemPropertiesInvariantRule.java:55)
      [mvn] 		at com.carrotsearch.randomizedtesting.rules.NoShadowingOrOverridesOnMethodsRule$1.evaluate(NoShadowingOrOverridesOnMethodsRule.java:39)
      [mvn] 		at com.carrotsearch.randomizedtesting.rules.NoShadowingOrOverridesOnMethodsRule$1.evaluate(NoShadowingOrOverridesOnMethodsRule.java:39)
      [mvn] 		at com.carrotsearch.randomizedtesting.rules.StatementAdapter.evaluate(StatementAdapter.java:36)
      [mvn] 		at org.apache.lucene.util.TestRuleAssertionsRequired$1.evaluate(TestRuleAssertionsRequired.java:43)
      [mvn] 		at org.apache.lucene.util.TestRuleMarkFailure$1.evaluate(TestRuleMarkFailure.java:48)
      [mvn] 		at org.apache.lucene.util.TestRuleIgnoreAfterMaxFailures$1.evaluate(TestRuleIgnoreAfterMaxFailures.java:70)
      [mvn] 		at org.apache.lucene.util.TestRuleIgnoreTestSuites$1.evaluate(TestRuleIgnoreTestSuites.java:55)
      [mvn] 		at com.carrotsearch.randomizedtesting.rules.StatementAdapter.evaluate(StatementAdapter.java:36)
      [mvn] 		at com.carrotsearch.randomizedtesting.ThreadLeakControl$StatementRunner.run(ThreadLeakControl.java:358)
      [mvn] 		at java.lang.Thread.run(Thread.java:679)
      [mvn] 	
      [mvn] Tests run: 7, Failures: 0, Errors: 0, Skipped: 0, Time elapsed: 3.647 sec
      [mvn] Running org.apache.solr.handler.TestCSVLoader
      [mvn] Creating dataDir: /usr/home/hudson/hudson-slave/workspace/Lucene-Solr-Maven-trunk/maven-build/solr/core/src/test/target/test/./solrtest-TestCSVLoader-1348246006478
      [mvn] Tests run: 5, Failures: 0, Errors: 0, Skipped: 0, Time elapsed: 0.719 sec
      [mvn] Running org.apache.solr.handler.TestReplicationHandler
      [mvn] replicate slave to master
      [mvn] 24078 T582 oasc.SolrException.log SEVERE SnapPull failed :org.apache.solr.common.SolrException: Unable to download _8_1.len completely. Downloaded 0!=102
      [mvn] 		at org.apache.solr.handler.SnapPuller$FileFetcher.cleanup(SnapPuller.java:1140)
      [mvn] 		at org.apache.solr.handler.SnapPuller$FileFetcher.fetchFile(SnapPuller.java:1024)
      [mvn] 		at org.apache.solr.handler.SnapPuller.downloadIndexFiles(SnapPuller.java:632)
      [mvn] 		at org.apache.solr.handler.SnapPuller.fetchLatestIndex(SnapPuller.java:333)
      [mvn] 		at org.apache.solr.handler.ReplicationHandler.doFetch(ReplicationHandler.java:297)
      [mvn] 		at org.apache.solr.handler.ReplicationHandler$1.run(ReplicationHandler.java:178)
      [mvn] 	
      [mvn] 31813 T660 oash.SnapPuller.fetchLatestIndex SEVERE Master at: http://127.0.0.1:43003/solr is not available. Index fetch failed. Exception: org.apache.solr.client.solrj.SolrServerException: IOException occured when talking to server at: http://127.0.0.1:43003/solr
      [mvn] Tests run: 1, Failures: 0, Errors: 0, Skipped: 0, Time elapsed: 31.888 sec
      [mvn] Running org.apache.solr.analysis.TestLuceneMatchVersion
      [mvn] Creating dataDir: /usr/home/hudson/hudson-slave/workspace/Lucene-Solr-Maven-trunk/maven-build/solr/core/src/test/target/test/./solrtest-TestLuceneMatchVersion-1348246039080
      [mvn] Tests run: 1, Failures: 0, Errors: 0, Skipped: 0, Time elapsed: 0.241 sec
      [mvn] Running org.apache.solr.update.DirectUpdateHandlerOptimizeTest
      [mvn] Tests run: 1, Failures: 0, Errors: 0, Skipped: 0, Time elapsed: 0.6 sec
      [mvn] Running org.apache.solr.schema.IndexSchemaTest
      [mvn] Creating dataDir: /usr/home/hudson/hudson-slave/workspace/Lucene-Solr-Maven-trunk/maven-build/solr/core/src/test/target/test/./solrtest-IndexSchemaTest-1348246039924
      [mvn] Tests run: 3, Failures: 0, Errors: 0, Skipped: 0, Time elapsed: 0.583 sec
      [mvn] Running org.apache.solr.cloud.TestHashPartitioner
      [mvn] Tests run: 1, Failures: 0, Errors: 0, Skipped: 0, Time elapsed: 18.444 sec
      [mvn] Running org.apache.solr.SolrInfoMBeanTest
      [mvn] Creating dataDir: /usr/home/hudson/hudson-slave/workspace/Lucene-Solr-Maven-trunk/maven-build/solr/core/src/test/target/test/./solrtest-SolrInfoMBeanTest-1348246058949
      [mvn] Tests run: 1, Failures: 0, Errors: 0, Skipped: 0, Time elapsed: 0.488 sec
      [mvn] Running org.apache.solr.OutputWriterTest
      [mvn] Creating dataDir: /usr/home/hudson/hudson-slave/workspace/Lucene-Solr-Maven-trunk/maven-build/solr/core/src/test/target/test/./solrtest-OutputWriterTest-1348246059441
      [mvn] Tests run: 5, Failures: 0, Errors: 0, Skipped: 0, Time elapsed: 0.192 sec
      [mvn] Running org.apache.solr.util.TestNumberUtils
      [mvn] Tests run: 1, Failures: 0, Errors: 0, Skipped: 0, Time elapsed: 0.246 sec
      [mvn] Running org.apache.solr.handler.component.DebugComponentTest
      [mvn] Creating dataDir: /usr/home/hudson/hudson-slave/workspace/Lucene-Solr-Maven-trunk/maven-build/solr/core/src/test/target/test/./solrtest-DebugComponentTest-1348246059881
      [mvn] Tests run: 2, Failures: 0, Errors: 0, Skipped: 0, Time elapsed: 0.545 sec
      [mvn] Running org.apache.solr.schema.MultiTermTest
      [mvn] Creating dataDir: /usr/home/hudson/hudson-slave/workspace/Lucene-Solr-Maven-trunk/maven-build/solr/core/src/test/target/test/./solrtest-MultiTermTest-1348246060422
      [mvn] Tests run: 3, Failures: 0, Errors: 0, Skipped: 0, Time elapsed: 0.17 sec
      [mvn] Running org.apache.solr.core.TestSolrDeletionPolicy1
      [mvn] Creating dataDir: /usr/home/hudson/hudson-slave/workspace/Lucene-Solr-Maven-trunk/maven-build/solr/core/src/test/target/test/./solrtest-TestSolrDeletionPolicy1-1348246060593
      [mvn] Tests run: 3, Failures: 0, Errors: 0, Skipped: 0, Time elapsed: 0.653 sec
      [mvn] Running org.apache.solr.TestGroupingSearch
      [mvn] Creating dataDir: /usr/home/hudson/hudson-slave/workspace/Lucene-Solr-Maven-trunk/maven-build/solr/core/src/test/target/test/./solrtest-TestGroupingSearch-1348246061249
      [mvn] Tests run: 12, Failures: 0, Errors: 0, Skipped: 0, Time elapsed: 2.742 sec
      [mvn] Running org.apache.solr.update.DirectUpdateHandlerTest
      [mvn] Creating dataDir: /usr/home/hudson/hudson-slave/workspace/Lucene-Solr-Maven-trunk/maven-build/solr/core/src/test/target/test/./solrtest-DirectUpdateHandlerTest-1348246063991
      [mvn] Creating dataDir: /usr/home/hudson/hudson-slave/workspace/Lucene-Solr-Maven-trunk/maven-build/solr/core/src/test/target/test/./solrtest-DirectUpdateHandlerTest-1348246064564
      [mvn] Creating dataDir: /usr/home/hudson/hudson-slave/workspace/Lucene-Solr-Maven-trunk/maven-build/solr/core/src/test/target/test/./solrtest-DirectUpdateHandlerTest-1348246064985
      [mvn] Tests run: 6, Failures: 0, Errors: 0, Skipped: 0, Time elapsed: 1.476 sec
      [mvn] Running org.apache.solr.cloud.ZkControllerTest
      [mvn] Creating dataDir: /usr/home/hudson/hudson-slave/workspace/Lucene-Solr-Maven-trunk/maven-build/solr/core/src/test/target/test/./solrtest-ZkControllerTest-1348246065477
      [mvn] Tests run: 2, Failures: 0, Errors: 0, Skipped: 0, Time elapsed: 3.924 sec
      [mvn] Running org.apache.solr.schema.PrimitiveFieldTypeTest
      [mvn] Tests run: 1, Failures: 0, Errors: 0, Skipped: 0, Time elapsed: 0.695 sec
      [mvn] Running org.apache.solr.schema.IndexSchemaRuntimeFieldTest
      [mvn] Creating dataDir: /usr/home/hudson/hudson-slave/workspace/Lucene-Solr-Maven-trunk/maven-build/solr/core/src/test/target/test/./solrtest-IndexSchemaRuntimeFieldTest-1348246070092
      [mvn] Tests run: 1, Failures: 0, Errors: 0, Skipped: 0, Time elapsed: 0.526 sec
      [mvn] Running org.apache.solr.search.QueryEqualityTest
      [mvn] Creating dataDir: /usr/home/hudson/hudson-slave/workspace/Lucene-Solr-Maven-trunk/maven-build/solr/core/src/test/target/test/./solrtest-QueryEqualityTest-1348246070625
      [mvn] Tests run: 60, Failures: 0, Errors: 0, Skipped: 0, Time elapsed: 0.632 sec
      [mvn] Running org.apache.solr.core.TestConfig
      [mvn] Creating dataDir: /usr/home/hudson/hudson-slave/workspace/Lucene-Solr-Maven-trunk/maven-build/solr/core/src/test/target/test/./solrtest-TestConfig-1348246071252
      [mvn] Tests run: 7, Failures: 0, Errors: 0, Skipped: 0, Time elapsed: 0.188 sec
      [mvn] Running org.apache.solr.TestJoin
      [mvn] Creating dataDir: /usr/home/hudson/hudson-slave/workspace/Lucene-Solr-Maven-trunk/maven-build/solr/core/src/test/target/test/./solrtest-TestJoin-1348246071448
      [mvn] Tests run: 2, Failures: 0, Errors: 0, Skipped: 0, Time elapsed: 4.801 sec
      [mvn] Running org.apache.solr.update.processor.StatelessScriptUpdateProcessorFactoryTest
      [mvn] Creating dataDir: /usr/home/hudson/hudson-slave/workspace/Lucene-Solr-Maven-trunk/maven-build/solr/core/src/test/target/test/./solrtest-StatelessScriptUpdateProcessorFactoryTest-1348246076244
      [mvn] Tests run: 7, Failures: 0, Errors: 0, Skipped: 0, Time elapsed: 1.057 sec
      [mvn] Running org.apache.solr.search.QueryParsingTest
      [mvn] Creating dataDir: /usr/home/hudson/hudson-slave/workspace/Lucene-Solr-Maven-trunk/maven-build/solr/core/src/test/target/test/./solrtest-QueryParsingTest-1348246077302
      [mvn] Tests run: 4, Failures: 0, Errors: 0, Skipped: 0, Time elapsed: 0.547 sec
      [mvn] Running org.apache.solr.handler.admin.SystemInfoHandlerTest
      [mvn] Tests run: 1, Failures: 0, Errors: 0, Skipped: 0, Time elapsed: 0.013 sec
      [mvn] Running org.apache.solr.TestSolrCoreProperties
      [mvn] Tests run: 1, Failures: 0, Errors: 0, Skipped: 0, Time elapsed: 0.181 sec
      [mvn] Running org.apache.solr.schema.DateFieldTest
      [mvn] Tests run: 8, Failures: 0, Errors: 0, Skipped: 1, Time elapsed: 0.032 sec
      [mvn] Running org.apache.solr.search.TestElisionMultitermQuery
      [mvn] Creating dataDir: /usr/home/hudson/hudson-slave/workspace/Lucene-Solr-Maven-trunk/maven-build/solr/core/src/test/target/test/./solrtest-TestElisionMultitermQuery-1348246078078
      [mvn] Tests run: 1, Failures: 0, Errors: 0, Skipped: 0, Time elapsed: 0.259 sec
      [mvn] Running org.apache.solr.servlet.SolrRequestParserTest
      [mvn] Creating dataDir: /usr/home/hudson/hudson-slave/workspace/Lucene-Solr-Maven-trunk/maven-build/solr/core/src/test/target/test/./solrtest-SolrRequestParserTest-1348246078338
      [mvn] Tests run: 4, Failures: 0, Errors: 0, Skipped: 0, Time elapsed: 1.223 sec
      [mvn] Running org.apache.solr.internal.csv.CSVParserTest
      [mvn] Tests run: 23, Failures: 0, Errors: 0, Skipped: 0, Time elapsed: 0.016 sec
      [mvn] Running org.apache.solr.AnalysisAfterCoreReloadTest
      [mvn] Tests run: 1, Failures: 0, Errors: 0, Skipped: 0, Time elapsed: 1.737 sec
      [mvn] Running org.apache.solr.handler.CSVRequestHandlerTest
      [mvn] Creating dataDir: /usr/home/hudson/hudson-slave/workspace/Lucene-Solr-Maven-trunk/maven-build/solr/core/src/test/target/test/./solrtest-CSVRequestHandlerTest-1348246081315
      [mvn] Tests run: 1, Failures: 0, Errors: 0, Skipped: 0, Time elapsed: 0.418 sec
      [mvn] Running org.apache.solr.core.TestQuerySenderNoQuery
      [mvn] Creating dataDir: /usr/home/hudson/hudson-slave/workspace/Lucene-Solr-Maven-trunk/maven-build/solr/core/src/test/target/test/./solrtest-TestQuerySenderNoQuery-1348246081738
      [mvn] Tests run: 3, Failures: 0, Errors: 0, Skipped: 0, Time elapsed: 0.426 sec
      [mvn] Running org.apache.solr.ConvertedLegacyTest
      [mvn] Creating dataDir: /usr/home/hudson/hudson-slave/workspace/Lucene-Solr-Maven-trunk/maven-build/solr/core/src/test/target/test/./solrtest-ConvertedLegacyTest-1348246082165
      [mvn] Tests run: 1, Failures: 0, Errors: 0, Skipped: 0, Time elapsed: 2.041 sec
      [mvn] Running org.apache.solr.update.processor.UniqFieldsUpdateProcessorFactoryTest
      [mvn] Creating dataDir: /usr/home/hudson/hudson-slave/workspace/Lucene-Solr-Maven-trunk/maven-build/solr/core/src/test/target/test/./solrtest-UniqFieldsUpdateProcessorFactoryTest-1348246084206
      [mvn] Tests run: 1, Failures: 0, Errors: 0, Skipped: 0, Time elapsed: 0.454 sec
      [mvn] Running org.apache.solr.core.RAMDirectoryFactoryTest
      [mvn] Tests run: 1, Failures: 0, Errors: 0, Skipped: 0, Time elapsed: 0.011 sec
      [mvn] Running org.apache.solr.handler.component.DistributedTermsComponentTest
      [mvn] Tests run: 1, Failures: 0, Errors: 0, Skipped: 0, Time elapsed: 5.272 sec
      [mvn] Running org.apache.solr.spelling.SpellPossibilityIteratorTest
      [mvn] Tests run: 3, Failures: 0, Errors: 0, Skipped: 0, Time elapsed: 0.182 sec
      [mvn] Running org.apache.solr.util.DateMathParserTest
      [mvn] Tests run: 8, Failures: 0, Errors: 0, Skipped: 0, Time elapsed: 0.068 sec
      [mvn] Running org.apache.solr.BasicFunctionalityTest
      [mvn] Creating dataDir: /usr/home/hudson/hudson-slave/workspace/Lucene-Solr-Maven-trunk/maven-build/solr/core/src/test/target/test/./solrtest-BasicFunctionalityTest-1348246090204
      [mvn] Tests run: 23, Failures: 0, Errors: 0, Skipped: 1, Time elapsed: 1.976 sec
      [mvn] Running org.apache.solr.core.PluginInfoTest
      [mvn] Tests run: 9, Failures: 0, Errors: 0, Skipped: 0, Time elapsed: 0.045 sec
      [mvn] Running org.apache.solr.internal.csv.CSVUtilsTest
      [mvn] Tests run: 14, Failures: 0, Errors: 0, Skipped: 0, Time elapsed: 0.005 sec
      [mvn] Running org.apache.solr.schema.CurrencyFieldTest
      [mvn] Creating dataDir: /usr/home/hudson/hudson-slave/workspace/Lucene-Solr-Maven-trunk/maven-build/solr/core/src/test/target/test/./solrtest-CurrencyFieldTest-1348246092228
      [mvn] Tests run: 8, Failures: 0, Errors: 0, Skipped: 1, Time elapsed: 0.7 sec
      [mvn] Running org.apache.solr.internal.csv.CSVStrategyTest
      [mvn] Tests run: 5, Failures: 0, Errors: 0, Skipped: 0, Time elapsed: 0 sec
      [mvn] Running org.apache.solr.search.function.SortByFunctionTest
      [mvn] Tests run: 2, Failures: 0, Errors: 0, Skipped: 0, Time elapsed: 1.141 sec
      [mvn] Running org.apache.solr.search.ReturnFieldsTest
      [mvn] Creating dataDir: /usr/home/hudson/hudson-slave/workspace/Lucene-Solr-Maven-trunk/maven-build/solr/core/src/test/target/test/./solrtest-ReturnFieldsTest-1348246094074
      [mvn] Tests run: 10, Failures: 0, Errors: 0, Skipped: 0, Time elapsed: 0.529 sec
      [mvn] Running org.apache.solr.search.TestQueryUtils
      [mvn] Tests run: 1, Failures: 0, Errors: 0, Skipped: 0, Time elapsed: 0.654 sec
      [mvn] Running org.apache.solr.schema.UUIDFieldTest
      [mvn] Tests run: 1, Failures: 0, Errors: 0, Skipped: 0, Time elapsed: 0.011 sec
      [mvn] Running org.apache.solr.cloud.RecoveryZkTest
      [mvn] Creating dataDir: /usr/home/hudson/hudson-slave/workspace/Lucene-Solr-Maven-trunk/maven-build/solr/core/src/test/target/test/./solrtest-RecoveryZkTest-1348246095284
      [mvn] ASYNC  NEW_CORE C2 name=collection1 org.apache.solr.core.SolrCore@52577158 url=http://127.0.0.1:38044/solr/collection1 node=127.0.0.1:38044_solr
      [mvn] 9522 T997 C2 P38044 oasc.SolrException.log SEVERE shard update error StdNode: http://127.0.0.1:38047/solr/collection1/:org.apache.solr.client.solrj.SolrServerException: IOException occured when talking to server at: http://127.0.0.1:38047/solr/collection1
      [mvn] 		at org.apache.solr.client.solrj.impl.HttpSolrServer.request(HttpSolrServer.java:414)
      [mvn] 		at org.apache.solr.client.solrj.impl.HttpSolrServer.request(HttpSolrServer.java:182)
      [mvn] 		at org.apache.solr.update.SolrCmdDistributor$1.call(SolrCmdDistributor.java:335)
      [mvn] 		at org.apache.solr.update.SolrCmdDistributor$1.call(SolrCmdDistributor.java:309)
      [mvn] 		at java.util.concurrent.FutureTask$Sync.innerRun(FutureTask.java:334)
      [mvn] 		at java.util.concurrent.FutureTask.run(FutureTask.java:166)
      [mvn] 		at java.util.concurrent.Executors$RunnableAdapter.call(Executors.java:471)
      [mvn] 		at java.util.concurrent.FutureTask$Sync.innerRun(FutureTask.java:334)
      [mvn] 		at java.util.concurrent.FutureTask.run(FutureTask.java:166)
      [mvn] 		at java.util.concurrent.ThreadPoolExecutor.runWorker(ThreadPoolExecutor.java:1110)
      [mvn] 		at java.util.concurrent.ThreadPoolExecutor$Worker.run(ThreadPoolExecutor.java:603)
      [mvn] 		at java.lang.Thread.run(Thread.java:679)
      [mvn] 	Caused by: org.apache.http.NoHttpResponseException: The target server failed to respond
      [mvn] 		at org.apache.http.impl.conn.DefaultResponseParser.parseHead(DefaultResponseParser.java:101)
      [mvn] 		at org.apache.http.impl.io.AbstractMessageParser.parse(AbstractMessageParser.java:252)
      [mvn] 		at org.apache.http.impl.AbstractHttpClientConnection.receiveResponseHeader(AbstractHttpClientConnection.java:282)
      [mvn] 		at org.apache.http.impl.conn.DefaultClientConnection.receiveResponseHeader(DefaultClientConnection.java:247)
      [mvn] 		at org.apache.http.impl.conn.AbstractClientConnAdapter.receiveResponseHeader(AbstractClientConnAdapter.java:216)
      [mvn] 		at org.apache.http.protocol.HttpRequestExecutor.doReceiveResponse(HttpRequestExecutor.java:298)
      [mvn] 		at org.apache.http.protocol.HttpRequestExecutor.execute(HttpRequestExecutor.java:125)
      [mvn] 		at org.apache.http.impl.client.DefaultRequestDirector.tryExecute(DefaultRequestDirector.java:647)
      [mvn] 		at org.apache.http.impl.client.DefaultRequestDirector.execute(DefaultRequestDirector.java:464)
      [mvn] 		at org.apache.http.impl.client.AbstractHttpClient.execute(AbstractHttpClient.java:820)
      [mvn] 		at org.apache.http.impl.client.AbstractHttpClient.execute(AbstractHttpClient.java:754)
      [mvn] 		at org.apache.http.impl.client.AbstractHttpClient.execute(AbstractHttpClient.java:732)
      [mvn] 		at org.apache.solr.client.solrj.impl.HttpSolrServer.request(HttpSolrServer.java:353)
      [mvn] 		... 11 more
      [mvn] 	
      [mvn] 9522 T996 C2 P38044 oasc.SolrException.log SEVERE shard update error StdNode: http://127.0.0.1:38047/solr/collection1/:org.apache.solr.client.solrj.SolrServerException: IOException occured when talking to server at: http://127.0.0.1:38047/solr/collection1
      [mvn] 		at org.apache.solr.client.solrj.impl.HttpSolrServer.request(HttpSolrServer.java:414)
      [mvn] 		at org.apache.solr.client.solrj.impl.HttpSolrServer.request(HttpSolrServer.java:182)
      [mvn] 		at org.apache.solr.update.SolrCmdDistributor$1.call(SolrCmdDistributor.java:335)
      [mvn] 		at org.apache.solr.update.SolrCmdDistributor$1.call(SolrCmdDistributor.java:309)
      [mvn] 		at java.util.concurrent.FutureTask$Sync.innerRun(FutureTask.java:334)
      [mvn] 		at java.util.concurrent.FutureTask.run(FutureTask.java:166)
      [mvn] 		at java.util.concurrent.Executors$RunnableAdapter.call(Executors.java:471)
      [mvn] 		at java.util.concurrent.FutureTask$Sync.innerRun(FutureTask.java:334)
      [mvn] 		at java.util.concurrent.FutureTask.run(FutureTask.java:166)
      [mvn] 		at java.util.concurrent.ThreadPoolExecutor.runWorker(ThreadPoolExecutor.java:1110)
      [mvn] 		at java.util.concurrent.ThreadPoolExecutor$Worker.run(ThreadPoolExecutor.java:603)
      [mvn] 		at java.lang.Thread.run(Thread.java:679)
      [mvn] 	Caused by: org.apache.http.NoHttpResponseException: The target server failed to respond
      [mvn] 		at org.apache.http.impl.conn.DefaultResponseParser.parseHead(DefaultResponseParser.java:101)
      [mvn] 		at org.apache.http.impl.io.AbstractMessageParser.parse(AbstractMessageParser.java:252)
      [mvn] 		at org.apache.http.impl.AbstractHttpClientConnection.receiveResponseHeader(AbstractHttpClientConnection.java:282)
      [mvn] 		at org.apache.http.impl.conn.DefaultClientConnection.receiveResponseHeader(DefaultClientConnection.java:247)
      [mvn] 		at org.apache.http.impl.conn.AbstractClientConnAdapter.receiveResponseHeader(AbstractClientConnAdapter.java:216)
      [mvn] 		at org.apache.http.protocol.HttpRequestExecutor.doReceiveResponse(HttpRequestExecutor.java:298)
      [mvn] 		at org.apache.http.protocol.HttpRequestExecutor.execute(HttpRequestExecutor.java:125)
      [mvn] 		at org.apache.http.impl.client.DefaultRequestDirector.tryExecute(DefaultRequestDirector.java:647)
      [mvn] 		at org.apache.http.impl.client.DefaultRequestDirector.execute(DefaultRequestDirector.java:464)
      [mvn] 		at org.apache.http.impl.client.AbstractHttpClient.execute(AbstractHttpClient.java:820)
      [mvn] 		at org.apache.http.impl.client.AbstractHttpClient.execute(AbstractHttpClient.java:754)
      [mvn] 		at org.apache.http.impl.client.AbstractHttpClient.execute(AbstractHttpClient.java:732)
      [mvn] 		at org.apache.solr.client.solrj.impl.HttpSolrServer.request(HttpSolrServer.java:353)
      [mvn] 		... 11 more
      [mvn] 	
      [mvn] added docs:434 with 0 fails deletes:193
      [mvn] added docs:439 with 0 fails deletes:196
      [mvn] Tests run: 1, Failures: 0, Errors: 0, Skipped: 0, Time elapsed: 15.973 sec
      [mvn] Running org.apache.solr.update.TestUpdate
      [mvn] Creating dataDir: /usr/home/hudson/hudson-slave/workspace/Lucene-Solr-Maven-trunk/maven-build/solr/core/src/test/target/test/./solrtest-TestUpdate-1348246111245
      [mvn] Tests run: 1, Failures: 0, Errors: 0, Skipped: 0, Time elapsed: 0.568 sec
      [mvn] Running org.apache.solr.internal.csv.writer.CSVConfigGuesserTest
      [mvn] Tests run: 3, Failures: 0, Errors: 0, Skipped: 0, Time elapsed: 0.001 sec
      [mvn] Running org.apache.solr.TestTrie
      [mvn] Creating dataDir: /usr/home/hudson/hudson-slave/workspace/Lucene-Solr-Maven-trunk/maven-build/solr/core/src/test/target/test/./solrtest-TestTrie-1348246111813
      [mvn] Tests run: 8, Failures: 0, Errors: 0, Skipped: 0, Time elapsed: 0.669 sec
      [mvn] Running org.apache.solr.core.TestArbitraryIndexDir
      [mvn] Tests run: 1, Failures: 0, Errors: 0, Skipped: 0, Time elapsed: 0.529 sec
      [mvn] Running org.apache.solr.core.TestBadConfig
      [mvn] Creating dataDir: /usr/home/hudson/hudson-slave/workspace/Lucene-Solr-Maven-trunk/maven-build/solr/core/src/test/target/test/./solrtest-TestBadConfig-1348246113018
      [mvn] 382 T1092 oasu.UpdateLog.init SEVERE Unable to use updateLog: _version_field must exist in schema, using indexed="true" stored="true" and multiValued="false" (_version_ does not exist) Ignoring exception matching \Q_version_\E
      [mvn] Creating dataDir: /usr/home/hudson/hudson-slave/workspace/Lucene-Solr-Maven-trunk/maven-build/solr/core/src/test/target/test/./solrtest-TestBadConfig-1348246113408
      [mvn] 802 T1092 oasup.StatelessScriptUpdateProcessorFactory.inform SEVERE Unable to initialize scripts: Unable to evaluate script: currency.xml Ignoring exception matching \Qcurrency.xml\E
      [mvn] Creating dataDir: /usr/home/hudson/hudson-slave/workspace/Lucene-Solr-Maven-trunk/maven-build/solr/core/src/test/target/test/./solrtest-TestBadConfig-1348246113826
      [mvn] 1098 T3 oasc.CoreContainer.finalize SEVERE CoreContainer was not shutdown prior to finalize(), indicates a bug -- POSSIBLE RESOURCE LEAK!!!  instance=1768820755
      [mvn] 1201 T1092 oasup.StatelessScriptUpdateProcessorFactory.inform SEVERE Unable to initialize scripts: Unable to evaluate script: a-file-name-that-does-not-exist.js Ignoring exception matching \Qa-file-name-that-does-not-exist.js\E
      [mvn] Creating dataDir: /usr/home/hudson/hudson-slave/workspace/Lucene-Solr-Maven-trunk/maven-build/solr/core/src/test/target/test/./solrtest-TestBadConfig-1348246114224
      [mvn] 1485 T3 oasc.CoreContainer.finalize SEVERE CoreContainer was not shutdown prior to finalize(), indicates a bug -- POSSIBLE RE

[...truncated too long message...]

/hudson-slave/workspace/Lucene-Solr-Maven-trunk/maven-build/solr/contrib/velocity/src/main/resources
      [mvn] [INFO] Copying 3 resources
      [mvn] [INFO] [compiler:compile {execution: default-compile}]
      [mvn] [INFO] Compiling 4 source files to /usr/home/hudson/hudson-slave/workspace/Lucene-Solr-Maven-trunk/maven-build/solr/contrib/velocity/target/classes
      [mvn] [INFO] [bundle:manifest {execution: bundle-manifest}]
      [mvn] [debug] execute contextualize
      [mvn] [INFO] [resources:testResources {execution: default-testResources}]
      [mvn] [INFO] Using 'UTF-8' encoding to copy filtered resources.
      [mvn] [INFO] Copying 3 resources
      [mvn] [INFO] Copying 1 resource
      [mvn] [INFO] Copying 3 resources
      [mvn] [INFO] [compiler:testCompile {execution: default-testCompile}]
      [mvn] [INFO] Compiling 1 source file to /usr/home/hudson/hudson-slave/workspace/Lucene-Solr-Maven-trunk/maven-build/solr/contrib/velocity/target/test-classes
      [mvn] [INFO] [surefire:test {execution: default-test}]
      [mvn] [INFO] Surefire report directory: /usr/home/hudson/hudson-slave/workspace/Lucene-Solr-Maven-trunk/maven-build/solr/contrib/velocity/target/surefire-reports
      [mvn] 
      [mvn] -------------------------------------------------------
      [mvn]  T E S T S
      [mvn] -------------------------------------------------------
      [mvn] Running org.apache.solr.velocity.VelocityResponseWriterTest
      [mvn] Creating dataDir: /usr/home/hudson/hudson-slave/workspace/Lucene-Solr-Maven-trunk/maven-build/solr/contrib/velocity/target/test/./solrtest-VelocityResponseWriterTest-1348247287601
      [mvn] Tests run: 1, Failures: 0, Errors: 0, Skipped: 0, Time elapsed: 1.834 sec
      [mvn] 
      [mvn] Results :
      [mvn] 
      [mvn] Tests run: 1, Failures: 0, Errors: 0, Skipped: 0
      [mvn] 
      [mvn] [INFO] [jar:jar {execution: default-jar}]
      [mvn] [INFO] Building jar: /usr/home/hudson/hudson-slave/workspace/Lucene-Solr-Maven-trunk/maven-build/solr/contrib/velocity/target/solr-velocity-5.0-SNAPSHOT.jar
      [mvn] [INFO] [install:install {execution: default-install}]
      [mvn] [INFO] Installing /usr/home/hudson/hudson-slave/workspace/Lucene-Solr-Maven-trunk/maven-build/solr/contrib/velocity/target/solr-velocity-5.0-SNAPSHOT.jar to /home/hudson/.m2/repository/org/apache/solr/solr-velocity/5.0-SNAPSHOT/solr-velocity-5.0-SNAPSHOT.jar
      [mvn] [INFO] ------------------------------------------------------------------------
      [mvn] [INFO] Building Apache Solr Contrib aggregator POM
      [mvn] [INFO]    task-segment: [install]
      [mvn] [INFO] ------------------------------------------------------------------------
      [mvn] [INFO] [groovy:execute {execution: generate-timestamps}]
      [mvn] [INFO] [buildnumber:create {execution: default}]
      [mvn] [INFO] [enforcer:enforce {execution: enforce-java-compat-version-and-maven-2.2.1}]
      [mvn] [INFO] [remote-resources:process {execution: default}]
      [mvn] [INFO] [bundle:manifest {execution: bundle-manifest}]
      [mvn] [WARNING] Ignoring project type pom - supportedProjectTypes = [jar, bundle]
      [mvn] [INFO] [site:attach-descriptor {execution: default-attach-descriptor}]
      [mvn] [INFO] [install:install {execution: default-install}]
      [mvn] [INFO] Installing /usr/home/hudson/hudson-slave/workspace/Lucene-Solr-Maven-trunk/maven-build/solr/contrib/pom.xml to /home/hudson/.m2/repository/org/apache/solr/solr-contrib-aggregator/5.0-SNAPSHOT/solr-contrib-aggregator-5.0-SNAPSHOT.pom
      [mvn] [INFO] 
      [mvn] [INFO] 
      [mvn] [INFO] ------------------------------------------------------------------------
      [mvn] [INFO] Reactor Summary:
      [mvn] [INFO] ------------------------------------------------------------------------
      [mvn] [INFO] Grandparent POM for Apache Lucene Core and Apache Solr  SUCCESS [8.522s]
      [mvn] [INFO] Lucene parent POM ..................................... SUCCESS [0.075s]
      [mvn] [INFO] Lucene Core ........................................... SUCCESS [14.020s]
      [mvn] [INFO] Lucene codecs ......................................... SUCCESS [3.923s]
      [mvn] [INFO] Lucene Test Framework ................................. SUCCESS [6.506s]
      [mvn] [INFO] Lucene Core tests ..................................... SUCCESS [3:44.895s]
      [mvn] [INFO] Lucene Core aggregator POM ............................ SUCCESS [0.148s]
      [mvn] [INFO] Lucene codecs tests ................................... SUCCESS [2.763s]
      [mvn] [INFO] Lucene codecs aggregator POM .......................... SUCCESS [0.066s]
      [mvn] [INFO] Lucene Common Analyzers ............................... SUCCESS [2:07.553s]
      [mvn] [INFO] Lucene ICU Analysis Components ........................ SUCCESS [11.607s]
      [mvn] [INFO] Lucene Kuromoji Japanese Morphological Analyzer ....... SUCCESS [23.709s]
      [mvn] [INFO] Lucene Morfologik Polish Lemmatizer ................... SUCCESS [4.661s]
      [mvn] [INFO] Lucene Phonetic Filters ............................... SUCCESS [19.885s]
      [mvn] [INFO] Lucene Smart Chinese Analyzer ......................... SUCCESS [8.749s]
      [mvn] [INFO] Lucene Stempel Analyzer ............................... SUCCESS [6.424s]
      [mvn] [INFO] Lucene UIMA Analysis Components ....................... SUCCESS [18.975s]
      [mvn] [INFO] Lucene Analysis Modules aggregator POM ................ SUCCESS [0.062s]
      [mvn] [INFO] Lucene Queries ........................................ SUCCESS [10.205s]
      [mvn] [INFO] Lucene Sandbox ........................................ SUCCESS [10.352s]
      [mvn] [INFO] Lucene QueryParsers ................................... SUCCESS [15.806s]
      [mvn] [INFO] Lucene Memory ......................................... SUCCESS [8.081s]
      [mvn] [INFO] Lucene Highlighter .................................... SUCCESS [8.395s]
      [mvn] [INFO] Lucene Facets ......................................... SUCCESS [59.085s]
      [mvn] [INFO] Lucene Benchmark ...................................... SUCCESS [24.008s]
      [mvn] [INFO] Lucene Classification ................................. SUCCESS [5.151s]
      [mvn] [INFO] Lucene Demo ........................................... SUCCESS [3.871s]
      [mvn] [INFO] Lucene Grouping ....................................... SUCCESS [18.516s]
      [mvn] [INFO] Lucene Join ........................................... SUCCESS [16.850s]
      [mvn] [INFO] Lucene Miscellaneous .................................. SUCCESS [6.985s]
      [mvn] [INFO] Lucene Spatial ........................................ SUCCESS [14.227s]
      [mvn] [INFO] Lucene Suggest ........................................ SUCCESS [16.593s]
      [mvn] [INFO] Apache Solr parent POM ................................ SUCCESS [0.101s]
      [mvn] [INFO] Apache Solr Solrj ..................................... SUCCESS [6.324s]
      [mvn] [INFO] Apache Solr Core ...................................... SUCCESS [14.395s]
      [mvn] [INFO] Apache Solr Test Framework ............................ SUCCESS [3.458s]
      [mvn] [INFO] Apache Solr Core tests ................................ FAILED [16:00.193s]
      [mvn] [INFO] Apache Solr Core aggregator POM ....................... SUCCESS [0.100s]
      [mvn] [INFO] Apache Solr Solrj tests ............................... SUCCESS [3:46.028s]
      [mvn] [INFO] Apache Solr Solrj aggregator POM ...................... SUCCESS [0.094s]
      [mvn] [INFO] Apache Solr Search Server ............................. SUCCESS [5.164s]
      [mvn] [INFO] Apache Solr Analysis Extras ........................... SUCCESS [7.443s]
      [mvn] [INFO] Apache Solr Clustering ................................ SUCCESS [14.409s]
      [mvn] [INFO] Apache Solr DataImportHandler ......................... SUCCESS [1:34.930s]
      [mvn] [INFO] Apache Solr DataImportHandler Extras .................. SUCCESS [6.886s]
      [mvn] [INFO] Apache Solr Content Extraction Library ................ SUCCESS [10.889s]
      [mvn] [INFO] Apache Solr Language Identifier ....................... SUCCESS [6.285s]
      [mvn] [INFO] Apache Solr UIMA integration .......................... SUCCESS [33.473s]
      [mvn] [INFO] Apache Solr Velocity .................................. SUCCESS [5.030s]
      [mvn] [INFO] Apache Solr Contrib aggregator POM .................... SUCCESS [0.053s]
      [mvn] [INFO] ------------------------------------------------------------------------
      [mvn] [INFO] Error for project: Apache Solr Core tests (during install)
      [mvn] [INFO] ------------------------------------------------------------------------
      [mvn] [INFO] There are test failures.
      [mvn] 
      [mvn] Please refer to /usr/home/hudson/hudson-slave/workspace/Lucene-Solr-Maven-trunk/maven-build/solr/core/src/test/target/surefire-reports for the individual test results.
      [mvn] [INFO] ------------------------------------------------------------------------
      [mvn] [INFO] For more information, run Maven with the -e switch
      [mvn] [INFO] ------------------------------------------------------------------------
      [mvn] [INFO] BUILD ERRORS
      [mvn] [INFO] ------------------------------------------------------------------------
      [mvn] [INFO] Total time: 34 minutes 57 seconds
      [mvn] [INFO] Finished at: Fri Sep 21 17:08:09 UTC 2012
      [mvn] [INFO] Final Memory: 290M/2366M
      [mvn] [INFO] ------------------------------------------------------------------------

BUILD FAILED
/usr/home/hudson/hudson-slave/workspace/Lucene-Solr-Maven-trunk/build.xml:160: The following error occurred while executing this line:
/usr/home/hudson/hudson-slave/workspace/Lucene-Solr-Maven-trunk/extra-targets.xml:56: Java returned: 1

Total time: 35 minutes 3 seconds
Build step 'Invoke Ant' marked build as failure
Recording test results
Email was triggered for: Failure
Sending email for trigger: Failure




Mime
View raw message