lucene-dev mailing list archives

Site index · List index
Message view « Date » · « Thread »
Top « Date » · « Thread »
From Policeman Jenkins Server <jenk...@sd-datasolutions.de>
Subject [JENKINS] Lucene-Solr-4.x-Linux (64bit/ibm-j9-jdk7) - Build # 1022 - Failure!
Date Tue, 11 Sep 2012 11:27:06 GMT
Build: http://jenkins.sd-datasolutions.de/job/Lucene-Solr-4.x-Linux/1022/
Java: 64bit/ibm-j9-jdk7 -Xjit:exclude={org/apache/lucene/util/fst/FST.pack(IIF)Lorg/apache/lucene/util/fst/FST;}

4 tests failed.
REGRESSION:  org.apache.solr.TestDistributedGrouping.testDistribSearch

Error Message:
Server at http://localhost:44277/solr returned non ok status:500, message:Server Error

Stack Trace:
org.apache.solr.common.SolrException: Server at http://localhost:44277/solr returned non ok status:500, message:Server Error
	at __randomizedtesting.SeedInfo.seed([98DB98944EE61084:193D168C39B970B8]:0)
	at org.apache.solr.client.solrj.impl.HttpSolrServer.request(HttpSolrServer.java:373)
	at org.apache.solr.client.solrj.impl.HttpSolrServer.request(HttpSolrServer.java:182)
	at org.apache.solr.client.solrj.request.QueryRequest.process(QueryRequest.java:90)
	at org.apache.solr.client.solrj.SolrServer.query(SolrServer.java:324)
	at org.apache.solr.BaseDistributedSearchTestCase.queryServer(BaseDistributedSearchTestCase.java:371)
	at org.apache.solr.BaseDistributedSearchTestCase.query(BaseDistributedSearchTestCase.java:390)
	at org.apache.solr.TestDistributedGrouping.doTest(TestDistributedGrouping.java:146)
	at org.apache.solr.BaseDistributedSearchTestCase.testDistribSearch(BaseDistributedSearchTestCase.java:697)
	at sun.reflect.NativeMethodAccessorImpl.invoke0(Native Method)
	at sun.reflect.NativeMethodAccessorImpl.invoke(NativeMethodAccessorImpl.java:88)
	at sun.reflect.DelegatingMethodAccessorImpl.invoke(DelegatingMethodAccessorImpl.java:55)
	at java.lang.reflect.Method.invoke(Method.java:613)
	at com.carrotsearch.randomizedtesting.RandomizedRunner.invoke(RandomizedRunner.java:1559)
	at com.carrotsearch.randomizedtesting.RandomizedRunner.access$600(RandomizedRunner.java:79)
	at com.carrotsearch.randomizedtesting.RandomizedRunner$6.evaluate(RandomizedRunner.java:737)
	at com.carrotsearch.randomizedtesting.RandomizedRunner$7.evaluate(RandomizedRunner.java:773)
	at com.carrotsearch.randomizedtesting.RandomizedRunner$8.evaluate(RandomizedRunner.java:787)
	at com.carrotsearch.randomizedtesting.rules.SystemPropertiesRestoreRule$1.evaluate(SystemPropertiesRestoreRule.java:53)
	at org.apache.lucene.util.TestRuleSetupTeardownChained$1.evaluate(TestRuleSetupTeardownChained.java:50)
	at org.apache.lucene.util.TestRuleFieldCacheSanity$1.evaluate(TestRuleFieldCacheSanity.java:51)
	at org.apache.lucene.util.AbstractBeforeAfterRule$1.evaluate(AbstractBeforeAfterRule.java:45)
	at com.carrotsearch.randomizedtesting.rules.SystemPropertiesInvariantRule$1.evaluate(SystemPropertiesInvariantRule.java:55)
	at org.apache.lucene.util.TestRuleThreadAndTestName$1.evaluate(TestRuleThreadAndTestName.java:48)
	at org.apache.lucene.util.TestRuleIgnoreAfterMaxFailures$1.evaluate(TestRuleIgnoreAfterMaxFailures.java:70)
	at org.apache.lucene.util.TestRuleMarkFailure$1.evaluate(TestRuleMarkFailure.java:48)
	at com.carrotsearch.randomizedtesting.rules.StatementAdapter.evaluate(StatementAdapter.java:36)
	at com.carrotsearch.randomizedtesting.ThreadLeakControl$StatementRunner.run(ThreadLeakControl.java:358)
	at com.carrotsearch.randomizedtesting.ThreadLeakControl.forkTimeoutingTask(ThreadLeakControl.java:782)
	at com.carrotsearch.randomizedtesting.ThreadLeakControl$3.evaluate(ThreadLeakControl.java:442)
	at com.carrotsearch.randomizedtesting.RandomizedRunner.runSingleTest(RandomizedRunner.java:746)
	at com.carrotsearch.randomizedtesting.RandomizedRunner$3.evaluate(RandomizedRunner.java:648)
	at com.carrotsearch.randomizedtesting.RandomizedRunner$4.evaluate(RandomizedRunner.java:682)
	at com.carrotsearch.randomizedtesting.RandomizedRunner$5.evaluate(RandomizedRunner.java:693)
	at com.carrotsearch.randomizedtesting.rules.StatementAdapter.evaluate(StatementAdapter.java:36)
	at com.carrotsearch.randomizedtesting.rules.SystemPropertiesRestoreRule$1.evaluate(SystemPropertiesRestoreRule.java:53)
	at org.apache.lucene.util.AbstractBeforeAfterRule$1.evaluate(AbstractBeforeAfterRule.java:45)
	at org.apache.lucene.util.TestRuleStoreClassName$1.evaluate(TestRuleStoreClassName.java:42)
	at com.carrotsearch.randomizedtesting.rules.SystemPropertiesInvariantRule$1.evaluate(SystemPropertiesInvariantRule.java:55)
	at com.carrotsearch.randomizedtesting.rules.NoShadowingOrOverridesOnMethodsRule$1.evaluate(NoShadowingOrOverridesOnMethodsRule.java:39)
	at com.carrotsearch.randomizedtesting.rules.NoShadowingOrOverridesOnMethodsRule$1.evaluate(NoShadowingOrOverridesOnMethodsRule.java:39)
	at org.apache.lucene.util.TestRuleAssertionsRequired$1.evaluate(TestRuleAssertionsRequired.java:40)
	at org.apache.lucene.util.TestRuleMarkFailure$1.evaluate(TestRuleMarkFailure.java:48)
	at org.apache.lucene.util.TestRuleIgnoreAfterMaxFailures$1.evaluate(TestRuleIgnoreAfterMaxFailures.java:70)
	at org.apache.lucene.util.TestRuleIgnoreTestSuites$1.evaluate(TestRuleIgnoreTestSuites.java:55)
	at com.carrotsearch.randomizedtesting.rules.StatementAdapter.evaluate(StatementAdapter.java:36)
	at com.carrotsearch.randomizedtesting.ThreadLeakControl$StatementRunner.run(ThreadLeakControl.java:358)
	at java.lang.Thread.run(Thread.java:777)


REGRESSION:  org.apache.solr.TestDistributedSearch.testDistribSearch

Error Message:
Server at http://localhost:57506/solr returned non ok status:500, message:Server Error

Stack Trace:
org.apache.solr.common.SolrException: Server at http://localhost:57506/solr returned non ok status:500, message:Server Error
	at __randomizedtesting.SeedInfo.seed([98DB98944EE61084:193D168C39B970B8]:0)
	at org.apache.solr.client.solrj.impl.HttpSolrServer.request(HttpSolrServer.java:373)
	at org.apache.solr.client.solrj.impl.HttpSolrServer.request(HttpSolrServer.java:182)
	at org.apache.solr.client.solrj.request.QueryRequest.process(QueryRequest.java:90)
	at org.apache.solr.client.solrj.SolrServer.query(SolrServer.java:324)
	at org.apache.solr.BaseDistributedSearchTestCase.queryServer(BaseDistributedSearchTestCase.java:371)
	at org.apache.solr.BaseDistributedSearchTestCase.query(BaseDistributedSearchTestCase.java:390)
	at org.apache.solr.TestDistributedSearch.doTest(TestDistributedSearch.java:134)
	at org.apache.solr.BaseDistributedSearchTestCase.testDistribSearch(BaseDistributedSearchTestCase.java:697)
	at sun.reflect.NativeMethodAccessorImpl.invoke0(Native Method)
	at sun.reflect.NativeMethodAccessorImpl.invoke(NativeMethodAccessorImpl.java:88)
	at sun.reflect.DelegatingMethodAccessorImpl.invoke(DelegatingMethodAccessorImpl.java:55)
	at java.lang.reflect.Method.invoke(Method.java:613)
	at com.carrotsearch.randomizedtesting.RandomizedRunner.invoke(RandomizedRunner.java:1559)
	at com.carrotsearch.randomizedtesting.RandomizedRunner.access$600(RandomizedRunner.java:79)
	at com.carrotsearch.randomizedtesting.RandomizedRunner$6.evaluate(RandomizedRunner.java:737)
	at com.carrotsearch.randomizedtesting.RandomizedRunner$7.evaluate(RandomizedRunner.java:773)
	at com.carrotsearch.randomizedtesting.RandomizedRunner$8.evaluate(RandomizedRunner.java:787)
	at com.carrotsearch.randomizedtesting.rules.SystemPropertiesRestoreRule$1.evaluate(SystemPropertiesRestoreRule.java:53)
	at org.apache.lucene.util.TestRuleSetupTeardownChained$1.evaluate(TestRuleSetupTeardownChained.java:50)
	at org.apache.lucene.util.TestRuleFieldCacheSanity$1.evaluate(TestRuleFieldCacheSanity.java:51)
	at org.apache.lucene.util.AbstractBeforeAfterRule$1.evaluate(AbstractBeforeAfterRule.java:45)
	at com.carrotsearch.randomizedtesting.rules.SystemPropertiesInvariantRule$1.evaluate(SystemPropertiesInvariantRule.java:55)
	at org.apache.lucene.util.TestRuleThreadAndTestName$1.evaluate(TestRuleThreadAndTestName.java:48)
	at org.apache.lucene.util.TestRuleIgnoreAfterMaxFailures$1.evaluate(TestRuleIgnoreAfterMaxFailures.java:70)
	at org.apache.lucene.util.TestRuleMarkFailure$1.evaluate(TestRuleMarkFailure.java:48)
	at com.carrotsearch.randomizedtesting.rules.StatementAdapter.evaluate(StatementAdapter.java:36)
	at com.carrotsearch.randomizedtesting.ThreadLeakControl$StatementRunner.run(ThreadLeakControl.java:358)
	at com.carrotsearch.randomizedtesting.ThreadLeakControl.forkTimeoutingTask(ThreadLeakControl.java:782)
	at com.carrotsearch.randomizedtesting.ThreadLeakControl$3.evaluate(ThreadLeakControl.java:442)
	at com.carrotsearch.randomizedtesting.RandomizedRunner.runSingleTest(RandomizedRunner.java:746)
	at com.carrotsearch.randomizedtesting.RandomizedRunner$3.evaluate(RandomizedRunner.java:648)
	at com.carrotsearch.randomizedtesting.RandomizedRunner$4.evaluate(RandomizedRunner.java:682)
	at com.carrotsearch.randomizedtesting.RandomizedRunner$5.evaluate(RandomizedRunner.java:693)
	at com.carrotsearch.randomizedtesting.rules.StatementAdapter.evaluate(StatementAdapter.java:36)
	at com.carrotsearch.randomizedtesting.rules.SystemPropertiesRestoreRule$1.evaluate(SystemPropertiesRestoreRule.java:53)
	at org.apache.lucene.util.AbstractBeforeAfterRule$1.evaluate(AbstractBeforeAfterRule.java:45)
	at org.apache.lucene.util.TestRuleStoreClassName$1.evaluate(TestRuleStoreClassName.java:42)
	at com.carrotsearch.randomizedtesting.rules.SystemPropertiesInvariantRule$1.evaluate(SystemPropertiesInvariantRule.java:55)
	at com.carrotsearch.randomizedtesting.rules.NoShadowingOrOverridesOnMethodsRule$1.evaluate(NoShadowingOrOverridesOnMethodsRule.java:39)
	at com.carrotsearch.randomizedtesting.rules.NoShadowingOrOverridesOnMethodsRule$1.evaluate(NoShadowingOrOverridesOnMethodsRule.java:39)
	at org.apache.lucene.util.TestRuleAssertionsRequired$1.evaluate(TestRuleAssertionsRequired.java:40)
	at org.apache.lucene.util.TestRuleMarkFailure$1.evaluate(TestRuleMarkFailure.java:48)
	at org.apache.lucene.util.TestRuleIgnoreAfterMaxFailures$1.evaluate(TestRuleIgnoreAfterMaxFailures.java:70)
	at org.apache.lucene.util.TestRuleIgnoreTestSuites$1.evaluate(TestRuleIgnoreTestSuites.java:55)
	at com.carrotsearch.randomizedtesting.rules.StatementAdapter.evaluate(StatementAdapter.java:36)
	at com.carrotsearch.randomizedtesting.ThreadLeakControl$StatementRunner.run(ThreadLeakControl.java:358)
	at java.lang.Thread.run(Thread.java:777)


REGRESSION:  org.apache.solr.handler.component.StatsComponentTest.testStats

Error Message:
Exception during query

Stack Trace:
java.lang.RuntimeException: Exception during query
	at __randomizedtesting.SeedInfo.seed([98DB98944EE61084:25AC12B263ADEA7]:0)
	at org.apache.solr.util.AbstractSolrTestCase.assertQ(AbstractSolrTestCase.java:283)
	at org.apache.solr.handler.component.StatsComponentTest.doTestFacetStatisticsResult(StatsComponentTest.java:239)
	at org.apache.solr.handler.component.StatsComponentTest.testStats(StatsComponentTest.java:68)
	at sun.reflect.NativeMethodAccessorImpl.invoke0(Native Method)
	at sun.reflect.NativeMethodAccessorImpl.invoke(NativeMethodAccessorImpl.java:88)
	at sun.reflect.DelegatingMethodAccessorImpl.invoke(DelegatingMethodAccessorImpl.java:55)
	at java.lang.reflect.Method.invoke(Method.java:613)
	at com.carrotsearch.randomizedtesting.RandomizedRunner.invoke(RandomizedRunner.java:1559)
	at com.carrotsearch.randomizedtesting.RandomizedRunner.access$600(RandomizedRunner.java:79)
	at com.carrotsearch.randomizedtesting.RandomizedRunner$6.evaluate(RandomizedRunner.java:737)
	at com.carrotsearch.randomizedtesting.RandomizedRunner$7.evaluate(RandomizedRunner.java:773)
	at com.carrotsearch.randomizedtesting.RandomizedRunner$8.evaluate(RandomizedRunner.java:787)
	at com.carrotsearch.randomizedtesting.rules.SystemPropertiesRestoreRule$1.evaluate(SystemPropertiesRestoreRule.java:53)
	at org.apache.lucene.util.TestRuleSetupTeardownChained$1.evaluate(TestRuleSetupTeardownChained.java:50)
	at org.apache.lucene.util.TestRuleFieldCacheSanity$1.evaluate(TestRuleFieldCacheSanity.java:51)
	at org.apache.lucene.util.AbstractBeforeAfterRule$1.evaluate(AbstractBeforeAfterRule.java:45)
	at com.carrotsearch.randomizedtesting.rules.SystemPropertiesInvariantRule$1.evaluate(SystemPropertiesInvariantRule.java:55)
	at org.apache.lucene.util.TestRuleThreadAndTestName$1.evaluate(TestRuleThreadAndTestName.java:48)
	at org.apache.lucene.util.TestRuleIgnoreAfterMaxFailures$1.evaluate(TestRuleIgnoreAfterMaxFailures.java:70)
	at org.apache.lucene.util.TestRuleMarkFailure$1.evaluate(TestRuleMarkFailure.java:48)
	at com.carrotsearch.randomizedtesting.rules.StatementAdapter.evaluate(StatementAdapter.java:36)
	at com.carrotsearch.randomizedtesting.ThreadLeakControl$StatementRunner.run(ThreadLeakControl.java:358)
	at com.carrotsearch.randomizedtesting.ThreadLeakControl.forkTimeoutingTask(ThreadLeakControl.java:782)
	at com.carrotsearch.randomizedtesting.ThreadLeakControl$3.evaluate(ThreadLeakControl.java:442)
	at com.carrotsearch.randomizedtesting.RandomizedRunner.runSingleTest(RandomizedRunner.java:746)
	at com.carrotsearch.randomizedtesting.RandomizedRunner$3.evaluate(RandomizedRunner.java:648)
	at com.carrotsearch.randomizedtesting.RandomizedRunner$4.evaluate(RandomizedRunner.java:682)
	at com.carrotsearch.randomizedtesting.RandomizedRunner$5.evaluate(RandomizedRunner.java:693)
	at com.carrotsearch.randomizedtesting.rules.StatementAdapter.evaluate(StatementAdapter.java:36)
	at com.carrotsearch.randomizedtesting.rules.SystemPropertiesRestoreRule$1.evaluate(SystemPropertiesRestoreRule.java:53)
	at org.apache.lucene.util.AbstractBeforeAfterRule$1.evaluate(AbstractBeforeAfterRule.java:45)
	at org.apache.lucene.util.TestRuleStoreClassName$1.evaluate(TestRuleStoreClassName.java:42)
	at com.carrotsearch.randomizedtesting.rules.SystemPropertiesInvariantRule$1.evaluate(SystemPropertiesInvariantRule.java:55)
	at com.carrotsearch.randomizedtesting.rules.NoShadowingOrOverridesOnMethodsRule$1.evaluate(NoShadowingOrOverridesOnMethodsRule.java:39)
	at com.carrotsearch.randomizedtesting.rules.NoShadowingOrOverridesOnMethodsRule$1.evaluate(NoShadowingOrOverridesOnMethodsRule.java:39)
	at org.apache.lucene.util.TestRuleAssertionsRequired$1.evaluate(TestRuleAssertionsRequired.java:40)
	at org.apache.lucene.util.TestRuleMarkFailure$1.evaluate(TestRuleMarkFailure.java:48)
	at org.apache.lucene.util.TestRuleIgnoreAfterMaxFailures$1.evaluate(TestRuleIgnoreAfterMaxFailures.java:70)
	at org.apache.lucene.util.TestRuleIgnoreTestSuites$1.evaluate(TestRuleIgnoreTestSuites.java:55)
	at com.carrotsearch.randomizedtesting.rules.StatementAdapter.evaluate(StatementAdapter.java:36)
	at com.carrotsearch.randomizedtesting.ThreadLeakControl$StatementRunner.run(ThreadLeakControl.java:358)
	at java.lang.Thread.run(Thread.java:777)
Caused by: java.lang.NullPointerException
	at org.apache.solr.util.NumberUtils.SortableStr2int(NumberUtils.java:162)
	at org.apache.solr.schema.SortableIntField.toObject(SortableIntField.java:96)
	at org.apache.solr.schema.SortableIntField.toObject(SortableIntField.java:55)
	at org.apache.solr.schema.FieldType.toObject(FieldType.java:342)
	at org.apache.solr.handler.component.AbstractStatsValues.accumulate(StatsValuesFactory.java:129)
	at org.apache.solr.handler.component.SimpleStats.getFieldCacheStats(StatsComponent.java:281)
	at org.apache.solr.handler.component.SimpleStats.getStatsFields(StatsComponent.java:227)
	at org.apache.solr.handler.component.SimpleStats.getStatsCounts(StatsComponent.java:201)
	at org.apache.solr.handler.component.StatsComponent.process(StatsComponent.java:70)
	at org.apache.solr.handler.component.SearchHandler.handleRequestBody(SearchHandler.java:206)
	at org.apache.solr.handler.RequestHandlerBase.handleRequest(RequestHandlerBase.java:129)
	at org.apache.solr.core.SolrCore.execute(SolrCore.java:1701)
	at org.apache.solr.util.TestHarness.query(TestHarness.java:351)
	at org.apache.solr.util.TestHarness.query(TestHarness.java:333)
	at org.apache.solr.util.AbstractSolrTestCase.assertQ(AbstractSolrTestCase.java:273)
	... 41 more


REGRESSION:  org.apache.solr.update.AutoCommitTest.testMaxTime

Error Message:
shouldn't find any query failed XPath: //result[@numFound=0]  xml response was: <?xml version="1.0" encoding="UTF-8"?> <response> <lst name="responseHeader"><int name="status">0</int><int name="QTime">1613</int></lst><result name="response" numFound="1" start="0"><doc><int name="id">529</int><int name="range_facet_si">529</int><arr name="range_facet_l"><long>529</long></arr><arr name="range_facet_sl"><long>529</long></arr><arr name="field_t"><str>what's inside?</str></arr><arr name="subject"><str>info</str></arr><int name="intDefault">42</int><date name="timestamp">2012-09-11T11:23:34.67Z</date><arr name="multiDefault"><str>muLti-Default</str></arr></doc></result> </response>   request was: q=id:529&start=0&qt=standard&version=2.2&rows=20

Stack Trace:
java.lang.AssertionError: shouldn't find any query failed XPath: //result[@numFound=0]
 xml response was: <?xml version="1.0" encoding="UTF-8"?>
<response>
<lst name="responseHeader"><int name="status">0</int><int name="QTime">1613</int></lst><result name="response" numFound="1" start="0"><doc><int name="id">529</int><int name="range_facet_si">529</int><arr name="range_facet_l"><long>529</long></arr><arr name="range_facet_sl"><long>529</long></arr><arr name="field_t"><str>what's inside?</str></arr><arr name="subject"><str>info</str></arr><int name="intDefault">42</int><date name="timestamp">2012-09-11T11:23:34.67Z</date><arr name="multiDefault"><str>muLti-Default</str></arr></doc></result>
</response>

 request was: q=id:529&start=0&qt=standard&version=2.2&rows=20
	at __randomizedtesting.SeedInfo.seed([98DB98944EE61084:22FE576D07C8CB8]:0)
	at org.junit.Assert.fail(Assert.java:93)
	at org.apache.solr.util.AbstractSolrTestCase.assertQ(AbstractSolrTestCase.java:276)
	at org.apache.solr.update.AutoCommitTest.testMaxTime(AutoCommitTest.java:217)
	at sun.reflect.NativeMethodAccessorImpl.invoke0(Native Method)
	at sun.reflect.NativeMethodAccessorImpl.invoke(NativeMethodAccessorImpl.java:88)
	at sun.reflect.DelegatingMethodAccessorImpl.invoke(DelegatingMethodAccessorImpl.java:55)
	at java.lang.reflect.Method.invoke(Method.java:613)
	at com.carrotsearch.randomizedtesting.RandomizedRunner.invoke(RandomizedRunner.java:1559)
	at com.carrotsearch.randomizedtesting.RandomizedRunner.access$600(RandomizedRunner.java:79)
	at com.carrotsearch.randomizedtesting.RandomizedRunner$6.evaluate(RandomizedRunner.java:737)
	at com.carrotsearch.randomizedtesting.RandomizedRunner$7.evaluate(RandomizedRunner.java:773)
	at com.carrotsearch.randomizedtesting.RandomizedRunner$8.evaluate(RandomizedRunner.java:787)
	at com.carrotsearch.randomizedtesting.rules.SystemPropertiesRestoreRule$1.evaluate(SystemPropertiesRestoreRule.java:53)
	at org.apache.lucene.util.TestRuleSetupTeardownChained$1.evaluate(TestRuleSetupTeardownChained.java:50)
	at org.apache.lucene.util.TestRuleFieldCacheSanity$1.evaluate(TestRuleFieldCacheSanity.java:51)
	at org.apache.lucene.util.AbstractBeforeAfterRule$1.evaluate(AbstractBeforeAfterRule.java:45)
	at com.carrotsearch.randomizedtesting.rules.SystemPropertiesInvariantRule$1.evaluate(SystemPropertiesInvariantRule.java:55)
	at org.apache.lucene.util.TestRuleThreadAndTestName$1.evaluate(TestRuleThreadAndTestName.java:48)
	at org.apache.lucene.util.TestRuleIgnoreAfterMaxFailures$1.evaluate(TestRuleIgnoreAfterMaxFailures.java:70)
	at org.apache.lucene.util.TestRuleMarkFailure$1.evaluate(TestRuleMarkFailure.java:48)
	at com.carrotsearch.randomizedtesting.rules.StatementAdapter.evaluate(StatementAdapter.java:36)
	at com.carrotsearch.randomizedtesting.ThreadLeakControl$StatementRunner.run(ThreadLeakControl.java:358)
	at com.carrotsearch.randomizedtesting.ThreadLeakControl.forkTimeoutingTask(ThreadLeakControl.java:782)
	at com.carrotsearch.randomizedtesting.ThreadLeakControl$3.evaluate(ThreadLeakControl.java:442)
	at com.carrotsearch.randomizedtesting.RandomizedRunner.runSingleTest(RandomizedRunner.java:746)
	at com.carrotsearch.randomizedtesting.RandomizedRunner$3.evaluate(RandomizedRunner.java:648)
	at com.carrotsearch.randomizedtesting.RandomizedRunner$4.evaluate(RandomizedRunner.java:682)
	at com.carrotsearch.randomizedtesting.RandomizedRunner$5.evaluate(RandomizedRunner.java:693)
	at com.carrotsearch.randomizedtesting.rules.StatementAdapter.evaluate(StatementAdapter.java:36)
	at com.carrotsearch.randomizedtesting.rules.SystemPropertiesRestoreRule$1.evaluate(SystemPropertiesRestoreRule.java:53)
	at org.apache.lucene.util.AbstractBeforeAfterRule$1.evaluate(AbstractBeforeAfterRule.java:45)
	at org.apache.lucene.util.TestRuleStoreClassName$1.evaluate(TestRuleStoreClassName.java:42)
	at com.carrotsearch.randomizedtesting.rules.SystemPropertiesInvariantRule$1.evaluate(SystemPropertiesInvariantRule.java:55)
	at com.carrotsearch.randomizedtesting.rules.NoShadowingOrOverridesOnMethodsRule$1.evaluate(NoShadowingOrOverridesOnMethodsRule.java:39)
	at com.carrotsearch.randomizedtesting.rules.NoShadowingOrOverridesOnMethodsRule$1.evaluate(NoShadowingOrOverridesOnMethodsRule.java:39)
	at org.apache.lucene.util.TestRuleAssertionsRequired$1.evaluate(TestRuleAssertionsRequired.java:40)
	at org.apache.lucene.util.TestRuleMarkFailure$1.evaluate(TestRuleMarkFailure.java:48)
	at org.apache.lucene.util.TestRuleIgnoreAfterMaxFailures$1.evaluate(TestRuleIgnoreAfterMaxFailures.java:70)
	at org.apache.lucene.util.TestRuleIgnoreTestSuites$1.evaluate(TestRuleIgnoreTestSuites.java:55)
	at com.carrotsearch.randomizedtesting.rules.StatementAdapter.evaluate(StatementAdapter.java:36)
	at com.carrotsearch.randomizedtesting.ThreadLeakControl$StatementRunner.run(ThreadLeakControl.java:358)
	at java.lang.Thread.run(Thread.java:777)




Build Log:
[...truncated 7916 lines...]
[junit4:junit4] Suite: org.apache.solr.TestDistributedGrouping
[junit4:junit4]   2> 3 T2116 oas.SolrTestCaseJ4.setUp ###Starting testDistribSearch
[junit4:junit4]   2> 4 T2116 oejs.Server.doStart jetty-8.1.2.v20120308
[junit4:junit4]   2> 6 T2116 oejs.AbstractConnector.doStart Started SocketConnector@0.0.0.0:45713
[junit4:junit4]   2> 7 T2116 oasc.SolrResourceLoader.locateSolrHome JNDI not configured for solr (NoInitialContextEx)
[junit4:junit4]   2> 7 T2116 oasc.SolrResourceLoader.locateSolrHome using system property solr.solr.home: /mnt/ssd/jenkins/workspace/Lucene-Solr-4.x-Linux/solr/build/solr-core/test-files/solr
[junit4:junit4]   2> 8 T2116 oasc.SolrResourceLoader.<init> new SolrResourceLoader for deduced Solr Home: '/mnt/ssd/jenkins/workspace/Lucene-Solr-4.x-Linux/solr/build/solr-core/test-files/solr/'
[junit4:junit4]   2> 15 T2116 oass.SolrDispatchFilter.init SolrDispatchFilter.init()
[junit4:junit4]   2> 16 T2116 oasc.SolrResourceLoader.locateSolrHome JNDI not configured for solr (NoInitialContextEx)
[junit4:junit4]   2> 16 T2116 oasc.SolrResourceLoader.locateSolrHome using system property solr.solr.home: /mnt/ssd/jenkins/workspace/Lucene-Solr-4.x-Linux/solr/build/solr-core/test-files/solr
[junit4:junit4]   2> 17 T2116 oasc.CoreContainer$Initializer.initialize looking for solr.xml: /mnt/ssd/jenkins/workspace/Lucene-Solr-4.x-Linux/solr/build/solr-core/test-files/solr/solr.xml
[junit4:junit4]   2> 17 T2116 oasc.CoreContainer.<init> New CoreContainer -493072772
[junit4:junit4]   2> 18 T2116 oasc.CoreContainer.load Loading CoreContainer using Solr Home: '/mnt/ssd/jenkins/workspace/Lucene-Solr-4.x-Linux/solr/build/solr-core/test-files/solr/'
[junit4:junit4]   2> 18 T2116 oasc.SolrResourceLoader.<init> new SolrResourceLoader for directory: '/mnt/ssd/jenkins/workspace/Lucene-Solr-4.x-Linux/solr/build/solr-core/test-files/solr/'
[junit4:junit4]   2> 29 T2116 oasc.CoreContainer.load Registering Log Listener
[junit4:junit4]   2> 38 T2116 oasc.CoreContainer.create Creating SolrCore 'collection1' using instanceDir: /mnt/ssd/jenkins/workspace/Lucene-Solr-4.x-Linux/solr/build/solr-core/test-files/solr/collection1
[junit4:junit4]   2> 39 T2116 oasc.SolrResourceLoader.<init> new SolrResourceLoader for directory: '/mnt/ssd/jenkins/workspace/Lucene-Solr-4.x-Linux/solr/build/solr-core/test-files/solr/collection1/'
[junit4:junit4]   2> 40 T2116 oasc.SolrResourceLoader.replaceClassLoader Adding 'file:/mnt/ssd/jenkins/workspace/Lucene-Solr-4.x-Linux/solr/build/solr-core/test-files/solr/collection1/lib/README' to classloader
[junit4:junit4]   2> 40 T2116 oasc.SolrResourceLoader.replaceClassLoader Adding 'file:/mnt/ssd/jenkins/workspace/Lucene-Solr-4.x-Linux/solr/build/solr-core/test-files/solr/collection1/lib/classes/' to classloader
[junit4:junit4]   2> 63 T2116 oasc.SolrConfig.<init> Using Lucene MatchVersion: LUCENE_40
[junit4:junit4]   2> 108 T2116 oasc.SolrConfig.<init> Loaded SolrConfig: solrconfig.xml
[junit4:junit4]   2> 108 T2116 oass.IndexSchema.readSchema Reading Solr Schema
[junit4:junit4]   2> 113 T2116 oass.IndexSchema.readSchema Schema name=test
[junit4:junit4]   2> 392 T2116 oass.OpenExchangeRatesOrgProvider.init Initialized with rates=open-exchange-rates.json, refreshInterval=1440.
[junit4:junit4]   2> 396 T2116 oass.IndexSchema.readSchema default search field in schema is text
[junit4:junit4]   2> 399 T2116 oass.IndexSchema.readSchema unique key field: id
[junit4:junit4]   2> 403 T2116 oass.FileExchangeRateProvider.reload Reloading exchange rates from file currency.xml
[junit4:junit4]   2> 407 T2116 oass.FileExchangeRateProvider.reload Reloading exchange rates from file currency.xml
[junit4:junit4]   2> 410 T2116 oass.OpenExchangeRatesOrgProvider.reload Reloading exchange rates from open-exchange-rates.json
[junit4:junit4]   2> 411 T2116 oass.OpenExchangeRatesOrgProvider.reload Reloading exchange rates from open-exchange-rates.json
[junit4:junit4]   2> 412 T2116 oasc.SolrCore.<init> [collection1] Opening new SolrCore at /mnt/ssd/jenkins/workspace/Lucene-Solr-4.x-Linux/solr/build/solr-core/test-files/solr/collection1/, dataDir=./org.apache.solr.TestDistributedGrouping-1347362587743/control/data/
[junit4:junit4]   2> 412 T2116 oasc.JmxMonitoredMap.<init> JMX monitoring is enabled. Adding Solr mbeans to JMX Server: com.sun.jmx.mbeanserver.JmxMBeanServer@f9453ca8
[junit4:junit4]   2> 413 T2116 oasc.SolrCore.getNewIndexDir WARNING New index directory detected: old=null new=./org.apache.solr.TestDistributedGrouping-1347362587743/control/data/index/
[junit4:junit4]   2> 413 T2116 oasc.SolrCore.initIndex WARNING [collection1] Solr index directory './org.apache.solr.TestDistributedGrouping-1347362587743/control/data/index' doesn't exist. Creating new index...
[junit4:junit4]   2> 415 T2116 oasc.CachingDirectoryFactory.get return new directory for /mnt/ssd/jenkins/workspace/Lucene-Solr-4.x-Linux/solr/build/solr-core/test/J1/./org.apache.solr.TestDistributedGrouping-1347362587743/control/data/index forceNew:false
[junit4:junit4]   2> 417 T2116 oasc.SolrDeletionPolicy.onCommit SolrDeletionPolicy.onCommit: commits:num=1
[junit4:junit4]   2> 		commit{dir=MockDirWrapper(org.apache.lucene.store.SimpleFSDirectory@/mnt/ssd/jenkins/workspace/Lucene-Solr-4.x-Linux/solr/build/solr-core/test/J1/index3561135616tmp lockFactory=org.apache.lucene.store.NativeFSLockFactory@62b360d8),segFN=segments_1,generation=1,filenames=[segments_1]
[junit4:junit4]   2> 418 T2116 oasc.SolrDeletionPolicy.updateCommits newest commit = 1
[junit4:junit4]   2> 418 T2116 oasc.SolrCore.initWriters created xml: solr.XMLResponseWriter
[junit4:junit4]   2> 420 T2116 oasup.UpdateRequestProcessorChain.init inserting DistributedUpdateProcessorFactory into updateRequestProcessorChain "dedupe"
[junit4:junit4]   2> 420 T2116 oasup.UpdateRequestProcessorChain.init inserting DistributedUpdateProcessorFactory into updateRequestProcessorChain "dedupe-allfields"
[junit4:junit4]   2> 421 T2116 oasup.UpdateRequestProcessorChain.init inserting DistributedUpdateProcessorFactory into updateRequestProcessorChain "stored_sig"
[junit4:junit4]   2> 421 T2116 oasup.UpdateRequestProcessorChain.init inserting DistributedUpdateProcessorFactory into updateRequestProcessorChain "uniq-fields"
[junit4:junit4]   2> 422 T2116 oasup.UpdateRequestProcessorChain.init inserting DistributedUpdateProcessorFactory into updateRequestProcessorChain "distrib-dup-test-chain-implicit"
[junit4:junit4]   2> 422 T2116 oasc.RequestHandlers.initHandlersFromConfig adding lazy requestHandler: solr.ReplicationHandler
[junit4:junit4]   2> 423 T2116 oasc.RequestHandlers.initHandlersFromConfig created /replication: solr.ReplicationHandler
[junit4:junit4]   2> 424 T2116 oasc.RequestHandlers.initHandlersFromConfig created standard: solr.StandardRequestHandler
[junit4:junit4]   2> 424 T2116 oasc.RequestHandlers.initHandlersFromConfig created /get: solr.RealTimeGetHandler
[junit4:junit4]   2> 425 T2116 oasc.RequestHandlers.initHandlersFromConfig created dismax: solr.SearchHandler
[junit4:junit4]   2> 425 T2116 oasc.RequestHandlers.initHandlersFromConfig created mock: org.apache.solr.core.MockQuerySenderListenerReqHandler
[junit4:junit4]   2> 426 T2116 oasc.RequestHandlers.initHandlersFromConfig created /admin/: org.apache.solr.handler.admin.AdminHandlers
[junit4:junit4]   2> 426 T2116 oasc.RequestHandlers.initHandlersFromConfig created defaults: solr.StandardRequestHandler
[junit4:junit4]   2> 427 T2116 oasc.RequestHandlers.initHandlersFromConfig adding lazy requestHandler: solr.StandardRequestHandler
[junit4:junit4]   2> 427 T2116 oasc.RequestHandlers.initHandlersFromConfig created lazy: solr.StandardRequestHandler
[junit4:junit4]   2> 428 T2116 oasc.RequestHandlers.initHandlersFromConfig created /update: solr.UpdateRequestHandler
[junit4:junit4]   2> 428 T2116 oasc.RequestHandlers.initHandlersFromConfig created /terms: org.apache.solr.handler.component.SearchHandler
[junit4:junit4]   2> 429 T2116 oasc.RequestHandlers.initHandlersFromConfig created spellCheckCompRH: org.apache.solr.handler.component.SearchHandler
[junit4:junit4]   2> 430 T2116 oasc.RequestHandlers.initHandlersFromConfig created spellCheckCompRH_Direct: org.apache.solr.handler.component.SearchHandler
[junit4:junit4]   2> 430 T2116 oasc.RequestHandlers.initHandlersFromConfig created spellCheckWithWordbreak: org.apache.solr.handler.component.SearchHandler
[junit4:junit4]   2> 431 T2116 oasc.RequestHandlers.initHandlersFromConfig created spellCheckWithWordbreak_Direct: org.apache.solr.handler.component.SearchHandler
[junit4:junit4]   2> 431 T2116 oasc.RequestHandlers.initHandlersFromConfig created spellCheckCompRH1: org.apache.solr.handler.component.SearchHandler
[junit4:junit4]   2> 432 T2116 oasc.RequestHandlers.initHandlersFromConfig created tvrh: org.apache.solr.handler.component.SearchHandler
[junit4:junit4]   2> 432 T2116 oasc.RequestHandlers.initHandlersFromConfig created /mlt: solr.MoreLikeThisHandler
[junit4:junit4]   2> 433 T2116 oasc.RequestHandlers.initHandlersFromConfig created /debug/dump: solr.DumpRequestHandler
[junit4:junit4]   2> 434 T2116 oashl.XMLLoader.init xsltCacheLifetimeSeconds=60
[junit4:junit4]   2> 435 T2116 oasc.SolrCore.initDeprecatedSupport WARNING solrconfig.xml uses deprecated <admin/gettableFiles>, Please update your config to use the ShowFileRequestHandler.
[junit4:junit4]   2> 436 T2116 oasc.SolrCore.initDeprecatedSupport WARNING adding ShowFileRequestHandler with hidden files: [BAD-SCHEMA-NOT-INDEXED-BUT-TF.XML, SCHEMA-REQUIRED-FIELDS.XML, SOLRCONFIG-MASTER1-KEEPONEBACKUP.XML, BAD-SCHEMA-NONTEXT-ANALYZER.XML, SOLRCONFIG-PROPINJECT.XML, SOLRCONFIG-PROPINJECT-INDEXDEFAULT.XML, STOP-2.TXT, SCHEMA11.XML, BAD-SCHEMA-UNIQUEKEY-USES-DEFAULT.XML, SCHEMA15.XML, SOLRCONFIG-NATIVELOCK.XML, SCHEMA-SIM.XML, CONDITIONAL.UPDATEPROCESSOR.JS, BAD-SOLRCONFIG-MISSING-SCRIPTFILE.XML, SOLRCONFIG-SCRIPT-UPDATEPROCESSOR.XML, SOLRCONFIG-REPEATER.XML, SOLRCONFIG-SPELLCHECKER.XML, SOLRCONFIG-NOCACHE.XML, SCHEMA-CHARFILTERS.XML, SOLRCONFIG-SOLCOREPROPERTIES.XML, SOLRCONFIG_CODEC.XML, BAD-SCHEMA-EXTERNAL-FILEFIELD.XML, HYPHENATION.DTD, SCHEMA.XML, SOLRCONFIG-MERGEPOLICY.XML, TRIVIAL.UPDATEPROCESSOR1.JS, SOLRCONFIG-PHRASESUGGEST.XML, SOLRCONFIG-SLAVE1.XML, SOLRCONFIG-BASIC.XML, SCHEMA-LMJELINEKMERCER.XML, BAD-MP-SOLRCONFIG.XML, BAD-SCHEMA-DUP-FIELD.XML, BAD-SCHEMA-UNIQUEKEY-MULTIVALUED.XML, SOLRCONFIG-MASTER.XML, SOLRCONFIG-HIGHLIGHT.XML, SCHEMA-TFIDF.XML, SCHEMA-REPLICATION1.XML, SYNONYMS.TXT, SOLRCONFIG-ELEVATE.XML, STOPWITHBOM.TXT, SOLRCONFIG-QUERYSENDER.XML, WDFTYPES.TXT, SOLRCONFIG-DELPOLICY1.XML, BAD_SOLRCONFIG.XML, HUNSPELL-TEST.DIC, SCHEMA-NUMERIC.XML, SCHEMA-LUCENEMATCHVERSION.XML, KEEP-2.TXT, SCHEMA-STOP-KEEP.XML, SCHEMA-IB.XML, STOP-SNOWBALL.TXT, SOLRCONFIG-SLAVE.XML, BAD-SCHEMA-NOT-INDEXED-BUT-NORMS.XML, STOPWORDSWRONGENCODING.TXT, THROW.ERROR.ON.ADD.UPDATEPROCESSOR.JS, SOLRCONFIG-SPELLCHECKCOMPONENT.XML, STOPTYPES-1.TXT, SOLRCONFIG-TLOG.XML, COMPOUNDDICTIONARY.TXT, DA_COMPOUNDDICTIONARY.TXT, SOLRCONFIG-TERMINDEX.XML, BAD-SOLRCONFIG-INVALID-SCRIPTFILE.XML, SCHEMASURROUND.XML, OPEN-EXCHANGE-RATES.JSON, BAD-SCHEMA-DUP-FIELDTYPE.XML, PHRASESUGGEST.TXT, SOLRCONFIG-MASTER2.XML, OLD_SYNONYMS.TXT, BAD-SCHEMA-UNIQUEKEY-IS-COPYFIELD-DEST.XML, SCHEMA-NOT-REQUIRED-UNIQUE-KEY.XML, BAD-SCHEMA-CODEC-GLOBAL-VS-FT-MISMATCH.XML, SCHEMA-LMDIRICHLET.XML, SCHEMA-REVERSED.XML, BAD-SCHEMA-NOT-INDEXED-BUT-POS.XML, SCHEMA-FOLDING.XML, SOLRCONFIG-CACHING.XML, MAPPING-ISOLATIN1ACCENT.TXT, ADDFIELDS.UPDATEPROCESSOR.JS, SCHEMA-BM25.XML, STOP-1.TXT, SOLRCONFIG-ENABLEPLUGIN.XML, MISSING.FUNCTIONS.UPDATEPROCESSOR.JS, SCHEMA12.XML, SOLRCONFIG-TRANSFORMERS.XML, SCHEMA-COPYFIELD-TEST.XML, SOLRCONFIG-BASIC-LUCENEVERSION31.XML, BAD-SCHEMA-DUP-DYNAMICFIELD.XML, CURRENCY.XML, DA_UTF8.XML, MISSLEADING.EXTENSION.UPDATEPROCESSOR.JS.TXT, SOLRCONFIG-SOLR-749.XML, STOPWORDS.TXT, HUNSPELL-TEST.AFF, SOLRCONFIG_PERF.XML, SOLRCONFIG-SIMPLELOCK.XML, FRENCHARTICLES.TXT, SOLRCONFIG-LAZYWRITER.XML, SCHEMA-REPLICATION2.XML, SOLRCONFIG-XINCLUDE.XML, SCHEMA-SPELLCHECKER.XML, XSLT, SOLRCONFIG-DELPOLICY2.XML, TRIVIAL.UPDATEPROCESSOR0.JS, KEEP-1.TXT, SCHEMA-TRIE.XML, SCHEMA-BINARYFIELD.XML, SCHEMA-COLLATEFILTER.XML, BAD-SCHEMA-OMIT-TF-BUT-NOT-POS.XML, SCHEMA-MINIMAL.XML, STOPTYPES-2.TXT, STEMDICT.TXT, SCHEMA_CODEC.XML, ELEVATE.XML, SCHEMA-COLLATE.XML, PROTWORDS.TXT, SOLRCONFIG-REQHANDLER.INCL, SCHEMA-PHRASESUGGEST.XML, SCHEMA-DFR.XML, BAD-SCHEMA-ANALYZER-CLASS-AND-NESTED.XML, SOLRCONFIG-MASTER1.XML, SOLRCONFIG-FUNCTIONQUERY.XML, SOLRCONFIG-MASTER3.XML, SOLRCONFIG-UPDATE-PROCESSOR-CHAINS.XML, SOLRCONFIG-ALTDIRECTORY.XML, BAD-SCHEMA-SIM-GLOBAL-VS-FT-MISMATCH.XML, SOLRCONFIG-QUERYSENDER-NOQUERY.XML, BAD-SOLRCONFIG-BOGUS-SCRIPTENGINE-NAME.XML]
[junit4:junit4]   2> 442 T2116 oass.SolrIndexSearcher.<init> Opening Searcher@8a446d7e main
[junit4:junit4]   2> 442 T2116 oass.SolrIndexSearcher.getIndexDir WARNING WARNING: Directory impl does not support setting indexDir: org.apache.lucene.store.MockDirectoryWrapper
[junit4:junit4]   2> 443 T2116 oasu.CommitTracker.<init> Hard AutoCommit: disabled
[junit4:junit4]   2> 444 T2116 oasu.CommitTracker.<init> Soft AutoCommit: disabled
[junit4:junit4]   2> 444 T2116 oashc.SpellCheckComponent.inform Initializing spell checkers
[junit4:junit4]   2> 522 T2116 oass.DirectSolrSpellChecker.init init: {name=direct,classname=DirectSolrSpellChecker,field=lowerfilt,minQueryLength=3}
[junit4:junit4]   2> 539 T2116 oashc.HttpShardHandlerFactory.getParameter Setting socketTimeout to: 0
[junit4:junit4]   2> 539 T2116 oashc.HttpShardHandlerFactory.getParameter Setting urlScheme to: http://
[junit4:junit4]   2> 540 T2116 oashc.HttpShardHandlerFactory.getParameter Setting connTimeout to: 0
[junit4:junit4]   2> 540 T2116 oashc.HttpShardHandlerFactory.getParameter Setting maxConnectionsPerHost to: 20
[junit4:junit4]   2> 541 T2116 oashc.HttpShardHandlerFactory.getParameter Setting corePoolSize to: 0
[junit4:junit4]   2> 541 T2116 oashc.HttpShardHandlerFactory.getParameter Setting maximumPoolSize to: 2147483647
[junit4:junit4]   2> 541 T2116 oashc.HttpShardHandlerFactory.getParameter Setting maxThreadIdleTime to: 5
[junit4:junit4]   2> 542 T2116 oashc.HttpShardHandlerFactory.getParameter Setting sizeOfQueue to: -1
[junit4:junit4]   2> 543 T2116 oashc.HttpShardHandlerFactory.getParameter Setting fairnessPolicy to: false
[junit4:junit4]   2> 543 T2116 oascsi.HttpClientUtil.createClient Creating new http client, config:maxConnectionsPerHost=20&maxConnections=10000&socketTimeout=0&connTimeout=0&retry=false
[junit4:junit4]   2> 550 T2126 oasc.SolrCore.registerSearcher [collection1] Registered new searcher Searcher@8a446d7e main{StandardDirectoryReader(segments_1:1)}
[junit4:junit4]   2> 554 T2116 oasc.CoreContainer.register registering core: collection1
[junit4:junit4]   2> 555 T2116 oass.SolrDispatchFilter.init user.dir=/mnt/ssd/jenkins/workspace/Lucene-Solr-4.x-Linux/solr/build/solr-core/test/J1
[junit4:junit4]   2> 556 T2116 oass.SolrDispatchFilter.init SolrDispatchFilter.init() done
[junit4:junit4]   2> 557 T2116 oascsi.HttpClientUtil.createClient Creating new http client, config:maxConnections=128&maxConnectionsPerHost=32&followRedirects=false
[junit4:junit4]   2> 562 T2116 oejs.Server.doStart jetty-8.1.2.v20120308
[junit4:junit4]   2> 564 T2116 oejs.AbstractConnector.doStart Started SocketConnector@0.0.0.0:44277
[junit4:junit4]   2> 565 T2116 oasc.SolrResourceLoader.locateSolrHome JNDI not configured for solr (NoInitialContextEx)
[junit4:junit4]   2> 566 T2116 oasc.SolrResourceLoader.locateSolrHome using system property solr.solr.home: /mnt/ssd/jenkins/workspace/Lucene-Solr-4.x-Linux/solr/build/solr-core/test-files/solr
[junit4:junit4]   2> 567 T2116 oasc.SolrResourceLoader.<init> new SolrResourceLoader for deduced Solr Home: '/mnt/ssd/jenkins/workspace/Lucene-Solr-4.x-Linux/solr/build/solr-core/test-files/solr/'
[junit4:junit4]   2> 580 T2116 oass.SolrDispatchFilter.init SolrDispatchFilter.init()
[junit4:junit4]   2> 581 T2116 oasc.SolrResourceLoader.locateSolrHome JNDI not configured for solr (NoInitialContextEx)
[junit4:junit4]   2> 581 T2116 oasc.SolrResourceLoader.locateSolrHome using system property solr.solr.home: /mnt/ssd/jenkins/workspace/Lucene-Solr-4.x-Linux/solr/build/solr-core/test-files/solr
[junit4:junit4]   2> 582 T2116 oasc.CoreContainer$Initializer.initialize looking for solr.xml: /mnt/ssd/jenkins/workspace/Lucene-Solr-4.x-Linux/solr/build/solr-core/test-files/solr/solr.xml
[junit4:junit4]   2> 583 T2116 oasc.CoreContainer.<init> New CoreContainer 484371860
[junit4:junit4]   2> 584 T2116 oasc.CoreContainer.load Loading CoreContainer using Solr Home: '/mnt/ssd/jenkins/workspace/Lucene-Solr-4.x-Linux/solr/build/solr-core/test-files/solr/'
[junit4:junit4]   2> 584 T2116 oasc.SolrResourceLoader.<init> new SolrResourceLoader for directory: '/mnt/ssd/jenkins/workspace/Lucene-Solr-4.x-Linux/solr/build/solr-core/test-files/solr/'
[junit4:junit4]   2> 602 T2116 oasc.CoreContainer.load Registering Log Listener
[junit4:junit4]   2> 618 T2116 oasc.CoreContainer.create Creating SolrCore 'collection1' using instanceDir: /mnt/ssd/jenkins/workspace/Lucene-Solr-4.x-Linux/solr/build/solr-core/test-files/solr/collection1
[junit4:junit4]   2> 619 T2116 oasc.SolrResourceLoader.<init> new SolrResourceLoader for directory: '/mnt/ssd/jenkins/workspace/Lucene-Solr-4.x-Linux/solr/build/solr-core/test-files/solr/collection1/'
[junit4:junit4]   2> 620 T2116 oasc.SolrResourceLoader.replaceClassLoader Adding 'file:/mnt/ssd/jenkins/workspace/Lucene-Solr-4.x-Linux/solr/build/solr-core/test-files/solr/collection1/lib/README' to classloader
[junit4:junit4]   2> 621 T2116 oasc.SolrResourceLoader.replaceClassLoader Adding 'file:/mnt/ssd/jenkins/workspace/Lucene-Solr-4.x-Linux/solr/build/solr-core/test-files/solr/collection1/lib/classes/' to classloader
[junit4:junit4]   2> 645 T2116 oasc.SolrConfig.<init> Using Lucene MatchVersion: LUCENE_40
[junit4:junit4]   2> 677 T2116 oasc.SolrConfig.<init> Loaded SolrConfig: solrconfig.xml
[junit4:junit4]   2> 678 T2116 oass.IndexSchema.readSchema Reading Solr Schema
[junit4:junit4]   2> 682 T2116 oass.IndexSchema.readSchema Schema name=test
[junit4:junit4]   2> 957 T2116 oass.OpenExchangeRatesOrgProvider.init Initialized with rates=open-exchange-rates.json, refreshInterval=1440.
[junit4:junit4]   2> 962 T2116 oass.IndexSchema.readSchema default search field in schema is text
[junit4:junit4]   2> 964 T2116 oass.IndexSchema.readSchema unique key field: id
[junit4:junit4]   2> 968 T2116 oass.FileExchangeRateProvider.reload Reloading exchange rates from file currency.xml
[junit4:junit4]   2> 972 T2116 oass.FileExchangeRateProvider.reload Reloading exchange rates from file currency.xml
[junit4:junit4]   2> 975 T2116 oass.OpenExchangeRatesOrgProvider.reload Reloading exchange rates from open-exchange-rates.json
[junit4:junit4]   2> 975 T2116 oass.OpenExchangeRatesOrgProvider.reload Reloading exchange rates from open-exchange-rates.json
[junit4:junit4]   2> 976 T2116 oasc.SolrCore.<init> [collection1] Opening new SolrCore at /mnt/ssd/jenkins/workspace/Lucene-Solr-4.x-Linux/solr/build/solr-core/test-files/solr/collection1/, dataDir=./org.apache.solr.TestDistributedGrouping-1347362587743/shard0/data/
[junit4:junit4]   2> 976 T2116 oasc.JmxMonitoredMap.<init> JMX monitoring is enabled. Adding Solr mbeans to JMX Server: com.sun.jmx.mbeanserver.JmxMBeanServer@f9453ca8
[junit4:junit4]   2> 977 T2116 oasc.SolrCore.getNewIndexDir WARNING New index directory detected: old=null new=./org.apache.solr.TestDistributedGrouping-1347362587743/shard0/data/index/
[junit4:junit4]   2> 978 T2116 oasc.SolrCore.initIndex WARNING [collection1] Solr index directory './org.apache.solr.TestDistributedGrouping-1347362587743/shard0/data/index' doesn't exist. Creating new index...
[junit4:junit4]   2> 979 T2116 oasc.CachingDirectoryFactory.get return new directory for /mnt/ssd/jenkins/workspace/Lucene-Solr-4.x-Linux/solr/build/solr-core/test/J1/./org.apache.solr.TestDistributedGrouping-1347362587743/shard0/data/index forceNew:false
[junit4:junit4]   2> 980 T2116 oasc.SolrDeletionPolicy.onCommit SolrDeletionPolicy.onCommit: commits:num=1
[junit4:junit4]   2> 		commit{dir=MockDirWrapper(org.apache.lucene.store.RAMDirectory@77d60fd2 lockFactory=org.apache.lucene.store.NativeFSLockFactory@691329d5),segFN=segments_1,generation=1,filenames=[segments_1]
[junit4:junit4]   2> 980 T2116 oasc.SolrDeletionPolicy.updateCommits newest commit = 1
[junit4:junit4]   2> 981 T2116 oasc.SolrCore.initWriters created xml: solr.XMLResponseWriter
[junit4:junit4]   2> 982 T2116 oasup.UpdateRequestProcessorChain.init inserting DistributedUpdateProcessorFactory into updateRequestProcessorChain "dedupe"
[junit4:junit4]   2> 983 T2116 oasup.UpdateRequestProcessorChain.init inserting DistributedUpdateProcessorFactory into updateRequestProcessorChain "dedupe-allfields"
[junit4:junit4]   2> 983 T2116 oasup.UpdateRequestProcessorChain.init inserting DistributedUpdateProcessorFactory into updateRequestProcessorChain "stored_sig"
[junit4:junit4]   2> 984 T2116 oasup.UpdateRequestProcessorChain.init inserting DistributedUpdateProcessorFactory into updateRequestProcessorChain "uniq-fields"
[junit4:junit4]   2> 985 T2116 oasup.UpdateRequestProcessorChain.init inserting DistributedUpdateProcessorFactory into updateRequestProcessorChain "distrib-dup-test-chain-implicit"
[junit4:junit4]   2> 985 T2116 oasc.RequestHandlers.initHandlersFromConfig adding lazy requestHandler: solr.ReplicationHandler
[junit4:junit4]   2> 986 T2116 oasc.RequestHandlers.initHandlersFromConfig created /replication: solr.ReplicationHandler
[junit4:junit4]   2> 986 T2116 oasc.RequestHandlers.initHandlersFromConfig created standard: solr.StandardRequestHandler
[junit4:junit4]   2> 987 T2116 oasc.RequestHandlers.initHandlersFromConfig created /get: solr.RealTimeGetHandler
[junit4:junit4]   2> 988 T2116 oasc.RequestHandlers.initHandlersFromConfig created dismax: solr.SearchHandler
[junit4:junit4]   2> 988 T2116 oasc.RequestHandlers.initHandlersFromConfig created mock: org.apache.solr.core.MockQuerySenderListenerReqHandler
[junit4:junit4]   2> 989 T2116 oasc.RequestHandlers.initHandlersFromConfig created /admin/: org.apache.solr.handler.admin.AdminHandlers
[junit4:junit4]   2> 989 T2116 oasc.RequestHandlers.initHandlersFromConfig created defaults: solr.StandardRequestHandler
[junit4:junit4]   2> 990 T2116 oasc.RequestHandlers.initHandlersFromConfig adding lazy requestHandler: solr.StandardRequestHandler
[junit4:junit4]   2> 990 T2116 oasc.RequestHandlers.initHandlersFromConfig created lazy: solr.StandardRequestHandler
[junit4:junit4]   2> 991 T2116 oasc.RequestHandlers.initHandlersFromConfig created /update: solr.UpdateRequestHandler
[junit4:junit4]   2> 991 T2116 oasc.RequestHandlers.initHandlersFromConfig created /terms: org.apache.solr.handler.component.SearchHandler
[junit4:junit4]   2> 992 T2116 oasc.RequestHandlers.initHandlersFromConfig created spellCheckCompRH: org.apache.solr.handler.component.SearchHandler
[junit4:junit4]   2> 992 T2116 oasc.RequestHandlers.initHandlersFromConfig created spellCheckCompRH_Direct: org.apache.solr.handler.component.SearchHandler
[junit4:junit4]   2> 993 T2116 oasc.RequestHandlers.initHandlersFromConfig created spellCheckWithWordbreak: org.apache.solr.handler.component.SearchHandler
[junit4:junit4]   2> 994 T2116 oasc.RequestHandlers.initHandlersFromConfig created spellCheckWithWordbreak_Direct: org.apache.solr.handler.component.SearchHandler
[junit4:junit4]   2> 994 T2116 oasc.RequestHandlers.initHandlersFromConfig created spellCheckCompRH1: org.apache.solr.handler.component.SearchHandler
[junit4:junit4]   2> 995 T2116 oasc.RequestHandlers.initHandlersFromConfig created tvrh: org.apache.solr.handler.component.SearchHandler
[junit4:junit4]   2> 995 T2116 oasc.RequestHandlers.initHandlersFromConfig created /mlt: solr.MoreLikeThisHandler
[junit4:junit4]   2> 996 T2116 oasc.RequestHandlers.initHandlersFromConfig created /debug/dump: solr.DumpRequestHandler
[junit4:junit4]   2> 997 T2116 oashl.XMLLoader.init xsltCacheLifetimeSeconds=60
[junit4:junit4]   2> 998 T2116 oasc.SolrCore.initDeprecatedSupport WARNING solrconfig.xml uses deprecated <admin/gettableFiles>, Please update your config to use the ShowFileRequestHandler.
[junit4:junit4]   2> 999 T2116 oasc.SolrCore.initDeprecatedSupport WARNING adding ShowFileRequestHandler with hidden files: [BAD-SCHEMA-NOT-INDEXED-BUT-TF.XML, SCHEMA-REQUIRED-FIELDS.XML, SOLRCONFIG-MASTER1-KEEPONEBACKUP.XML, BAD-SCHEMA-NONTEXT-ANALYZER.XML, SOLRCONFIG-PROPINJECT.XML, SOLRCONFIG-PROPINJECT-INDEXDEFAULT.XML, STOP-2.TXT, SCHEMA11.XML, BAD-SCHEMA-UNIQUEKEY-USES-DEFAULT.XML, SCHEMA15.XML, SOLRCONFIG-NATIVELOCK.XML, SCHEMA-SIM.XML, CONDITIONAL.UPDATEPROCESSOR.JS, BAD-SOLRCONFIG-MISSING-SCRIPTFILE.XML, SOLRCONFIG-SCRIPT-UPDATEPROCESSOR.XML, SOLRCONFIG-REPEATER.XML, SOLRCONFIG-SPELLCHECKER.XML, SOLRCONFIG-NOCACHE.XML, SCHEMA-CHARFILTERS.XML, SOLRCONFIG-SOLCOREPROPERTIES.XML, SOLRCONFIG_CODEC.XML, BAD-SCHEMA-EXTERNAL-FILEFIELD.XML, HYPHENATION.DTD, SCHEMA.XML, SOLRCONFIG-MERGEPOLICY.XML, TRIVIAL.UPDATEPROCESSOR1.JS, SOLRCONFIG-PHRASESUGGEST.XML, SOLRCONFIG-SLAVE1.XML, SOLRCONFIG-BASIC.XML, SCHEMA-LMJELINEKMERCER.XML, BAD-MP-SOLRCONFIG.XML, BAD-SCHEMA-DUP-FIELD.XML, BAD-SCHEMA-UNIQUEKEY-MULTIVALUED.XML, SOLRCONFIG-MASTER.XML, SOLRCONFIG-HIGHLIGHT.XML, SCHEMA-TFIDF.XML, SCHEMA-REPLICATION1.XML, SYNONYMS.TXT, SOLRCONFIG-ELEVATE.XML, STOPWITHBOM.TXT, SOLRCONFIG-QUERYSENDER.XML, WDFTYPES.TXT, SOLRCONFIG-DELPOLICY1.XML, BAD_SOLRCONFIG.XML, HUNSPELL-TEST.DIC, SCHEMA-NUMERIC.XML, SCHEMA-LUCENEMATCHVERSION.XML, KEEP-2.TXT, SCHEMA-STOP-KEEP.XML, SCHEMA-IB.XML, STOP-SNOWBALL.TXT, SOLRCONFIG-SLAVE.XML, BAD-SCHEMA-NOT-INDEXED-BUT-NORMS.XML, STOPWORDSWRONGENCODING.TXT, THROW.ERROR.ON.ADD.UPDATEPROCESSOR.JS, SOLRCONFIG-SPELLCHECKCOMPONENT.XML, STOPTYPES-1.TXT, SOLRCONFIG-TLOG.XML, COMPOUNDDICTIONARY.TXT, DA_COMPOUNDDICTIONARY.TXT, SOLRCONFIG-TERMINDEX.XML, BAD-SOLRCONFIG-INVALID-SCRIPTFILE.XML, SCHEMASURROUND.XML, OPEN-EXCHANGE-RATES.JSON, BAD-SCHEMA-DUP-FIELDTYPE.XML, PHRASESUGGEST.TXT, SOLRCONFIG-MASTER2.XML, OLD_SYNONYMS.TXT, BAD-SCHEMA-UNIQUEKEY-IS-COPYFIELD-DEST.XML, SCHEMA-NOT-REQUIRED-UNIQUE-KEY.XML, BAD-SCHEMA-CODEC-GLOBAL-VS-FT-MISMATCH.XML, SCHEMA-LMDIRICHLET.XML, SCHEMA-REVERSED.XML, BAD-SCHEMA-NOT-INDEXED-BUT-POS.XML, SCHEMA-FOLDING.XML, SOLRCONFIG-CACHING.XML, MAPPING-ISOLATIN1ACCENT.TXT, ADDFIELDS.UPDATEPROCESSOR.JS, SCHEMA-BM25.XML, STOP-1.TXT, SOLRCONFIG-ENABLEPLUGIN.XML, MISSING.FUNCTIONS.UPDATEPROCESSOR.JS, SCHEMA12.XML, SOLRCONFIG-TRANSFORMERS.XML, SCHEMA-COPYFIELD-TEST.XML, SOLRCONFIG-BASIC-LUCENEVERSION31.XML, BAD-SCHEMA-DUP-DYNAMICFIELD.XML, CURRENCY.XML, DA_UTF8.XML, MISSLEADING.EXTENSION.UPDATEPROCESSOR.JS.TXT, SOLRCONFIG-SOLR-749.XML, STOPWORDS.TXT, HUNSPELL-TEST.AFF, SOLRCONFIG_PERF.XML, SOLRCONFIG-SIMPLELOCK.XML, FRENCHARTICLES.TXT, SOLRCONFIG-LAZYWRITER.XML, SCHEMA-REPLICATION2.XML, SOLRCONFIG-XINCLUDE.XML, SCHEMA-SPELLCHECKER.XML, XSLT, SOLRCONFIG-DELPOLICY2.XML, TRIVIAL.UPDATEPROCESSOR0.JS, KEEP-1.TXT, SCHEMA-TRIE.XML, SCHEMA-BINARYFIELD.XML, SCHEMA-COLLATEFILTER.XML, BAD-SCHEMA-OMIT-TF-BUT-NOT-POS.XML, SCHEMA-MINIMAL.XML, STOPTYPES-2.TXT, STEMDICT.TXT, SCHEMA_CODEC.XML, ELEVATE.XML, SCHEMA-COLLATE.XML, PROTWORDS.TXT, SOLRCONFIG-REQHANDLER.INCL, SCHEMA-PHRASESUGGEST.XML, SCHEMA-DFR.XML, BAD-SCHEMA-ANALYZER-CLASS-AND-NESTED.XML, SOLRCONFIG-MASTER1.XML, SOLRCONFIG-FUNCTIONQUERY.XML, SOLRCONFIG-MASTER3.XML, SOLRCONFIG-UPDATE-PROCESSOR-CHAINS.XML, SOLRCONFIG-ALTDIRECTORY.XML, BAD-SCHEMA-SIM-GLOBAL-VS-FT-MISMATCH.XML, SOLRCONFIG-QUERYSENDER-NOQUERY.XML, BAD-SOLRCONFIG-BOGUS-SCRIPTENGINE-NAME.XML]
[junit4:junit4]   2> 1001 T2116 oass.SolrIndexSearcher.<init> Opening Searcher@f21485b3 main
[junit4:junit4]   2> 1001 T2116 oass.SolrIndexSearcher.getIndexDir WARNING WARNING: Directory impl does not support setting indexDir: org.apache.lucene.store.MockDirectoryWrapper
[junit4:junit4]   2> 1002 T2116 oasu.CommitTracker.<init> Hard AutoCommit: disabled
[junit4:junit4]   2> 1003 T2116 oasu.CommitTracker.<init> Soft AutoCommit: disabled
[junit4:junit4]   2> 1003 T2116 oashc.SpellCheckComponent.inform Initializing spell checkers
[junit4:junit4]   2> 1007 T2116 oass.DirectSolrSpellChecker.init init: {name=direct,classname=DirectSolrSpellChecker,field=lowerfilt,minQueryLength=3}
[junit4:junit4]   2> 1022 T2116 oashc.HttpShardHandlerFactory.getParameter Setting socketTimeout to: 0
[junit4:junit4]   2> 1023 T2116 oashc.HttpShardHandlerFactory.getParameter Setting urlScheme to: http://
[junit4:junit4]   2> 1023 T2116 oashc.HttpShardHandlerFactory.getParameter Setting connTimeout to: 0
[junit4:junit4]   2> 1024 T2116 oashc.HttpShardHandlerFactory.getParameter Setting maxConnectionsPerHost to: 20
[junit4:junit4]   2> 1024 T2116 oashc.HttpShardHandlerFactory.getParameter Setting corePoolSize to: 0
[junit4:junit4]   2> 1025 T2116 oashc.HttpShardHandlerFactory.getParameter Setting maximumPoolSize to: 2147483647
[junit4:junit4]   2> 1025 T2116 oashc.HttpShardHandlerFactory.getParameter Setting maxThreadIdleTime to: 5
[junit4:junit4]   2> 1026 T2116 oashc.HttpShardHandlerFactory.getParameter Setting sizeOfQueue to: -1
[junit4:junit4]   2> 1026 T2116 oashc.HttpShardHandlerFactory.getParameter Setting fairnessPolicy to: false
[junit4:junit4]   2> 1027 T2116 oascsi.HttpClientUtil.createClient Creating new http client, config:maxConnectionsPerHost=20&maxConnections=10000&socketTimeout=0&connTimeout=0&retry=false
[junit4:junit4]   2> 1033 T2136 oasc.SolrCore.registerSearcher [collection1] Registered new searcher Searcher@f21485b3 main{StandardDirectoryReader(segments_1:1)}
[junit4:junit4]   2> 1038 T2116 oasc.CoreContainer.register registering core: collection1
[junit4:junit4]   2> 1039 T2116 oass.SolrDispatchFilter.init user.dir=/mnt/ssd/jenkins/workspace/Lucene-Solr-4.x-Linux/solr/build/solr-core/test/J1
[junit4:junit4]   2> 1040 T2116 oass.SolrDispatchFilter.init SolrDispatchFilter.init() done
[junit4:junit4]   2> 1041 T2116 oascsi.HttpClientUtil.createClient Creating new http client, config:maxConnections=128&maxConnectionsPerHost=32&followRedirects=false
[junit4:junit4]   2> ASYNC  NEW_CORE C128 name=collection1 org.apache.solr.core.SolrCore@4cb45089
[junit4:junit4]   2> 1049 T2119 C128 oasu.DirectUpdateHandler2.deleteAll [collection1] REMOVING ALL DOCUMENTS FROM INDEX
[junit4:junit4]   2> 1051 T2119 C128 oasc.SolrDeletionPolicy.onInit SolrDeletionPolicy.onInit: commits:num=1
[junit4:junit4]   2> 		commit{dir=MockDirWrapper(org.apache.lucene.store.SimpleFSDirectory@/mnt/ssd/jenkins/workspace/Lucene-Solr-4.x-Linux/solr/build/solr-core/test/J1/index3561135616tmp lockFactory=org.apache.lucene.store.NativeFSLockFactory@62b360d8),segFN=segments_1,generation=1,filenames=[segments_1]
[junit4:junit4]   2> 1051 T2119 C128 oasc.SolrDeletionPolicy.updateCommits newest commit = 1
[junit4:junit4]   2> 1052 T2119 C128 UPDATE [collection1] webapp=/solr path=/update params={version=2&wt=javabin} {deleteByQuery=*:*} 0 3
[junit4:junit4]   2> ASYNC  NEW_CORE C129 name=collection1 org.apache.solr.core.SolrCore@9c70cd38
[junit4:junit4]   2> 1056 T2129 C129 oasu.DirectUpdateHandler2.deleteAll [collection1] REMOVING ALL DOCUMENTS FROM INDEX
[junit4:junit4]   2> 1057 T2129 C129 oasc.SolrDeletionPolicy.onInit SolrDeletionPolicy.onInit: commits:num=1
[junit4:junit4]   2> 		commit{dir=MockDirWrapper(org.apache.lucene.store.RAMDirectory@77d60fd2 lockFactory=org.apache.lucene.store.NativeFSLockFactory@691329d5),segFN=segments_1,generation=1,filenames=[segments_1]
[junit4:junit4]   2> 1058 T2129 C129 oasc.SolrDeletionPolicy.updateCommits newest commit = 1
[junit4:junit4]   2> 1058 T2129 C129 UPDATE [collection1] webapp=/solr path=/update params={version=2&wt=javabin} {deleteByQuery=*:*} 0 2
[junit4:junit4]   2> 1060 T2119 C128 oasu.DirectUpdateHandler2.commit start commit{flags=0,_version_=0,optimize=false,openSearcher=true,waitSearcher=true,expungeDeletes=false,softCommit=false}
[junit4:junit4]   2> 1061 T2119 C128 oasc.SolrDeletionPolicy.onCommit SolrDeletionPolicy.onCommit: commits:num=2
[junit4:junit4]   2> 		commit{dir=MockDirWrapper(org.apache.lucene.store.SimpleFSDirectory@/mnt/ssd/jenkins/workspace/Lucene-Solr-4.x-Linux/solr/build/solr-core/test/J1/index3561135616tmp lockFactory=org.apache.lucene.store.NativeFSLockFactory@62b360d8),segFN=segments_1,generation=1,filenames=[segments_1]
[junit4:junit4]   2> 		commit{dir=MockDirWrapper(org.apache.lucene.store.SimpleFSDirectory@/mnt/ssd/jenkins/workspace/Lucene-Solr-4.x-Linux/solr/build/solr-core/test/J1/index3561135616tmp lockFactory=org.apache.lucene.store.NativeFSLockFactory@62b360d8),segFN=segments_2,generation=2,filenames=[segments_2]
[junit4:junit4]   2> 1062 T2119 C128 oasc.SolrDeletionPolicy.updateCommits newest commit = 2
[junit4:junit4]   2> 1063 T2119 C128 oass.SolrIndexSearcher.<init> Opening Searcher@e995be26 main
[junit4:junit4]   2> 1064 T2119 C128 oass.SolrIndexSearcher.getIndexDir WARNING WARNING: Directory impl does not support setting indexDir: org.apache.lucene.store.MockDirectoryWrapper
[junit4:junit4]   2> 1064 T2119 C128 oasu.DirectUpdateHandler2.commit end_commit_flush
[junit4:junit4]   2> 1065 T2126 oasc.SolrCore.registerSearcher [collection1] Registered new searcher Searcher@e995be26 main{StandardDirectoryReader(segments_2:2)}
[junit4:junit4]   2> 1066 T2119 C128 UPDATE [collection1] webapp=/solr path=/update params={version=2&softCommit=false&waitSearcher=true&wt=javabin&commit=true} {commit=} 0 6
[junit4:junit4]   2> 1068 T2129 C129 oasu.DirectUpdateHandler2.commit start commit{flags=0,_version_=0,optimize=false,openSearcher=true,waitSearcher=true,expungeDeletes=false,softCommit=false}
[junit4:junit4]   2> 1068 T2129 C129 oasc.SolrDeletionPolicy.onCommit SolrDeletionPolicy.onCommit: commits:num=2
[junit4:junit4]   2> 		commit{dir=MockDirWrapper(org.apache.lucene.store.RAMDirectory@77d60fd2 lockFactory=org.apache.lucene.store.NativeFSLockFactory@691329d5),segFN=segments_1,generation=1,filenames=[segments_1]
[junit4:junit4]   2> 		commit{dir=MockDirWrapper(org.apache.lucene.store.RAMDirectory@77d60fd2 lockFactory=org.apache.lucene.store.NativeFSLockFactory@691329d5),segFN=segments_2,generation=2,filenames=[segments_2]
[junit4:junit4]   2> 1069 T2129 C129 oasc.SolrDeletionPolicy.updateCommits newest commit = 2
[junit4:junit4]   2> 1069 T2129 C129 oass.SolrIndexSearcher.<init> Opening Searcher@81dc1742 main
[junit4:junit4]   2> 1070 T2129 C129 oass.SolrIndexSearcher.getIndexDir WARNING WARNING: Directory impl does not support setting indexDir: org.apache.lucene.store.MockDirectoryWrapper
[junit4:junit4]   2> 1070 T2129 C129 oasu.DirectUpdateHandler2.commit end_commit_flush
[junit4:junit4]   2> 1071 T2136 oasc.SolrCore.registerSearcher [collection1] Registered new searcher Searcher@81dc1742 main{StandardDirectoryReader(segments_2:2)}
[junit4:junit4]   2> 1072 T2129 C129 UPDATE [collection1] webapp=/solr path=/update params={version=2&softCommit=false&waitSearcher=true&wt=javabin&commit=true} {commit=} 0 4
[junit4:junit4]   2> 1076 T2119 C128 REQ [collection1] webapp=/solr path=/select params={q=*:*&distrib=false&fl=id,a_si&version=2&rows=100&group.field=a_si&group.limit=10&wt=javabin&sort=a_si+asc,+id+asc&group=true} hits=0 status=0 QTime=2 
[junit4:junit4]   2> 1083 T2130 C129 REQ [collection1] webapp=/solr path=/select params={start=0&distrib=false&fl=id&group.field=a_si&group.limit=10&q=*:*&isShard=true&NOW=1347362588818&group.distributed.first=true&version=2&rows=100&wt=javabin&sort=a_si+asc,+id+asc&shard.url=localhost:44277/solr&group=true} status=0 QTime=3 
[junit4:junit4]   2> 1088 T2129 C129 REQ [collection1] webapp=/solr path=/select params={q=*:*&shards=localhost:44277/solr&fl=id,a_si&version=2&rows=100&group.field=a_si&group.limit=10&wt=javabin&sort=a_si+asc,+id+asc&group=true} status=0 QTime=10 
[junit4:junit4]   2> 1091 T2119 C128 REQ [collection1] webapp=/solr path=/select params={hl=true&distrib=false&fl=id,a_si&group.field=a_si&group.limit=10&hl.fl=a_t&q=*:*&version=2&rows=100&wt=javabin&sort=a_si+asc,+id+asc&group=true} hits=0 status=0 QTime=1 
[junit4:junit4]   2> 1094 T2130 C129 REQ [collection1] webapp=/solr path=/select params={start=0&hl=false&distrib=false&fl=id&group.field=a_si&group.limit=10&hl.fl=a_t&q=*:*&isShard=true&group.distributed.first=true&NOW=1347362588833&version=2&rows=100&wt=javabin&sort=a_si+asc,+id+asc&group=true&shard.url=localhost:44277/solr} status=0 QTime=0 
[junit4:junit4]   2> 1095 T2129 C129 REQ [collection1] webapp=/solr path=/select params={hl=true&fl=id,a_si&group.field=a_si&group.limit=10&hl.fl=a_t&q=*:*&shards=localhost:44277/solr&version=2&rows=100&wt=javabin&sort=a_si+asc,+id+asc&group=true} status=0 QTime=2 
[junit4:junit4]   2> 1097 T2119 C128 oasr.UnInvertedField.<init> UnInverted multi-valued field {field=a_t,memSize=4288,tindexSize=0,time=0,phase1=0,nTerms=0,bigTerms=0,termInstances=0,uses=0}
[junit4:junit4]   2> 1098 T2119 C128 REQ [collection1] webapp=/solr path=/select params={facet.field=a_t&distrib=false&fl=id,a_si&group.field=a_si&group.limit=10&q=*:*&facet=true&version=2&rows=100&wt=javabin&sort=a_si+asc,+id+asc&group=true} hits=0 status=0 QTime=1 
[junit4:junit4]   2> 1101 T2130 C129 REQ [collection1] webapp=/solr path=/select params={start=0&facet.field=a_t&distrib=false&fl=id&group.field=a_si&group.limit=10&q=*:*&isShard=true&group.distributed.first=true&NOW=1347362588839&facet=false&version=2&rows=100&wt=javabin&sort=a_si+asc,+id+asc&group=true&shard.url=localhost:44277/solr|[::1]:33332/solr} status=0 QTime=0 
[junit4:junit4]   2> 1105 T2130 C129 oasr.UnInvertedField.<init> UnInverted multi-valued field {field=a_t,memSize=4288,tindexSize=0,time=0,phase1=0,nTerms=0,bigTerms=0,termInstances=0,uses=0}
[junit4:junit4]   2> 1105 T2130 C129 REQ [collection1] webapp=/solr path=/select params={start=0&facet.field=a_t&f.a_t.facet.limit=160&distrib=false&fl=id&group.field=a_si&group.limit=10&group.distributed.second=true&q=*:*&isShard=true&NOW=1347362588839&facet=true&version=2&rows=100&wt=javabin&sort=a_si+asc,+id+asc&group=true&shard.url=localhost:44277/solr|[::1]:33332/solr} status=0 QTime=2 
[junit4:junit4]   2> 1107 T2129 C129 REQ [collection1] webapp=/solr path=/select params={facet.field=a_t&fl=id,a_si&group.field=a_si&group.limit=10&q=*:*&shards=localhost:44277/solr|[::1]:33332/solr&facet=true&version=2&rows=100&wt=javabin&sort=a_si+asc,+id+asc&group=true} status=0 QTime=8 
[junit4:junit4]   2> 1109 T2119 C128 REQ [collection1] webapp=/solr path=/select params={distrib=false&fl=id,a_si&group.field=a_si&stats.field=a_si&group.limit=10&q=*:*&version=2&rows=100&wt=javabin&sort=a_si+asc,+id+asc&group=true&stats=true} hits=0 status=0 QTime=0 
[junit4:junit4]   2> 1113 T2130 C129 REQ [collection1] webapp=/solr path=/select params={start=0&distrib=false&fl=id&group.field=a_si&stats.field=a_si&group.limit=10&q=*:*&isShard=true&group.distributed.first=true&NOW=1347362588851&version=2&rows=100&wt=javabin&sort=a_si+asc,+id+asc&group=true&stats=false&shard.url=[::1]:33332/solr|localhost:44277/solr} status=0 QTime=0 
[junit4:junit4]   2> 1115 T2130 C129 REQ [collection1] webapp=/solr path=/select params={start=0&distrib=false&fl=id&group.field=a_si&stats.field=a_si&group.limit=10&group.distributed.second=true&q=*:*&isShard=true&NOW=1347362588851&version=2&rows=100&wt=javabin&sort=a_si+asc,+id+asc&group=true&stats=true&shard.url=[::1]:33332/solr|localhost:44277/solr} status=0 QTime=0 
[junit4:junit4]   2> 1115 T2129 C129 REQ [collection1] webapp=/solr path=/select params={fl=id,a_si&group.field=a_si&stats.field=a_si&group.limit=10&q=*:*&shards=[::1]:33332/solr|localhost:44277/solr&version=2&rows=100&wt=javabin&sort=a_si+asc,+id+asc&group=true&stats=true} status=0 QTime=4 
[junit4:junit4]   2> 1133 T2119 C128 REQ [collection1] webapp=/solr path=/select params={spellcheck.build=true&spellcheck=true&qt=spellCheckCompRH&distrib=false&fl=id,a_si&group.field=a_si&group.limit=10&q=kings&version=2&rows=100&wt=javabin&sort=a_si+asc,+id+asc&group=true} hits=0 status=0 QTime=16 
[junit4:junit4]   2> 1154 T2130 C129 REQ [collection1] webapp=/solr path=/select params={spellcheck.build=true&spellcheck=false&spellcheck.count=1&start=0&distrib=false&fl=id&spellcheck.onlyMorePopular=false&group.field=a_si&group.limit=10&spellcheck.extendedResults=false&q=kings&isShard=true&group.distributed.first=true&NOW=1347362588876&version=2&rows=100&wt=javabin&sort=a_si+asc,+id+asc&group=true&shard.url=localhost:44277/solr} status=0 QTime=0 
[junit4:junit4]   2> 1155 T2129 C129 oashc.SpellCheckComponent.finishStage localhost:44277/solr null
[junit4:junit4]   2> 1155 T2129 C129 REQ [collection1] webapp=/solr path=/select params={spellcheck.build=true&spellcheck=true&qt=spellCheckCompRH&fl=id,a_si&group.field=a_si&group.limit=10&q=kings&shards=localhost:44277/solr&version=2&rows=100&wt=javabin&sort=a_si+asc,+id+asc&group=true} status=0 QTime=19 
[junit4:junit4]   2> 1159 T2119 C128 REQ [collection1] webapp=/solr path=/select params={facet.field=a_t&distrib=false&fl=id,a_si&fq=a_s:a&group.field=a_si&group.limit=10&q=*:*&group.truncate=true&facet=true&version=2&rows=100&wt=javabin&sort=a_si+asc,+id+asc&group=true} hits=0 status=0 QTime=2 
[junit4:junit4]   2> 1162 T2130 C129 REQ [collection1] webapp=/solr path=/select params={start=0&facet.field=a_t&distrib=false&fl=id&fq=a_s:a&group.field=a_si&group.limit=10&q=*:*&isShard=true&group.truncate=true&group.distributed.first=true&NOW=1347362588901&facet=false&version=2&rows=100&wt=javabin&sort=a_si+asc,+id+asc&group=true&shard.url=localhost:44277/solr} status=0 QTime=0 
[junit4:junit4]   2> 1167 T2130 C129 REQ [collection1] webapp=/solr path=/select params={start=0&facet.field=a_t&f.a_t.facet.limit=160&distrib=false&fl=id&fq=a_s:a&group.field=a_si&group.limit=10&group.distributed.second=true&q=*:*&isShard=true&group.truncate=true&NOW=1347362588901&facet=true&version=2&rows=100&wt=javabin&sort=a_si+asc,+id+asc&group=true&shard.url=localhost:44277/solr} status=0 QTime=3 
[junit4:junit4]   2> 1168 T2129 C129 REQ [collection1] webapp=/solr path=/select params={facet.field=a_t&fl=id,a_si&fq=a_s:a&group.field=a_si&group.limit=10&q=*:*&group.truncate=true&shards=localhost:44277/solr&facet=true&version=2&rows=100&wt=javabin&sort=a_si+asc,+id+asc&group=true} status=0 QTime=7 
[junit4:junit4]   2> 1172 T2119 C128 UPDATE [collection1] webapp=/solr path=/update params={version=2&wt=javabin} {add=[1]} 0 2
[junit4:junit4]   2> 1175 T2129 C129 UPDATE [collection1] webapp=/solr path=/update params={version=2&wt=javabin} {add=[1]} 0 1
[junit4:junit4]   2> 1178 T2119 C128 UPDATE [collection1] webapp=/solr path=/update params={version=2&wt=javabin} {add=[2]} 0 1
[junit4:junit4]   2> 1181 T2129 C129 UPDATE [collection1] webapp=/solr path=/update params={version=2&wt=javabin} {add=[2]} 0 1
[junit4:junit4]   2> 1183 T2119 C128 UPDATE [collection1] webapp=/solr path=/update params={version=2&wt=javabin} {add=[3]} 0 1
[junit4:junit4]   2> 1186 T2129 C129 UPDATE [collection1] webapp=/solr path=/update params={version=2&wt=javabin} {add=[3]} 0 1
[junit4:junit4]   2> 1188 T2119 C128 UPDATE [collection1] webapp=/solr path=/update params={version=2&wt=javabin} {add=[4]} 0 0
[junit4:junit4]   2> 1191 T2129 C129 UPDATE [collection1] webapp=/solr path=/update params={version=2&wt=javabin} {add=[4]} 0 1
[junit4:junit4]   2> 1193 T2119 C128 UPDATE [collection1] webapp=/solr path=/update params={version=2&wt=javabin} {add=[5]} 0 0
[junit4:junit4]   2> 1196 T2129 C129 UPDATE [collection1] webapp=/solr path=/update params={version=2&wt=javabin} {add=[5]} 0 1
[junit4:junit4]   2> 1198 T2119 C128 UPDATE [collection1] webapp=/solr path=/update params={version=2&wt=javabin} {add=[6]} 0 0
[junit4:junit4]   2> 1201 T2129 C129 UPDATE [collection1] webapp=/solr path=/update params={version=2&wt=javabin} {add=[6]} 0 1
[junit4:junit4]   2> 1203 T2119 C128 UPDATE [collection1] webapp=/solr path=/update params={version=2&wt=javabin} {add=[7]} 0 1
[junit4:junit4]   2> 1205 T2129 C129 UPDATE [collection1] webapp=/solr path=/update params={version=2&wt=javabin} {add=[7]} 0 0
[junit4:junit4]   2> 1208 T2119 C128 UPDATE [collection1] webapp=/solr path=/update params={version=2&wt=javabin} {add=[8]} 0 1
[junit4:junit4]   2> 1211 T2129 C129 UPDATE [collection1] webapp=/solr path=/update params={version=2&wt=javabin} {add=[8]} 0 1
[junit4:junit4]   2> 1213 T2119 C128 UPDATE [collection1] webapp=/solr path=/update params={version=2&wt=javabin} {add=[9]} 0 1
[junit4:junit4]   2> 1215 T2129 C129 UPDATE [collection1] webapp=/solr path=/update params={version=2&wt=javabin} {add=[9]} 0 0
[junit4:junit4]   2> 1221 T2119 C128 UPDATE [collection1] webapp=/solr path=/update params={version=2&wt=javabin} {add=[10]} 0 4
[junit4:junit4]   2> 1225 T2129 C129 UPDATE [collection1] webapp=/solr path=/update params={version=2&wt=javabin} {add=[10]} 0 2
[junit4:junit4]   2> 1228 T2119 C128 UPDATE [collection1] webapp=/solr path=/update params={version=2&wt=javabin} {add=[11]} 0 1
[junit4:junit4]   2> 1230 T2129 C129 UPDATE [collection1] webapp=/solr path=/update params={version=2&wt=javabin} {add=[11]} 0 0
[junit4:junit4]   2> 1233 T2119 C128 UPDATE [collection1] webapp=/solr path=/update params={version=2&wt=javabin} {add=[12]} 0 1
[junit4:junit4]   2> 1235 T2129 C129 UPDATE [collection1] webapp=/solr path=/update params={version=2&wt=javabin} {add=[12]} 0 1
[junit4:junit4]   2> 1237 T2119 C128 UPDATE [collection1] webapp=/solr path=/update params={version=2&wt=javabin} {add=[14]} 0 0
[junit4:junit4]   2> 1240 T2129 C129 UPDATE [collection1] webapp=/solr path=/update params={version=2&wt=javabin} {add=[14]} 0 1
[junit4:junit4]   2> 1242 T2119 C128 UPDATE [collection1] webapp=/solr path=/update params={version=2&wt=javabin} {add=[15]} 0 1
[junit4:junit4]   2> 1245 T2129 C129 UPDATE [collection1] webapp=/solr path=/update params={version=2&wt=javabin} {add=[15]} 0 1
[junit4:junit4]   2> 1247 T2119 C128 UPDATE [collection1] webapp=/solr path=/update params={version=2&wt=javabin} {add=[16]} 0 0
[junit4:junit4]   2> 1250 T2129 C129 UPDATE [collection1] webapp=/solr path=/update params={version=2&wt=javabin} {add=[16]} 0 1
[junit4:junit4]   2> 1253 T2119 C128 UPDATE [collection1] webapp=/solr path=/update params={version=2&wt=javabin} {add=[17]} 0 1
[junit4:junit4]   2> 1257 T2129 C129 UPDATE [collection1] webapp=/solr path=/update params={version=2&wt=javabin} {add=[17]} 0 2
[junit4:junit4]   2> 1259 T2119 C128 UPDATE [collection1] webapp=/solr path=/update params={version=2&wt=javabin} {add=[18]} 0 0
[junit4:junit4]   2> 1262 T2129 C129 UPDATE [collection1] webapp=/solr path=/update params={version=2&wt=javabin} {add=[18]} 0 1
[junit4:junit4]   2> 1264 T2119 C128 UPDATE [collection1] webapp=/solr path=/update params={version=2&wt=javabin} {add=[19]} 0 0
[junit4:junit4]   2> 1266 T2129 C129 UPDATE [collection1] webapp=/solr path=/update params={version=2&wt=javabin} {add=[19]} 0 0
[junit4:junit4]   2> 1269 T2119 C128 UPDATE [collection1] webapp=/solr path=/update params={version=2&wt=javabin} {add=[20]} 0 1
[junit4:junit4]   2> 1271 T2129 C129 UPDATE [collection1] webapp=/solr path=/update params={version=2&wt=javabin} {add=[20]} 0 1
[junit4:junit4]   2> 1279 T2119 C128 UPDATE [collection1] webapp=/solr path=/update params={version=2&wt=javabin} {add=[21]} 0 6
[junit4:junit4]   2> 1284 T2129 C129 UPDATE [collection1] webapp=/solr path=/update params={version=2&wt=javabin} {add=[21]} 0 2
[junit4:junit4]   2> 1287 T2119 C128 UPDATE [collection1] webapp=/solr path=/update params={version=2&wt=javabin} {add=[22]} 0 2
[junit4:junit4]   2> 1289 T2129 C129 UPDATE [collection1] webapp=/solr path=/update params={version=2&wt=javabin} {add=[22]} 0 0
[junit4:junit4]   2> 1292 T2119 C128 UPDATE [collection1] webapp=/solr path=/update params={version=2&wt=javabin} {add=[23]} 0 1
[junit4:junit4]   2> 1294 T2129 C129 UPDATE [collection1] webapp=/solr path=/update params={version=2&wt=javabin} {add=[23]} 0 0
[junit4:junit4]   2> 1297 T2119 C128 UPDATE [collection1] webapp=/solr path=/update params={version=2&wt=javabin} {add=[100]} 0 1
[junit4:junit4]   2> 1299 T2129 C129 UPDATE [collection1] webapp=/solr path=/update params={version=2&wt=javabin} {add=[100]} 0 1
[junit4:junit4]   2> 1301 T2119 C128 UPDATE [collection1] webapp=/solr path=/update params={version=2&wt=javabin} {add=[101]} 0 0
[junit4:junit4]   2> 1303 T2129 C129 UPDATE [collection1] webapp=/solr path=/update params={version=2&wt=javabin} {add=[101]} 0 0
[junit4:junit4]   2> 1306 T2119 C128 UPDATE [collection1] webapp=/solr path=/update params={version=2&wt=javabin} {add=[102]} 0 1
[junit4:junit4]   2> 1308 T2129 C129 UPDATE [collection1] webapp=/solr path=/update params={version=2&wt=javabin} {add=[102]} 0 1
[junit4:junit4]   2> 1310 T2119 C128 UPDATE [collection1] webapp=/solr path=/update params={version=2&wt=javabin} {add=[103]} 0 0
[junit4:junit4]   2> 1313 T2129 C129 UPDATE [collection1] webapp=/solr path=/update params={version=2&wt=javabin} {add=[103]} 0 1
[junit4:junit4]   2> 1315 T2119 C128 UPDATE [collection1] webapp=/solr path=/update params={version=2&wt=javabin} {add=[104]} 0 1
[junit4:junit4]   2> 1317 T2129 C129 UPDATE [collection1] webapp=/solr path=/update params={version=2&wt=javabin} {add=[104]} 0 0
[junit4:junit4]   2> 1319 T2119 C128 UPDATE [collection1] webapp=/solr path=/update params={version=2&wt=javabin} {add=[105]} 0 0
[junit4:junit4]   2> 1322 T2129 C129 UPDATE [collection1] webapp=/solr path=/update params={version=2&wt=javabin} {add=[105]} 0 1
[junit4:junit4]   2> 1324 T2119 C128 UPDATE [collection1] webapp=/solr path=/update params={version=2&wt=javabin} {add=[106]} 0 1
[junit4:junit4]   2> 1326 T2129 C129 UPDATE [collection1] webapp=/solr path=/update params={version=2&wt=javabin} {add=[106]} 0 0
[junit4:junit4]   2> 1331 T2119 C128 UPDATE [collection1] webapp=/solr path=/update params={version=2&wt=javabin} {add=[107]} 0 3
[junit4:junit4]   2> 1335 T2129 C129 UPDATE [collection1] webapp=/solr path=/update params={version=2&wt=javabin} {add=[107]} 0 2
[junit4:junit4]   2> 1338 T2119 C128 UPDATE [collection1] webapp=/solr path=/update params={version=2&wt=javabin} {add=[108]} 0 1
[junit4:junit4]   2> 1340 T2129 C129 UPDATE [collection1] webapp=/solr path=/update params={version=2&wt=javabin} {add=[108]} 0 1
[junit4:junit4]   2> 1342 T2119 C128 UPDATE [collection1] webapp=/solr path=/update params={version=2&wt=javabin} {add=[109]} 0 0
[junit4:junit4]   2> 1344 T2129 C129 UPDATE [collection1] webapp=/solr path=/update params={version=2&wt=javabin} {add=[109]} 0 0
[junit4:junit4]   2> 1347 T2119 C128 UPDATE [collection1] webapp=/solr path=/update params={version=2&wt=javabin} {add=[110]} 0 1
[junit4:junit4]   2> 1349 T2129 C129 UPDATE [collection1] webapp=/solr path=/update params={version=2&wt=javabin} {add=[110]} 0 1
[junit4:junit4]   2> 1351 T2119 C128 UPDATE [collection1] webapp=/solr path=/update params={version=2&wt=javabin} {add=[111]} 0 0
[junit4:junit4]   2> 1353 T2129 C129 UPDATE [collection1] webapp=/solr path=/update params={version=2&wt=javabin} {add=[111]} 0 0
[junit4:junit4]   2> 1355 T2119 C128 UPDATE [collection1] webapp=/solr path=/update params={version=2&wt=javabin} {add=[112]} 0 0
[junit4:junit4]   2> 1358 T2129 C129 UPDATE [collection1] webapp=/solr path=/update params={version=2&wt=javabin} {add=[112]} 0 1
[junit4:junit4]   2> 1360 T2119 C128 UPDATE [collection1] webapp=/solr path=/update params={version=2&wt=javabin} {add=[113]} 0 0
[junit4:junit4]   2> 1362 T2129 C129 UPDATE [collection1] webapp=/solr path=/update params={version=2&wt=javabin} {add=[113]} 0 0
[junit4:junit4]   2> 1365 T2119 C128 UPDATE [collection1] webapp=/solr path=/update params={version=2&wt=javabin} {add=[114]} 0 1
[junit4:junit4]   2> 1367 T2129 C129 UPDATE [collection1] webapp=/solr path=/update params={version=2&wt=javabin} {add=[114]} 0 0
[junit4:junit4]   2> 1369 T2119 C128 UPDATE [collection1] webapp=/solr path=/update params={version=2&wt=javabin} {add=[115]} 0 0
[junit4:junit4]   2> 1372 T2129 C129 UPDATE [collection1] webapp=/solr path=/update params={version=2&wt=javabin} {add=[115]} 0 1
[junit4:junit4]   2> 1374 T2119 C128 UPDATE [collection1] webapp=/solr path=/update params={version=2&wt=javabin} {add=[116]} 0 1
[junit4:junit4]   2> 1376 T2129 C129 UPDATE [collection1] webapp=/solr path=/update params={version=2&wt=javabin} {add=[116]} 0 1
[junit4:junit4]   2> 1381 T2119 C128 UPDATE [collection1] webapp=/solr path=/update params={version=2&wt=javabin} {add=[117]} 0 3
[junit4:junit4]   2> 1384 T2129 C129 UPDATE [collection1] webapp=/solr path=/update params={version=2&wt=javabin} {add=[117]} 0 1
[junit4:junit4]   2> 1387 T2119 C128 UPDATE [collection1] webapp=/solr path=/update params={version=2&wt=javabin} {add=[118]} 0 1
[junit4:junit4]   2> 1390 T2129 C129 UPDATE [collection1] webapp=/solr path=/update params={version=2&wt=javabin} {add=[118]} 0 1
[junit4:junit4]   2> 1392 T2119 C128 UPDATE [collection1] webapp=/solr path=/update params={version=2&wt=javabin} {add=[119]} 0 0
[junit4:junit4]   2> 1394 T2129 C129 UPDATE [collection1] webapp=/solr path=/update params={version=2&wt=javabin} {add=[119]} 0 0
[junit4:junit4]   2> 1397 T2119 C128 UPDATE [collection1] webapp=/solr path=/update params={version=2&wt=javabin} {add=[120]} 0 1
[junit4:junit4]   2> 1399 T2129 C129 UPDATE [collection1] webapp=/solr path=/update params={version=2&wt=javabin} {add=[120]} 0 1
[junit4:junit4]   2> 1401 T2119 C128 UPDATE [collection1] webapp=/solr path=/update params={version=2&wt=javabin} {add=[121]} 0 0
[junit4:junit4]   2> 1403 T2129 C129 UPDATE [collection1] webapp=/solr path=/update params={version=2&wt=javabin} {add=[121]} 0 0
[junit4:junit4]   2> 1406 T2119 C128 UPDATE [collection1] webapp=/solr path=/update params={version=2&wt=javabin} {add=[122]} 0 1
[junit4:junit4]   2> 1408 T2129 C129 UPDATE [collection1] webapp=/solr path=/update params={version=2&wt=javabin} {add=[122]} 0 1
[junit4:junit4]   2> 1410 T2119 C128 UPDATE [collection1] webapp=/solr path=/update params={version=2&wt=javabin} {add=[123]} 0 0
[junit4:junit4]   2> 1412 T2129 C129 UPDATE [collection1] webapp=/solr path=/update params={version=2&wt=javabin} {add=[123]} 0 0
[junit4:junit4]   2> 1415 T2119 C128 UPDATE [collection1] webapp=/solr path=/update params={version=2&wt=javabin} {add=[124]} 0 1
[junit4:junit4]   2> 1417 T2129 C129 UPDATE [collection1] webapp=/solr path=/update params={version=2&wt=javabin} {add=[124]} 0 0
[junit4:junit4]   2> 1419 T2119 C128 UPDATE [collection1] webapp=/solr path=/update params={version=2&wt=javabin} {add=[125]} 0 0
[junit4:junit4]   2> 1422 T2129 C129 UPDATE [collection1] webapp=/solr path=/update params={version=2&wt=javabin} {add=[125]} 0 1
[junit4:junit4]   2> 1424 T2119 C128 UPDATE [collection1] webapp=/solr path=/update params={version=2&wt=javabin} {add=[126]} 0 1
[junit4:junit4]   2> 1426 T2129 C129 UPDATE [collection1] webapp=/solr path=/update params={version=2&wt=javabin} {add=[126]} 0 0
[junit4:junit4]   2> 1431 T2119 C128 UPDATE [collection1] webapp=/solr path=/update params={version=2&wt=javabin} {add=[127]} 0 3
[junit4:junit4]   2> 1435 T2129 C129 UPDATE [collection1] webapp=/solr path=/update params={version=2&wt=javabin} {add=[127]} 0 2
[junit4:junit4]   2> 1438 T2119 C128 UPDATE [collection1] webapp=/solr path=/update params={version=2&wt=javabin} {add=[128]} 0 1
[junit4:junit4]   2> 1440 T2129 C129 UPDATE [collection1] webapp=/solr path=/update params={version=2&wt=javabin} {add=[128]} 0 1
[junit4:junit4]   2> 1442 T2119 C128 UPDATE [collection1] webapp=/solr path=/update params={version=2&wt=javabin} {add=[129]} 0 0
[junit4:junit4]   2> 1444 T2129 C129 UPDATE [collection1] webapp=/solr path=/update params={version=2&wt=javabin} {add=[129]} 0 0
[junit4:junit4]   2> 1446 T2119 C128 UPDATE [collection1] webapp=/solr path=/update params={version=2&wt=javabin} {add=[130]} 0 0
[junit4:junit4]   2> 1448 T2129 C129 UPDATE [collection1] webapp=/solr path=/update params={version=2&wt=javabin} {add=[130]} 0 0
[junit4:junit4]   2> 1451 T2119 C128 UPDATE [collection1] webapp=/solr path=/update params={version=2&wt=javabin} {add=[131]} 0 1
[junit4:junit4]   2> 1453 T2129 C129 UPDATE [collection1] webapp=/solr path=/update params={version=2&wt=javabin} {add=[131]} 0 0
[junit4:junit4]   2> 1455 T2119 C128 UPDATE [collection1] webapp=/solr path=/update params={version=2&wt=javabin} {add=[132]} 0 0
[junit4:junit4]   2> 1457 T2129 C129 UPDATE [collection1] webapp=/solr path=/update params={version=2&wt=javabin} {add=[132]} 0 0
[junit4:junit4]   2> 1460 T2119 C128 UPDATE [collection1] webapp=/solr path=/update params={version=2&wt=javabin} {add=[133]} 0 1
[junit4:junit4]   2> 1462 T2129 C129 UPDATE [collection1] webapp=/solr path=/update params={version=2&wt=javabin} {add=[133]} 0 1
[junit4:junit4]   2> 1464 T2119 C128 UPDATE [collection1] webapp=/solr path=/update params={version=2&wt=javabin} {add=[134]} 0 0
[junit4:junit4]   2> 1466 T2129 C129 UPDATE [collection1] webapp=/solr path=/update params={version=2&wt=javabin} {add=[134]} 0 0
[junit4:junit4]   2> 1469 T2119 C128 UPDATE [collection1] webapp=/solr path=/update params={version=2&wt=javabin} {add=[135]} 0 1
[junit4:junit4]   2> 1471 T2129 C129 UPDATE [collection1] webapp=/solr path=/update params={version=2&wt=javabin} {add=[135]} 0 1
[junit4:junit4]   2> 1473 T2119 C128 UPDATE [collection1] webapp=/solr path=/update params={version=2&wt=javabin} {add=[136]} 0 0
[junit4:junit4]   2> 1475 T2129 C129 UPDATE [collection1] webapp=/solr path=/update params={version=2&wt=javabin} {add=[136]} 0 0
[junit4:junit4]   2> 1481 T2119 C128 UPDATE [collection1] webapp=/solr path=/update params={version=2&wt=javabin} {add=[137]} 0 4
[junit4:junit4]   2> 1484 T2129 C129 UPDATE [collection1] webapp=/solr path=/update params={version=2&wt=javabin} {add=[137]} 0 1
[junit4:junit4]   2> 1487 T2119 C128 UPDATE [collection1] webapp=/solr path=/update params={version=2&wt=javabin} {add=[138]} 0 1
[junit4:junit4]   2> 1489 T2129 C129 UPDATE [collection1] webapp=/solr path=/update params={version=2&wt=javabin} {add=[138]} 0 0
[junit4:junit4]   2> 1492 T2119 C128 UPDATE [collection1] webapp=/solr path=/update params={version=2&wt=javabin} {add=[139]} 0 1
[junit4:junit4]   2> 1494 T2129 C129 UPDATE [collection1] webapp=/solr path=/update params={version=2&wt=javabin} {add=[139]} 0 1
[junit4:junit4]   2> 1496 T2119 C128 UPDATE [collection1] webapp=/solr path=/update params={version=2&wt=javabin} {add=[140]} 0 1
[junit4:junit4]   2> 1498 T2129 C129 UPDATE [collection1] webapp=/solr path=/update params={version=2&wt=javabin} {add=[140]} 0 0
[junit4:junit4]   2> 1501 T2119 C128 UPDATE [collection1] webapp=/solr path=/update params={version=2&wt=javabin} {add=[141]} 0 1
[junit4:junit4]   2> 1503 T2129 C129 UPDATE [collection1] webapp=/solr path=/update params={version=2&wt=javabin} {add=[141]} 0 0
[junit4:junit4]   2> 1505 T2119 C128 UPDATE [collection1] webapp=/solr path=/update params={version=2&wt=javabin} {add=[142]} 0 0
[junit4:junit4]   2> 1507 T2129 C129 UPDATE [collection1] webapp=/solr path=/update params={version=2&wt=javabin} {add=[142]} 0 0
[junit4:junit4]   2> 1510 T2119 C128 UPDATE [collection1] webapp=/solr path=/update params={version=2&wt=javabin} {add=[143]} 0 1
[junit4:junit4]   2> 1512 T2129 C129 UPDATE [collection1] webapp=/solr path=/update params={version=2&wt=javabin} {add=[143]} 0 1
[junit4:junit4]   2> 1514 T2119 C128 UPDATE [collection1] webapp=/solr path=/update params={version=2&wt=javabin} {add=[144]} 0 0
[junit4:junit4]   2> 1516 T2129 C129 UPDATE [collection1] webapp=/solr path=/update params={version=2&wt=javabin} {add=[144]} 0 0
[junit4:junit4]   2> 1518 T2119 C128 UPDATE [collection1] webapp=/solr path=/update params={version=2&wt=javabin} {add=[145]} 0 0
[junit4:junit4]   2> 1520 T2129 C129 UPDATE [collection1] webapp=/solr path=/update params={version=2&wt=javabin} {add=[145]} 0 0
[junit4:junit4]   2> 1523 T2119 C128 UPDATE [collection1] webapp=/solr path=/update params={version=2&wt=javabin} {add=[146]} 0 1
[junit4:junit4]   2> 1525 T2129 C129 UPDATE [collection1] webapp=/solr path=/update params={version=2&wt=javabin} {add=[146]} 0 1
[junit4:junit4]   2> 1530 T2119 C128 UPDATE [collection1] webapp=/solr path=/update params={version=2&wt=javabin} {add=[147]} 0 3
[junit4:junit4]   2> 1534 T2129 C129 UPDATE [collection1] webapp=/solr path=/update params={version=2&wt=javabin} {add=[147]} 0 2
[junit4:junit4]   2> 1537 T2119 C128 UPDATE [collection1] webapp=/solr path=/update params={version=2&wt=javabin} {add=[148]} 0 1
[junit4:junit4]   2> 1539 T2129 C129 UPDATE [collection1] webapp=/solr path=/update params={version=2&wt=javabin} {add=[148]} 0 0
[junit4:junit4]   2> 1541 T2119 C128 UPDATE [collection1] webapp=/solr path=/update params={version=2&wt=javabin} {add=[149]} 0 0
[junit4:junit4]   2> 1543 T2129 C129 UPDATE [collection1] webapp=/solr path=/update params={version=2&wt=javabin} {add=[149]} 0 0
[junit4:junit4]   2> 1545 T2119 C128 UPDATE [collection1] webapp=/solr path=/update params={version=2&wt=javabin} {add=[500]} 0 0
[junit4:junit4]   2> 1547 T2129 C129 UPDATE [collection1] webapp=/solr path=/update params={version=2&wt=javabin} {add=[500]} 0 0
[junit4:junit4]   2> 1549 T2119 C128 UPDATE [collection1] webapp=/solr path=/update params={version=2&wt=javabin} {add=[501]} 0 0
[junit4:junit4]   2> 1551 T2129 C129 UPDATE [collection1] webapp=/solr path=/update params={version=2&wt=javabin} {add=[501]} 0 0
[junit4:junit4]   2> 1553 T2119 C128 UPDATE [collection1] webapp=/solr path=/update params={version=2&wt=javabin} {add=[502]} 0 0
[junit4:junit4]   2> 1555 T2129 C129 UPDATE [collection1] webapp=/solr path=/update params={version=2&wt=javabin} {add=[502]} 0 0
[junit4:junit4]   2> 1557 T2119 C128 UPDATE [collection1] webapp=/solr path=/update params={version=2&wt=javabin} {add=[503]} 0 0
[junit4:junit4]   2> 1559 T2129 C129 UPDATE [collection1] webapp=/solr path=/update params={version=2&wt=javabin} {add=[503]} 0 0
[junit4:junit4]   2> 1561 T2119 C128 UPDATE [collection1] webapp=/solr path=/update params={version=2&wt=javabin} {add=[504]} 0 0
[junit4:junit4]   2> 1563 T2129 C129 UPDATE [collection1] webapp=/solr path=/update params={version=2&wt=javabin} {add=[504]} 0 0
[junit4:junit4]   2> 1565 T2119 C128 UPDATE [collection1] webapp=/solr path=/update params={version=2&wt=javabin} {add=[505]} 0 1
[junit4:junit4]   2> 1567 T2129 C129 UPDATE [collection1] webapp=/solr path=/update params={version=2&wt=javabin} {add=[505]} 0 1
[junit4:junit4]   2> 1568 T2119 C128 UPDATE [collection1] webapp=/solr path=/update params={version=2&wt=javabin} {add=[506]} 0 0
[junit4:junit4]   2> 1570 T2129 C129 UPDATE [collection1] webapp=/solr path=/update params={version=2&wt=javabin} {add=[506]} 0 0
[junit4:junit4]   2> 1588 T2119 C128 UPDATE [collection1] webapp=/solr path=/update params={version=2&wt=javabin} {add=[507]} 0 16
[junit4:junit4]   2> 1595 T2129 C129 UPDATE [collection1] webapp=/solr path=/update params={version=2&wt=javabin} {add=[507]} 0 5
[junit4:junit4]   2> 1597 T2119 C128 UPDATE [collection1] webapp=/solr path=/update params={version=2&wt=javabin} {add=[508]} 0 0
[junit4:junit4]   2> 1600 T2129 C129 UPDATE [collection1] webapp=/solr path=/update params={version=2&wt=javabin} {add=[508]} 0 1
[junit4:junit4]   2> 1602 T2119 C128 UPDATE [collection1] webapp=/solr path=/update params={version=2&wt=javabin} {add=[509]} 0 1
[junit4:junit4]   2> 1604 T2129 C129 UPDATE [collection1] webapp=/solr path=/update params={version=2&wt=javabin} {add=[509]} 0 1
[junit4:junit4]   2> 1605 T2119 C128 UPDATE [collection1] webapp=/solr path=/update params={version=2&wt=javabin} {add=[510]} 0 0
[junit4:junit4]   2> 1607 T2129 C129 UPDATE [collection1] webapp=/solr path=/update params={version=2&wt=javabin} {add=[510]} 0 0
[junit4:junit4]   2> 1609 T2119 C128 UPDATE [collection1] webapp=/solr path=/update params={version=2&wt=javabin} {add=[511]} 0 0
[junit4:junit4]   2> 1611 T2129 C129 UPDATE [collection1] webapp=/solr path=/update params={version=2&wt=javabin} {add=[511]} 0 0
[junit4:junit4]   2> 1613 T2119 C128 UPDATE [collection1] webapp=/solr path=/update params={version=2&wt=javabin} {add=[512]} 0 0
[junit4:junit4]   2> 1615 T2129 C129 UPDATE [collection1] webapp=/solr path=/update params={version=2&wt=javabin} {add=[512]} 0 0
[junit4:junit4]   2> 1617 T2119 C128 UPDATE [collection1] webapp=/solr path=/update params={version=2&wt=javabin} {add=[513]} 0 0
[junit4:junit4]   2> 1619 T2129 C129 UPDATE [collection1] webapp=/solr path=/update params={version=2&wt=javabin} {add=[513]} 0 1
[junit4:junit4]   2> 1621 T2119 C128 UPDATE [collection1] webapp=/solr path=/update params={version=2&wt=javabin} {add=[514]} 0 1
[junit4:junit4]   2> 1623 T2129 C129 UPDATE [collection1] webapp=/solr path=/update params={version=2&wt=javabin} {add=[514]} 0 1
[junit4:junit4]   2> 1624 T2119 C128 UPDATE [collection1] webapp=/solr path=/update params={version=2&wt=javabin} {add=[515]} 0 0
[junit4:junit4]   2> 1626 T2129 C129 UPDATE [collection1] webapp=/solr path=/update params={version=2&wt=javabin} {add=[515]} 0 0
[junit4:junit4]   2> 1628 T2119 C128 UPDATE [collection1] webapp=/solr path=/update params={version=2&wt=javabin} {add=[516]} 0 0
[junit4:junit4]   2> 1630 T2129 C129 UPDATE [collection1] webapp=/solr path=/update params={version=2&wt=javabin} {add=[516]} 0 0
[junit4:junit4]   2> 1635 T2119 C128 UPDATE [collection1] webapp=/solr path=/update params={version=2&wt=javabin} {add=[517]} 0 3
[junit4:junit4]   2> 1637 T2129 C129 UPDATE [collection1] webapp=/solr path=/update params={version=2&wt=javabin} {add=[517]} 0 0
[junit4:junit4]   2> 1640 T2119 C128 UPDATE [collection1] webapp=/solr path=/update params={version=2&wt=javabin} {add=[518]} 0 1
[junit4:junit4]   2> 1642 T2129 C129 UPDATE [collection1] webapp=/solr path=/update params={version=2&wt=javabin} {add=[518]} 0 0
[junit4:junit4]   2> 1644 T2119 C128 UPDATE [collection1] webapp=/solr path=/update params={version=2&wt=javabin} {add=[519]} 0 0
[junit4:junit4]   2> 1646 T2129 C129 UPDATE [collection1] webapp=/solr path=/update params={version=2&wt=javabin} {add=[519]} 0 0
[junit4:junit4]   2> 1648 T2119 C128 UPDATE [collection1] webapp=/solr path=/update params={version=2&wt=javabin} {add=[520]} 0 0
[junit4:junit4]   2> 1650 T2129 C129 UPDATE [collection1] webapp=/solr path=/update params={version=2&wt=javabin} {add=[520]} 0 0
[junit4:junit4]   2> 1652 T2119 C128 UPDATE [collection1] webapp=/solr path=/update params={version=2&wt=javabin} {add=[521]} 0 0
[junit4:junit4]   2> 1654 T2129 C129 UPDATE [collection1] webapp=/solr path=/update params={version=2&wt=javabin} {add=[521]} 0 1
[junit4:junit4]   2> 1656 T2119 C128 UPDATE [collection1] webapp=/solr path=/update params={version=2&wt=javabin} {add=[522]} 0 1
[junit4:junit4]   2> 1657 T2129 C129 UPDATE [collection1] webapp=/solr path=/update params={version=2&wt=javabin} {add=[522]} 0 0
[junit4:junit4]   2> 1659 T2119 C128 UPDATE [collection1] webapp=/solr path=/update params={version=2&wt=javabin} {add=[523]} 0 0
[junit4:junit4]   2> 1661 T2129 C129 UPDATE [collection1] webapp=/solr path=/update params={version=2&wt=javabin} {add=[523]} 0 0
[junit4:junit4]   2> 1663 T2119 C128 UPDATE [collection1] webapp=/solr path=/update params={version=2&wt=javabin} {add=[524]} 0 0
[junit4:junit4]   2> 1665 T2129 C129 UPDATE [collection1] webapp=/solr path=/update params={version=2&wt=javabin} {add=[524]} 0 0
[junit4:junit4]   2> 1667 T2119 C128 UPDATE [collection1] webapp=/solr path=/update params={version=2&wt=javabin} {add=[525]} 0 0
[junit4:junit4]   2> 1669 T2129 C129 UPDATE [collection1] webapp=/solr path=/update params={version=2&wt=javabin} {add=[525]} 0 1
[junit4:junit4]   2> 1671 T2119 C128 UPDATE [collection1] webapp=/solr path=/update params={version=2&wt=javabin} {add=[526]} 0 1
[junit4:junit4]   2> 1672 T2129 C129 UPDATE [collection1] webapp=/solr path=/update params={version=2&wt=javabin} {add=[526]} 0 0
[junit4:junit4]   2> 1677 T2119 C128 UPDATE [collection1] webapp=/solr path=/update params={version=2&wt=javabin} {add=[527]} 0 3
[junit4:junit4]   2> 1680 T2129 C129 UPDATE [collection1] webapp=/solr path=/update params={version=2&wt=javabin} {add=[527]} 0 1
[junit4:junit4]   2> 1682 T2119 C128 UPDATE [collection1] webapp=/solr path=/update params={version=2&wt=javabin} {add=[528]} 0 1
[junit4:junit4]   2> 1684 T2129 C129 UPDATE [collection1] webapp=/solr path=/update params={version=2&wt=javabin} {add=[528]} 0 0
[junit4:junit4]   2> 1686 T2119 C128 UPDATE [collection1] webapp=/solr path=/update params={version=2&wt=javabin} {add=[529]} 0 0
[junit4:junit4]   2> 1688 T2129 C129 UPDATE [collection1] webapp=/solr path=/update params={version=2&wt=javabin} {add=[529]} 0 0
[junit4:junit4]   2> 1690 T2119 C128 UPDATE [collection1] webapp=/solr path=/update params={version=2&wt=javabin} {add=[530]} 0 0
[junit4:junit4]   2> 1692 T2129 C129 UPDATE [collection1] webapp=/solr path=/update params={version=2&wt=javabin} {add=[530]} 0 0
[junit4:junit4]   2> 1694 T2119 C128 UPDATE [collection1] webapp=/solr path=/update params={version=2&wt=javabin} {add=[531]} 0 1
[junit4:junit4]   2> 1695 T2129 C129 UPDATE [collection1] webapp=/solr path=/update params={version=2&wt=javabin} {add=[531]} 0 0
[junit4:junit4]   2> 1697 T2119 C128 UPDATE [collection1] webapp=/solr path=/update params={version=2&wt=javabin} {add=[532]} 0 0
[junit4:junit4]   2> 1699 T2129 C129 UPDATE [collection1] webapp=/solr path=/update params={version=2&wt=javabin} {add=[532]} 0 0
[junit4:junit4]   2> 1701 T2119 C128 UPDATE [collection1] webapp=/solr path=/update params={version=2&wt=javabin} {add=[533]} 0 0
[junit4:junit4]   2> 1703 T2129 C129 UPDATE [collection1] webapp=/solr path=/update params={version=2&wt=javabin} {add=[533]} 0 0
[junit4:junit4]   2> 1705 T2119 C128 UPDATE [collection1] webapp=/solr path=/update params={version=2&wt=javabin} {add=[534]} 0 0
[junit4:junit4]   2> 1707 T2129 C129 UPDATE [collection1] webapp=/solr path=/update params={version=2&wt=javabin} {add=[534]} 0 1
[junit4:junit4]   2> 1709 T2119 C128 UPDATE [collection1] webapp=/solr path=/update params={version=2&wt=javabin} {add=[535]} 0 1
[junit4:junit4]   2> 1710 T2129 C129 UPDATE [collection1] webapp=/solr path=/update params={version=2&wt=javabin} {add=[535]} 0 0
[junit4:junit4]   2> 1712 T2119 C128 UPDATE [collection1] webapp=/solr path=/update params={version=2&wt=javabin} {add=[536]} 0 0
[junit4:junit4]   2> 1714 T2129 C129 UPDATE [collection1] webapp=/solr path=/update params={version=2&wt=javabin} {add=[536]} 0 0
[junit4:junit4]   2> 1719 T2119 C128 UPDATE [collection1] webapp=/solr path=/update params={version=2&wt=javabin} {add=[537]} 0 3
[junit4:junit4]   2> 1722 T2129 C129 UPDATE [collection1] webapp=/solr path=/update params={version=2&wt=javabin} {add=[537]} 0 1
[junit4:junit4]   2> 1724 T2119 C128 UPDATE [collection1] webapp=/solr path=/update params={version=2&wt=javabin} {add=[538]} 0 0
[junit4:junit4]   2> 1726 T2129 C129 UPDATE [collection1] webapp=/solr path=/update params={version=2&wt=javabin} {add=[538]} 0 0
[junit4:junit4]   2> 1728 T2119 C128 UPDATE [collection1] webapp=/solr path=/update params={version=2&wt=javabin} {add=[539]} 0 0
[junit4:junit4]   2> 1730 T2129 C129 UPDATE [collection1] webapp=/solr path=/update params={version=2&wt=javabin} {add=[539]} 0 0
[junit4:junit4]   2> 1732 T2119 C128 UPDATE [collection1] webapp=/solr path=/update params={version=2&wt=javabin} {add=[540]} 0 0
[junit4:junit4]   2> 1734 T2129 C129 UPDATE [collection1] webapp=/solr path=/update params={version=2&wt=javabin} {add=[540]} 0 0
[junit4:junit4]   2> 1736 T2119 C128 UPDATE [collection1] webapp=/solr path=/update params={version=2&wt=javabin} {add=[541]} 0 0
[junit4:junit4]   2> 1738 T2129 C129 UPDATE [collection1] webapp=/solr path=/update params={version=2&wt=javabin} {add=[541]} 0 0
[junit4:junit4]   2> 1740 T2119 C128 UPDATE [collection1] webapp=/solr path=/update params={version=2&wt=javabin} {add=[542]} 0 1
[junit4:junit4]   2> 1741 T2129 C129 UPDATE [collection1] webapp=/solr path=/update params={version=2&wt=javabin} {add=[542]} 0 0
[junit4:junit4]   2> 1743 T2119 C128 UPDATE [collection1] webapp=/solr path=/update params={version=2&wt=javabin} {add=[543]} 0 0
[junit4:junit4]   2> 1745 T2129 C129 UPDATE [collection1] webapp=/solr path=/update params={version=2&wt=javabin} {add=[543]} 0 0
[junit4:junit4]   2> 1747 T2119 C128 UPDATE [collection1] webapp=/solr path=/update params={version=2&wt=javabin} {add=[544]} 0 0
[junit4:junit4]   2> 1749 T2129 C129 UPDATE [collection1] webapp=/solr path=/update params={version=2&wt=javabin} {add=[544]} 0 0
[junit4:junit4]   2> 1751 T2119 C128 UPDATE [collection1] webapp=/solr path=/update params={version=2&wt=javabin} {add=[545]} 0 0
[junit4:junit4]   2> 1753 T2129 C129 UPDATE [collection1] webapp=/solr path=/update params={version=2&wt=javabin} {add=[545]} 0 1
[junit4:junit4]   2> 1755 T2119 C128 UPDATE [collection1] webapp=/solr path=/update params={version=2&wt=javabin} {add=[546]} 0 1
[junit4:junit4]   2> 1757 T2129 C129 UPDATE [collection1] webapp=/solr path=/update params={version=2&wt=javabin} {add=[546]} 0 1
[junit4:junit4]   2> 1763 T2119 C128 UPDATE [collection1] webapp=/solr path=/update params={version=2&wt=javabin} {add=[547]} 0 5
[junit4:junit4]   2> 1766 T2129 C129 UPDATE [collection1] webapp=/solr path=/update params={version=2&wt=javabin} {add=[547]} 0 1
[junit4:junit4]   2> 1769 T2119 C128 UPDATE [collection1] webapp=/solr path=/update params={version=2&wt=javabin} {add=[548]} 0 1
[junit4:junit4]   2> 1771 T2129 C129 UPDATE [collection1] webapp=/solr path=/update params={version=2&wt=javabin} {add=[548]} 0 1
[junit4:junit4]   2> 1773 T2119 C128 UPDATE [collection1] webapp=/solr path=/update params={version=2&wt=javabin} {add=[549]} 0 0
[junit4:junit4]   2> 1775 T2129 C129 UPDATE [collection1] webapp=/solr path=/update params={version=2&wt=javabin} {add=[549]} 0 0
[junit4:junit4]   2> 1777 T2119 C128 UPDATE [collection1] webapp=/solr path=/update params={version=2&wt=javabin} {add=[550]} 0 0
[junit4:junit4]   2> 1779 T2129 C129 UPDATE [collection1] webapp=/solr path=/update params={version=2&wt=javabin} {add=[550]} 0 0
[junit4:junit4]   2> 1781 T2119 C128 UPDATE [collection1] webapp=/solr path=/update params={version=2&wt=javabin} {add=[551]} 0 0
[junit4:junit4]   2> 1783 T2129 C129 UPDATE [collection1] webapp=/solr path=/update params={version=2&wt=javabin} {add=[551]} 0 0
[junit4:junit4]   2> 1785 T2119 C128 UPDATE [collection1] webapp=/solr path=/update params={version=2&wt=javabin} {add=[552]} 0 1
[junit4:junit4]   2> 1787 T2129 C129 UPDATE [collection1] webapp=/solr path=/update params={version=2&wt=javabin} {add=[552]} 0 1
[junit4:junit4]   2> 1789 T2119 C128 UPDATE [collection1] webapp=/solr path=/update params={version=2&wt=javabin} {add=[553]} 0 1
[junit4:junit4]   2> 1791 T2129 C129 UPDATE [collection1] webapp=/solr path=/update params={version=2&wt=javabin} {add=[553]} 0 1
[junit4:junit4]   2> 1793 T2119 C128 UPDATE [collection1] webapp=/solr path=/update params={version=2&wt=javabin} {add=[554]} 0 1
[junit4:junit4]   2> 1794 T2129 C129 UPDATE [collection1] webapp=/solr path=/update params={version=2&wt=javabin} {add=[554]} 0 0
[junit4:junit4]   2> 1796 T2119 C128 UPDATE [collection1] webapp=/solr path=/update params={version=2&wt=javabin} {add=[555]} 0 0
[junit4:junit4]   2> 1798 T2129 C129 UPDATE [collection1] webapp=/solr path=/update params={version=2&wt=javabin} {add=[555]} 0 0
[junit4:junit4]   2> 1800 T2119 C128 UPDATE [collection1] webapp=/solr path=/update params={version=2&wt=javabin} {add=[556]} 0 0
[junit4:junit4]   2> 1802 T2129 C129 UPDATE [collection1] webapp=/solr path=/update params={version=2&wt=javabin} {add=[556]} 0 0
[junit4:junit4]   2> 1807 T2119 C128 UPDATE [collection1] webapp=/solr path=/update params={version=2&wt=javabin} {add=[557]} 0 3
[junit4:junit4]   2> 1810 T2129 C129 UPDATE [collection1] webapp=/solr path=/update params={version=2&wt=javabin} {add=[557]} 0 1
[junit4:junit4]   2> 1812 T2119 C128 UPDATE [collection1] webapp=/solr path=/update params={version=2&wt=javabin} {add=[558]} 0 1
[junit4:junit4]   2> 1814 T2129 C129 UPDATE [collection1] webapp=/solr path=/update params={version=2&wt=javabin} {add=[558]} 0 0
[junit4:junit4]   2> 1816 T2119 C128 UPDATE [collection1] webapp=/solr path=/update params={version=2&wt=javabin} {add=[559]} 0 0
[junit4:junit4]   2> 1818 T2129 C129 UPDATE [collection1] webapp=/solr path=/update params={version=2&wt=javabin} {add=[559]} 0 0
[junit4:junit4]   2> 1820 T2119 C128 UPDATE [collection1] webapp=/solr path=/update params={version=2&wt=javabin} {add=[560]} 0 1
[junit4:junit4]   2> 1821 T2129 C129 UPDATE [collection1] webapp=/solr path=/update params={version=2&wt=javabin} {add=[560]} 0 0
[junit4:junit4]   2> 1823 T2119 C128 UPDATE [collection1] webapp=/solr path=/update params={version=2&wt=javabin} {add=[561]} 0 0
[junit4:junit4]   2> 1825 T2129 C129 UPDATE [collection1] webapp=/solr path=/update params={version=2&wt=javabin} {add=[561]} 0 0
[junit4:junit4]   2> 1827 T2119 C128 UPDATE [collection1] webapp=/solr path=/update params={version=2&wt=javabin} {add=[562]} 0 0
[junit4:junit4]   2> 1829 T2129 C129 UPDATE [collection1] webapp=/solr path=/update params={version=2&wt=javabin} {add=[562]} 0 0
[junit4:junit4]   2> 1831 T2119 C128 UPDATE [collection1] webapp=/solr path=/update params={version=2&wt=javabin} {add=[563]} 0 0
[junit4:junit4]   2> 1833 T2129 C129 UPDATE [collection1] webapp=/solr path=/update params={version=2&wt=javabin} {add=[563]} 0 1
[junit4:junit4]   2> 1834 T2119 C128 UPDATE [collection1] webapp=/solr path=/update params={version=2&wt=javabin} {add=[564]} 0 0
[junit4:junit4]   2> 1836 T2129 C129 UPDATE [collection1] webapp=/solr path=/update params={version=2&wt=javabin} {add=[564]} 0 0
[junit4:junit4]   2> 1838 T2119 C128 UPDATE [collection1] webapp=/solr path=/update params={version=2&wt=javabin} {add=[565]} 0 0
[junit4:junit4]   2> 1840 T2129 C129 UPDATE [collection1] webapp=/solr path=/update params={version=2&wt=javabin} {add=[565]} 0 0
[junit4:junit4]   2> 1842 T2119 C128 UPDATE [collection1] webapp=/solr path=/update params={version=2&wt=javabin} {add=[566]} 0 0
[junit4:junit4]   2> 1844 T2129 C129 UPDATE [collection1] webapp=/solr path=/update params={version=2&wt=javabin} {add=[566]} 0 0
[junit4:junit4]   2> 1848 T2119 C128 UPDATE [collection1] webapp=/solr path=/update params={version=2&wt=javabin} {add=[567]} 0 3
[junit4:junit4]   2> 1851 T2129 C129 UPDATE [collection1] webapp=/solr path=/update params={version=2&wt=javabin} {add=[567]} 0 1
[junit4:junit4]   2> 1853 T2119 C128 UPDATE [collection1] webapp=/solr path=/update params={version=2&wt=javabin} {add=[568]} 0 0
[junit4:junit4]   2> 1855 T2129 C129 UPDATE [collection1] webapp=/solr path=/update params={version=2&wt=javabin} {add=[568]} 0 0
[junit4:junit4]   2> 1857 T2119 C128 UPDATE [collection1] webapp=/solr path=/update params={version=2&wt=javabin} {add=[569]} 0 0
[junit4:junit4]   2> 1859 T2129 C129 UPDATE [collection1] webapp=/solr path=/update params={version=2&wt=javabin} {add=[569]} 0 0
[junit4:junit4]   2> 1861 T2119 C128 UPDATE [collection1] webapp=/solr path=/update params={version=2&wt=javabin} {add=[570]} 0 0
[junit4:junit4]   2> 1863 T2129 C129 UPDATE [collection1] webapp=/solr path=/update params={version=2&wt=javabin} {add=[570]} 0 0
[junit4:junit4]   2> 1865 T2119 C128 UPDATE [collection1] webapp=/solr path=/update params={version=2&wt=javabin} {add=[571]} 0 0
[junit4:junit4]   2> 1867 T2129 C129 UPDATE [collection1] webapp=/solr path=/update params={version=2&wt=javabin} {add=[571]} 0 0
[junit4:junit4]   2> 1869 T2119 C128 UPDATE [collection1] webapp=/solr path=/update params={version=2&wt=javabin} {add=[572]} 0 0
[junit4:junit4]   2> 1871 T2129 C129 UPDATE [collection1] webapp=/solr path=/update params={version=2&wt=javabin} {add=[572]} 0 0
[junit4:junit4]   2> 1873 T2119 C128 UPDATE [collection1] webapp=/solr path=/update params={version=2&wt=javabin} {add=[573]} 0 0
[junit4:junit4]   2> 1875 T2129 C129 UPDATE [collection1] webapp=/solr path=/update params={version=2&wt=javabin} {add=[573]} 0 0
[junit4:junit4]   2> 1877 T2119 C128 UPDATE [collection1] webapp=/solr path=/update params={version=2&wt=javabin} {add=[574]} 0 0
[junit4:junit4]   2> 1879 T2129 C129 UPDATE [collection1] webapp=/solr path=/update params={version=2&wt=javabin} {add=[574]} 0 0
[junit4:junit4]   2> 1881 T2119 C128 UPDATE [collection1] webapp=/solr path=/update params={version=2&wt=javabin} {add=[575]} 0 0
[junit4:junit4]   2> 1883 T2129 C129 UPDATE [collection1] webapp=/solr path=/update params={version=2&wt=javabin} {add=[575]} 0 0
[junit4:junit4]   2> 1885 T2119 C128 UPDATE [collection1] webapp=/solr path=/update params={version=2&wt=javabin} {add=[576]} 0 0
[junit4:junit4]   2> 1887 T2129 C129 UPDATE [collection1] webapp=/solr path=/update params={version=2&wt=javabin} {add=[576]} 0 0
[junit4:junit4]   2> 1905 T2119 C128 UPDATE [collection1] webapp=/solr path=/update params={version=2&wt=javabin} {add=[577]} 0 16
[junit4:junit4]   2> 1913 T2129 C129 UPDATE [collection1] webapp=/solr path=/update params={version=2&wt=javabin} {add=[577]} 0 6
[junit4:junit4]   2> 1916 T2119 C128 UPDATE [collection1] webapp=/solr path=/update params={version=2&wt=javabin} {add=[578]} 0 1
[junit4:junit4]   2> 1919 T2129 C129 UPDATE [collection1] webapp=/solr path=/update params={version=2&wt=javabin} {add=[578]} 0 0
[junit4:junit4]   2> 1922 T2119 C128 UPDATE [collection1] webapp=/solr path=/update params={version=2&wt=javabin} {add=[579]} 0 1
[junit4:junit4]   2> 1924 T2129 C129 UPDATE [collection1] webapp=/solr path=/update params={version=2&wt=javabin} {add=[579]} 0 0
[junit4:junit4]   2> 1926 T2119 C128 UPDATE [collection1] webapp=/solr path=/update params={version=2&wt=javabin} {add=[580]} 0 0
[junit4:junit4]   2> 1929 T2129 C129 UPDATE [collection1] webapp=/solr path=/update params={version=2&wt=javabin} {add=[580]} 0 0
[junit4:junit4]   2> 1931 T2119 C128 UPDATE [collection1] webapp=/solr path=/update params={version=2&wt=javabin} {add=[581]} 0 0
[junit4:junit4]   2> 1934 T2129 C129 UPDATE [collection1] webapp=/solr path=/update params={version=2&wt=javabin} {add=[581]} 0 0
[junit4:junit4]   2> 1936 T2119 C128 UPDATE [collection1] webapp=/solr path=/update params={version=2&wt=javabin} {add=[582]} 0 0
[junit4:junit4]   2> 1938 T2129 C129 UPDATE [collection1] webapp=/solr path=/update params={version=2&wt=javabin} {add=[582]} 0 0
[junit4:junit4]   2> 1940 T2119 C128 UPDATE [collection1] webapp=/solr path=/update params={version=2&wt=javabin} {add=[583]} 0 0
[junit4:junit4]   2> 1942 T2129 C129 UPDATE [collection1] webapp=/solr path=/update params={version=2&wt=javabin} {add=[583]} 0 0
[junit4:junit4]   2> 1944 T2119 C128 UPDATE [collection1] webapp=/solr path=/update params={version=2&wt=javabin} {add=[584]} 0 0
[junit4:junit4]   2> 1946 T2129 C129 UPDATE [collection1] webapp=/solr path=/update params={version=2&wt=javabin} {add=[584]} 0 0
[junit4:junit4]   2> 1948 T2119 C128 UPDATE [collection1] webapp=/solr path=/update params={version=2&wt=javabin} {add=[585]} 0 0
[junit4:junit4]   2> 1950 T2129 C129 UPDATE [collection1] webapp=/solr path=/update params={version=2&wt=javabin} {add=[585]} 0 0
[junit4:junit4]   2> 1952 T2119 C128 UPDATE [collection1] webapp=/solr path=/update params={version=2&wt=javabin} {add=[586]} 0 0
[junit4:junit4]   2> 1954 T2129 C129 UPDATE [collection1] webapp=/solr path=/update params={version=2&wt=javabin} {add=[586]} 0 0
[junit4:junit4]   2> 1958 T2119 C128 UPDATE [collection1] webapp=/solr path=/update params={version=2&wt=javabin} {add=[587]} 0 2
[junit4:junit4]   2> 1961 T2129 C129 UPDATE [collection1] webapp=/solr path=/update params={version=2&wt=javabin} {add=[587]} 0 1
[junit4:junit4]   2> 1964 T2119 C128 UPDATE [collection1] webapp=/solr path=/update params={version=2&wt=javabin} {add=[588]} 0 1
[junit4:junit4]   2> 1966 T2129 C129 UPDATE [collection1] webapp=/solr path=/update params={version=2&wt=javabin} {add=[588]} 0 1
[junit4:junit4]   2> 1968 T2119 C128 UPDATE [collection1] webapp=/solr path=/update params={version=2&wt=javabin} {add=[589]} 0 1
[junit4:junit4]   2> 1970 T2129 C129 UPDATE [collection1] webapp=/solr path=/update params={version=2&wt=javabin} {add=[589]} 0 1
[junit4:junit4]   2> 1971 T2119 C128 UPDATE [collection1] webapp=/solr path=/update params={version=2&wt=javabin} {add=[590]} 0 0
[junit4:junit4]   2> 1973 T2129 C129 UPDATE [collection1] webapp=/solr path=/update params={version=2&wt=javabin} {add=[590]} 0 0
[junit4:junit4]   2> 1975 T2119 C128 UPDATE [collection1] webapp=/solr path=/update params={version=2&wt=javabin} {add=[591]} 0 0
[junit4:junit4]   2> 1977 T2129 C129 UPDATE [collection1] webapp=/solr path=/update params={version=2&wt=javabin} {add=[591]} 0 0
[junit4:junit4]   2> 1979 T2119 C128 UPDATE [collection1] webapp=/solr path=/update params={version=2&wt=javabin} {add=[592]} 0 0
[junit4:junit4]   2> 1981 T2129 C129 UPDATE [collection1] webapp=/solr path=/update params={version=2&wt=javabin} {add=[592]} 0 0
[junit4:junit4]   2> 1983 T2119 C128 UPDATE [collection1] webapp=/solr path=/update params={version=2&wt=javabin} {add=[593]} 0 0
[junit4:junit4]   2> 1985 T2129 C129 UPDATE [collection1] webapp=/solr path=/update params={version=2&wt=javabin} {add=[593]} 0 0
[junit4:junit4]   2> 1987 T2119 C128 UPDATE [collection1] webapp=/solr path=/update params={version=2&wt=javabin} {add=[594]} 0 1
[junit4:junit4]   2> 1989 T2129 C129 UPDATE [collection1] webapp=/solr path=/update params={version=2&wt=javabin} {add=[594]} 0 1
[junit4:junit4]   2> 1990 T2119 C128 UPDATE [collection1] webapp=/solr path=/update params={version=2&wt=javabin} {add=[595]} 0 0
[junit4:junit4]   2> 1992 T2129 C129 UPDATE [collection1] webapp=/solr path=/update params={version=2&wt=javabin} {add=[595]} 0 0
[junit4:junit4]   2> 1994 T2119 C128 UPDATE [collection1] webapp=/solr path=/update params={version=2&wt=javabin} {add=[596]} 0 0
[junit4:junit4]   2> 1996 T2129 C129 UPDATE [collection1] webapp=/solr path=/update params={version=2&wt=javabin} {add=[596]} 0 0
[junit4:junit4]   2> 2000 T2119 C128 UPDATE [collection1] webapp=/solr path=/update params={version=2&wt=javabin} {add=[597]} 0 2
[junit4:junit4]   2> 2003 T2129 C129 UPDATE [collection1] webapp=/solr path=/update params={version=2&wt=javabin} {add=[597]} 0 1
[junit4:junit4]   2> 2006 T2119 C128 UPDATE [collection1] webapp=/solr path=/update params={version=2&wt=javabin} {add=[598]} 0 1
[junit4:junit4]   2> 2008 T2129 C129 UPDATE [collection1] webapp=/solr path=/update params={version=2&wt=javabin} {add=[598]} 0 1
[junit4:junit4]   2> 2009 T2119 C128 UPDATE [collection1] webapp=/solr path=/update params={version=2&wt=javabin} {add=[599]} 0 0
[junit4:junit4]   2> 2011 T2129 C129 UPDATE [collection1] webapp=/solr path=/update params={version=2&wt=javabin} {add=[599]} 0 0
[junit4:junit4]   2> 2013 T2119 C128 oasu.DirectUpdateHandler2.commit start commit{flags=0,_version_=0,optimize=false,openSearcher=true,waitSearcher=true,expungeDeletes=false,softCommit=false}
[junit4:junit4]   2> 2026 T2119 C128 oasc.SolrDeletionPolicy.onCommit SolrDeletionPolicy.onCommit: commits:num=2
[junit4:junit4]   2> 		commit{dir=MockDirWrapper(org.apache.lucene.store.SimpleFSDirectory@/mnt/ssd/jenkins/workspace/Lucene-Solr-4.x-Linux/solr/build/solr-core/test/J1/index3561135616tmp lockFactory=org.apache.lucene.store.NativeFSLockFactory@62b360d8),segFN=segments_2,generation=2,filenames=[segments_2]
[junit4:junit4]   2> 		commit{dir=MockDirWrapper(org.apache.lucene.store.SimpleFSDirectory@/mnt/ssd/jenkins/workspace/Lucene-Solr-4.x-Linux/solr/build/solr-core/test/J1/index3561135616tmp lockFactory=org.apache.lucene.store.NativeFSLockFactory@62b360d8),segFN=segments_3,generation=3,filenames=[_g.tii, _h.tii, _i.tii, _j.tii, segments_3, _g.tis, _h.tis, _i.si, _i.tis, _j.tis, _g.si, _g.frq, _g.fnm, _h.frq, _h.fnm, _i.fnm, _i.frq, _j.frq, _j.fnm, _g.nrm, _h.nrm, _i.nrm, _j.nrm, _g.fdt, _g.prx, _h.prx, _h.fdt, _i.prx, _i.fdt, _j.fdt, _j.prx, _g.fdx, _h.fdx, _i.fdx, _j.fdx, _j.si, _h.si]
[junit4:junit4]   2> 2026 T2119 C128 oasc.SolrDeletionPolicy.updateCommits newest commit = 3
[junit4:junit4]   2> 2035 T2119 C128 oass.SolrIndexSearcher.<init> Opening Searcher@6e2c139a main
[junit4:junit4]   2> 2036 T2119 C128 oass.SolrIndexSearcher.getIndexDir WARNING WARNING: Directory impl does not support setting indexDir: org.apache.lucene.store.MockDirectoryWrapper
[junit4:junit4]   2> 2036 T2119 C128 oasu.DirectUpdateHandler2.commit end_commit_flush
[junit4:junit4]   2> 2038 T2126 oasc.SolrCore.registerSearcher [collection1] Registered new searcher Searcher@6e2c139a main{StandardDirectoryReader(segments_3:42 _g(4.0.0.2):C150 _h(4.0.0.2):C10 _i(4.0.0.2):C10 _j(4.0.0.2):C2)}
[junit4:junit4]   2> 2038 T2119 C128 UPDATE [collection1] webapp=/solr path=/update params={version=2&softCommit=false&waitSearcher=true&wt=javabin&commit=true} {commit=} 0 25
[junit4:junit4]   2> 2040 T2129 C129 oasu.DirectUpdateHandler2.commit start commit{flags=0,_version_=0,optimize=false,openSearcher=true,waitSearcher=true,expungeDeletes=false,softCommit=false}
[junit4:junit4]   2> 2043 T2129 C129 oasc.SolrDeletionPolicy.onCommit SolrDeletionPolicy.onCommit: commits:num=2
[junit4:junit4]   2> 		commit{dir=MockDirWrapper(org.apache.lucene.store.RAMDirectory@77d60fd2 lockFactory=org.apache.lucene.store.NativeFSLockFactory@691329d5),segFN=segments_2,generation=2,filenames=[segments_2]
[junit4:junit4]   2> 		commit{dir=MockDirWrapper(org.apache.lucene.store.RAMDirectory@77d60fd2 lockFactory=org.apache.lucene.store.NativeFSLockFactory@691329d5),segFN=segments_3,generation=3,filenames=[_g.tii, _h.tii, _i.tii, _j.tii, segments_3, _g.tis, _h.tis, _i.si, _i.tis, _j.tis, _g.si, _g.frq, _g.fnm, _h.frq, _h.fnm, _i.fnm, _i.frq, _j.frq, _j.fnm, _g.nrm, _h.nrm, _i.nrm, _j.nrm, _g.fdt, _g.prx, _h.prx, _h.fdt, _i.prx, _i.fdt, _j.fdt, _j.prx, _g.fdx, _h.fdx, _i.fdx, _j.fdx, _j.si, _h.si]
[junit4:junit4]   2> 2044 T2129 C129 oasc.SolrDeletionPolicy.updateCommits newest commit = 3
[junit4:junit4]   2> 2046 T2129 C129 oass.SolrIndexSearcher.<init> Opening Searcher@90a3dfa9 main
[junit4:junit4]   2> 2046 T2129 C129 oass.SolrIndexSearcher.getIndexDir WARNING WARNING: Directory impl does not support setting indexDir: org.apache.lucene.store.MockDirectoryWrapper
[junit4:junit4]   2> 2047 T2129 C129 oasu.DirectUpdateHandler2.commit end_commit_flush
[junit4:junit4]   2> 2048 T2136 oasc.SolrCore.registerSearcher [collection1] Registered new searcher Searcher@90a3dfa9 main{StandardDirectoryReader(segments_3:42 _g(4.0.0.2):C150 _h(4.0.0.2):C10 _i(4.0.0.2):C10 _j(4.0.0.2):C2)}
[junit4:junit4]   2> 2049 T2129 C129 UPDATE [collection1] webapp=/solr path=/update params={version=2&softCommit=false&waitSearcher=true&wt=javabin&commit=true} {commit=} 0 9
[junit4:junit4]   2> 2056 T2119 C128 REQ [collection1] webapp=/solr path=/select params={q=*:*&distrib=false&fl=id,a_si&version=2&rows=100&group.field=a_si&group.limit=10&wt=javabin&sort=a_si+asc,+id+asc&group=true} hits=172 status=0 QTime=6 
[junit4:junit4]   2> 2057 T2119 C128 oasr.BinaryResponseWriter$Resolver.getDoc WARNING Error reading a field from document : SolrDocument{id=3} java.lang.NullPointerException
[junit4:junit4]   2> 	at org.apache.solr.util.NumberUtils.SortableStr2int(NumberUtils.java:162)
[junit4:junit4]   2> 	at org.apache.solr.schema.SortableIntField.toObject(SortableIntField.java:96)
[junit4:junit4]   2> 	at org.apache.solr.schema.SortableIntField.toObject(SortableIntField.java:55)
[junit4:junit4]   2> 	at org.apache.solr.response.BinaryResponseWriter$Resolver.getValue(BinaryResponseWriter.java:218)
[junit4:junit4]   2> 	at org.apache.solr.response.BinaryResponseWriter$Resolver.getDoc(BinaryResponseWriter.java:181)
[junit4:junit4]   2> 	at org.apache.solr.response.BinaryResponseWriter$Resolver.writeResultsBody(BinaryResponseWriter.java:142)
[junit4:junit4]   2> 	at org.apache.solr.response.BinaryResponseWriter$Resolver.writeResults(BinaryResponseWriter.java:168)
[junit4:junit4]   2> 	at org.apache.solr.response.BinaryResponseWriter$Resolver.resolve(BinaryResponseWriter.java:87)
[junit4:junit4]   2> 	at org.apache.solr.common.util.JavaBinCodec.writeVal(JavaBinCodec.java:154)
[junit4:junit4]   2> 	at org.apache.solr.common.util.JavaBinCodec.writeNamedList(JavaBinCodec.java:144)
[junit4:junit4]   2> 	at org.apache.solr.common.util.JavaBinCodec.writeKnownType(JavaBinCodec.java:234)
[junit4:junit4]   2> 	at org.apache.solr.common.util.JavaBinCodec.writeVal(JavaBinCodec.java:149)
[junit4:junit4]   2> 	at org.apache.solr.common.util.JavaBinCodec.writeArray(JavaBinCodec.java:434)
[junit4:junit4]   2> 	at org.apache.solr.common.util.JavaBinCodec.writeKnownType(JavaBinCodec.java:242)
[junit4:junit4]   2> 	at org.apache.solr.common.util.JavaBinCodec.writeVal(JavaBinCodec.java:149)
[junit4:junit4]   2> 	at org.apache.solr.common.util.JavaBinCodec.writeNamedList(JavaBinCodec.java:144)
[junit4:junit4]   2> 	at org.apache.solr.common.util.JavaBinCodec.writeKnownType(JavaBinCodec.java:234)
[junit4:junit4]   2> 	at org.apache.solr.common.util.JavaBinCodec.writeVal(JavaBinCodec.java:149)
[junit4:junit4]   2> 	at org.apache.solr.common.util.JavaBinCodec.writeNamedList(JavaBinCodec.java:144)
[junit4:junit4]   2> 	at org.apache.solr.common.util.JavaBinCodec.writeKnownType(JavaBinCodec.java:234)
[junit4:junit4]   2> 	at org.apache.solr.common.util.JavaBinCodec.writeVal(JavaBinCodec.java:149)
[junit4:junit4]   2> 	at org.apache.solr.common.util.JavaBinCodec.writeNamedList(JavaBinCodec.java:144)
[junit4:junit4]   2> 	at org.apache.solr.common.util.JavaBinCodec.writeKnownType(JavaBinCodec.java:234)
[junit4:junit4]   2> 	at org.apache.solr.common.util.JavaBinCodec.writeVal(JavaBinCodec.java:149)
[junit4:junit4]   2> 	at org.apache.solr.common.util.JavaBinCodec.marshal(JavaBinCodec.java:92)
[junit4:junit4]   2> 	at org.apache.solr.response.BinaryResponseWriter.write(BinaryResponseWriter.java:49)
[junit4:junit4]   2> 	at org.apache.solr.servlet.SolrDispatchFilter.writeResponse(SolrDispatchFilter.java:404)
[junit4:junit4]   2> 	at org.apache.solr.servlet.SolrDispatchFilter.doFilter(SolrDispatchFilter.java:289)
[junit4:junit4]   2> 	at org.eclipse.jetty.servlet.ServletHandler$CachedChain.doFilter(ServletHandler.java:1337)
[junit4:junit4]   2> 	at org.eclipse.jetty.servlet.ServletHandler.doHandle(ServletHandler.java:484)
[junit4:junit4]   2> 	at org.eclipse.jetty.server.session.SessionHandler.doHandle(SessionHandler.java:231)
[junit4:junit4]   2> 	at org.eclipse.jetty.server.handler.ScopedHandler.handle(ScopedHandler.java:119)
[junit4:junit4]   2> 	at org.eclipse.jetty.server.handler.GzipHandler.handle(GzipHandler.java:267)
[junit4:junit4]   2> 	at org.eclipse.jetty.server.handler.ContextHandler.doHandle(ContextHandler.java:1067)
[junit4:junit4]   2> 	at org.eclipse.jetty.servlet.ServletHandler.doScope(ServletHandler.java:413)
[junit4:junit4]   2> 	at org.eclipse.jetty.server.session.SessionHandler.doScope(SessionHandler.java:192)
[junit4:junit4]   2> 	at org.eclipse.jetty.server.handler.ContextHandler.doScope(ContextHandler.java:999)
[junit4:junit4]   2> 	at org.eclipse.jetty.server.handler.ScopedHandler.handle(ScopedHandler.java:117)
[junit4:junit4]   2> 	at org.eclipse.jetty.server.handler.HandlerWrapper.handle(HandlerWrapper.java:111)
[junit4:junit4]   2> 	at org.eclipse.jetty.server.Server.handle(Server.java:351)
[junit4:junit4]   2> 	at org.eclipse.jetty.server.AbstractHttpConnection.handleRequest(AbstractHttpConnection.java:454)
[junit4:junit4]   2> 	at org.eclipse.jetty.server.AbstractHttpConnection.headerComplete(AbstractHttpConnection.java:890)
[junit4:junit4]   2> 	at org.eclipse.jetty.server.AbstractHttpConnection$RequestHandler.headerComplete(AbstractHttpConnection.java:944)
[junit4:junit4]   2> 	at org.eclipse.jetty.http.HttpParser.parseNext(HttpParser.java:634)
[junit4:junit4]   2> 	at org.eclipse.jetty.http.HttpParser.parseAvailable(HttpParser.java:230)
[junit4:junit4]   2> 	at org.eclipse.jetty.server.BlockingHttpConnection.handle(BlockingHttpConnection.java:66)
[junit4:junit4]   2> 	at org.eclipse.jetty.server.bio.SocketConnector$ConnectorEndPoint.run(SocketConnector.java:254)
[junit4:junit4]   2> 	at org.eclipse.jetty.util.thread.QueuedThreadPool.runJob(QueuedThreadPool.java:599)
[junit4:junit4]   2> 	at org.eclipse.jetty.util.thread.QueuedThreadPool$3.run(QueuedThreadPool.java:534)
[junit4:junit4]   2> 	at java.lang.Thread.run(Thread.java:777)
[junit4:junit4]   2> 
[junit4:junit4]   2> 2058 T2119 C128 oasr.BinaryResponseWriter$Resolver.getDoc WARNING Error reading a field from document : SolrDocument{id=9} java.lang.NullPointerException
[junit4:junit4]   2> 	at org.apache.solr.util.NumberUtils.SortableStr2int(NumberUtils.java:162)
[junit4:junit4]   2> 	at org.apache.solr.schema.SortableIntField.toObject(SortableIntField.java:96)
[junit4:junit4]   2> 	at org.apache.solr.schema.SortableIntField.toObject(SortableIntField.java:55)
[junit4:junit4]   2> 	at org.apache.solr.response.BinaryResponseWriter$Resolver.getValue(BinaryResponseWriter.java:218)
[junit4:junit4]   2> 	at org.apache.solr.response.BinaryResponseWriter$Resolver.getDoc(BinaryResponseWriter.java:181)
[junit4:junit4]   2> 	at org.apache.solr.response.BinaryResponseWriter$Resolver.writeResultsBody(BinaryResponseWriter.java:142)
[junit4:junit4]   2> 	at org.apache.solr.response.BinaryResponseWriter$Resolver.writeResults(BinaryResponseWriter.java:168)
[junit4:junit4]   2> 	at org.apache.solr.response.BinaryResponseWriter$Resolver.resolve(BinaryResponseWriter.java:87)
[junit4:junit4]   2> 	at org.apache.solr.common.util.JavaBinCodec.writeVal(JavaBinCodec.java:154)
[junit4:junit4]   2> 	at org.apache.solr.common.util.JavaBinCodec.writeNamedList(JavaBinCodec.java:144)
[junit4:junit4]   2> 	at org.apache.solr.common.util.JavaBinCodec.writeKnownType(JavaBinCodec.java:234)
[junit4:junit4]   2> 	at org.apache.solr.common.util.JavaBinCodec.writeVal(JavaBinCodec.java:149)
[junit4:junit4]   2> 	at org.apache.solr.common.util.JavaBinCodec.writeArray(JavaBinCodec.java:434)
[junit4:junit4]   2> 	at org.apache.solr.common.util.JavaBinCodec.writeKnownType(JavaBinCodec.java:242)
[junit4:junit4]   2> 	at org.apache.solr.common.util.JavaBinCodec.writeVal(JavaBinCodec.java:149)
[junit4:junit4]   2> 	at org.apache.solr.common.util.JavaBinCodec.writeNamedList(JavaBinCodec.java:144)
[junit4:junit4]   2> 	at org.apache.solr.common.util.JavaBinCodec.writeKnownType(JavaBinCodec.java:234)
[junit4:junit4]   2> 	at org.apache.solr.common.util.JavaBinCodec.writeVal(JavaBinCodec.java:149)
[junit4:junit4]   2> 	at org.apache.solr.common.util.JavaBinCodec.writeNamedList(JavaBinCodec.java:144)
[junit4:junit4]   2> 	at org.apache.solr.common.util.JavaBinCodec.writeKnownType(JavaBinCodec.java:234)
[junit4:junit4]   2> 	at org.apache.solr.common.util.JavaBinCodec.writeVal(JavaBinCodec.java:149)
[junit4:junit4]   2> 	at org.apache.solr.common.util.JavaBinCodec.writeNamedList(JavaBinCodec.java:144)
[junit4:junit4]   2> 	at org.apache.solr.common.util.JavaBinCodec.writeKnownType(JavaBinCodec.java:234)
[junit4:junit4]   2> 	at org.apache.solr.common.util.JavaBinCodec.writeVal(JavaBinCodec.java:149)
[junit4:junit4]   2> 	at org.apache.solr.common.util.JavaBinCodec.marshal(JavaBinCodec.java:92)
[junit4:junit4]   2> 	at org.apache.solr.response.BinaryResponseWriter.write(BinaryResponseWriter.java:49)
[junit4:junit4]   2> 	at org.apache.solr.servlet.SolrDispatchFilter.writeResponse(SolrDispatchFilter.java:404)
[junit4:junit4]   2> 	at org.apache.solr.servlet.SolrDispatchFilter.doFilter(SolrDispatchFilter.java:289)
[junit4:junit4]   2> 	at org.eclipse.jetty.servlet.ServletHandler$CachedChain.doFilter(ServletHandler.java:1337)
[junit4:junit4]   2> 	at org.eclipse.jetty.servlet.ServletHandler.doHandle(ServletHandler.java:484)
[junit4:junit4]   2> 	at org.eclipse.jetty.server.session.SessionHandler.doHandle(SessionHandler.java:231)
[junit4:junit4]   2> 	at org.eclipse.jetty.server.handler.ScopedHandler.handle(ScopedHandler.java:119)
[junit4:junit4]   2> 	at org.eclipse.jetty.server.handler.GzipHandler.handle(GzipHandler.java:267)
[junit4:junit4]   2> 	at org.eclipse.jetty.server.handler.ContextHandler.doHandle(ContextHandler.java:1067)
[junit4:junit4]   2> 	at org.eclipse.jetty.servlet.ServletHandler.doScope(ServletHandler.java:413)
[junit4:junit4]   2> 	at org.eclipse.jetty.server.session.SessionHandler.doScope(SessionHandler.java:192)
[junit4:junit4]   2> 	at org.eclipse.jetty.server.handler.ContextHandler.doScope(ContextHandler.java:999)
[junit4:junit4]   2> 	at org.eclipse.jetty.server.handler.ScopedHandler.handle(ScopedHandler.java:117)
[junit4:junit4]   2> 	at org.eclipse.jetty.server.handler.HandlerWrapper.handle(HandlerWrapper.java:111)
[junit4:junit4]   2> 	at org.eclipse.jetty.server.Server.handle(Server.java:351)
[junit4:junit4]   2> 	at org.eclipse.jetty.server.AbstractHttpConnection.handleRequest(AbstractHttpConnection.java:454)
[junit4:junit4]   2> 	at org.eclipse.jetty.server.AbstractHttpConnection.headerComplete(AbstractHttpConnection.java:890)
[junit4:junit4]   2> 	at org.eclipse.jetty.server.AbstractHttpConnection$RequestHandler.headerComplete(AbstractHttpConnection.java:944)
[junit4:junit4]   2> 	at org.eclipse.jetty.http.HttpParser.parseNext(HttpParser.java:634)
[junit4:junit4]   2> 	at org.eclipse.jetty.http.HttpParser.parseAvailable(HttpParser.java:230)
[junit4:junit4]   2> 	at org.eclipse.jetty.server.BlockingHttpConnection.handle(BlockingHttpConnection.java:66)
[junit4:junit4]   2> 	at org.eclipse.jetty.server.bio.SocketConnector$ConnectorEndPoint.run(SocketConnector.java:254)
[junit4:junit4]   2> 	at org.eclipse.jetty.util.thread.QueuedThreadPool.runJob(QueuedThreadPool.java:599)
[junit4:junit4]   2> 	at org.eclipse.jetty.util.thread.QueuedThreadPool$3.run(QueuedThreadPool.java:534)
[junit4:junit4]   2> 	at java.lang.Thread.run(Thread.java:777)
[junit4:junit4]   2> 
[junit4:junit4]   2> 2062 T2119 C128 oasr.BinaryResponseWriter$Resolver.getDoc WARNING Error reading a field from document : SolrDocument{id=2} java.lang.NullPointerException
[junit4:junit4]   2> 	at org.apache.solr.util.NumberUtils.SortableStr2int(NumberUtils.java:162)
[junit4:junit4]   2> 	at org.apache.solr.schema.SortableIntField.toObject(SortableIntField.java:96)
[junit4:junit4]   2> 	at org.apache.solr.schema.SortableIntField.toObject(SortableIntField.java:55)
[junit4:junit4]   2> 	at org.apache.solr.response.BinaryResponseWriter$Resolver.getValue(BinaryResponseWriter.java:218)
[junit4:junit4]   2> 	at org.apache.solr.response.BinaryResponseWriter$Resolver.getDoc(BinaryResponseWriter.java:181)
[junit4:junit4]   2> 	at org.apache.solr.response.BinaryResponseWriter$Resolver.writeResultsBody(BinaryResponseWriter.java:142)
[junit4:junit4]   2> 	at org.apache.solr.response.BinaryResponseWriter$Resolver.writeResults(BinaryResponseWriter.java:168)
[junit4:junit4]   2> 	at org.apache.solr.response.BinaryResponseWriter$Resolver.resolve(BinaryResponseWriter.java:87)
[junit4:junit4]   2> 	at org.apache.solr.common.util.JavaBinCodec.writeVal(JavaBinCodec.java:154)
[junit4:junit4]   2> 	at org.apache.solr.common.util.JavaBinCodec.writeNamedList(JavaBinCodec.java:144)
[junit4:junit4]   2> 	at org.apache.solr.common.util.JavaBinCodec.writeKnownType(JavaBinCodec.java:234)
[junit4:junit4]   2> 	at org.apache.solr.common.util.JavaBinCodec.writeVal(JavaBinCodec.java:149)
[junit4:junit4]   2> 	at org.apache.solr.common.util.JavaBinCodec.writeArray(JavaBinCodec.java:434)
[junit4:junit4]   2> 	at org.apache.solr.common.util.JavaBinCodec.writeKnownType(JavaBinCodec.java:242)
[junit4:junit4]   2> 	at org.apache.solr.common.util.JavaBinCodec.writeVal(JavaBinCodec.java:149)
[junit4:junit4]   2> 	at org.apache.solr.common.util.JavaBinCodec.writeNamedList(JavaBinCodec.java:144)
[junit4:junit4]   2> 	at org.apache.solr.common.util.JavaBinCodec.writeKnownType(JavaBinCodec.java:234)
[junit4:junit4]   2> 	at org.apache.solr.common.util.JavaBinCodec.writeVal(JavaBinCodec.java:149)
[junit4:junit4]   2> 	at org.apache.solr.common.util.JavaBinCodec.writeNamedList(JavaBinCodec.java:144)
[junit4:junit4]   2> 	at org.apache.solr.common.util.JavaBinCodec.writeKnownType(JavaBinCodec.java:234)
[junit4:junit4]   2> 	at org.apache.solr.common.util.JavaBinCodec.writeVal(JavaBinCodec.java:149)
[junit4:junit4]   2> 	at org.apache.solr.common.util.JavaBinCodec.writeNamedList(JavaBinCodec.java:144)
[junit4:junit4]   2> 	at org.apache.solr.common.util.JavaBinCodec.writeKnownType(JavaBinCodec.java:234)
[junit4:junit4]   2> 	at org.apache.solr.common.util.JavaBinCodec.writeVal(JavaBinCodec.java:149)
[junit4:junit4]   2> 	at org.apache.solr.common.util.JavaBinCodec.marshal(JavaBinCodec.java:92)
[junit4:junit4]   2> 	at org.apache.solr.response.BinaryResponseWriter.write(BinaryResponseWriter.java:49)
[junit4:junit4]   2> 	at org.apache.solr.servlet.SolrDispatchFilter.writeResponse(SolrDispatchFilter.java:404)
[junit4:junit4]   2> 	at org.apache.solr.servlet.SolrDispatchFilter.doFilter(SolrDispatchFilter.java:289)
[junit4:junit4]   2> 	at org.eclipse.jetty.servlet.ServletHandler$CachedChain.doFilter(ServletHandler.java:1337)
[junit4:junit4]   2> 	at org.eclipse.jetty.servlet.ServletHandler.doHandle(ServletHandler.java:484)
[junit4:junit4]   2> 	at org.eclipse.jetty.server.session.SessionHandler.doHandle(SessionHandler.java:231)
[junit4:junit4]   2> 	at org.eclipse.jetty.server.handler.ScopedHandler.handle(ScopedHandler.java:119)
[junit4:junit4]   2> 	at org.eclipse.jetty.server.handler.GzipHandler.handle(GzipHandler.java:267)
[junit4:junit4]   2> 	at org.eclipse.jetty.server.handler.ContextHandler.doHandle(ContextHandler.java:1067)
[junit4:junit4]   2> 	at org.eclipse.jetty.servlet.ServletHandler.doScope(ServletHandler.java:413)
[junit4:junit4]   2> 	at org.eclipse.jetty.server.session.SessionHandler.doScope(SessionHandler.java:192)
[junit4:junit4]   2> 	at org.eclipse.jetty.server.handler.ContextHandler.doScope(ContextHandler.java:999)
[junit4:junit4]   2> 	at org.eclipse.jetty.server.handler.ScopedHandler.handle(ScopedHandler.java:117)
[junit4:junit4]   2> 	at org.eclipse.jetty.server.handler.HandlerWrapper.handle(HandlerWrapper.java:111)
[junit4:junit4]   2> 	at org.eclipse.jetty.server.Server.handle(Server.java:351)
[junit4:junit4]   2> 	at org.eclipse.jetty.server.AbstractHttpConnection.handleRequest(AbstractHttpConnection.java:454)
[junit4:junit4]   2> 	at org.eclipse.jetty.server.AbstractHttpConnection.headerComplete(AbstractHttpConnection.java:890)
[junit4:junit4]   2> 	at org.eclipse.jetty.server.AbstractHttpConnection$RequestHandler.headerComplete(AbstractHttpConnection.java:944)
[junit4:junit4]   2> 	at org.eclipse.jetty.http.HttpParser.parseNext(HttpParser.java:634)
[junit4:junit4]   2> 	at org.eclipse.jetty.http.HttpParser.parseAvailable(HttpParser.java:230)
[junit4:junit4]   2> 	at org.eclipse.jetty.server.BlockingHttpConnection.handle(BlockingHttpConnection.java:66)
[junit4:junit4]   2> 	at org.eclipse.jetty.server.bio.SocketConnector$ConnectorEndPoint.run(SocketConnector.java:254)
[junit4:junit4]   2> 	at org.eclipse.jetty.util.thread.QueuedThreadPool.runJob(QueuedThreadPool.java:599)
[junit4:junit4]   2> 	at org.eclipse.jetty.util.thread.QueuedThreadPool$3.run(QueuedThreadPool.java:534)
[junit4:junit4]   2> 	at java.lang.Thread.run(Thread.java:777)
[junit4:junit4]   2> 
[junit4:junit4]   2> 2063 T2119 C128 oasr.BinaryResponseWriter$Resolver.getDoc WARNING Error reading a field from document : SolrDocument{id=1} java.lang.NullPointerException
[junit4:junit4]   2> 	at org.apache.solr.util.NumberUtils.SortableStr2int(NumberUtils.java:162)
[junit4:junit4]   2> 	at org.apache.solr.schema.SortableIntField.toObject(SortableIntField.java:96)
[junit4:junit4]   2> 	at org.apache.solr.schema.SortableIntField.toObject(SortableIntField.java:55)
[junit4:junit4]   2> 	at org.apache.solr.response.BinaryResponseWriter$Resolver.getValue(BinaryResponseWriter.java:218)
[junit4:junit4]   2> 	at org.apache.solr.response.BinaryResponseWriter$Resolver.getDoc(BinaryResponseWriter.java:181)
[junit4:junit4]   2> 	at org.apache.solr.response.BinaryResponseWriter$Resolver.writeResultsBody(BinaryResponseWriter.java:142)
[junit4:junit4]   2> 	at org.apache.solr.response.BinaryResponseWriter$Resolver.writeResults(BinaryResponseWriter.java:168)
[junit4:junit4]   2> 	at org.apache.solr.response.BinaryResponseWriter$Resolver.resolve(BinaryResponseWriter.java:87)
[junit4:junit4]   2> 	at org.apache.solr.common.util.JavaBinCodec.writeVal(JavaBinCodec.java:154)
[junit4:junit4]   2> 	at org.apache.solr.common.util.JavaBinCodec.writeNamedList(JavaBinCodec.java:144)
[junit4:junit4]   2> 	at org.apache.solr.common.util.JavaBinCodec.writeKnownType(JavaBinCodec.java:234)
[junit4:junit4]   2> 	at org.apache.solr.common.util.JavaBinCodec.writeVal(JavaBinCodec.java:149)
[junit4:junit4]   2> 	at org.apache.solr.common.util.JavaBinCodec.writeArray(JavaBinCodec.java:434)
[junit4:junit4]   2> 	at org.apache.solr.common.util.JavaBinCodec.writeKnownType(JavaBinCodec.java:242)
[junit4:junit4]   2> 	at org.apache.solr.common.util.JavaBinCodec.writeVal(JavaBinCodec.java:149)
[junit4:junit4]   2> 	at org.apache.solr.common.util.JavaBinCodec.writeNamedList(JavaBinCodec.java:144)
[junit4:junit4]   2> 	at org.apache.solr.common.util.JavaBinCodec.writeKnownType(JavaBinCodec.java:234)
[junit4:junit4]   2> 	at org.apache.solr.common.util.JavaBinCodec.writeVal(JavaBinCodec.java:149)
[junit4:junit4]   2> 	at org.apache.solr.common.util.JavaBinCodec.writeNamedList(JavaBinCodec.java:144)
[junit4:junit4]   2> 	at org.apache.solr.common.util.JavaBinCodec.writeKnownType(JavaBinCodec.java:234)
[junit4:junit4]   2> 	at org.apache.solr.common.util.JavaBinCodec.writeVal(JavaBinCodec.java:149)
[junit4:junit4]   2> 	at org.apache.solr.common.util.JavaBinCodec.writeNamedList(JavaBinCodec.java:144)
[junit4:junit4]   2> 	at org.apache.solr.common.util.JavaBinCodec.writeKnownType(JavaBinCodec.java:234)
[junit4:junit4]   2> 	at org.apache.solr.common.util.JavaBinCodec.writeVal(JavaBinCodec.java:149)
[junit4:junit4]   2> 	at org.apache.solr.common.util.JavaBinCodec.marshal(JavaBinCodec.java:92)
[junit4:junit4]   2> 	at org.apache.solr.response.BinaryResponseWriter.write(BinaryResponseWriter.java:49)
[junit4:junit4]   2> 	at org.apache.solr.servlet.SolrDispatchFilter.writeResponse(SolrDispatchFilter.java:404)
[junit4:junit4]   2> 	at org.apache.solr.servlet.SolrDispatchFilter.doFilter(SolrDispatchFilter.java:289)
[junit4:junit4]   2> 	at org.eclipse.jetty.servlet.ServletHandler$CachedChain.doFilter(ServletHandler.java:1337)
[junit4:junit4]   2> 	at org.eclipse.jetty.servlet.ServletHandler.doHandle(ServletHandler.java:484)
[junit4:junit4]   2> 	at org.eclipse.jetty.server.session.SessionHandler.doHandle(SessionHandler.java:231)
[junit4:junit4]   2> 	at org.eclipse.jetty.server.handler.ScopedHandler.handle(ScopedHandler.java:119)
[junit4:junit4]   2> 	at org.eclipse.jetty.server.handler.GzipHandler.handle(GzipHandler.java:267)
[junit4:junit4]   2> 	at org.eclipse.jetty.server.handler.ContextHandler.doHandle(ContextHandler.java:1067)
[junit4:junit4]   2> 	at org.eclipse.jetty.servlet.ServletHandler.doScope(ServletHandler.java:413)
[junit4:junit4]   2> 	at org.eclipse.jetty.server.session.SessionHandler.doScope(SessionHandler.java:192)
[junit4:junit4]   2> 	at org.eclipse.jetty.server.handler.ContextHandler.doScope(ContextHandler.java:999)
[junit4:junit4]   2> 	at org.eclipse.jetty.server.handler.ScopedHandler.handle(ScopedHandler.java:117)
[junit4:junit4]   2> 	at org.eclipse.jetty.server.handler.HandlerWrapper.handle(HandlerWrapper.java:111)
[junit4:junit4]   2> 	at org.eclipse.jetty.server.Server.handle(Server.java:351)
[junit4:junit4]   2> 	at org.eclipse.jetty.server.AbstractHttpConnection.handleRequest(AbstractHttpConnection.java:454)
[junit4:junit4]   2> 	at org.eclipse.jetty.server.AbstractHttpConnection.headerComplete(AbstractHttpConnection.java:890)
[junit4:junit4]   2> 	at org.eclipse.jetty.server.AbstractHttpConnection$RequestHandler.headerComplete(AbstractHttpConnection.java:944)
[junit4:junit4]   2> 	at org.eclipse.jetty.http.HttpParser.parseNext(HttpParser.java:634)
[junit4:junit4]   2> 	at org.eclipse.jetty.http.HttpParser.parseAvailable(HttpParser.java:230)
[junit4:junit4]   2> 	at org.eclipse.jetty.server.BlockingHttpConnection.handle(BlockingHttpConnection.java:66)
[junit4:junit4]   2> 	at org.eclipse.jetty.server.bio.SocketConnector$ConnectorEndPoint.run(SocketConnector.java:254)
[junit4:junit4]   2> 	at org.eclipse.jetty.util.thread.QueuedThreadPool.runJob(QueuedThreadPool.java:599)
[junit4:junit4]   2> 	at org.eclipse.jetty.util.thread.QueuedThreadPool$3.run(QueuedThreadPool.java:534)
[junit4:junit4]   2> 	at java.lang.Thread.run(Thread.java:777)
[junit4:junit4]   2> 
[junit4:junit4]   2> 2064 T2119 C128 oasr.BinaryResponseWriter$Resolver.getDoc WARNING Error reading a field from document : SolrDocument{id=7} java.lang.NullPointerException
[junit4:junit4]   2> 	at org.apache.solr.util.NumberUtils.SortableStr2int(NumberUtils.java:162)
[junit4:junit4]   2> 	at org.apache.solr.schema.SortableIntField.toObject(SortableIntField.java:96)
[junit4:junit4]   2> 	at org.apache.solr.schema.SortableIntField.toObject(SortableIntField.java:55)
[junit4:junit4]   2> 	at org.apache.solr.response.BinaryResponseWriter$Resolver.getValue(BinaryResponseWriter.java:218)
[junit4:junit4]   2> 	at org.apache.solr.response.BinaryResponseWriter$Resolver.getDoc(BinaryResponseWriter.java:181)
[junit4:junit4]   2> 	at org.apache.solr.response.BinaryResponseWriter$Resolver.writeResultsBody(BinaryResponseWriter.java:142)
[junit4:junit4]   2> 	at org.apache.solr.response.BinaryResponseWriter$Resolver.writeResults(BinaryResponseWriter.java:168)
[junit4:junit4]   2> 	at org.apache.solr.response.BinaryResponseWriter$Resolver.resolve(BinaryResponseWriter.java:87)
[junit4:junit4]   2> 	at org.apache.solr.common.util.JavaBinCodec.writeVal(JavaBinCodec.java:154)
[junit4:junit4]   2> 	at org.apache.solr.common.util.JavaBinCodec.writeNamedList(JavaBinCodec.java:144)
[junit4:junit4]   2> 	at org.apache.solr.common.util.JavaBinCodec.writeKnownType(JavaBinCodec.java:234)
[junit4:junit4]   2> 	at org.apache.solr.common.util.JavaBinCodec.writeVal(JavaBinCodec.java:149)
[junit4:junit4]   2> 	at org.apache.solr.common.util.JavaBinCodec.writeArray(JavaBinCodec.java:434)
[junit4:junit4]   2> 	at org.apache.solr.common.util.JavaBinCodec.writeKnownType(JavaBinCodec.java:242)
[junit4:junit4]   2> 	at org.apache.solr.common.util.JavaBinCodec.writeVal(JavaBinCodec.java:149)
[junit4:junit4]   2> 	at org.apache.solr.common.util.JavaBinCodec.writeNamedList(JavaBinCodec.java:144)
[junit4:junit4]   2> 	at org.apache.solr.common.util.JavaBinCodec.writeKnownType(JavaBinCodec.java:234)
[junit4:junit4]   2> 	at org.apache.solr.common.util.JavaBinCodec.writeVal(JavaBinCodec.java:149)
[junit4:junit4]   2> 	at org.apache.solr.common.util.JavaBinCodec.writeNamedList(JavaBinCodec.java:144)
[junit4:junit4]   2> 	at org.apache.solr.common.util.JavaBinCodec.writeKnownType(JavaBinCodec.java:234)
[junit4:junit4]   2> 	at org.apache.solr.common.util.JavaBinCodec.writeVal(JavaBinCodec.java:149)
[junit4:junit4]   2> 	at org.apache.solr.common.util.JavaBinCodec.writeNamedList(JavaBinCodec.java:144)
[junit4:junit4]   2> 	at org.apache.solr.common.util.JavaBinCodec.writeKnownType(JavaBinCodec.java:234)
[junit4:junit4]   2> 	at org.apache.solr.common.util.JavaBinCodec.writeVal(JavaBinCodec.java:149)
[junit4:junit4]   2> 	at org.apache.solr.common.util.JavaBinCodec.marshal(JavaBinCodec.java:92)
[junit4:junit4]   2> 	at org.apache.solr.response.BinaryResponseWriter.write(BinaryResponseWriter.java:49)
[junit4:junit4]   2> 	at org.apache.solr.servlet.SolrDispatchFilter.writeResponse(SolrDispatchFilter.java:404)
[junit4:junit4]   2> 	at org.apache.solr.servlet.SolrDispatchFilter.doFilter(SolrDispatchFilter.java:289)
[junit4:junit4]   2> 	at org.eclipse.jetty.servlet.ServletHandler$CachedChain.doFilter(ServletHandler.java:1337)
[junit4:junit4]   2> 	at org.eclipse.jetty.servlet.ServletHandler.doHandle(ServletHandler.java:484)
[junit4:junit4]   2> 	at org.eclipse.jetty.server.session.SessionHandler.doHandle(SessionHandler.java:231)
[junit4:junit4]   2> 	at org.eclipse.jetty.server.handler.ScopedHandler.handle(ScopedHandler.java:119)
[junit4:junit4]   2> 	at org.eclipse.jetty.server.handler.GzipHandler.handle(GzipHandler.java:267)
[junit4:junit4]   2> 	at org.eclipse.jetty.server.handler.ContextHandler.doHandle(ContextHandler.java:1067)
[junit4:junit4]   2> 	at org.eclipse.jetty.servlet.ServletHandler.doScope(ServletHandler.java:413)
[junit4:junit4]   2> 	at org.eclipse.jetty.server.session.SessionHandler.doScope(SessionHandler.java:192)
[junit4:junit4]   2> 	at org.eclipse.jetty.server.handler.ContextHandler.doScope(ContextHandler.java:999)
[junit4:junit4]   2> 	at org.eclipse.jetty.server.handler.ScopedHandler.handle(ScopedHandler.java:117)
[junit4:junit4]   2> 	at org.eclipse.jetty.server.handler.HandlerWrapper.handle(HandlerWrapper.java:111)
[junit4:junit4]   2> 	at org.eclipse.jetty.server.Server.handle(Server.java:351)
[junit4:junit4]   2> 	at org.eclipse.jetty.server.AbstractHttpConnection.handleRequest(AbstractHttpConnection.java:454)
[junit4:junit4]   2> 	at org.eclipse.jetty.server.AbstractHttpConnection.headerComplete(AbstractHttpConnection.java:890)
[junit4:junit4]   2> 	at org.eclipse.jetty.server.AbstractHttpConnection$RequestHandler.headerComplete(AbstractHttpConnection.java:944)
[junit4:junit4]   2> 	at org.eclipse.jetty.http.HttpParser.parseNext(HttpParser.java:634)
[junit4:junit4]   2> 	at org.eclipse.jetty.http.HttpParser.parseAvailable(HttpParser.java:230)
[junit4:junit4]   2> 	at org.eclipse.jetty.server.BlockingHttpConnection.handle(BlockingHttpConnection.java:66)
[junit4:junit4]   2> 	at org.eclipse.jetty.server.bio.SocketConnector$ConnectorEndPoint.run(SocketConnector.java:254)
[junit4:junit4]   2> 	at org.eclipse.jetty.util.thread.QueuedThreadPool.runJob(QueuedThreadPool.java:599)
[junit4:junit4]   2> 	at org.eclipse.jetty.util.thread.QueuedThreadPool$3.run(QueuedThreadPool.java:534)
[junit4:junit4]   2> 	at java.lang.Thread.run(Thread.java:777)
[junit4:junit4]   2> 
[junit4:junit4]   2> 2072 T2130 C129 oasc.SolrException.log SEVERE java.lang.NullPointerException
[junit4:junit4]   2> 		at org.apache.solr.util.NumberUtils.SortableStr2int(NumberUtils.java:162)
[junit4:junit4]   2> 		at org.apache.solr.schema.SortableIntField.toObject(SortableIntField.java:96)
[junit4:junit4]   2> 		at org.apache.solr.schema.SortableIntField.toObject(SortableIntField.java:55)
[junit4:junit4]   2> 		at org.apache.solr.search.grouping.distributed.shardresultserializer.SearchGroupsResultTransformer.serializeSearchGroup(SearchGroupsResultTransformer.java:113)
[junit4:junit4]   2> 		at org.apache.solr.search.grouping.distributed.shardresultserializer.SearchGroupsResultTransformer.transform(SearchGroupsResultTransformer.java:60)
[junit4:junit4]   2> 		at org.apache.solr.search.grouping.distributed.shardresultserializer.SearchGroupsResultTransformer.transform(SearchGroupsResultTransformer.java:39)
[junit4:junit4]   2> 		at org.apache.solr.search.grouping.CommandHandler.processResult(CommandHandler.java:187)
[junit4:junit4]   2> 		at org.apache.solr.handler.component.QueryComponent.process(QueryComponent.java:290)
[junit4:junit4]   2> 		at org.apache.solr.handler.component.SearchHandler.handleRequestBody(SearchHandler.java:206)
[junit4:junit4]   2> 		at org.apache.solr.handler.RequestHandlerBase.handleRequest(RequestHandlerBase.java:129)
[junit4:junit4]   2> 		at org.apache.solr.core.SolrCore.execute(SolrCore.java:1701)
[junit4:junit4]   2> 		at org.apache.solr.servlet.SolrDispatchFilter.execute(SolrDispatchFilter.java:455)
[junit4:junit4]   2> 		at org.apache.solr.servlet.SolrDispatchFilter.doFilter(SolrDispatchFilter.java:276)
[junit4:junit4]   2> 		at org.eclipse.jetty.servlet.ServletHandler$CachedChain.doFilter(ServletHandler.java:1337)
[junit4:junit4]   2> 		at org.eclipse.jetty.servlet.ServletHandler.doHandle(ServletHandler.java:484)
[junit4:junit4]   2> 		at org.eclipse.jetty.server.session.SessionHandler.doHandle(SessionHandler.java:231)
[junit4:junit4]   2> 		at org.eclipse.jetty.server.handler.ScopedHandler.handle(ScopedHandler.java:119)
[junit4:junit4]   2> 		at org.eclipse.jetty.server.handler.GzipHandler.handle(GzipHandler.java:267)
[junit4:junit4]   2> 		at org.eclipse.jetty.server.handler.ContextHandler.doHandle(ContextHandler.java:1067)
[junit4:junit4]   2> 		at org.eclipse.jetty.servlet.ServletHandler.doScope(ServletHandler.java:413)
[junit4:junit4]   2> 		at org.eclipse.jetty.server.session.SessionHandler.doScope(SessionHandler.java:192)
[junit4:junit4]   2> 		at org.eclipse.jetty.server.handler.ContextHandler.doScope(ContextHandler.java:999)
[junit4:junit4]   2> 		at org.eclipse.jetty.server.handler.ScopedHandler.handle(ScopedHandler.java:117)
[junit4:junit4]   2> 		at org.eclipse.jetty.server.handler.HandlerWrapper.handle(HandlerWrapper.java:111)
[junit4:junit4]   2> 		at org.eclipse.jetty.server.Server.handle(Server.java:351)
[junit4:junit4]   2> 		at org.eclipse.jetty.server.AbstractHttpConnection.handleRequest(AbstractHttpConnection.java:454)
[junit4:junit4]   2> 		at org.eclipse.jetty.server.AbstractHttpConnection.content(AbstractHttpConnection.java:900)
[junit4:junit4]   2> 		at org.eclipse.jetty.server.AbstractHttpConnection$RequestHandler.content(AbstractHttpConnection.java:954)
[junit4:junit4]   2> 		at org.eclipse.jetty.http.HttpParser.parseNext(HttpParser.java:857)
[junit4:junit4]   2> 		at org.eclipse.jetty.http.HttpParser.parseAvailable(HttpParser.java:235)
[junit4:junit4]   2> 		at org.eclipse.jetty.server.BlockingHttpConnection.handle(BlockingHttpConnection.java:66)
[junit4:junit4]   2> 		at org.eclipse.jetty.server.bio.SocketConnector$ConnectorEndPoint.run(SocketConnector.java:254)
[junit4:junit4]   2> 		at org.eclipse.jetty.util.thread.QueuedThreadPool.runJob(QueuedThreadPool.java:599)
[junit4:junit4]   2> 		at org.eclipse.jetty.util.thread.QueuedThreadPool$3.run(QueuedThreadPool.java:534)
[junit4:junit4]   2> 		at java.lang.Thread.run(Thread.java:777)
[junit4:junit4]   2> 	
[junit4:junit4]   2> 2073 T2130 C129 REQ [collection1] webapp=/solr path=/select params={start=0&distrib=false&fl=id&group.field=a_si&group.limit=10&q=*:*&isShard=true&group.distributed.first=true&NOW=1347362589808&version=2&rows=100&wt=javabin&sort=a_si+asc,+id+asc&group=true&shard.url=localhost:44277/solr} status=500 QTime=4 
[junit4:junit4]   2> 2074 T2130 C129 oasc.SolrException.log SEVERE null:java.lang.NullPointerException
[junit4:junit4]   2> 		at org.apache.solr.util.NumberUtils.SortableStr2int(NumberUtils.java:162)
[junit4:junit4]   2> 		at org.apache.solr.schema.SortableIntField.toObject(SortableIntField.java:96)
[junit4:junit4]   2> 		at org.apache.solr.schema.SortableIntField.toObject(SortableIntField.java:55)
[junit4:junit4]   2> 		at org.apache.solr.search.grouping.distributed.shardresultserializer.SearchGroupsResultTransformer.serializeSearchGroup(SearchGroupsResultTransformer.java:113)
[junit4:junit4]   2> 		at org.apache.solr.search.grouping.distributed.shardresultserializer.SearchGroupsResultTransformer.transform(SearchGroupsResultTransformer.java:60)
[junit4:junit4]   2> 		at org.apache.solr.search.grouping.distributed.shardresultserializer.SearchGroupsResultTransformer.transform(SearchGroupsResultTransformer.java:39)
[junit4:junit4]   2> 		at org.apache.solr.search.grouping.CommandHandler.processResult(CommandHandler.java:187)
[junit4:junit4]   2> 		at org.apache.solr.handler.component.QueryComponent.process(QueryComponent.java:290)
[junit4:junit4]   2> 		at org.apache.solr.handler.component.SearchHandler.handleRequestBody(SearchHandler.java:206)
[junit4:junit4]   2> 		at org.apache.solr.handler.RequestHandlerBase.handleRequest(RequestHandlerBase.java:129)
[junit4:junit4]   2> 		at org.apache.solr.core.SolrCore.execute(SolrCore.java:1701)
[junit4:junit4]   2> 		at org.apache.solr.servlet.SolrDispatchFilter.execute(SolrDispatchFilter.java:455)
[junit4:junit4]   2> 		at org.apache.solr.servlet.SolrDispatchFilter.doFilter(SolrDispatchFilter.java:276)
[junit4:junit4]   2> 		at org.eclipse.jetty.servlet.ServletHandler$CachedChain.doFilter(ServletHandler.java:1337)
[junit4:junit4]   2> 		at org.eclipse.jetty.servlet.ServletHandler.doHandle(ServletHandler.java:484)
[junit4:junit4]   2> 		at org.eclipse.jetty.server.session.SessionHandler.doHandle(SessionHandler.java:231)
[junit4:junit4]   2> 		at org.eclipse.jetty.server.handler.ScopedHandler.handle(ScopedHandler.java:119)
[junit4:junit4]   2> 		at org.eclipse.jetty.server.handler.GzipHandler.handle(GzipHandler.java:267)
[junit4:junit4]   2> 		at org.eclipse.jetty.server.handler.ContextHandler.doHandle(ContextHandler.java:1067)
[junit4:junit4]   2> 		at org.eclipse.jetty.servlet.ServletHandler.doScope(ServletHandler.java:413)
[junit4:junit4]   2> 		at org.eclipse.jetty.server.session.SessionHandler.doScope(SessionHandler.java:192)
[junit4:junit4]   2> 		at org.eclipse.jetty.server.handler.ContextHandler.doScope(ContextHandler.java:999)
[junit4:junit4]   2> 		at org.eclipse.jetty.server.handler.ScopedHandler.handle(ScopedHandler.java:117)
[junit4:junit4]   2> 		at org.eclipse.jetty.server.handler.HandlerWrapper.handle(HandlerWrapper.java:111)
[junit4:junit4]   2> 		at org.eclipse.jetty.server.Server.handle(Server.java:351)
[junit4:junit4]   2> 		at org.eclipse.jetty.server.AbstractHttpConnection.handleRequest(AbstractHttpConnection.java:454)
[junit4:junit4]   2> 		at org.eclipse.jetty.server.AbstractHttpConnection.content(AbstractHttpConnection.java:900)
[junit4:junit4]   2> 		at org.eclipse.jetty.server.AbstractHttpConnection$RequestHandler.content(AbstractHttpConnection.java:954)
[junit4:junit4]   2> 		at org.eclipse.jetty.http.HttpParser.parseNext(HttpParser.java:857)
[junit4:junit4]   2> 		at org.eclipse.jetty.http.HttpParser.parseAvailable(HttpParser.java:235)
[junit4:junit4]   2> 		at org.eclipse.jetty.server.BlockingHttpConnection.handle(BlockingHttpConnection.java:66)
[junit4:junit4]   2> 		at org.eclipse.jetty.server.bio.SocketConnector$ConnectorEndPoint.run(SocketConnector.java:254)
[junit4:junit4]   2> 		at org.eclipse.jetty.util.thread.QueuedThreadPool.runJob(QueuedThreadPool.java:599)
[junit4:junit4]   2> 		at org.eclipse.jetty.util.thread.QueuedThreadPool$3.run(QueuedThreadPool.java:534)
[junit4:junit4]   2> 		at java.lang.Thread.run(Thread.java:777)
[junit4:junit4]   2> 	
[junit4:junit4]   2> 2075 T2129 C129 oasc.SolrException.log SEVERE org.apache.solr.common.SolrException: Server at http://localhost:44277/solr returned non ok status:500, message:Server Error
[junit4:junit4]   2> 		at org.apache.solr.client.solrj.impl.HttpSolrServer.request(HttpSolrServer.java:373)
[junit4:junit4]   2> 		at org.apache.solr.client.solrj.impl.HttpSolrServer.request(HttpSolrServer.java:182)
[junit4:junit4]   2> 		at org.apache.solr.handler.component.HttpShardHandler$1.call(HttpShardHandler.java:166)
[junit4:junit4]   2> 		at org.apache.solr.handler.component.HttpShardHandler$1.call(HttpShardHandler.java:133)
[junit4:junit4]   2> 		at java.util.concurrent.FutureTask$Sync.innerRun(FutureTask.java:345)
[junit4:junit4]   2> 		at java.util.concurrent.FutureTask.run(FutureTask.java:177)
[junit4:junit4]   2> 		at java.util.concurrent.Executors$RunnableAdapter.call(Executors.java:482)
[junit4:junit4]   2> 		at java.util.concurrent.FutureTask$Sync.innerRun(FutureTask.java:345)
[junit4:junit4]   2> 		at java.util.concurrent.FutureTask.run(FutureTask.java:177)
[junit4:junit4]   2> 		at java.util.concurrent.ThreadPoolExecutor.runWorker(ThreadPoolExecutor.java:1121)
[junit4:junit4]   2> 		at java.util.concurrent.ThreadPoolExecutor$Worker.run(ThreadPoolExecutor.java:614)
[junit4:junit4]   2> 		at java.lang.Thread.run(Thread.java:777)
[junit4:junit4]   2> 	
[junit4:junit4]   2> 2075 T2129 C129 REQ [collection1] webapp=/solr path=/select params={q=*:*&shards=localhost:44277/solr&fl=id,a_si&version=2&rows=100&group.field=a_si&group.limit=10&wt=javabin&sort=a_si+asc,+id+asc&group=true} status=500 QTime=7 
[junit4:junit4]   2> 2076 T2129 C129 oasc.SolrException.log SEVERE null:org.apache.solr.common.SolrException: Server at http://localhost:44277/solr returned non ok status:500, message:Server Error
[junit4:junit4]   2> 		at org.apache.solr.client.solrj.impl.HttpSolrServer.request(HttpSolrServer.java:373)
[junit4:junit4]   2> 		at org.apache.solr.client.solrj.impl.HttpSolrServer.request(HttpSolrServer.java:182)
[junit4:junit4]   2> 		at org.apache.solr.handler.component.HttpShardHandler$1.call(HttpShardHandler.java:166)
[junit4:junit4]   2> 		at org.apache.solr.handler.component.HttpShardHandler$1.call(HttpShardHandler.java:133)
[junit4:junit4]   2> 		at java.util.concurrent.FutureTask$Sync.innerRun(FutureTask.java:345)
[junit4:junit4]   2> 		at java.util.concurrent.FutureTask.run(FutureTask.java:177)
[junit4:junit4]   2> 		at java.util.concurrent.Executors$RunnableAdapter.call(Executors.java:482)
[junit4:junit4]   2> 		at java.util.concurrent.FutureTask$Sync.innerRun(FutureTask.java:345)
[junit4:junit4]   2> 		at java.util.concurrent.FutureTask.run(FutureTask.java:177)
[junit4:junit4]   2> 		at java.util.concurrent.ThreadPoolExecutor.runWorker(ThreadPoolExecutor.java:1121)
[junit4:junit4]   2> 		at java.util.concurrent.ThreadPoolExecutor$Worker.run(ThreadPoolExecutor.java:614)
[junit4:junit4]   2> 		at java.lang.Thread.run(Thread.java:777)
[junit4:junit4]   2> 	
[junit4:junit4]   2> 2077 T2116 oasc.CoreContainer.shutdown Shutting down CoreContainer instance=-493072772
[junit4:junit4]   2> 2078 T2116 oasc.SolrCore.close [collection1]  CLOSING SolrCore org.apache.solr.core.SolrCore@4cb45089
[junit4:junit4]   2> 2084 T2116 oasc.SolrCore.closeSearcher [collection1] Closing main searcher on request.
[junit4:junit4]   2> 2085 T2116 oasu.DirectUpdateHandler2.close closing DirectUpdateHandler2{commits=2,autocommits=0,soft autocommits=0,optimizes=0,rollbacks=0,expungeDeletes=0,docsPending=0,adds=0,deletesById=0,deletesByQuery=0,errors=0,cumulative_adds=172,cumulative_deletesById=0,cumulative_deletesByQuery=1,cumulative_errors=0}
[junit4:junit4]   2> 2086 T2116 oasu.DefaultSolrCoreState.decref SolrCoreState ref count has reached 0 - closing IndexWriter
[junit4:junit4]   2> 2168 T2116 oasu.DefaultSolrCoreState.decref Closing SolrCoreState - canceling any ongoing recovery
[junit4:junit4]   2> 2169 T2116 oejsh.ContextHandler.doStop stopped o.e.j.s.ServletContextHandler{/solr,null}
[junit4:junit4]   2> 2220 T2116 oasc.CoreContainer.shutdown Shutting down CoreContainer instance=484371860
[junit4:junit4]   2> 2221 T2116 oasc.SolrCore.close [collection1]  CLOSING SolrCore org.apache.solr.core.SolrCore@9c70cd38
[junit4:junit4]   2> 2228 T2116 oasc.SolrCore.closeSearcher [collection1] Closing main searcher on request.
[junit4:junit4]   2> 2229 T2116 oasu.DirectUpdateHandler2.close closing DirectUpdateHandler2{commits=2,autocommits=0,soft autocommits=0,optimizes=0,rollbacks=0,expungeDeletes=0,docsPending=0,adds=0,deletesById=0,deletesByQuery=0,errors=0,cumulative_adds=172,cumulative_deletesById=0,cumulative_deletesByQuery=1,cumulative_errors=0}
[junit4:junit4]   2> 2230 T2116 oasu.DefaultSolrCoreState.decref SolrCoreState ref count has reached 0 - closing IndexWriter
[junit4:junit4]   2> 2285 T2116 oasu.DefaultSolrCoreState.decref Closing SolrCoreState - canceling any ongoing recovery
[junit4:junit4]   2> 2286 T2116 oejsh.ContextHandler.doStop stopped o.e.j.s.ServletContextHandler{/solr,null}
[junit4:junit4]   2> 2344 T2116 oas.SolrTestCaseJ4.tearDown ###Ending testDistribSearch
[junit4:junit4]   2> NOTE: reproduce with: ant test  -Dtestcase=TestDistributedGrouping -Dtests.method=testDistribSearch -Dtests.seed=98DB98944EE61084 -Dtests.multiplier=3 -Dtests.slow=true -Dtests.locale=ar_SA -Dtests.timezone=JST -Dtests.file.encoding=ISO-8859-1
[junit4:junit4] ERROR   2.36s J1 | TestDistributedGrouping.testDistribSearch <<<
[junit4:junit4]    > Throwable #1: org.apache.solr.common.SolrException: Server at http://localhost:44277/solr returned non ok status:500, message:Server Error
[junit4:junit4]    > 	at __randomizedtesting.SeedInfo.seed([98DB98944EE61084:193D168C39B970B8]:0)
[junit4:junit4]    > 	at org.apache.solr.client.solrj.impl.HttpSolrServer.request(HttpSolrServer.java:373)
[junit4:junit4]    > 	at org.apache.solr.client.solrj.impl.HttpSolrServer.request(HttpSolrServer.java:182)
[junit4:junit4]    > 	at org.apache.solr.client.solrj.request.QueryRequest.process(QueryRequest.java:90)
[junit4:junit4]    > 	at org.apache.solr.client.solrj.SolrServer.query(SolrServer.java:324)
[junit4:junit4]    > 	at org.apache.solr.BaseDistributedSearchTestCase.queryServer(BaseDistributedSearchTestCase.java:371)
[junit4:junit4]    > 	at org.apache.solr.BaseDistributedSearchTestCase.query(BaseDistributedSearchTestCase.java:390)
[junit4:junit4]    > 	at org.apache.solr.TestDistributedGrouping.doTest(TestDistributedGrouping.java:146)
[junit4:junit4]    > 	at org.apache.solr.BaseDistributedSearchTestCase.testDistribSearch(BaseDistributedSearchTestCase.java:697)
[junit4:junit4]    > 	at sun.reflect.NativeMethodAccessorImpl.invoke0(Native Method)
[junit4:junit4]    > 	at sun.reflect.NativeMethodAccessorImpl.invoke(NativeMethodAccessorImpl.java:88)
[junit4:junit4]    > 	at sun.reflect.DelegatingMethodAccessorImpl.invoke(DelegatingMethodAccessorImpl.java:55)
[junit4:junit4]    > 	at java.lang.reflect.Method.invoke(Method.java:613)
[junit4:junit4]    > 	at com.carrotsearch.randomizedtesting.RandomizedRunner.invoke(RandomizedRunner.java:1559)
[junit4:junit4]    > 	at com.carrotsearch.randomizedtesting.RandomizedRunner.access$600(RandomizedRunner.java:79)
[junit4:junit4]    > 	at com.carrotsearch.randomizedtesting.RandomizedRunner$6.evaluate(RandomizedRunner.java:737)
[junit4:junit4]    > 	at com.carrotsearch.randomizedtesting.RandomizedRunner$7.evaluate(RandomizedRunner.java:773)
[junit4:junit4]    > 	at com.carrotsearch.randomizedtesting.RandomizedRunner$8.evaluate(RandomizedRunner.java:787)
[junit4:junit4]    > 	at com.carrotsearch.randomizedtesting.rules.SystemPropertiesRestoreRule$1.evaluate(SystemPropertiesRestoreRule.java:53)
[junit4:junit4]    > 	at org.apache.lucene.util.TestRuleSetupTeardownChained$1.evaluate(TestRuleSetupTeardownChained.java:50)
[junit4:junit4]    > 	at org.apache.lucene.util.TestRuleFieldCacheSanity$1.evaluate(TestRuleFieldCacheSanity.java:51)
[junit4:junit4]    > 	at org.apache.lucene.util.AbstractBeforeAfterRule$1.evaluate(AbstractBeforeAfterRule.java:45)
[junit4:junit4]    > 	at com.carrotsearch.randomizedtesting.rules.SystemPropertiesInvariantRule$1.evaluate(SystemPropertiesInvariantRule.java:55)
[junit4:junit4]    > 	at org.apache.lucene.util.TestRuleThreadAndTestName$1.evaluate(TestRuleThreadAndTestName.java:48)
[junit4:junit4]    > 	at org.apache.lucene.util.TestRuleIgnoreAfterMaxFailures$1.evaluate(TestRuleIgnoreAfterMaxFailures.java:70)
[junit4:junit4]    > 	at org.apache.lucene.util.TestRuleMarkFailure$1.evaluate(TestRuleMarkFailure.java:48)
[junit4:junit4]    > 	at com.carrotsearch.randomizedtesting.rules.StatementAdapter.evaluate(StatementAdapter.java:36)
[junit4:junit4]    > 	at com.carrotsearch.randomizedtesting.ThreadLeakControl$StatementRunner.run(ThreadLeakControl.java:358)
[junit4:junit4]    > 	at com.carrotsearch.randomizedtesting.ThreadLeakControl.forkTimeoutingTask(ThreadLeakControl.java:782)
[junit4:junit4]    > 	at com.carrotsearch.randomizedtesting.ThreadLeakControl$3.evaluate(ThreadLeakControl.java:442)
[junit4:junit4]    > 	at com.carrotsearch.randomizedtesting.RandomizedRunner.runSingleTest(RandomizedRunner.java:746)
[junit4:junit4]    > 	at com.carrotsearch.randomizedtesting.RandomizedRunner$3.evaluate(RandomizedRunner.java:648)
[junit4:junit4]    > 	at com.carrotsearch.randomizedtesting.RandomizedRunner$4.evaluate(RandomizedRunner.java:682)
[junit4:junit4]    > 	at com.carrotsearch.randomizedtesting.RandomizedRunner$5.evaluate(RandomizedRunner.java:693)
[junit4:junit4]    > 	at com.carrotsearch.randomizedtesting.rules.StatementAdapter.evaluate(StatementAdapter.java:36)
[junit4:junit4]    > 	at com.carrotsearch.randomizedtesting.rules.SystemPropertiesRestoreRule$1.evaluate(SystemPropertiesRestoreRule.java:53)
[junit4:junit4]    > 	at org.apache.lucene.util.AbstractBeforeAfterRule$1.evaluate(AbstractBeforeAfterRule.java:45)
[junit4:junit4]    > 	at org.apache.lucene.util.TestRuleStoreClassName$1.evaluate(TestRuleStoreClassName.java:42)
[junit4:junit4]    > 	at com.carrotsearch.randomizedtesting.rules.SystemPropertiesInvariantRule$1.evaluate(SystemPropertiesInvariantRule.java:55)
[junit4:junit4]    > 	at com.carrotsearch.randomizedtesting.rules.NoShadowingOrOverridesOnMethodsRule$1.evaluate(NoShadowingOrOverridesOnMethodsRule.java:39)
[junit4:junit4]    > 	at com.carrotsearch.randomizedtesting.rules.NoShadowingOrOverridesOnMethodsRule$1.evaluate(NoShadowingOrOverridesOnMethodsRule.java:39)
[junit4:junit4]    > 	at org.apache.lucene.util.TestRuleAssertionsRequired$1.evaluate(TestRuleAssertionsRequired.java:40)
[junit4:junit4]    > 	at org.apache.lucene.util.TestRuleMarkFailure$1.evaluate(TestRuleMarkFailure.java:48)
[junit4:junit4]    > 	at org.apache.lucene.util.TestRuleIgnoreAfterMaxFailures$1.evaluate(TestRuleIgnoreAfterMaxFailures.java:70)
[junit4:junit4]    > 	at org.apache.lucene.util.TestRuleIgnoreTestSuites$1.evaluate(TestRuleIgnoreTestSuites.java:55)
[junit4:junit4]    > 	at com.carrotsearch.randomizedtesting.rules.StatementAdapter.evaluate(StatementAdapter.java:36)
[junit4:junit4]    > 	at com.carrotsearch.randomizedtesting.ThreadLeakControl$StatementRunner.run(ThreadLeakControl.java:358)
[junit4:junit4]    > 	at java.lang.Thread.run(Thread.java:777)
[junit4:junit4]   2> 2365 T2116 oas.SolrTestCaseJ4.deleteCore ###deleteCore
[junit4:junit4]   2> NOTE: test params are: codec=Lucene3x, sim=DefaultSimilarity, locale=ar_SA, timezone=JST
[junit4:junit4]   2> NOTE: Linux 3.2.0-29-generic amd64/IBM Corporation 1.7.0 (64-bit)/cpus=8,threads=1,free=113312080,total=269549568
[junit4:junit4]   2> NOTE: All tests run in this JVM: [LegacyHTMLStripCharFilterTest, ScriptEngineTest, BasicZkTest, ZkNodePropsTest, ZkCLITest, QueryParsingTest, TestQueryUtils, DocumentAnalysisRequestHandlerTest, TestCSVResponseWriter, SolrInfoMBeanTest, TestReversedWildcardFilterFactory, DOMUtilTest, TestUtils, BasicFunctionalityTest, RAMDirectoryFactoryTest, MultiTermTest, TestRemoteStreaming, XmlUpdateRequestHandlerTest, LeaderElectionTest, TestBM25SimilarityFactory, TestDFRSimilarityFactory, FileUtilsTest, URLClassifyProcessorTest, DistributedQueryElevationComponentTest, BadIndexSchemaTest, EchoParamsTest, FullSolrCloudDistribCmdsTest, XsltUpdateRequestHandlerTest, DirectUpdateHandlerTest, TestUpdate, TestHashPartitioner, TestReplicationHandler, DisMaxRequestHandlerTest, TermVectorComponentTest, TestJmxIntegration, ClusterStateTest, TestStressLucene, TestDocumentBuilder, IndexReaderFactoryTest, TestCSVLoader, TestTrie, SimplePostToolTest, TestSolrCoreProperties, DebugComponentTest, TestSolrDeletionPolicy2, SuggesterTest, SolrCoreTest, PingRequestHandlerTest, StandardRequestHandlerTest, QueryEqualityTest, TestCollationKeyRangeQueries, TestLRUCache, FieldMutatingUpdateProcessorTest, PrimitiveFieldTypeTest, BasicDistributedZkTest, OverseerTest, RecoveryZkTest, SpellCheckComponentTest, TestRealTimeGet, ZkControllerTest, TestDistributedGrouping]
[junit4:junit4] Completed on J1 in 2.38s, 1 test, 1 error <<< FAILURES!

[...truncated 1 lines...]
[junit4:junit4] Suite: org.apache.solr.TestDistributedSearch
[junit4:junit4]   2> 3 T2143 oas.SolrTestCaseJ4.setUp ###Starting testDistribSearch
[junit4:junit4]   2> 4 T2143 oejs.Server.doStart jetty-8.1.2.v20120308
[junit4:junit4]   2> 6 T2143 oejs.AbstractConnector.doStart Started SocketConnector@0.0.0.0:53842
[junit4:junit4]   2> 6 T2143 oasc.SolrResourceLoader.locateSolrHome JNDI not configured for solr (NoInitialContextEx)
[junit4:junit4]   2> 7 T2143 oasc.SolrResourceLoader.locateSolrHome using system property solr.solr.home: /mnt/ssd/jenkins/workspace/Lucene-Solr-4.x-Linux/solr/build/solr-core/test-files/solr
[junit4:junit4]   2> 7 T2143 oasc.SolrResourceLoader.<init> new SolrResourceLoader for deduced Solr Home: '/mnt/ssd/jenkins/workspace/Lucene-Solr-4.x-Linux/solr/build/solr-core/test-files/solr/'
[junit4:junit4]   2> 15 T2143 oass.SolrDispatchFilter.init SolrDispatchFilter.init()
[junit4:junit4]   2> 15 T2143 oasc.SolrResourceLoader.locateSolrHome JNDI not configured for solr (NoInitialContextEx)
[junit4:junit4]   2> 16 T2143 oasc.SolrResourceLoader.locateSolrHome using system property solr.solr.home: /mnt/ssd/jenkins/workspace/Lucene-Solr-4.x-Linux/solr/build/solr-core/test-files/solr
[junit4:junit4]   2> 16 T2143 oasc.CoreContainer$Initializer.initialize looking for solr.xml: /mnt/ssd/jenkins/workspace/Lucene-Solr-4.x-Linux/solr/build/solr-core/test-files/solr/solr.xml
[junit4:junit4]   2> 17 T2143 oasc.CoreContainer.<init> New CoreContainer 47340574
[junit4:junit4]   2> 17 T2143 oasc.CoreContainer.load Loading CoreContainer using Solr Home: '/mnt/ssd/jenkins/workspace/Lucene-Solr-4.x-Linux/solr/build/solr-core/test-files/solr/'
[junit4:junit4]   2> 18 T2143 oasc.SolrResourceLoader.<init> new SolrResourceLoader for directory: '/mnt/ssd/jenkins/workspace/Lucene-Solr-4.x-Linux/solr/build/solr-core/test-files/solr/'
[junit4:junit4]   2> 28 T2143 oasc.CoreContainer.load Registering Log Listener
[junit4:junit4]   2> 37 T2143 oasc.CoreContainer.create Creating SolrCore 'collection1' using instanceDir: /mnt/ssd/jenkins/workspace/Lucene-Solr-4.x-Linux/solr/build/solr-core/test-files/solr/collection1
[junit4:junit4]   2> 38 T2143 oasc.SolrResourceLoader.<init> new SolrResourceLoader for directory: '/mnt/ssd/jenkins/workspace/Lucene-Solr-4.x-Linux/solr/build/solr-core/test-files/solr/collection1/'
[junit4:junit4]   2> 39 T2143 oasc.SolrResourceLoader.replaceClassLoader Adding 'file:/mnt/ssd/jenkins/workspace/Lucene-Solr-4.x-Linux/solr/build/solr-core/test-files/solr/collection1/lib/README' to classloader
[junit4:junit4]   2> 40 T2143 oasc.SolrResourceLoader.replaceClassLoader Adding 'file:/mnt/ssd/jenkins/workspace/Lucene-Solr-4.x-Linux/solr/build/solr-core/test-files/solr/collection1/lib/classes/' to classloader
[junit4:junit4]   2> 62 T2143 oasc.SolrConfig.<init> Using Lucene MatchVersion: LUCENE_40
[junit4:junit4]   2> 94 T2143 oasc.SolrConfig.<init> Loaded SolrConfig: solrconfig.xml
[junit4:junit4]   2> 95 T2143 oass.IndexSchema.readSchema Reading Solr Schema
[junit4:junit4]   2> 99 T2143 oass.IndexSchema.readSchema Schema name=test
[junit4:junit4]   2> 379 T2143 oass.OpenExchangeRatesOrgProvider.init Initialized with rates=open-exchange-rates.json, refreshInterval=1440.
[junit4:junit4]   2> 384 T2143 oass.IndexSchema.readSchema default search field in schema is text
[junit4:junit4]   2> 387 T2143 oass.IndexSchema.readSchema unique key field: id
[junit4:junit4]   2> 391 T2143 oass.FileExchangeRateProvider.reload Reloading exchange rates from file currency.xml
[junit4:junit4]   2> 394 T2143 oass.FileExchangeRateProvider.reload Reloading exchange rates from file currency.xml
[junit4:junit4]   2> 397 T2143 oass.OpenExchangeRatesOrgProvider.reload Reloading exchange rates from open-exchange-rates.json
[junit4:junit4]   2> 398 T2143 oass.OpenExchangeRatesOrgProvider.reload Reloading exchange rates from open-exchange-rates.json
[junit4:junit4]   2> 399 T2143 oasc.SolrCore.<init> [collection1] Opening new SolrCore at /mnt/ssd/jenkins/workspace/Lucene-Solr-4.x-Linux/solr/build/solr-core/test-files/solr/collection1/, dataDir=./org.apache.solr.TestDistributedSearch-1347362590311/control/data/
[junit4:junit4]   2> 399 T2143 oasc.JmxMonitoredMap.<init> JMX monitoring is enabled. Adding Solr mbeans to JMX Server: com.sun.jmx.mbeanserver.JmxMBeanServer@f9453ca8
[junit4:junit4]   2> 400 T2143 oasc.SolrCore.getNewIndexDir WARNING New index directory detected: old=null new=./org.apache.solr.TestDistributedSearch-1347362590311/control/data/index/
[junit4:junit4]   2> 400 T2143 oasc.SolrCore.initIndex WARNING [collection1] Solr index directory './org.apache.solr.TestDistributedSearch-1347362590311/control/data/index' doesn't exist. Creating new index...
[junit4:junit4]   2> 402 T2143 oasc.CachingDirectoryFactory.get return new directory for /mnt/ssd/jenkins/workspace/Lucene-Solr-4.x-Linux/solr/build/solr-core/test/J1/./org.apache.solr.TestDistributedSearch-1347362590311/control/data/index forceNew:false
[junit4:junit4]   2> 404 T2143 oasc.SolrDeletionPolicy.onCommit SolrDeletionPolicy.onCommit: commits:num=1
[junit4:junit4]   2> 		commit{dir=MockDirWrapper(org.apache.lucene.store.SimpleFSDirectory@/mnt/ssd/jenkins/workspace/Lucene-Solr-4.x-Linux/solr/build/solr-core/test/J1/index3561135617tmp lockFactory=org.apache.lucene.store.NativeFSLockFactory@abdc77d1),segFN=segments_1,generation=1,filenames=[segments_1]
[junit4:junit4]   2> 405 T2143 oasc.SolrDeletionPolicy.updateCommits newest commit = 1
[junit4:junit4]   2> 405 T2143 oasc.SolrCore.initWriters created xml: solr.XMLResponseWriter
[junit4:junit4]   2> 406 T2143 oasup.UpdateRequestProcessorChain.init inserting DistributedUpdateProcessorFactory into updateRequestProcessorChain "dedupe"
[junit4:junit4]   2> 407 T2143 oasup.UpdateRequestProcessorChain.init inserting DistributedUpdateProcessorFactory into updateRequestProcessorChain "dedupe-allfields"
[junit4:junit4]   2> 408 T2143 oasup.UpdateRequestProcessorChain.init inserting DistributedUpdateProcessorFactory into updateRequestProcessorChain "stored_sig"
[junit4:junit4]   2> 408 T2143 oasup.UpdateRequestProcessorChain.init inserting DistributedUpdateProcessorFactory into updateRequestProcessorChain "uniq-fields"
[junit4:junit4]   2> 409 T2143 oasup.UpdateRequestProcessorChain.init inserting DistributedUpdateProcessorFactory into updateRequestProcessorChain "distrib-dup-test-chain-implicit"
[junit4:junit4]   2> 409 T2143 oasc.RequestHandlers.initHandlersFromConfig adding lazy requestHandler: solr.ReplicationHandler
[junit4:junit4]   2> 410 T2143 oasc.RequestHandlers.initHandlersFromConfig created /replication: solr.ReplicationHandler
[junit4:junit4]   2> 410 T2143 oasc.RequestHandlers.initHandlersFromConfig created standard: solr.StandardRequestHandler
[junit4:junit4]   2> 411 T2143 oasc.RequestHandlers.initHandlersFromConfig created /get: solr.RealTimeGetHandler
[junit4:junit4]   2> 411 T2143 oasc.RequestHandlers.initHandlersFromConfig created dismax: solr.SearchHandler
[junit4:junit4]   2> 412 T2143 oasc.RequestHandlers.initHandlersFromConfig created mock: org.apache.solr.core.MockQuerySenderListenerReqHandler
[junit4:junit4]   2> 412 T2143 oasc.RequestHandlers.initHandlersFromConfig created /admin/: org.apache.solr.handler.admin.AdminHandlers
[junit4:junit4]   2> 413 T2143 oasc.RequestHandlers.initHandlersFromConfig created defaults: solr.StandardRequestHandler
[junit4:junit4]   2> 413 T2143 oasc.RequestHandlers.initHandlersFromConfig adding lazy requestHandler: solr.StandardRequestHandler
[junit4:junit4]   2> 414 T2143 oasc.RequestHandlers.initHandlersFromConfig created lazy: solr.StandardRequestHandler
[junit4:junit4]   2> 414 T2143 oasc.RequestHandlers.initHandlersFromConfig created /update: solr.UpdateRequestHandler
[junit4:junit4]   2> 415 T2143 oasc.RequestHandlers.initHandlersFromConfig created /terms: org.apache.solr.handler.component.SearchHandler
[junit4:junit4]   2> 415 T2143 oasc.RequestHandlers.initHandlersFromConfig created spellCheckCompRH: org.apache.solr.handler.component.SearchHandler
[junit4:junit4]   2> 416 T2143 oasc.RequestHandlers.initHandlersFromConfig created spellCheckCompRH_Direct: org.apache.solr.handler.component.SearchHandler
[junit4:junit4]   2> 416 T2143 oasc.RequestHandlers.initHandlersFromConfig created spellCheckWithWordbreak: org.apache.solr.handler.component.SearchHandler
[junit4:junit4]   2> 417 T2143 oasc.RequestHandlers.initHandlersFromConfig created spellCheckWithWordbreak_Direct: org.apache.solr.handler.component.SearchHandler
[junit4:junit4]   2> 418 T2143 oasc.RequestHandlers.initHandlersFromConfig created spellCheckCompRH1: org.apache.solr.handler.component.SearchHandler
[junit4:junit4]   2> 418 T2143 oasc.RequestHandlers.initHandlersFromConfig created tvrh: org.apache.solr.handler.component.SearchHandler
[junit4:junit4]   2> 419 T2143 oasc.RequestHandlers.initHandlersFromConfig created /mlt: solr.MoreLikeThisHandler
[junit4:junit4]   2> 419 T2143 oasc.RequestHandlers.initHandlersFromConfig created /debug/dump: solr.DumpRequestHandler
[junit4:junit4]   2> 420 T2143 oashl.XMLLoader.init xsltCacheLifetimeSeconds=60
[junit4:junit4]   2> 421 T2143 oasc.SolrCore.initDeprecatedSupport WARNING solrconfig.xml uses deprecated <admin/gettableFiles>, Please update your config to use the ShowFileRequestHandler.
[junit4:junit4]   2> 422 T2143 oasc.SolrCore.initDeprecatedSupport WARNING adding ShowFileRequestHandler with hidden files: [BAD-SCHEMA-NOT-INDEXED-BUT-TF.XML, SCHEMA-REQUIRED-FIELDS.XML, SOLRCONFIG-MASTER1-KEEPONEBACKUP.XML, BAD-SCHEMA-NONTEXT-ANALYZER.XML, SOLRCONFIG-PROPINJECT.XML, SOLRCONFIG-PROPINJECT-INDEXDEFAULT.XML, STOP-2.TXT, SCHEMA11.XML, BAD-SCHEMA-UNIQUEKEY-USES-DEFAULT.XML, SCHEMA15.XML, SOLRCONFIG-NATIVELOCK.XML, SCHEMA-SIM.XML, CONDITIONAL.UPDATEPROCESSOR.JS, BAD-SOLRCONFIG-MISSING-SCRIPTFILE.XML, SOLRCONFIG-SCRIPT-UPDATEPROCESSOR.XML, SOLRCONFIG-REPEATER.XML, SOLRCONFIG-SPELLCHECKER.XML, SOLRCONFIG-NOCACHE.XML, SCHEMA-CHARFILTERS.XML, SOLRCONFIG-SOLCOREPROPERTIES.XML, SOLRCONFIG_CODEC.XML, BAD-SCHEMA-EXTERNAL-FILEFIELD.XML, HYPHENATION.DTD, SCHEMA.XML, SOLRCONFIG-MERGEPOLICY.XML, TRIVIAL.UPDATEPROCESSOR1.JS, SOLRCONFIG-PHRASESUGGEST.XML, SOLRCONFIG-SLAVE1.XML, SOLRCONFIG-BASIC.XML, SCHEMA-LMJELINEKMERCER.XML, BAD-MP-SOLRCONFIG.XML, BAD-SCHEMA-DUP-FIELD.XML, BAD-SCHEMA-UNIQUEKEY-MULTIVALUED.XML, SOLRCONFIG-MASTER.XML, SOLRCONFIG-HIGHLIGHT.XML, SCHEMA-TFIDF.XML, SCHEMA-REPLICATION1.XML, SYNONYMS.TXT, SOLRCONFIG-ELEVATE.XML, STOPWITHBOM.TXT, SOLRCONFIG-QUERYSENDER.XML, WDFTYPES.TXT, SOLRCONFIG-DELPOLICY1.XML, BAD_SOLRCONFIG.XML, HUNSPELL-TEST.DIC, SCHEMA-NUMERIC.XML, SCHEMA-LUCENEMATCHVERSION.XML, KEEP-2.TXT, SCHEMA-STOP-KEEP.XML, SCHEMA-IB.XML, STOP-SNOWBALL.TXT, SOLRCONFIG-SLAVE.XML, BAD-SCHEMA-NOT-INDEXED-BUT-NORMS.XML, STOPWORDSWRONGENCODING.TXT, THROW.ERROR.ON.ADD.UPDATEPROCESSOR.JS, SOLRCONFIG-SPELLCHECKCOMPONENT.XML, STOPTYPES-1.TXT, SOLRCONFIG-TLOG.XML, COMPOUNDDICTIONARY.TXT, DA_COMPOUNDDICTIONARY.TXT, SOLRCONFIG-TERMINDEX.XML, BAD-SOLRCONFIG-INVALID-SCRIPTFILE.XML, SCHEMASURROUND.XML, OPEN-EXCHANGE-RATES.JSON, BAD-SCHEMA-DUP-FIELDTYPE.XML, PHRASESUGGEST.TXT, SOLRCONFIG-MASTER2.XML, OLD_SYNONYMS.TXT, BAD-SCHEMA-UNIQUEKEY-IS-COPYFIELD-DEST.XML, SCHEMA-NOT-REQUIRED-UNIQUE-KEY.XML, BAD-SCHEMA-CODEC-GLOBAL-VS-FT-MISMATCH.XML, SCHEMA-LMDIRICHLET.XML, SCHEMA-REVERSED.XML, BAD-SCHEMA-NOT-INDEXED-BUT-POS.XML, SCHEMA-FOLDING.XML, SOLRCONFIG-CACHING.XML, MAPPING-ISOLATIN1ACCENT.TXT, ADDFIELDS.UPDATEPROCESSOR.JS, SCHEMA-BM25.XML, STOP-1.TXT, SOLRCONFIG-ENABLEPLUGIN.XML, MISSING.FUNCTIONS.UPDATEPROCESSOR.JS, SCHEMA12.XML, SOLRCONFIG-TRANSFORMERS.XML, SCHEMA-COPYFIELD-TEST.XML, SOLRCONFIG-BASIC-LUCENEVERSION31.XML, BAD-SCHEMA-DUP-DYNAMICFIELD.XML, CURRENCY.XML, DA_UTF8.XML, MISSLEADING.EXTENSION.UPDATEPROCESSOR.JS.TXT, SOLRCONFIG-SOLR-749.XML, STOPWORDS.TXT, HUNSPELL-TEST.AFF, SOLRCONFIG_PERF.XML, SOLRCONFIG-SIMPLELOCK.XML, FRENCHARTICLES.TXT, SOLRCONFIG-LAZYWRITER.XML, SCHEMA-REPLICATION2.XML, SOLRCONFIG-XINCLUDE.XML, SCHEMA-SPELLCHECKER.XML, XSLT, SOLRCONFIG-DELPOLICY2.XML, TRIVIAL.UPDATEPROCESSOR0.JS, KEEP-1.TXT, SCHEMA-TRIE.XML, SCHEMA-BINARYFIELD.XML, SCHEMA-COLLATEFILTER.XML, BAD-SCHEMA-OMIT-TF-BUT-NOT-POS.XML, SCHEMA-MINIMAL.XML, STOPTYPES-2.TXT, STEMDICT.TXT, SCHEMA_CODEC.XML, ELEVATE.XML, SCHEMA-COLLATE.XML, PROTWORDS.TXT, SOLRCONFIG-REQHANDLER.INCL, SCHEMA-PHRASESUGGEST.XML, SCHEMA-DFR.XML, BAD-SCHEMA-ANALYZER-CLASS-AND-NESTED.XML, SOLRCONFIG-MASTER1.XML, SOLRCONFIG-FUNCTIONQUERY.XML, SOLRCONFIG-MASTER3.XML, SOLRCONFIG-UPDATE-PROCESSOR-CHAINS.XML, SOLRCONFIG-ALTDIRECTORY.XML, BAD-SCHEMA-SIM-GLOBAL-VS-FT-MISMATCH.XML, SOLRCONFIG-QUERYSENDER-NOQUERY.XML, BAD-SOLRCONFIG-BOGUS-SCRIPTENGINE-NAME.XML]
[junit4:junit4]   2> 425 T2143 oass.SolrIndexSearcher.<init> Opening Searcher@c58820e6 main
[junit4:junit4]   2> 425 T2143 oass.SolrIndexSearcher.getIndexDir WARNING WARNING: Directory impl does not support setting indexDir: org.apache.lucene.store.MockDirectoryWrapper
[junit4:junit4]   2> 426 T2143 oasu.CommitTracker.<init> Hard AutoCommit: disabled
[junit4:junit4]   2> 426 T2143 oasu.CommitTracker.<init> Soft AutoCommit: disabled
[junit4:junit4]   2> 427 T2143 oashc.SpellCheckComponent.inform Initializing spell checkers
[junit4:junit4]   2> 576 T2143 oass.DirectSolrSpellChecker.init init: {name=direct,classname=DirectSolrSpellChecker,field=lowerfilt,minQueryLength=3}
[junit4:junit4]   2> 591 T2143 oashc.HttpShardHandlerFactory.getParameter Setting socketTimeout to: 0
[junit4:junit4]   2> 592 T2143 oashc.HttpShardHandlerFactory.getParameter Setting urlScheme to: http://
[junit4:junit4]   2> 592 T2143 oashc.HttpShardHandlerFactory.getParameter Setting connTimeout to: 0
[junit4:junit4]   2> 592 T2143 oashc.HttpShardHandlerFactory.getParameter Setting maxConnectionsPerHost to: 20
[junit4:junit4]   2> 593 T2143 oashc.HttpShardHandlerFactory.getParameter Setting corePoolSize to: 0
[junit4:junit4]   2> 593 T2143 oashc.HttpShardHandlerFactory.getParameter Setting maximumPoolSize to: 2147483647
[junit4:junit4]   2> 594 T2143 oashc.HttpShardHandlerFactory.getParameter Setting maxThreadIdleTime to: 5
[junit4:junit4]   2> 594 T2143 oashc.HttpShardHandlerFactory.getParameter Setting sizeOfQueue to: -1
[junit4:junit4]   2> 595 T2143 oashc.HttpShardHandlerFactory.getParameter Setting fairnessPolicy to: false
[junit4:junit4]   2> 595 T2143 oascsi.HttpClientUtil.createClient Creating new http client, config:maxConnectionsPerHost=20&maxConnections=10000&socketTimeout=0&connTimeout=0&retry=false
[junit4:junit4]   2> 600 T2153 oasc.SolrCore.registerSearcher [collection1] Registered new searcher Searcher@c58820e6 main{StandardDirectoryReader(segments_1:1)}
[junit4:junit4]   2> 602 T2143 oasc.CoreContainer.register registering core: collection1
[junit4:junit4]   2> 603 T2143 oass.SolrDispatchFilter.init user.dir=/mnt/ssd/jenkins/workspace/Lucene-Solr-4.x-Linux/solr/build/solr-core/test/J1
[junit4:junit4]   2> 603 T2143 oass.SolrDispatchFilter.init SolrDispatchFilter.init() done
[junit4:junit4]   2> 604 T2143 oascsi.HttpClientUtil.createClient Creating new http client, config:maxConnections=128&maxConnectionsPerHost=32&followRedirects=false
[junit4:junit4]   2> 607 T2143 oejs.Server.doStart jetty-8.1.2.v20120308
[junit4:junit4]   2> 608 T2143 oejs.AbstractConnector.doStart Started SocketConnector@0.0.0.0:57506
[junit4:junit4]   2> 609 T2143 oasc.SolrResourceLoader.locateSolrHome JNDI not configured for solr (NoInitialContextEx)
[junit4:junit4]   2> 609 T2143 oasc.SolrResourceLoader.locateSolrHome using system property solr.solr.home: /mnt/ssd/jenkins/workspace/Lucene-Solr-4.x-Linux/solr/build/solr-core/test-files/solr
[junit4:junit4]   2> 609 T2143 oasc.SolrResourceLoader.<init> new SolrResourceLoader for deduced Solr Home: '/mnt/ssd/jenkins/workspace/Lucene-Solr-4.x-Linux/solr/build/solr-core/test-files/solr/'
[junit4:junit4]   2> 617 T2143 oass.SolrDispatchFilter.init SolrDispatchFilter.init()
[junit4:junit4]   2> 618 T2143 oasc.SolrResourceLoader.locateSolrHome JNDI not configured for solr (NoInitialContextEx)
[junit4:junit4]   2> 618 T2143 oasc.SolrResourceLoader.locateSolrHome using system property solr.solr.home: /mnt/ssd/jenkins/workspace/Lucene-Solr-4.x-Linux/solr/build/solr-core/test-files/solr
[junit4:junit4]   2> 619 T2143 oasc.CoreContainer$Initializer.initialize looking for solr.xml: /mnt/ssd/jenkins/workspace/Lucene-Solr-4.x-Linux/solr/build/solr-core/test-files/solr/solr.xml
[junit4:junit4]   2> 619 T2143 oasc.CoreContainer.<init> New CoreContainer 1189829493
[junit4:junit4]   2> 619 T2143 oasc.CoreContainer.load Loading CoreContainer using Solr Home: '/mnt/ssd/jenkins/workspace/Lucene-Solr-4.x-Linux/solr/build/solr-core/test-files/solr/'
[junit4:junit4]   2> 620 T2143 oasc.SolrResourceLoader.<init> new SolrResourceLoader for directory: '/mnt/ssd/jenkins/workspace/Lucene-Solr-4.x-Linux/solr/build/solr-core/test-files/solr/'
[junit4:junit4]   2> 630 T2143 oasc.CoreContainer.load Registering Log Listener
[junit4:junit4]   2> 639 T2143 oasc.CoreContainer.create Creating SolrCore 'collection1' using instanceDir: /mnt/ssd/jenkins/workspace/Lucene-Solr-4.x-Linux/solr/build/solr-core/test-files/solr/collection1
[junit4:junit4]   2> 640 T2143 oasc.SolrResourceLoader.<init> new SolrResourceLoader for directory: '/mnt/ssd/jenkins/workspace/Lucene-Solr-4.x-Linux/solr/build/solr-core/test-files/solr/collection1/'
[junit4:junit4]   2> 641 T2143 oasc.SolrResourceLoader.replaceClassLoader Adding 'file:/mnt/ssd/jenkins/workspace/Lucene-Solr-4.x-Linux/solr/build/solr-core/test-files/solr/collection1/lib/README' to classloader
[junit4:junit4]   2> 641 T2143 oasc.SolrResourceLoader.replaceClassLoader Adding 'file:/mnt/ssd/jenkins/workspace/Lucene-Solr-4.x-Linux/solr/build/solr-core/test-files/solr/collection1/lib/classes/' to classloader
[junit4:junit4]   2> 663 T2143 oasc.SolrConfig.<init> Using Lucene MatchVersion: LUCENE_40
[junit4:junit4]   2> 695 T2143 oasc.SolrConfig.<init> Loaded SolrConfig: solrconfig.xml
[junit4:junit4]   2> 696 T2143 oass.IndexSchema.readSchema Reading Solr Schema
[junit4:junit4]   2> 700 T2143 oass.IndexSchema.readSchema Schema name=test
[junit4:junit4]   2> 978 T2143 oass.OpenExchangeRatesOrgProvider.init Initialized with rates=open-exchange-rates.json, refreshInterval=1440.
[junit4:junit4]   2> 983 T2143 oass.IndexSchema.readSchema default search field in schema is text
[junit4:junit4]   2> 986 T2143 oass.IndexSchema.readSchema unique key field: id
[junit4:junit4]   2> 990 T2143 oass.FileExchangeRateProvider.reload Reloading exchange rates from file currency.xml
[junit4:junit4]   2> 993 T2143 oass.FileExchangeRateProvider.reload Reloading exchange rates from file currency.xml
[junit4:junit4]   2> 997 T2143 oass.OpenExchangeRatesOrgProvider.reload Reloading exchange rates from open-exchange-rates.json
[junit4:junit4]   2> 997 T2143 oass.OpenExchangeRatesOrgProvider.reload Reloading exchange rates from open-exchange-rates.json
[junit4:junit4]   2> 998 T2143 oasc.SolrCore.<init> [collection1] Opening new SolrCore at /mnt/ssd/jenkins/workspace/Lucene-Solr-4.x-Linux/solr/build/solr-core/test-files/solr/collection1/, dataDir=./org.apache.solr.TestDistributedSearch-1347362590311/shard0/data/
[junit4:junit4]   2> 999 T2143 oasc.JmxMonitoredMap.<init> JMX monitoring is enabled. Adding Solr mbeans to JMX Server: com.sun.jmx.mbeanserver.JmxMBeanServer@f9453ca8
[junit4:junit4]   2> 999 T2143 oasc.SolrCore.getNewIndexDir WARNING New index directory detected: old=null new=./org.apache.solr.TestDistributedSearch-1347362590311/shard0/data/index/
[junit4:junit4]   2> 1000 T2143 oasc.SolrCore.initIndex WARNING [collection1] Solr index directory './org.apache.solr.TestDistributedSearch-1347362590311/shard0/data/index' doesn't exist. Creating new index...
[junit4:junit4]   2> 1001 T2143 oasc.CachingDirectoryFactory.get return new directory for /mnt/ssd/jenkins/workspace/Lucene-Solr-4.x-Linux/solr/build/solr-core/test/J1/./org.apache.solr.TestDistributedSearch-1347362590311/shard0/data/index forceNew:false
[junit4:junit4]   2> 1003 T2143 oasc.SolrDeletionPolicy.onCommit SolrDeletionPolicy.onCommit: commits:num=1
[junit4:junit4]   2> 		commit{dir=MockDirWrapper(org.apache.lucene.store.RAMDirectory@8e18d257 lockFactory=org.apache.lucene.store.NativeFSLockFactory@c378ff22),segFN=segments_1,generation=1,filenames=[segments_1]
[junit4:junit4]   2> 1003 T2143 oasc.SolrDeletionPolicy.updateCommits newest commit = 1
[junit4:junit4]   2> 1004 T2143 oasc.SolrCore.initWriters created xml: solr.XMLResponseWriter
[junit4:junit4]   2> 1005 T2143 oasup.UpdateRequestProcessorChain.init inserting DistributedUpdateProcessorFactory into updateRequestProcessorChain "dedupe"
[junit4:junit4]   2> 1006 T2143 oasup.UpdateRequestProcessorChain.init inserting DistributedUpdateProcessorFactory into updateRequestProcessorChain "dedupe-allfields"
[junit4:junit4]   2> 1006 T2143 oasup.UpdateRequestProcessorChain.init inserting DistributedUpdateProcessorFactory into updateRequestProcessorChain "stored_sig"
[junit4:junit4]   2> 1007 T2143 oasup.UpdateRequestProcessorChain.init inserting DistributedUpdateProcessorFactory into updateRequestProcessorChain "uniq-fields"
[junit4:junit4]   2> 1007 T2143 oasup.UpdateRequestProcessorChain.init inserting DistributedUpdateProcessorFactory into updateRequestProcessorChain "distrib-dup-test-chain-implicit"
[junit4:junit4]   2> 1008 T2143 oasc.RequestHandlers.initHandlersFromConfig adding lazy requestHandler: solr.ReplicationHandler
[junit4:junit4]   2> 1009 T2143 oasc.RequestHandlers.initHandlersFromConfig created /replication: solr.ReplicationHandler
[junit4:junit4]   2> 1009 T2143 oasc.RequestHandlers.initHandlersFromConfig created standard: solr.StandardRequestHandler
[junit4:junit4]   2> 1010 T2143 oasc.RequestHandlers.initHandlersFromConfig created /get: solr.RealTimeGetHandler
[junit4:junit4]   2> 1010 T2143 oasc.RequestHandlers.initHandlersFromConfig created dismax: solr.SearchHandler
[junit4:junit4]   2> 1011 T2143 oasc.RequestHandlers.initHandlersFromConfig created mock: org.apache.solr.core.MockQuerySenderListenerReqHandler
[junit4:junit4]   2> 1011 T2143 oasc.RequestHandlers.initHandlersFromConfig created /admin/: org.apache.solr.handler.admin.AdminHandlers
[junit4:junit4]   2> 1012 T2143 oasc.RequestHandlers.initHandlersFromConfig created defaults: solr.StandardRequestHandler
[junit4:junit4]   2> 1012 T2143 oasc.RequestHandlers.initHandlersFromConfig adding lazy requestHandler: solr.StandardRequestHandler
[junit4:junit4]   2> 1013 T2143 oasc.RequestHandlers.initHandlersFromConfig created lazy: solr.StandardRequestHandler
[junit4:junit4]   2> 1014 T2143 oasc.RequestHandlers.initHandlersFromConfig created /update: solr.UpdateRequestHandler
[junit4:junit4]   2> 1014 T2143 oasc.RequestHandlers.initHandlersFromConfig created /terms: org.apache.solr.handler.component.SearchHandler
[junit4:junit4]   2> 1015 T2143 oasc.RequestHandlers.initHandlersFromConfig created spellCheckCompRH: org.apache.solr.handler.component.SearchHandler
[junit4:junit4]   2> 1015 T2143 oasc.RequestHandlers.initHandlersFromConfig created spellCheckCompRH_Direct: org.apache.solr.handler.component.SearchHandler
[junit4:junit4]   2> 1016 T2143 oasc.RequestHandlers.initHandlersFromConfig created spellCheckWithWordbreak: org.apache.solr.handler.component.SearchHandler
[junit4:junit4]   2> 1017 T2143 oasc.RequestHandlers.initHandlersFromConfig created spellCheckWithWordbreak_Direct: org.apache.solr.handler.component.SearchHandler
[junit4:junit4]   2> 1017 T2143 oasc.RequestHandlers.initHandlersFromConfig created spellCheckCompRH1: org.apache.solr.handler.component.SearchHandler
[junit4:junit4]   2> 1018 T2143 oasc.RequestHandlers.initHandlersFromConfig created tvrh: org.apache.solr.handler.component.SearchHandler
[junit4:junit4]   2> 1018 T2143 oasc.RequestHandlers.initHandlersFromConfig created /mlt: solr.MoreLikeThisHandler
[junit4:junit4]   2> 1019 T2143 oasc.RequestHandlers.initHandlersFromConfig created /debug/dump: solr.DumpRequestHandler
[junit4:junit4]   2> 1020 T2143 oashl.XMLLoader.init xsltCacheLifetimeSeconds=60
[junit4:junit4]   2> 1021 T2143 oasc.SolrCore.initDeprecatedSupport WARNING solrconfig.xml uses deprecated <admin/gettableFiles>, Please update your config to use the ShowFileRequestHandler.
[junit4:junit4]   2> 1022 T2143 oasc.SolrCore.initDeprecatedSupport WARNING adding ShowFileRequestHandler with hidden files: [BAD-SCHEMA-NOT-INDEXED-BUT-TF.XML, SCHEMA-REQUIRED-FIELDS.XML, SOLRCONFIG-MASTER1-KEEPONEBACKUP.XML, BAD-SCHEMA-NONTEXT-ANALYZER.XML, SOLRCONFIG-PROPINJECT.XML, SOLRCONFIG-PROPINJECT-INDEXDEFAULT.XML, STOP-2.TXT, SCHEMA11.XML, BAD-SCHEMA-UNIQUEKEY-USES-DEFAULT.XML, SCHEMA15.XML, SOLRCONFIG-NATIVELOCK.XML, SCHEMA-SIM.XML, CONDITIONAL.UPDATEPROCESSOR.JS, BAD-SOLRCONFIG-MISSING-SCRIPTFILE.XML, SOLRCONFIG-SCRIPT-UPDATEPROCESSOR.XML, SOLRCONFIG-REPEATER.XML, SOLRCONFIG-SPELLCHECKER.XML, SOLRCONFIG-NOCACHE.XML, SCHEMA-CHARFILTERS.XML, SOLRCONFIG-SOLCOREPROPERTIES.XML, SOLRCONFIG_CODEC.XML, BAD-SCHEMA-EXTERNAL-FILEFIELD.XML, HYPHENATION.DTD, SCHEMA.XML, SOLRCONFIG-MERGEPOLICY.XML, TRIVIAL.UPDATEPROCESSOR1.JS, SOLRCONFIG-PHRASESUGGEST.XML, SOLRCONFIG-SLAVE1.XML, SOLRCONFIG-BASIC.XML, SCHEMA-LMJELINEKMERCER.XML, BAD-MP-SOLRCONFIG.XML, BAD-SCHEMA-DUP-FIELD.XML, BAD-SCHEMA-UNIQUEKEY-MULTIVALUED.XML, SOLRCONFIG-MASTER.XML, SOLRCONFIG-HIGHLIGHT.XML, SCHEMA-TFIDF.XML, SCHEMA-REPLICATION1.XML, SYNONYMS.TXT, SOLRCONFIG-ELEVATE.XML, STOPWITHBOM.TXT, SOLRCONFIG-QUERYSENDER.XML, WDFTYPES.TXT, SOLRCONFIG-DELPOLICY1.XML, BAD_SOLRCONFIG.XML, HUNSPELL-TEST.DIC, SCHEMA-NUMERIC.XML, SCHEMA-LUCENEMATCHVERSION.XML, KEEP-2.TXT, SCHEMA-STOP-KEEP.XML, SCHEMA-IB.XML, STOP-SNOWBALL.TXT, SOLRCONFIG-SLAVE.XML, BAD-SCHEMA-NOT-INDEXED-BUT-NORMS.XML, STOPWORDSWRONGENCODING.TXT, THROW.ERROR.ON.ADD.UPDATEPROCESSOR.JS, SOLRCONFIG-SPELLCHECKCOMPONENT.XML, STOPTYPES-1.TXT, SOLRCONFIG-TLOG.XML, COMPOUNDDICTIONARY.TXT, DA_COMPOUNDDICTIONARY.TXT, SOLRCONFIG-TERMINDEX.XML, BAD-SOLRCONFIG-INVALID-SCRIPTFILE.XML, SCHEMASURROUND.XML, OPEN-EXCHANGE-RATES.JSON, BAD-SCHEMA-DUP-FIELDTYPE.XML, PHRASESUGGEST.TXT, SOLRCONFIG-MASTER2.XML, OLD_SYNONYMS.TXT, BAD-SCHEMA-UNIQUEKEY-IS-COPYFIELD-DEST.XML, SCHEMA-NOT-REQUIRED-UNIQUE-KEY.XML, BAD-SCHEMA-CODEC-GLOBAL-VS-FT-MISMATCH.XML, SCHEMA-LMDIRICHLET.XML, SCHEMA-REVERSED.XML, BAD-SCHEMA-NOT-INDEXED-BUT-POS.XML, SCHEMA-FOLDING.XML, SOLRCONFIG-CACHING.XML, MAPPING-ISOLATIN1ACCENT.TXT, ADDFIELDS.UPDATEPROCESSOR.JS, SCHEMA-BM25.XML, STOP-1.TXT, SOLRCONFIG-ENABLEPLUGIN.XML, MISSING.FUNCTIONS.UPDATEPROCESSOR.JS, SCHEMA12.XML, SOLRCONFIG-TRANSFORMERS.XML, SCHEMA-COPYFIELD-TEST.XML, SOLRCONFIG-BASIC-LUCENEVERSION31.XML, BAD-SCHEMA-DUP-DYNAMICFIELD.XML, CURRENCY.XML, DA_UTF8.XML, MISSLEADING.EXTENSION.UPDATEPROCESSOR.JS.TXT, SOLRCONFIG-SOLR-749.XML, STOPWORDS.TXT, HUNSPELL-TEST.AFF, SOLRCONFIG_PERF.XML, SOLRCONFIG-SIMPLELOCK.XML, FRENCHARTICLES.TXT, SOLRCONFIG-LAZYWRITER.XML, SCHEMA-REPLICATION2.XML, SOLRCONFIG-XINCLUDE.XML, SCHEMA-SPELLCHECKER.XML, XSLT, SOLRCONFIG-DELPOLICY2.XML, TRIVIAL.UPDATEPROCESSOR0.JS, KEEP-1.TXT, SCHEMA-TRIE.XML, SCHEMA-BINARYFIELD.XML, SCHEMA-COLLATEFILTER.XML, BAD-SCHEMA-OMIT-TF-BUT-NOT-POS.XML, SCHEMA-MINIMAL.XML, STOPTYPES-2.TXT, STEMDICT.TXT, SCHEMA_CODEC.XML, ELEVATE.XML, SCHEMA-COLLATE.XML, PROTWORDS.TXT, SOLRCONFIG-REQHANDLER.INCL, SCHEMA-PHRASESUGGEST.XML, SCHEMA-DFR.XML, BAD-SCHEMA-ANALYZER-CLASS-AND-NESTED.XML, SOLRCONFIG-MASTER1.XML, SOLRCONFIG-FUNCTIONQUERY.XML, SOLRCONFIG-MASTER3.XML, SOLRCONFIG-UPDATE-PROCESSOR-CHAINS.XML, SOLRCONFIG-ALTDIRECTORY.XML, BAD-SCHEMA-SIM-GLOBAL-VS-FT-MISMATCH.XML, SOLRCONFIG-QUERYSENDER-NOQUERY.XML, BAD-SOLRCONFIG-BOGUS-SCRIPTENGINE-NAME.XML]
[junit4:junit4]   2> 1024 T2143 oass.SolrIndexSearcher.<init> Opening Searcher@abf70781 main
[junit4:junit4]   2> 1024 T2143 oass.SolrIndexSearcher.getIndexDir WARNING WARNING: Directory impl does not support setting indexDir: org.apache.lucene.store.MockDirectoryWrapper
[junit4:junit4]   2> 1025 T2143 oasu.CommitTracker.<init> Hard AutoCommit: disabled
[junit4:junit4]   2> 1025 T2143 oasu.CommitTracker.<init> Soft AutoCommit: disabled
[junit4:junit4]   2> 1026 T2143 oashc.SpellCheckComponent.inform Initializing spell checkers
[junit4:junit4]   2> 1031 T2143 oass.DirectSolrSpellChecker.init init: {name=direct,classname=DirectSolrSpellChecker,field=lowerfilt,minQueryLength=3}
[junit4:junit4]   2> 1048 T2143 oashc.HttpShardHandlerFactory.getParameter Setting socketTimeout to: 0
[junit4:junit4]   2> 1048 T2143 oashc.HttpShardHandlerFactory.getParameter Setting urlScheme to: http://
[junit4:junit4]   2> 1049 T2143 oashc.HttpShardHandlerFactory.getParameter Setting connTimeout to: 0
[junit4:junit4]   2> 1049 T2143 oashc.HttpShardHandlerFactory.getParameter Setting maxConnectionsPerHost to: 20
[junit4:j

[...truncated too long message...]

recovery
[junit4:junit4]   2> NOTE: reproduce with: ant test  -Dtestcase=StatsComponentTest -Dtests.method=testStats -Dtests.seed=98DB98944EE61084 -Dtests.multiplier=3 -Dtests.slow=true -Dtests.locale=en_IE -Dtests.timezone=Asia/Vladivostok -Dtests.file.encoding=ISO-8859-1
[junit4:junit4] ERROR   0.42s J1 | StatsComponentTest.testStats <<<
[junit4:junit4]    > Throwable #1: java.lang.RuntimeException: Exception during query
[junit4:junit4]    > 	at __randomizedtesting.SeedInfo.seed([98DB98944EE61084:25AC12B263ADEA7]:0)
[junit4:junit4]    > 	at org.apache.solr.util.AbstractSolrTestCase.assertQ(AbstractSolrTestCase.java:283)
[junit4:junit4]    > 	at org.apache.solr.handler.component.StatsComponentTest.doTestFacetStatisticsResult(StatsComponentTest.java:239)
[junit4:junit4]    > 	at org.apache.solr.handler.component.StatsComponentTest.testStats(StatsComponentTest.java:68)
[junit4:junit4]    > 	at sun.reflect.NativeMethodAccessorImpl.invoke0(Native Method)
[junit4:junit4]    > 	at sun.reflect.NativeMethodAccessorImpl.invoke(NativeMethodAccessorImpl.java:88)
[junit4:junit4]    > 	at sun.reflect.DelegatingMethodAccessorImpl.invoke(DelegatingMethodAccessorImpl.java:55)
[junit4:junit4]    > 	at java.lang.reflect.Method.invoke(Method.java:613)
[junit4:junit4]    > 	at com.carrotsearch.randomizedtesting.RandomizedRunner.invoke(RandomizedRunner.java:1559)
[junit4:junit4]    > 	at com.carrotsearch.randomizedtesting.RandomizedRunner.access$600(RandomizedRunner.java:79)
[junit4:junit4]    > 	at com.carrotsearch.randomizedtesting.RandomizedRunner$6.evaluate(RandomizedRunner.java:737)
[junit4:junit4]    > 	at com.carrotsearch.randomizedtesting.RandomizedRunner$7.evaluate(RandomizedRunner.java:773)
[junit4:junit4]    > 	at com.carrotsearch.randomizedtesting.RandomizedRunner$8.evaluate(RandomizedRunner.java:787)
[junit4:junit4]    > 	at com.carrotsearch.randomizedtesting.rules.SystemPropertiesRestoreRule$1.evaluate(SystemPropertiesRestoreRule.java:53)
[junit4:junit4]    > 	at org.apache.lucene.util.TestRuleSetupTeardownChained$1.evaluate(TestRuleSetupTeardownChained.java:50)
[junit4:junit4]    > 	at org.apache.lucene.util.TestRuleFieldCacheSanity$1.evaluate(TestRuleFieldCacheSanity.java:51)
[junit4:junit4]    > 	at org.apache.lucene.util.AbstractBeforeAfterRule$1.evaluate(AbstractBeforeAfterRule.java:45)
[junit4:junit4]    > 	at com.carrotsearch.randomizedtesting.rules.SystemPropertiesInvariantRule$1.evaluate(SystemPropertiesInvariantRule.java:55)
[junit4:junit4]    > 	at org.apache.lucene.util.TestRuleThreadAndTestName$1.evaluate(TestRuleThreadAndTestName.java:48)
[junit4:junit4]    > 	at org.apache.lucene.util.TestRuleIgnoreAfterMaxFailures$1.evaluate(TestRuleIgnoreAfterMaxFailures.java:70)
[junit4:junit4]    > 	at org.apache.lucene.util.TestRuleMarkFailure$1.evaluate(TestRuleMarkFailure.java:48)
[junit4:junit4]    > 	at com.carrotsearch.randomizedtesting.rules.StatementAdapter.evaluate(StatementAdapter.java:36)
[junit4:junit4]    > 	at com.carrotsearch.randomizedtesting.ThreadLeakControl$StatementRunner.run(ThreadLeakControl.java:358)
[junit4:junit4]    > 	at com.carrotsearch.randomizedtesting.ThreadLeakControl.forkTimeoutingTask(ThreadLeakControl.java:782)
[junit4:junit4]    > 	at com.carrotsearch.randomizedtesting.ThreadLeakControl$3.evaluate(ThreadLeakControl.java:442)
[junit4:junit4]    > 	at com.carrotsearch.randomizedtesting.RandomizedRunner.runSingleTest(RandomizedRunner.java:746)
[junit4:junit4]    > 	at com.carrotsearch.randomizedtesting.RandomizedRunner$3.evaluate(RandomizedRunner.java:648)
[junit4:junit4]    > 	at com.carrotsearch.randomizedtesting.RandomizedRunner$4.evaluate(RandomizedRunner.java:682)
[junit4:junit4]    > 	at com.carrotsearch.randomizedtesting.RandomizedRunner$5.evaluate(RandomizedRunner.java:693)
[junit4:junit4]    > 	at com.carrotsearch.randomizedtesting.rules.StatementAdapter.evaluate(StatementAdapter.java:36)
[junit4:junit4]    > 	at com.carrotsearch.randomizedtesting.rules.SystemPropertiesRestoreRule$1.evaluate(SystemPropertiesRestoreRule.java:53)
[junit4:junit4]    > 	at org.apache.lucene.util.AbstractBeforeAfterRule$1.evaluate(AbstractBeforeAfterRule.java:45)
[junit4:junit4]    > 	at org.apache.lucene.util.TestRuleStoreClassName$1.evaluate(TestRuleStoreClassName.java:42)
[junit4:junit4]    > 	at com.carrotsearch.randomizedtesting.rules.SystemPropertiesInvariantRule$1.evaluate(SystemPropertiesInvariantRule.java:55)
[junit4:junit4]    > 	at com.carrotsearch.randomizedtesting.rules.NoShadowingOrOverridesOnMethodsRule$1.evaluate(NoShadowingOrOverridesOnMethodsRule.java:39)
[junit4:junit4]    > 	at com.carrotsearch.randomizedtesting.rules.NoShadowingOrOverridesOnMethodsRule$1.evaluate(NoShadowingOrOverridesOnMethodsRule.java:39)
[junit4:junit4]    > 	at org.apache.lucene.util.TestRuleAssertionsRequired$1.evaluate(TestRuleAssertionsRequired.java:40)
[junit4:junit4]    > 	at org.apache.lucene.util.TestRuleMarkFailure$1.evaluate(TestRuleMarkFailure.java:48)
[junit4:junit4]    > 	at org.apache.lucene.util.TestRuleIgnoreAfterMaxFailures$1.evaluate(TestRuleIgnoreAfterMaxFailures.java:70)
[junit4:junit4]    > 	at org.apache.lucene.util.TestRuleIgnoreTestSuites$1.evaluate(TestRuleIgnoreTestSuites.java:55)
[junit4:junit4]    > 	at com.carrotsearch.randomizedtesting.rules.StatementAdapter.evaluate(StatementAdapter.java:36)
[junit4:junit4]    > 	at com.carrotsearch.randomizedtesting.ThreadLeakControl$StatementRunner.run(ThreadLeakControl.java:358)
[junit4:junit4]    > 	at java.lang.Thread.run(Thread.java:777)
[junit4:junit4]    > Caused by: java.lang.NullPointerException
[junit4:junit4]    > 	at org.apache.solr.util.NumberUtils.SortableStr2int(NumberUtils.java:162)
[junit4:junit4]    > 	at org.apache.solr.schema.SortableIntField.toObject(SortableIntField.java:96)
[junit4:junit4]    > 	at org.apache.solr.schema.SortableIntField.toObject(SortableIntField.java:55)
[junit4:junit4]    > 	at org.apache.solr.schema.FieldType.toObject(FieldType.java:342)
[junit4:junit4]    > 	at org.apache.solr.handler.component.AbstractStatsValues.accumulate(StatsValuesFactory.java:129)
[junit4:junit4]    > 	at org.apache.solr.handler.component.SimpleStats.getFieldCacheStats(StatsComponent.java:281)
[junit4:junit4]    > 	at org.apache.solr.handler.component.SimpleStats.getStatsFields(StatsComponent.java:227)
[junit4:junit4]    > 	at org.apache.solr.handler.component.SimpleStats.getStatsCounts(StatsComponent.java:201)
[junit4:junit4]    > 	at org.apache.solr.handler.component.StatsComponent.process(StatsComponent.java:70)
[junit4:junit4]    > 	at org.apache.solr.handler.component.SearchHandler.handleRequestBody(SearchHandler.java:206)
[junit4:junit4]    > 	at org.apache.solr.handler.RequestHandlerBase.handleRequest(RequestHandlerBase.java:129)
[junit4:junit4]    > 	at org.apache.solr.core.SolrCore.execute(SolrCore.java:1701)
[junit4:junit4]    > 	at org.apache.solr.util.TestHarness.query(TestHarness.java:351)
[junit4:junit4]    > 	at org.apache.solr.util.TestHarness.query(TestHarness.java:333)
[junit4:junit4]    > 	at org.apache.solr.util.AbstractSolrTestCase.assertQ(AbstractSolrTestCase.java:273)
[junit4:junit4]    > 	... 41 more
[junit4:junit4]   2> NOTE: test params are: codec=Lucene3x, sim=DefaultSimilarity, locale=en_IE, timezone=Asia/Vladivostok
[junit4:junit4]   2> NOTE: Linux 3.2.0-29-generic amd64/IBM Corporation 1.7.0 (64-bit)/cpus=8,threads=1,free=27189992,total=269549568
[junit4:junit4]   2> NOTE: All tests run in this JVM: [LegacyHTMLStripCharFilterTest, ScriptEngineTest, BasicZkTest, ZkNodePropsTest, ZkCLITest, QueryParsingTest, TestQueryUtils, DocumentAnalysisRequestHandlerTest, TestCSVResponseWriter, SolrInfoMBeanTest, TestReversedWildcardFilterFactory, DOMUtilTest, TestUtils, BasicFunctionalityTest, RAMDirectoryFactoryTest, MultiTermTest, TestRemoteStreaming, XmlUpdateRequestHandlerTest, LeaderElectionTest, TestBM25SimilarityFactory, TestDFRSimilarityFactory, FileUtilsTest, URLClassifyProcessorTest, DistributedQueryElevationComponentTest, BadIndexSchemaTest, EchoParamsTest, FullSolrCloudDistribCmdsTest, XsltUpdateRequestHandlerTest, DirectUpdateHandlerTest, TestUpdate, TestHashPartitioner, TestReplicationHandler, DisMaxRequestHandlerTest, TermVectorComponentTest, TestJmxIntegration, ClusterStateTest, TestStressLucene, TestDocumentBuilder, IndexReaderFactoryTest, TestCSVLoader, TestTrie, SimplePostToolTest, TestSolrCoreProperties, DebugComponentTest, TestSolrDeletionPolicy2, SuggesterTest, SolrCoreTest, PingRequestHandlerTest, StandardRequestHandlerTest, QueryEqualityTest, TestCollationKeyRangeQueries, TestLRUCache, FieldMutatingUpdateProcessorTest, PrimitiveFieldTypeTest, BasicDistributedZkTest, OverseerTest, RecoveryZkTest, SpellCheckComponentTest, TestRealTimeGet, ZkControllerTest, TestDistributedGrouping, TestDistributedSearch, SpellCheckCollatorTest, SoftAutoCommitTest, AutoCommitTest, ZkSolrClientTest, StatsComponentTest]
[junit4:junit4] Completed on J1 in 2.61s, 7 tests, 1 error <<< FAILURES!

[...truncated 336 lines...]
BUILD FAILED
/mnt/ssd/jenkins/workspace/Lucene-Solr-4.x-Linux/build.xml:29: The following error occurred while executing this line:
/mnt/ssd/jenkins/workspace/Lucene-Solr-4.x-Linux/solr/build.xml:146: The following error occurred while executing this line:
/mnt/ssd/jenkins/workspace/Lucene-Solr-4.x-Linux/lucene/module-build.xml:63: The following error occurred while executing this line:
/mnt/ssd/jenkins/workspace/Lucene-Solr-4.x-Linux/lucene/common-build.xml:1133: The following error occurred while executing this line:
/mnt/ssd/jenkins/workspace/Lucene-Solr-4.x-Linux/lucene/common-build.xml:810: There were test failures: 229 suites, 924 tests, 3 errors, 1 failure, 7 ignored (2 assumptions)

Total time: 27 minutes 48 seconds
Build step 'Invoke Ant' marked build as failure
Recording test results
Description set: Java: 64bit/ibm-j9-jdk7 -Xjit:exclude={org/apache/lucene/util/fst/FST.pack(IIF)Lorg/apache/lucene/util/fst/FST;}
Email was triggered for: Failure
Sending email for trigger: Failure



Mime
View raw message