lucene-dev mailing list archives

Site index · List index
Message view « Date » · « Thread »
Top « Date » · « Thread »
From Apache Jenkins Server <jenk...@builds.apache.org>
Subject [JENKINS] Lucene-Solr-Tests-4.x-java7 - Build # 461 - Failure
Date Mon, 17 Sep 2012 06:30:14 GMT
Build: https://builds.apache.org/job/Lucene-Solr-Tests-4.x-java7/461/

2 tests failed.
REGRESSION:  org.apache.solr.cloud.BasicDistributedZk2Test.testDistribSearch

Error Message:
Shard still reported as live in zk

Stack Trace:
java.lang.AssertionError: Shard still reported as live in zk
	at __randomizedtesting.SeedInfo.seed([F0F9AAA1DF6E31:811677B2D6800E0D]:0)
	at org.junit.Assert.fail(Assert.java:93)
	at org.apache.solr.cloud.AbstractFullDistribZkTestBase.waitToSeeNotLive(AbstractFullDistribZkTestBase.java:1220)
	at org.apache.solr.cloud.BasicDistributedZk2Test.brindDownShardIndexSomeDocsAndRecover(BasicDistributedZk2Test.java:190)
	at org.apache.solr.cloud.BasicDistributedZk2Test.doTest(BasicDistributedZk2Test.java:83)
	at org.apache.solr.BaseDistributedSearchTestCase.testDistribSearch(BaseDistributedSearchTestCase.java:695)
	at sun.reflect.NativeMethodAccessorImpl.invoke0(Native Method)
	at sun.reflect.NativeMethodAccessorImpl.invoke(NativeMethodAccessorImpl.java:57)
	at sun.reflect.DelegatingMethodAccessorImpl.invoke(DelegatingMethodAccessorImpl.java:43)
	at java.lang.reflect.Method.invoke(Method.java:601)
	at com.carrotsearch.randomizedtesting.RandomizedRunner.invoke(RandomizedRunner.java:1559)
	at com.carrotsearch.randomizedtesting.RandomizedRunner.access$600(RandomizedRunner.java:79)
	at com.carrotsearch.randomizedtesting.RandomizedRunner$6.evaluate(RandomizedRunner.java:737)
	at com.carrotsearch.randomizedtesting.RandomizedRunner$7.evaluate(RandomizedRunner.java:773)
	at com.carrotsearch.randomizedtesting.RandomizedRunner$8.evaluate(RandomizedRunner.java:787)
	at com.carrotsearch.randomizedtesting.rules.SystemPropertiesRestoreRule$1.evaluate(SystemPropertiesRestoreRule.java:53)
	at org.apache.lucene.util.TestRuleSetupTeardownChained$1.evaluate(TestRuleSetupTeardownChained.java:50)
	at org.apache.lucene.util.TestRuleFieldCacheSanity$1.evaluate(TestRuleFieldCacheSanity.java:51)
	at org.apache.lucene.util.AbstractBeforeAfterRule$1.evaluate(AbstractBeforeAfterRule.java:45)
	at com.carrotsearch.randomizedtesting.rules.SystemPropertiesInvariantRule$1.evaluate(SystemPropertiesInvariantRule.java:55)
	at org.apache.lucene.util.TestRuleThreadAndTestName$1.evaluate(TestRuleThreadAndTestName.java:48)
	at org.apache.lucene.util.TestRuleIgnoreAfterMaxFailures$1.evaluate(TestRuleIgnoreAfterMaxFailures.java:70)
	at org.apache.lucene.util.TestRuleMarkFailure$1.evaluate(TestRuleMarkFailure.java:48)
	at com.carrotsearch.randomizedtesting.rules.StatementAdapter.evaluate(StatementAdapter.java:36)
	at com.carrotsearch.randomizedtesting.ThreadLeakControl$StatementRunner.run(ThreadLeakControl.java:358)
	at com.carrotsearch.randomizedtesting.ThreadLeakControl.forkTimeoutingTask(ThreadLeakControl.java:782)
	at com.carrotsearch.randomizedtesting.ThreadLeakControl$3.evaluate(ThreadLeakControl.java:442)
	at com.carrotsearch.randomizedtesting.RandomizedRunner.runSingleTest(RandomizedRunner.java:746)
	at com.carrotsearch.randomizedtesting.RandomizedRunner$3.evaluate(RandomizedRunner.java:648)
	at com.carrotsearch.randomizedtesting.RandomizedRunner$4.evaluate(RandomizedRunner.java:682)
	at com.carrotsearch.randomizedtesting.RandomizedRunner$5.evaluate(RandomizedRunner.java:693)
	at com.carrotsearch.randomizedtesting.rules.StatementAdapter.evaluate(StatementAdapter.java:36)
	at com.carrotsearch.randomizedtesting.rules.SystemPropertiesRestoreRule$1.evaluate(SystemPropertiesRestoreRule.java:53)
	at org.apache.lucene.util.AbstractBeforeAfterRule$1.evaluate(AbstractBeforeAfterRule.java:45)
	at org.apache.lucene.util.TestRuleStoreClassName$1.evaluate(TestRuleStoreClassName.java:42)
	at com.carrotsearch.randomizedtesting.rules.SystemPropertiesInvariantRule$1.evaluate(SystemPropertiesInvariantRule.java:55)
	at com.carrotsearch.randomizedtesting.rules.NoShadowingOrOverridesOnMethodsRule$1.evaluate(NoShadowingOrOverridesOnMethodsRule.java:39)
	at com.carrotsearch.randomizedtesting.rules.NoShadowingOrOverridesOnMethodsRule$1.evaluate(NoShadowingOrOverridesOnMethodsRule.java:39)
	at com.carrotsearch.randomizedtesting.rules.StatementAdapter.evaluate(StatementAdapter.java:36)
	at org.apache.lucene.util.TestRuleAssertionsRequired$1.evaluate(TestRuleAssertionsRequired.java:43)
	at org.apache.lucene.util.TestRuleMarkFailure$1.evaluate(TestRuleMarkFailure.java:48)
	at org.apache.lucene.util.TestRuleIgnoreAfterMaxFailures$1.evaluate(TestRuleIgnoreAfterMaxFailures.java:70)
	at org.apache.lucene.util.TestRuleIgnoreTestSuites$1.evaluate(TestRuleIgnoreTestSuites.java:55)
	at com.carrotsearch.randomizedtesting.rules.StatementAdapter.evaluate(StatementAdapter.java:36)
	at com.carrotsearch.randomizedtesting.ThreadLeakControl$StatementRunner.run(ThreadLeakControl.java:358)
	at java.lang.Thread.run(Thread.java:722)


REGRESSION:  org.apache.solr.cloud.SyncSliceTest.testDistribSearch

Error Message:
There are still nodes recoverying

Stack Trace:
java.lang.AssertionError: There are still nodes recoverying
	at __randomizedtesting.SeedInfo.seed([F0F9AAA1DF6E31:811677B2D6800E0D]:0)
	at org.junit.Assert.fail(Assert.java:93)
	at org.apache.solr.cloud.AbstractDistribZkTestBase.waitForRecoveriesToFinish(AbstractDistribZkTestBase.java:154)
	at org.apache.solr.cloud.AbstractFullDistribZkTestBase.waitForRecoveriesToFinish(AbstractFullDistribZkTestBase.java:560)
	at org.apache.solr.cloud.AbstractFullDistribZkTestBase.waitForThingsToLevelOut(AbstractFullDistribZkTestBase.java:1135)
	at org.apache.solr.cloud.SyncSliceTest.doTest(SyncSliceTest.java:162)
	at org.apache.solr.BaseDistributedSearchTestCase.testDistribSearch(BaseDistributedSearchTestCase.java:695)
	at sun.reflect.NativeMethodAccessorImpl.invoke0(Native Method)
	at sun.reflect.NativeMethodAccessorImpl.invoke(NativeMethodAccessorImpl.java:57)
	at sun.reflect.DelegatingMethodAccessorImpl.invoke(DelegatingMethodAccessorImpl.java:43)
	at java.lang.reflect.Method.invoke(Method.java:601)
	at com.carrotsearch.randomizedtesting.RandomizedRunner.invoke(RandomizedRunner.java:1559)
	at com.carrotsearch.randomizedtesting.RandomizedRunner.access$600(RandomizedRunner.java:79)
	at com.carrotsearch.randomizedtesting.RandomizedRunner$6.evaluate(RandomizedRunner.java:737)
	at com.carrotsearch.randomizedtesting.RandomizedRunner$7.evaluate(RandomizedRunner.java:773)
	at com.carrotsearch.randomizedtesting.RandomizedRunner$8.evaluate(RandomizedRunner.java:787)
	at com.carrotsearch.randomizedtesting.rules.SystemPropertiesRestoreRule$1.evaluate(SystemPropertiesRestoreRule.java:53)
	at org.apache.lucene.util.TestRuleSetupTeardownChained$1.evaluate(TestRuleSetupTeardownChained.java:50)
	at org.apache.lucene.util.TestRuleFieldCacheSanity$1.evaluate(TestRuleFieldCacheSanity.java:51)
	at org.apache.lucene.util.AbstractBeforeAfterRule$1.evaluate(AbstractBeforeAfterRule.java:45)
	at com.carrotsearch.randomizedtesting.rules.SystemPropertiesInvariantRule$1.evaluate(SystemPropertiesInvariantRule.java:55)
	at org.apache.lucene.util.TestRuleThreadAndTestName$1.evaluate(TestRuleThreadAndTestName.java:48)
	at org.apache.lucene.util.TestRuleIgnoreAfterMaxFailures$1.evaluate(TestRuleIgnoreAfterMaxFailures.java:70)
	at org.apache.lucene.util.TestRuleMarkFailure$1.evaluate(TestRuleMarkFailure.java:48)
	at com.carrotsearch.randomizedtesting.rules.StatementAdapter.evaluate(StatementAdapter.java:36)
	at com.carrotsearch.randomizedtesting.ThreadLeakControl$StatementRunner.run(ThreadLeakControl.java:358)
	at com.carrotsearch.randomizedtesting.ThreadLeakControl.forkTimeoutingTask(ThreadLeakControl.java:782)
	at com.carrotsearch.randomizedtesting.ThreadLeakControl$3.evaluate(ThreadLeakControl.java:442)
	at com.carrotsearch.randomizedtesting.RandomizedRunner.runSingleTest(RandomizedRunner.java:746)
	at com.carrotsearch.randomizedtesting.RandomizedRunner$3.evaluate(RandomizedRunner.java:648)
	at com.carrotsearch.randomizedtesting.RandomizedRunner$4.evaluate(RandomizedRunner.java:682)
	at com.carrotsearch.randomizedtesting.RandomizedRunner$5.evaluate(RandomizedRunner.java:693)
	at com.carrotsearch.randomizedtesting.rules.StatementAdapter.evaluate(StatementAdapter.java:36)
	at com.carrotsearch.randomizedtesting.rules.SystemPropertiesRestoreRule$1.evaluate(SystemPropertiesRestoreRule.java:53)
	at org.apache.lucene.util.AbstractBeforeAfterRule$1.evaluate(AbstractBeforeAfterRule.java:45)
	at org.apache.lucene.util.TestRuleStoreClassName$1.evaluate(TestRuleStoreClassName.java:42)
	at com.carrotsearch.randomizedtesting.rules.SystemPropertiesInvariantRule$1.evaluate(SystemPropertiesInvariantRule.java:55)
	at com.carrotsearch.randomizedtesting.rules.NoShadowingOrOverridesOnMethodsRule$1.evaluate(NoShadowingOrOverridesOnMethodsRule.java:39)
	at com.carrotsearch.randomizedtesting.rules.NoShadowingOrOverridesOnMethodsRule$1.evaluate(NoShadowingOrOverridesOnMethodsRule.java:39)
	at com.carrotsearch.randomizedtesting.rules.StatementAdapter.evaluate(StatementAdapter.java:36)
	at org.apache.lucene.util.TestRuleAssertionsRequired$1.evaluate(TestRuleAssertionsRequired.java:43)
	at org.apache.lucene.util.TestRuleMarkFailure$1.evaluate(TestRuleMarkFailure.java:48)
	at org.apache.lucene.util.TestRuleIgnoreAfterMaxFailures$1.evaluate(TestRuleIgnoreAfterMaxFailures.java:70)
	at org.apache.lucene.util.TestRuleIgnoreTestSuites$1.evaluate(TestRuleIgnoreTestSuites.java:55)
	at com.carrotsearch.randomizedtesting.rules.StatementAdapter.evaluate(StatementAdapter.java:36)
	at com.carrotsearch.randomizedtesting.ThreadLeakControl$StatementRunner.run(ThreadLeakControl.java:358)
	at java.lang.Thread.run(Thread.java:722)




Build Log:
[...truncated 8275 lines...]
[junit4:junit4] Suite: org.apache.solr.cloud.BasicDistributedZk2Test
[junit4:junit4]   2> 3 T1680 oas.SolrTestCaseJ4.setUp ###Starting testDistribSearch
[junit4:junit4]   2> Creating dataDir: /usr/home/hudson/hudson-slave/workspace/Lucene-Solr-Tests-4.x-java7/solr/build/solr-core/test/J0/./solrtest-BasicDistributedZk2Test-1347862706828
[junit4:junit4]   2> 4 T1680 oasc.ZkTestServer.run STARTING ZK TEST SERVER
[junit4:junit4]   2> 6 T1681 oazs.ZooKeeperServer.setTickTime tickTime set to 1000
[junit4:junit4]   2> 7 T1681 oazs.NIOServerCnxn$Factory.<init> binding to port 0.0.0.0/0.0.0.0:0
[junit4:junit4]   2> 7 T1681 oazsp.FileTxnSnapLog.save Snapshotting: 0
[junit4:junit4]   2> 105 T1680 oasc.ZkTestServer.run start zk server on port:42540
[junit4:junit4]   2> 105 T1680 oaz.ZooKeeper.<init> Initiating client connection, connectString=127.0.0.1:42540 sessionTimeout=10000 watcher=org.apache.solr.common.cloud.ConnectionManager@c9b4cc0
[junit4:junit4]   2> 106 T1686 oaz.ClientCnxn$SendThread.startConnect Opening socket connection to server /127.0.0.1:42540
[junit4:junit4]   2> 106 T1680 oascc.ConnectionManager.waitForConnected Waiting for client to connect to ZooKeeper
[junit4:junit4]   2> 107 T1686 oaz.ClientCnxn$SendThread.primeConnection Socket connection established to localhost/127.0.0.1:42540, initiating session
[junit4:junit4]   2> 107 T1682 oazs.NIOServerCnxn$Factory.run Accepted socket connection from /140.211.11.196:42541
[junit4:junit4]   2> 108 T1682 oazs.NIOServerCnxn.readConnectRequest Client attempting to establish new session at /140.211.11.196:42541
[junit4:junit4]   2> 108 T1684 oazsp.FileTxnLog.append Creating new log file: log.1
[junit4:junit4]   2> 136 T1684 oazs.NIOServerCnxn.finishSessionInit Established session 0x139d2e0ba910000 with negotiated timeout 10000 for client /140.211.11.196:42541
[junit4:junit4]   2> 136 T1686 oaz.ClientCnxn$SendThread.readConnectResult Session establishment complete on server localhost/127.0.0.1:42540, sessionid = 0x139d2e0ba910000, negotiated timeout = 10000
[junit4:junit4]   2> 136 T1687 oascc.ConnectionManager.process Watcher org.apache.solr.common.cloud.ConnectionManager@c9b4cc0 name:ZooKeeperConnection Watcher:127.0.0.1:42540 got event WatchedEvent state:SyncConnected type:None path:null path:null type:None
[junit4:junit4]   2> 136 T1680 oascc.ConnectionManager.waitForConnected Client is connected to ZooKeeper
[junit4:junit4]   2> 137 T1680 oascc.SolrZkClient.makePath makePath: /solr
[junit4:junit4]   2> 140 T1685 oazs.PrepRequestProcessor.pRequest Processed session termination for sessionid: 0x139d2e0ba910000
[junit4:junit4]   2> 151 T1687 oaz.ClientCnxn$EventThread.run EventThread shut down
[junit4:junit4]   2> 151 T1680 oaz.ZooKeeper.close Session: 0x139d2e0ba910000 closed
[junit4:junit4]   2> 151 T1682 oazs.NIOServerCnxn.closeSock Closed socket connection for client /140.211.11.196:42541 which had sessionid 0x139d2e0ba910000
[junit4:junit4]   2> 152 T1680 oaz.ZooKeeper.<init> Initiating client connection, connectString=127.0.0.1:42540/solr sessionTimeout=10000 watcher=org.apache.solr.common.cloud.ConnectionManager@51e5b0e7
[junit4:junit4]   2> 152 T1688 oaz.ClientCnxn$SendThread.startConnect Opening socket connection to server /127.0.0.1:42540
[junit4:junit4]   2> 152 T1680 oascc.ConnectionManager.waitForConnected Waiting for client to connect to ZooKeeper
[junit4:junit4]   2> 153 T1688 oaz.ClientCnxn$SendThread.primeConnection Socket connection established to localhost/127.0.0.1:42540, initiating session
[junit4:junit4]   2> 153 T1682 oazs.NIOServerCnxn$Factory.run Accepted socket connection from /140.211.11.196:42542
[junit4:junit4]   2> 153 T1682 oazs.NIOServerCnxn.readConnectRequest Client attempting to establish new session at /140.211.11.196:42542
[junit4:junit4]   2> 155 T1684 oazs.NIOServerCnxn.finishSessionInit Established session 0x139d2e0ba910001 with negotiated timeout 10000 for client /140.211.11.196:42542
[junit4:junit4]   2> 155 T1688 oaz.ClientCnxn$SendThread.readConnectResult Session establishment complete on server localhost/127.0.0.1:42540, sessionid = 0x139d2e0ba910001, negotiated timeout = 10000
[junit4:junit4]   2> 155 T1689 oascc.ConnectionManager.process Watcher org.apache.solr.common.cloud.ConnectionManager@51e5b0e7 name:ZooKeeperConnection Watcher:127.0.0.1:42540/solr got event WatchedEvent state:SyncConnected type:None path:null path:null type:None
[junit4:junit4]   2> 155 T1680 oascc.ConnectionManager.waitForConnected Client is connected to ZooKeeper
[junit4:junit4]   2> 156 T1680 oascc.SolrZkClient.makePath makePath: /collections/collection1
[junit4:junit4]   2> 159 T1680 oascc.SolrZkClient.makePath makePath: /collections/collection1/shards
[junit4:junit4]   2> 169 T1680 oascc.SolrZkClient.makePath makePath: /collections/control_collection
[junit4:junit4]   2> 170 T1680 oascc.SolrZkClient.makePath makePath: /collections/control_collection/shards
[junit4:junit4]   2> 172 T1680 oasc.AbstractZkTestCase.putConfig put /usr/home/hudson/hudson-slave/workspace/Lucene-Solr-Tests-4.x-java7/solr/build/solr-core/test-files/solr/collection1/conf/solrconfig.xml to /configs/conf1/solrconfig.xml
[junit4:junit4]   2> 173 T1680 oascc.SolrZkClient.makePath makePath: /configs/conf1/solrconfig.xml
[junit4:junit4]   2> 183 T1680 oasc.AbstractZkTestCase.putConfig put /usr/home/hudson/hudson-slave/workspace/Lucene-Solr-Tests-4.x-java7/solr/build/solr-core/test-files/solr/collection1/conf/schema.xml to /configs/conf1/schema.xml
[junit4:junit4]   2> 184 T1680 oascc.SolrZkClient.makePath makePath: /configs/conf1/schema.xml
[junit4:junit4]   2> 291 T1680 oasc.AbstractZkTestCase.putConfig put /usr/home/hudson/hudson-slave/workspace/Lucene-Solr-Tests-4.x-java7/solr/build/solr-core/test-files/solr/collection1/conf/solrconfig.xml to /configs/conf1/solrconfig.xml
[junit4:junit4]   2> 292 T1680 oascc.SolrZkClient.makePath makePath: /configs/conf1/solrconfig.xml
[junit4:junit4]   2> 294 T1680 oasc.AbstractZkTestCase.putConfig put /usr/home/hudson/hudson-slave/workspace/Lucene-Solr-Tests-4.x-java7/solr/build/solr-core/test-files/solr/collection1/conf/stopwords.txt to /configs/conf1/stopwords.txt
[junit4:junit4]   2> 295 T1680 oascc.SolrZkClient.makePath makePath: /configs/conf1/stopwords.txt
[junit4:junit4]   2> 308 T1680 oasc.AbstractZkTestCase.putConfig put /usr/home/hudson/hudson-slave/workspace/Lucene-Solr-Tests-4.x-java7/solr/build/solr-core/test-files/solr/collection1/conf/protwords.txt to /configs/conf1/protwords.txt
[junit4:junit4]   2> 308 T1680 oascc.SolrZkClient.makePath makePath: /configs/conf1/protwords.txt
[junit4:junit4]   2> 311 T1680 oasc.AbstractZkTestCase.putConfig put /usr/home/hudson/hudson-slave/workspace/Lucene-Solr-Tests-4.x-java7/solr/build/solr-core/test-files/solr/collection1/conf/currency.xml to /configs/conf1/currency.xml
[junit4:junit4]   2> 311 T1680 oascc.SolrZkClient.makePath makePath: /configs/conf1/currency.xml
[junit4:junit4]   2> 314 T1680 oasc.AbstractZkTestCase.putConfig put /usr/home/hudson/hudson-slave/workspace/Lucene-Solr-Tests-4.x-java7/solr/build/solr-core/test-files/solr/collection1/conf/open-exchange-rates.json to /configs/conf1/open-exchange-rates.json
[junit4:junit4]   2> 314 T1680 oascc.SolrZkClient.makePath makePath: /configs/conf1/open-exchange-rates.json
[junit4:junit4]   2> 316 T1680 oasc.AbstractZkTestCase.putConfig put /usr/home/hudson/hudson-slave/workspace/Lucene-Solr-Tests-4.x-java7/solr/build/solr-core/test-files/solr/collection1/conf/mapping-ISOLatin1Accent.txt to /configs/conf1/mapping-ISOLatin1Accent.txt
[junit4:junit4]   2> 317 T1680 oascc.SolrZkClient.makePath makePath: /configs/conf1/mapping-ISOLatin1Accent.txt
[junit4:junit4]   2> 324 T1680 oasc.AbstractZkTestCase.putConfig put /usr/home/hudson/hudson-slave/workspace/Lucene-Solr-Tests-4.x-java7/solr/build/solr-core/test-files/solr/collection1/conf/old_synonyms.txt to /configs/conf1/old_synonyms.txt
[junit4:junit4]   2> 325 T1680 oascc.SolrZkClient.makePath makePath: /configs/conf1/old_synonyms.txt
[junit4:junit4]   2> 327 T1680 oasc.AbstractZkTestCase.putConfig put /usr/home/hudson/hudson-slave/workspace/Lucene-Solr-Tests-4.x-java7/solr/build/solr-core/test-files/solr/collection1/conf/synonyms.txt to /configs/conf1/synonyms.txt
[junit4:junit4]   2> 327 T1680 oascc.SolrZkClient.makePath makePath: /configs/conf1/synonyms.txt
[junit4:junit4]   2> 329 T1685 oazs.PrepRequestProcessor.pRequest Processed session termination for sessionid: 0x139d2e0ba910001
[junit4:junit4]   2> 330 T1689 oaz.ClientCnxn$EventThread.run EventThread shut down
[junit4:junit4]   2> 330 T1680 oaz.ZooKeeper.close Session: 0x139d2e0ba910001 closed
[junit4:junit4]   2> 330 T1682 oazs.NIOServerCnxn.closeSock Closed socket connection for client /140.211.11.196:42542 which had sessionid 0x139d2e0ba910001
[junit4:junit4]   2> 333 T1680 oejs.Server.doStart jetty-8.1.2.v20120308
[junit4:junit4]   2> 336 T1680 oejs.AbstractConnector.doStart Started SocketConnector@0.0.0.0:42543
[junit4:junit4]   2> 337 T1680 oasc.SolrResourceLoader.locateSolrHome JNDI not configured for solr (NoInitialContextEx)
[junit4:junit4]   2> 337 T1680 oasc.SolrResourceLoader.locateSolrHome using system property solr.solr.home: /usr/home/hudson/hudson-slave/workspace/Lucene-Solr-Tests-4.x-java7/solr/build/solr-core/test-files/solr
[junit4:junit4]   2> 338 T1680 oasc.SolrResourceLoader.<init> new SolrResourceLoader for deduced Solr Home: '/usr/home/hudson/hudson-slave/workspace/Lucene-Solr-Tests-4.x-java7/solr/build/solr-core/test-files/solr/'
[junit4:junit4]   2> 371 T1680 oass.SolrDispatchFilter.init SolrDispatchFilter.init()
[junit4:junit4]   2> 372 T1680 oasc.SolrResourceLoader.locateSolrHome JNDI not configured for solr (NoInitialContextEx)
[junit4:junit4]   2> 372 T1680 oasc.SolrResourceLoader.locateSolrHome using system property solr.solr.home: /usr/home/hudson/hudson-slave/workspace/Lucene-Solr-Tests-4.x-java7/solr/build/solr-core/test-files/solr
[junit4:junit4]   2> 373 T1680 oasc.CoreContainer$Initializer.initialize looking for solr.xml: /usr/home/hudson/hudson-slave/workspace/Lucene-Solr-Tests-4.x-java7/solr/build/solr-core/test-files/solr/solr.xml
[junit4:junit4]   2> 373 T1680 oasc.CoreContainer.<init> New CoreContainer 1832142266
[junit4:junit4]   2> 374 T1680 oasc.CoreContainer.load Loading CoreContainer using Solr Home: '/usr/home/hudson/hudson-slave/workspace/Lucene-Solr-Tests-4.x-java7/solr/build/solr-core/test-files/solr/'
[junit4:junit4]   2> 374 T1680 oasc.SolrResourceLoader.<init> new SolrResourceLoader for directory: '/usr/home/hudson/hudson-slave/workspace/Lucene-Solr-Tests-4.x-java7/solr/build/solr-core/test-files/solr/'
[junit4:junit4]   2> 402 T1680 oasc.CoreContainer.load Registering Log Listener
[junit4:junit4]   2> 416 T1680 oasc.CoreContainer.initZooKeeper Zookeeper client=127.0.0.1:42540/solr
[junit4:junit4]   2> 417 T1680 oaz.ZooKeeper.<init> Initiating client connection, connectString=127.0.0.1:42540/solr sessionTimeout=5000 watcher=org.apache.solr.common.cloud.ConnectionManager@4244bdf6
[junit4:junit4]   2> 418 T1699 oaz.ClientCnxn$SendThread.startConnect Opening socket connection to server /127.0.0.1:42540
[junit4:junit4]   2> 418 T1680 oascc.ConnectionManager.waitForConnected Waiting for client to connect to ZooKeeper
[junit4:junit4]   2> 419 T1699 oaz.ClientCnxn$SendThread.primeConnection Socket connection established to localhost/127.0.0.1:42540, initiating session
[junit4:junit4]   2> 419 T1682 oazs.NIOServerCnxn$Factory.run Accepted socket connection from /140.211.11.196:42544
[junit4:junit4]   2> 419 T1682 oazs.NIOServerCnxn.readConnectRequest Client attempting to establish new session at /140.211.11.196:42544
[junit4:junit4]   2> 420 T1684 oazs.NIOServerCnxn.finishSessionInit Established session 0x139d2e0ba910002 with negotiated timeout 5000 for client /140.211.11.196:42544
[junit4:junit4]   2> 420 T1699 oaz.ClientCnxn$SendThread.readConnectResult Session establishment complete on server localhost/127.0.0.1:42540, sessionid = 0x139d2e0ba910002, negotiated timeout = 5000
[junit4:junit4]   2> 421 T1700 oascc.ConnectionManager.process Watcher org.apache.solr.common.cloud.ConnectionManager@4244bdf6 name:ZooKeeperConnection Watcher:127.0.0.1:42540/solr got event WatchedEvent state:SyncConnected type:None path:null path:null type:None
[junit4:junit4]   2> 421 T1680 oascc.ConnectionManager.waitForConnected Client is connected to ZooKeeper
[junit4:junit4]   2> 423 T1685 oazs.PrepRequestProcessor.pRequest Got user-level KeeperException when processing sessionid:0x139d2e0ba910002 type:create cxid:0x2 zxid:0xfffffffffffffffe txntype:unknown reqpath:n/a Error Path:/solr/overseer Error:KeeperErrorCode = NodeExists for /solr/overseer
[junit4:junit4]   2> 424 T1680 oascc.SolrZkClient.makePath makePath: /live_nodes
[junit4:junit4]   2> 426 T1680 oasc.ZkController.createEphemeralLiveNode Register node as live in ZooKeeper:/live_nodes/127.0.0.1:42543_solr
[junit4:junit4]   2> 426 T1685 oazs.PrepRequestProcessor.pRequest Got user-level KeeperException when processing sessionid:0x139d2e0ba910002 type:delete cxid:0x7 zxid:0xfffffffffffffffe txntype:unknown reqpath:n/a Error Path:/solr/live_nodes/127.0.0.1:42543_solr Error:KeeperErrorCode = NoNode for /solr/live_nodes/127.0.0.1:42543_solr
[junit4:junit4]   2> 434 T1680 oascc.SolrZkClient.makePath makePath: /live_nodes/127.0.0.1:42543_solr
[junit4:junit4]   2> 436 T1680 oashc.HttpShardHandlerFactory.getParameter Setting socketTimeout to: 0
[junit4:junit4]   2> 436 T1680 oashc.HttpShardHandlerFactory.getParameter Setting urlScheme to: http://
[junit4:junit4]   2> 437 T1680 oashc.HttpShardHandlerFactory.getParameter Setting connTimeout to: 0
[junit4:junit4]   2> 437 T1680 oashc.HttpShardHandlerFactory.getParameter Setting maxConnectionsPerHost to: 20
[junit4:junit4]   2> 438 T1680 oashc.HttpShardHandlerFactory.getParameter Setting corePoolSize to: 0
[junit4:junit4]   2> 438 T1680 oashc.HttpShardHandlerFactory.getParameter Setting maximumPoolSize to: 2147483647
[junit4:junit4]   2> 438 T1680 oashc.HttpShardHandlerFactory.getParameter Setting maxThreadIdleTime to: 5
[junit4:junit4]   2> 439 T1680 oashc.HttpShardHandlerFactory.getParameter Setting sizeOfQueue to: -1
[junit4:junit4]   2> 439 T1680 oashc.HttpShardHandlerFactory.getParameter Setting fairnessPolicy to: false
[junit4:junit4]   2> 440 T1680 oascsi.HttpClientUtil.createClient Creating new http client, config:maxConnectionsPerHost=20&maxConnections=10000&socketTimeout=0&connTimeout=0&retry=false
[junit4:junit4]   2> 452 T1680 oascc.SolrZkClient.makePath makePath: /overseer_elect/election
[junit4:junit4]   2> 456 T1685 oazs.PrepRequestProcessor.pRequest Got user-level KeeperException when processing sessionid:0x139d2e0ba910002 type:delete cxid:0x15 zxid:0xfffffffffffffffe txntype:unknown reqpath:n/a Error Path:/solr/overseer_elect/leader Error:KeeperErrorCode = NoNode for /solr/overseer_elect/leader
[junit4:junit4]   2> 469 T1680 oascc.SolrZkClient.makePath makePath: /overseer_elect/leader
[junit4:junit4]   2> 471 T1680 oasc.Overseer.start Overseer (id=88333530355007490-127.0.0.1:42543_solr-n_0000000000) starting
[junit4:junit4]   2> 472 T1685 oazs.PrepRequestProcessor.pRequest Got user-level KeeperException when processing sessionid:0x139d2e0ba910002 type:create cxid:0x1a zxid:0xfffffffffffffffe txntype:unknown reqpath:n/a Error Path:/solr/overseer Error:KeeperErrorCode = NodeExists for /solr/overseer
[junit4:junit4]   2> 473 T1685 oazs.PrepRequestProcessor.pRequest Got user-level KeeperException when processing sessionid:0x139d2e0ba910002 type:create cxid:0x1b zxid:0xfffffffffffffffe txntype:unknown reqpath:n/a Error Path:/solr/overseer Error:KeeperErrorCode = NodeExists for /solr/overseer
[junit4:junit4]   2> 474 T1685 oazs.PrepRequestProcessor.pRequest Got user-level KeeperException when processing sessionid:0x139d2e0ba910002 type:create cxid:0x1c zxid:0xfffffffffffffffe txntype:unknown reqpath:n/a Error Path:/solr/overseer Error:KeeperErrorCode = NodeExists for /solr/overseer
[junit4:junit4]   2> 485 T1685 oazs.PrepRequestProcessor.pRequest Got user-level KeeperException when processing sessionid:0x139d2e0ba910002 type:create cxid:0x1d zxid:0xfffffffffffffffe txntype:unknown reqpath:n/a Error Path:/solr/overseer Error:KeeperErrorCode = NodeExists for /solr/overseer
[junit4:junit4]   2> 486 T1702 oasc.OverseerCollectionProcessor.run Process current queue of collection creations
[junit4:junit4]   2> 486 T1680 oascc.SolrZkClient.makePath makePath: /clusterstate.json
[junit4:junit4]   2> 497 T1680 oascc.ZkStateReader.createClusterStateWatchersAndUpdate Updating cluster state from ZooKeeper... 
[junit4:junit4]   2> 498 T1701 oasc.Overseer$ClusterStateUpdater.run Starting to work on the main queue
[junit4:junit4]   2> 502 T1680 oasc.CoreContainer.create Creating SolrCore 'collection1' using instanceDir: /usr/home/hudson/hudson-slave/workspace/Lucene-Solr-Tests-4.x-java7/solr/build/solr-core/test-files/solr/collection1
[junit4:junit4]   2> 503 T1680 oasc.ZkController.createCollectionZkNode Check for collection zkNode:control_collection
[junit4:junit4]   2> 503 T1680 oasc.ZkController.createCollectionZkNode Collection zkNode exists
[junit4:junit4]   2> 504 T1680 oasc.ZkController.readConfigName Load collection config from:/collections/control_collection
[junit4:junit4]   2> 505 T1680 oasc.SolrResourceLoader.<init> new SolrResourceLoader for directory: '/usr/home/hudson/hudson-slave/workspace/Lucene-Solr-Tests-4.x-java7/solr/build/solr-core/test-files/solr/collection1/'
[junit4:junit4]   2> 506 T1680 oasc.SolrResourceLoader.replaceClassLoader Adding 'file:/usr/home/hudson/hudson-slave/workspace/Lucene-Solr-Tests-4.x-java7/solr/build/solr-core/test-files/solr/collection1/lib/classes/' to classloader
[junit4:junit4]   2> 506 T1680 oasc.SolrResourceLoader.replaceClassLoader Adding 'file:/usr/home/hudson/hudson-slave/workspace/Lucene-Solr-Tests-4.x-java7/solr/build/solr-core/test-files/solr/collection1/lib/README' to classloader
[junit4:junit4]   2> 549 T1680 oasc.SolrConfig.<init> Using Lucene MatchVersion: LUCENE_40
[junit4:junit4]   2> 609 T1680 oasc.SolrConfig.<init> Loaded SolrConfig: solrconfig.xml
[junit4:junit4]   2> 710 T1680 oass.IndexSchema.readSchema Reading Solr Schema
[junit4:junit4]   2> 716 T1680 oass.IndexSchema.readSchema Schema name=test
[junit4:junit4]   2> 1336 T1680 oass.OpenExchangeRatesOrgProvider.init Initialized with rates=open-exchange-rates.json, refreshInterval=1440.
[junit4:junit4]   2> 1349 T1680 oass.IndexSchema.readSchema default search field in schema is text
[junit4:junit4]   2> 1354 T1680 oass.IndexSchema.readSchema unique key field: id
[junit4:junit4]   2> 1365 T1680 oass.FileExchangeRateProvider.reload Reloading exchange rates from file currency.xml
[junit4:junit4]   2> 1371 T1680 oass.FileExchangeRateProvider.reload Reloading exchange rates from file currency.xml
[junit4:junit4]   2> 1376 T1680 oass.OpenExchangeRatesOrgProvider.reload Reloading exchange rates from open-exchange-rates.json
[junit4:junit4]   2> 1377 T1680 oass.OpenExchangeRatesOrgProvider.reload Reloading exchange rates from open-exchange-rates.json
[junit4:junit4]   2> 1378 T1680 oasc.SolrCore.<init> [collection1] Opening new SolrCore at /usr/home/hudson/hudson-slave/workspace/Lucene-Solr-Tests-4.x-java7/solr/build/solr-core/test-files/solr/collection1/, dataDir=./org.apache.solr.cloud.BasicDistributedZk2Test-1347862706828/control/data/
[junit4:junit4]   2> 1379 T1680 oasc.JmxMonitoredMap.<init> JMX monitoring is enabled. Adding Solr mbeans to JMX Server: com.sun.jmx.mbeanserver.JmxMBeanServer@28da95c1
[junit4:junit4]   2> 1416 T1680 oasc.SolrCore.getNewIndexDir WARNING New index directory detected: old=null new=./org.apache.solr.cloud.BasicDistributedZk2Test-1347862706828/control/data/index/
[junit4:junit4]   2> 1418 T1680 oasc.SolrCore.initIndex WARNING [collection1] Solr index directory './org.apache.solr.cloud.BasicDistributedZk2Test-1347862706828/control/data/index' doesn't exist. Creating new index...
[junit4:junit4]   2> 1419 T1680 oasc.CachingDirectoryFactory.get return new directory for /usr/home/hudson/hudson-slave/workspace/Lucene-Solr-Tests-4.x-java7/solr/build/solr-core/test/J0/./org.apache.solr.cloud.BasicDistributedZk2Test-1347862706828/control/data/index forceNew:false
[junit4:junit4]   2> 1450 T1680 oasc.SolrDeletionPolicy.onCommit SolrDeletionPolicy.onCommit: commits:num=1
[junit4:junit4]   2> 		commit{dir=/usr/home/hudson/hudson-slave/workspace/Lucene-Solr-Tests-4.x-java7/solr/build/solr-core/test/J0/org.apache.solr.cloud.BasicDistributedZk2Test-1347862706828/control/data/index,segFN=segments_1,generation=1,filenames=[segments_1]
[junit4:junit4]   2> 1451 T1680 oasc.SolrDeletionPolicy.updateCommits newest commit = 1
[junit4:junit4]   2> 1452 T1680 oasc.SolrCore.initWriters created xml: solr.XMLResponseWriter
[junit4:junit4]   2> 1455 T1680 oasup.UpdateRequestProcessorChain.init inserting DistributedUpdateProcessorFactory into updateRequestProcessorChain "dedupe"
[junit4:junit4]   2> 1455 T1680 oasup.UpdateRequestProcessorChain.init inserting DistributedUpdateProcessorFactory into updateRequestProcessorChain "dedupe-allfields"
[junit4:junit4]   2> 1456 T1680 oasup.UpdateRequestProcessorChain.init inserting DistributedUpdateProcessorFactory into updateRequestProcessorChain "stored_sig"
[junit4:junit4]   2> 1457 T1680 oasup.UpdateRequestProcessorChain.init inserting DistributedUpdateProcessorFactory into updateRequestProcessorChain "uniq-fields"
[junit4:junit4]   2> 1457 T1680 oasup.UpdateRequestProcessorChain.init inserting DistributedUpdateProcessorFactory into updateRequestProcessorChain "distrib-dup-test-chain-implicit"
[junit4:junit4]   2> 1458 T1680 oasc.RequestHandlers.initHandlersFromConfig adding lazy requestHandler: solr.ReplicationHandler
[junit4:junit4]   2> 1459 T1680 oasc.RequestHandlers.initHandlersFromConfig created /replication: solr.ReplicationHandler
[junit4:junit4]   2> 1460 T1680 oasc.RequestHandlers.initHandlersFromConfig created standard: solr.StandardRequestHandler
[junit4:junit4]   2> 1460 T1680 oasc.RequestHandlers.initHandlersFromConfig created /get: solr.RealTimeGetHandler
[junit4:junit4]   2> 1461 T1680 oasc.RequestHandlers.initHandlersFromConfig created dismax: solr.SearchHandler
[junit4:junit4]   2> 1462 T1680 oasc.RequestHandlers.initHandlersFromConfig created mock: org.apache.solr.core.MockQuerySenderListenerReqHandler
[junit4:junit4]   2> 1463 T1680 oasc.RequestHandlers.initHandlersFromConfig created /admin/: org.apache.solr.handler.admin.AdminHandlers
[junit4:junit4]   2> 1463 T1680 oasc.RequestHandlers.initHandlersFromConfig created defaults: solr.StandardRequestHandler
[junit4:junit4]   2> 1464 T1680 oasc.RequestHandlers.initHandlersFromConfig adding lazy requestHandler: solr.StandardRequestHandler
[junit4:junit4]   2> 1465 T1680 oasc.RequestHandlers.initHandlersFromConfig created lazy: solr.StandardRequestHandler
[junit4:junit4]   2> 1465 T1680 oasc.RequestHandlers.initHandlersFromConfig created /update: solr.UpdateRequestHandler
[junit4:junit4]   2> 1466 T1680 oasc.RequestHandlers.initHandlersFromConfig created /terms: org.apache.solr.handler.component.SearchHandler
[junit4:junit4]   2> 1467 T1680 oasc.RequestHandlers.initHandlersFromConfig created spellCheckCompRH: org.apache.solr.handler.component.SearchHandler
[junit4:junit4]   2> 1468 T1680 oasc.RequestHandlers.initHandlersFromConfig created spellCheckCompRH_Direct: org.apache.solr.handler.component.SearchHandler
[junit4:junit4]   2> 1468 T1680 oasc.RequestHandlers.initHandlersFromConfig created spellCheckWithWordbreak: org.apache.solr.handler.component.SearchHandler
[junit4:junit4]   2> 1469 T1680 oasc.RequestHandlers.initHandlersFromConfig created spellCheckWithWordbreak_Direct: org.apache.solr.handler.component.SearchHandler
[junit4:junit4]   2> 1470 T1680 oasc.RequestHandlers.initHandlersFromConfig created spellCheckCompRH1: org.apache.solr.handler.component.SearchHandler
[junit4:junit4]   2> 1471 T1680 oasc.RequestHandlers.initHandlersFromConfig created tvrh: org.apache.solr.handler.component.SearchHandler
[junit4:junit4]   2> 1471 T1680 oasc.RequestHandlers.initHandlersFromConfig created /mlt: solr.MoreLikeThisHandler
[junit4:junit4]   2> 1472 T1680 oasc.RequestHandlers.initHandlersFromConfig created /debug/dump: solr.DumpRequestHandler
[junit4:junit4]   2> 1476 T1680 oashl.XMLLoader.init xsltCacheLifetimeSeconds=60
[junit4:junit4]   2> 1482 T1680 oasc.SolrCore.initDeprecatedSupport WARNING solrconfig.xml uses deprecated <admin/gettableFiles>, Please update your config to use the ShowFileRequestHandler.
[junit4:junit4]   2> 1483 T1680 oasc.SolrCore.initDeprecatedSupport WARNING adding ShowFileRequestHandler with hidden files: [SCHEMA.XML, OLD_SYNONYMS.TXT, STOPWORDS.TXT, PROTWORDS.TXT, OPEN-EXCHANGE-RATES.JSON, SYNONYMS.TXT, CURRENCY.XML, MAPPING-ISOLATIN1ACCENT.TXT]
[junit4:junit4]   2> 1488 T1680 oass.SolrIndexSearcher.<init> Opening Searcher@4edd2266 main
[junit4:junit4]   2> 1489 T1680 oasu.CommitTracker.<init> Hard AutoCommit: disabled
[junit4:junit4]   2> 1490 T1680 oasu.CommitTracker.<init> Soft AutoCommit: disabled
[junit4:junit4]   2> 1490 T1680 oashc.SpellCheckComponent.inform Initializing spell checkers
[junit4:junit4]   2> 1509 T1680 oass.DirectSolrSpellChecker.init init: {name=direct,classname=DirectSolrSpellChecker,field=lowerfilt,minQueryLength=3}
[junit4:junit4]   2> 1567 T1703 oasc.SolrCore.registerSearcher [collection1] Registered new searcher Searcher@4edd2266 main{StandardDirectoryReader(segments_1:1)}
[junit4:junit4]   2> 1572 T1685 oazs.PrepRequestProcessor.pRequest Got user-level KeeperException when processing sessionid:0x139d2e0ba910002 type:create cxid:0x56 zxid:0xfffffffffffffffe txntype:unknown reqpath:n/a Error Path:/solr/overseer/queue Error:KeeperErrorCode = NoNode for /solr/overseer/queue
[junit4:junit4]   2> 1582 T1680 oasc.CoreContainer.register registering core: collection1
[junit4:junit4]   2> 1583 T1680 oasc.ZkController.register Register shard - core:collection1 address:http://127.0.0.1:42543/solr shardId:control_shard
[junit4:junit4]   2> 1584 T1680 oascc.SolrZkClient.makePath makePath: /collections/control_collection/leader_elect/control_shard/election
[junit4:junit4]   2> 1599 T1685 oazs.PrepRequestProcessor.pRequest Got user-level KeeperException when processing sessionid:0x139d2e0ba910002 type:delete cxid:0x65 zxid:0xfffffffffffffffe txntype:unknown reqpath:n/a Error Path:/solr/collections/control_collection/leaders Error:KeeperErrorCode = NoNode for /solr/collections/control_collection/leaders
[junit4:junit4]   2> 1600 T1680 oasc.ShardLeaderElectionContext.runLeaderProcess Running the leader process.
[junit4:junit4]   2> 1600 T1685 oazs.PrepRequestProcessor.pRequest Got user-level KeeperException when processing sessionid:0x139d2e0ba910002 type:create cxid:0x66 zxid:0xfffffffffffffffe txntype:unknown reqpath:n/a Error Path:/solr/overseer Error:KeeperErrorCode = NodeExists for /solr/overseer
[junit4:junit4]   2> 2003 T1701 oascc.ZkStateReader.updateClusterState Updating cloud state from ZooKeeper... 
[junit4:junit4]   2> 2004 T1685 oazs.PrepRequestProcessor.pRequest Got user-level KeeperException when processing sessionid:0x139d2e0ba910002 type:create cxid:0x6d zxid:0xfffffffffffffffe txntype:unknown reqpath:n/a Error Path:/solr/overseer/queue-work Error:KeeperErrorCode = NoNode for /solr/overseer/queue-work
[junit4:junit4]   2> 2020 T1700 oascc.ZkStateReader$2.process A cluster state change has occurred - updating...
[junit4:junit4]   2> 2112 T1680 oasc.ShardLeaderElectionContext.waitForReplicasToComeUp Enough replicas found to continue.
[junit4:junit4]   2> 2113 T1680 oasc.ShardLeaderElectionContext.runLeaderProcess I may be the new leader - try and sync
[junit4:junit4]   2> 2113 T1680 oasc.SyncStrategy.sync Sync replicas to http://127.0.0.1:42543/solr/collection1/
[junit4:junit4]   2> 2113 T1680 oasc.SyncStrategy.syncReplicas Sync Success - now sync replicas to me
[junit4:junit4]   2> 2114 T1680 oasc.SyncStrategy.syncToMe http://127.0.0.1:42543/solr/collection1/ has no replicas
[junit4:junit4]   2> 2114 T1680 oasc.ShardLeaderElectionContext.runLeaderProcess I am the new leader: http://127.0.0.1:42543/solr/collection1/
[junit4:junit4]   2> 2115 T1680 oascc.SolrZkClient.makePath makePath: /collections/control_collection/leaders/control_shard
[junit4:junit4]   2> 2129 T1685 oazs.PrepRequestProcessor.pRequest Got user-level KeeperException when processing sessionid:0x139d2e0ba910002 type:create cxid:0x8b zxid:0xfffffffffffffffe txntype:unknown reqpath:n/a Error Path:/solr/overseer Error:KeeperErrorCode = NodeExists for /solr/overseer
[junit4:junit4]   2> 2524 T1701 oascc.ZkStateReader.updateClusterState Updating cloud state from ZooKeeper... 
[junit4:junit4]   2> 2536 T1700 oascc.ZkStateReader$2.process A cluster state change has occurred - updating...
[junit4:junit4]   2> 2544 T1680 oasc.ZkController.register We are http://127.0.0.1:42543/solr/collection1/ and leader is http://127.0.0.1:42543/solr/collection1/
[junit4:junit4]   2> 2544 T1680 oasc.ZkController.register No LogReplay needed for core=collection1 baseURL=http://127.0.0.1:42543/solr
[junit4:junit4]   2> 2545 T1680 oasc.ZkController.checkRecovery I am the leader, no recovery necessary
[junit4:junit4]   2> 2547 T1680 oascc.ZkStateReader.updateClusterState Updating cloud state from ZooKeeper... 
[junit4:junit4]   2> 2548 T1680 oass.SolrDispatchFilter.init user.dir=/usr/home/hudson/hudson-slave/workspace/Lucene-Solr-Tests-4.x-java7/solr/build/solr-core/test/J0
[junit4:junit4]   2> 2548 T1680 oass.SolrDispatchFilter.init SolrDispatchFilter.init() done
[junit4:junit4]   2> 2549 T1680 oascsi.HttpClientUtil.createClient Creating new http client, config:maxConnections=128&maxConnectionsPerHost=32&followRedirects=false
[junit4:junit4]   2> 3033 T1680 oejs.Server.doStart jetty-8.1.2.v20120308
[junit4:junit4]   2> 3037 T1680 oejs.AbstractConnector.doStart Started SocketConnector@0.0.0.0:42548
[junit4:junit4]   2> 3037 T1680 oasc.SolrResourceLoader.locateSolrHome JNDI not configured for solr (NoInitialContextEx)
[junit4:junit4]   2> 3038 T1680 oasc.SolrResourceLoader.locateSolrHome using system property solr.solr.home: /usr/home/hudson/hudson-slave/workspace/Lucene-Solr-Tests-4.x-java7/solr/build/solr-core/test/J0/./solrtest-jetty1-1347862709387
[junit4:junit4]   2> 3039 T1701 oascc.ZkStateReader.updateClusterState Updating cloud state from ZooKeeper... 
[junit4:junit4]   2> 3039 T1680 oasc.SolrResourceLoader.<init> new SolrResourceLoader for deduced Solr Home: '/usr/home/hudson/hudson-slave/workspace/Lucene-Solr-Tests-4.x-java7/solr/build/solr-core/test/J0/./solrtest-jetty1-1347862709387/'
[junit4:junit4]   2> 3055 T1700 oascc.ZkStateReader$2.process A cluster state change has occurred - updating...
[junit4:junit4]   2> 3083 T1680 oass.SolrDispatchFilter.init SolrDispatchFilter.init()
[junit4:junit4]   2> 3083 T1680 oasc.SolrResourceLoader.locateSolrHome JNDI not configured for solr (NoInitialContextEx)
[junit4:junit4]   2> 3084 T1680 oasc.SolrResourceLoader.locateSolrHome using system property solr.solr.home: /usr/home/hudson/hudson-slave/workspace/Lucene-Solr-Tests-4.x-java7/solr/build/solr-core/test/J0/./solrtest-jetty1-1347862709387
[junit4:junit4]   2> 3084 T1680 oasc.CoreContainer$Initializer.initialize looking for solr.xml: /usr/home/hudson/hudson-slave/workspace/Lucene-Solr-Tests-4.x-java7/solr/build/solr-core/test/J0/./solrtest-jetty1-1347862709387/solr.xml
[junit4:junit4]   2> 3085 T1680 oasc.CoreContainer.<init> New CoreContainer 1445880321
[junit4:junit4]   2> 3086 T1680 oasc.CoreContainer.load Loading CoreContainer using Solr Home: '/usr/home/hudson/hudson-slave/workspace/Lucene-Solr-Tests-4.x-java7/solr/build/solr-core/test/J0/./solrtest-jetty1-1347862709387/'
[junit4:junit4]   2> 3086 T1680 oasc.SolrResourceLoader.<init> new SolrResourceLoader for directory: '/usr/home/hudson/hudson-slave/workspace/Lucene-Solr-Tests-4.x-java7/solr/build/solr-core/test/J0/./solrtest-jetty1-1347862709387/'
[junit4:junit4]   2> 3121 T1680 oasc.CoreContainer.load Registering Log Listener
[junit4:junit4]   2> 3138 T1680 oasc.CoreContainer.initZooKeeper Zookeeper client=127.0.0.1:42540/solr
[junit4:junit4]   2> 3139 T1680 oaz.ZooKeeper.<init> Initiating client connection, connectString=127.0.0.1:42540/solr sessionTimeout=5000 watcher=org.apache.solr.common.cloud.ConnectionManager@495ed814
[junit4:junit4]   2> 3140 T1713 oaz.ClientCnxn$SendThread.startConnect Opening socket connection to server /127.0.0.1:42540
[junit4:junit4]   2> 3140 T1680 oascc.ConnectionManager.waitForConnected Waiting for client to connect to ZooKeeper
[junit4:junit4]   2> 3141 T1713 oaz.ClientCnxn$SendThread.primeConnection Socket connection established to localhost/127.0.0.1:42540, initiating session
[junit4:junit4]   2> 3141 T1682 oazs.NIOServerCnxn$Factory.run Accepted socket connection from /140.211.11.196:42549
[junit4:junit4]   2> 3142 T1682 oazs.NIOServerCnxn.readConnectRequest Client attempting to establish new session at /140.211.11.196:42549
[junit4:junit4]   2> 3143 T1684 oazs.NIOServerCnxn.finishSessionInit Established session 0x139d2e0ba910003 with negotiated timeout 5000 for client /140.211.11.196:42549
[junit4:junit4]   2> 3143 T1713 oaz.ClientCnxn$SendThread.readConnectResult Session establishment complete on server localhost/127.0.0.1:42540, sessionid = 0x139d2e0ba910003, negotiated timeout = 5000
[junit4:junit4]   2> 3144 T1714 oascc.ConnectionManager.process Watcher org.apache.solr.common.cloud.ConnectionManager@495ed814 name:ZooKeeperConnection Watcher:127.0.0.1:42540/solr got event WatchedEvent state:SyncConnected type:None path:null path:null type:None
[junit4:junit4]   2> 3144 T1680 oascc.ConnectionManager.waitForConnected Client is connected to ZooKeeper
[junit4:junit4]   2> 3145 T1685 oazs.PrepRequestProcessor.pRequest Got user-level KeeperException when processing sessionid:0x139d2e0ba910003 type:create cxid:0x1 zxid:0xfffffffffffffffe txntype:unknown reqpath:n/a Error Path:/solr/overseer Error:KeeperErrorCode = NodeExists for /solr/overseer
[junit4:junit4]   2> 3147 T1685 oazs.PrepRequestProcessor.pRequest Got user-level KeeperException when processing sessionid:0x139d2e0ba910003 type:create cxid:0x2 zxid:0xfffffffffffffffe txntype:unknown reqpath:n/a Error Path:/solr/overseer Error:KeeperErrorCode = NodeExists for /solr/overseer
[junit4:junit4]   2> 3156 T1680 oasc.ZkController.createEphemeralLiveNode Register node as live in ZooKeeper:/live_nodes/127.0.0.1:42548_solr
[junit4:junit4]   2> 3156 T1685 oazs.PrepRequestProcessor.pRequest Got user-level KeeperException when processing sessionid:0x139d2e0ba910003 type:delete cxid:0x4 zxid:0xfffffffffffffffe txntype:unknown reqpath:n/a Error Path:/solr/live_nodes/127.0.0.1:42548_solr Error:KeeperErrorCode = NoNode for /solr/live_nodes/127.0.0.1:42548_solr
[junit4:junit4]   2> 3158 T1680 oascc.SolrZkClient.makePath makePath: /live_nodes/127.0.0.1:42548_solr
[junit4:junit4]   2> 3160 T1700 oascc.ZkStateReader$3.process Updating live nodes
[junit4:junit4]   2> 3160 T1680 oashc.HttpShardHandlerFactory.getParameter Setting socketTimeout to: 0
[junit4:junit4]   2> 3161 T1680 oashc.HttpShardHandlerFactory.getParameter Setting urlScheme to: http://
[junit4:junit4]   2> 3161 T1680 oashc.HttpShardHandlerFactory.getParameter Setting connTimeout to: 0
[junit4:junit4]   2> 3162 T1680 oashc.HttpShardHandlerFactory.getParameter Setting maxConnectionsPerHost to: 20
[junit4:junit4]   2> 3162 T1680 oashc.HttpShardHandlerFactory.getParameter Setting corePoolSize to: 0
[junit4:junit4]   2> 3163 T1680 oashc.HttpShardHandlerFactory.getParameter Setting maximumPoolSize to: 2147483647
[junit4:junit4]   2> 3163 T1680 oashc.HttpShardHandlerFactory.getParameter Setting maxThreadIdleTime to: 5
[junit4:junit4]   2> 3164 T1680 oashc.HttpShardHandlerFactory.getParameter Setting sizeOfQueue to: -1
[junit4:junit4]   2> 3164 T1680 oashc.HttpShardHandlerFactory.getParameter Setting fairnessPolicy to: false
[junit4:junit4]   2> 3165 T1680 oascsi.HttpClientUtil.createClient Creating new http client, config:maxConnectionsPerHost=20&maxConnections=10000&socketTimeout=0&connTimeout=0&retry=false
[junit4:junit4]   2> 3181 T1680 oascc.ZkStateReader.createClusterStateWatchersAndUpdate Updating cluster state from ZooKeeper... 
[junit4:junit4]   2> 3187 T1680 oasc.CoreContainer.create Creating SolrCore 'collection1' using instanceDir: /usr/home/hudson/hudson-slave/workspace/Lucene-Solr-Tests-4.x-java7/solr/build/solr-core/test/J0/./solrtest-jetty1-1347862709387/collection1
[junit4:junit4]   2> 3188 T1680 oasc.ZkController.createCollectionZkNode Check for collection zkNode:collection1
[junit4:junit4]   2> 3189 T1680 oasc.ZkController.createCollectionZkNode Collection zkNode exists
[junit4:junit4]   2> 3189 T1680 oasc.ZkController.readConfigName Load collection config from:/collections/collection1
[junit4:junit4]   2> 3190 T1680 oasc.SolrResourceLoader.<init> new SolrResourceLoader for directory: '/usr/home/hudson/hudson-slave/workspace/Lucene-Solr-Tests-4.x-java7/solr/build/solr-core/test/J0/./solrtest-jetty1-1347862709387/collection1/'
[junit4:junit4]   2> 3192 T1680 oasc.SolrResourceLoader.replaceClassLoader Adding 'file:/usr/home/hudson/hudson-slave/workspace/Lucene-Solr-Tests-4.x-java7/solr/build/solr-core/test/J0/solrtest-jetty1-1347862709387/collection1/lib/README' to classloader
[junit4:junit4]   2> 3193 T1680 oasc.SolrResourceLoader.replaceClassLoader Adding 'file:/usr/home/hudson/hudson-slave/workspace/Lucene-Solr-Tests-4.x-java7/solr/build/solr-core/test/J0/solrtest-jetty1-1347862709387/collection1/lib/classes/' to classloader
[junit4:junit4]   2> 3266 T1680 oasc.SolrConfig.<init> Using Lucene MatchVersion: LUCENE_40
[junit4:junit4]   2> 3343 T1680 oasc.SolrConfig.<init> Loaded SolrConfig: solrconfig.xml
[junit4:junit4]   2> 3444 T1680 oass.IndexSchema.readSchema Reading Solr Schema
[junit4:junit4]   2> 3451 T1680 oass.IndexSchema.readSchema Schema name=test
[junit4:junit4]   2> 4104 T1680 oass.OpenExchangeRatesOrgProvider.init Initialized with rates=open-exchange-rates.json, refreshInterval=1440.
[junit4:junit4]   2> 4117 T1680 oass.IndexSchema.readSchema default search field in schema is text
[junit4:junit4]   2> 4122 T1680 oass.IndexSchema.readSchema unique key field: id
[junit4:junit4]   2> 4132 T1680 oass.FileExchangeRateProvider.reload Reloading exchange rates from file currency.xml
[junit4:junit4]   2> 4138 T1680 oass.FileExchangeRateProvider.reload Reloading exchange rates from file currency.xml
[junit4:junit4]   2> 4142 T1680 oass.OpenExchangeRatesOrgProvider.reload Reloading exchange rates from open-exchange-rates.json
[junit4:junit4]   2> 4144 T1680 oass.OpenExchangeRatesOrgProvider.reload Reloading exchange rates from open-exchange-rates.json
[junit4:junit4]   2> 4145 T1680 oasc.SolrCore.<init> [collection1] Opening new SolrCore at /usr/home/hudson/hudson-slave/workspace/Lucene-Solr-Tests-4.x-java7/solr/build/solr-core/test/J0/./solrtest-jetty1-1347862709387/collection1/, dataDir=./org.apache.solr.cloud.BasicDistributedZk2Test-1347862706828/jetty1/
[junit4:junit4]   2> 4145 T1680 oasc.JmxMonitoredMap.<init> JMX monitoring is enabled. Adding Solr mbeans to JMX Server: com.sun.jmx.mbeanserver.JmxMBeanServer@28da95c1
[junit4:junit4]   2> 4147 T1680 oasc.SolrCore.getNewIndexDir WARNING New index directory detected: old=null new=./org.apache.solr.cloud.BasicDistributedZk2Test-1347862706828/jetty1/index/
[junit4:junit4]   2> 4148 T1680 oasc.SolrCore.initIndex WARNING [collection1] Solr index directory './org.apache.solr.cloud.BasicDistributedZk2Test-1347862706828/jetty1/index' doesn't exist. Creating new index...
[junit4:junit4]   2> 4149 T1680 oasc.CachingDirectoryFactory.get return new directory for /usr/home/hudson/hudson-slave/workspace/Lucene-Solr-Tests-4.x-java7/solr/build/solr-core/test/J0/./org.apache.solr.cloud.BasicDistributedZk2Test-1347862706828/jetty1/index forceNew:false
[junit4:junit4]   2> 4155 T1680 oasc.SolrDeletionPolicy.onCommit SolrDeletionPolicy.onCommit: commits:num=1
[junit4:junit4]   2> 		commit{dir=/usr/home/hudson/hudson-slave/workspace/Lucene-Solr-Tests-4.x-java7/solr/build/solr-core/test/J0/org.apache.solr.cloud.BasicDistributedZk2Test-1347862706828/jetty1/index,segFN=segments_1,generation=1,filenames=[segments_1]
[junit4:junit4]   2> 4156 T1680 oasc.SolrDeletionPolicy.updateCommits newest commit = 1
[junit4:junit4]   2> 4157 T1680 oasc.SolrCore.initWriters created xml: solr.XMLResponseWriter
[junit4:junit4]   2> 4160 T1680 oasup.UpdateRequestProcessorChain.init inserting DistributedUpdateProcessorFactory into updateRequestProcessorChain "dedupe"
[junit4:junit4]   2> 4161 T1680 oasup.UpdateRequestProcessorChain.init inserting DistributedUpdateProcessorFactory into updateRequestProcessorChain "dedupe-allfields"
[junit4:junit4]   2> 4161 T1680 oasup.UpdateRequestProcessorChain.init inserting DistributedUpdateProcessorFactory into updateRequestProcessorChain "stored_sig"
[junit4:junit4]   2> 4162 T1680 oasup.UpdateRequestProcessorChain.init inserting DistributedUpdateProcessorFactory into updateRequestProcessorChain "uniq-fields"
[junit4:junit4]   2> 4163 T1680 oasup.UpdateRequestProcessorChain.init inserting DistributedUpdateProcessorFactory into updateRequestProcessorChain "distrib-dup-test-chain-implicit"
[junit4:junit4]   2> 4164 T1680 oasc.RequestHandlers.initHandlersFromConfig adding lazy requestHandler: solr.ReplicationHandler
[junit4:junit4]   2> 4164 T1680 oasc.RequestHandlers.initHandlersFromConfig created /replication: solr.ReplicationHandler
[junit4:junit4]   2> 4165 T1680 oasc.RequestHandlers.initHandlersFromConfig created standard: solr.StandardRequestHandler
[junit4:junit4]   2> 4166 T1680 oasc.RequestHandlers.initHandlersFromConfig created /get: solr.RealTimeGetHandler
[junit4:junit4]   2> 4167 T1680 oasc.RequestHandlers.initHandlersFromConfig created dismax: solr.SearchHandler
[junit4:junit4]   2> 4168 T1680 oasc.RequestHandlers.initHandlersFromConfig created mock: org.apache.solr.core.MockQuerySenderListenerReqHandler
[junit4:junit4]   2> 4169 T1680 oasc.RequestHandlers.initHandlersFromConfig created /admin/: org.apache.solr.handler.admin.AdminHandlers
[junit4:junit4]   2> 4169 T1680 oasc.RequestHandlers.initHandlersFromConfig created defaults: solr.StandardRequestHandler
[junit4:junit4]   2> 4170 T1680 oasc.RequestHandlers.initHandlersFromConfig adding lazy requestHandler: solr.StandardRequestHandler
[junit4:junit4]   2> 4171 T1680 oasc.RequestHandlers.initHandlersFromConfig created lazy: solr.StandardRequestHandler
[junit4:junit4]   2> 4172 T1680 oasc.RequestHandlers.initHandlersFromConfig created /update: solr.UpdateRequestHandler
[junit4:junit4]   2> 4172 T1680 oasc.RequestHandlers.initHandlersFromConfig created /terms: org.apache.solr.handler.component.SearchHandler
[junit4:junit4]   2> 4173 T1680 oasc.RequestHandlers.initHandlersFromConfig created spellCheckCompRH: org.apache.solr.handler.component.SearchHandler
[junit4:junit4]   2> 4174 T1680 oasc.RequestHandlers.initHandlersFromConfig created spellCheckCompRH_Direct: org.apache.solr.handler.component.SearchHandler
[junit4:junit4]   2> 4175 T1680 oasc.RequestHandlers.initHandlersFromConfig created spellCheckWithWordbreak: org.apache.solr.handler.component.SearchHandler
[junit4:junit4]   2> 4176 T1680 oasc.RequestHandlers.initHandlersFromConfig created spellCheckWithWordbreak_Direct: org.apache.solr.handler.component.SearchHandler
[junit4:junit4]   2> 4177 T1680 oasc.RequestHandlers.initHandlersFromConfig created spellCheckCompRH1: org.apache.solr.handler.component.SearchHandler
[junit4:junit4]   2> 4177 T1680 oasc.RequestHandlers.initHandlersFromConfig created tvrh: org.apache.solr.handler.component.SearchHandler
[junit4:junit4]   2> 4178 T1680 oasc.RequestHandlers.initHandlersFromConfig created /mlt: solr.MoreLikeThisHandler
[junit4:junit4]   2> 4179 T1680 oasc.RequestHandlers.initHandlersFromConfig created /debug/dump: solr.DumpRequestHandler
[junit4:junit4]   2> 4183 T1680 oashl.XMLLoader.init xsltCacheLifetimeSeconds=60
[junit4:junit4]   2> 4188 T1680 oasc.SolrCore.initDeprecatedSupport WARNING solrconfig.xml uses deprecated <admin/gettableFiles>, Please update your config to use the ShowFileRequestHandler.
[junit4:junit4]   2> 4189 T1680 oasc.SolrCore.initDeprecatedSupport WARNING adding ShowFileRequestHandler with hidden files: [SCHEMA.XML, OLD_SYNONYMS.TXT, STOPWORDS.TXT, PROTWORDS.TXT, OPEN-EXCHANGE-RATES.JSON, SYNONYMS.TXT, CURRENCY.XML, MAPPING-ISOLATIN1ACCENT.TXT]
[junit4:junit4]   2> 4194 T1680 oass.SolrIndexSearcher.<init> Opening Searcher@67482872 main
[junit4:junit4]   2> 4195 T1680 oasu.CommitTracker.<init> Hard AutoCommit: disabled
[junit4:junit4]   2> 4196 T1680 oasu.CommitTracker.<init> Soft AutoCommit: disabled
[junit4:junit4]   2> 4197 T1680 oashc.SpellCheckComponent.inform Initializing spell checkers
[junit4:junit4]   2> 4205 T1680 oass.DirectSolrSpellChecker.init init: {name=direct,classname=DirectSolrSpellChecker,field=lowerfilt,minQueryLength=3}
[junit4:junit4]   2> 4263 T1715 oasc.SolrCore.registerSearcher [collection1] Registered new searcher Searcher@67482872 main{StandardDirectoryReader(segments_1:1)}
[junit4:junit4]   2> 4569 T1701 oascc.ZkStateReader.updateClusterState Updating cloud state from ZooKeeper... 
[junit4:junit4]   2> 4626 T1700 oascc.ZkStateReader$2.process A cluster state change has occurred - updating...
[junit4:junit4]   2> 4626 T1714 oascc.ZkStateReader$2.process A cluster state change has occurred - updating...
[junit4:junit4]   2> 4771 T1680 oasc.CoreContainer.register registering core: collection1
[junit4:junit4]   2> 4771 T1680 oasc.ZkController.register Register shard - core:collection1 address:http://127.0.0.1:42548/solr shardId:shard1
[junit4:junit4]   2> 4772 T1680 oascc.SolrZkClient.makePath makePath: /collections/collection1/leader_elect/shard1/election
[junit4:junit4]   2> 4793 T1685 oazs.PrepRequestProcessor.pRequest Got user-level KeeperException when processing sessionid:0x139d2e0ba910003 type:delete cxid:0x42 zxid:0xfffffffffffffffe txntype:unknown reqpath:n/a Error Path:/solr/collections/collection1/leaders Error:KeeperErrorCode = NoNode for /solr/collections/collection1/leaders
[junit4:junit4]   2> 4794 T1680 oasc.ShardLeaderElectionContext.runLeaderProcess Running the leader process.
[junit4:junit4]   2> 4794 T1685 oazs.PrepRequestProcessor.pRequest Got user-level KeeperException when processing sessionid:0x139d2e0ba910003 type:create cxid:0x43 zxid:0xfffffffffffffffe txntype:unknown reqpath:n/a Error Path:/solr/overseer Error:KeeperErrorCode = NodeExists for /solr/overseer
[junit4:junit4]   2> 4796 T1680 oasc.ShardLeaderElectionContext.waitForReplicasToComeUp Enough replicas found to continue.
[junit4:junit4]   2> 4796 T1680 oasc.ShardLeaderElectionContext.runLeaderProcess I may be the new leader - try and sync
[junit4:junit4]   2> 4797 T1680 oasc.SyncStrategy.sync Sync replicas to http://127.0.0.1:42548/solr/collection1/
[junit4:junit4]   2> 4797 T1680 oasc.SyncStrategy.syncReplicas Sync Success - now sync replicas to me
[junit4:junit4]   2> 4797 T1680 oasc.SyncStrategy.syncToMe http://127.0.0.1:42548/solr/collection1/ has no replicas
[junit4:junit4]   2> 4798 T1680 oasc.ShardLeaderElectionContext.runLeaderProcess I am the new leader: http://127.0.0.1:42548/solr/collection1/
[junit4:junit4]   2> 4798 T1680 oascc.SolrZkClient.makePath makePath: /collections/collection1/leaders/shard1
[junit4:junit4]   2> 4801 T1685 oazs.PrepRequestProcessor.pRequest Got user-level KeeperException when processing sessionid:0x139d2e0ba910003 type:create cxid:0x4d zxid:0xfffffffffffffffe txntype:unknown reqpath:n/a Error Path:/solr/overseer Error:KeeperErrorCode = NodeExists for /solr/overseer
[junit4:junit4]   2> 5133 T1701 oascc.ZkStateReader.updateClusterState Updating cloud state from ZooKeeper... 
[junit4:junit4]   2> 5157 T1700 oascc.ZkStateReader$2.process A cluster state change has occurred - updating...
[junit4:junit4]   2> 5157 T1714 oascc.ZkStateReader$2.process A cluster state change has occurred - updating...
[junit4:junit4]   2> 5159 T1680 oasc.ZkController.register We are http://127.0.0.1:42548/solr/collection1/ and leader is http://127.0.0.1:42548/solr/collection1/
[junit4:junit4]   2> 5159 T1680 oasc.ZkController.register No LogReplay needed for core=collection1 baseURL=http://127.0.0.1:42548/solr
[junit4:junit4]   2> 5160 T1680 oasc.ZkController.checkRecovery I am the leader, no recovery necessary
[junit4:junit4]   2> 5162 T1680 oascc.ZkStateReader.updateClusterState Updating cloud state from ZooKeeper... 
[junit4:junit4]   2> 5163 T1680 oass.SolrDispatchFilter.init user.dir=/usr/home/hudson/hudson-slave/workspace/Lucene-Solr-Tests-4.x-java7/solr/build/solr-core/test/J0
[junit4:junit4]   2> 5163 T1680 oass.SolrDispatchFilter.init SolrDispatchFilter.init() done
[junit4:junit4]   2> 5163 T1680 oascsi.HttpClientUtil.createClient Creating new http client, config:maxConnections=128&maxConnectionsPerHost=32&followRedirects=false
[junit4:junit4]   2> 5502 T1680 oejs.Server.doStart jetty-8.1.2.v20120308
[junit4:junit4]   2> 5506 T1680 oejs.AbstractConnector.doStart Started SocketConnector@0.0.0.0:42552
[junit4:junit4]   2> 5506 T1680 oasc.SolrResourceLoader.locateSolrHome JNDI not configured for solr (NoInitialContextEx)
[junit4:junit4]   2> 5506 T1680 oasc.SolrResourceLoader.locateSolrHome using system property solr.solr.home: /usr/home/hudson/hudson-slave/workspace/Lucene-Solr-Tests-4.x-java7/solr/build/solr-core/test/J0/./solrtest-jetty2-1347862711998
[junit4:junit4]   2> 5507 T1680 oasc.SolrResourceLoader.<init> new SolrResourceLoader for deduced Solr Home: '/usr/home/hudson/hudson-slave/workspace/Lucene-Solr-Tests-4.x-java7/solr/build/solr-core/test/J0/./solrtest-jetty2-1347862711998/'
[junit4:junit4]   2> 5537 T1680 oass.SolrDispatchFilter.init SolrDispatchFilter.init()
[junit4:junit4]   2> 5537 T1680 oasc.SolrResourceLoader.locateSolrHome JNDI not configured for solr (NoInitialContextEx)
[junit4:junit4]   2> 5538 T1680 oasc.SolrResourceLoader.locateSolrHome using system property solr.solr.home: /usr/home/hudson/hudson-slave/workspace/Lucene-Solr-Tests-4.x-java7/solr/build/solr-core/test/J0/./solrtest-jetty2-1347862711998
[junit4:junit4]   2> 5538 T1680 oasc.CoreContainer$Initializer.initialize looking for solr.xml: /usr/home/hudson/hudson-slave/workspace/Lucene-Solr-Tests-4.x-java7/solr/build/solr-core/test/J0/./solrtest-jetty2-1347862711998/solr.xml
[junit4:junit4]   2> 5539 T1680 oasc.CoreContainer.<init> New CoreContainer 1903829117
[junit4:junit4]   2> 5539 T1680 oasc.CoreContainer.load Loading CoreContainer using Solr Home: '/usr/home/hudson/hudson-slave/workspace/Lucene-Solr-Tests-4.x-java7/solr/build/solr-core/test/J0/./solrtest-jetty2-1347862711998/'
[junit4:junit4]   2> 5540 T1680 oasc.SolrResourceLoader.<init> new SolrResourceLoader for directory: '/usr/home/hudson/hudson-slave/workspace/Lucene-Solr-Tests-4.x-java7/solr/build/solr-core/test/J0/./solrtest-jetty2-1347862711998/'
[junit4:junit4]   2> 5564 T1680 oasc.CoreContainer.load Registering Log Listener
[junit4:junit4]   2> 5576 T1680 oasc.CoreContainer.initZooKeeper Zookeeper client=127.0.0.1:42540/solr
[junit4:junit4]   2> 5576 T1680 oaz.ZooKeeper.<init> Initiating client connection, connectString=127.0.0.1:42540/solr sessionTimeout=5000 watcher=org.apache.solr.common.cloud.ConnectionManager@2d0eb946
[junit4:junit4]   2> 5577 T1725 oaz.ClientCnxn$SendThread.startConnect Opening socket connection to server /127.0.0.1:42540
[junit4:junit4]   2> 5577 T1680 oascc.ConnectionManager.waitForConnected Waiting for client to connect to ZooKeeper
[junit4:junit4]   2> 5579 T1725 oaz.ClientCnxn$SendThread.primeConnection Socket connection established to localhost/127.0.0.1:42540, initiating session
[junit4:junit4]   2> 5579 T1682 oazs.NIOServerCnxn$Factory.run Accepted socket connection from /140.211.11.196:42553
[junit4:junit4]   2> 5579 T1682 oazs.NIOServerCnxn.readConnectRequest Client attempting to establish new session at /140.211.11.196:42553
[junit4:junit4]   2> 5582 T1684 oazs.NIOServerCnxn.finishSessionInit Established session 0x139d2e0ba910004 with negotiated timeout 5000 for client /140.211.11.196:42553
[junit4:junit4]   2> 5582 T1725 oaz.ClientCnxn$SendThread.readConnectResult Session establishment complete on server localhost/127.0.0.1:42540, sessionid = 0x139d2e0ba910004, negotiated timeout = 5000
[junit4:junit4]   2> 5583 T1726 oascc.ConnectionManager.process Watcher org.apache.solr.common.cloud.ConnectionManager@2d0eb946 name:ZooKeeperConnection Watcher:127.0.0.1:42540/solr got event WatchedEvent state:SyncConnected type:None path:null path:null type:None
[junit4:junit4]   2> 5583 T1680 oascc.ConnectionManager.waitForConnected Client is connected to ZooKeeper
[junit4:junit4]   2> 5584 T1685 oazs.PrepRequestProcessor.pRequest Got user-level KeeperException when processing sessionid:0x139d2e0ba910004 type:create cxid:0x1 zxid:0xfffffffffffffffe txntype:unknown reqpath:n/a Error Path:/solr/overseer Error:KeeperErrorCode = NodeExists for /solr/overseer
[junit4:junit4]   2> 5598 T1685 oazs.PrepRequestProcessor.pRequest Got user-level KeeperException when processing sessionid:0x139d2e0ba910004 type:create cxid:0x2 zxid:0xfffffffffffffffe txntype:unknown reqpath:n/a Error Path:/solr/overseer Error:KeeperErrorCode = NodeExists for /solr/overseer
[junit4:junit4]   2> 5599 T1680 oasc.ZkController.createEphemeralLiveNode Register node as live in ZooKeeper:/live_nodes/127.0.0.1:42552_solr
[junit4:junit4]   2> 5600 T1685 oazs.PrepRequestProcessor.pRequest Got user-level KeeperException when processing sessionid:0x139d2e0ba910004 type:delete cxid:0x4 zxid:0xfffffffffffffffe txntype:unknown reqpath:n/a Error Path:/solr/live_nodes/127.0.0.1:42552_solr Error:KeeperErrorCode = NoNode for /solr/live_nodes/127.0.0.1:42552_solr
[junit4:junit4]   2> 5601 T1680 oascc.SolrZkClient.makePath makePath: /live_nodes/127.0.0.1:42552_solr
[junit4:junit4]   2> 5603 T1700 oascc.ZkStateReader$3.process Updating live nodes
[junit4:junit4]   2> 5603 T1714 oascc.ZkStateReader$3.process Updating live nodes
[junit4:junit4]   2> 5604 T1680 oashc.HttpShardHandlerFactory.getParameter Setting socketTimeout to: 0
[junit4:junit4]   2> 5604 T1680 oashc.HttpShardHandlerFactory.getParameter Setting urlScheme to: http://
[junit4:junit4]   2> 5604 T1680 oashc.HttpShardHandlerFactory.getParameter Setting connTimeout to: 0
[junit4:junit4]   2> 5605 T1680 oashc.HttpShardHandlerFactory.getParameter Setting maxConnectionsPerHost to: 20
[junit4:junit4]   2> 5605 T1680 oashc.HttpShardHandlerFactory.getParameter Setting corePoolSize to: 0
[junit4:junit4]   2> 5605 T1680 oashc.HttpShardHandlerFactory.getParameter Setting maximumPoolSize to: 2147483647
[junit4:junit4]   2> 5606 T1680 oashc.HttpShardHandlerFactory.getParameter Setting maxThreadIdleTime to: 5
[junit4:junit4]   2> 5606 T1680 oashc.HttpShardHandlerFactory.getParameter Setting sizeOfQueue to: -1
[junit4:junit4]   2> 5607 T1680 oashc.HttpShardHandlerFactory.getParameter Setting fairnessPolicy to: false
[junit4:junit4]   2> 5607 T1680 oascsi.HttpClientUtil.createClient Creating new http client, config:maxConnectionsPerHost=20&maxConnections=10000&socketTimeout=0&connTimeout=0&retry=false
[junit4:junit4]   2> 5619 T1680 oascc.ZkStateReader.createClusterStateWatchersAndUpdate Updating cluster state from ZooKeeper... 
[junit4:junit4]   2> 5626 T1680 oasc.CoreContainer.create Creating SolrCore 'collection1' using instanceDir: /usr/home/hudson/hudson-slave/workspace/Lucene-Solr-Tests-4.x-java7/solr/build/solr-core/test/J0/./solrtest-jetty2-1347862711998/collection1
[junit4:junit4]   2> 5627 T1680 oasc.ZkController.createCollectionZkNode Check for collection zkNode:collection1
[junit4:junit4]   2> 5627 T1680 oasc.ZkController.createCollectionZkNode Collection zkNode exists
[junit4:junit4]   2> 5628 T1680 oasc.ZkController.readConfigName Load collection config from:/collections/collection1
[junit4:junit4]   2> 5629 T1680 oasc.SolrResourceLoader.<init> new SolrResourceLoader for directory: '/usr/home/hudson/hudson-slave/workspace/Lucene-Solr-Tests-4.x-java7/solr/build/solr-core/test/J0/./solrtest-jetty2-1347862711998/collection1/'
[junit4:junit4]   2> 5631 T1680 oasc.SolrResourceLoader.replaceClassLoader Adding 'file:/usr/home/hudson/hudson-slave/workspace/Lucene-Solr-Tests-4.x-java7/solr/build/solr-core/test/J0/solrtest-jetty2-1347862711998/collection1/lib/README' to classloader
[junit4:junit4]   2> 5632 T1680 oasc.SolrResourceLoader.replaceClassLoader Adding 'file:/usr/home/hudson/hudson-slave/workspace/Lucene-Solr-Tests-4.x-java7/solr/build/solr-core/test/J0/solrtest-jetty2-1347862711998/collection1/lib/classes/' to classloader
[junit4:junit4]   2> 5661 T1701 oascc.ZkStateReader.updateClusterState Updating cloud state from ZooKeeper... 
[junit4:junit4]   2> 5674 T1726 oascc.ZkStateReader$2.process A cluster state change has occurred - updating...
[junit4:junit4]   2> 5674 T1714 oascc.ZkStateReader$2.process A cluster state change has occurred - updating...
[junit4:junit4]   2> 5674 T1700 oascc.ZkStateReader$2.process A cluster state change has occurred - updating...
[junit4:junit4]   2> 5690 T1680 oasc.SolrConfig.<init> Using Lucene MatchVersion: LUCENE_40
[junit4:junit4]   2> 5783 T1680 oasc.SolrConfig.<init> Loaded SolrConfig: solrconfig.xml
[junit4:junit4]   2> 5885 T1680 oass.IndexSchema.readSchema Reading Solr Schema
[junit4:junit4]   2> 5892 T1680 oass.IndexSchema.readSchema Schema name=test
[junit4:junit4]   2> 6494 T1680 oass.OpenExchangeRatesOrgProvider.init Initialized with rates=open-exchange-rates.json, refreshInterval=1440.
[junit4:junit4]   2> 6502 T1680 oass.IndexSchema.readSchema default search field in schema is text
[junit4:junit4]   2> 6505 T1680 oass.IndexSchema.readSchema unique key field: id
[junit4:junit4]   2> 6514 T1680 oass.FileExchangeRateProvider.reload Reloading exchange rates from file currency.xml
[junit4:junit4]   2> 6518 T1680 oass.FileExchangeRateProvider.reload Reloading exchange rates from file currency.xml
[junit4:junit4]   2> 6521 T1680 oass.OpenExchangeRatesOrgProvider.reload Reloading exchange rates from open-exchange-rates.json
[junit4:junit4]   2> 6522 T1680 oass.OpenExchangeRatesOrgProvider.reload Reloading exchange rates from open-exchange-rates.json
[junit4:junit4]   2> 6523 T1680 oasc.SolrCore.<init> [collection1] Opening new SolrCore at /usr/home/hudson/hudson-slave/workspace/Lucene-Solr-Tests-4.x-java7/solr/build/solr-core/test/J0/./solrtest-jetty2-1347862711998/collection1/, dataDir=./org.apache.solr.cloud.BasicDistributedZk2Test-1347862706828/jetty2/
[junit4:junit4]   2> 6523 T1680 oasc.JmxMonitoredMap.<init> JMX monitoring is enabled. Adding Solr mbeans to JMX Server: com.sun.jmx.mbeanserver.JmxMBeanServer@28da95c1
[junit4:junit4]   2> 6524 T1680 oasc.SolrCore.getNewIndexDir WARNING New index directory detected: old=null new=./org.apache.solr.cloud.BasicDistributedZk2Test-1347862706828/jetty2/index/
[junit4:junit4]   2> 6525 T1680 oasc.SolrCore.initIndex WARNING [collection1] Solr index directory './org.apache.solr.cloud.BasicDistributedZk2Test-1347862706828/jetty2/index' doesn't exist. Creating new index...
[junit4:junit4]   2> 6525 T1680 oasc.CachingDirectoryFactory.get return new directory for /usr/home/hudson/hudson-slave/workspace/Lucene-Solr-Tests-4.x-java7/solr/build/solr-core/test/J0/./org.apache.solr.cloud.BasicDistributedZk2Test-1347862706828/jetty2/index forceNew:false
[junit4:junit4]   2> 6556 T1680 oasc.SolrDeletionPolicy.onCommit SolrDeletionPolicy.onCommit: commits:num=1
[junit4:junit4]   2> 		commit{dir=/usr/home/hudson/hudson-slave/workspace/Lucene-Solr-Tests-4.x-java7/solr/build/solr-core/test/J0/org.apache.solr.cloud.BasicDistributedZk2Test-1347862706828/jetty2/index,segFN=segments_1,generation=1,filenames=[segments_1]
[junit4:junit4]   2> 6557 T1680 oasc.SolrDeletionPolicy.updateCommits newest commit = 1
[junit4:junit4]   2> 6558 T1680 oasc.SolrCore.initWriters created xml: solr.XMLResponseWriter
[junit4:junit4]   2> 6560 T1680 oasup.UpdateRequestProcessorChain.init inserting DistributedUpdateProcessorFactory into updateRequestProcessorChain "dedupe"
[junit4:junit4]   2> 6560 T1680 oasup.UpdateRequestProcessorChain.init inserting DistributedUpdateProcessorFactory into updateRequestProcessorChain "dedupe-allfields"
[junit4:junit4]   2> 6561 T1680 oasup.UpdateRequestProcessorChain.init inserting DistributedUpdateProcessorFactory into updateRequestProcessorChain "stored_sig"
[junit4:junit4]   2> 6561 T1680 oasup.UpdateRequestProcessorChain.init inserting DistributedUpdateProcessorFactory into updateRequestProcessorChain "uniq-fields"
[junit4:junit4]   2> 6562 T1680 oasup.UpdateRequestProcessorChain.init inserting DistributedUpdateProcessorFactory into updateRequestProcessorChain "distrib-dup-test-chain-implicit"
[junit4:junit4]   2> 6562 T1680 oasc.RequestHandlers.initHandlersFromConfig adding lazy requestHandler: solr.ReplicationHandler
[junit4:junit4]   2> 6563 T1680 oasc.RequestHandlers.initHandlersFromConfig created /replication: solr.ReplicationHandler
[junit4:junit4]   2> 6563 T1680 oasc.RequestHandlers.initHandlersFromConfig created standard: solr.StandardRequestHandler
[junit4:junit4]   2> 6564 T1680 oasc.RequestHandlers.initHandlersFromConfig created /get: solr.RealTimeGetHandler
[junit4:junit4]   2> 6565 T1680 oasc.RequestHandlers.initHandlersFromConfig created dismax: solr.SearchHandler
[junit4:junit4]   2> 6565 T1680 oasc.RequestHandlers.initHandlersFromConfig created mock: org.apache.solr.core.MockQuerySenderListenerReqHandler
[junit4:junit4]   2> 6566 T1680 oasc.RequestHandlers.initHandlersFromConfig created /admin/: org.apache.solr.handler.admin.AdminHandlers
[junit4:junit4]   2> 6566 T1680 oasc.RequestHandlers.initHandlersFromConfig created defaults: solr.StandardRequestHandler
[junit4:junit4]   2> 6567 T1680 oasc.RequestHandlers.initHandlersFromConfig adding lazy requestHandler: solr.StandardRequestHandler
[junit4:junit4]   2> 6567 T1680 oasc.RequestHandlers.initHandlersFromConfig created lazy: solr.StandardRequestHandler
[junit4:junit4]   2> 6568 T1680 oasc.RequestHandlers.initHandlersFromConfig created /update: solr.UpdateRequestHandler
[junit4:junit4]   2> 6568 T1680 oasc.RequestHandlers.initHandlersFromConfig created /terms: org.apache.solr.handler.component.SearchHandler
[junit4:junit4]   2> 6569 T1680 oasc.RequestHandlers.initHandlersFromConfig created spellCheckCompRH: org.apache.solr.handler.component.SearchHandler
[junit4:junit4]   2> 6569 T1680 oasc.RequestHandlers.initHandlersFromConfig created spellCheckCompRH_Direct: org.apache.solr.handler.component.SearchHandler
[junit4:junit4]   2> 6570 T1680 oasc.RequestHandlers.initHandlersFromConfig created spellCheckWithWordbreak: org.apache.solr.handler.component.SearchHandler
[junit4:junit4]   2> 6570 T1680 oasc.RequestHandlers.initHandlersFromConfig created spellCheckWithWordbreak_Direct: org.apache.solr.handler.component.SearchHandler
[junit4:junit4]   2> 6571 T1680 oasc.RequestHandlers.initHandlersFromConfig created spellCheckCompRH1: org.apache.solr.handler.component.SearchHandler
[junit4:junit4]   2> 6571 T1680 oasc.RequestHandlers.initHandlersFromConfig created tvrh: org.apache.solr.handler.component.SearchHandler
[junit4:junit4]   2> 6572 T1680 oasc.RequestHandlers.initHandlersFromConfig created /mlt: solr.MoreLikeThisHandler
[junit4:junit4]   2> 6573 T1680 oasc.RequestHandlers.initHandlersFromConfig created /debug/dump: solr.DumpRequestHandler
[junit4:junit4]   2> 6575 T1680 oashl.XMLLoader.init xsltCacheLifetimeSeconds=60
[junit4:junit4]   2> 6579 T1680 oasc.SolrCore.initDeprecatedSupport WARNING solrconfig.xml uses deprecated <admin/gettableFiles>, Please update your config to use the ShowFileRequestHandler.
[junit4:junit4]   2> 6580 T1680 oasc.SolrCore.initDeprecatedSupport WARNING adding ShowFileRequestHandler with hidden files: [SCHEMA.XML, OLD_SYNONYMS.TXT, STOPWORDS.TXT, PROTWORDS.TXT, OPEN-EXCHANGE-RATES.JSON, SYNONYMS.TXT, CURRENCY.XML, MAPPING-ISOLATIN1ACCENT.TXT]
[junit4:junit4]   2> 6583 T1680 oass.SolrIndexSearcher.<init> Opening Searcher@3118c9f3 main
[junit4:junit4]   2> 6584 T1680 oasu.CommitTracker.<init> Hard AutoCommit: disabled
[junit4:junit4]   2> 6584 T1680 oasu.CommitTracker.<init> Soft AutoCommit: disabled
[junit4:junit4]   2> 6585 T1680 oashc.SpellCheckComponent.inform Initializing spell checkers
[junit4:junit4]   2> 6591 T1680 oass.DirectSolrSpellChecker.init init: {name=direct,classname=DirectSolrSpellChecker,field=lowerfilt,minQueryLength=3}
[junit4:junit4]   2> 6643 T1727 oasc.SolrCore.registerSearcher [collection1] Registered new searcher Searcher@3118c9f3 main{StandardDirectoryReader(segments_1:1)}
[junit4:junit4]   2> 6680 T1701 oascc.ZkStateReader.updateClusterState Updating cloud state from ZooKeeper... 
[junit4:junit4]   2> 6693 T1700 oascc.ZkStateReader$2.process A cluster state change has occurred - updating...
[junit4:junit4]   2> 6693 T1726 oascc.ZkStateReader$2.process A cluster state change has occurred - updating...
[junit4:junit4]   2> 6693 T1714 oascc.ZkStateReader$2.process A cluster state change has occurred - updating...
[junit4:junit4]   2> 7149 T1680 oasc.CoreContainer.register registering core: collection1
[junit4:junit4]   2> 7149 T1680 oasc.ZkController.register Register shard - core:collection1 address:http://127.0.0.1:42552/solr shardId:shard2
[junit4:junit4]   2> 7150 T1680 oascc.SolrZkClient.makePath makePath: /collections/collection1/leader_elect/shard2/election
[junit4:junit4]   2> 7165 T1685 oazs.PrepRequestProcessor.pRequest Got user-level KeeperException when processing sessionid:0x139d2e0ba910004 type:delete cxid:0x42 zxid:0xfffffffffffffffe txntype:unknown reqpath:n/a Error Path:/solr/collections/collection1/leaders/shard2 Error:KeeperErrorCode = NoNode for /solr/collections/collection1/leaders/shard2
[junit4:junit4]   2> 7166 T1680 oasc.ShardLeaderElectionContext.runLeaderProcess Running the leader process.
[junit4:junit4]   2> 7167 T1685 oazs.PrepRequestProcessor.pRequest Got user-level KeeperException when processing sessionid:0x139d2e0ba910004 type:create cxid:0x43 zxid:0xfffffffffffffffe txntype:unknown reqpath:n/a Error Path:/solr/overseer Error:KeeperErrorCode = NodeExists for /solr/overseer
[junit4:junit4]   2> 7168 T1680 oasc.ShardLeaderElectionContext.waitForReplicasToComeUp Enough replicas found to continue.
[junit4:junit4]   2> 7168 T1680 oasc.ShardLeaderElectionContext.runLeaderProcess I may be the new leader - try and sync
[junit4:junit4]   2> 7169 T1680 oasc.SyncStrategy.sync Sync replicas to http://127.0.0.1:42552/solr/collection1/
[junit4:junit4]   2> 7169 T1680 oasc.SyncStrategy.syncReplicas Sync Success - now sync replicas to me
[junit4:junit4]   2> 7170 T1680 oasc.SyncStrategy.syncToMe http://127.0.0.1:42552/solr/collection1/ has no replicas
[junit4:junit4]   2> 7170 T1680 oasc.ShardLeaderElectionContext.runLeaderProcess I am the new leader: http://127.0.0.1:42552/solr/collection1/
[junit4:junit4]   2> 7170 T1680 oascc.SolrZkClient.makePath makePath: /collections/collection1/leaders/shard2
[junit4:junit4]   2> 7172 T1685 oazs.PrepRequestProcessor.pRequest Got user-level KeeperException when processing sessionid:0x139d2e0ba910004 type:create cxid:0x4c zxid:0xfffffffffffffffe txntype:unknown reqpath:n/a Error Path:/solr/overseer Error:KeeperErrorCode = NodeExists for /solr/overseer
[junit4:junit4]   2> 7196 T1701 oascc.ZkStateReader.updateClusterState Updating cloud state from ZooKeeper... 
[junit4:junit4]   2> 7201 T1726 oascc.ZkStateReader$2.process A cluster state change has occurred - updating...
[junit4:junit4]   2> 7201 T1700 oascc.ZkStateReader$2.process A cluster state change has occurred - updating...
[junit4:junit4]   2> 7201 T1714 oascc.ZkStateReader$2.process A cluster state change has occurred - updating...
[junit4:junit4]   2> 7225 T1680 oasc.ZkController.register We are http://127.0.0.1:42552/solr/collection1/ and leader is http://127.0.0.1:42552/solr/collection1/
[junit4:junit4]   2> 7225 T1680 oasc.ZkController.register No LogReplay needed for core=collection1 baseURL=http://127.0.0.1:42552/solr
[junit4:junit4]   2> 7225 T1680 oasc.ZkController.checkRecovery I am the leader, no recovery necessary
[junit4:junit4]   2> 7227 T1680 oascc.ZkStateReader.updateClusterState Updating cloud state from ZooKeeper... 
[junit4:junit4]   2> 7227 T1680 oass.SolrDispatchFilter.init user.dir=/usr/home/hudson/hudson-slave/workspace/Lucene-Solr-Tests-4.x-java7/solr/build/solr-core/test/J0
[junit4:junit4]   2> 7228 T1680 oass.SolrDispatchFilter.init SolrDispatchFilter.init() done
[junit4:junit4]   2> 7228 T1680 oascsi.HttpClientUtil.createClient Creating new http client, config:maxConnections=128&maxConnectionsPerHost=32&followRedirects=false
[junit4:junit4]   2> 7638 T1680 oejs.Server.doStart jetty-8.1.2.v20120308
[junit4:junit4]   2> 7642 T1680 oejs.AbstractConnector.doStart Started SocketConnector@0.0.0.0:42554
[junit4:junit4]   2> 7642 T1680 oasc.SolrResourceLoader.locateSolrHome JNDI not configured for solr (NoInitialContextEx)
[junit4:junit4]   2> 7643 T1680 oasc.SolrResourceLoader.locateSolrHome using system property solr.solr.home: /usr/home/hudson/hudson-slave/workspace/Lucene-Solr-Tests-4.x-java7/solr/build/solr-core/test/J0/./solrtest-jetty3-1347862714063
[junit4:junit4]   2> 7644 T1680 oasc.SolrResourceLoader.<init> new SolrResourceLoader for deduced Solr Home: '/usr/home/hudson/hudson-slave/workspace/Lucene-Solr-Tests-4.x-java7/solr/build/solr-core/test/J0/./solrtest-jetty3-1347862714063/'
[junit4:junit4]   2> 7687 T1680 oass.SolrDispatchFilter.init SolrDispatchFilter.init()
[junit4:junit4]   2> 7688 T1680 oasc.SolrResourceLoader.locateSolrHome JNDI not configured for solr (NoInitialContextEx)
[junit4:junit4]   2> 7688 T1680 oasc.SolrResourceLoader.locateSolrHome using system property solr.solr.home: /usr/home/hudson/hudson-slave/workspace/Lucene-Solr-Tests-4.x-java7/solr/build/solr-core/test/J0/./solrtest-jetty3-1347862714063
[junit4:junit4]   2> 7689 T1680 oasc.CoreContainer$Initializer.initialize looking for solr.xml: /usr/home/hudson/hudson-slave/workspace/Lucene-Solr-Tests-4.x-java7/solr/build/solr-core/test/J0/./solrtest-jetty3-1347862714063/solr.xml
[junit4:junit4]   2> 7689 T1680 oasc.CoreContainer.<init> New CoreContainer 841294131
[junit4:junit4]   2> 7690 T1680 oasc.CoreContainer.load Loading CoreContainer using Solr Home: '/usr/home/hudson/hudson-slave/workspace/Lucene-Solr-Tests-4.x-java7/solr/build/solr-core/test/J0/./solrtest-jetty3-1347862714063/'
[junit4:junit4]   2> 7691 T1680 oasc.SolrResourceLoader.<init> new SolrResourceLoader for directory: '/usr/home/hudson/hudson-slave/workspace/Lucene-Solr-Tests-4.x-java7/solr/build/solr-core/test/J0/./solrtest-jetty3-1347862714063/'
[junit4:junit4]   2> 7705 T1701 oascc.ZkStateReader.updateClusterState Updating cloud state from ZooKeeper... 
[junit4:junit4]   2> 7725 T1680 oasc.CoreContainer.load Registering Log Listener
[junit4:junit4]   2> 7726 T1700 oascc.ZkStateReader$2.process A cluster state change has occurred - updating...
[junit4:junit4]   2> 7726 T1726 oascc.ZkStateReader$2.process A cluster state change has occurred - updating...
[junit4:junit4]   2> 7726 T1714 oascc.ZkStateReader$2.process A cluster state change has occurred - updating...
[junit4:junit4]   2> 7743 T1680 oasc.CoreContainer.initZooKeeper Zookeeper client=127.0.0.1:42540/solr
[junit4:junit4]   2> 7744 T1680 oaz.ZooKeeper.<init> Initiating client connection, connectString=127.0.0.1:42540/solr sessionTimeout=5000 watcher=org.apache.solr.common.cloud.ConnectionManager@6bd4fea4
[junit4:junit4]   2> 7745 T1737 oaz.ClientCnxn$SendThread.startConnect Opening socket connection to server /127.0.0.1:42540
[junit4:junit4]   2> 7745 T1680 oascc.ConnectionManager.waitForConnected Waiting for client to connect to ZooKeeper
[junit4:junit4]   2> 7746 T1737 oaz.ClientCnxn$SendThread.primeConnection Socket connection established to localhost/127.0.0.1:42540, initiating session
[junit4:junit4]   2> 7747 T1682 oazs.NIOServerCnxn$Factory.run Accepted socket connection from /140.211.11.196:42555
[junit4:junit4]   2> 7747 T1682 oazs.NIOServerCnxn.readConnectRequest Client attempting to establish new session at /140.211.11.196:42555
[junit4:junit4]   2> 7749 T1684 oazs.NIOServerCnxn.finishSessionInit Established session 0x139d2e0ba910005 with negotiated timeout 5000 for client /140.211.11.196:42555
[junit4:junit4]   2> 7749 T1737 oaz.ClientCnxn$SendThread.readConnectResult Session establishment complete on server localhost/127.0.0.1:42540, sessionid = 0x139d2e0ba910005, negotiated timeout = 5000
[junit4:junit4]   2> 7749 T1738 oascc.ConnectionManager.process Watcher org.apache.solr.common.cloud.ConnectionManager@6bd4fea4 name:ZooKeeperConnection Watcher:127.0.0.1:42540/solr got event WatchedEvent state:SyncConnected type:None path:null path:null type:None
[junit4:junit4]   2> 7750 T1680 oascc.ConnectionManager.waitForConnected Client is connected to ZooKeeper
[junit4:junit4]   2> 7751 T1685 oazs.PrepRequestProcessor.pRequest Got user-level KeeperException when processing sessionid:0x139d2e0ba910005 type:create cxid:0x1 zxid:0xfffffffffffffffe txntype:unknown reqpath:n/a Error Path:/solr/overseer Error:KeeperErrorCode = NodeExists for /solr/overseer
[junit4:junit4]   2> 7752 T1685 oazs.PrepRequestProcessor.pRequest Got user-level KeeperException when processing sessionid:0x139d2e0ba910005 type:create cxid:0x2 zxid:0xfffffffffffffffe txntype:unknown reqpath:n/a Error Path:/solr/overseer Error:KeeperErrorCode = NodeExists for /solr/overseer
[junit4:junit4]   2> 7753 T1680 oasc.ZkController.createEphemeralLiveNode Register node as live in ZooKeeper:/live_nodes/127.0.0.1:42554_solr
[junit4:junit4]   2> 7754 T1685 oazs.PrepRequestProcessor.pRequest Got user-level KeeperException when processing sessionid:0x139d2e0ba910005 type:delete cxid:0x4 zxid:0xfffffffffffffffe txntype:unknown reqpath:n/a Error Path:/solr/live_nodes/127.0.0.1:42554_solr Error:KeeperErrorCode = NoNode for /solr/live_nodes/127.0.0.1:42554_solr
[junit4:junit4]   2> 7755 T1680 oascc.SolrZkClient.makePath makePath: /live_nodes/127.0.0.1:42554_solr
[junit4:junit4]   2> 7767 T1700 oascc.ZkStateReader$3.process Updating live nodes
[junit4:junit4]   2> 7767 T1726 oascc.ZkStateReader$3.process Updating live nodes
[junit4:junit4]   2> 7767 T1714 oascc.ZkStateReader$3.process Updating live nodes
[junit4:junit4]   2> 7768 T1680 oashc.HttpShardHandlerFactory.getParameter Setting socketTimeout to: 0
[junit4:junit4]   2> 7768 T1680 oashc.HttpShardHandlerFactory.getParameter Setting urlScheme to: http://
[junit4:junit4]   2> 7769 T1680 oashc.HttpShardHandlerFactory.getParameter Setting connTimeout to: 0
[junit4:junit4]   2> 7769 T1680 oashc.HttpShardHandlerFactory.getParameter Setting maxConnectionsPerHost to: 20
[junit4:junit4]   2> 7770 T1680 oashc.HttpShardHandlerFactory.getParameter Setting corePoolSize to: 0
[junit4:junit4]   2> 7771 T1680 oashc.HttpShardHandlerFactory.getParameter Setting maximumPoolSize to: 2147483647
[junit4:junit4]   2> 7771 T1680 oashc.HttpShardHandlerFactory.getParameter Setting maxThreadIdleTime to: 5
[junit4:junit4]   2> 7772 T1680 oashc.HttpShardHandlerFactory.getParameter Setting sizeOfQueue to: -1
[junit4:junit4]   2> 7772 T1680 oashc.HttpShardHandlerFactory.getParameter Setting fairnessPolicy to: false
[junit4:junit4]   2> 7773 T1680 oascsi.HttpClientUtil.createClient Creating new http client, config:maxConnectionsPerHost=20&maxConnections=10000&socketTimeout=0&connTimeout=0&retry=false
[junit4:junit4]   2> 7792 T1680 oascc.ZkStateReader.createClusterStateWatchersAndUpdate Updating cluster state from ZooKeeper... 
[junit4:junit4]   2> 7799 T1680 oasc.CoreContainer.create Creating SolrCore 'collection1' using instanceDir: /usr/home/hudson/hudson-slave/workspace/Lucene-Solr-Tests-4.x-java7/solr/build/solr-core/test/J0/./solrtest-jetty3-1347862714063/collection1
[junit4:junit4]   2> 7800 T1680 oasc.ZkController.createCollectionZkNode Check for collection zkNode:collection1
[junit4:junit4]   2> 7801 T1680 oasc.ZkController.createCollectionZkNode Collection zkNode exists
[junit4:junit4]   2> 7801 T1680 oasc.ZkController.readConfigName Load collection config from:/collections/collection1
[junit4:junit4]   2> 7803 T1680 oasc.SolrResourceLoader.<init> new SolrResourceLoader for directory: '/usr/home/hudson/hudson-slave/workspace/Lucene-Solr-Tests-4.x-java7/solr/build/solr-core/test/J0/./solrtest-jetty3-1347862714063/collection1/'
[junit4:junit4]   2> 7804 T1680 oasc.SolrResourceLoader.replaceClassLoader Adding 'file:/usr/home/hudson/hudson-slave/workspace/Lucene-Solr-Tests-4.x-java7/solr/build/solr-core/test/J0/solrtest-jetty3-1347862714063/collection1/lib/classes/' to classloader
[junit4:junit4]   2> 7805 T1680 oasc.SolrResourceLoader.replaceClassLoader Adding 'file:/usr/home/hudson/hudson-slave/workspace/Lucene-Solr-Tests-4.x-java7/solr/build/solr-core/test/J0/solrtest-jetty3-1347862714063/collection1/lib/README' to classloader
[junit4:junit4]   2> 7860 T1680 oasc.SolrConfig.<init> Using Lucene MatchVersion: LUCENE_40
[junit4:junit4]   2> 7935 T1680 oasc.SolrConfig.<init> Loaded SolrConfig: solrconfig.xml
[junit4:junit4]   2> 8036 T1680 oass.IndexSchema.readSchema Reading Solr Schema
[junit4:junit4]   2> 8044 T1680 oass.IndexSchema.readSchema Schema name=test
[junit4:junit4]   2> 8712 T1680 oass.OpenExchangeRatesOrgProvider.init Initialized with rates=open-exchange-rates.json, refreshInterval=1440.
[junit4:junit4]   2> 8724 T1680 oass.IndexSchema.readSchema default search field in schema is text
[junit4:junit4]   2> 8729 T1680 oass.IndexSchema.readSchema unique key field: id
[junit4:junit4]   2> 8740 T1680 oass.FileExchangeRateProvider.reload Reloading exchange rates from file currency.xml
[junit4:junit4]   2> 8745 T1680 oass.FileExchangeRateProvider.reload Reloading exchange rates from file currency.xml
[junit4:junit4]   2> 8750 T1680 oass.OpenExchangeRatesOrgProvider.reload Reloading exchange rates from open-exchange-rates.json
[junit4:junit4]   2> 8751 T1680 oass.OpenExchangeRatesOrgProvider.reload Reloading exchange rates from open-exchange-rates.json
[junit4:junit4]   2> 8753 T1680 oasc.SolrCore.<init> [collection1] Opening new SolrCore at /usr/home/hudson/hudson-slave/workspace/Lucene-Solr-Tests-4.x-java7/solr/build/solr-core/test/J0/./solrtest-jetty3-1347862714063/collection1/, dataDir=./org.apache.solr.cloud.BasicDistributedZk2Test-1347862706828/jetty3/
[junit4:junit4]   2> 8753 T1680 oasc.JmxMonitoredMap.<init> JMX monitoring is enabled. Adding Solr mbeans to JMX Server: com.sun.jmx.mbeanserver.JmxMBeanServer@28da95c1
[junit4:junit4]   2> 8755 T1680 oasc.SolrCore.getNewIndexDir WARNING New index directory detected: old=null new=./org.apache.solr.cloud.BasicDistributedZk2Test-1347862706828/jetty3/index/
[junit4:junit4]   2> 8756 T1680 oasc.SolrCore.initIndex WARNING [collection1] Solr index directory './org.apache.solr.cloud.BasicDistributedZk2Test-1347862706828/jetty3/index' doesn't exist. Creating new index...
[junit4:junit4]   2> 8757 T1680 oasc.CachingDirectoryFactory.get return new directory for /usr/home/hudson/hudson-slave/workspace/Lucene-Solr-Tests-4.x-java7/solr/build/solr-core/test/J0/./org.apache.solr.cloud.BasicDistributedZk2Test-1347862706828/jetty3/index forceNew:false
[junit4:junit4]   2> 8763 T1680 oasc.SolrDeletionPolicy.onCommit SolrDeletionPolicy.onCommit: commits:num=1
[junit4:junit4]   2> 		commit{dir=/usr/home/hudson/hudson-slave/workspace/Lucene-Solr-Tests-4.x-java7/solr/build/solr-core/test/J0/org.apache.solr.cloud.BasicDistributedZk2Test-1347862706828/jetty3/index,segFN=segments_1,generation=1,filenames=[segments_1]
[junit4:junit4]   2> 8764 T1680 oasc.SolrDeletionPolicy.updateCommits newest commit = 1
[junit4:junit4]   2> 8765 T1680 oasc.SolrCore.initWriters created xml: solr.XMLResponseWriter
[junit4:junit4]   2> 8768 T1680 oasup.UpdateRequestProcessorChain.init inserting DistributedUpdateProcessorFactory into updateRequestProcessorChain "dedupe"
[junit4:junit4]   2> 8768 T1680 oasup.UpdateRequestProcessorChain.init inserting DistributedUpdateProcessorFactory into updateRequestProcessorChain "dedupe-allfields"
[junit4:junit4]   2> 8769 T1680 oasup.UpdateRequestProcessorChain.init inserting DistributedUpdateProcessorFactory into updateRequestProcessorChain "stored_sig"
[junit4:junit4]   2> 8770 T1680 oasup.UpdateRequestProcessorChain.init inserting DistributedUpdateProcessorFactory into updateRequestProcessorChain "uniq-fields"
[junit4:junit4]   2> 8771 T1680 oasup.UpdateRequestProcessorChain.init inserting DistributedUpdateProcessorFactory into updateRequestProcessorChain "distrib-dup-test-chain-implicit"
[junit4:junit4]   2> 8771 T1680 oasc.RequestHandlers.initHandlersFromConfig adding lazy requestHandler: solr.ReplicationHandler
[junit4:junit4]   2> 8772 T1680 oasc.RequestHandlers.initHandlersFromConfig created /replication: solr.ReplicationHandler
[junit4:junit4]   2> 8773 T1680 oasc.RequestHandlers.initHandlersFromConfig created standard: solr.StandardRequestHandler
[junit4:junit4]   2> 8774 T1680 oasc.RequestHandlers.initHandlersFromConfig created /get: solr.RealTimeGetHandler
[junit4:junit4]   2> 8775 T1680 oasc.RequestHandlers.initHandlersFromConfig created dismax: solr.SearchHandler
[junit4:junit4]   2> 8775 T1680 oasc.RequestHandlers.initHandlersFromConfig created mock: org.apache.solr.core.MockQuerySenderListenerReqHandler
[junit4:junit4]   2> 8776 T1680 oasc.RequestHandlers.initHandlersFromConfig created /admin/: org.apache.solr.handler.admin.AdminHandlers
[junit4:junit4]   2> 8777 T1680 oasc.RequestHandlers.initHandlersFromConfig created defaults: solr.StandardRequestHandler
[junit4:junit4]   2> 8778 T1680 oasc.RequestHandlers.initHandlersFromConfig adding lazy requestHandler: solr.StandardRequestHandler
[junit4:junit4]   2> 8778 T1680 oasc.RequestHandlers.initHandlersFromConfig created lazy: solr.StandardRequestHandler
[junit4:junit4]   2> 8779 T1680 oasc.RequestHandlers.initHandlersFromConfig created /update: solr.UpdateRequestHandler
[junit4:junit4]   2> 8780 T1680 oasc.RequestHandlers.initHandlersFromConfig created /terms: org.apache.solr.handler.component.SearchHandler
[junit4:junit4]   2> 8781 T1680 oasc.RequestHandlers.initHandlersFromConfig created spellCheckCompRH: org.apache.solr.handler.component.SearchHandler
[junit4:junit4]   2> 8782 T1680 oasc.RequestHandlers.initHandlersFromConfig created spellCheckCompRH_Direct: org.apache.solr.handler.component.SearchHandler
[junit4:junit4]   2> 8783 T1680 oasc.RequestHandlers.initHandlersFromConfig created spellCheckWithWordbreak: org.apache.solr.handler.component.SearchHandler
[junit4:junit4]   2> 8783 T1680 oasc.RequestHandlers.initHandlersFromConfig created spellCheckWithWordbreak_Direct: org.apache.solr.handler.component.SearchHandler
[junit4:junit4]   2> 8784 T1680 oasc.RequestHandlers.initHandlersFromConfig created spellCheckCompRH1: org.apache.solr.handler.component.SearchHandler
[junit4:junit4]   2> 8785 T1680 oasc.RequestHandlers.initHandlersFromConfig created tvrh: org.apache.solr.handler.component.SearchHandler
[junit4:junit4]   2> 8786 T1680 oasc.RequestHandlers.initHandlersFromConfig created /mlt: solr.MoreLikeThisHandler
[junit4:junit4]   2> 8787 T1680 oasc.RequestHandlers.initHandlersFromConfig created /debug/dump: solr.DumpRequestHandler
[junit4:junit4]   2> 8791 T1680 oashl.XMLLoader.init xsltCacheLifetimeSeconds=60
[junit4:junit4]   2> 8796 T1680 oasc.SolrCore.initDeprecatedSupport WARNING solrconfig.xml uses deprecated <admin/gettableFiles>, Please update your config to use the ShowFileRequestHandler.
[junit4:junit4]   2> 8797 T1680 oasc.SolrCore.initDeprecatedSupport WARNING adding ShowFileRequestHandler with hidden files: [SCHEMA.XML, OLD_SYNONYMS.TXT, STOPWORDS.TXT, PROTWORDS.TXT, OPEN-EXCHANGE-RATES.JSON, SYNONYMS.TXT, CURRENCY.XML, MAPPING-ISOLATIN1ACCENT.TXT]
[junit4:junit4]   2> 8801 T1680 oass.SolrIndexSearcher.<init> Opening Searcher@28438027 main
[junit4:junit4]   2> 8803 T1680 oasu.CommitTracker.<init> Hard AutoCommit: disabled
[junit4:junit4]   2> 8803 T1680 oasu.CommitTracker.<init> Soft AutoCommit: disabled
[junit4:junit4]   2> 8804 T1680 oashc.SpellCheckComponent.inform Initializing spell checkers
[junit4:junit4]   2> 8812 T1680 oass.DirectSolrSpellChecker.init init: {name=direct,classname=DirectSolrSpellChecker,field=lowerfilt,minQueryLength=3}
[junit4:junit4]   2> 8870 T1739 oasc.SolrCore.registerSearcher [collection1] Registered new searcher Searcher@28438027 main{StandardDirectoryReader(segments_1:1)}
[junit4:junit4]   2> 9233 T1701 oascc.ZkStateReader.updateClusterState Updating cloud state from ZooKeeper... 
[junit4:junit4]   2> 9283 T1700 oascc.ZkStateReader$2.process A cluster state change has occurred - updating...
[junit4:junit4]   2> 9283 T1714 oascc.ZkStateReader$2.process A cluster state change has occurred - updating...
[junit4:junit4]   2> 9283 T1738 oascc.ZkStateReader$2.process A cluster state change has occurred - updating...
[junit4:junit4]   2> 9283 T1726 oascc.ZkStateReader$2.process A cluster state change has occurred - updating...
[junit4:junit4]   2> 9378 T1680 oasc.CoreContainer.register registering core: collection1
[junit4:junit4]   2> 9378 T1680 oasc.ZkController.register Register shard - core:collection1 address:http://127.0.0.1:42554/solr shardId:shard1
[junit4:junit4]   2> 9381 T1680 oasc.ZkController.register We are http://127.0.0.1:42554/solr/collection1/ and leader is http://127.0.0.1:42548/solr/collection1/
[junit4:junit4]   2> 9382 T1680 oasc.ZkController.register No LogReplay needed for core=collection1 baseURL=http://127.0.0.1:42554/solr
[junit4:junit4]   2> 9382 T1680 oasc.ZkController.checkRecovery Core needs to recover:collection1
[junit4:junit4]   2> 9383 T1680 oasu.DefaultSolrCoreState.doRecovery Running recovery - first canceling any ongoing recovery
[junit4:junit4]   2> ASYNC  NEW_CORE C162 name=collection1 org.apache.solr.core.SolrCore@47019779 url=http://127.0.0.1:42554/solr/collection1 node=127.0.0.1:42554_solr
[junit4:junit4]   2> 9384 T1740 C162 P42554 oasc.RecoveryStrategy.run Starting recovery process.  core=collection1 recoveringAfterStartup=true
[junit4:junit4]   2> 9384 T1740 C162 P42554 oasc.RecoveryStrategy.doRecovery ###### startupVersions=[]
[junit4:junit4]   2> 9384 T1680 oascc.ZkStateReader.updateClusterState Updating cloud state from ZooKeeper... 
[junit4:junit4]   2> 9385 T1740 C162 P42554 oasc.RecoveryStrategy.doRecovery Attempting to PeerSync from http://127.0.0.1:42548/solr/collection1/ core=collection1 - recoveringAfterStartup=true
[junit4:junit4]   2> 9386 T1740 C162 P42554 oasu.PeerSync.sync PeerSync: core=collection1 url=http://127.0.0.1:42554/solr START replicas=[http://127.0.0.1:42548/solr/collection1/] nUpdates=100
[junit4:junit4]   2> 9386 T1680 oass.SolrDispatchFilter.init user.dir=/usr/home/hudson/hudson-slave/workspace/Lucene-Solr-Tests-4.x-java7/solr/build/solr-core/test/J0
[junit4:junit4]   2> 9386 T1740 C162 P42554 oasu.PeerSync.sync WARNING no frame of reference to tell of we've missed updates
[junit4:junit4]   2> 9386 T1740 C162 P42554 oasc.RecoveryStrategy.doRecovery PeerSync Recovery was not successful - trying replication. core=collection1
[junit4:junit4]   2> 9386 T1680 oass.SolrDispatchFilter.init SolrDispatchFilter.init() done
[junit4:junit4]   2> 9387 T1740 C162 P42554 oasc.RecoveryStrategy.doRecovery Starting Replication Recovery. core=collection1
[junit4:junit4]   2> 9387 T1680 oascsi.HttpClientUtil.createClient Creating new http client, config:maxConnections=128&maxConnectionsPerHost=32&followRedirects=false
[junit4:junit4]   2> 9387 T1740 C162 P42554 oascsi.HttpClientUtil.createClient Creating new http client, config:maxConnections=128&maxConnectionsPerHost=32&followRedirects=false
[junit4:junit4]   2> ASYNC  NEW_CORE C163 name=collection1 org.apache.solr.core.SolrCore@58f8d884 url=http://127.0.0.1:42548/solr/collection1 node=127.0.0.1:42548_solr
[junit4:junit4]   2> 9394 T1706 C163 P42548 REQ /get {distrib=false&qt=/get&wt=javabin&version=2&getVersions=100} status=0 QTime=0 
[junit4:junit4]   2> 9787 T1701 oascc.ZkStateReader.updateClusterState Updating cloud state from ZooKeeper... 
[junit4:junit4]   2> 9812 T1738 oascc.ZkStateReader$2.process A cluster state change has occurred - updating...
[junit4:junit4]   2> 9812 T1714 oascc.ZkStateReader$2.process A cluster state change has occurred - updating...
[junit4:junit4]   2> 9812 T1700 oascc.ZkStateReader$2.process A cluster state change has occurred - updating...
[junit4:junit4]   2> 9812 T1726 oascc.ZkStateReader$2.process A cluster state change has occurred - updating...
[junit4:junit4]   2> 9889 T1680 oejs.Server.doStart jetty-8.1.2.v20120308
[junit4:junit4]   2> 9893 T1680 oejs.AbstractConnector.doStart Started SocketConnector@0.0.0.0:42558
[junit4:junit4]   2> 9893 T1680 oasc.SolrResourceLoader.locateSolrHome JNDI not configured for solr (NoInitialContextEx)
[junit4:junit4]   2> 9894 T1680 oasc.SolrResourceLoader.locateSolrHome using system property solr.solr.home: /usr/home/hudson/hudson-slave/workspace/Lucene-Solr-Tests-4.x-java7/solr/build/solr-core/test/J0/./solrtest-jetty4-1347862716230
[junit4:junit4]   2> 9895 T1680 oasc.SolrResourceLoader.<init> new SolrResourceLoader for deduced Solr Home: '/usr/home/hudson/hudson-slave/workspace/Lucene-Solr-Tests-4.x-java7/solr/build/solr-core/test/J0/./solrtest-jetty4-1347862716230/'
[junit4:junit4]   2> 9938 T1680 oass.SolrDispatchFilter.init SolrDispatchFilter.init()
[junit4:junit4]   2> 9939 T1680 oasc.SolrResourceLoader.locateSolrHome JNDI not configured for solr (NoInitialContextEx)
[junit4:junit4]   2> 9939 T1680 oasc.SolrResourceLoader.locateSolrHome using system property solr.solr.home: /usr/home/hudson/hudson-slave/workspace/Lucene-Solr-Tests-4.x-java7/solr/build/solr-core/test/J0/./solrtest-jetty4-1347862716230
[junit4:junit4]   2> 9940 T1680 oasc.CoreContainer$Initializer.initialize looking for solr.xml: /usr/home/hudson/hudson-slave/workspace/Lucene-Solr-Tests-4.x-java7/solr/build/solr-core/test/J0/./solrtest-jetty4-1347862716230/solr.xml
[junit4:junit4]   2> 9940 T1680 oasc.CoreContainer.<init> New CoreContainer 678297686
[junit4:junit4]   2> 9941 T1680 oasc.CoreContainer.load Loading CoreContainer using Solr Home: '/usr/home/hudson/hudson-slave/workspace/Lucene-Solr-Tests-4.x-java7/solr/build/solr-core/test/J0/./solrtest-jetty4-1347862716230/'
[junit4:junit4]   2> 9942 T1680 oasc.SolrResourceLoader.<init> new SolrResourceLoader for directory: '/usr/home/hudson/hudson-slave/workspace/Lucene-Solr-Tests-4.x-java7/solr/build/solr-core/test/J0/./solrtest-jetty4-1347862716230/'
[junit4:junit4]   2> 9975 T1680 oasc.CoreContainer.load Registering Log Listener
[junit4:junit4]   2> 9992 T1680 oasc.CoreContainer.initZooKeeper Zookeeper client=127.0.0.1:42540/solr
[junit4:junit4]   2> 9994 T1680 oaz.ZooKeeper.<init> Initiating client connection, connectString=127.0.0.1:42540/solr sessionTimeout=5000 watcher=org.apache.solr.common.cloud.ConnectionManager@1707935c
[junit4:junit4]   2> 9995 T1751 oaz.ClientCnxn$SendThread.startConnect Opening socket connection to server /127.0.0.1:42540
[junit4:junit4]   2> 9995 T1680 oascc.ConnectionManager.waitForConnected Waiting for client to connect to ZooKeeper
[junit4:junit4]   2> 9996 T1751 oaz.ClientCnxn$SendThread.primeConnection Socket connection established to localhost/127.0.0.1:42540, initiating session
[junit4:junit4]   2> 9996 T1682 oazs.NIOServerCnxn$Factory.run Accepted socket connection from /140.211.11.196:42559
[junit4:junit4]   2> 9997 T1682 oazs.NIOServerCnxn.readConnectRequest Client attempting to establish new session at /140.211.11.196:42559
[junit4:junit4]   2> 10028 T1684 oazs.NIOServerCnxn.finishSessionInit Established session 0x139d2e0ba910006 with negotiated timeout 5000 for client /140.211.11.196:42559
[junit4:junit4]   2> 10028 T1751 oaz.ClientCnxn$SendThread.readConnectResult Session establishment complete on server localhost/127.0.0.1:42540, sessionid = 0x139d2e0ba910006, negotiated timeout = 5000
[junit4:junit4]   2> 10028 T1752 oascc.ConnectionManager.process Watcher org.apache.solr.common.cloud.ConnectionManager@1707935c name:ZooKeeperConnection Watcher:127.0.0.1:42540/solr got event WatchedEvent state:SyncConnected type:None path:null path:null type:None
[junit4:junit4]   2> 10028 T1680 oascc.ConnectionManager.waitForConnected Client is connected to ZooKeeper
[junit4:junit4]   2> 10030 T1685 oazs.PrepRequestProcessor.pRequest Got user-level KeeperException when processing sessionid:0x139d2e0ba910006 type:create cxid:0x1 zxid:0xfffffffffffffffe txntype:unknown reqpath:n/a Error Path:/solr/overseer Error:KeeperErrorCode = NodeExists for /solr/overseer
[junit4:junit4]   2> 10031 T1685 oazs.PrepRequestProcessor.pRequest Got user-level KeeperException when processing sessionid:0x139d2e0ba910006 type:create cxid:0x2 zxid:0xfffffffffffffffe txntype:unknown reqpath:n/a Error Path:/solr/overseer Error:KeeperErrorCode = NodeExists for /solr/overseer
[junit4:junit4]   2> 10032 T1680 oasc.ZkController.createEphemeralLiveNode Register node as live in ZooKeeper:/live_nodes/127.0.0.1:42558_solr
[junit4:junit4]   2> 10033 T1685 oazs.PrepRequestProcessor.pRequest Got user-level KeeperException when processing sessionid:0x139d2e0ba910006 type:delete cxid:0x4 zxid:0xfffffffffffffffe txntype:unknown reqpath:n/a Error Path:/solr/live_nodes/127.0.0.1:42558_solr Error:KeeperErrorCode = NoNode for /solr/live_nodes/127.0.0.1:42558_solr
[junit4:junit4]   2> 10045 T1680 oascc.SolrZkClient.makePath makePath: /live_nodes/127.0.0.1:42558_solr
[junit4:junit4]   2> 10047 T1738 oascc.ZkStateReader$3.process Updating live nodes
[junit4:junit4]   2> 10047 T1714 oascc.ZkStateReader$3.process Updating live nodes
[junit4:junit4]   2> 10047 T1700 oascc.ZkStateReader$3.process Updating live nodes
[junit4:junit4]   2> 10047 T1726 oascc.ZkStateReader$3.process Updating live nodes
[junit4:junit4]   2> 10048 T1680 oashc.HttpShardHandlerFactory.getParameter Setting socketTimeout to: 0
[junit4:junit4]   2> 10048 T1680 oashc.HttpShardHandlerFactory.getParameter Setting urlScheme to: http://
[junit4:junit4]   2> 10049 T1680 oashc.HttpShardHandlerFactory.getParameter Setting connTimeout to: 0
[junit4:junit4]   2> 10050 T1680 oashc.HttpShardHandlerFactory.getParameter Setting maxConnectionsPerHost to: 20
[junit4:junit4]   2> 10050 T1680 oashc.HttpShardHandlerFactory.getParameter Setting corePoolSize to: 0
[junit4:junit4]   2> 10051 T1680 oashc.HttpShardHandlerFactory.getParameter Setting maximumPoolSize to: 2147483647
[junit4:junit4]   2> 10051 T1680 oashc.HttpShardHandlerFactory.getParameter Setting maxThreadIdleTime to: 5
[junit4:junit4]   2> 10052 T1680 oashc.HttpShardHandlerFactory.getParameter Setting sizeOfQueue to: -1
[junit4:junit4]   2> 10052 T1680 oashc.HttpShardHandlerFactory.getParameter Setting fairnessPolicy to: false
[junit4:junit4]   2> 10053 T1680 oascsi.HttpClientUtil.createClient Creating new http client, config:maxConnectionsPerHost=20&maxConnections=10000&socketTimeout=0&connTimeout=0&retry=false
[junit4:junit4]   2> 10070 T1680 oascc.ZkStateReader.createClusterStateWatchersAndUpdate Updating cluster state from ZooKeeper... 
[junit4:junit4]   2> 10077 T1680 oasc.CoreContainer.create Creating SolrCore 'collection1' using instanceDir: /usr/home/hudson/hudson-slave/workspace/Lucene-Solr-Tests-4.x-java7/solr/build/solr-core/test/J0/./solrtest-jetty4-1347862716230/collection1
[junit4:junit4]   2> 10077 T1680 oasc.ZkController.createCollectionZkNode Check for collection zkNode:collection1
[junit4:junit4]   2> 10078 T1680 oasc.ZkController.createCollectionZkNode Collection zkNode exists
[junit4:junit4]   2> 10079 T1680 oasc.ZkController.readConfigName Load collection config from:/collections/collection1
[junit4:junit4]   2> 10080 T1680 oasc.SolrResourceLoader.<init> new SolrResourceLoader for directory: '/usr/home/hudson/hudson-slave/workspace/Lucene-Solr-Tests-4.x-java7/solr/build/solr-core/test/J0/./solrtest-jetty4-1347862716230/collection1/'
[junit4:junit4]   2> 10081 T1680 oasc.SolrResourceLoader.replaceClassLoader Adding 'file:/usr/home/hudson/hudson-slave/workspace/Lucene-Solr-Tests-4.x-java7/solr/build/solr-core/test/J0/solrtest-jetty4-1347862716230/collection1/lib/README' to classloader
[junit4:junit4]   2> 10082 T1680 oasc.SolrResourceLoader.replaceClassLoader Adding 'file:/usr/home/hudson/hudson-slave/workspace/Lucene-Solr-Tests-4.x-java7/solr/build/solr-core/test/J0/solrtest-jetty4-1347862716230/collection1/lib/classes/' to classloader
[junit4:junit4]   2> 10137 T1680 oasc.SolrConfig.<init> Using Lucene MatchVersion: LUCENE_40
[junit4:junit4]   2> 10213 T1680 oasc.SolrConfig.<init> Loaded SolrConfig: solrconfig.xml
[junit4:junit4]   2> 10315 T1680 oass.IndexSchema.readSchema Reading Solr Schema
[junit4:junit4]   2> 10322 T1680 oass.IndexSchema.readSchema Schema name=test
[junit4:junit4]   2> 10989 T1680 oass.OpenExchangeRatesOrgProvider.init Initialized with rates=open-exchange-rates.json, refreshInterval=1440.
[junit4:junit4]   2> 11001 T1680 oass.IndexSchema.readSchema default search field in schema is text
[junit4:junit4]   2> 11005 T1680 oass.IndexSchema.readSchema unique key field: id
[junit4:junit4]   2> 11015 T1680 oass.FileExchangeRateProvider.reload Reloading exchange rates from file currency.xml
[junit4:junit4]   2> 11020 T1680 oass.FileExchangeRateProvider.reload Reloading exchange rates from file currency.xml
[junit4:junit4]   2> 11025 T1680 oass.OpenExchangeRatesOrgProvider.reload Reloading exchange rates from open-exchange-rates.json
[junit4:junit4]   2> 11026 T1680 oass.OpenExchangeRatesOrgProvider.reload Reloading exchange rates from open-exchange-rates.json
[junit4:junit4]   2> 11027 T1680 oasc.SolrCore.<init> [collection1] Opening new SolrCore at /usr/home/hudson/hudson-slave/workspace/Lucene-Solr-Tests-4.x-java7/solr/build/solr-core/test/J0/./solrtest-jetty4-1347862716230/collection1/, dataDir=./org.apache.solr.cloud.BasicDistributedZk2Test-1347862706828/jetty4/
[junit4:junit4]   2> 11028 T1680 oasc.JmxMonitoredMap.<init> JMX monitoring is enabled. Adding Solr mbeans to JMX Server: com.sun.jmx.mbeanserver.JmxMBeanServer@28da95c1
[junit4:junit4]   2> 11029 T1680 oasc.SolrCore.getNewIndexDir WARNING New index directory detected: old=null new=./org.apache.solr.cloud.BasicDistributedZk2Test-1347862706828/jetty4/index/
[junit4:junit4]   2> 11030 T1680 oasc.SolrCore.initIndex WARNING [collection1] Solr index directory './org.apache.solr.cloud.BasicDistributedZk2Test-1347862706828/jetty4/index' doesn't exist. Creating new index...
[junit4:junit4]   2> 11031 T1680 oasc.CachingDirectoryFactory.get return new directory for /usr/home/hudson/hudson-slave/workspace/Lucene-Solr-Tests-4.x-java7/solr/build/solr-core/test/J0/./org.apache.solr.cloud.BasicDistributedZk2Test-1347862706828/jetty4/index forceNew:false
[junit4:junit4]   2> 11063 T1680 oasc.SolrDeletionPolicy.onCommit SolrDeletionPolicy.onCommit: commits:num=1
[junit4:junit4]   2> 		commit{dir=/usr/home/hudson/hudson-slave/workspace/Lucene-Solr-Tests-4.x-java7/solr/build/solr-core/test/J0/org.apache.solr.cloud.BasicDistributedZk2Test-1347862706828/jetty4/index,segFN=segments_1,generation=1,filenames=[segments_1]
[junit4:junit4]   2> 11063 T1680 oasc.SolrDeletionPolicy.updateCommits newest commit = 1
[junit4:junit4]   2> 11064 T1680 oasc.SolrCore.initWriters created xml: solr.XMLResponseWriter
[junit4:junit4]   2> 11067 T1680 oasup.UpdateRequestProcessorChain.init inserting DistributedUpdateProcessorFactory into updateRequestProcessorChain "dedupe"
[junit4:junit4]   2> 11068 T1680 oasup.UpdateRequestProcessorChain.init inserting DistributedUpdateProcessorFactory into updateRequestProcessorChain "dedupe-allfields"
[junit4:junit4]   2> 11068 T1680 oasup.UpdateRequestProcessorChain.init inserting DistributedUpdateProcessorFactory into updateRequestProcessorChain "stored_sig"
[junit4:junit4]   2> 11069 T1680 oasup.UpdateRequestProcessorChain.init inserting DistributedUpdateProcessorFactory into updateRequestProcessorChain "uniq-fields"
[junit4:junit4]   2> 11070 T1680 oasup.UpdateRequestProcessorChain.init inserting DistributedUpdateProcessorFactory into updateRequestProcessorChain "distrib-dup-test-chain-implicit"
[junit4:junit4]   2> 11070 T1680 oasc.RequestHandlers.initHandlersFromConfig adding lazy requestHandler: solr.ReplicationHandler
[junit4:junit4]   2> 11071 T1680 oasc.RequestHandlers.initHandlersFromConfig created /replication: solr.ReplicationHandler
[junit4:junit4]   2> 11072 T1680 oasc.RequestHandlers.initHandlersFromConfig created standard: solr.StandardRequestHandler
[junit4:junit4]   2> 11072 T1680 oasc.RequestHandlers.initHandlersFromConfig created /get: solr.RealTimeGetHandler
[junit4:junit4]   2> 11073 T1680 oasc.RequestHandlers.initHandlersFromConfig created dismax: solr.SearchHandler
[junit4:junit4]   2> 11074 T1680 oasc.RequestHandlers.initHandlersFromConfig created mock: org.apache.solr.core.MockQuerySenderListenerReqHandler
[junit4:junit4]   2> 11075 T1680 oasc.RequestHandlers.initHandlersFromConfig created /admin/: org.apache.solr.handler.admin.AdminHandlers
[junit4:junit4]   2> 11075 T1680 oasc.RequestHandlers.initHandlersFromConfig created defaults: solr.StandardRequestHandler
[junit4:junit4]   2> 11076 T1680 oasc.RequestHandlers.initHandlersFromConfig adding lazy requestHandler: solr.StandardRequestHandler
[junit4:junit4]   2> 11077 T1680 oasc.RequestHandlers.initHandlersFromConfig created lazy: solr.StandardRequestHandler
[junit4:junit4]   2> 11077 T1680 oasc.RequestHandlers.initHandlersFromConfig created /update: solr.UpdateRequestHandler
[junit4:junit4]   2> 11078 T1680 oasc.RequestHandlers.initHandlersFromConfig created /terms: org.apache.solr.handler.component.SearchHandler
[junit4:junit4]   2> 11079 T1680 oasc.RequestHandlers.initHandlersFromConfig created spellCheckCompRH: org.apache.solr.handler.component.SearchHandler
[junit4:junit4]   2> 11080 T1680 oasc.RequestHandlers.initHandlersFromConfig created spellCheckCompRH_Direct: org.apache.solr.handler.component.SearchHandler
[junit4:junit4]   2> 11080 T1680 oasc.RequestHandlers.initHandlersFromConfig created spellCheckWithWordbreak: org.apache.solr.handler.component.SearchHandler
[junit4:junit4]   2> 11081 T1680 oasc.RequestHandlers.initHandlersFromConfig created spellCheckWithWordbreak_Direct: org.apache.solr.handler.component.SearchHandler
[junit4:junit4]   2> 11082 T1680 oasc.RequestHandlers.initHandlersFromConfig created spellCheckCompRH1: org.apache.solr.handler.component.SearchHandler
[junit4:junit4]   2> 11083 T1680 oasc.RequestHandlers.initHandlersFromConfig created tvrh: org.apache.solr.handler.component.SearchHandler
[junit4:junit4]   2> 11083 T1680 oasc.RequestHandlers.initHandlersFromConfig created /mlt: solr.MoreLikeThisHandler
[junit4:junit4]   2> 11084 T1680 oasc.RequestHandlers.initHandlersFromConfig created /debug/dump: solr.DumpRequestHandler
[junit4:junit4]   2> 11088 T1680 oashl.XMLLoader.init xsltCacheLifetimeSeconds=60
[junit4:junit4]   2> 11092 T1680 oasc.SolrCore.initDeprecatedSupport WARNING solrconfig.xml uses deprecated <admin/gettableFiles>, Please update your config to use the ShowFileRequestHandler.
[junit4:junit4]   2> 11094 T1680 oasc.SolrCore.initDeprecatedSupport WARNING adding ShowFileRequestHandler with hidden files: [SCHEMA.XML, OLD_SYNONYMS.TXT, STOPWORDS.TXT, PROTWORDS.TXT, OPEN-EXCHANGE-RATES.JSON, SYNONYMS.TXT, CURRENCY.XML, MAPPING-ISOLATIN1ACCENT.TXT]
[junit4:junit4]   2> 11098 T1680 oass.SolrIndexSearcher.<init> Opening Searcher@7ab5d8e2 main
[junit4:junit4]   2> 11099 T1680 oasu.CommitTracker.<init> Hard AutoCommit: disabled
[junit4:junit4]   2> 11100 T1680 oasu.CommitTracker.<init> Soft AutoCommit: disabled
[junit4:junit4]   2> 11100 T1680 oashc.SpellCheckComponent.inform Initializing spell checkers
[junit4:junit4]   2> 11108 T1680 oass.DirectSolrSpellChecker.init init: {name=direct,classname=DirectSolrSpellChecker,field=lowerfilt,minQueryLength=3}
[junit4:junit4]   2> 11163 T1753 oasc.SolrCore.registerSearcher [collection1] Registered new searcher Searcher@7ab5d8e2 main{StandardDirectoryReader(segments_1:1)}
[junit4:junit4]   2> 11318 T1701 oascc.ZkStateReader.updateClusterState Updating cloud state from ZooKeeper... 
[junit4:junit4]   2> 11331 T1752 oascc.ZkStateReader$2.process A cluster state change has occurred - updating...
[junit4:junit4]   2> 11331 T1714 oascc.ZkStateReader$2.process A cluster state change has occurred - updating...
[junit4:junit4]   2> 11331 T1738 oascc.ZkStateReader$2.process A cluster state change has occurred - updating...
[junit4:junit4]   2> 11331 T1726 oascc.ZkStateReader$2.process A cluster state change has occurred - updating...
[junit4:junit4]   2> 11331 T1700 oascc.ZkStateReader$2.process A cluster state change has occurred - updating...
[junit4:junit4]   2> 11670 T1680 oasc.CoreContainer.register registering core: collection1
[junit4:junit4]   2> 11670 T1680 oasc.ZkController.register Register shard - core:collection1 address:http://127.0.0.1:42558/solr shardId:shard2
[junit4:junit4]   2> 11677 T1680 oasc.ZkController.register We are http://127.0.0.1:42558/solr/collection1/ and leader is http://127.0.0.1:42552/solr/collection1/
[junit4:junit4]   2> 11677 T1680 oasc.ZkController.register No LogReplay needed for core=collection1 baseURL=http://127.0.0.1:42558/solr
[junit4:junit4]   2> 11678 T1680 oasc.ZkController.checkRecovery Core needs to recover:collection1
[junit4:junit4]   2> 11678 T1680 oasu.DefaultSolrCoreState.doRecovery Running recovery - first canceling any ongoing recovery
[junit4:junit4]   2> ASYNC  NEW_CORE C164 name=collection1 org.apache.solr.core.SolrCore@2c4a7372 url=http://127.0.0.1:42558/solr/collection1 node=127.0.0.1:42558_solr
[junit4:junit4]   2> 11679 T1754 C164 P42558 oasc.RecoveryStrategy.run Starting recovery process.  core=collection1 recoveringAfterStartup=true
[junit4:junit4]   2> 11679 T1680 oascc.ZkStateReader.updateClusterState Updating cloud state from ZooKeeper... 
[junit4:junit4]   2> 11680 T1754 C164 P42558 oasc.RecoveryStrategy.doRecovery ###### startupVersions=[]
[junit4:junit4]   2> 11680 T1680 oass.SolrDispatchFilter.init user.dir=/usr/home/hudson/hudson-slave/workspace/Lucene-Solr-Tests-4.x-java7/solr/build/solr-core/test/J0
[junit4:junit4]   2> 11680 T1680 oass.SolrDispatchFilter.init SolrDispatchFilter.init() done
[junit4:junit4]   2> 11681 T1754 C164 P42558 oasc.RecoveryStrategy.doRecovery Attempting to PeerSync from http://127.0.0.1:42552/solr/collection1/ core=collection1 - recoveringAfterStartup=true
[junit4:junit4]   2> 11681 T1680 oascsi.HttpClientUtil.createClient Creating new http client, config:maxConnections=128&maxConnectionsPerHost=32&followRedirects=false
[junit4:junit4]   2> 11681 T1754 C164 P42558 oasu.PeerSync.sync PeerSync: core=collection1 url=http://127.0.0.1:42558/solr START replicas=[http://127.0.0.1:42552/solr/collection1/] nUpdates=100
[junit4:junit4]   2> 11682 T1754 C164 P42558 oasu.PeerSync.sync WARNING no frame of reference to tell of we've missed updates
[junit4:junit4]   2> 11682 T1754 C164 P42558 oasc.RecoveryStrategy.doRecovery PeerSync Recovery was not successful - trying replication. core=collection1
[junit4:junit4]   2> 11682 T1754 C164 P42558 oasc.RecoveryStrategy.doRecovery Starting Replication Recovery. core=collection1
[junit4:junit4]   2> 11682 T1754 C164 P42558 oascsi.HttpClientUtil.createClient Creating new http client, config:maxConnections=128&maxConnectionsPerHost=32&followRedirects=false
[junit4:junit4]   2> ASYNC  NEW_CORE C165 name=collection1 org.apache.solr.core.SolrCore@1ea73942 url=http://127.0.0.1:42552/solr/collection1 node=127.0.0.1:42552_solr
[junit4:junit4]   2> 11691 T1718 C165 P42552 REQ /get {distrib=false&qt=/get&wt=javabin&version=2&getVersions=100} status=0 QTime=0 
[junit4:junit4]   2> 11694 T1680 oaz.ZooKeeper.<init> Initiating client connection, connectString=127.0.0.1:42540/solr sessionTimeout=10000 watcher=org.apache.solr.common.cloud.ConnectionManager@b392ee
[junit4:junit4]   2> 11695 T1756 oaz.ClientCnxn$SendThread.startConnect Opening socket connection to server /127.0.0.1:42540
[junit4:junit4]   2> 11695 T1680 oascc.ConnectionManager.waitForConnected Waiting for client to connect to ZooKeeper
[junit4:junit4]   2> 11696 T1756 oaz.ClientCnxn$SendThread.primeConnection Socket connection established to localhost/127.0.0.1:42540, initiating session
[junit4:junit4]   2> 11696 T1682 oazs.NIOServerCnxn$Factory.run Accepted socket connection from /140.211.11.196:42562
[junit4:junit4]   2> 11696 T1682 oazs.NIOServerCnxn.readConnectRequest Client attempting to establish new session at /140.211.11.196:42562
[junit4:junit4]   2> 11698 T1684 oazs.NIOServerCnxn.finishSessionInit Established session 0x139d2e0ba910007 with negotiated timeout 10000 for client /140.211.11.196:42562
[junit4:junit4]   2> 11698 T1756 oaz.ClientCnxn$SendThread.readConnectResult Session establishment complete on server localhost/127.0.0.1:42540, sessionid = 0x139d2e0ba910007, negotiated timeout = 10000
[junit4:junit4]   2> 11698 T1757 oascc.ConnectionManager.process Watcher org.apache.solr.common.cloud.ConnectionManager@b392ee name:ZooKeeperConnection Watcher:127.0.0.1:42540/solr got event WatchedEvent state:SyncConnected type:None path:null path:null type:None
[junit4:junit4]   2> 11698 T1680 oascc.ConnectionManager.waitForConnected Client is connected to ZooKeeper
[junit4:junit4]   2> 11699 T1680 oascc.ZkStateReader.createClusterStateWatchersAndUpdate Updating cluster state from ZooKeeper... 
[junit4:junit4]   2> 11700 T1680 oasc.ChaosMonkey.monkeyLog monkey: init - expire sessions:true cause connection loss:true
[junit4:junit4]   2> 11700 T1680 oascsi.HttpClientUtil.createClient Creating new http client, config:
[junit4:junit4]   2> 11707 T1680 oascc.ZkStateReader.updateClusterState Updating cloud state from ZooKeeper... 
[junit4:junit4]   2> ASYNC  NEW_CORE C166 name=collection1 org.apache.solr.core.SolrCore@5bcde555 url=http://127.0.0.1:42543/solr/collection1 node=127.0.0.1:42543_solr
[junit4:junit4]   2> 11716 T1692 C166 P42543 oasc.SolrDeletionPolicy.onInit SolrDeletionPolicy.onInit: commits:num=1
[junit4:junit4]   2> 		commit{dir=/usr/home/hudson/hudson-slave/workspace/Lucene-Solr-Tests-4.x-java7/solr/build/solr-core/test/J0/org.apache.solr.cloud.BasicDistributedZk2Test-1347862706828/control/data/index,segFN=segments_1,generation=1,filenames=[segments_1]
[junit4:junit4]   2> 11717 T1692 C166 P42543 oasc.SolrDeletionPolicy.updateCommits newest commit = 1
[junit4:junit4]   2> 11720 T1692 C166 P42543 /update {wt=javabin&version=2} {add=[1 (1413336497953701888)]} 0 7
[junit4:junit4]   2> 11721 T1680 oaz.ZooKeeper.<init> Initiating client connection, connectString=127.0.0.1:42540/solr sessionTimeout=10000 watcher=org.apache.solr.common.cloud.ConnectionManager@134edb30
[junit4:junit4]   2> 11722 T1758 oaz.ClientCnxn$SendThread.startConnect Opening socket connection to server /127.0.0.1:42540
[junit4:junit4]   2> 11722 T1680 oascc.ConnectionManager.waitForConnected Waiting for client to connect to ZooKeeper
[junit4:junit4]   2> 11723 T1758 oaz.ClientCnxn$SendThread.primeConnection Socket connection established to localhost/127.0.0.1:42540, initiating session
[junit4:junit4]   2> 11723 T1682 oazs.NIOServerCnxn$Factory.run Accepted socket connection from /140.211.11.196:42564
[junit4:junit4]   2> 11723 T1682 oazs.NIOServerCnxn.readConnectRequest Client attempting to establish new session at /140.211.11.196:42564
[junit4:junit4]   2> 11724 T1684 oazs.NIOServerCnxn.finishSessionInit Established session 0x139d2e0ba910008 with negotiated timeout 10000 for client /140.211.11.196:42564
[junit4:junit4]   2> 11724 T1758 oaz.ClientCnxn$SendThread.readConnectResult Session establishment complete on server localhost/127.0.0.1:42540, sessionid = 0x139d2e0ba910008, negotiated timeout = 10000
[junit4:junit4]   2> 11725 T1759 oascc.ConnectionManager.process Watcher org.apache.solr.common.cloud.ConnectionManager@134edb30 name:ZooKeeperConnection Watcher:127.0.0.1:42540/solr got event WatchedEvent state:SyncConnected type:None path:null path:null type:None
[junit4:junit4]   2> 11725 T1680 oascc.ConnectionManager.waitForConnected Client is connected to ZooKeeper
[junit4:junit4]   2> 11726 T1680 oascc.ZkStateReader.createClusterStateWatchersAndUpdate Updating cluster state from ZooKeeper... 
[junit4:junit4]   2> 11731 T1708 C163 P42548 oasc.SolrDeletionPolicy.onInit SolrDeletionPolicy.onInit: commits:num=1
[junit4:junit4]   2> 		commit{dir=/usr/home/hudson/hudson-slave/workspace/Lucene-Solr-Tests-4.x-java7/solr/build/solr-core/test/J0/org.apache.solr.cloud.BasicDistributedZk2Test-1347862706828/jetty1/index,segFN=segments_1,generation=1,filenames=[segments_1]
[junit4:junit4]   2> 11732 T1708 C163 P42548 oasc.SolrDeletionPolicy.updateCommits newest commit = 1
[junit4:junit4]   2>  C162_STATE=coll:collection1 core:collection1 props:{shard=shard1, roles=null, state=recovering, core=collection1, collection=collection1, node_name=127.0.0.1:42554_solr, base_url=http://127.0.0.1:42554/solr}
[junit4:junit4]   2> 11744 T1730 C162 P42554 oasc.SolrDeletionPolicy.onInit SolrDeletionPolicy.onInit: commits:num=1
[junit4:junit4]   2> 		commit{dir=/usr/home/hudson/hudson-slave/workspace/Lucene-Solr-Tests-4.x-java7/solr/build/solr-core/test/J0/org.apache.solr.cloud.BasicDistributedZk2Test-1347862706828/jetty3/index,segFN=segments_1,generation=1,filenames=[segments_1]
[junit4:junit4]   2> 11745 T1730 C162 P42554 oasc.SolrDeletionPolicy.updateCommits newest commit = 1
[junit4:junit4]   2> 11749 T1730 C162 P42554 REQ /update {distrib.from=http://127.0.0.1:42548/solr/collection1/&update.distrib=FROMLEADER&wt=javabin&version=2} status=0 QTime=9 
[junit4:junit4]   2> 11750 T1708 C163 P42548 /update {wt=javabin&version=2} {add=[1 (1413336497970479104)]} 0 22
[junit4:junit4]   2> 11751 T1680 oasc.AbstractDistribZkTestBase.waitForRecoveriesToFinish Wait for recoveries to finish - collection: collection1 failOnTimeout:true timeout (sec):1800
[junit4:junit4]   2> 11751 T1680 oascc.ZkStateReader.updateClusterState Updating cloud state from ZooKeeper... 
[junit4:junit4]   2> 11835 T1701 oascc.ZkStateReader.updateClusterState Updating cloud state from ZooKeeper... 
[junit4:junit4]   2> 11847 T1752 oascc.ZkStateReader$2.process A cluster state change has occurred - updating...
[junit4:junit4]   2> 11847 T1714 oascc.ZkStateReader$2.process A cluster state change has occurred - updating...
[junit4:junit4]   2> 11847 T1759 oascc.ZkStateReader$2.process A cluster state change has occurred - updating...
[junit4:junit4]   2> 11847 T1738 oascc.ZkStateReader$2.process A cluster state change has occurred - updating...
[junit4:junit4]   2> 11847 T1726 oascc.ZkStateReader$2.process A cluster state change has occurred - updating...
[junit4:junit4]   2> 11847 T1757 oascc.ZkStateReader$2.process A cluster state change has occurred - updating...
[junit4:junit4]   2> 11847 T1700 oascc.ZkStateReader$2.process A cluster state change has occurred - updating...
[junit4:junit4]   2> 12409 T1740 C162 P42554 oasc.RecoveryStrategy.doRecovery Begin buffering updates. core=collection1
[junit4:junit4]   2> 12409 T1740 C162 P42554 oasu.UpdateLog.bufferUpdates Starting to buffer updates. FSUpdateLog{state=ACTIVE, tlog=tlog{file=./org.apache.solr.cloud.BasicDistributedZk2Test-1347862706828/jetty3/tlog/tlog.0000000000000000000 refcount=1}}
[junit4:junit4]   2> 12410 T1740 C162 P42554 oasc.RecoveryStrategy.replicate Attempting to replicate from http://127.0.0.1:42548/solr/collection1/. core=collection1
[junit4:junit4]   2> 12410 T1740 C162 P42554 oascsi.HttpClientUtil.createClient Creating new http client, config:maxConnections=128&maxConnectionsPerHost=32&followRedirects=false
[junit4:junit4]   2> 12420 T1709 C163 P42548 oasu.DirectUpdateHandler2.commit start commit{flags=0,_version_=0,optimize=false,openSearcher=true,waitSearcher=true,expungeDeletes=false,softCommit=false}
[junit4:junit4]   2> 12486 T1709 C163 P42548 oasc.SolrDeletionPolicy.onCommit SolrDeletionPolicy.onCommit: commits:num=2
[junit4:junit4]   2> 		commit{dir=/usr/home/hudson/hudson-slave/workspace/Lucene-Solr-Tests-4.x-java7/solr/build/solr-core/test/J0/org.apache.solr.cloud.BasicDistributedZk2Test-1347862706828/jetty1/index,segFN=segments_1,generation=1,filenames=[segments_1]
[junit4:junit4]   2> 		commit{dir=/usr/home/hudson/hudson-slave/workspace/Lucene-Solr-Tests-4.x-java7/solr/build/solr-core/test/J0/org.apache.solr.cloud.BasicDistributedZk2Test-1347862706828/jetty1/index,segFN=segments_2,generation=2,filenames=[_0.fnm, _0.frq, _0.tim, _0_nrm.cfe, segments_2, _0.fdx, _0_nrm.cfs, _0.si, _0.prx, _0.tip, _0.fdt]
[junit4:junit4]   2> 12487 T1709 C163 P42548 oasc.SolrDeletionPolicy.updateCommits newest commit = 2
[junit4:junit4]   2> 12493 T1709 C163 P42548 oass.SolrIndexSearcher.<init> Opening Searcher@782b0457 main
[junit4:junit4]   2> 12493 T1709 C163 P42548 oasu.DirectUpdateHandler2.commit end_commit_flush
[junit4:junit4]   2> 12494 T1715 oasc.SolrCore.registerSearcher [collection1] Registered new searcher Searcher@782b0457 main{StandardDirectoryReader(segments_2:3 _0(4.0.0.2):C1)}
[junit4:junit4]   2> 12495 T1709 C163 P42548 /update {waitSearcher=true&commit=true&commit_end_point=true&wt=javabin&softCommit=false&version=2} {commit=} 0 75
[junit4:junit4]   2> 12496 T1740 C162 P42554 oash.ReplicationHandler.inform Commits will be reserved for  10000
[junit4:junit4]   2> 12496 T1740 C162 P42554 oash.SnapPuller.<init>  No value set for 'pollInterval'. Timer Task not started.
[junit4:junit4]   2> 12498 T1710 C163 P42548 oash.ReplicationHandler.inform Commits will be reserved for  10000
[junit4:junit4]   2> 12498 T1710 C163 P42548 REQ /replication {command=indexversion&wt=javabin&qt=/replication&version=2} status=0 QTime=1 
[junit4:junit4]   2> 12499 T1740 C162 P42554 oash.SnapPuller.fetchLatestIndex Master's generation: 2
[junit4:junit4]   2> 12499 T1740 C162 P42554 oash.SnapPuller.fetchLatestIndex Slave's generation: 1
[junit4:junit4]   2> 12499 T1740 C162 P42554 oash.SnapPuller.fetchLatestIndex Starting replication process
[junit4:junit4]   2> 12502 T1710 C163 P42548 REQ /replication {command=filelist&generation=2&wt=javabin&qt=/replication&version=2} status=0 QTime=1 
[junit4:junit4]   2> 12502 T1740 C162 P42554 oash.SnapPuller.fetchLatestIndex Number of files in latest index in master: 11
[junit4:junit4]   2> 12505 T1740 C162 P42554 oash.SnapPuller.fetchLatestIndex Starting download to ./org.apache.solr.cloud.BasicDistributedZk2Test-1347862706828/jetty3/index.20120916191839328 fullCopy=true
[junit4:junit4]   2> 12508 T1710 C163 P42548 REQ /replication {file=_0.fnm&command=filecontent&checksum=true&generation=2&qt=/replication&wt=filestream} status=0 QTime=0 
[junit4:junit4]   2> 12513 T1710 C163 P42548 REQ /replication {file=_0_nrm.cfe&command=filecontent&checksum=true&generation=2&qt=/replication&wt=filestream} status=0 QTime=0 
[junit4:junit4]   2> 12517 T1710 C163 P42548 REQ /replication {file=_0.tim&command=filecontent&checksum=true&generation=2&qt=/replication&wt=filestream} status=0 QTime=0 
[junit4:junit4]   2> 12521 T1710 C163 P42548 REQ /replication {file=_0.frq&command=filecontent&checksum=true&generation=2&qt=/replication&wt=filestream} status=0 QTime=0 
[junit4:junit4]   2> 12525 T1710 C163 P42548 REQ /replication {file=segments_2&command=filecontent&checksum=true&generation=2&qt=/replication&wt=filestream} status=0 QTime=0 
[junit4:junit4]   2> 12529 T1710 C163 P42548 REQ /replication {file=_0.fdx&command=filecontent&checksum=true&generation=2&qt=/replication&wt=filestream} status=0 QTime=0 
[junit4:junit4]   2> 12534 T1710 C163 P42548 REQ /replication {file=_0_nrm.cfs&command=filecontent&checksum=true&generation=2&qt=/replication&wt=filestream} status=0 QTime=0 
[junit4:junit4]   2> 12538 T1710 C163 P42548 REQ /replication {file=_0.si&command=filecontent&checksum=true&generation=2&qt=/replication&wt=filestream} status=0 QTime=0 
[junit4:junit4]   2> 12542 T1710 C163 P42548 REQ /replication {file=_0.tip&command=filecontent&checksum=true&generation=2&qt=/replication&wt=filestream} status=0 QTime=0 
[junit4:junit4]   2> 12547 T1710 C163 P42548 REQ /replication {file=_0.prx&command=filecontent&checksum=true&generation=2&qt=/replication&wt=filestream} status=0 QTime=0 
[junit4:junit4]   2> 12552 T1710 C163 P42548 REQ /replication {file=_0.fdt&command=filecontent&checksum=true&generation=2&qt=/replication&wt=filestream} status=0 QTime=0 
[junit4:junit4]   2> 12554 T1740 C162 P42554 oash.SnapPuller.fetchLatestIndex Total time taken for download : 0 secs
[junit4:junit4]   2> 12554 T1740 C162 P42554 oash.SnapPuller.modifyIndexProps New index installed. Updating index properties... index=index.20120916191839328
[junit4:junit4]   2> 12556 T1740 C162 P42554 oasu.DefaultSolrCoreState.newIndexWriter Creating new IndexWriter...
[junit4:junit4]   2> 12556 T1740 C162 P42554 oasu.DefaultSolrCoreState.newIndexWriter Waiting until IndexWriter is unused... core=collection1
[junit4:junit4]   2> 12556 T1740 C162 P42554 oasu.DefaultSolrCoreState.newIndexWriter Rollback old IndexWriter... core=collection1
[junit4:junit4]   2> 12560 T1740 C162 P42554 oasc.SolrCore.getNewIndexDir WARNING New index directory detected: old=./org.apache.solr.cloud.BasicDistributedZk2Test-1347862706828/jetty3/index/ new=./org.apache.solr.cloud.BasicDistributedZk2Test-1347862706828/jetty3/index.20120916191839328
[junit4:junit4]   2> 12561 T1740 C162 P42554 oasc.CachingDirectoryFactory.get return new directory for /usr/home/hudson/hudson-slave/workspace/Lucene-Solr-Tests-4.x-java7/solr/build/solr-core/test/J0/./org.apache.solr.cloud.BasicDistributedZk2Test-1347862706828/jetty3/index.20120916191839328 forceNew:true
[junit4:junit4]   2> 12565 T1740 C162 P42554 oasc.SolrDeletionPolicy.onInit SolrDeletionPolicy.onInit: commits:num=1
[junit4:junit4]   2> 		commit{dir=/usr/home/hudson/hudson-slave/workspace/Lucene-Solr-Tests-4.x-java7/solr/build/solr-core/test/J0/org.apache.solr.cloud.BasicDistributedZk2Test-1347862706828/jetty3/index.20120916191839328,segFN=segments_2,generation=2,filenames=[_0.fnm, _0_nrm.cfe, _0.tim, _0.frq, segments_2, _0.fdx, _0_nrm.cfs, _0.si, _0.tip, _0.prx, _0.fdt]
[junit4:junit4]   2> 12565 T1740 C162 P42554 oasc.SolrDeletionPolicy.updateCommits newest commit = 2
[junit4:junit4]   2> 12565 T1740 C162 P42554 oasu.DefaultSolrCoreState.newIndexWriter New IndexWriter is ready to be used.
[junit4:junit4]   2> 12567 T1740 C162 P42554 oass.SolrIndexSearcher.<init> Opening Searcher@178bccaa main
[junit4:junit4]   2> 12568 T1739 oasc.SolrCore.registerSearcher [collection1] Registered new searcher Searcher@178bccaa main{StandardDirectoryReader(segments_2:3:nrt _0(4.0.0.2):C1)}
[junit4:junit4]   2> 12568 T1739 oasc.CachingDirectoryFactory.close Closing directory:/usr/home/hudson/hudson-slave/workspace/Lucene-Solr-Tests-4.x-java7/solr/build/solr-core/test/J0/./org.apache.solr.cloud.BasicDistributedZk2Test-1347862706828/jetty3/index
[junit4:junit4]   2> 12569 T1739 oash.SnapPuller$2.onClose removing old index directory ./org.apache.solr.cloud.BasicDistributedZk2Test-1347862706828/jetty3/index
[junit4:junit4]   2> 12570 T1740 C162 P42554 oasu.DirectUpdateHandler2.commit start commit{flags=0,_version_=0,optimize=false,openSearcher=false,waitSearcher=false,expungeDeletes=false,softCommit=false}
[junit4:junit4]   2> 12571 T1740 C162 P42554 oasu.DirectUpdateHandler2.commit end_commit_flush
[junit4:junit4]   2> 12575 T1740 C162 P42554 oasc.RecoveryStrategy.replay Replaying buffered documents. core=collection1
[junit4:junit4]   2> 12575 T1762 C162 P42554 oasu.UpdateLog$LogReplayer.doReplay WARNING Starting log replay tlog{file=./org.apache.solr.cloud.BasicDistributedZk2Test-1347862706828/jetty3/tlog/tlog.0000000000000000000 refcount=2} active=true starting pos=433
[junit4:junit4]   2> 12580 T1762 C162 P42554 oasu.DirectUpdateHandler2.commit start commit{flags=2,_version_=0,optimize=false,openSearcher=true,waitSearcher=true,expungeDeletes=false,softCommit=false}
[junit4:junit4]   2> 12582 T1762 C162 P42554 oass.SolrIndexSearcher.<init> Opening Searcher@88aa173 main
[junit4:junit4]   2> 12582 T1762 C162 P42554 oasu.DirectUpdateHandler2.commit end_commit_flush
[junit4:junit4]   2> 12583 T1739 oasc.SolrCore.registerSearcher [collection1] Registered new searcher Searcher@88aa173 main{StandardDirectoryReader(segments_2:3:nrt _0(4.0.0.2):C1)}
[junit4:junit4]   2> 12584 T1762 C162 P42554 oasu.UpdateLog$LogReplayer.run WARNING Log replay finished. recoveryInfo=RecoveryInfo{adds=0 deletes=0 deleteByQuery=0 errors=0 positionOfStart=433}
[junit4:junit4]   2> 12584 T1740 C162 P42554 oasc.RecoveryStrategy.doRecovery Replication Recovery was successful - registering as Active. core=collection1
[junit4:junit4]   2> 12585 T1740 C162 P42554 oasc.RecoveryStrategy.doRecovery Finished recovery process. core=collection1
[junit4:junit4]   2> 12753 T1680 oascc.ZkStateReader.updateClusterState Updating cloud state from ZooKeeper... 
[junit4:junit4]   2> 12851 T1701 oascc.ZkStateReader.updateClusterState Updating cloud state from ZooKeeper... 
[junit4:junit4]   2> 12864 T1700 oascc.ZkStateReader$2.process A cluster state change has occurred - updating...
[junit4:junit4]   2> 12864 T1738 oascc.ZkStateReader$2.process A cluster state change has occurred - updating...
[junit4:junit4]   2> 12864 T1759 oascc.ZkStateReader$2.process A cluster state change has occurred - updating...
[junit4:junit4]   2> 12864 T1757 oascc.ZkStateReader$2.process A cluster state change has occurred - updating...
[junit4:junit4]   2> 12864 T1726 oascc.ZkStateReader$2.process A cluster state change has occurred - updating...
[junit4:junit4]   2> 12864 T1714 oascc.ZkStateReader$2.process A cluster state change has occurred - updating...
[junit4:junit4]   2> 12864 T1752 oascc.ZkStateReader$2.process A cluster state change has occurred - updating...
[junit4:junit4]   2> 13755 T1680 oascc.ZkStateReader.updateClusterState Updating cloud state from ZooKeeper... 
[junit4:junit4]   2>  C164_STATE=coll:collection1 core:collection1 props:{shard=shard2, roles=null, state=recovering, core=collection1, collection=collection1, node_name=127.0.0.1:42558_solr, base_url=http://127.0.0.1:42558/solr}
[junit4:junit4]   2> 14697 T1754 C164 P42558 oasc.RecoveryStrategy.doRecovery Begin buffering updates. core=collection1
[junit4:junit4]   2> 14697 T1754 C164 P42558 oasu.UpdateLog.bufferUpdates Starting to buffer updates. FSUpdateLog{state=ACTIVE, tlog=null}
[junit4:junit4]   2> 14697 T1754 C164 P42558 oasc.RecoveryStrategy.replicate Attempting to replicate from http://127.0.0.1:42552/solr/collection1/. core=collection1
[junit4:junit4]   2> 14697 T1754 C164 P42558 oascsi.HttpClientUtil.createClient Creating new http client, config:maxConnections=128&maxConnectionsPerHost=32&followRedirects=false
[junit4:junit4]   2> 14708 T1720 C165 P42552 oasu.DirectUpdateHandler2.commit start commit{flags=0,_version_=0,optimize=false,openSearcher=true,waitSearcher=true,expungeDeletes=false,softCommit=false}
[junit4:junit4]   2> 14713 T1720 C165 P42552 oasc.SolrDeletionPolicy.onInit SolrDeletionPolicy.onInit: commits:num=1
[junit4:junit4]   2> 		commit{dir=/usr/home/hudson/hudson-slave/workspace/Lucene-Solr-Tests-4.x-java7/solr/build/solr-core/test/J0/org.apache.solr.cloud.BasicDistributedZk2Test-1347862706828/jetty2/index,segFN=segments_1,generation=1,filenames=[segments_1]
[junit4:junit4]   2> 14714 T1720 C165 P42552 oasc.SolrDeletionPolicy.updateCommits newest commit = 1
[junit4:junit4]   2> 14715 T1720 C165 P42552 oass.SolrIndexSearcher.<init> Opening Searcher@17e2bce8 main
[junit4:junit4]   2> 14716 T1720 C165 P42552 oasu.DirectUpdateHandler2.commit end_commit_flush
[junit4:junit4]   2> 14717 T1727 oasc.SolrCore.registerSearcher [collection1] Registered new searcher Searcher@17e2bce8 main{StandardDirectoryReader(segments_1:1)}
[junit4:junit4]   2> 14717 T1720 C165 P42552 /update {waitSearcher=true&commit=true&commit_end_point=true&wt=javabin&softCommit=false&version=2} {commit=} 0 9
[junit4:junit4]   2> 14718 T1754 C164 P42558 oash.ReplicationHandler.inform Commits will be reserved for  10000
[junit4:junit4]   2> 14718 T1754 C164 P42558 oash.SnapPuller.<init>  No value set for 'pollInterval'. Timer Task not started.
[junit4:junit4]   2> 14720 T1721 C165 P42552 oash.ReplicationHandler.inform Commits will be reserved for  10000
[junit4:junit4]   2> 14720 T1721 C165 P42552 REQ /replication {command=indexversion&wt=javabin&qt=/replication&version=2} status=0 QTime=1 
[junit4:junit4]   2> 14725 T1754 C164 P42558 oasc.SolrDeletionPolicy.onInit SolrDeletionPolicy.onInit: commits:num=1
[junit4:junit4]   2> 		commit{dir=/usr/home/hudson/hudson-slave/workspace/Lucene-Solr-Tests-4.x-java7/solr/build/solr-core/test/J0/org.apache.solr.cloud.BasicDistributedZk2Test-1347862706828/jetty4/index,segFN=segments_1,generation=1,filenames=[segments_1]
[junit4:junit4]   2> 14726 T1754 C164 P42558 oasc.SolrDeletionPolicy.updateCommits newest commit = 1
[junit4:junit4]   2> 14726 T1754 C164 P42558 oasu.DirectUpdateHandler2.commit start commit{flags=0,_version_=0,optimize=false,openSearcher=true,waitSearcher=true,expungeDeletes=false,softCommit=false}
[junit4:junit4]   2> 14729 T1754 C164 P42558 oasc.SolrDeletionPolicy.onCommit SolrDeletionPolicy.onCommit: commits:num=2
[junit4:junit4]   2> 		commit{dir=/usr/home/hudson/hudson-slave/workspace/Lucene-Solr-Tests-4.x-java7/solr/build/solr-core/test/J0/org.apache.solr.cloud.BasicDistributedZk2Test-1347862706828/jetty4/index,segFN=segments_1,generation=1,filenames=[segments_1]
[junit4:junit4]   2> 		commit{dir=/usr/home/hudson/hudson-slave/workspace/Lucene-Solr-Tests-4.x-java7/solr/build/solr-core/test/J0/org.apache.solr.cloud.BasicDistributedZk2Test-1347862706828/jetty4/index,segFN=segments_2,generation=2,filenames=[segments_2]
[junit4:junit4]   2> 14729 T1754 C164 P42558 oasc.SolrDeletionPolicy.updateCommits newest commit = 2
[junit4:junit4]   2> 14733 T1754 C164 P42558 oass.SolrIndexSearcher.<init> Opening Searcher@dbfbe1e main
[junit4:junit4]   2> 14733 T1754 C164 P42558 oasu.DirectUpdateHandler2.commit end_commit_flush
[junit4:junit4]   2> 14734 T1753 oasc.SolrCore.registerSearcher [collection1] Registered new searcher Searcher@dbfbe1e main{StandardDirectoryReader(segments_2:2)}
[junit4:junit4]   2> 14734 T1754 C164 P42558 oasc.RecoveryStrategy.replay No replay needed. core=collection1
[junit4:junit4]   2> 14735 T1754 C164 P42558 oasc.RecoveryStrategy.doRecovery Replication Recovery was successful - registering as Active. core=collection1
[junit4:junit4]   2> 14763 T1754 C164 P42558 oasc.RecoveryStrategy.doRecovery Finished recovery process. core=collection1
[junit4:junit4]   2> 14763 T1680 oascc.ZkStateReader.updateClusterState Updating cloud state from ZooKeeper... 
[junit4:junit4]   2> 14869 T1701 oascc.ZkStateReader.updateClusterState Updating cloud state from ZooKeeper... 
[junit4:junit4]   2> 14914 T1700 oascc.ZkStateReader$2.process A cluster state change has occurred - updating...
[junit4:junit4]   2> 14914 T1714 oascc.ZkStateReader$2.process A cluster state change has occurred - updating...
[junit4:junit4]   2> 14914 T1759 oascc.ZkStateReader$2.process A cluster state change has occurred - updating...
[junit4:junit4]   2> 14914 T1757 oascc.ZkStateReader$2.process A cluster state change has occurred - updating...
[junit4:junit4]   2> 14914 T1726 oascc.ZkStateReader$2.process A cluster state change has occurred - updating...
[junit4:junit4]   2> 14914 T1738 oascc.ZkStateReader$2.process A cluster state change has occurred - updating...
[junit4:junit4]   2> 14914 T1752 oascc.ZkStateReader$2.process A cluster state change has occurred - updating...
[junit4:junit4]   2> 15765 T1680 oascc.ZkStateReader.updateClusterState Updating cloud state from ZooKeeper... 
[junit4:junit4]   2> 15768 T1692 C166 P42543 oasu.DirectUpdateHandler2.commit start commit{flags=0,_version_=0,optimize=false,openSearcher=true,waitSearcher=true,expungeDeletes=false,softCommit=false}
[junit4:junit4]   2> 15800 T1692 C166 P42543 oasc.SolrDeletionPolicy.onCommit SolrDeletionPolicy.onCommit: commits:num=2
[junit4:junit4]   2> 		commit{dir=/usr/home/hudson/hudson-slave/workspace/Lucene-Solr-Tests-4.x-java7/solr/build/solr-core/test/J0/org.apache.solr.cloud.BasicDistributedZk2Test-1347862706828/control/data/index,segFN=segments_1,generation=1,filenames=[segments_1]
[junit4:junit4]   2> 		commit{dir=/usr/home/hudson/hudson-slave/workspace/Lucene-Solr-Tests-4.x-java7/solr/build/solr-core/test/J0/org.apache.solr.cloud.BasicDistributedZk2Test-1347862706828/control/data/index,segFN=segments_2,generation=2,filenames=[_0.fnm, _0.frq, _0.tim, _0_nrm.cfe, segments_2, _0.fdx, _0_nrm.cfs, _0.si, _0.prx, _0.tip, _0.fdt]
[junit4:junit4]   2> 15800 T1692 C166 P42543 oasc.SolrDeletionPolicy.updateCommits newest commit = 2
[junit4:junit4]   2> 15807 T1692 C166 P42543 oass.SolrIndexSearcher.<init> Opening Searcher@7f67043 main
[junit4:junit4]   2> 15807 T1692 C166 P42543 oasu.DirectUpdateHandler2.commit end_commit_flush
[junit4:junit4]   2> 15808 T1703 oasc.SolrCore.registerSearcher [collection1] Registered new searcher Searcher@7f67043 main{StandardDirectoryReader(segments_2:3 _0(4.0.0.2):C1)}
[junit4:junit4]   2> 15809 T1692 C166 P42543 /update {waitSearcher=true&wt=javabin&commit=true&softCommit=false&version=2} {commit=} 0 41
[junit4:junit4]   2> 15812 T1708 C163 P42548 oasu.DirectUpdateHandler2.commit start commit{flags=0,_version_=0,optimize=false,openSearcher=true,waitSearcher=true,expungeDeletes=false,softCommit=false}
[junit4:junit4]   2> 15819 T1708 C163 P42548 oass.SolrIndexSearcher.<init> Opening Searcher@2de2c84e main
[junit4:junit4]   2> 15819 T1708 C163 P42548 oasu.DirectUpdateHandler2.commit end_commit_flush
[junit4:junit4]   2> 15820 T1715 oasc.SolrCore.registerSearcher [collection1] Registered new searcher Searcher@2de2c84e main{StandardDirectoryReader(segments_2:3 _0(4.0.0.2):C1)}
[junit4:junit4]   2> 15821 T1708 C163 P42548 oasu.SolrCmdDistributor.distribCommit Distrib commit to:[StdNode: http://127.0.0.1:42554/solr/collection1/, StdNode: http://127.0.0.1:42552/solr/collection1/, StdNode: http://127.0.0.1:42558/solr/collection1/]
[junit4:junit4]   2> 15823 T1722 C165 P42552 oasu.DirectUpdateHandler2.commit start commit{flags=0,_version_=0,optimize=false,openSearcher=true,waitSearcher=true,expungeDeletes=false,softCommit=false}
[junit4:junit4]   2>  C162_STATE=coll:collection1 core:collection1 props:{shard=shard1, roles=null, state=active, core=collection1, collection=collection1, node_name=127.0.0.1:42554_solr, base_url=http://127.0.0.1:42554/solr}
[junit4:junit4]   2> 15825 T1730 C162 P42554 oasu.DirectUpdateHandler2.commit start commit{flags=0,_version_=0,optimize=false,openSearcher=true,waitSearcher=true,expungeDeletes=false,softCommit=false}
[junit4:junit4]   2> 15827 T1730 C162 P42554 oass.SolrIndexSearcher.<init> Opening Searcher@151385d9 main
[junit4:junit4]   2> 15827 T1722 C165 P42552 oass.SolrIndexSearcher.<init> Opening Searcher@39dfe25c main
[junit4:junit4]   2> 15827 T1730 C162 P42554 oasu.DirectUpdateHandler2.commit end_commit_flush
[junit4:junit4]   2> 15828 T1722 C165 P42552 oasu.DirectUpdateHandler2.commit end_commit_flush
[junit4:junit4]   2> 15828 T1727 oasc.JmxMonitoredMap.put WARNING Failed to register info bean: searcher javax.management.InstanceAlreadyExistsException: solr/collection1:type=searcher,id=org.apache.solr.search.SolrIndexSearcher
[junit4:junit4]   2> 	at com.sun.jmx.mbeanserver.Repository.addMBean(Repository.java:437)
[junit4:junit4]   2> 	at com.sun.jmx.interceptor.DefaultMBeanServerInterceptor.registerWithRepository(DefaultMBeanServerInterceptor.java:1898)
[junit4:junit4]   2> 	at com.sun.jmx.interceptor.DefaultMBeanServerInterceptor.registerDynamicMBean(DefaultMBeanServerInterceptor.java:966)
[junit4:junit4]   2> 	at com.sun.jmx.interceptor.DefaultMBeanServerInterceptor.registerObject(DefaultMBeanServerInterceptor.java:900)
[junit4:junit4]   2> 	at com.sun.jmx.interceptor.DefaultMBeanServerInterceptor.registerMBean(DefaultMBeanServerInterceptor.java:324)
[junit4:junit4]   2> 	at com.sun.jmx.mbeanserver.JmxMBeanServer.registerMBean(JmxMBeanServer.java:512)
[junit4:junit4]   2> 	at org.apache.solr.core.JmxMonitoredMap.put(JmxMonitoredMap.java:140)
[junit4:junit4]   2> 	at org.apache.solr.core.JmxMonitoredMap.put(JmxMonitoredMap.java:51)
[junit4:junit4]   2> 	at org.apache.solr.search.SolrIndexSearcher.register(SolrIndexSearcher.java:242)
[junit4:junit4]   2> 	at org.apache.solr.core.SolrCore.registerSearcher(SolrCore.java:1642)
[junit4:junit4]   2> 	at org.apache.solr.core.SolrCore.access$000(SolrCore.java:121)
[junit4:junit4]   2> 	at org.apache.solr.core.SolrCore$7.call(SolrCore.java:1519)
[junit4:junit4]   2> 	at java.util.concurrent.FutureTask$Sync.innerRun(FutureTask.java:334)
[junit4:junit4]   2> 	at java.util.concurrent.FutureTask.run(FutureTask.java:166)
[junit4:junit4]   2> 	at java.util.concurrent.ThreadPoolExecutor.runWorker(ThreadPoolExecutor.java:1110)
[junit4:junit4]   2> 	at java.util.concurrent.ThreadPoolExecutor$Worker.run(ThreadPoolExecutor.java:603)
[junit4:junit4]   2> 	at java.lang.Thread.run(Thread.java:722)
[junit4:junit4]   2> 
[junit4:junit4]   2> 15829 T1739 oasc.SolrCore.registerSearcher [collection1] Registered new searcher Searcher@151385d9 main{StandardDirectoryReader(segments_2:3:nrt _0(4.0.0.2):C1)}
[junit4:junit4]   2> 15829 T1730 C162 P42554 /update {waitSearcher=true&commit=true&wt=javabin&commit_end_point=true&expungeDeletes=false&softCommit=false&version=2} {commit=} 0 4
[junit4:junit4]   2> 15830 T1727 oasc.SolrCore.registerSearcher [collection1] Registered new searcher Searcher@39dfe25c main{StandardDirectoryReader(segments_1:1)}
[junit4:junit4]   2>  C164_STATE=coll:collection1 core:collection1 props:{shard=shard2, roles=null, state=active, core=collection1, collection=collection1, node_name=127.0.0.1:42558_solr, base_url=http://127.0.0.1:42558/solr}
[junit4:junit4]   2> 15830 T1744 C164 P42558 oasu.DirectUpdateHandler2.commit start commit{flags=0,_version_=0,optimize=false,openSearcher=true,waitSearcher=true,expungeDeletes=false,softCommit=false}
[junit4:junit4]   2> 15830 T1722 C165 P42552 /update {waitSearcher=true&commit=true&wt=javabin&commit_end_point=true&expungeDeletes=false&softCommit=false&version=2} {commit=} 0 7
[junit4:junit4]   2> 15834 T1744 C164 P42558 oass.SolrIndexSearcher.<init> Opening Searcher@7308366 main
[junit4:junit4]   2> 15834 T1744 C164 P42558 oasu.DirectUpdateHandler2.commit end_commit_flush
[junit4:junit4]   2> 15835 T1753 oasc.SolrCore.registerSearcher [collection1] Registered new searcher Searcher@7308366 main{StandardDirectoryReader(segments_2:2)}
[junit4:junit4]   2> 15836 T1744 C164 P42558 /update {waitSearcher=true&commit=true&wt=javabin&commit_end_point=true&expungeDeletes=false&softCommit=false&version=2} {commit=} 0 6
[junit4:junit4]   2> 15836 T1708 C163 P42548 /update {waitSearcher=true&wt=javabin&commit=true&softCommit=false&version=2} {commit=} 0 24
[junit4:junit4]   2> 15842 T1693 C166 P42543 REQ /select {fl=id,score&shard.url=127.0.0.1:42543/solr/collection1/&NOW=1347862722664&start=0&q=*:*&distrib=false&isShard=true&wt=javabin&fsv=true&rows=10&version=2} hits=1 status=0 QTime=0 
[junit4:junit4]   2> 15845 T1693 C166 P42543 REQ /select {shard.url=127.0.0.1:42543/solr/collection1/&NOW=1347862722664&q=*:*&ids=1&distrib=false&isShard=true&wt=javabin&version=2} status=0 QTime=0 
[junit4:junit4]   2> 15846 T1692 C166 P42543 REQ /select {wt=javabin&q=*:*&version=2} hits=1 status=0 QTime=7 
[junit4:junit4]   2> 15847 T1680 oaz.ZooKeeper.<init> Initiating client connection, connectString=127.0.0.1:42540/solr sessionTimeout=10000 watcher=org.apache.solr.common.cloud.ConnectionManager@66586bc5
[junit4:junit4]   2> 15848 T1766 oaz.ClientCnxn$SendThread.startConnect Opening socket connection to server /127.0.0.1:42540
[junit4:junit4]   2> 15848 T1680 oascc.ConnectionManager.waitForConnected Waiting for client to connect to ZooKeeper
[junit4:junit4]   2> 15849 T1766 oaz.ClientCnxn$SendThread.primeConnection Socket connection established to localhost/127.0.0.1:42540, initiating session
[junit4:junit4]   2> 15849 T1682 oazs.NIOServerCnxn$Factory.run Accepted socket connection from /140.211.11.196:42579
[junit4:junit4]   2> 15849 T1682 oazs.NIOServerCnxn.readConnectRequest Client attempting to establish new session at /140.211.11.196:42579
[junit4:junit4]   2> 15850 T1684 oazs.NIOServerCnxn.finishSessionInit Established session 0x139d2e0ba910009 with negotiated timeout 10000 for client /140.211.11.196:42579
[junit4:junit4]   2> 15850 T1766 oaz.ClientCnxn$SendThread.readConnectResult Session establishment complete on server localhost/127.0.0.1:42540, sessionid = 0x139d2e0ba910009, negotiated timeout = 10000
[junit4:junit4]   2> 15851 T1767 oascc.ConnectionManager.process Watcher org.apache.solr.common.cloud.ConnectionManager@66586bc5 name:ZooKeeperConnection Watcher:127.0.0.1:42540/solr got event WatchedEvent state:SyncConnected type:None path:null path:null type:None
[junit4:junit4]   2> 15851 T1680 oascc.ConnectionManager.waitForConnected Client is connected to ZooKeeper
[junit4:junit4]   2> 15852 T1680 oascc.ZkStateReader.createClusterStateWatchersAndUpdate Updating cluster state from ZooKeeper... 
[junit4:junit4]   2> 15853 T1685 oazs.PrepRequestProcessor.pRequest Processed session termination for sessionid: 0x139d2e0ba910009
[junit4:junit4]   2> 15854 T1767 oaz.ClientCnxn$EventThread.run EventThread shut down
[junit4:junit4]   2> 15854 T1682 oazs.NIOServerCnxn.closeSock Closed socket connection for client /140.211.11.196:42579 which had sessionid 0x139d2e0ba910009
[junit4:junit4]   2> 15854 T1680 oaz.ZooKeeper.close Session: 0x139d2e0ba910009 closed
[junit4:junit4]   2> 15856 T1711 C163 P42548 REQ /select {distrib=false&wt=javabin&q=*:*&version=2} hits=1 status=0 QTime=0 
[junit4:junit4]   2> 15858 T1723 C165 P42552 REQ /select {distrib=false&wt=javabin&q=*:*&version=2} hits=0 status=0 QTime=0 
[junit4:junit4]   2> 15863 T1731 C162 P42554 REQ /select {fl=id,score&shard.url=127.0.0.1:42548/solr/collection1/|127.0.0.1:42554/solr/collection1/&NOW=1347862722686&start=0&q=*:*&distrib=false&isShard=true&wt=javabin&fsv=true&rows=10&version=2} hits=1 status=0 QTime=0 
[junit4:junit4]   2> 15864 T1745 C164 P42558 REQ /select {fl=id,score&shard.url=127.0.0.1:42552/solr/collection1/|127.0.0.1:42558/solr/collection1/&NOW=1347862722686&start=0&q=*:*&distrib=false&isShard=true&wt=javabin&fsv=true&rows=10&version=2} hits=0 status=0 QTime=0 
[junit4:junit4]   2> 15867 T1731 C162 P42554 REQ /select {shard.url=127.0.0.1:42548/solr/collection1/|127.0.0.1:42554/solr/collection1/&NOW=1347862722686&q=*:*&ids=1&distrib=false&isShard=true&wt=javabin&version=2} status=0 QTime=0 
[junit4:junit4]   2> 15868 T1708 C163 P42548 REQ /select {wt=javabin&q=*:*&version=2} hits=1 status=0 QTime=7 
[junit4:junit4]   2> 15874 T1692 C166 P42543 /update {wt=javabin&version=2} {add=[2 (1413336502313680896)]} 0 3
[junit4:junit4]   2> 15884 T1744 C164 P42558 REQ /update {distrib.from=http://127.0.0.1:42552/solr/collection1/&update.distrib=FROMLEADER&wt=javabin&version=2} status=0 QTime=3 
[junit4:junit4]   2> 15885 T1724 C165 P42552 /update {wt=javabin&version=2} {add=[2 (1413336502318923776)]} 0 9
[junit4:junit4]   2> 15889 T1692 C166 P42543 /update {wt=javabin&version=2} {add=[3 (1413336502331506688)]} 0 2
[junit4:junit4]   2> 15901 T1744 C164 P42558 REQ /update {update.distrib=FROMLEADER&distrib.from=http://127.0.0.1:42552/solr/collection1/&wt=javabin&version=2} status=0 QTime=2 
[junit4:junit4]   2> 15901 T1722 C165 P42552 REQ /update {distrib.from=http://127.0.0.1:42548/solr/collection1/&update.distrib=TOLEADER&wt=javabin&version=2} status=0 QTime=6 
[junit4:junit4]   2> 15902 T1708 C163 P42548 /update {wt=javabin&version=2} {add=[3]} 0 10
[junit4:junit4]   2> 15907 T1692 C166 P42543 /update {wt=javabin&version=2} {add=[4 (1413336502349332480)]} 0 2
[junit4:junit4]   2> 15921 T1730 C162 P42554 REQ /update {update.distrib=FROMLEADER&distrib.from=http://127.0.0.1:42548/solr/collection1/&wt=javabin&version=2} status=0 QTime=3 
[junit4:junit4]   2> 15922 T1712 C163 P42548 REQ /update {distrib.from=http://127.0.0.1:42552/solr/collection1/&update.distrib=TOLEADER&wt=javabin&version=2} status=0 QTime=11 
[junit4:junit4]   2> 15922 T1724 C165 P42552 /update {wt=javabin&version=2} {add=[4]} 0 13
[junit4:junit4]   2> 15926 T1692 C166 P42543 /update {wt=javabin&version=2} {add=[5 (1413336502370304000)]} 0 1
[junit4:junit4]   2> 15934 T1744 C164 P42558 REQ /update {distrib.from=http://127.0.0.1:42552/solr/collection1/&update.distrib=FROMLEADER&wt=javabin&version=2} status=0 QTime=1 
[junit4:junit4]   2> 15935 T1724 C165 P42552 /update {wt=javabin&version=2} {add=[5 (1413336502375546880)]} 0 6
[junit4:junit4]   2> 15939 T1692 C166 P42543 /update {wt=javabin&version=2} {add=[6 (1413336502383935488)]} 0 1
[junit4:junit4]   2> 15946 T1744 C164 P42558 REQ /update {distrib.from=http://127.0.0.1:42552/solr/collection1/&update.distrib=FROMLEADER&wt=javabin&version=2} status=0 QTime=1 
[junit4:junit4]   2> 15947 T1724 C165 P42552 /update {wt=javabin&version=2} {add=[6 (1413336502388129792)]} 0 5
[junit4:junit4]   2> 15950 T1692 C166 P42543 /update {wt=javabin&version=2} {add=[7 (1413336502395469824)]} 0 1
[junit4:junit4]   2> 15957 T1744 C164 P42558 REQ /update {distrib.from=http://127.0.0.1:42552/solr/collection1/&update.distrib=FROMLEADER&wt=javabin&version=2} status=0 QTime=1 
[junit4:junit4]   2> 15958 T1724 C165 P42552 /update {wt=javabin&version=2} {add=[7 (1413336502399664128)]} 0 5
[junit4:junit4]   2> 15962 T1692 C166 P42543 /update {wt=javabin&version=2} {add=[8 (1413336502408052736)]} 0 1
[junit4:junit4]   2> 15970 T1730 C162 P42554 REQ /update {distrib.from=http://127.0.0.1:42548/solr/collection1/&update.distrib=FROMLEADER&wt=javabin&version=2} status=0 QTime=1 
[junit4:junit4]   2> 15971 T1708 C163 P42548 /update {wt=javabin&version=2} {add=[8 (1413336502413295616)]} 0 6
[junit4:junit4]   2> 15975 T1692 C166 P42543 /update {wt=javabin&version=2} {add=[9 (1413336502421684224)]} 0 1
[junit4:junit4]   2> 15983 T1744 C164 P42558 REQ /update {distrib.from=http://127.0.0.1:42552/solr/collection1/&update.distrib=FROMLEADER&wt=javabin&version=2} status=0 QTime=1 
[junit4:junit4]   2> 15984 T1724 C165 P42552 /update {wt=javabin&version=2} {add=[9 (1413336502426927104)]} 0 6
[junit4:junit4]   2> 15989 T1692 C166 P42543 /update {wt=javabin&version=2} {add=[10 (1413336502436364288)]} 0 2
[junit4:junit4]   2> 15998 T1730 C162 P42554 REQ /update {distrib.from=http://127.0.0.1:42548/solr/collection1/&update.distrib=FROMLEADER&wt=javabin&version=2} status=0 QTime=2 
[junit4:junit4]   2> 15999 T1708 C163 P42548 /update {wt=javabin&version=2} {add=[10 (1413336502441607168)]} 0 7
[junit4:junit4]   2> 16013 T1692 C166 P42543 /update {wt=javabin&version=2} {add=[11 (1413336502451044352)]} 0 11
[junit4:junit4]   2> 16025 T1730 C162 P42554 REQ /update {update.distrib=FROMLEADER&distrib.from=http://127.0.0.1:42548/solr/collection1/&wt=javabin&version=2} status=0 QTime=2 
[junit4:junit4]   2> 16025 T1712 C163 P42548 REQ /update {distrib.from=http://127.0.0.1:42552/solr/collection1/&update.distrib=TOLEADER&wt=javabin&version=2} status=0 QTime=6 
[junit4:junit4]   2> 16026 T1724 C165 P42552 /update {wt=javabin&version=2} {add=[11]} 0 10
[junit4:junit4]   2> 16031 T1692 C166 P42543 /update {wt=javabin&version=2} {add=[12 (1413336502479355904)]} 0 2
[junit4:junit4]   2> 16040 T1730 C162 P42554 REQ /update {distrib.from=http://127.0.0.1:42548/solr/collection1/&update.distrib=FROMLEADER&wt=javabin&version=2} status=0 QTime=2 
[junit4:junit4]   2> 16041 T1708 C163 P42548 /update {wt=javabin&version=2} {add=[12 (1413336502485647360)]} 0 7
[junit4:junit4]   2> 16046 T1692 C166 P42543 /update {wt=javabin&version=2} {add=[13 (1413336502495084544)]} 0 2
[junit4:junit4]   2> 16055 T1730 C162 P42554 REQ /update {distrib.from=http://127.0.0.1:42548/solr/collection1/&update.distrib=FROMLEADER&wt=javabin&version=2} status=0 QTime=2 
[junit4:junit4]   2> 16056 T1708 C163 P42548 /update {wt=javabin&version=2} {add=[13 (1413336502501376000)]} 0 7
[junit4:junit4]   2> 16061 T1692 C166 P42543 /update {wt=javabin&version=2} {add=[14 (1413336502510813184)]} 0 2
[junit4:junit4]   2> 16072 T1730 C162 P42554 REQ /update {update.distrib=FROMLEADER&distrib.from=http://127.0.0.1:42548/solr/collection1/&wt=javabin&version=2} status=0 QTime=2 
[junit4:junit4]   2> 16072 T1712 C163 P42548 REQ /update {distrib.from=http://127.0.0.1:42552/solr/collection1/&update.distrib=TOLEADER&wt=javabin&version=2} status=0 QTime=6 
[junit4:junit4]   2> 16073 T1724 C165 P42552 /update {wt=javabin&version=2} {add=[14]} 0 10
[junit4:junit4]   2> 16078 T1692 C166 P42543 /update {wt=javabin&version=2} {add=[15 (1413336502529687552)]} 0 2
[junit4:junit4]   2> 16086 T1730 C162 P42554 REQ /update {distrib.from=http://127.0.0.1:42548/solr/collection1/&update.distrib=FROMLEADER&wt=javabin&version=2} status=0 QTime=2 
[junit4:junit4]   2> 16086 T1708 C163 P42548 /update {wt=javabin&version=2} {add=[15 (1413336502532833280)]} 0 6
[junit4:junit4]   2> 16091 T1692 C166 P42543 /update {wt=javabin&version=2} {add=[16 (1413336502543319040)]} 0 2
[junit4:junit4]   2> 16102 T1730 C162 P42554 REQ /update {update.distrib=FROMLEADER&distrib.from=http://127.0.0.1:42548/solr/collection1/&wt=javabin&version=2} status=0 QTime=2 
[junit4:junit4]   2> 16103 T1712 C163 P42548 REQ /update {distrib.from=http://127.0.0.1:42552/solr/collection1/&update.distrib=TOLEADER&wt=javabin&version=2} status=0 QTime=7 
[junit4:junit4]   2> 16103 T1724 C165 P42552 /update {wt=javabin&version=2} {add=[16]} 0 10
[junit4:junit4]   2> 16110 T1692 C166 P42543 /update {wt=javabin&version=2} {add=[17 (1413336502562193408)]} 0 4
[junit4:junit4]   2> 16126 T1744 C164 P42558 REQ /update {update.distrib=FROMLEADER&distrib.from=http://127.0.0.1:42552/solr/collection1/&wt=javabin&version=2} status=0 QTime=3 
[junit4:junit4]   2> 16127 T1722 C165 P42552 REQ /update {distrib.from=http://127.0.0.1:42548/solr/collection1/&update.distrib=TOLEADER&wt=javabin&version=2} status=0 QTime=10 
[junit4:junit4]   2> 16128 T1708 C163 P42548 /update {wt=javabin&version=2} {add=[17]} 0 15
[junit4:junit4]   2> 16133 T1692 C166 P42543 /update {wt=javabin&version=2} {add=[100 (1413336502587359232)]} 0 2
[junit4:junit4]   2> 16160 T1730 C162 P42554 REQ /update {distrib.from=http://127.0.0.1:42548/solr/collection1/&update.distrib=FROMLEADER&wt=javabin&version=2} status=0 QTime=11 
[junit4:junit4]   2> 16161 T1708 C163 P42548 /update {wt=javabin&version=2} {add=[100 (1413336502591553536)]} 0 25
[junit4:junit4]   2> 16166 T1692 C166 P42543 /update {wt=javabin&version=2} {add=[101 (1413336502621962240)]} 0 2
[junit4:junit4]   2> 16177 T1730 C162 P42554 REQ /update {distrib.from=http://127.0.0.1:42548/solr/collection1/&update.distrib=FROMLEADER&wt=javabin&version=2} status=0 QTime=3 
[junit4:junit4]   2> 16178 T1708 C163 P42548 /update {wt=javabin&version=2} {add=[101 (1413336502626156544)]} 0 9
[junit4:junit4]   2> 16182 T1692 C166 P42543 /update {wt=javabin&version=2} {add=[102 (1413336502638739456)]} 0 1
[junit4:junit4]   2> 16190 T1730 C162 P42554 REQ /update {distrib.from=http://127.0.0.1:42548/solr/collection1/&update.distrib=FROMLEADER&wt=javabin&version=2} status=0 QTime=1 
[junit4:junit4]   2> 16191 T1708 C163 P42548 /update {wt=javabin&version=2} {add=[102 (1413336502643982336)]} 0 6
[junit4:junit4]   2> 16204 T1692 C166 P42543 /update {wt=javabin&version=2} {add=[103 (1413336502652370944)]} 0 10
[junit4:junit4]   2> 16214 T1744 C164 P42558 REQ /update {update.distrib=FROMLEADER&distrib.from=http://127.0.0.1:42552/solr/collection1/&wt=javabin&version=2} status=0 QTime=1 
[junit4:junit4]   2> 16214 T1722 C165 P42552 REQ /update {distrib.from=http://127.0.0.1:42548/solr/collection1/&update.distrib=TOLEADER&wt=javabin&version=2} status=0 QTime=5 
[junit4:junit4]   2> 16215 T1708 C163 P42548 /update {wt=javabin&version=2} {add=[103]} 0 8
[junit4:junit4]   2> 16221 T1692 C166 P42543 /update {wt=javabin&version=2} {add=[104 (1413336502677536768)]} 0 3
[junit4:junit4]   2> 16230 T1744 C164 P42558 REQ /update {update.distrib=FROMLEADER&distrib.from=http://127.0.0.1:42552/solr/collection1/&wt=javabin&version=2} status=0 QTime=1 
[junit4:junit4]   2> 16230 T1722 C165 P42552 REQ /update {distrib.from=http://127.0.0.1:42548/solr/collection1/&update.distrib=TOLEADER&wt=javabin&version=2} status=0 QTime=4 
[junit4:junit4]   2> 16231 T1708 C163 P42548 /update {wt=javabin&version=2} {add=[104]} 0 7
[junit4:junit4]   2> 16236 T1692 C166 P42543 /update {wt=javabin&version=2} {add=[105 (1413336502695362560)]} 0 2
[junit4:junit4]   2> 16258 T1744 C164 P42558 REQ /update {distrib.from=http://127.0.0.1:42552/solr/collection1/&update.distrib=FROMLEADER&wt=javabin&version=2} status=0 QTime=7 
[junit4:junit4]   2> 16259 T1724 C165 P42552 /update {wt=javabin&version=2} {add=[105 (1413336502698508288)]} 0 21
[junit4:junit4]   2> 16264 T1692 C166 P42543 /update {wt=javabin&version=2} {add=[106 (1413336502724722688)]} 0 2
[junit4:junit4]   2> 16274 T1744 C164 P42558 REQ /update {distrib.from=http://127.0.0.1:42552/solr/collection1/&update.distrib=FROMLEADER&wt=javabin&version=2} status=0 QTime=2 
[junit4:junit4]   2> 16275 T1724 C165 P42552 /update {wt=javabin&version=2} {add=[106 (1413336502728916992)]} 0 8
[junit4:junit4]   2> 16280 T1692 C166 P42543 /update {wt=javabin&version=2} {add=[107 (1413336502741499904)]} 0 2
[junit4:junit4]   2> 16291 T1730 C162 P42554 REQ /update {update.distrib=FROMLEADER&distrib.from=http://127.0.0.1:42548/solr/collection1/&wt=javabin&version=2} status=0 QTime=2 
[junit4:junit4]   2> 16292 T1712 C163 P42548 REQ /update {distrib.from=http://127.0.0.1:42552/solr/collection1/&update.distrib=TOLEADER&wt=javabin&version=2} status=0 QTime=7 
[junit4:junit4]   2> 16293 T1724 C165 P42552 /update {wt=javabin&version=2} {add=[107]} 0 11
[junit4:junit4]   2> 16297 T1692 C166 P42543 /update {wt=javabin&version=2} {add=[108 (1413336502759325696)]} 0 1
[junit4:junit4]   2> 16306 T1730 C162 P42554 REQ /update {update.distrib=FROMLEADER&distrib.from=http://127.0.0.1:42548/solr/collection1/&wt=javabin&version=2} status=0 QTime=1 
[junit4:junit4]   2> 16307 T1712 C163 P42548 REQ /update {distrib.from=http://127.0.0.1:42552/solr/collection1/&update.distrib=TOLEADER&wt=javabin&version=2} status=0 QTime=5 
[junit4:junit4]   2> 16307 T1724 C165 P42552 /update {wt=javabin&version=2} {add=[108]} 0 7
[junit4:junit4]   2> 16311 T1692 C166 P42543 /update {wt=javabin&version=2} {add=[109 (1413336502774005760)]} 0 1
[junit4:junit4]   2> 16318 T1730 C162 P42554 REQ /update {distrib.from=http://127.0.0.1:42548/solr/collection1/&update.distrib=FROMLEADER&wt=javabin&version=2} status=0 QTime=1 
[junit4:junit4]   2> 16319 T1708 C163 P42548 /update {wt=javabin&version=2} {add=[109 (1413336502778200064)]} 0 5
[junit4:junit4]   2> 16323 T1692 C166 P42543 /update {wt=javabin&version=2} {add=[110 (1413336502786588672)]} 0 1
[junit4:junit4]   2> 16330 T1730 C162 P42554 REQ /update {distrib.from=http://127.0.0.1:42548/solr/collection1/&update.distrib=FROMLEADER&wt=javabin&version=2} status=0 QTime=1 
[junit4:junit4]   2> 16331 T1708 C163 P42548 /update {wt=javabin&version=2} {add=[110 (1413336502790782976)]} 0 5
[junit4:junit4]   2> 16335 T1692 C166 P42543 /update {wt=javabin&version=2} {add=[111 (1413336502799171584)]} 0 1
[junit4:junit4]   2> 16342 T1730 C162 P42554 REQ /update {distrib.from=http://127.0.0.1:42548/solr/collection1/&update.distrib=FROMLEADER&wt=javabin&version=2} status=0 QTime=1 
[junit4:junit4]   2> 16342 T1708 C163 P42548 /update {wt=javabin&version=2} {add=[111 (1413336502803365888)]} 0 4
[junit4:junit4]   2> 16346 T1692 C166 P42543 /update {wt=javabin&version=2} {add=[112 (1413336502810705920)]} 0 1
[junit4:junit4]   2> 16353 T1744 C164 P42558 REQ /update {distrib.from=http://127.0.0.1:42552/solr/collection1/&update.distrib=FROMLEADER&wt=javabin&version=2} status=0 QTime=1 
[junit4:junit4]   2> 16353 T1724 C165 P42552 /update {wt=javabin&version=2} {add=[112 (1413336502814900224)]} 0 4
[junit4:junit4]   2> 16365 T1692 C166 P42543 /update {wt=javabin&version=2} {add=[113 (1413336502822240256)]} 0 9
[junit4:junit4]   2> 16372 T1730 C162 P42554 REQ /update {distrib.from=http://127.0.0.1:42548/solr/collection1/&update.distrib=FROMLEADER&wt=javabin&version=2} status=0 QTime=1 
[junit4:junit4]   2> 16373 T1708 C163 P42548 /update {wt=javabin&version=2} {add=[113 (1413336502834823168)]} 0 5
[junit4:junit4]   2> 16378 T1692 C166 P42543 /update {wt=javabin&version=2} {add=[114 (1413336502843211776)]} 0 2
[junit4:junit4]   2> 16388 T1730 C162 P42554 REQ /update {update.distrib=FROMLEADER&distrib.from=http://127.0.0.1:42548/solr/collection1/&wt=javabin&version=2} status=0 QTime=1 
[junit4:junit4]   2> 16388 T1712 C163 P42548 REQ /update {distrib.from=http://127.0.0.1:42552/solr/collection1/&update.distrib=TOLEADER&wt=javabin&version=2} status=0 QTime=4 
[junit4:junit4]   2> 16389 T1724 C165 P42552 /update {wt=javabin&version=2} {add=[114]} 0 8
[junit4:junit4]   2> 16393 T1692 C166 P42543 /update {wt=javabin&version=2} {add=[115 (1413336502859988992)]} 0 1
[junit4:junit4]   2> 16401 T1744 C164 P42558 REQ /update {distrib.from=http://127.0.0.1:42552/solr/collection1/&update.distrib=FROMLEADER&wt=javabin&version=2} status=0 QTime=1 
[junit4:junit4]   2> 16401 T1724 C165 P42552 /update {wt=javabin&version=2} {add=[115 (1413336502865231872)]} 0 5
[junit4:junit4]   2> 16406 T1692 C166 P42543 /update {wt=javabin&version=2} {add=[116 (1413336502873620480)]} 0 1
[junit4:junit4]   2> 16416 T1744 C164 P42558 REQ /update {update.distrib=FROMLEADER&distrib.from=http://127.0.0.1:42552/solr/collection1/&wt=javabin&version=2} status=0 QTime=1 
[junit4:junit4]   2> 16416 T1722 C165 P42552 REQ /update {distrib.from=http://127.0.0.1:42548/solr/collection1/&update.distrib=TOLEADER&wt=javabin&version=2} status=0 QTime=4 
[junit4:junit4]   2> 16417 T1708 C163 P42548 /update {wt=javabin&version=2} {add=[116]} 0 8
[junit4:junit4]   2> 16421 T1692 C166 P42543 /update {wt=javabin&version=2} {add=[117 (1413336502889349120)]} 0 1
[junit4:junit4]   2> 16428 T1744 C164 P42558 REQ /update {distrib.from=http://127.0.0.1:42552/solr/collection1/&update.distrib=FROMLEADER&wt=javabin&version=2} status=0 QTime=1 
[junit4:junit4]   2> 16428 T1724 C165 P42552 /update {wt=javabin&version=2} {add=[117 (1413336502892494848)]} 0 5
[junit4:junit4]   2> 16432 T1692 C166 P42543 /update {wt=javabin&version=2} {add=[118 (1413336502900883456)]} 0 1
[junit4:junit4]   2> 16465 T1730 C162 P42554 REQ /update {update.distrib=FROMLEADER&distrib.from=http://127.0.0.1:42548/solr/collection1/&wt=javabin&version=2} status=0 QTime=10 
[junit4:junit4]   2> 16466 T1712 C163 P42548 REQ /update {distrib.from=http://127.0.0.1:42552/solr/collection1/&update.distrib=TOLEADER&wt=javabin&version=2} status=0 QTime=28 
[junit4:junit4]   2> 16466 T1724 C165 P42552 /update {wt=javabin&version=2} {add=[118]} 0 31
[junit4:junit4]   2> 16470 T1692 C166 P42543 /update {wt=javabin&version=2} {add=[119 (1413336502940729344)]} 0 1
[junit4:junit4]   2> 16481 T1744 C164 P42558 REQ /update {update.distrib=FROMLEADER&distrib.from=http://127.0.0.1:42552/solr/collection1/&wt=javabin&version=2} status=0 QTime=1 
[junit4:junit4]   2> 16482 T1722 C165 P42552 REQ /update {distrib.from=http://127.0.0.1:42548/solr/collection1/&update.distrib=TOLEADER&wt=javabin&version=2} status=0 QTime=6 
[junit4:junit4]   2> 16482 T1708 C163 P42548 /update {wt=javabin&version=2} {add=[119]} 0 9
[junit4:junit4]   2> 16486 T1692 C166 P42543 /update {wt=javabin&version=2} {add=[120 (1413336502957506560)]} 0 1
[junit4:junit4]   2> 16493 T1744 C164 P42558 REQ /update {distrib.from=http://127.0.0.1:42552/solr/collection1/&update.distrib=FROMLEADER&wt=javabin&version=2} status=0 QTime=1 
[junit4:junit4]   2> 16493 T1724 C165 P42552 /update {wt=javabin&version=2} {add=[120 (1413336502961700864)]} 0 4
[junit4:junit4]   2> 16499 T1692 C166 P42543 /update {wt=javabin&version=2} {add=[121 (1413336502971138048)]} 0 2
[junit4:junit4]   2> 16509 T1744 C164 P42558 REQ /update {update.distrib=FROMLEADER&distrib.from=http://127.0.0.1:42552/solr/collection1/&wt=javabin&version=2} status=0 QTime=1 
[junit4:junit4]   2> 16510 T1722 C165 P42552 REQ /update {distrib.from=http://127.0.0.1:42548/solr/collection1/&update.distrib=TOLEADER&wt=javabin&version=2} status=0 QTime=5 
[junit4:junit4]   2> 16511 T1708 C163 P42548 /update {wt=javabin&version=2} {add=[121]} 0 9
[junit4:junit4]   2> 16514 T1692 C166 P42543 /update {wt=javabin&version=2} {add=[122 (1413336502986866688)]} 0 1
[junit4:junit4]   2> 16528 T1730 C162 P42554 REQ /update {update.distrib=FROMLEADER&distrib.from=http://127.0.0.1:42548/solr/collection1/&wt=javabin&version=2} status=0 QTime=3 
[junit4:junit4]   2> 16528 T1712 C163 P42548 REQ /update {distrib.from=http://127.0.0.1:42552/solr/collection1/&update.distrib=TOLEADER&wt=javabin&version=2} status=0 QTime=8 
[junit4:junit4]   2> 16529 T1724 C165 P42552 /update {wt=javabin&version=2} {add=[122]} 0 12
[junit4:junit4]   2> 16542 T1692 C166 P42543 /update {wt=javabin&version=2} {add=[123 (1413336503006789632)]} 0 10
[junit4:junit4]   2> 16553 T1730 C162 P42554 REQ /update {update.distrib=FROMLEADER&distrib.from=http://127.0.0.1:42548/solr/collection1/&wt=javabin&version=2} status=0 QTime=1 
[junit4:junit4]   2> 16554 T1712 C163 P42548 REQ /update {distrib.from=http://127.0.0.1:42552/solr/collection1/&update.distrib=TOLEADER&wt=javabin&version=2} status=0 QTime=6 
[junit4:junit4]   2> 16555 T1724 C165 P42552 /update {wt=javabin&version=2} {add=[123]} 0 10
[junit4:junit4]   2> 16561 T1692 C166 P42543 /update {wt=javabin&version=2} {add=[124 (1413336503034052608)]} 0 3
[junit4:junit4]   2> 16568 T1730 C162 P42554 REQ /update {distrib.from=http://127.0.0.1:42548/solr/collection1/&update.distrib=FROMLEADER&wt=javabin&version=2} status=0 QTime=1 
[junit4:junit4]   2> 16569 T1708 C163 P42548 /update {wt=javabin&version=2} {add=[124 (1413336503040344064)]} 0 5
[junit4:junit4]   2> 16573 T1692 C166 P42543 /update {wt=javabin&version=2} {add=[125 (1413336503048732672)]} 0 1
[junit4:junit4]   2> 16584 T1730 C162 P42554 REQ /update {update.distrib=FROMLEADER&distrib.from=http://127.0.0.1:42548/solr/collection1/&wt=javabin&version=2} status=0 QTime=1 
[junit4:junit4]   2> 16585 T1712 C163 P42548 REQ /update {distrib.from=http://127.0.0.1:42552/solr/collection1/&update.distrib=TOLEADER&wt=javabin&version=2} status=0 QTime=6 
[junit4:junit4]   2> 16586 T1724 C165 P42552 /update {wt=javabin&version=2} {add=[125]} 0 10
[junit4:junit4]   2> 16590 T1692 C166 P42543 /update {wt=javabin&version=2} {add=[126 (1413336503066558464)]} 0 1
[junit4:junit4]   2> 16597 T1744 C164 P42558 REQ /update {distrib.from=http://127.0.0.1:42552/solr/collection1/&update.distrib=FROMLEADER&wt=javabin&version=2} status=0 QTime=1 
[junit4:junit4]   2> 16598 T1724 C165 P42552 /update {wt=javabin&version=2} {add=[126 (1413336503070752768)]} 0 5
[junit4:junit4]   2> 16602 T1692 C166 P42543 /update {wt=javabin&version=2} {add=[127 (1413336503079141376)]} 0 1
[junit4:junit4]   2> 16625 T1744 C164 P42558 REQ /update {update.distrib=FROMLEADER&distrib.from=http://127.0.0.1:42552/solr/collection1/&wt=javabin&version=2} status=0 QTime=6 
[junit4:junit4]   2> 16626 T1722 C165 P42552 REQ /update {distrib.from=http://127.0.0.1:42548/solr/collection1/&update.distrib=TOLEADER&wt=javabin&version=2} status=0 QTime=18 
[junit4:junit4]   2> 16627 T1708 C163 P42548 /update {wt=javabin&version=2} {add=[127]} 0 22
[junit4:junit4]   2> 16632 T1692 C166 P42543 /update {wt=javabin&version=2} {add=[128 (1413336503109550080)]} 0 2
[junit4:junit4]   2> 16644 T1744 C164 P42558 REQ /update {update.distrib=FROMLEADER&distrib.from=http://127.0.0.1:42552/solr/collection1/&wt=javabin&version=2} status=0 QTime=2 
[junit4:junit4]   2> 16644 T1722 C165 P42552 REQ /update {distrib.from=http://127.0.0.1:42548/solr/collection1/&update.distrib=TOLEADER&wt=javabin&version=2} status=0 QTime=7 
[junit4:junit4]   2> 16645 T1708 C163 P42548 /update {wt=javabin&version=2} {add=[128]} 0 11
[junit4:junit4]   2> 16649 T1692 C166 P42543 /update {wt=javabin&version=2} {add=[129 (1413336503128424448)]} 0 1
[junit4:junit4]   2> 16656 T1730 C162 P42554 REQ /update {distrib.from=http://127.0.0.1:42548/solr/collection1/&update.distrib=FROMLEADER&wt=javabin&version=2} status=0 QTime=1 
[junit4:junit4]   2> 16657 T1708 C163 P42548 /update {wt=javabin&version=2} {add=[129 (1413336503132618752)]} 0 5
[junit4:junit4]   2> 16661 T1692 C166 P42543 /update {wt=javabin&version=2} {add=[130 (1413336503141007360)]} 0 1
[junit4:junit4]   2> 16670 T1744 C164 P42558 REQ /update {update.distrib=FROMLEADER&distrib.from=http://127.0.0.1:42552/solr/collection1/&wt=javabin&version=2} status=0 QTime=1 
[junit4:junit4]   2> 16670 T1722 C165 P42552 REQ /update {distrib.from=http://127.0.0.1:42548/solr/collection1/&update.distrib=TOLEADER&wt=javabin&version=2} status=0 QTime=4 
[junit4:junit4]   2> 16671 T1708 C163 P42548 /update {wt=javabin&version=2} {add=[130]} 0 7
[junit4:junit4]   2> 16675 T1692 C166 P42543 /update {wt=javabin&version=2} {add=[131 (1413336503155687424)]} 0 1
[junit4:junit4]   2> 16683 T1744 C164 P42558 REQ /update {update.distrib=FROMLEADER&distrib.from=http://127.0.0.1:42552/solr/collection1/&wt=javabin&version=2} status=0 QTime=1 
[junit4:junit4]   2> 16683 T1722 C165 P42552 REQ /update {distrib.from=http://127.0.0.1:42548/solr/collection1/&update.distrib=TOLEADER&wt=javabin&version=2} status=0 QTime=4 
[junit4:junit4]   2> 16684 T1708 C163 P42548 /update {wt=javabin&version=2} {add=[131]} 0 7
[junit4:junit4]   2> 16687 T1692 C166 P42543 /update {wt=javabin&version=2} {add=[132 (1413336503168270336)]} 0 1
[junit4:junit4]   2> 16697 T1730 C162 P42554 REQ /update {update.distrib=FROMLEADER&distrib.from=http://127.0.0.1:42548/solr/collection1/&wt=javabin&version=2} status=0 QTime=1 
[junit4:junit4]   2> 16698 T1712 C163 P42548 REQ /update {distrib.from=http://127.0.0.1:42552/solr/collection1/&update.distrib=TOLEADER&wt=javabin&version=2} status=0 QTime=5 
[junit4:junit4]   2> 16699 T1724 C165 P42552 /update {wt=javabin&version=2} {add=[132]} 0 9
[junit4:junit4]   2> 16709 T1692 C166 P42543 /update {wt=javabin&version=2} {add=[133 (1413336503185047552)]} 0 7
[junit4:junit4]   2> 16718 T1730 C162 P42554 REQ /update {update.distrib=FROMLEADER&distrib.from=http://127.0.0.1:42548/solr/collection1/&wt=javabin&version=2} status=0 QTime=1 
[junit4:junit4]   2> 16719 T1712 C163 P42548 REQ /update {distrib.from=http://127.0.0.1:42552/solr/collection1/&update.distrib=TOLEADER&wt=javabin&version=2} status=0 QTime=5 
[junit4:junit4]   2> 16720 T1724 C165 P42552 /update {wt=javabin&version=2} {add=[133]} 0 9
[junit4:junit4]   2> 16724 T1692 C166 P42543 /update {wt=javabin&version=2} {add=[134 (1413336503206019072)]} 0 2
[junit4:junit4]   2> 16731 T1744 C164 P42558 REQ /update {distrib.from=http://127.0.0.1:42552/solr/collection1/&update.distrib=FROMLEADER&wt=javabin&version=2} status=0 QTime=1 
[junit4:junit4]   2> 16732 T1724 C165 P42552 /update {wt=javabin&version=2} {add=[134 (1413336503211261952)]} 0 5
[junit4:junit4]   2> 16736 T1692 C166 P42543 /update {wt=javabin&version=2} {add=[135 (1413336503219650560)]} 0 1
[junit4:junit4]   2> 16747 T1730 C162 P42554 REQ /update {update.distrib=FROMLEADER&distrib.from=http://127.0.0.1:42548/solr/collection1/&wt=javabin&version=2} status=0 QTime=1 
[junit4:junit4]   2> 16748 T1712 C163 P42548 REQ /update {distrib.from=http://127.0.0.1:42552/solr/collection1/&update.distrib=TOLEADER&wt=javabin&version=2} status=0 QTime=6 
[junit4:junit4]   2> 16749 T1724 C165 P42552 /update {wt=javabin&version=2} {add=[135]} 0 10
[junit4:junit4]   2> 16752 T1692 C166 P42543 /update {wt=javabin&version=2} {add=[136 (1413336503236427776)]} 0 1
[junit4:junit4]   2> 16759 T1744 C164 P42558 REQ /update {distrib.from=http://127.0.0.1:42552/solr/collection1/&update.distrib=FROMLEADER&wt=javabin&version=2} status=0 QTime=1 
[junit4:junit4]   2> 16760 T1724 C165 P42552 /update {wt=javabin&version=2} {add=[136 (1413336503240622080)]} 0 5
[junit4:junit4]   2> 16764 T1692 C166 P42543 /update {wt=javabin&version=2} {add=[137 (1413336503249010688)]} 0 1
[junit4:junit4]   2> 16770 T1744 C164 P42558 REQ /update {distrib.from=http://127.0.0.1:42552/solr/collection1/&update.distrib=FROMLEADER&wt=javabin&version=2} status=0 QTime=1 
[junit4:junit4]   2> 16771 T1724 C165 P42552 /update {wt=javabin&version=2} {add=[137 (1413336503252156416)]} 0 5
[junit4:junit4]   2> 16774 T1692 C166 P42543 /update {wt=javabin&version=2} {add=[138 (1413336503259496448)]} 0 1
[junit4:junit4]   2> 16784 T1730 C162 P42554 REQ /update {update.distrib=FROMLEADER&distrib.from=http://127.0.0.1:42548/solr/collection1/&wt=javabin&version=2} status=0 QTime=1 
[junit4:junit4]   2> 16785 T1712 C163 P42548 REQ /update {distrib.from=http://127.0.0.1:42552/solr/collection1/&update.distrib=TOLEADER&wt=javabin&version=2} status=0 QTime=5 
[junit4:junit4]   2> 16786 T1724 C165 P42552 /update {wt=javabin&version=2} {add=[138]} 0 9
[junit4:junit4]   2> 16790 T1692 C166 P42543 /update {wt=javabin&version=2} {add=[139 (1413336503276273664)]} 0 1
[junit4:junit4]   2> 16801 T1744 C164 P42558 REQ /update {update.distrib=FROMLEADER&distrib.from=http://127.0.0.1:42552/solr/collection1/&wt=javabin&version=2} status=0 QTime=1 
[junit4:junit4]   2> 16802 T1722 C165 P42552 REQ /update {distrib.from=http://127.0.0.1:42548/solr/collection1/&update.distrib=TOLEADER&wt=javabin&version=2} status=0 QTime=6 
[junit4:junit4]   2> 16803 T1708 C163 P42548 /update {wt=javabin&version=2} {add=[139]} 0 10
[junit4:junit4]   2> 16806 T1692 C166 P42543 /update {wt=javabin&version=2} {add=[140 (1413336503293050880)]} 0 1
[junit4:junit4]   2> 16813 T1744 C164 P42558 REQ /update {distrib.from=http://127.0.0.1:42552/solr/collection1/&update.distrib=FROMLEADER&wt=javabin&version=2} status=0 QTime=1 
[junit4:junit4]   2> 16813 T1724 C165 P42552 /update {wt=javabin&version=2} {add=[140 (1413336503297245184)]} 0 4
[junit4:junit4]   2> 16817 T1692 C166 P42543 /update {wt=javabin&version=2} {add=[141 (1413336503304585216)]} 0 1
[junit4:junit4]   2> 16824 T1744 C164 P42558 REQ /update {distrib.from=http://127.0.0.1:42552/solr/collection1/&update.distrib=FROMLEADER&wt=javabin&version=2} status=0 QTime=1 
[junit4:junit4]   2> 16824 T1724 C165 P42552 /update {wt=javabin&version=2} {add=[141 (1413336503308779520)]} 0 4
[junit4:junit4]   2> 16828 T1692 C166 P42543 /update {wt=javabin&version=2} {add=[142 (1413336503316119552)]} 0 1
[junit4:junit4]   2> 16850 T1744 C164 P42558 REQ /update {update.distrib=FROMLEADER&distrib.from=http://127.0.0.1:42552/solr/collection1/&wt=javabin&version=2} status=0 QTime=6 
[junit4:junit4]   2> 16851 T1722 C165 P42552 REQ /update {distrib.from=http://127.0.0.1:42548/solr/collection1/&update.distrib=TOLEADER&wt=javabin&version=2} status=0 QTime=18 
[junit4:junit4]   2> 16851 T1708 C163 P42548 /update {wt=javabin&version=2} {add=[142]} 0 20
[junit4:junit4]   2> 16864 T1692 C166 P42543 /update {wt=javabin&version=2} {add=[143 (1413336503344431104)]} 0 10
[junit4:junit4]   2> 16876 T1744 C164 P42558 REQ /update {update.distrib=FROMLEADER&distrib.from=http://127.0.0.1:42552/solr/collection1/&wt=javabin&version=2} status=0 QTime=2 
[junit4:junit4]   2> 16876 T1722 C165 P42552 REQ /update {distrib.from=http://127.0.0.1:42548/solr/collection1/&update.distrib=TOLEADER&wt=javabin&version=2} status=0 QTime=6 
[junit4:junit4]   2> 16877 T1708 C163 P42548 /update {wt=javabin&version=2} {add=[143]} 0 10
[junit4:junit4]   2> 16882 T1692 C166 P42543 /update {wt=javabin&version=2} {add=[144 (1413336503370645504)]} 0 3
[junit4:junit4]   2> 16891 T1744 C164 P42558 REQ /update {update.distrib=FROMLEADER&distrib.from=http://127.0.0.1:42552/solr/collection1/&wt=javabin&version=2} status=0 QTime=1 
[junit4:junit4]   2> 16891 T1722 C165 P42552 REQ /update {distrib.from=http://127.0.0.1:42548/solr/collection1/&update.distrib=TOLEADER&wt=javabin&version=2} status=0 QTime=4 
[junit4:junit4]   2> 16892 T1708 C163 P42548 /update {wt=javabin&version=2} {add=[144]} 0 7
[junit4:junit4]   2> 16896 T1692 C166 P42543 /update {wt=javabin&version=2} {add=[145 (1413336503387422720)]} 0 1
[junit4:junit4]   2> 16906 T1744 C164 P42558 REQ /update {update.distrib=FROMLEADER&distrib.from=http://127.0.0.1:42552/solr/collection1/&wt=javabin&version=2} status=0 QTime=1 
[junit4:junit4]   2> 16906 T1722 C165 P42552 REQ /update {distrib.from=http://127.0.0.1:42548/solr/collection1/&update.distrib=TOLEADER&wt=javabin&version=2} status=0 QTime=4 
[junit4:junit4]   2> 16907 T1708 C163 P42548 /update {wt=javabin&version=2} {add=[145]} 0 8
[junit4:junit4]   2> 16911 T1692 C166 P42543 /update {wt=javabin&version=2} {add=[146 (1413336503403151360)]} 0 1
[junit4:junit4]   2> 16931 T1730 C162 P42554 REQ /update {distrib.from=http://127.0.0.1:42548/solr/collection1/&update.distrib=FROMLEADER&wt=javabin&version=2} status=0 QTime=9 
[junit4:junit4]   2> 16931 T1708 C163 P42548 /update {wt=javabin&version=2} {add=[146 (1413336503407345664)]} 0 17
[junit4:junit4]   2> 16935 T1692 C166 P42543 /update {wt=javabin&version=2} {add=[147 (1413336503428317184)]} 0 1
[junit4:junit4]   2> 16942 T1744 C164 P42558 REQ /update {distrib.from=http://127.0.0.1:42552/solr/collection1/&update.distrib=FROMLEADER&wt=javabin&version=2} status=0 QTime=1 
[junit4:junit4]   2> 16942 T1724 C165 P42552 /update {wt=javabin&version=2} {add=[147 (1413336503432511488)]} 0 4
[junit4:junit4]   2> 16946 T1692 C166 P42543 /update {wt=javabin&version=2} {add=[148 (1413336503439851520)]} 0 1
[junit4:junit4]   2> 16958 T1730 C162 P42554 REQ /update {update.distrib=FROMLEADER&distrib.from=http://127.0.0.1:42548/solr/collection1/&wt=javabin&version=2} status=0 QTime=2 
[junit4:junit4]   2> 16959 T1712 C163 P42548 REQ /update {distrib.from=http://127.0.0.1:42552/solr/collection1/&update.distrib=TOLEADER&wt=javabin&version=2} status=0 QTime=8 
[junit4:junit4]   2> 16959 T1724 C165 P42552 /update {wt=javabin&version=2} {add=[148]} 0 10
[junit4:junit4]   2> 16963 T1692 C166 P42543 /update {wt=javabin&version=2} {add=[149 (1413336503457677312)]} 0 1
[junit4:junit4]   2> 16970 T1744 C164 P42558 REQ /update {distrib.from=http://127.0.0.1:42552/solr/collection1/&update.distrib=FROMLEADER&wt=javabin&version=2} status=0 QTime=1 
[junit4:junit4]   2> 16970 T1724 C165 P42552 /update {wt=javabin&version=2} {add=[149 (1413336503461871616)]} 0 4
[junit4:junit4]   2> 16971 T1680 oasc.AbstractDistribZkTestBase.waitForRecoveriesToFinish Wait for recoveries to finish - collection: collection1 failOnTimeout:true timeout (sec):1800
[junit4:junit4]   2> 16972 T1680 oascc.ZkStateReader.updateClusterState Updating cloud state from ZooKeeper... 
[junit4:junit4]   2> 16974 T1692 C166 P42543 oasu.DirectUpdateHandler2.commit start commit{flags=0,_version_=0,optimize=false,openSearcher=true,waitSearcher=true,expungeDeletes=false,softCommit=false}
[junit4:junit4]   2> 17245 T1692 C166 P42543 oasc.SolrDeletionPolicy.onCommit SolrDeletionPolicy.onCommit: commits:num=2
[junit4:junit4]   2> 		commit{dir=/usr/home/hudson/hudson-slave/workspace/Lucene-Solr-Tests-4.x-java7/solr/build/solr-core/test/J0/org.apache.solr.cloud.BasicDistributedZk2Test-1347862706828/control/data/index,segFN=segments_2,generation=2,filenames=[_0.fnm, _0.frq, _0.tim, _0_nrm.cfe, segments_2, _0.fdx, _0_nrm.cfs, _0.si, _0.prx, _0.tip, _0.fdt]
[junit4:junit4]   2> 		commit{dir=/usr/home/hudson/hudson-slave/workspace/Lucene-Solr-Tests-4.x-java7/solr/build/solr-core/test/J0/org.apache.solr.cloud.BasicDistributedZk2Test-1347862706828/control/data/index,segFN=segments_3,generation=3,filenames=[_5_nrm.cfe, _3_nrm.cfe, _5.fdt, _5.prx, _1.frq, _4.prx, _7.si, _4.fnm, _4_nrm.cfe, _3.fdt, _1.fnm, _2.tim, _4.fdx, _7.fnm, _5.tip, _5.tim, _4.frq, _7.frq, _7.tim, _0.prx, _7.tip, _0.fnm, _2.prx, _2.frq, _2.fdt, _7.fdx, _3.prx, _2.fdx, _7.fdt, _5.si, _2.tip, _1.fdx, _1.prx, _3_nrm.cfs, _5_nrm.cfs, _1.fdt, _0.tim, _0.frq, _4_nrm.cfs, _3.si, _6.fdt, _0.tip, _2.si, _3.frq, _6.frq, _3.tim, _6.fdx, _3.fnm, _2_nrm.cfe, _6.tip, _6_nrm.cfs, _7_nrm.cfs, _6.tim, _4.tip, _0.si, _2_nrm.cfs, _1.tip, _1.tim, _1_nrm.cfs, _5.fnm, _7_nrm.cfe, _4.tim, _6_nrm.cfe, _5.frq, _4.si, _4.fdt, _0_nrm.cfs, _1_nrm.cfe, _2.fnm, _7.prx, _3.fdx, _6.prx, _1.si, _0_nrm.cfe, _5.fdx, _6.si, _6.fnm, _0.fdx, _3.tip, segments_3, _0.fdt]
[junit4:junit4]   2> 17245 T1692 C166 P42543 oasc.SolrDeletionPolicy.updateCommits newest commit = 3
[junit4:junit4]   2> 17277 T1692 C166 P42543 oass.SolrIndexSearcher.<init> Opening Searcher@55c939c5 main
[junit4:junit4]   2> 17278 T1692 C166 P42543 oasu.DirectUpdateHandler2.commit end_commit_flush
[junit4:junit4]   2> 17279 T1703 oasc.SolrCore.registerSearcher [collection1] Registered new searcher Searcher@55c939c5 main{StandardDirectoryReader(segments_3:17 _0(4.0.0.2):C1 _1(4.0.0.2):C10 _2(4.0.0.2):C10 _3(4.0.0.2):C10 _4(4.0.0.2):C10 _5(4.0.0.2):C10 _6(4.0.0.2):C10 _7(4.0.0.2):C6)}
[junit4:junit4]   2> 17279 T1692 C166 P42543 /update {waitSearcher=true&wt=javabin&commit=true&softCommit=false&version=2} {commit=} 0 305
[junit4:junit4]   2> 17282 T1708 C163 P42548 oasu.DirectUpdateHandler2.commit start commit{flags=0,_version_=0,optimize=false,openSearcher=true,waitSearcher=true,expungeDeletes=false,softCommit=false}
[junit4:junit4]   2> 17469 T1708 C163 P42548 oasc.SolrDeletionPolicy.onCommit SolrDeletionPolicy.onCommit: commits:num=2
[junit4:junit4]   2> 		commit{dir=/usr/home/hudson/hudson-slave/workspace/Lucene-Solr-Tests-4.x-java7/solr/build/solr-core/test/J0/org.apache.solr.cloud.BasicDistributedZk2Test-1347862706828/jetty1/index,segFN=segments_2,generation=2,filenames=[_0.fnm, _0.frq, _0.tim, _0_nrm.cfe, segments_2, _0.fdx, _0_nrm.cfs, _0.si, _0.prx, _0.tip, _0.fdt]
[junit4:junit4]   2> 		commit{dir=/usr/home/hudson/hudson-slave/workspace/Lucene-Solr-Tests-4.x-java7/solr/build/solr-core/test/J0/org.apache.solr.cloud.BasicDistributedZk2Test-1347862706828/jetty1/index,segFN=segments_3,generation=3,filenames=[_3_nrm.cfe, _1.frq, _4.prx, _4.fnm, _4_nrm.cfe, _3.fdt, _1.fnm, _2.tim, _4.fdx, _4.frq, _0.prx, _0.fnm, _2.prx, _2.frq, _2.fdt, _3.prx, _2.fdx, _2.tip, _1.fdx, _1.prx, _3_nrm.cfs, _1.fdt, _0.tim, _0.frq, _4_nrm.cfs, _3.si, _0.tip, _2.si, _3.frq, _3.tim, _3.fnm, _2_nrm.cfe, _4.tip, _0.si, _2_nrm.cfs, _1.tip, _1.tim, _1_nrm.cfs, _4.tim, _4.si, _4.fdt, _0_nrm.cfs, _1_nrm.cfe, _2.fnm, _3.fdx, _1.si, _0_nrm.cfe, _0.fdx, _3.tip, segments_3, _0.fdt]
[junit4:junit4]   2> 17470 T1708 C163 P42548 oasc.SolrDeletionPolicy.updateCommits newest commit = 3
[junit4:junit4]   2> 17497 T1708 C163 P42548 oass.SolrIndexSearcher.<init> Opening Searcher@3cee3bc3 main
[junit4:junit4]   2> 17498 T1708 C163 P42548 oasu.DirectUpdateHandler2.commit end_commit_flush
[junit4:junit4]   2> 17499 T1715 oasc.SolrCore.registerSearcher [collection1] Registered new searcher Searcher@3cee3bc3 main{StandardDirectoryReader(segments_3:11 _0(4.0.0.2):C1 _1(4.0.0.2):C10 _2(4.0.0.2):C10 _3(4.0.0.2):C10 _4(4.0.0.2):C1)}
[junit4:junit4]   2> 17499 T1708 C163 P42548 oasu.SolrCmdDistributor.distribCommit Distrib commit to:[StdNode: http://127.0.0.1:42554/solr/collection1/, StdNode: http://127.0.0.1:42552/solr/collection1/, StdNode: http://127.0.0.1:42558/solr/collection1/]
[junit4:junit4]   2> 17502 T1730 C162 P42554 oasu.DirectUpdateHandler2.commit start commit{flags=0,_version_=0,optimize=false,openSearcher=true,waitSearcher=true,expungeDeletes=false,softCommit=false}
[junit4:junit4]   2> 17502 T1722 C165 P42552 oasu.DirectUpdateHandler2.commit start commit{flags=0,_version_=0,optimize=false,openSearcher=true,waitSearcher=true,expungeDeletes=false,softCommit=false}
[junit4:junit4]   2> 17502 T1744 C164 P42558 oasu.DirectUpdateHandler2.commit start commit{flags=0,_version_=0,optimize=false,openSearcher=true,waitSearcher=true,expungeDeletes=false,softCommit=false}
[junit4:junit4]   2> 17761 T1744 C164 P42558 oasc.SolrDeletionPolicy.onCommit SolrDeletionPolicy.onCommit: commits:num=2
[junit4:junit4]   2> 		commit{dir=/usr/home/hudson/hudson-slave/workspace/Lucene-Solr-Tests-4.x-java7/solr/build/solr-c

[...truncated too long message...]

t.java:93)
[junit4:junit4]    > 	at org.apache.solr.cloud.AbstractDistribZkTestBase.waitForRecoveriesToFinish(AbstractDistribZkTestBase.java:154)
[junit4:junit4]    > 	at org.apache.solr.cloud.AbstractFullDistribZkTestBase.waitForRecoveriesToFinish(AbstractFullDistribZkTestBase.java:560)
[junit4:junit4]    > 	at org.apache.solr.cloud.AbstractFullDistribZkTestBase.waitForThingsToLevelOut(AbstractFullDistribZkTestBase.java:1135)
[junit4:junit4]    > 	at org.apache.solr.cloud.SyncSliceTest.doTest(SyncSliceTest.java:162)
[junit4:junit4]    > 	at org.apache.solr.BaseDistributedSearchTestCase.testDistribSearch(BaseDistributedSearchTestCase.java:695)
[junit4:junit4]    > 	at sun.reflect.NativeMethodAccessorImpl.invoke0(Native Method)
[junit4:junit4]    > 	at sun.reflect.NativeMethodAccessorImpl.invoke(NativeMethodAccessorImpl.java:57)
[junit4:junit4]    > 	at sun.reflect.DelegatingMethodAccessorImpl.invoke(DelegatingMethodAccessorImpl.java:43)
[junit4:junit4]    > 	at java.lang.reflect.Method.invoke(Method.java:601)
[junit4:junit4]    > 	at com.carrotsearch.randomizedtesting.RandomizedRunner.invoke(RandomizedRunner.java:1559)
[junit4:junit4]    > 	at com.carrotsearch.randomizedtesting.RandomizedRunner.access$600(RandomizedRunner.java:79)
[junit4:junit4]    > 	at com.carrotsearch.randomizedtesting.RandomizedRunner$6.evaluate(RandomizedRunner.java:737)
[junit4:junit4]    > 	at com.carrotsearch.randomizedtesting.RandomizedRunner$7.evaluate(RandomizedRunner.java:773)
[junit4:junit4]    > 	at com.carrotsearch.randomizedtesting.RandomizedRunner$8.evaluate(RandomizedRunner.java:787)
[junit4:junit4]    > 	at com.carrotsearch.randomizedtesting.rules.SystemPropertiesRestoreRule$1.evaluate(SystemPropertiesRestoreRule.java:53)
[junit4:junit4]    > 	at org.apache.lucene.util.TestRuleSetupTeardownChained$1.evaluate(TestRuleSetupTeardownChained.java:50)
[junit4:junit4]    > 	at org.apache.lucene.util.TestRuleFieldCacheSanity$1.evaluate(TestRuleFieldCacheSanity.java:51)
[junit4:junit4]    > 	at org.apache.lucene.util.AbstractBeforeAfterRule$1.evaluate(AbstractBeforeAfterRule.java:45)
[junit4:junit4]    > 	at com.carrotsearch.randomizedtesting.rules.SystemPropertiesInvariantRule$1.evaluate(SystemPropertiesInvariantRule.java:55)
[junit4:junit4]    > 	at org.apache.lucene.util.TestRuleThreadAndTestName$1.evaluate(TestRuleThreadAndTestName.java:48)
[junit4:junit4]    > 	at org.apache.lucene.util.TestRuleIgnoreAfterMaxFailures$1.evaluate(TestRuleIgnoreAfterMaxFailures.java:70)
[junit4:junit4]    > 	at org.apache.lucene.util.TestRuleMarkFailure$1.evaluate(TestRuleMarkFailure.java:48)
[junit4:junit4]    > 	at com.carrotsearch.randomizedtesting.rules.StatementAdapter.evaluate(StatementAdapter.java:36)
[junit4:junit4]    > 	at com.carrotsearch.randomizedtesting.ThreadLeakControl$StatementRunner.run(ThreadLeakControl.java:358)
[junit4:junit4]    > 	at com.carrotsearch.randomizedtesting.ThreadLeakControl.forkTimeoutingTask(ThreadLeakControl.java:782)
[junit4:junit4]    > 	at com.carrotsearch.randomizedtesting.ThreadLeakControl$3.evaluate(ThreadLeakControl.java:442)
[junit4:junit4]    > 	at com.carrotsearch.randomizedtesting.RandomizedRunner.runSingleTest(RandomizedRunner.java:746)
[junit4:junit4]    > 	at com.carrotsearch.randomizedtesting.RandomizedRunner$3.evaluate(RandomizedRunner.java:648)
[junit4:junit4]    > 	at com.carrotsearch.randomizedtesting.RandomizedRunner$4.evaluate(RandomizedRunner.java:682)
[junit4:junit4]    > 	at com.carrotsearch.randomizedtesting.RandomizedRunner$5.evaluate(RandomizedRunner.java:693)
[junit4:junit4]    > 	at com.carrotsearch.randomizedtesting.rules.StatementAdapter.evaluate(StatementAdapter.java:36)
[junit4:junit4]    > 	at com.carrotsearch.randomizedtesting.rules.SystemPropertiesRestoreRule$1.evaluate(SystemPropertiesRestoreRule.java:53)
[junit4:junit4]    > 	at org.apache.lucene.util.AbstractBeforeAfterRule$1.evaluate(AbstractBeforeAfterRule.java:45)
[junit4:junit4]    > 	at org.apache.lucene.util.TestRuleStoreClassName$1.evaluate(TestRuleStoreClassName.java:42)
[junit4:junit4]    > 	at com.carrotsearch.randomizedtesting.rules.SystemPropertiesInvariantRule$1.evaluate(SystemPropertiesInvariantRule.java:55)
[junit4:junit4]    > 	at com.carrotsearch.randomizedtesting.rules.NoShadowingOrOverridesOnMethodsRule$1.evaluate(NoShadowingOrOverridesOnMethodsRule.java:39)
[junit4:junit4]    > 	at com.carrotsearch.randomizedtesting.rules.NoShadowingOrOverridesOnMethodsRule$1.evaluate(NoShadowingOrOverridesOnMethodsRule.java:39)
[junit4:junit4]    > 	at com.carrotsearch.randomizedtesting.rules.StatementAdapter.evaluate(StatementAdapter.java:36)
[junit4:junit4]    > 	at org.apache.lucene.util.TestRuleAssertionsRequired$1.evaluate(TestRuleAssertionsRequired.java:43)
[junit4:junit4]    > 	at org.apache.lucene.util.TestRuleMarkFailure$1.evaluate(TestRuleMarkFailure.java:48)
[junit4:junit4]    > 	at org.apache.lucene.util.TestRuleIgnoreAfterMaxFailures$1.evaluate(TestRuleIgnoreAfterMaxFailures.java:70)
[junit4:junit4]    > 	at org.apache.lucene.util.TestRuleIgnoreTestSuites$1.evaluate(TestRuleIgnoreTestSuites.java:55)
[junit4:junit4]    > 	at com.carrotsearch.randomizedtesting.rules.StatementAdapter.evaluate(StatementAdapter.java:36)
[junit4:junit4]    > 	at com.carrotsearch.randomizedtesting.ThreadLeakControl$StatementRunner.run(ThreadLeakControl.java:358)
[junit4:junit4]    > 	at java.lang.Thread.run(Thread.java:722)
[junit4:junit4]   2> 135598 T1798 oas.SolrTestCaseJ4.deleteCore ###deleteCore
[junit4:junit4]   2> NOTE: test params are: codec=Asserting, sim=DefaultSimilarity, locale=lt, timezone=SST
[junit4:junit4]   2> NOTE: FreeBSD 9.0-RELEASE amd64/Oracle Corporation 1.7.0_06 (64-bit)/cpus=16,threads=1,free=196725656,total=472907776
[junit4:junit4]   2> NOTE: All tests run in this JVM: [LeaderElectionIntegrationTest, TestSolr4Spatial, PluginInfoTest, RequestHandlersTest, SampleTest, TestQueryTypes, DistanceFunctionTest, SimplePostToolTest, ZkCLITest, TestConfig, SpellCheckComponentTest, UpdateRequestProcessorFactoryTest, MBeansHandlerTest, SpatialFilterTest, SystemInfoHandlerTest, TestExtendedDismaxParser, SolrPluginUtilsTest, DateFieldTest, TestLMJelinekMercerSimilarityFactory, TestCoreContainer, TestSearchPerf, TestSolrJ, TestIndexingPerformance, QueryElevationComponentTest, TestCollationKeyRangeQueries, TestFastLRUCache, LoggingHandlerTest, WordBreakSolrSpellCheckerTest, TestPseudoReturnFields, CacheHeaderTest, ClusterStateTest, TestNumberUtils, SuggesterWFSTTest, TestSystemIdResolver, TestIBSimilarityFactory, SpellPossibilityIteratorTest, SolrRequestParserTest, TestDefaultSimilarityFactory, TestIndexSearcher, MoreLikeThisHandlerTest, TestStressReorder, SpellCheckCollatorTest, SolrCoreCheckLockOnStartupTest, BadComponentTest, TestStressVersions, TestCollationField, NoCacheHeaderTest, IndexBasedSpellCheckerTest, TestLMDirichletSimilarityFactory, TestPHPSerializedResponseWriter, TestFastWriter, NotRequiredUniqueKeyTest, TestLuceneMatchVersion, TestBinaryResponseWriter, FileBasedSpellCheckerTest, BasicDistributedZkTest, TestRangeQuery, TestMultiCoreConfBootstrap, SimpleFacetsTest, LukeRequestHandlerTest, TestGroupingSearch, ConvertedLegacyTest, PeerSyncTest, SortByFunctionTest, BasicFunctionalityTest, SignatureUpdateProcessorFactoryTest, CoreAdminHandlerTest, DirectSolrConnectionTest, TestWordDelimiterFilterFactory, PolyFieldTest, DistributedQueryElevationComponentTest, CurrencyFieldTest, DisMaxRequestHandlerTest, IndexSchemaTest, BinaryUpdateRequestHandlerTest, TermsComponentTest, SolrInfoMBeanTest, MinimalSchemaTest, FieldAnalysisRequestHandlerTest, PingRequestHandlerTest, JsonLoaderTest, DocumentAnalysisRequestHandlerTest, DirectUpdateHandlerOptimizeTest, IndexSchemaRuntimeFieldTest, TestSolrQueryParser, TestValueSourceCache, FastVectorHighlighterTest, DebugComponentTest, JSONWriterTest, ReturnFieldsTest, SearchHandlerTest, RequiredFieldsTest, TestOmitPositions, SuggesterFSTTest, CopyFieldTest, SolrCmdDistributorTest, UniqFieldsUpdateProcessorFactoryTest, UpdateParamsTest, SuggesterTest, CSVRequestHandlerTest, TestFoldingMultitermQuery, PrimitiveFieldTypeTest, AlternateDirectoryTest, FieldMutatingUpdateProcessorTest, TestUpdate, HighlighterConfigTest, SOLR749Test, TestPropInjectDefaults, DefaultValueUpdateProcessorTest, TestXIncludeConfig, TestLFUCache, TestQuerySenderListener, TestQuerySenderNoQuery, NumericFieldsTest, OutputWriterTest, TestJmxMonitoredMap, TestBM25SimilarityFactory, TestPerFieldSimilarity, TestPluginEnable, LegacyHTMLStripCharFilterTest, TestDFRSimilarityFactory, TestCodecSupport, DateMathParserTest, URLClassifyProcessorTest, ResourceLoaderTest, FileUtilsTest, TestSolrXMLSerializer, TestSuggestSpellingConverter, TestBadConfig, DOMUtilTest, TestLRUCache, UUIDFieldTest, RAMDirectoryFactoryTest, PreAnalyzedFieldTest, ZkNodePropsTest, CircularListTest, AnalysisAfterCoreReloadTest, TestDocumentBuilder, TestCharFilters, BasicDistributedZk2Test, SyncSliceTest]
[junit4:junit4] Completed on J0 in 135.63s, 1 test, 1 failure <<< FAILURES!

[...truncated 28 lines...]
BUILD FAILED
/usr/home/hudson/hudson-slave/workspace/Lucene-Solr-Tests-4.x-java7/build.xml:32: The following error occurred while executing this line:
/usr/home/hudson/hudson-slave/workspace/Lucene-Solr-Tests-4.x-java7/solr/build.xml:146: The following error occurred while executing this line:
/usr/home/hudson/hudson-slave/workspace/Lucene-Solr-Tests-4.x-java7/lucene/module-build.xml:63: The following error occurred while executing this line:
/usr/home/hudson/hudson-slave/workspace/Lucene-Solr-Tests-4.x-java7/lucene/common-build.xml:1133: The following error occurred while executing this line:
/usr/home/hudson/hudson-slave/workspace/Lucene-Solr-Tests-4.x-java7/lucene/common-build.xml:810: There were test failures: 230 suites, 951 tests, 2 failures, 7 ignored (2 assumptions)

Total time: 41 minutes 24 seconds
Build step 'Invoke Ant' marked build as failure
Recording test results
Email was triggered for: Failure
Sending email for trigger: Failure



Mime
View raw message