lucene-dev mailing list archives

Site index · List index
Message view « Date » · « Thread »
Top « Date » · « Thread »
From Apache Jenkins Server <jenk...@builds.apache.org>
Subject [JENKINS] Lucene-Solr-Tests-trunk-java7 - Build # 3221 - Still Failing
Date Mon, 17 Sep 2012 21:46:24 GMT
Build: https://builds.apache.org/job/Lucene-Solr-Tests-trunk-java7/3221/

2 tests failed.
REGRESSION:  org.apache.solr.cloud.BasicDistributedZk2Test.testDistribSearch

Error Message:
Shard still reported as live in zk

Stack Trace:
java.lang.AssertionError: Shard still reported as live in zk
	at __randomizedtesting.SeedInfo.seed([CC8F8D2F8E3E94B:8D2E76CA8FBC8977]:0)
	at org.junit.Assert.fail(Assert.java:93)
	at org.apache.solr.cloud.AbstractFullDistribZkTestBase.waitToSeeNotLive(AbstractFullDistribZkTestBase.java:1220)
	at org.apache.solr.cloud.BasicDistributedZk2Test.brindDownShardIndexSomeDocsAndRecover(BasicDistributedZk2Test.java:190)
	at org.apache.solr.cloud.BasicDistributedZk2Test.doTest(BasicDistributedZk2Test.java:83)
	at org.apache.solr.BaseDistributedSearchTestCase.testDistribSearch(BaseDistributedSearchTestCase.java:695)
	at sun.reflect.NativeMethodAccessorImpl.invoke0(Native Method)
	at sun.reflect.NativeMethodAccessorImpl.invoke(NativeMethodAccessorImpl.java:57)
	at sun.reflect.DelegatingMethodAccessorImpl.invoke(DelegatingMethodAccessorImpl.java:43)
	at java.lang.reflect.Method.invoke(Method.java:601)
	at com.carrotsearch.randomizedtesting.RandomizedRunner.invoke(RandomizedRunner.java:1559)
	at com.carrotsearch.randomizedtesting.RandomizedRunner.access$600(RandomizedRunner.java:79)
	at com.carrotsearch.randomizedtesting.RandomizedRunner$6.evaluate(RandomizedRunner.java:737)
	at com.carrotsearch.randomizedtesting.RandomizedRunner$7.evaluate(RandomizedRunner.java:773)
	at com.carrotsearch.randomizedtesting.RandomizedRunner$8.evaluate(RandomizedRunner.java:787)
	at com.carrotsearch.randomizedtesting.rules.SystemPropertiesRestoreRule$1.evaluate(SystemPropertiesRestoreRule.java:53)
	at org.apache.lucene.util.TestRuleSetupTeardownChained$1.evaluate(TestRuleSetupTeardownChained.java:50)
	at org.apache.lucene.util.TestRuleFieldCacheSanity$1.evaluate(TestRuleFieldCacheSanity.java:51)
	at org.apache.lucene.util.AbstractBeforeAfterRule$1.evaluate(AbstractBeforeAfterRule.java:45)
	at com.carrotsearch.randomizedtesting.rules.SystemPropertiesInvariantRule$1.evaluate(SystemPropertiesInvariantRule.java:55)
	at org.apache.lucene.util.TestRuleThreadAndTestName$1.evaluate(TestRuleThreadAndTestName.java:48)
	at org.apache.lucene.util.TestRuleIgnoreAfterMaxFailures$1.evaluate(TestRuleIgnoreAfterMaxFailures.java:70)
	at org.apache.lucene.util.TestRuleMarkFailure$1.evaluate(TestRuleMarkFailure.java:48)
	at com.carrotsearch.randomizedtesting.rules.StatementAdapter.evaluate(StatementAdapter.java:36)
	at com.carrotsearch.randomizedtesting.ThreadLeakControl$StatementRunner.run(ThreadLeakControl.java:358)
	at com.carrotsearch.randomizedtesting.ThreadLeakControl.forkTimeoutingTask(ThreadLeakControl.java:782)
	at com.carrotsearch.randomizedtesting.ThreadLeakControl$3.evaluate(ThreadLeakControl.java:442)
	at com.carrotsearch.randomizedtesting.RandomizedRunner.runSingleTest(RandomizedRunner.java:746)
	at com.carrotsearch.randomizedtesting.RandomizedRunner$3.evaluate(RandomizedRunner.java:648)
	at com.carrotsearch.randomizedtesting.RandomizedRunner$4.evaluate(RandomizedRunner.java:682)
	at com.carrotsearch.randomizedtesting.RandomizedRunner$5.evaluate(RandomizedRunner.java:693)
	at com.carrotsearch.randomizedtesting.rules.StatementAdapter.evaluate(StatementAdapter.java:36)
	at com.carrotsearch.randomizedtesting.rules.SystemPropertiesRestoreRule$1.evaluate(SystemPropertiesRestoreRule.java:53)
	at org.apache.lucene.util.AbstractBeforeAfterRule$1.evaluate(AbstractBeforeAfterRule.java:45)
	at org.apache.lucene.util.TestRuleStoreClassName$1.evaluate(TestRuleStoreClassName.java:42)
	at com.carrotsearch.randomizedtesting.rules.SystemPropertiesInvariantRule$1.evaluate(SystemPropertiesInvariantRule.java:55)
	at com.carrotsearch.randomizedtesting.rules.NoShadowingOrOverridesOnMethodsRule$1.evaluate(NoShadowingOrOverridesOnMethodsRule.java:39)
	at com.carrotsearch.randomizedtesting.rules.NoShadowingOrOverridesOnMethodsRule$1.evaluate(NoShadowingOrOverridesOnMethodsRule.java:39)
	at com.carrotsearch.randomizedtesting.rules.StatementAdapter.evaluate(StatementAdapter.java:36)
	at org.apache.lucene.util.TestRuleAssertionsRequired$1.evaluate(TestRuleAssertionsRequired.java:43)
	at org.apache.lucene.util.TestRuleMarkFailure$1.evaluate(TestRuleMarkFailure.java:48)
	at org.apache.lucene.util.TestRuleIgnoreAfterMaxFailures$1.evaluate(TestRuleIgnoreAfterMaxFailures.java:70)
	at org.apache.lucene.util.TestRuleIgnoreTestSuites$1.evaluate(TestRuleIgnoreTestSuites.java:55)
	at com.carrotsearch.randomizedtesting.rules.StatementAdapter.evaluate(StatementAdapter.java:36)
	at com.carrotsearch.randomizedtesting.ThreadLeakControl$StatementRunner.run(ThreadLeakControl.java:358)
	at java.lang.Thread.run(Thread.java:722)


REGRESSION:  org.apache.solr.cloud.SyncSliceTest.testDistribSearch

Error Message:
No live SolrServers available to handle this request

Stack Trace:
org.apache.solr.client.solrj.SolrServerException: No live SolrServers available to handle this request
	at __randomizedtesting.SeedInfo.seed([CC8F8D2F8E3E94B:8D2E76CA8FBC8977]:0)
	at org.apache.solr.client.solrj.impl.LBHttpSolrServer.request(LBHttpSolrServer.java:323)
	at org.apache.solr.client.solrj.impl.CloudSolrServer.request(CloudSolrServer.java:257)
	at org.apache.solr.client.solrj.request.QueryRequest.process(QueryRequest.java:90)
	at org.apache.solr.client.solrj.SolrServer.query(SolrServer.java:324)
	at org.apache.solr.cloud.AbstractFullDistribZkTestBase.checkShardConsistency(AbstractFullDistribZkTestBase.java:909)
	at org.apache.solr.cloud.SyncSliceTest.doTest(SyncSliceTest.java:226)
	at org.apache.solr.BaseDistributedSearchTestCase.testDistribSearch(BaseDistributedSearchTestCase.java:695)
	at sun.reflect.NativeMethodAccessorImpl.invoke0(Native Method)
	at sun.reflect.NativeMethodAccessorImpl.invoke(NativeMethodAccessorImpl.java:57)
	at sun.reflect.DelegatingMethodAccessorImpl.invoke(DelegatingMethodAccessorImpl.java:43)
	at java.lang.reflect.Method.invoke(Method.java:601)
	at com.carrotsearch.randomizedtesting.RandomizedRunner.invoke(RandomizedRunner.java:1559)
	at com.carrotsearch.randomizedtesting.RandomizedRunner.access$600(RandomizedRunner.java:79)
	at com.carrotsearch.randomizedtesting.RandomizedRunner$6.evaluate(RandomizedRunner.java:737)
	at com.carrotsearch.randomizedtesting.RandomizedRunner$7.evaluate(RandomizedRunner.java:773)
	at com.carrotsearch.randomizedtesting.RandomizedRunner$8.evaluate(RandomizedRunner.java:787)
	at com.carrotsearch.randomizedtesting.rules.SystemPropertiesRestoreRule$1.evaluate(SystemPropertiesRestoreRule.java:53)
	at org.apache.lucene.util.TestRuleSetupTeardownChained$1.evaluate(TestRuleSetupTeardownChained.java:50)
	at org.apache.lucene.util.TestRuleFieldCacheSanity$1.evaluate(TestRuleFieldCacheSanity.java:51)
	at org.apache.lucene.util.AbstractBeforeAfterRule$1.evaluate(AbstractBeforeAfterRule.java:45)
	at com.carrotsearch.randomizedtesting.rules.SystemPropertiesInvariantRule$1.evaluate(SystemPropertiesInvariantRule.java:55)
	at org.apache.lucene.util.TestRuleThreadAndTestName$1.evaluate(TestRuleThreadAndTestName.java:48)
	at org.apache.lucene.util.TestRuleIgnoreAfterMaxFailures$1.evaluate(TestRuleIgnoreAfterMaxFailures.java:70)
	at org.apache.lucene.util.TestRuleMarkFailure$1.evaluate(TestRuleMarkFailure.java:48)
	at com.carrotsearch.randomizedtesting.rules.StatementAdapter.evaluate(StatementAdapter.java:36)
	at com.carrotsearch.randomizedtesting.ThreadLeakControl$StatementRunner.run(ThreadLeakControl.java:358)
	at com.carrotsearch.randomizedtesting.ThreadLeakControl.forkTimeoutingTask(ThreadLeakControl.java:782)
	at com.carrotsearch.randomizedtesting.ThreadLeakControl$3.evaluate(ThreadLeakControl.java:442)
	at com.carrotsearch.randomizedtesting.RandomizedRunner.runSingleTest(RandomizedRunner.java:746)
	at com.carrotsearch.randomizedtesting.RandomizedRunner$3.evaluate(RandomizedRunner.java:648)
	at com.carrotsearch.randomizedtesting.RandomizedRunner$4.evaluate(RandomizedRunner.java:682)
	at com.carrotsearch.randomizedtesting.RandomizedRunner$5.evaluate(RandomizedRunner.java:693)
	at com.carrotsearch.randomizedtesting.rules.StatementAdapter.evaluate(StatementAdapter.java:36)
	at com.carrotsearch.randomizedtesting.rules.SystemPropertiesRestoreRule$1.evaluate(SystemPropertiesRestoreRule.java:53)
	at org.apache.lucene.util.AbstractBeforeAfterRule$1.evaluate(AbstractBeforeAfterRule.java:45)
	at org.apache.lucene.util.TestRuleStoreClassName$1.evaluate(TestRuleStoreClassName.java:42)
	at com.carrotsearch.randomizedtesting.rules.SystemPropertiesInvariantRule$1.evaluate(SystemPropertiesInvariantRule.java:55)
	at com.carrotsearch.randomizedtesting.rules.NoShadowingOrOverridesOnMethodsRule$1.evaluate(NoShadowingOrOverridesOnMethodsRule.java:39)
	at com.carrotsearch.randomizedtesting.rules.NoShadowingOrOverridesOnMethodsRule$1.evaluate(NoShadowingOrOverridesOnMethodsRule.java:39)
	at com.carrotsearch.randomizedtesting.rules.StatementAdapter.evaluate(StatementAdapter.java:36)
	at org.apache.lucene.util.TestRuleAssertionsRequired$1.evaluate(TestRuleAssertionsRequired.java:43)
	at org.apache.lucene.util.TestRuleMarkFailure$1.evaluate(TestRuleMarkFailure.java:48)
	at org.apache.lucene.util.TestRuleIgnoreAfterMaxFailures$1.evaluate(TestRuleIgnoreAfterMaxFailures.java:70)
	at org.apache.lucene.util.TestRuleIgnoreTestSuites$1.evaluate(TestRuleIgnoreTestSuites.java:55)
	at com.carrotsearch.randomizedtesting.rules.StatementAdapter.evaluate(StatementAdapter.java:36)
	at com.carrotsearch.randomizedtesting.ThreadLeakControl$StatementRunner.run(ThreadLeakControl.java:358)
	at java.lang.Thread.run(Thread.java:722)




Build Log:
[...truncated 7998 lines...]
[junit4:junit4] Suite: org.apache.solr.cloud.BasicDistributedZk2Test
[junit4:junit4]   2> 3 T180 oas.SolrTestCaseJ4.setUp ###Starting testDistribSearch
[junit4:junit4]   2> Creating dataDir: /usr/home/hudson/hudson-slave/workspace/Lucene-Solr-Tests-trunk-java7/solr/build/solr-core/test/J1/./solrtest-BasicDistributedZk2Test-1347917508319
[junit4:junit4]   2> 13 T180 oasc.ZkTestServer.run STARTING ZK TEST SERVER
[junit4:junit4]   2> 136 T181 oaz.Environment.logEnv Server environment:zookeeper.version=3.3.6-1366786, built on 07/29/2012 06:22 GMT
[junit4:junit4]   2> 136 T181 oaz.Environment.logEnv Server environment:host.name=lucene.zones.apache.org
[junit4:junit4]   2> 137 T181 oaz.Environment.logEnv Server environment:java.version=1.7.0_06
[junit4:junit4]   2> 137 T181 oaz.Environment.logEnv Server environment:java.vendor=Oracle Corporation
[junit4:junit4]   2> 137 T181 oaz.Environment.logEnv Server environment:java.home=/usr/local/openjdk7/jre
[junit4:junit4]   2> 137 T181 oaz.Environment.logEnv Server environment:java.class.path=/usr/home/hudson/hudson-slave/workspace/Lucene-Solr-Tests-trunk-java7/solr/build/solr-core/classes/test:/usr/home/hudson/hudson-slave/workspace/Lucene-Solr-Tests-trunk-java7/solr/build/solr-test-framework/classes/java:/usr/home/hudson/hudson-slave/workspace/Lucene-Solr-Tests-trunk-java7/solr/build/solr-core/test-files:/usr/home/hudson/hudson-slave/workspace/Lucene-Solr-Tests-trunk-java7/lucene/build/codecs/classes/java:/usr/home/hudson/hudson-slave/workspace/Lucene-Solr-Tests-trunk-java7/lucene/build/test-framework/classes/java:/usr/home/hudson/hudson-slave/workspace/Lucene-Solr-Tests-trunk-java7/solr/build/solr-solrj/classes/java:/usr/home/hudson/hudson-slave/workspace/Lucene-Solr-Tests-trunk-java7/solr/build/solr-core/classes/java:/usr/home/hudson/hudson-slave/workspace/Lucene-Solr-Tests-trunk-java7/lucene/build/analysis/common/lucene-analyzers-common-5.0-SNAPSHOT.jar:/usr/home/hudson/hudson-slave/workspace/Lucene-Solr-Tests-trunk-java7/lucene/build/analysis/kuromoji/lucene-analyzers-kuromoji-5.0-SNAPSHOT.jar:/usr/home/hudson/hudson-slave/workspace/Lucene-Solr-Tests-trunk-java7/lucene/build/analysis/phonetic/lucene-analyzers-phonetic-5.0-SNAPSHOT.jar:/usr/home/hudson/hudson-slave/workspace/Lucene-Solr-Tests-trunk-java7/lucene/build/highlighter/lucene-highlighter-5.0-SNAPSHOT.jar:/usr/home/hudson/hudson-slave/workspace/Lucene-Solr-Tests-trunk-java7/lucene/build/memory/lucene-memory-5.0-SNAPSHOT.jar:/usr/home/hudson/hudson-slave/workspace/Lucene-Solr-Tests-trunk-java7/lucene/build/misc/lucene-misc-5.0-SNAPSHOT.jar:/usr/home/hudson/hudson-slave/workspace/Lucene-Solr-Tests-trunk-java7/lucene/build/spatial/lucene-spatial-5.0-SNAPSHOT.jar:/usr/home/hudson/hudson-slave/workspace/Lucene-Solr-Tests-trunk-java7/lucene/build/suggest/lucene-suggest-5.0-SNAPSHOT.jar:/usr/home/hudson/hudson-slave/workspace/Lucene-Solr-Tests-trunk-java7/lucene/build/grouping/lucene-grouping-5.0-SNAPSHOT.jar:/usr/home/hudson/hudson-slave/workspace/Lucene-Solr-Tests-trunk-java7/lucene/build/queries/lucene-queries-5.0-SNAPSHOT.jar:/usr/home/hudson/hudson-slave/workspace/Lucene-Solr-Tests-trunk-java7/lucene/build/queryparser/lucene-queryparser-5.0-SNAPSHOT.jar:/usr/home/hudson/hudson-slave/workspace/Lucene-Solr-Tests-trunk-java7/solr/core/lib/commons-cli-1.2.jar:/usr/home/hudson/hudson-slave/workspace/Lucene-Solr-Tests-trunk-java7/solr/core/lib/commons-codec-1.7.jar:/usr/home/hudson/hudson-slave/workspace/Lucene-Solr-Tests-trunk-java7/solr/core/lib/commons-fileupload-1.2.1.jar:/usr/home/hudson/hudson-slave/workspace/Lucene-Solr-Tests-trunk-java7/solr/core/lib/commons-lang-2.6.jar:/usr/home/hudson/hudson-slave/workspace/Lucene-Solr-Tests-trunk-java7/solr/core/lib/easymock-2.2.jar:/usr/home/hudson/hudson-slave/workspace/Lucene-Solr-Tests-trunk-java7/solr/core/lib/guava-r05.jar:/usr/home/hudson/hudson-slave/workspace/Lucene-Solr-Tests-trunk-java7/solr/core/lib/javax.servlet-api-3.0.1.jar:/usr/home/hudson/hudson-slave/workspace/Lucene-Solr-Tests-trunk-java7/solr/core/lib/spatial4j-0.3.jar:/usr/home/hudson/hudson-slave/workspace/Lucene-Solr-Tests-trunk-java7/solr/solrj/lib/commons-io-2.1.jar:/usr/home/hudson/hudson-slave/workspace/Lucene-Solr-Tests-trunk-java7/solr/solrj/lib/httpclient-4.1.3.jar:/usr/home/hudson/hudson-slave/workspace/Lucene-Solr-Tests-trunk-java7/solr/solrj/lib/httpcore-4.1.4.jar:/usr/home/hudson/hudson-slave/workspace/Lucene-Solr-Tests-trunk-java7/solr/solrj/lib/httpmime-4.1.3.jar:/usr/home/hudson/hudson-slave/workspace/Lucene-Solr-Tests-trunk-java7/solr/solrj/lib/jcl-over-slf4j-1.6.4.jar:/usr/home/hudson/hudson-slave/workspace/Lucene-Solr-Tests-trunk-java7/solr/solrj/lib/log4j-over-slf4j-1.6.4.jar:/usr/home/hudson/hudson-slave/workspace/Lucene-Solr-Tests-trunk-java7/solr/solrj/lib/slf4j-api-1.6.4.jar:/usr/home/hudson/hudson-slave/workspace/Lucene-Solr-Tests-trunk-java7/solr/solrj/lib/slf4j-jdk14-1.6.4.jar:/usr/home/hudson/hudson-slave/workspace/Lucene-Solr-Tests-trunk-java7/solr/solrj/lib/wstx-asl-3.2.7.jar:/usr/home/hudson/hudson-slave/workspace/Lucene-Solr-Tests-trunk-java7/solr/solrj/lib/zookeeper-3.3.6.jar:/usr/home/hudson/hudson-slave/workspace/Lucene-Solr-Tests-trunk-java7/solr/example/lib/jetty-continuation-8.1.2.v20120308.jar:/usr/home/hudson/hudson-slave/workspace/Lucene-Solr-Tests-trunk-java7/solr/example/lib/jetty-deploy-8.1.2.v20120308.jar:/usr/home/hudson/hudson-slave/workspace/Lucene-Solr-Tests-trunk-java7/solr/example/lib/jetty-http-8.1.2.v20120308.jar:/usr/home/hudson/hudson-slave/workspace/Lucene-Solr-Tests-trunk-java7/solr/example/lib/jetty-io-8.1.2.v20120308.jar:/usr/home/hudson/hudson-slave/workspace/Lucene-Solr-Tests-trunk-java7/solr/example/lib/jetty-jmx-8.1.2.v20120308.jar:/usr/home/hudson/hudson-slave/workspace/Lucene-Solr-Tests-trunk-java7/solr/example/lib/jetty-security-8.1.2.v20120308.jar:/usr/home/hudson/hudson-slave/workspace/Lucene-Solr-Tests-trunk-java7/solr/example/lib/jetty-server-8.1.2.v20120308.jar:/usr/home/hudson/hudson-slave/workspace/Lucene-Solr-Tests-trunk-java7/solr/example/lib/jetty-servlet-8.1.2.v20120308.jar:/usr/home/hudson/hudson-slave/workspace/Lucene-Solr-Tests-trunk-java7/solr/example/lib/jetty-util-8.1.2.v20120308.jar:/usr/home/hudson/hudson-slave/workspace/Lucene-Solr-Tests-trunk-java7/solr/example/lib/jetty-webapp-8.1.2.v20120308.jar:/usr/home/hudson/hudson-slave/workspace/Lucene-Solr-Tests-trunk-java7/solr/example/lib/jetty-xml-8.1.2.v20120308.jar:/usr/home/hudson/hudson-slave/workspace/Lucene-Solr-Tests-trunk-java7/solr/example/lib/servlet-api-3.0.jar:/usr/home/hudson/hudson-slave/workspace/Lucene-Solr-Tests-trunk-java7/solr/example/example-DIH/solr/db/lib/hsqldb-1.8.0.10.jar:/usr/home/hudson/hudson-slave/workspace/Lucene-Solr-Tests-trunk-java7/lucene/build/core/classes/java:/usr/home/hudson/hudson-slave/workspace/Lucene-Solr-Tests-trunk-java7/lucene/test-framework/lib/junit-4.10.jar:/usr/home/hudson/hudson-slave/workspace/Lucene-Solr-Tests-trunk-java7/lucene/test-framework/lib/randomizedtesting-runner-2.0.0.jar:/home/hudson/hudson-slave/tools/Ant/ant-1.8.2/lib/ant-launcher.jar:/home/hudson/.ant/lib/ivy-2.2.0.jar:/home/hudson/hudson-slave/tools/Ant/ant-1.8.2/lib/ant-apache-regexp.jar:/home/hudson/hudson-slave/tools/Ant/ant-1.8.2/lib/ant-junit.jar:/home/hudson/hudson-slave/tools/Ant/ant-1.8.2/lib/ant-apache-bsf.jar:/home/hudson/hudson-slave/tools/Ant/ant-1.8.2/lib/ant-commons-net.jar:/home/hudson/hudson-slave/tools/Ant/ant-1.8.2/lib/ant-antlr.jar:/home/hudson/hudson-slave/tools/Ant/ant-1.8.2/lib/ant-apache-log4j.jar:/home/hudson/hudson-slave/tools/Ant/ant-1.8.2/lib/ant-commons-logging.jar:/home/hudson/hudson-slave/tools/Ant/ant-1.8.2/lib/ant-apache-xalan2.jar:/home/hudson/hudson-slave/tools/Ant/ant-1.8.2/lib/ant-apache-oro.jar:/home/hudson/hudson-slave/tools/Ant/ant-1.8.2/lib/ant-junit4.jar:/home/hudson/hudson-slave/tools/Ant/ant-1.8.2/lib/ant-netrexx.jar:/home/hudson/hudson-slave/tools/Ant/ant-1.8.2/lib/ant-swing.jar:/home/hudson/hudson-slave/tools/Ant/ant-1.8.2/lib/ant-javamail.jar:/home/hudson/hudson-slave/tools/Ant/ant-1.8.2/lib/ant-jsch.jar:/home/hudson/hudson-slave/tools/Ant/ant-1.8.2/lib/ant-jmf.jar:/home/hudson/hudson-slave/tools/Ant/ant-1.8.2/lib/ant.jar:/home/hudson/hudson-slave/tools/Ant/ant-1.8.2/lib/ant-apache-bcel.jar:/home/hudson/hudson-slave/tools/Ant/ant-1.8.2/lib/ant-jai.jar:/home/hudson/hudson-slave/tools/Ant/ant-1.8.2/lib/ant-testutil.jar:/home/hudson/hudson-slave/tools/Ant/ant-1.8.2/lib/ant-apache-resolver.jar:/home/hudson/hudson-slave/tools/Ant/ant-1.8.2/lib/ant-jdepend.jar:/usr/local/openjdk7/lib/tools.jar:/home/hudson/.ivy2/cache/com.carrotsearch.randomizedtesting/junit4-ant/jars/junit4-ant-2.0.0.jar
[junit4:junit4]   2> 138 T181 oaz.Environment.logEnv Server environment:java.library.path=/usr/local/openjdk7/jre/lib/amd64/server:/usr/local/openjdk7/jre/lib/amd64:/usr/local/openjdk7/jre/../lib/amd64:/usr/local/openjdk6/jre/lib/amd64/server:/usr/local/openjdk6/jre/lib/amd64:/usr/local/openjdk6/jre/../lib/amd64:/usr/java/packages/lib/amd64:/lib:/usr/lib:/usr/local/lib
[junit4:junit4]   2> 138 T181 oaz.Environment.logEnv Server environment:java.io.tmpdir=.
[junit4:junit4]   2> 138 T181 oaz.Environment.logEnv Server environment:java.compiler=<NA>
[junit4:junit4]   2> 138 T181 oaz.Environment.logEnv Server environment:os.name=FreeBSD
[junit4:junit4]   2> 138 T181 oaz.Environment.logEnv Server environment:os.arch=amd64
[junit4:junit4]   2> 139 T181 oaz.Environment.logEnv Server environment:os.version=9.0-RELEASE
[junit4:junit4]   2> 139 T181 oaz.Environment.logEnv Server environment:user.name=hudson
[junit4:junit4]   2> 139 T181 oaz.Environment.logEnv Server environment:user.home=/home/hudson
[junit4:junit4]   2> 139 T181 oaz.Environment.logEnv Server environment:user.dir=/usr/home/hudson/hudson-slave/workspace/Lucene-Solr-Tests-trunk-java7/solr/build/solr-core/test/J1
[junit4:junit4]   2> 191 T181 oazs.ZooKeeperServer.setTickTime tickTime set to 1000
[junit4:junit4]   2> 232 T181 oazs.NIOServerCnxn$Factory.<init> binding to port 0.0.0.0/0.0.0.0:0
[junit4:junit4]   2> 317 T181 oazsp.FileTxnSnapLog.save Snapshotting: 0
[junit4:junit4]   2> 324 T180 oasc.ZkTestServer.run start zk server on port:37391
[junit4:junit4]   2> 431 T180 oaz.Environment.logEnv Client environment:zookeeper.version=3.3.6-1366786, built on 07/29/2012 06:22 GMT
[junit4:junit4]   2> 432 T180 oaz.Environment.logEnv Client environment:host.name=lucene.zones.apache.org
[junit4:junit4]   2> 433 T180 oaz.Environment.logEnv Client environment:java.version=1.7.0_06
[junit4:junit4]   2> 433 T180 oaz.Environment.logEnv Client environment:java.vendor=Oracle Corporation
[junit4:junit4]   2> 433 T180 oaz.Environment.logEnv Client environment:java.home=/usr/local/openjdk7/jre
[junit4:junit4]   2> 434 T180 oaz.Environment.logEnv Client environment:java.class.path=/usr/home/hudson/hudson-slave/workspace/Lucene-Solr-Tests-trunk-java7/solr/build/solr-core/classes/test:/usr/home/hudson/hudson-slave/workspace/Lucene-Solr-Tests-trunk-java7/solr/build/solr-test-framework/classes/java:/usr/home/hudson/hudson-slave/workspace/Lucene-Solr-Tests-trunk-java7/solr/build/solr-core/test-files:/usr/home/hudson/hudson-slave/workspace/Lucene-Solr-Tests-trunk-java7/lucene/build/codecs/classes/java:/usr/home/hudson/hudson-slave/workspace/Lucene-Solr-Tests-trunk-java7/lucene/build/test-framework/classes/java:/usr/home/hudson/hudson-slave/workspace/Lucene-Solr-Tests-trunk-java7/solr/build/solr-solrj/classes/java:/usr/home/hudson/hudson-slave/workspace/Lucene-Solr-Tests-trunk-java7/solr/build/solr-core/classes/java:/usr/home/hudson/hudson-slave/workspace/Lucene-Solr-Tests-trunk-java7/lucene/build/analysis/common/lucene-analyzers-common-5.0-SNAPSHOT.jar:/usr/home/hudson/hudson-slave/workspace/Lucene-Solr-Tests-trunk-java7/lucene/build/analysis/kuromoji/lucene-analyzers-kuromoji-5.0-SNAPSHOT.jar:/usr/home/hudson/hudson-slave/workspace/Lucene-Solr-Tests-trunk-java7/lucene/build/analysis/phonetic/lucene-analyzers-phonetic-5.0-SNAPSHOT.jar:/usr/home/hudson/hudson-slave/workspace/Lucene-Solr-Tests-trunk-java7/lucene/build/highlighter/lucene-highlighter-5.0-SNAPSHOT.jar:/usr/home/hudson/hudson-slave/workspace/Lucene-Solr-Tests-trunk-java7/lucene/build/memory/lucene-memory-5.0-SNAPSHOT.jar:/usr/home/hudson/hudson-slave/workspace/Lucene-Solr-Tests-trunk-java7/lucene/build/misc/lucene-misc-5.0-SNAPSHOT.jar:/usr/home/hudson/hudson-slave/workspace/Lucene-Solr-Tests-trunk-java7/lucene/build/spatial/lucene-spatial-5.0-SNAPSHOT.jar:/usr/home/hudson/hudson-slave/workspace/Lucene-Solr-Tests-trunk-java7/lucene/build/suggest/lucene-suggest-5.0-SNAPSHOT.jar:/usr/home/hudson/hudson-slave/workspace/Lucene-Solr-Tests-trunk-java7/lucene/build/grouping/lucene-grouping-5.0-SNAPSHOT.jar:/usr/home/hudson/hudson-slave/workspace/Lucene-Solr-Tests-trunk-java7/lucene/build/queries/lucene-queries-5.0-SNAPSHOT.jar:/usr/home/hudson/hudson-slave/workspace/Lucene-Solr-Tests-trunk-java7/lucene/build/queryparser/lucene-queryparser-5.0-SNAPSHOT.jar:/usr/home/hudson/hudson-slave/workspace/Lucene-Solr-Tests-trunk-java7/solr/core/lib/commons-cli-1.2.jar:/usr/home/hudson/hudson-slave/workspace/Lucene-Solr-Tests-trunk-java7/solr/core/lib/commons-codec-1.7.jar:/usr/home/hudson/hudson-slave/workspace/Lucene-Solr-Tests-trunk-java7/solr/core/lib/commons-fileupload-1.2.1.jar:/usr/home/hudson/hudson-slave/workspace/Lucene-Solr-Tests-trunk-java7/solr/core/lib/commons-lang-2.6.jar:/usr/home/hudson/hudson-slave/workspace/Lucene-Solr-Tests-trunk-java7/solr/core/lib/easymock-2.2.jar:/usr/home/hudson/hudson-slave/workspace/Lucene-Solr-Tests-trunk-java7/solr/core/lib/guava-r05.jar:/usr/home/hudson/hudson-slave/workspace/Lucene-Solr-Tests-trunk-java7/solr/core/lib/javax.servlet-api-3.0.1.jar:/usr/home/hudson/hudson-slave/workspace/Lucene-Solr-Tests-trunk-java7/solr/core/lib/spatial4j-0.3.jar:/usr/home/hudson/hudson-slave/workspace/Lucene-Solr-Tests-trunk-java7/solr/solrj/lib/commons-io-2.1.jar:/usr/home/hudson/hudson-slave/workspace/Lucene-Solr-Tests-trunk-java7/solr/solrj/lib/httpclient-4.1.3.jar:/usr/home/hudson/hudson-slave/workspace/Lucene-Solr-Tests-trunk-java7/solr/solrj/lib/httpcore-4.1.4.jar:/usr/home/hudson/hudson-slave/workspace/Lucene-Solr-Tests-trunk-java7/solr/solrj/lib/httpmime-4.1.3.jar:/usr/home/hudson/hudson-slave/workspace/Lucene-Solr-Tests-trunk-java7/solr/solrj/lib/jcl-over-slf4j-1.6.4.jar:/usr/home/hudson/hudson-slave/workspace/Lucene-Solr-Tests-trunk-java7/solr/solrj/lib/log4j-over-slf4j-1.6.4.jar:/usr/home/hudson/hudson-slave/workspace/Lucene-Solr-Tests-trunk-java7/solr/solrj/lib/slf4j-api-1.6.4.jar:/usr/home/hudson/hudson-slave/workspace/Lucene-Solr-Tests-trunk-java7/solr/solrj/lib/slf4j-jdk14-1.6.4.jar:/usr/home/hudson/hudson-slave/workspace/Lucene-Solr-Tests-trunk-java7/solr/solrj/lib/wstx-asl-3.2.7.jar:/usr/home/hudson/hudson-slave/workspace/Lucene-Solr-Tests-trunk-java7/solr/solrj/lib/zookeeper-3.3.6.jar:/usr/home/hudson/hudson-slave/workspace/Lucene-Solr-Tests-trunk-java7/solr/example/lib/jetty-continuation-8.1.2.v20120308.jar:/usr/home/hudson/hudson-slave/workspace/Lucene-Solr-Tests-trunk-java7/solr/example/lib/jetty-deploy-8.1.2.v20120308.jar:/usr/home/hudson/hudson-slave/workspace/Lucene-Solr-Tests-trunk-java7/solr/example/lib/jetty-http-8.1.2.v20120308.jar:/usr/home/hudson/hudson-slave/workspace/Lucene-Solr-Tests-trunk-java7/solr/example/lib/jetty-io-8.1.2.v20120308.jar:/usr/home/hudson/hudson-slave/workspace/Lucene-Solr-Tests-trunk-java7/solr/example/lib/jetty-jmx-8.1.2.v20120308.jar:/usr/home/hudson/hudson-slave/workspace/Lucene-Solr-Tests-trunk-java7/solr/example/lib/jetty-security-8.1.2.v20120308.jar:/usr/home/hudson/hudson-slave/workspace/Lucene-Solr-Tests-trunk-java7/solr/example/lib/jetty-server-8.1.2.v20120308.jar:/usr/home/hudson/hudson-slave/workspace/Lucene-Solr-Tests-trunk-java7/solr/example/lib/jetty-servlet-8.1.2.v20120308.jar:/usr/home/hudson/hudson-slave/workspace/Lucene-Solr-Tests-trunk-java7/solr/example/lib/jetty-util-8.1.2.v20120308.jar:/usr/home/hudson/hudson-slave/workspace/Lucene-Solr-Tests-trunk-java7/solr/example/lib/jetty-webapp-8.1.2.v20120308.jar:/usr/home/hudson/hudson-slave/workspace/Lucene-Solr-Tests-trunk-java7/solr/example/lib/jetty-xml-8.1.2.v20120308.jar:/usr/home/hudson/hudson-slave/workspace/Lucene-Solr-Tests-trunk-java7/solr/example/lib/servlet-api-3.0.jar:/usr/home/hudson/hudson-slave/workspace/Lucene-Solr-Tests-trunk-java7/solr/example/example-DIH/solr/db/lib/hsqldb-1.8.0.10.jar:/usr/home/hudson/hudson-slave/workspace/Lucene-Solr-Tests-trunk-java7/lucene/build/core/classes/java:/usr/home/hudson/hudson-slave/workspace/Lucene-Solr-Tests-trunk-java7/lucene/test-framework/lib/junit-4.10.jar:/usr/home/hudson/hudson-slave/workspace/Lucene-Solr-Tests-trunk-java7/lucene/test-framework/lib/randomizedtesting-runner-2.0.0.jar:/home/hudson/hudson-slave/tools/Ant/ant-1.8.2/lib/ant-launcher.jar:/home/hudson/.ant/lib/ivy-2.2.0.jar:/home/hudson/hudson-slave/tools/Ant/ant-1.8.2/lib/ant-apache-regexp.jar:/home/hudson/hudson-slave/tools/Ant/ant-1.8.2/lib/ant-junit.jar:/home/hudson/hudson-slave/tools/Ant/ant-1.8.2/lib/ant-apache-bsf.jar:/home/hudson/hudson-slave/tools/Ant/ant-1.8.2/lib/ant-commons-net.jar:/home/hudson/hudson-slave/tools/Ant/ant-1.8.2/lib/ant-antlr.jar:/home/hudson/hudson-slave/tools/Ant/ant-1.8.2/lib/ant-apache-log4j.jar:/home/hudson/hudson-slave/tools/Ant/ant-1.8.2/lib/ant-commons-logging.jar:/home/hudson/hudson-slave/tools/Ant/ant-1.8.2/lib/ant-apache-xalan2.jar:/home/hudson/hudson-slave/tools/Ant/ant-1.8.2/lib/ant-apache-oro.jar:/home/hudson/hudson-slave/tools/Ant/ant-1.8.2/lib/ant-junit4.jar:/home/hudson/hudson-slave/tools/Ant/ant-1.8.2/lib/ant-netrexx.jar:/home/hudson/hudson-slave/tools/Ant/ant-1.8.2/lib/ant-swing.jar:/home/hudson/hudson-slave/tools/Ant/ant-1.8.2/lib/ant-javamail.jar:/home/hudson/hudson-slave/tools/Ant/ant-1.8.2/lib/ant-jsch.jar:/home/hudson/hudson-slave/tools/Ant/ant-1.8.2/lib/ant-jmf.jar:/home/hudson/hudson-slave/tools/Ant/ant-1.8.2/lib/ant.jar:/home/hudson/hudson-slave/tools/Ant/ant-1.8.2/lib/ant-apache-bcel.jar:/home/hudson/hudson-slave/tools/Ant/ant-1.8.2/lib/ant-jai.jar:/home/hudson/hudson-slave/tools/Ant/ant-1.8.2/lib/ant-testutil.jar:/home/hudson/hudson-slave/tools/Ant/ant-1.8.2/lib/ant-apache-resolver.jar:/home/hudson/hudson-slave/tools/Ant/ant-1.8.2/lib/ant-jdepend.jar:/usr/local/openjdk7/lib/tools.jar:/home/hudson/.ivy2/cache/com.carrotsearch.randomizedtesting/junit4-ant/jars/junit4-ant-2.0.0.jar
[junit4:junit4]   2> 435 T180 oaz.Environment.logEnv Client environment:java.library.path=/usr/local/openjdk7/jre/lib/amd64/server:/usr/local/openjdk7/jre/lib/amd64:/usr/local/openjdk7/jre/../lib/amd64:/usr/local/openjdk6/jre/lib/amd64/server:/usr/local/openjdk6/jre/lib/amd64:/usr/local/openjdk6/jre/../lib/amd64:/usr/java/packages/lib/amd64:/lib:/usr/lib:/usr/local/lib
[junit4:junit4]   2> 436 T180 oaz.Environment.logEnv Client environment:java.io.tmpdir=.
[junit4:junit4]   2> 436 T180 oaz.Environment.logEnv Client environment:java.compiler=<NA>
[junit4:junit4]   2> 437 T180 oaz.Environment.logEnv Client environment:os.name=FreeBSD
[junit4:junit4]   2> 437 T180 oaz.Environment.logEnv Client environment:os.arch=amd64
[junit4:junit4]   2> 438 T180 oaz.Environment.logEnv Client environment:os.version=9.0-RELEASE
[junit4:junit4]   2> 438 T180 oaz.Environment.logEnv Client environment:user.name=hudson
[junit4:junit4]   2> 438 T180 oaz.Environment.logEnv Client environment:user.home=/home/hudson
[junit4:junit4]   2> 439 T180 oaz.Environment.logEnv Client environment:user.dir=/usr/home/hudson/hudson-slave/workspace/Lucene-Solr-Tests-trunk-java7/solr/build/solr-core/test/J1
[junit4:junit4]   2> 445 T180 oaz.ZooKeeper.<init> Initiating client connection, connectString=127.0.0.1:37391 sessionTimeout=10000 watcher=org.apache.solr.common.cloud.ConnectionManager@3e4d9180
[junit4:junit4]   2> 495 T186 oaz.ClientCnxn$SendThread.startConnect Opening socket connection to server /127.0.0.1:37391
[junit4:junit4]   2> 495 T180 oascc.ConnectionManager.waitForConnected Waiting for client to connect to ZooKeeper
[junit4:junit4]   2> 498 T186 oaz.ClientCnxn$SendThread.primeConnection Socket connection established to localhost/127.0.0.1:37391, initiating session
[junit4:junit4]   2> 498 T182 oazs.NIOServerCnxn$Factory.run Accepted socket connection from /140.211.11.196:37394
[junit4:junit4]   2> 514 T182 oazs.NIOServerCnxn.readConnectRequest Client attempting to establish new session at /140.211.11.196:37394
[junit4:junit4]   2> 531 T184 oazsp.FileTxnLog.append Creating new log file: log.1
[junit4:junit4]   2> 561 T184 oazs.NIOServerCnxn.finishSessionInit Established session 0x139d624f0400000 with negotiated timeout 10000 for client /140.211.11.196:37394
[junit4:junit4]   2> 561 T186 oaz.ClientCnxn$SendThread.readConnectResult Session establishment complete on server localhost/127.0.0.1:37391, sessionid = 0x139d624f0400000, negotiated timeout = 10000
[junit4:junit4]   2> 569 T187 oascc.ConnectionManager.process Watcher org.apache.solr.common.cloud.ConnectionManager@3e4d9180 name:ZooKeeperConnection Watcher:127.0.0.1:37391 got event WatchedEvent state:SyncConnected type:None path:null path:null type:None
[junit4:junit4]   2> 569 T180 oascc.ConnectionManager.waitForConnected Client is connected to ZooKeeper
[junit4:junit4]   2> 573 T180 oascc.SolrZkClient.makePath makePath: /solr
[junit4:junit4]   2> 638 T185 oazs.PrepRequestProcessor.pRequest Processed session termination for sessionid: 0x139d624f0400000
[junit4:junit4]   2> 639 T187 oaz.ClientCnxn$EventThread.run EventThread shut down
[junit4:junit4]   2> 639 T180 oaz.ZooKeeper.close Session: 0x139d624f0400000 closed
[junit4:junit4]   2> 640 T180 oaz.ZooKeeper.<init> Initiating client connection, connectString=127.0.0.1:37391/solr sessionTimeout=10000 watcher=org.apache.solr.common.cloud.ConnectionManager@37530a43
[junit4:junit4]   2> 640 T182 oazs.NIOServerCnxn.closeSock Closed socket connection for client /140.211.11.196:37394 which had sessionid 0x139d624f0400000
[junit4:junit4]   2> 641 T188 oaz.ClientCnxn$SendThread.startConnect Opening socket connection to server /127.0.0.1:37391
[junit4:junit4]   2> 641 T180 oascc.ConnectionManager.waitForConnected Waiting for client to connect to ZooKeeper
[junit4:junit4]   2> 642 T188 oaz.ClientCnxn$SendThread.primeConnection Socket connection established to localhost/127.0.0.1:37391, initiating session
[junit4:junit4]   2> 642 T182 oazs.NIOServerCnxn$Factory.run Accepted socket connection from /140.211.11.196:37396
[junit4:junit4]   2> 642 T182 oazs.NIOServerCnxn.readConnectRequest Client attempting to establish new session at /140.211.11.196:37396
[junit4:junit4]   2> 644 T184 oazs.NIOServerCnxn.finishSessionInit Established session 0x139d624f0400001 with negotiated timeout 10000 for client /140.211.11.196:37396
[junit4:junit4]   2> 644 T188 oaz.ClientCnxn$SendThread.readConnectResult Session establishment complete on server localhost/127.0.0.1:37391, sessionid = 0x139d624f0400001, negotiated timeout = 10000
[junit4:junit4]   2> 644 T189 oascc.ConnectionManager.process Watcher org.apache.solr.common.cloud.ConnectionManager@37530a43 name:ZooKeeperConnection Watcher:127.0.0.1:37391/solr got event WatchedEvent state:SyncConnected type:None path:null path:null type:None
[junit4:junit4]   2> 644 T180 oascc.ConnectionManager.waitForConnected Client is connected to ZooKeeper
[junit4:junit4]   2> 653 T180 oascc.SolrZkClient.makePath makePath: /collections/collection1
[junit4:junit4]   2> 658 T180 oascc.SolrZkClient.makePath makePath: /collections/collection1/shards
[junit4:junit4]   2> 667 T180 oascc.SolrZkClient.makePath makePath: /collections/control_collection
[junit4:junit4]   2> 670 T180 oascc.SolrZkClient.makePath makePath: /collections/control_collection/shards
[junit4:junit4]   2> 679 T180 oasc.AbstractZkTestCase.putConfig put /usr/home/hudson/hudson-slave/workspace/Lucene-Solr-Tests-trunk-java7/solr/build/solr-core/test-files/solr/collection1/conf/solrconfig.xml to /configs/conf1/solrconfig.xml
[junit4:junit4]   2> 711 T180 oascc.SolrZkClient.makePath makePath: /configs/conf1/solrconfig.xml
[junit4:junit4]   2> 727 T180 oasc.AbstractZkTestCase.putConfig put /usr/home/hudson/hudson-slave/workspace/Lucene-Solr-Tests-trunk-java7/solr/build/solr-core/test-files/solr/collection1/conf/schema.xml to /configs/conf1/schema.xml
[junit4:junit4]   2> 728 T180 oascc.SolrZkClient.makePath makePath: /configs/conf1/schema.xml
[junit4:junit4]   2> 833 T180 oasc.AbstractZkTestCase.putConfig put /usr/home/hudson/hudson-slave/workspace/Lucene-Solr-Tests-trunk-java7/solr/build/solr-core/test-files/solr/collection1/conf/solrconfig.xml to /configs/conf1/solrconfig.xml
[junit4:junit4]   2> 835 T180 oascc.SolrZkClient.makePath makePath: /configs/conf1/solrconfig.xml
[junit4:junit4]   2> 854 T180 oasc.AbstractZkTestCase.putConfig put /usr/home/hudson/hudson-slave/workspace/Lucene-Solr-Tests-trunk-java7/solr/build/solr-core/test-files/solr/collection1/conf/stopwords.txt to /configs/conf1/stopwords.txt
[junit4:junit4]   2> 855 T180 oascc.SolrZkClient.makePath makePath: /configs/conf1/stopwords.txt
[junit4:junit4]   2> 859 T180 oasc.AbstractZkTestCase.putConfig put /usr/home/hudson/hudson-slave/workspace/Lucene-Solr-Tests-trunk-java7/solr/build/solr-core/test-files/solr/collection1/conf/protwords.txt to /configs/conf1/protwords.txt
[junit4:junit4]   2> 860 T180 oascc.SolrZkClient.makePath makePath: /configs/conf1/protwords.txt
[junit4:junit4]   2> 864 T180 oasc.AbstractZkTestCase.putConfig put /usr/home/hudson/hudson-slave/workspace/Lucene-Solr-Tests-trunk-java7/solr/build/solr-core/test-files/solr/collection1/conf/currency.xml to /configs/conf1/currency.xml
[junit4:junit4]   2> 865 T180 oascc.SolrZkClient.makePath makePath: /configs/conf1/currency.xml
[junit4:junit4]   2> 870 T180 oasc.AbstractZkTestCase.putConfig put /usr/home/hudson/hudson-slave/workspace/Lucene-Solr-Tests-trunk-java7/solr/build/solr-core/test-files/solr/collection1/conf/open-exchange-rates.json to /configs/conf1/open-exchange-rates.json
[junit4:junit4]   2> 870 T180 oascc.SolrZkClient.makePath makePath: /configs/conf1/open-exchange-rates.json
[junit4:junit4]   2> 875 T180 oasc.AbstractZkTestCase.putConfig put /usr/home/hudson/hudson-slave/workspace/Lucene-Solr-Tests-trunk-java7/solr/build/solr-core/test-files/solr/collection1/conf/mapping-ISOLatin1Accent.txt to /configs/conf1/mapping-ISOLatin1Accent.txt
[junit4:junit4]   2> 877 T180 oascc.SolrZkClient.makePath makePath: /configs/conf1/mapping-ISOLatin1Accent.txt
[junit4:junit4]   2> 884 T180 oasc.AbstractZkTestCase.putConfig put /usr/home/hudson/hudson-slave/workspace/Lucene-Solr-Tests-trunk-java7/solr/build/solr-core/test-files/solr/collection1/conf/old_synonyms.txt to /configs/conf1/old_synonyms.txt
[junit4:junit4]   2> 885 T180 oascc.SolrZkClient.makePath makePath: /configs/conf1/old_synonyms.txt
[junit4:junit4]   2> 889 T180 oasc.AbstractZkTestCase.putConfig put /usr/home/hudson/hudson-slave/workspace/Lucene-Solr-Tests-trunk-java7/solr/build/solr-core/test-files/solr/collection1/conf/synonyms.txt to /configs/conf1/synonyms.txt
[junit4:junit4]   2> 890 T180 oascc.SolrZkClient.makePath makePath: /configs/conf1/synonyms.txt
[junit4:junit4]   2> 894 T185 oazs.PrepRequestProcessor.pRequest Processed session termination for sessionid: 0x139d624f0400001
[junit4:junit4]   2> 895 T189 oaz.ClientCnxn$EventThread.run EventThread shut down
[junit4:junit4]   2> 896 T182 oazs.NIOServerCnxn.closeSock Closed socket connection for client /140.211.11.196:37396 which had sessionid 0x139d624f0400001
[junit4:junit4]   2> 895 T180 oaz.ZooKeeper.close Session: 0x139d624f0400001 closed
[junit4:junit4]   2> 898 T180 oejs.Server.doStart jetty-8.1.2.v20120308
[junit4:junit4]   2> 902 T180 oejs.AbstractConnector.doStart Started SocketConnector@0.0.0.0:37397
[junit4:junit4]   2> 903 T180 oasc.SolrResourceLoader.locateSolrHome JNDI not configured for solr (NoInitialContextEx)
[junit4:junit4]   2> 903 T180 oasc.SolrResourceLoader.locateSolrHome using system property solr.solr.home: /usr/home/hudson/hudson-slave/workspace/Lucene-Solr-Tests-trunk-java7/solr/build/solr-core/test-files/solr
[junit4:junit4]   2> 904 T180 oasc.SolrResourceLoader.<init> new SolrResourceLoader for deduced Solr Home: '/usr/home/hudson/hudson-slave/workspace/Lucene-Solr-Tests-trunk-java7/solr/build/solr-core/test-files/solr/'
[junit4:junit4]   2> 952 T180 oass.SolrDispatchFilter.init SolrDispatchFilter.init()
[junit4:junit4]   2> 953 T180 oasc.SolrResourceLoader.locateSolrHome JNDI not configured for solr (NoInitialContextEx)
[junit4:junit4]   2> 953 T180 oasc.SolrResourceLoader.locateSolrHome using system property solr.solr.home: /usr/home/hudson/hudson-slave/workspace/Lucene-Solr-Tests-trunk-java7/solr/build/solr-core/test-files/solr
[junit4:junit4]   2> 954 T180 oasc.CoreContainer$Initializer.initialize looking for solr.xml: /usr/home/hudson/hudson-slave/workspace/Lucene-Solr-Tests-trunk-java7/solr/build/solr-core/test-files/solr/solr.xml
[junit4:junit4]   2> 954 T180 oasc.CoreContainer.<init> New CoreContainer 7180697
[junit4:junit4]   2> 955 T180 oasc.CoreContainer.load Loading CoreContainer using Solr Home: '/usr/home/hudson/hudson-slave/workspace/Lucene-Solr-Tests-trunk-java7/solr/build/solr-core/test-files/solr/'
[junit4:junit4]   2> 956 T180 oasc.SolrResourceLoader.<init> new SolrResourceLoader for directory: '/usr/home/hudson/hudson-slave/workspace/Lucene-Solr-Tests-trunk-java7/solr/build/solr-core/test-files/solr/'
[junit4:junit4]   2> 995 T180 oasc.CoreContainer.load Registering Log Listener
[junit4:junit4]   2> 1013 T180 oasc.CoreContainer.initZooKeeper Zookeeper client=127.0.0.1:37391/solr
[junit4:junit4]   2> 1046 T180 oaz.ZooKeeper.<init> Initiating client connection, connectString=127.0.0.1:37391/solr sessionTimeout=5000 watcher=org.apache.solr.common.cloud.ConnectionManager@16c66d64
[junit4:junit4]   2> 1047 T199 oaz.ClientCnxn$SendThread.startConnect Opening socket connection to server /127.0.0.1:37391
[junit4:junit4]   2> 1047 T180 oascc.ConnectionManager.waitForConnected Waiting for client to connect to ZooKeeper
[junit4:junit4]   2> 1049 T199 oaz.ClientCnxn$SendThread.primeConnection Socket connection established to localhost/127.0.0.1:37391, initiating session
[junit4:junit4]   2> 1049 T182 oazs.NIOServerCnxn$Factory.run Accepted socket connection from /140.211.11.196:37398
[junit4:junit4]   2> 1050 T182 oazs.NIOServerCnxn.readConnectRequest Client attempting to establish new session at /140.211.11.196:37398
[junit4:junit4]   2> 1051 T184 oazs.NIOServerCnxn.finishSessionInit Established session 0x139d624f0400002 with negotiated timeout 5000 for client /140.211.11.196:37398
[junit4:junit4]   2> 1052 T199 oaz.ClientCnxn$SendThread.readConnectResult Session establishment complete on server localhost/127.0.0.1:37391, sessionid = 0x139d624f0400002, negotiated timeout = 5000
[junit4:junit4]   2> 1052 T200 oascc.ConnectionManager.process Watcher org.apache.solr.common.cloud.ConnectionManager@16c66d64 name:ZooKeeperConnection Watcher:127.0.0.1:37391/solr got event WatchedEvent state:SyncConnected type:None path:null path:null type:None
[junit4:junit4]   2> 1052 T180 oascc.ConnectionManager.waitForConnected Client is connected to ZooKeeper
[junit4:junit4]   2> 1076 T185 oazs.PrepRequestProcessor.pRequest Got user-level KeeperException when processing sessionid:0x139d624f0400002 type:create cxid:0x2 zxid:0xfffffffffffffffe txntype:unknown reqpath:n/a Error Path:/solr/overseer Error:KeeperErrorCode = NodeExists for /solr/overseer
[junit4:junit4]   2> 1089 T180 oascc.SolrZkClient.makePath makePath: /live_nodes
[junit4:junit4]   2> 1092 T180 oasc.ZkController.createEphemeralLiveNode Register node as live in ZooKeeper:/live_nodes/127.0.0.1:37397_solr
[junit4:junit4]   2> 1099 T185 oazs.PrepRequestProcessor.pRequest Got user-level KeeperException when processing sessionid:0x139d624f0400002 type:delete cxid:0x7 zxid:0xfffffffffffffffe txntype:unknown reqpath:n/a Error Path:/solr/live_nodes/127.0.0.1:37397_solr Error:KeeperErrorCode = NoNode for /solr/live_nodes/127.0.0.1:37397_solr
[junit4:junit4]   2> 1101 T180 oascc.SolrZkClient.makePath makePath: /live_nodes/127.0.0.1:37397_solr
[junit4:junit4]   2> 1105 T180 oashc.HttpShardHandlerFactory.getParameter Setting socketTimeout to: 0
[junit4:junit4]   2> 1106 T180 oashc.HttpShardHandlerFactory.getParameter Setting urlScheme to: http://
[junit4:junit4]   2> 1106 T180 oashc.HttpShardHandlerFactory.getParameter Setting connTimeout to: 0
[junit4:junit4]   2> 1107 T180 oashc.HttpShardHandlerFactory.getParameter Setting maxConnectionsPerHost to: 20
[junit4:junit4]   2> 1107 T180 oashc.HttpShardHandlerFactory.getParameter Setting corePoolSize to: 0
[junit4:junit4]   2> 1108 T180 oashc.HttpShardHandlerFactory.getParameter Setting maximumPoolSize to: 2147483647
[junit4:junit4]   2> 1108 T180 oashc.HttpShardHandlerFactory.getParameter Setting maxThreadIdleTime to: 5
[junit4:junit4]   2> 1109 T180 oashc.HttpShardHandlerFactory.getParameter Setting sizeOfQueue to: -1
[junit4:junit4]   2> 1109 T180 oashc.HttpShardHandlerFactory.getParameter Setting fairnessPolicy to: false
[junit4:junit4]   2> 1110 T180 oascsi.HttpClientUtil.createClient Creating new http client, config:maxConnectionsPerHost=20&maxConnections=10000&socketTimeout=0&connTimeout=0&retry=false
[junit4:junit4]   2> 1132 T180 oascc.SolrZkClient.makePath makePath: /overseer_elect/election
[junit4:junit4]   2> 1155 T185 oazs.PrepRequestProcessor.pRequest Got user-level KeeperException when processing sessionid:0x139d624f0400002 type:delete cxid:0x15 zxid:0xfffffffffffffffe txntype:unknown reqpath:n/a Error Path:/solr/overseer_elect/leader Error:KeeperErrorCode = NoNode for /solr/overseer_elect/leader
[junit4:junit4]   2> 1156 T180 oascc.SolrZkClient.makePath makePath: /overseer_elect/leader
[junit4:junit4]   2> 1160 T180 oasc.Overseer.start Overseer (id=88337121848328194-127.0.0.1:37397_solr-n_0000000000) starting
[junit4:junit4]   2> 1161 T185 oazs.PrepRequestProcessor.pRequest Got user-level KeeperException when processing sessionid:0x139d624f0400002 type:create cxid:0x1a zxid:0xfffffffffffffffe txntype:unknown reqpath:n/a Error Path:/solr/overseer Error:KeeperErrorCode = NodeExists for /solr/overseer
[junit4:junit4]   2> 1182 T185 oazs.PrepRequestProcessor.pRequest Got user-level KeeperException when processing sessionid:0x139d624f0400002 type:create cxid:0x1b zxid:0xfffffffffffffffe txntype:unknown reqpath:n/a Error Path:/solr/overseer Error:KeeperErrorCode = NodeExists for /solr/overseer
[junit4:junit4]   2> 1183 T185 oazs.PrepRequestProcessor.pRequest Got user-level KeeperException when processing sessionid:0x139d624f0400002 type:create cxid:0x1c zxid:0xfffffffffffffffe txntype:unknown reqpath:n/a Error Path:/solr/overseer Error:KeeperErrorCode = NodeExists for /solr/overseer
[junit4:junit4]   2> 1198 T185 oazs.PrepRequestProcessor.pRequest Got user-level KeeperException when processing sessionid:0x139d624f0400002 type:create cxid:0x1d zxid:0xfffffffffffffffe txntype:unknown reqpath:n/a Error Path:/solr/overseer Error:KeeperErrorCode = NodeExists for /solr/overseer
[junit4:junit4]   2> 1200 T202 oasc.OverseerCollectionProcessor.run Process current queue of collection creations
[junit4:junit4]   2> 1201 T180 oascc.SolrZkClient.makePath makePath: /clusterstate.json
[junit4:junit4]   2> 1203 T180 oascc.ZkStateReader.createClusterStateWatchersAndUpdate Updating cluster state from ZooKeeper... 
[junit4:junit4]   2> 1223 T201 oasc.Overseer$ClusterStateUpdater.run Starting to work on the main queue
[junit4:junit4]   2> 1230 T180 oasc.CoreContainer.create Creating SolrCore 'collection1' using instanceDir: /usr/home/hudson/hudson-slave/workspace/Lucene-Solr-Tests-trunk-java7/solr/build/solr-core/test-files/solr/collection1
[junit4:junit4]   2> 1231 T180 oasc.ZkController.createCollectionZkNode Check for collection zkNode:control_collection
[junit4:junit4]   2> 1232 T180 oasc.ZkController.createCollectionZkNode Collection zkNode exists
[junit4:junit4]   2> 1232 T180 oasc.ZkController.readConfigName Load collection config from:/collections/control_collection
[junit4:junit4]   2> 1233 T180 oasc.SolrResourceLoader.<init> new SolrResourceLoader for directory: '/usr/home/hudson/hudson-slave/workspace/Lucene-Solr-Tests-trunk-java7/solr/build/solr-core/test-files/solr/collection1/'
[junit4:junit4]   2> 1234 T180 oasc.SolrResourceLoader.replaceClassLoader Adding 'file:/usr/home/hudson/hudson-slave/workspace/Lucene-Solr-Tests-trunk-java7/solr/build/solr-core/test-files/solr/collection1/lib/README' to classloader
[junit4:junit4]   2> 1235 T180 oasc.SolrResourceLoader.replaceClassLoader Adding 'file:/usr/home/hudson/hudson-slave/workspace/Lucene-Solr-Tests-trunk-java7/solr/build/solr-core/test-files/solr/collection1/lib/classes/' to classloader
[junit4:junit4]   2> 1285 T180 oasc.SolrConfig.<init> Using Lucene MatchVersion: LUCENE_50
[junit4:junit4]   2> 1333 T180 oasc.SolrConfig.<init> Loaded SolrConfig: solrconfig.xml
[junit4:junit4]   2> 1434 T180 oass.IndexSchema.readSchema Reading Solr Schema
[junit4:junit4]   2> 1439 T180 oass.IndexSchema.readSchema Schema name=test
[junit4:junit4]   2> 1922 T180 oass.OpenExchangeRatesOrgProvider.init Initialized with rates=open-exchange-rates.json, refreshInterval=1440.
[junit4:junit4]   2> 1931 T180 oass.IndexSchema.readSchema default search field in schema is text
[junit4:junit4]   2> 1934 T180 oass.IndexSchema.readSchema unique key field: id
[junit4:junit4]   2> 1951 T180 oass.FileExchangeRateProvider.reload Reloading exchange rates from file currency.xml
[junit4:junit4]   2> 1955 T180 oass.FileExchangeRateProvider.reload Reloading exchange rates from file currency.xml
[junit4:junit4]   2> 1959 T180 oass.OpenExchangeRatesOrgProvider.reload Reloading exchange rates from open-exchange-rates.json
[junit4:junit4]   2> 1961 T180 oass.OpenExchangeRatesOrgProvider.reload Reloading exchange rates from open-exchange-rates.json
[junit4:junit4]   2> 1963 T180 oasc.SolrCore.<init> [collection1] Opening new SolrCore at /usr/home/hudson/hudson-slave/workspace/Lucene-Solr-Tests-trunk-java7/solr/build/solr-core/test-files/solr/collection1/, dataDir=./org.apache.solr.cloud.BasicDistributedZk2Test-1347917508319/control/data/
[junit4:junit4]   2> 1964 T180 oasc.JmxMonitoredMap.<init> JMX monitoring is enabled. Adding Solr mbeans to JMX Server: com.sun.jmx.mbeanserver.JmxMBeanServer@b35f26b
[junit4:junit4]   2> 1988 T180 oasc.SolrCore.getNewIndexDir WARNING New index directory detected: old=null new=./org.apache.solr.cloud.BasicDistributedZk2Test-1347917508319/control/data/index/
[junit4:junit4]   2> 1990 T180 oasc.SolrCore.initIndex WARNING [collection1] Solr index directory './org.apache.solr.cloud.BasicDistributedZk2Test-1347917508319/control/data/index' doesn't exist. Creating new index...
[junit4:junit4]   2> 1991 T180 oasc.CachingDirectoryFactory.get return new directory for /usr/home/hudson/hudson-slave/workspace/Lucene-Solr-Tests-trunk-java7/solr/build/solr-core/test/J1/./org.apache.solr.cloud.BasicDistributedZk2Test-1347917508319/control/data/index forceNew:false
[junit4:junit4]   2> 1996 T180 oasc.SolrDeletionPolicy.onCommit SolrDeletionPolicy.onCommit: commits:num=1
[junit4:junit4]   2> 		commit{dir=NRTCachingDirectory(org.apache.lucene.store.NIOFSDirectory@/usr/home/hudson/hudson-slave/workspace/Lucene-Solr-Tests-trunk-java7/solr/build/solr-core/test/J1/org.apache.solr.cloud.BasicDistributedZk2Test-1347917508319/control/data/index lockFactory=org.apache.lucene.store.NativeFSLockFactory@3392aed7; maxCacheMB=48.0 maxMergeSizeMB=4.0),segFN=segments_1,generation=1,filenames=[segments_1]
[junit4:junit4]   2> 1997 T180 oasc.SolrDeletionPolicy.updateCommits newest commit = 1
[junit4:junit4]   2> 1998 T180 oasc.SolrCore.initWriters created xml: solr.XMLResponseWriter
[junit4:junit4]   2> 1999 T180 oasup.UpdateRequestProcessorChain.init inserting DistributedUpdateProcessorFactory into updateRequestProcessorChain "dedupe"
[junit4:junit4]   2> 2000 T180 oasup.UpdateRequestProcessorChain.init inserting DistributedUpdateProcessorFactory into updateRequestProcessorChain "dedupe-allfields"
[junit4:junit4]   2> 2000 T180 oasup.UpdateRequestProcessorChain.init inserting DistributedUpdateProcessorFactory into updateRequestProcessorChain "stored_sig"
[junit4:junit4]   2> 2001 T180 oasup.UpdateRequestProcessorChain.init inserting DistributedUpdateProcessorFactory into updateRequestProcessorChain "uniq-fields"
[junit4:junit4]   2> 2001 T180 oasup.UpdateRequestProcessorChain.init inserting DistributedUpdateProcessorFactory into updateRequestProcessorChain "distrib-dup-test-chain-implicit"
[junit4:junit4]   2> 2002 T180 oasc.RequestHandlers.initHandlersFromConfig adding lazy requestHandler: solr.ReplicationHandler
[junit4:junit4]   2> 2002 T180 oasc.RequestHandlers.initHandlersFromConfig created /replication: solr.ReplicationHandler
[junit4:junit4]   2> 2003 T180 oasc.RequestHandlers.initHandlersFromConfig created standard: solr.StandardRequestHandler
[junit4:junit4]   2> 2003 T180 oasc.RequestHandlers.initHandlersFromConfig created /get: solr.RealTimeGetHandler
[junit4:junit4]   2> 2004 T180 oasc.RequestHandlers.initHandlersFromConfig created dismax: solr.SearchHandler
[junit4:junit4]   2> 2004 T180 oasc.RequestHandlers.initHandlersFromConfig created mock: org.apache.solr.core.MockQuerySenderListenerReqHandler
[junit4:junit4]   2> 2004 T180 oasc.RequestHandlers.initHandlersFromConfig created /admin/: org.apache.solr.handler.admin.AdminHandlers
[junit4:junit4]   2> 2005 T180 oasc.RequestHandlers.initHandlersFromConfig created defaults: solr.StandardRequestHandler
[junit4:junit4]   2> 2005 T180 oasc.RequestHandlers.initHandlersFromConfig adding lazy requestHandler: solr.StandardRequestHandler
[junit4:junit4]   2> 2006 T180 oasc.RequestHandlers.initHandlersFromConfig created lazy: solr.StandardRequestHandler
[junit4:junit4]   2> 2006 T180 oasc.RequestHandlers.initHandlersFromConfig created /update: solr.UpdateRequestHandler
[junit4:junit4]   2> 2007 T180 oasc.RequestHandlers.initHandlersFromConfig created /terms: org.apache.solr.handler.component.SearchHandler
[junit4:junit4]   2> 2007 T180 oasc.RequestHandlers.initHandlersFromConfig created spellCheckCompRH: org.apache.solr.handler.component.SearchHandler
[junit4:junit4]   2> 2008 T180 oasc.RequestHandlers.initHandlersFromConfig created spellCheckCompRH_Direct: org.apache.solr.handler.component.SearchHandler
[junit4:junit4]   2> 2008 T180 oasc.RequestHandlers.initHandlersFromConfig created spellCheckWithWordbreak: org.apache.solr.handler.component.SearchHandler
[junit4:junit4]   2> 2008 T180 oasc.RequestHandlers.initHandlersFromConfig created spellCheckWithWordbreak_Direct: org.apache.solr.handler.component.SearchHandler
[junit4:junit4]   2> 2009 T180 oasc.RequestHandlers.initHandlersFromConfig created spellCheckCompRH1: org.apache.solr.handler.component.SearchHandler
[junit4:junit4]   2> 2009 T180 oasc.RequestHandlers.initHandlersFromConfig created tvrh: org.apache.solr.handler.component.SearchHandler
[junit4:junit4]   2> 2010 T180 oasc.RequestHandlers.initHandlersFromConfig created /mlt: solr.MoreLikeThisHandler
[junit4:junit4]   2> 2010 T180 oasc.RequestHandlers.initHandlersFromConfig created /debug/dump: solr.DumpRequestHandler
[junit4:junit4]   2> 2013 T180 oashl.XMLLoader.init xsltCacheLifetimeSeconds=60
[junit4:junit4]   2> 2017 T180 oasc.SolrCore.initDeprecatedSupport WARNING solrconfig.xml uses deprecated <admin/gettableFiles>, Please update your config to use the ShowFileRequestHandler.
[junit4:junit4]   2> 2018 T180 oasc.SolrCore.initDeprecatedSupport WARNING adding ShowFileRequestHandler with hidden files: [SCHEMA.XML, OLD_SYNONYMS.TXT, STOPWORDS.TXT, PROTWORDS.TXT, OPEN-EXCHANGE-RATES.JSON, SYNONYMS.TXT, CURRENCY.XML, MAPPING-ISOLATIN1ACCENT.TXT]
[junit4:junit4]   2> 2021 T180 oass.SolrIndexSearcher.<init> Opening Searcher@8f5dd67 main
[junit4:junit4]   2> 2022 T180 oasu.CommitTracker.<init> Hard AutoCommit: disabled
[junit4:junit4]   2> 2023 T180 oasu.CommitTracker.<init> Soft AutoCommit: disabled
[junit4:junit4]   2> 2023 T180 oashc.SpellCheckComponent.inform Initializing spell checkers
[junit4:junit4]   2> 2030 T180 oass.DirectSolrSpellChecker.init init: {name=direct,classname=DirectSolrSpellChecker,field=lowerfilt,minQueryLength=3}
[junit4:junit4]   2> 2076 T203 oasc.SolrCore.registerSearcher [collection1] Registered new searcher Searcher@8f5dd67 main{StandardDirectoryReader(segments_1:1)}
[junit4:junit4]   2> 2080 T185 oazs.PrepRequestProcessor.pRequest Got user-level KeeperException when processing sessionid:0x139d624f0400002 type:create cxid:0x53 zxid:0xfffffffffffffffe txntype:unknown reqpath:n/a Error Path:/solr/overseer/queue Error:KeeperErrorCode = NoNode for /solr/overseer/queue
[junit4:junit4]   2> 2092 T180 oasc.CoreContainer.register registering core: collection1
[junit4:junit4]   2> 2093 T180 oasc.ZkController.register Register shard - core:collection1 address:http://127.0.0.1:37397/solr shardId:control_shard
[junit4:junit4]   2> 2103 T180 oascsi.HttpClientUtil.createClient Creating new http client, config:maxConnections=10000&maxConnectionsPerHost=20&connTimeout=30000&socketTimeout=30000&retry=false
[junit4:junit4]   2> 2116 T180 oascc.SolrZkClient.makePath makePath: /collections/control_collection/leader_elect/control_shard/election
[junit4:junit4]   2> 2137 T185 oazs.PrepRequestProcessor.pRequest Got user-level KeeperException when processing sessionid:0x139d624f0400002 type:delete cxid:0x62 zxid:0xfffffffffffffffe txntype:unknown reqpath:n/a Error Path:/solr/collections/control_collection/leaders Error:KeeperErrorCode = NoNode for /solr/collections/control_collection/leaders
[junit4:junit4]   2> 2138 T180 oasc.ShardLeaderElectionContext.runLeaderProcess Running the leader process.
[junit4:junit4]   2> 2139 T185 oazs.PrepRequestProcessor.pRequest Got user-level KeeperException when processing sessionid:0x139d624f0400002 type:create cxid:0x63 zxid:0xfffffffffffffffe txntype:unknown reqpath:n/a Error Path:/solr/overseer Error:KeeperErrorCode = NodeExists for /solr/overseer
[junit4:junit4]   2> 2230 T201 oascc.ZkStateReader.updateClusterState Updating cloud state from ZooKeeper... 
[junit4:junit4]   2> 2244 T185 oazs.PrepRequestProcessor.pRequest Got user-level KeeperException when processing sessionid:0x139d624f0400002 type:create cxid:0x6a zxid:0xfffffffffffffffe txntype:unknown reqpath:n/a Error Path:/solr/overseer/queue-work Error:KeeperErrorCode = NoNode for /solr/overseer/queue-work
[junit4:junit4]   2> 2273 T200 oascc.ZkStateReader$2.process A cluster state change has occurred - updating...
[junit4:junit4]   2> 2650 T180 oasc.ShardLeaderElectionContext.waitForReplicasToComeUp Enough replicas found to continue.
[junit4:junit4]   2> 2650 T180 oasc.ShardLeaderElectionContext.runLeaderProcess I may be the new leader - try and sync
[junit4:junit4]   2> 2651 T180 oasc.SyncStrategy.sync Sync replicas to http://127.0.0.1:37397/solr/collection1/
[junit4:junit4]   2> 2651 T180 oasc.SyncStrategy.syncReplicas Sync Success - now sync replicas to me
[junit4:junit4]   2> 2651 T180 oasc.SyncStrategy.syncToMe http://127.0.0.1:37397/solr/collection1/ has no replicas
[junit4:junit4]   2> 2652 T180 oasc.ShardLeaderElectionContext.runLeaderProcess I am the new leader: http://127.0.0.1:37397/solr/collection1/
[junit4:junit4]   2> 2652 T180 oascc.SolrZkClient.makePath makePath: /collections/control_collection/leaders/control_shard
[junit4:junit4]   2> 2658 T185 oazs.PrepRequestProcessor.pRequest Got user-level KeeperException when processing sessionid:0x139d624f0400002 type:create cxid:0x88 zxid:0xfffffffffffffffe txntype:unknown reqpath:n/a Error Path:/solr/overseer Error:KeeperErrorCode = NodeExists for /solr/overseer
[junit4:junit4]   2> 2780 T201 oascc.ZkStateReader.updateClusterState Updating cloud state from ZooKeeper... 
[junit4:junit4]   2> 2795 T200 oascc.ZkStateReader$2.process A cluster state change has occurred - updating...
[junit4:junit4]   2> 2822 T180 oasc.ZkController.register We are http://127.0.0.1:37397/solr/collection1/ and leader is http://127.0.0.1:37397/solr/collection1/
[junit4:junit4]   2> 2822 T180 oasc.ZkController.register No LogReplay needed for core=collection1 baseURL=http://127.0.0.1:37397/solr
[junit4:junit4]   2> 2823 T180 oasc.ZkController.checkRecovery I am the leader, no recovery necessary
[junit4:junit4]   2> 2825 T180 oascc.ZkStateReader.updateClusterState Updating cloud state from ZooKeeper... 
[junit4:junit4]   2> 2826 T180 oass.SolrDispatchFilter.init user.dir=/usr/home/hudson/hudson-slave/workspace/Lucene-Solr-Tests-trunk-java7/solr/build/solr-core/test/J1
[junit4:junit4]   2> 2826 T180 oass.SolrDispatchFilter.init SolrDispatchFilter.init() done
[junit4:junit4]   2> 2827 T180 oascsi.HttpClientUtil.createClient Creating new http client, config:maxConnections=128&maxConnectionsPerHost=32&followRedirects=false
[junit4:junit4]   2> 2950 T180 oejs.Server.doStart jetty-8.1.2.v20120308
[junit4:junit4]   2> 2952 T180 oejs.AbstractConnector.doStart Started SocketConnector@0.0.0.0:37408
[junit4:junit4]   2> 2953 T180 oasc.SolrResourceLoader.locateSolrHome JNDI not configured for solr (NoInitialContextEx)
[junit4:junit4]   2> 2953 T180 oasc.SolrResourceLoader.locateSolrHome using system property solr.solr.home: /usr/home/hudson/hudson-slave/workspace/Lucene-Solr-Tests-trunk-java7/solr/build/solr-core/test/J1/./solrtest-jetty1-1347917511150
[junit4:junit4]   2> 2954 T180 oasc.SolrResourceLoader.<init> new SolrResourceLoader for deduced Solr Home: '/usr/home/hudson/hudson-slave/workspace/Lucene-Solr-Tests-trunk-java7/solr/build/solr-core/test/J1/./solrtest-jetty1-1347917511150/'
[junit4:junit4]   2> 2981 T180 oass.SolrDispatchFilter.init SolrDispatchFilter.init()
[junit4:junit4]   2> 2982 T180 oasc.SolrResourceLoader.locateSolrHome JNDI not configured for solr (NoInitialContextEx)
[junit4:junit4]   2> 2982 T180 oasc.SolrResourceLoader.locateSolrHome using system property solr.solr.home: /usr/home/hudson/hudson-slave/workspace/Lucene-Solr-Tests-trunk-java7/solr/build/solr-core/test/J1/./solrtest-jetty1-1347917511150
[junit4:junit4]   2> 2982 T180 oasc.CoreContainer$Initializer.initialize looking for solr.xml: /usr/home/hudson/hudson-slave/workspace/Lucene-Solr-Tests-trunk-java7/solr/build/solr-core/test/J1/./solrtest-jetty1-1347917511150/solr.xml
[junit4:junit4]   2> 2983 T180 oasc.CoreContainer.<init> New CoreContainer 2125040330
[junit4:junit4]   2> 2983 T180 oasc.CoreContainer.load Loading CoreContainer using Solr Home: '/usr/home/hudson/hudson-slave/workspace/Lucene-Solr-Tests-trunk-java7/solr/build/solr-core/test/J1/./solrtest-jetty1-1347917511150/'
[junit4:junit4]   2> 2984 T180 oasc.SolrResourceLoader.<init> new SolrResourceLoader for directory: '/usr/home/hudson/hudson-slave/workspace/Lucene-Solr-Tests-trunk-java7/solr/build/solr-core/test/J1/./solrtest-jetty1-1347917511150/'
[junit4:junit4]   2> 3006 T180 oasc.CoreContainer.load Registering Log Listener
[junit4:junit4]   2> 3017 T180 oasc.CoreContainer.initZooKeeper Zookeeper client=127.0.0.1:37391/solr
[junit4:junit4]   2> 3017 T180 oaz.ZooKeeper.<init> Initiating client connection, connectString=127.0.0.1:37391/solr sessionTimeout=5000 watcher=org.apache.solr.common.cloud.ConnectionManager@52b0b4e7
[junit4:junit4]   2> 3018 T213 oaz.ClientCnxn$SendThread.startConnect Opening socket connection to server /127.0.0.1:37391
[junit4:junit4]   2> 3018 T180 oascc.ConnectionManager.waitForConnected Waiting for client to connect to ZooKeeper
[junit4:junit4]   2> 3020 T182 oazs.NIOServerCnxn$Factory.run Accepted socket connection from /140.211.11.196:37409
[junit4:junit4]   2> 3020 T213 oaz.ClientCnxn$SendThread.primeConnection Socket connection established to localhost/127.0.0.1:37391, initiating session
[junit4:junit4]   2> 3021 T182 oazs.NIOServerCnxn.readConnectRequest Client attempting to establish new session at /140.211.11.196:37409
[junit4:junit4]   2> 3031 T184 oazs.NIOServerCnxn.finishSessionInit Established session 0x139d624f0400003 with negotiated timeout 5000 for client /140.211.11.196:37409
[junit4:junit4]   2> 3031 T213 oaz.ClientCnxn$SendThread.readConnectResult Session establishment complete on server localhost/127.0.0.1:37391, sessionid = 0x139d624f0400003, negotiated timeout = 5000
[junit4:junit4]   2> 3032 T214 oascc.ConnectionManager.process Watcher org.apache.solr.common.cloud.ConnectionManager@52b0b4e7 name:ZooKeeperConnection Watcher:127.0.0.1:37391/solr got event WatchedEvent state:SyncConnected type:None path:null path:null type:None
[junit4:junit4]   2> 3032 T180 oascc.ConnectionManager.waitForConnected Client is connected to ZooKeeper
[junit4:junit4]   2> 3033 T185 oazs.PrepRequestProcessor.pRequest Got user-level KeeperException when processing sessionid:0x139d624f0400003 type:create cxid:0x1 zxid:0xfffffffffffffffe txntype:unknown reqpath:n/a Error Path:/solr/overseer Error:KeeperErrorCode = NodeExists for /solr/overseer
[junit4:junit4]   2> 3035 T185 oazs.PrepRequestProcessor.pRequest Got user-level KeeperException when processing sessionid:0x139d624f0400003 type:create cxid:0x2 zxid:0xfffffffffffffffe txntype:unknown reqpath:n/a Error Path:/solr/overseer Error:KeeperErrorCode = NodeExists for /solr/overseer
[junit4:junit4]   2> 3036 T180 oasc.ZkController.createEphemeralLiveNode Register node as live in ZooKeeper:/live_nodes/127.0.0.1:37408_solr
[junit4:junit4]   2> 3037 T185 oazs.PrepRequestProcessor.pRequest Got user-level KeeperException when processing sessionid:0x139d624f0400003 type:delete cxid:0x4 zxid:0xfffffffffffffffe txntype:unknown reqpath:n/a Error Path:/solr/live_nodes/127.0.0.1:37408_solr Error:KeeperErrorCode = NoNode for /solr/live_nodes/127.0.0.1:37408_solr
[junit4:junit4]   2> 3038 T180 oascc.SolrZkClient.makePath makePath: /live_nodes/127.0.0.1:37408_solr
[junit4:junit4]   2> 3041 T200 oascc.ZkStateReader$3.process Updating live nodes
[junit4:junit4]   2> 3042 T180 oashc.HttpShardHandlerFactory.getParameter Setting socketTimeout to: 0
[junit4:junit4]   2> 3043 T180 oashc.HttpShardHandlerFactory.getParameter Setting urlScheme to: http://
[junit4:junit4]   2> 3043 T180 oashc.HttpShardHandlerFactory.getParameter Setting connTimeout to: 0
[junit4:junit4]   2> 3044 T180 oashc.HttpShardHandlerFactory.getParameter Setting maxConnectionsPerHost to: 20
[junit4:junit4]   2> 3044 T180 oashc.HttpShardHandlerFactory.getParameter Setting corePoolSize to: 0
[junit4:junit4]   2> 3045 T180 oashc.HttpShardHandlerFactory.getParameter Setting maximumPoolSize to: 2147483647
[junit4:junit4]   2> 3045 T180 oashc.HttpShardHandlerFactory.getParameter Setting maxThreadIdleTime to: 5
[junit4:junit4]   2> 3046 T180 oashc.HttpShardHandlerFactory.getParameter Setting sizeOfQueue to: -1
[junit4:junit4]   2> 3046 T180 oashc.HttpShardHandlerFactory.getParameter Setting fairnessPolicy to: false
[junit4:junit4]   2> 3047 T180 oascsi.HttpClientUtil.createClient Creating new http client, config:maxConnectionsPerHost=20&maxConnections=10000&socketTimeout=0&connTimeout=0&retry=false
[junit4:junit4]   2> 3071 T180 oascc.ZkStateReader.createClusterStateWatchersAndUpdate Updating cluster state from ZooKeeper... 
[junit4:junit4]   2> 3078 T180 oasc.CoreContainer.create Creating SolrCore 'collection1' using instanceDir: /usr/home/hudson/hudson-slave/workspace/Lucene-Solr-Tests-trunk-java7/solr/build/solr-core/test/J1/./solrtest-jetty1-1347917511150/collection1
[junit4:junit4]   2> 3079 T180 oasc.ZkController.createCollectionZkNode Check for collection zkNode:collection1
[junit4:junit4]   2> 3080 T180 oasc.ZkController.createCollectionZkNode Collection zkNode exists
[junit4:junit4]   2> 3080 T180 oasc.ZkController.readConfigName Load collection config from:/collections/collection1
[junit4:junit4]   2> 3082 T180 oasc.SolrResourceLoader.<init> new SolrResourceLoader for directory: '/usr/home/hudson/hudson-slave/workspace/Lucene-Solr-Tests-trunk-java7/solr/build/solr-core/test/J1/./solrtest-jetty1-1347917511150/collection1/'
[junit4:junit4]   2> 3084 T180 oasc.SolrResourceLoader.replaceClassLoader Adding 'file:/usr/home/hudson/hudson-slave/workspace/Lucene-Solr-Tests-trunk-java7/solr/build/solr-core/test/J1/solrtest-jetty1-1347917511150/collection1/lib/classes/' to classloader
[junit4:junit4]   2> 3085 T180 oasc.SolrResourceLoader.replaceClassLoader Adding 'file:/usr/home/hudson/hudson-slave/workspace/Lucene-Solr-Tests-trunk-java7/solr/build/solr-core/test/J1/solrtest-jetty1-1347917511150/collection1/lib/README' to classloader
[junit4:junit4]   2> 3136 T180 oasc.SolrConfig.<init> Using Lucene MatchVersion: LUCENE_50
[junit4:junit4]   2> 3207 T180 oasc.SolrConfig.<init> Loaded SolrConfig: solrconfig.xml
[junit4:junit4]   2> 3304 T201 oascc.ZkStateReader.updateClusterState Updating cloud state from ZooKeeper... 
[junit4:junit4]   2> 3309 T180 oass.IndexSchema.readSchema Reading Solr Schema
[junit4:junit4]   2> 3317 T180 oass.IndexSchema.readSchema Schema name=test
[junit4:junit4]   2> 3322 T200 oascc.ZkStateReader$2.process A cluster state change has occurred - updating...
[junit4:junit4]   2> 3322 T214 oascc.ZkStateReader$2.process A cluster state change has occurred - updating...
[junit4:junit4]   2> 3929 T180 oass.OpenExchangeRatesOrgProvider.init Initialized with rates=open-exchange-rates.json, refreshInterval=1440.
[junit4:junit4]   2> 3942 T180 oass.IndexSchema.readSchema default search field in schema is text
[junit4:junit4]   2> 3946 T180 oass.IndexSchema.readSchema unique key field: id
[junit4:junit4]   2> 3970 T180 oass.FileExchangeRateProvider.reload Reloading exchange rates from file currency.xml
[junit4:junit4]   2> 3976 T180 oass.FileExchangeRateProvider.reload Reloading exchange rates from file currency.xml
[junit4:junit4]   2> 3983 T180 oass.OpenExchangeRatesOrgProvider.reload Reloading exchange rates from open-exchange-rates.json
[junit4:junit4]   2> 3986 T180 oass.OpenExchangeRatesOrgProvider.reload Reloading exchange rates from open-exchange-rates.json
[junit4:junit4]   2> 3989 T180 oasc.SolrCore.<init> [collection1] Opening new SolrCore at /usr/home/hudson/hudson-slave/workspace/Lucene-Solr-Tests-trunk-java7/solr/build/solr-core/test/J1/./solrtest-jetty1-1347917511150/collection1/, dataDir=./org.apache.solr.cloud.BasicDistributedZk2Test-1347917508319/jetty1/
[junit4:junit4]   2> 3989 T180 oasc.JmxMonitoredMap.<init> JMX monitoring is enabled. Adding Solr mbeans to JMX Server: com.sun.jmx.mbeanserver.JmxMBeanServer@b35f26b
[junit4:junit4]   2> 3991 T180 oasc.SolrCore.getNewIndexDir WARNING New index directory detected: old=null new=./org.apache.solr.cloud.BasicDistributedZk2Test-1347917508319/jetty1/index/
[junit4:junit4]   2> 3992 T180 oasc.SolrCore.initIndex WARNING [collection1] Solr index directory './org.apache.solr.cloud.BasicDistributedZk2Test-1347917508319/jetty1/index' doesn't exist. Creating new index...
[junit4:junit4]   2> 3993 T180 oasc.CachingDirectoryFactory.get return new directory for /usr/home/hudson/hudson-slave/workspace/Lucene-Solr-Tests-trunk-java7/solr/build/solr-core/test/J1/./org.apache.solr.cloud.BasicDistributedZk2Test-1347917508319/jetty1/index forceNew:false
[junit4:junit4]   2> 4000 T180 oasc.SolrDeletionPolicy.onCommit SolrDeletionPolicy.onCommit: commits:num=1
[junit4:junit4]   2> 		commit{dir=NRTCachingDirectory(org.apache.lucene.store.NIOFSDirectory@/usr/home/hudson/hudson-slave/workspace/Lucene-Solr-Tests-trunk-java7/solr/build/solr-core/test/J1/org.apache.solr.cloud.BasicDistributedZk2Test-1347917508319/jetty1/index lockFactory=org.apache.lucene.store.NativeFSLockFactory@6fd45b15; maxCacheMB=48.0 maxMergeSizeMB=4.0),segFN=segments_1,generation=1,filenames=[segments_1]
[junit4:junit4]   2> 4001 T180 oasc.SolrDeletionPolicy.updateCommits newest commit = 1
[junit4:junit4]   2> 4002 T180 oasc.SolrCore.initWriters created xml: solr.XMLResponseWriter
[junit4:junit4]   2> 4005 T180 oasup.UpdateRequestProcessorChain.init inserting DistributedUpdateProcessorFactory into updateRequestProcessorChain "dedupe"
[junit4:junit4]   2> 4006 T180 oasup.UpdateRequestProcessorChain.init inserting DistributedUpdateProcessorFactory into updateRequestProcessorChain "dedupe-allfields"
[junit4:junit4]   2> 4006 T180 oasup.UpdateRequestProcessorChain.init inserting DistributedUpdateProcessorFactory into updateRequestProcessorChain "stored_sig"
[junit4:junit4]   2> 4007 T180 oasup.UpdateRequestProcessorChain.init inserting DistributedUpdateProcessorFactory into updateRequestProcessorChain "uniq-fields"
[junit4:junit4]   2> 4008 T180 oasup.UpdateRequestProcessorChain.init inserting DistributedUpdateProcessorFactory into updateRequestProcessorChain "distrib-dup-test-chain-implicit"
[junit4:junit4]   2> 4008 T180 oasc.RequestHandlers.initHandlersFromConfig adding lazy requestHandler: solr.ReplicationHandler
[junit4:junit4]   2> 4009 T180 oasc.RequestHandlers.initHandlersFromConfig created /replication: solr.ReplicationHandler
[junit4:junit4]   2> 4010 T180 oasc.RequestHandlers.initHandlersFromConfig created standard: solr.StandardRequestHandler
[junit4:junit4]   2> 4011 T180 oasc.RequestHandlers.initHandlersFromConfig created /get: solr.RealTimeGetHandler
[junit4:junit4]   2> 4011 T180 oasc.RequestHandlers.initHandlersFromConfig created dismax: solr.SearchHandler
[junit4:junit4]   2> 4012 T180 oasc.RequestHandlers.initHandlersFromConfig created mock: org.apache.solr.core.MockQuerySenderListenerReqHandler
[junit4:junit4]   2> 4013 T180 oasc.RequestHandlers.initHandlersFromConfig created /admin/: org.apache.solr.handler.admin.AdminHandlers
[junit4:junit4]   2> 4014 T180 oasc.RequestHandlers.initHandlersFromConfig created defaults: solr.StandardRequestHandler
[junit4:junit4]   2> 4014 T180 oasc.RequestHandlers.initHandlersFromConfig adding lazy requestHandler: solr.StandardRequestHandler
[junit4:junit4]   2> 4015 T180 oasc.RequestHandlers.initHandlersFromConfig created lazy: solr.StandardRequestHandler
[junit4:junit4]   2> 4016 T180 oasc.RequestHandlers.initHandlersFromConfig created /update: solr.UpdateRequestHandler
[junit4:junit4]   2> 4016 T180 oasc.RequestHandlers.initHandlersFromConfig created /terms: org.apache.solr.handler.component.SearchHandler
[junit4:junit4]   2> 4017 T180 oasc.RequestHandlers.initHandlersFromConfig created spellCheckCompRH: org.apache.solr.handler.component.SearchHandler
[junit4:junit4]   2> 4018 T180 oasc.RequestHandlers.initHandlersFromConfig created spellCheckCompRH_Direct: org.apache.solr.handler.component.SearchHandler
[junit4:junit4]   2> 4019 T180 oasc.RequestHandlers.initHandlersFromConfig created spellCheckWithWordbreak: org.apache.solr.handler.component.SearchHandler
[junit4:junit4]   2> 4020 T180 oasc.RequestHandlers.initHandlersFromConfig created spellCheckWithWordbreak_Direct: org.apache.solr.handler.component.SearchHandler
[junit4:junit4]   2> 4020 T180 oasc.RequestHandlers.initHandlersFromConfig created spellCheckCompRH1: org.apache.solr.handler.component.SearchHandler
[junit4:junit4]   2> 4021 T180 oasc.RequestHandlers.initHandlersFromConfig created tvrh: org.apache.solr.handler.component.SearchHandler
[junit4:junit4]   2> 4022 T180 oasc.RequestHandlers.initHandlersFromConfig created /mlt: solr.MoreLikeThisHandler
[junit4:junit4]   2> 4023 T180 oasc.RequestHandlers.initHandlersFromConfig created /debug/dump: solr.DumpRequestHandler
[junit4:junit4]   2> 4027 T180 oashl.XMLLoader.init xsltCacheLifetimeSeconds=60
[junit4:junit4]   2> 4032 T180 oasc.SolrCore.initDeprecatedSupport WARNING solrconfig.xml uses deprecated <admin/gettableFiles>, Please update your config to use the ShowFileRequestHandler.
[junit4:junit4]   2> 4033 T180 oasc.SolrCore.initDeprecatedSupport WARNING adding ShowFileRequestHandler with hidden files: [SCHEMA.XML, OLD_SYNONYMS.TXT, STOPWORDS.TXT, PROTWORDS.TXT, OPEN-EXCHANGE-RATES.JSON, SYNONYMS.TXT, CURRENCY.XML, MAPPING-ISOLATIN1ACCENT.TXT]
[junit4:junit4]   2> 4038 T180 oass.SolrIndexSearcher.<init> Opening Searcher@6bcca3da main
[junit4:junit4]   2> 4039 T180 oasu.CommitTracker.<init> Hard AutoCommit: disabled
[junit4:junit4]   2> 4040 T180 oasu.CommitTracker.<init> Soft AutoCommit: disabled
[junit4:junit4]   2> 4040 T180 oashc.SpellCheckComponent.inform Initializing spell checkers
[junit4:junit4]   2> 4049 T180 oass.DirectSolrSpellChecker.init init: {name=direct,classname=DirectSolrSpellChecker,field=lowerfilt,minQueryLength=3}
[junit4:junit4]   2> 4100 T215 oasc.SolrCore.registerSearcher [collection1] Registered new searcher Searcher@6bcca3da main{StandardDirectoryReader(segments_1:1)}
[junit4:junit4]   2> 4343 T201 oascc.ZkStateReader.updateClusterState Updating cloud state from ZooKeeper... 
[junit4:junit4]   2> 4361 T200 oascc.ZkStateReader$2.process A cluster state change has occurred - updating...
[junit4:junit4]   2> 4361 T214 oascc.ZkStateReader$2.process A cluster state change has occurred - updating...
[junit4:junit4]   2> 4613 T180 oasc.CoreContainer.register registering core: collection1
[junit4:junit4]   2> 4614 T180 oasc.ZkController.register Register shard - core:collection1 address:http://127.0.0.1:37408/solr shardId:shard1
[junit4:junit4]   2> 4616 T180 oascc.SolrZkClient.makePath makePath: /collections/collection1/leader_elect/shard1/election
[junit4:junit4]   2> 4635 T185 oazs.PrepRequestProcessor.pRequest Got user-level KeeperException when processing sessionid:0x139d624f0400003 type:delete cxid:0x43 zxid:0xfffffffffffffffe txntype:unknown reqpath:n/a Error Path:/solr/collections/collection1/leaders Error:KeeperErrorCode = NoNode for /solr/collections/collection1/leaders
[junit4:junit4]   2> 4636 T180 oasc.ShardLeaderElectionContext.runLeaderProcess Running the leader process.
[junit4:junit4]   2> 4637 T185 oazs.PrepRequestProcessor.pRequest Got user-level KeeperException when processing sessionid:0x139d624f0400003 type:create cxid:0x44 zxid:0xfffffffffffffffe txntype:unknown reqpath:n/a Error Path:/solr/overseer Error:KeeperErrorCode = NodeExists for /solr/overseer
[junit4:junit4]   2> 4646 T180 oasc.ShardLeaderElectionContext.waitForReplicasToComeUp Enough replicas found to continue.
[junit4:junit4]   2> 4647 T180 oasc.ShardLeaderElectionContext.runLeaderProcess I may be the new leader - try and sync
[junit4:junit4]   2> 4647 T180 oasc.SyncStrategy.sync Sync replicas to http://127.0.0.1:37408/solr/collection1/
[junit4:junit4]   2> 4648 T180 oasc.SyncStrategy.syncReplicas Sync Success - now sync replicas to me
[junit4:junit4]   2> 4648 T180 oasc.SyncStrategy.syncToMe http://127.0.0.1:37408/solr/collection1/ has no replicas
[junit4:junit4]   2> 4649 T180 oasc.ShardLeaderElectionContext.runLeaderProcess I am the new leader: http://127.0.0.1:37408/solr/collection1/
[junit4:junit4]   2> 4649 T180 oascc.SolrZkClient.makePath makePath: /collections/collection1/leaders/shard1
[junit4:junit4]   2> 4656 T185 oazs.PrepRequestProcessor.pRequest Got user-level KeeperException when processing sessionid:0x139d624f0400003 type:create cxid:0x4e zxid:0xfffffffffffffffe txntype:unknown reqpath:n/a Error Path:/solr/overseer Error:KeeperErrorCode = NodeExists for /solr/overseer
[junit4:junit4]   2> 4916 T201 oascc.ZkStateReader.updateClusterState Updating cloud state from ZooKeeper... 
[junit4:junit4]   2> 4935 T200 oascc.ZkStateReader$2.process A cluster state change has occurred - updating...
[junit4:junit4]   2> 4935 T214 oascc.ZkStateReader$2.process A cluster state change has occurred - updating...
[junit4:junit4]   2> 4971 T180 oasc.ZkController.register We are http://127.0.0.1:37408/solr/collection1/ and leader is http://127.0.0.1:37408/solr/collection1/
[junit4:junit4]   2> 4971 T180 oasc.ZkController.register No LogReplay needed for core=collection1 baseURL=http://127.0.0.1:37408/solr
[junit4:junit4]   2> 4972 T180 oasc.ZkController.checkRecovery I am the leader, no recovery necessary
[junit4:junit4]   2> 4974 T180 oascc.ZkStateReader.updateClusterState Updating cloud state from ZooKeeper... 
[junit4:junit4]   2> 4975 T180 oass.SolrDispatchFilter.init user.dir=/usr/home/hudson/hudson-slave/workspace/Lucene-Solr-Tests-trunk-java7/solr/build/solr-core/test/J1
[junit4:junit4]   2> 4976 T180 oass.SolrDispatchFilter.init SolrDispatchFilter.init() done
[junit4:junit4]   2> 4977 T180 oascsi.HttpClientUtil.createClient Creating new http client, config:maxConnections=128&maxConnectionsPerHost=32&followRedirects=false
[junit4:junit4]   2> 5169 T180 oejs.Server.doStart jetty-8.1.2.v20120308
[junit4:junit4]   2> 5172 T180 oejs.AbstractConnector.doStart Started SocketConnector@0.0.0.0:37420
[junit4:junit4]   2> 5173 T180 oasc.SolrResourceLoader.locateSolrHome JNDI not configured for solr (NoInitialContextEx)
[junit4:junit4]   2> 5173 T180 oasc.SolrResourceLoader.locateSolrHome using system property solr.solr.home: /usr/home/hudson/hudson-slave/workspace/Lucene-Solr-Tests-trunk-java7/solr/build/solr-core/test/J1/./solrtest-jetty2-1347917513308
[junit4:junit4]   2> 5174 T180 oasc.SolrResourceLoader.<init> new SolrResourceLoader for deduced Solr Home: '/usr/home/hudson/hudson-slave/workspace/Lucene-Solr-Tests-trunk-java7/solr/build/solr-core/test/J1/./solrtest-jetty2-1347917513308/'
[junit4:junit4]   2> 5221 T180 oass.SolrDispatchFilter.init SolrDispatchFilter.init()
[junit4:junit4]   2> 5222 T180 oasc.SolrResourceLoader.locateSolrHome JNDI not configured for solr (NoInitialContextEx)
[junit4:junit4]   2> 5222 T180 oasc.SolrResourceLoader.locateSolrHome using system property solr.solr.home: /usr/home/hudson/hudson-slave/workspace/Lucene-Solr-Tests-trunk-java7/solr/build/solr-core/test/J1/./solrtest-jetty2-1347917513308
[junit4:junit4]   2> 5223 T180 oasc.CoreContainer$Initializer.initialize looking for solr.xml: /usr/home/hudson/hudson-slave/workspace/Lucene-Solr-Tests-trunk-java7/solr/build/solr-core/test/J1/./solrtest-jetty2-1347917513308/solr.xml
[junit4:junit4]   2> 5223 T180 oasc.CoreContainer.<init> New CoreContainer 781124710
[junit4:junit4]   2> 5224 T180 oasc.CoreContainer.load Loading CoreContainer using Solr Home: '/usr/home/hudson/hudson-slave/workspace/Lucene-Solr-Tests-trunk-java7/solr/build/solr-core/test/J1/./solrtest-jetty2-1347917513308/'
[junit4:junit4]   2> 5224 T180 oasc.SolrResourceLoader.<init> new SolrResourceLoader for directory: '/usr/home/hudson/hudson-slave/workspace/Lucene-Solr-Tests-trunk-java7/solr/build/solr-core/test/J1/./solrtest-jetty2-1347917513308/'
[junit4:junit4]   2> 5271 T180 oasc.CoreContainer.load Registering Log Listener
[junit4:junit4]   2> 5287 T180 oasc.CoreContainer.initZooKeeper Zookeeper client=127.0.0.1:37391/solr
[junit4:junit4]   2> 5288 T180 oaz.ZooKeeper.<init> Initiating client connection, connectString=127.0.0.1:37391/solr sessionTimeout=5000 watcher=org.apache.solr.common.cloud.ConnectionManager@1f277ec9
[junit4:junit4]   2> 5289 T225 oaz.ClientCnxn$SendThread.startConnect Opening socket connection to server /127.0.0.1:37391
[junit4:junit4]   2> 5289 T180 oascc.ConnectionManager.waitForConnected Waiting for client to connect to ZooKeeper
[junit4:junit4]   2> 5290 T225 oaz.ClientCnxn$SendThread.primeConnection Socket connection established to localhost/127.0.0.1:37391, initiating session
[junit4:junit4]   2> 5290 T182 oazs.NIOServerCnxn$Factory.run Accepted socket connection from /140.211.11.196:37421
[junit4:junit4]   2> 5290 T182 oazs.NIOServerCnxn.readConnectRequest Client attempting to establish new session at /140.211.11.196:37421
[junit4:junit4]   2> 5293 T184 oazs.NIOServerCnxn.finishSessionInit Established session 0x139d624f0400004 with negotiated timeout 5000 for client /140.211.11.196:37421
[junit4:junit4]   2> 5293 T225 oaz.ClientCnxn$SendThread.readConnectResult Session establishment complete on server localhost/127.0.0.1:37391, sessionid = 0x139d624f0400004, negotiated timeout = 5000
[junit4:junit4]   2> 5293 T226 oascc.ConnectionManager.process Watcher org.apache.solr.common.cloud.ConnectionManager@1f277ec9 name:ZooKeeperConnection Watcher:127.0.0.1:37391/solr got event WatchedEvent state:SyncConnected type:None path:null path:null type:None
[junit4:junit4]   2> 5293 T180 oascc.ConnectionManager.waitForConnected Client is connected to ZooKeeper
[junit4:junit4]   2> 5294 T185 oazs.PrepRequestProcessor.pRequest Got user-level KeeperException when processing sessionid:0x139d624f0400004 type:create cxid:0x1 zxid:0xfffffffffffffffe txntype:unknown reqpath:n/a Error Path:/solr/overseer Error:KeeperErrorCode = NodeExists for /solr/overseer
[junit4:junit4]   2> 5308 T185 oazs.PrepRequestProcessor.pRequest Got user-level KeeperException when processing sessionid:0x139d624f0400004 type:create cxid:0x2 zxid:0xfffffffffffffffe txntype:unknown reqpath:n/a Error Path:/solr/overseer Error:KeeperErrorCode = NodeExists for /solr/overseer
[junit4:junit4]   2> 5310 T180 oasc.ZkController.createEphemeralLiveNode Register node as live in ZooKeeper:/live_nodes/127.0.0.1:37420_solr
[junit4:junit4]   2> 5311 T185 oazs.PrepRequestProcessor.pRequest Got user-level KeeperException when processing sessionid:0x139d624f0400004 type:delete cxid:0x4 zxid:0xfffffffffffffffe txntype:unknown reqpath:n/a Error Path:/solr/live_nodes/127.0.0.1:37420_solr Error:KeeperErrorCode = NoNode for /solr/live_nodes/127.0.0.1:37420_solr
[junit4:junit4]   2> 5312 T180 oascc.SolrZkClient.makePath makePath: /live_nodes/127.0.0.1:37420_solr
[junit4:junit4]   2> 5320 T200 oascc.ZkStateReader$3.process Updating live nodes
[junit4:junit4]   2> 5320 T214 oascc.ZkStateReader$3.process Updating live nodes
[junit4:junit4]   2> 5321 T180 oashc.HttpShardHandlerFactory.getParameter Setting socketTimeout to: 0
[junit4:junit4]   2> 5322 T180 oashc.HttpShardHandlerFactory.getParameter Setting urlScheme to: http://
[junit4:junit4]   2> 5322 T180 oashc.HttpShardHandlerFactory.getParameter Setting connTimeout to: 0
[junit4:junit4]   2> 5323 T180 oashc.HttpShardHandlerFactory.getParameter Setting maxConnectionsPerHost to: 20
[junit4:junit4]   2> 5323 T180 oashc.HttpShardHandlerFactory.getParameter Setting corePoolSize to: 0
[junit4:junit4]   2> 5324 T180 oashc.HttpShardHandlerFactory.getParameter Setting maximumPoolSize to: 2147483647
[junit4:junit4]   2> 5324 T180 oashc.HttpShardHandlerFactory.getParameter Setting maxThreadIdleTime to: 5
[junit4:junit4]   2> 5325 T180 oashc.HttpShardHandlerFactory.getParameter Setting sizeOfQueue to: -1
[junit4:junit4]   2> 5325 T180 oashc.HttpShardHandlerFactory.getParameter Setting fairnessPolicy to: false
[junit4:junit4]   2> 5325 T180 oascsi.HttpClientUtil.createClient Creating new http client, config:maxConnectionsPerHost=20&maxConnections=10000&socketTimeout=0&connTimeout=0&retry=false
[junit4:junit4]   2> 5345 T180 oascc.ZkStateReader.createClusterStateWatchersAndUpdate Updating cluster state from ZooKeeper... 
[junit4:junit4]   2> 5352 T180 oasc.CoreContainer.create Creating SolrCore 'collection1' using instanceDir: /usr/home/hudson/hudson-slave/workspace/Lucene-Solr-Tests-trunk-java7/solr/build/solr-core/test/J1/./solrtest-jetty2-1347917513308/collection1
[junit4:junit4]   2> 5353 T180 oasc.ZkController.createCollectionZkNode Check for collection zkNode:collection1
[junit4:junit4]   2> 5354 T180 oasc.ZkController.createCollectionZkNode Collection zkNode exists
[junit4:junit4]   2> 5354 T180 oasc.ZkController.readConfigName Load collection config from:/collections/collection1
[junit4:junit4]   2> 5356 T180 oasc.SolrResourceLoader.<init> new SolrResourceLoader for directory: '/usr/home/hudson/hudson-slave/workspace/Lucene-Solr-Tests-trunk-java7/solr/build/solr-core/test/J1/./solrtest-jetty2-1347917513308/collection1/'
[junit4:junit4]   2> 5358 T180 oasc.SolrResourceLoader.replaceClassLoader Adding 'file:/usr/home/hudson/hudson-slave/workspace/Lucene-Solr-Tests-trunk-java7/solr/build/solr-core/test/J1/solrtest-jetty2-1347917513308/collection1/lib/README' to classloader
[junit4:junit4]   2> 5359 T180 oasc.SolrResourceLoader.replaceClassLoader Adding 'file:/usr/home/hudson/hudson-slave/workspace/Lucene-Solr-Tests-trunk-java7/solr/build/solr-core/test/J1/solrtest-jetty2-1347917513308/collection1/lib/classes/' to classloader
[junit4:junit4]   2> 5416 T180 oasc.SolrConfig.<init> Using Lucene MatchVersion: LUCENE_50
[junit4:junit4]   2> 5450 T201 oascc.ZkStateReader.updateClusterState Updating cloud state from ZooKeeper... 
[junit4:junit4]   2> 5465 T226 oascc.ZkStateReader$2.process A cluster state change has occurred - updating...
[junit4:junit4]   2> 5465 T200 oascc.ZkStateReader$2.process A cluster state change has occurred - updating...
[junit4:junit4]   2> 5465 T214 oascc.ZkStateReader$2.process A cluster state change has occurred - updating...
[junit4:junit4]   2> 5492 T180 oasc.SolrConfig.<init> Loaded SolrConfig: solrconfig.xml
[junit4:junit4]   2> 5593 T180 oass.IndexSchema.readSchema Reading Solr Schema
[junit4:junit4]   2> 5600 T180 oass.IndexSchema.readSchema Schema name=test
[junit4:junit4]   2> 6209 T180 oass.OpenExchangeRatesOrgProvider.init Initialized with rates=open-exchange-rates.json, refreshInterval=1440.
[junit4:junit4]   2> 6219 T180 oass.IndexSchema.readSchema default search field in schema is text
[junit4:junit4]   2> 6222 T180 oass.IndexSchema.readSchema unique key field: id
[junit4:junit4]   2> 6238 T180 oass.FileExchangeRateProvider.reload Reloading exchange rates from file currency.xml
[junit4:junit4]   2> 6243 T180 oass.FileExchangeRateProvider.reload Reloading exchange rates from file currency.xml
[junit4:junit4]   2> 6247 T180 oass.OpenExchangeRatesOrgProvider.reload Reloading exchange rates from open-exchange-rates.json
[junit4:junit4]   2> 6249 T180 oass.OpenExchangeRatesOrgProvider.reload Reloading exchange rates from open-exchange-rates.json
[junit4:junit4]   2> 6252 T180 oasc.SolrCore.<init> [collection1] Opening new SolrCore at /usr/home/hudson/hudson-slave/workspace/Lucene-Solr-Tests-trunk-java7/solr/build/solr-core/test/J1/./solrtest-jetty2-1347917513308/collection1/, dataDir=./org.apache.solr.cloud.BasicDistributedZk2Test-1347917508319/jetty2/
[junit4:junit4]   2> 6252 T180 oasc.JmxMonitoredMap.<init> JMX monitoring is enabled. Adding Solr mbeans to JMX Server: com.sun.jmx.mbeanserver.JmxMBeanServer@b35f26b
[junit4:junit4]   2> 6253 T180 oasc.SolrCore.getNewIndexDir WARNING New index directory detected: old=null new=./org.apache.solr.cloud.BasicDistributedZk2Test-1347917508319/jetty2/index/
[junit4:junit4]   2> 6254 T180 oasc.SolrCore.initIndex WARNING [collection1] Solr index directory './org.apache.solr.cloud.BasicDistributedZk2Test-1347917508319/jetty2/index' doesn't exist. Creating new index...
[junit4:junit4]   2> 6254 T180 oasc.CachingDirectoryFactory.get return new directory for /usr/home/hudson/hudson-slave/workspace/Lucene-Solr-Tests-trunk-java7/solr/build/solr-core/test/J1/./org.apache.solr.cloud.BasicDistributedZk2Test-1347917508319/jetty2/index forceNew:false
[junit4:junit4]   2> 6287 T180 oasc.SolrDeletionPolicy.onCommit SolrDeletionPolicy.onCommit: commits:num=1
[junit4:junit4]   2> 		commit{dir=NRTCachingDirectory(org.apache.lucene.store.NIOFSDirectory@/usr/home/hudson/hudson-slave/workspace/Lucene-Solr-Tests-trunk-java7/solr/build/solr-core/test/J1/org.apache.solr.cloud.BasicDistributedZk2Test-1347917508319/jetty2/index lockFactory=org.apache.lucene.store.NativeFSLockFactory@5d6a32f1; maxCacheMB=48.0 maxMergeSizeMB=4.0),segFN=segments_1,generation=1,filenames=[segments_1]
[junit4:junit4]   2> 6287 T180 oasc.SolrDeletionPolicy.updateCommits newest commit = 1
[junit4:junit4]   2> 6288 T180 oasc.SolrCore.initWriters created xml: solr.XMLResponseWriter
[junit4:junit4]   2> 6290 T180 oasup.UpdateRequestProcessorChain.init inserting DistributedUpdateProcessorFactory into updateRequestProcessorChain "dedupe"
[junit4:junit4]   2> 6290 T180 oasup.UpdateRequestProcessorChain.init inserting DistributedUpdateProcessorFactory into updateRequestProcessorChain "dedupe-allfields"
[junit4:junit4]   2> 6291 T180 oasup.UpdateRequestProcessorChain.init inserting DistributedUpdateProcessorFactory into updateRequestProcessorChain "stored_sig"
[junit4:junit4]   2> 6291 T180 oasup.UpdateRequestProcessorChain.init inserting DistributedUpdateProcessorFactory into updateRequestProcessorChain "uniq-fields"
[junit4:junit4]   2> 6292 T180 oasup.UpdateRequestProcessorChain.init inserting DistributedUpdateProcessorFactory into updateRequestProcessorChain "distrib-dup-test-chain-implicit"
[junit4:junit4]   2> 6292 T180 oasc.RequestHandlers.initHandlersFromConfig adding lazy requestHandler: solr.ReplicationHandler
[junit4:junit4]   2> 6292 T180 oasc.RequestHandlers.initHandlersFromConfig created /replication: solr.ReplicationHandler
[junit4:junit4]   2> 6293 T180 oasc.RequestHandlers.initHandlersFromConfig created standard: solr.StandardRequestHandler
[junit4:junit4]   2> 6294 T180 oasc.RequestHandlers.initHandlersFromConfig created /get: solr.RealTimeGetHandler
[junit4:junit4]   2> 6294 T180 oasc.RequestHandlers.initHandlersFromConfig created dismax: solr.SearchHandler
[junit4:junit4]   2> 6295 T180 oasc.RequestHandlers.initHandlersFromConfig created mock: org.apache.solr.core.MockQuerySenderListenerReqHandler
[junit4:junit4]   2> 6295 T180 oasc.RequestHandlers.initHandlersFromConfig created /admin/: org.apache.solr.handler.admin.AdminHandlers
[junit4:junit4]   2> 6296 T180 oasc.RequestHandlers.initHandlersFromConfig created defaults: solr.StandardRequestHandler
[junit4:junit4]   2> 6296 T180 oasc.RequestHandlers.initHandlersFromConfig adding lazy requestHandler: solr.StandardRequestHandler
[junit4:junit4]   2> 6296 T180 oasc.RequestHandlers.initHandlersFromConfig created lazy: solr.StandardRequestHandler
[junit4:junit4]   2> 6297 T180 oasc.RequestHandlers.initHandlersFromConfig created /update: solr.UpdateRequestHandler
[junit4:junit4]   2> 6297 T180 oasc.RequestHandlers.initHandlersFromConfig created /terms: org.apache.solr.handler.component.SearchHandler
[junit4:junit4]   2> 6298 T180 oasc.RequestHandlers.initHandlersFromConfig created spellCheckCompRH: org.apache.solr.handler.component.SearchHandler
[junit4:junit4]   2> 6298 T180 oasc.RequestHandlers.initHandlersFromConfig created spellCheckCompRH_Direct: org.apache.solr.handler.component.SearchHandler
[junit4:junit4]   2> 6299 T180 oasc.RequestHandlers.initHandlersFromConfig created spellCheckWithWordbreak: org.apache.solr.handler.component.SearchHandler
[junit4:junit4]   2> 6300 T180 oasc.RequestHandlers.initHandlersFromConfig created spellCheckWithWordbreak_Direct: org.apache.solr.handler.component.SearchHandler
[junit4:junit4]   2> 6300 T180 oasc.RequestHandlers.initHandlersFromConfig created spellCheckCompRH1: org.apache.solr.handler.component.SearchHandler
[junit4:junit4]   2> 6301 T180 oasc.RequestHandlers.initHandlersFromConfig created tvrh: org.apache.solr.handler.component.SearchHandler
[junit4:junit4]   2> 6301 T180 oasc.RequestHandlers.initHandlersFromConfig created /mlt: solr.MoreLikeThisHandler
[junit4:junit4]   2> 6302 T180 oasc.RequestHandlers.initHandlersFromConfig created /debug/dump: solr.DumpRequestHandler
[junit4:junit4]   2> 6305 T180 oashl.XMLLoader.init xsltCacheLifetimeSeconds=60
[junit4:junit4]   2> 6308 T180 oasc.SolrCore.initDeprecatedSupport WARNING solrconfig.xml uses deprecated <admin/gettableFiles>, Please update your config to use the ShowFileRequestHandler.
[junit4:junit4]   2> 6310 T180 oasc.SolrCore.initDeprecatedSupport WARNING adding ShowFileRequestHandler with hidden files: [SCHEMA.XML, OLD_SYNONYMS.TXT, STOPWORDS.TXT, PROTWORDS.TXT, OPEN-EXCHANGE-RATES.JSON, SYNONYMS.TXT, CURRENCY.XML, MAPPING-ISOLATIN1ACCENT.TXT]
[junit4:junit4]   2> 6313 T180 oass.SolrIndexSearcher.<init> Opening Searcher@2a79db08 main
[junit4:junit4]   2> 6314 T180 oasu.CommitTracker.<init> Hard AutoCommit: disabled
[junit4:junit4]   2> 6314 T180 oasu.CommitTracker.<init> Soft AutoCommit: disabled
[junit4:junit4]   2> 6315 T180 oashc.SpellCheckComponent.inform Initializing spell checkers
[junit4:junit4]   2> 6321 T180 oass.DirectSolrSpellChecker.init init: {name=direct,classname=DirectSolrSpellChecker,field=lowerfilt,minQueryLength=3}
[junit4:junit4]   2> 6369 T227 oasc.SolrCore.registerSearcher [collection1] Registered new searcher Searcher@2a79db08 main{StandardDirectoryReader(segments_1:1)}
[junit4:junit4]   2> 6474 T201 oascc.ZkStateReader.updateClusterState Updating cloud state from ZooKeeper... 
[junit4:junit4]   2> 6480 T200 oascc.ZkStateReader$2.process A cluster state change has occurred - updating...
[junit4:junit4]   2> 6480 T226 oascc.ZkStateReader$2.process A cluster state change has occurred - updating...
[junit4:junit4]   2> 6480 T214 oascc.ZkStateReader$2.process A cluster state change has occurred - updating...
[junit4:junit4]   2> 6876 T180 oasc.CoreContainer.register registering core: collection1
[junit4:junit4]   2> 6876 T180 oasc.ZkController.register Register shard - core:collection1 address:http://127.0.0.1:37420/solr shardId:shard2
[junit4:junit4]   2> 6877 T180 oascc.SolrZkClient.makePath makePath: /collections/collection1/leader_elect/shard2/election
[junit4:junit4]   2> 6897 T185 oazs.PrepRequestProcessor.pRequest Got user-level KeeperException when processing sessionid:0x139d624f0400004 type:delete cxid:0x42 zxid:0xfffffffffffffffe txntype:unknown reqpath:n/a Error Path:/solr/collections/collection1/leaders/shard2 Error:KeeperErrorCode = NoNode for /solr/collections/collection1/leaders/shard2
[junit4:junit4]   2> 6904 T180 oasc.ShardLeaderElectionContext.runLeaderProcess Running the leader process.
[junit4:junit4]   2> 6905 T185 oazs.PrepRequestProcessor.pRequest Got user-level KeeperException when processing sessionid:0x139d624f0400004 type:create cxid:0x43 zxid:0xfffffffffffffffe txntype:unknown reqpath:n/a Error Path:/solr/overseer Error:KeeperErrorCode = NodeExists for /solr/overseer
[junit4:junit4]   2> 6921 T180 oasc.ShardLeaderElectionContext.waitForReplicasToComeUp Enough replicas found to continue.
[junit4:junit4]   2> 6921 T180 oasc.ShardLeaderElectionContext.runLeaderProcess I may be the new leader - try and sync
[junit4:junit4]   2> 6921 T180 oasc.SyncStrategy.sync Sync replicas to http://127.0.0.1:37420/solr/collection1/
[junit4:junit4]   2> 6922 T180 oasc.SyncStrategy.syncReplicas Sync Success - now sync replicas to me
[junit4:junit4]   2> 6922 T180 oasc.SyncStrategy.syncToMe http://127.0.0.1:37420/solr/collection1/ has no replicas
[junit4:junit4]   2> 6922 T180 oasc.ShardLeaderElectionContext.runLeaderProcess I am the new leader: http://127.0.0.1:37420/solr/collection1/
[junit4:junit4]   2> 6923 T180 oascc.SolrZkClient.makePath makePath: /collections/collection1/leaders/shard2
[junit4:junit4]   2> 6927 T185 oazs.PrepRequestProcessor.pRequest Got user-level KeeperException when processing sessionid:0x139d624f0400004 type:create cxid:0x4c zxid:0xfffffffffffffffe txntype:unknown reqpath:n/a Error Path:/solr/overseer Error:KeeperErrorCode = NodeExists for /solr/overseer
[junit4:junit4]   2> 6994 T201 oascc.ZkStateReader.updateClusterState Updating cloud state from ZooKeeper... 
[junit4:junit4]   2> 7009 T200 oascc.ZkStateReader$2.process A cluster state change has occurred - updating...
[junit4:junit4]   2> 7010 T214 oascc.ZkStateReader$2.process A cluster state change has occurred - updating...
[junit4:junit4]   2> 7009 T226 oascc.ZkStateReader$2.process A cluster state change has occurred - updating...
[junit4:junit4]   2> 7046 T180 oasc.ZkController.register We are http://127.0.0.1:37420/solr/collection1/ and leader is http://127.0.0.1:37420/solr/collection1/
[junit4:junit4]   2> 7046 T180 oasc.ZkController.register No LogReplay needed for core=collection1 baseURL=http://127.0.0.1:37420/solr
[junit4:junit4]   2> 7046 T180 oasc.ZkController.checkRecovery I am the leader, no recovery necessary
[junit4:junit4]   2> 7049 T180 oascc.ZkStateReader.updateClusterState Updating cloud state from ZooKeeper... 
[junit4:junit4]   2> 7050 T180 oass.SolrDispatchFilter.init user.dir=/usr/home/hudson/hudson-slave/workspace/Lucene-Solr-Tests-trunk-java7/solr/build/solr-core/test/J1
[junit4:junit4]   2> 7050 T180 oass.SolrDispatchFilter.init SolrDispatchFilter.init() done
[junit4:junit4]   2> 7050 T180 oascsi.HttpClientUtil.createClient Creating new http client, config:maxConnections=128&maxConnectionsPerHost=32&followRedirects=false
[junit4:junit4]   2> 7200 T180 oejs.Server.doStart jetty-8.1.2.v20120308
[junit4:junit4]   2> 7203 T180 oejs.AbstractConnector.doStart Started SocketConnector@0.0.0.0:37430
[junit4:junit4]   2> 7204 T180 oasc.SolrResourceLoader.locateSolrHome JNDI not configured for solr (NoInitialContextEx)
[junit4:junit4]   2> 7205 T180 oasc.SolrResourceLoader.locateSolrHome using system property solr.solr.home: /usr/home/hudson/hudson-slave/workspace/Lucene-Solr-Tests-trunk-java7/solr/build/solr-core/test/J1/./solrtest-jetty3-1347917515376
[junit4:junit4]   2> 7205 T180 oasc.SolrResourceLoader.<init> new SolrResourceLoader for deduced Solr Home: '/usr/home/hudson/hudson-slave/workspace/Lucene-Solr-Tests-trunk-java7/solr/build/solr-core/test/J1/./solrtest-jetty3-1347917515376/'
[junit4:junit4]   2> 7247 T180 oass.SolrDispatchFilter.init SolrDispatchFilter.init()
[junit4:junit4]   2> 7247 T180 oasc.SolrResourceLoader.locateSolrHome JNDI not configured for solr (NoInitialContextEx)
[junit4:junit4]   2> 7248 T180 oasc.SolrResourceLoader.locateSolrHome using system property solr.solr.home: /usr/home/hudson/hudson-slave/workspace/Lucene-Solr-Tests-trunk-java7/solr/build/solr-core/test/J1/./solrtest-jetty3-1347917515376
[junit4:junit4]   2> 7248 T180 oasc.CoreContainer$Initializer.initialize looking for solr.xml: /usr/home/hudson/hudson-slave/workspace/Lucene-Solr-Tests-trunk-java7/solr/build/solr-core/test/J1/./solrtest-jetty3-1347917515376/solr.xml
[junit4:junit4]   2> 7249 T180 oasc.CoreContainer.<init> New CoreContainer 904479315
[junit4:junit4]   2> 7250 T180 oasc.CoreContainer.load Loading CoreContainer using Solr Home: '/usr/home/hudson/hudson-slave/workspace/Lucene-Solr-Tests-trunk-java7/solr/build/solr-core/test/J1/./solrtest-jetty3-1347917515376/'
[junit4:junit4]   2> 7250 T180 oasc.SolrResourceLoader.<init> new SolrResourceLoader for directory: '/usr/home/hudson/hudson-slave/workspace/Lucene-Solr-Tests-trunk-java7/solr/build/solr-core/test/J1/./solrtest-jetty3-1347917515376/'
[junit4:junit4]   2> 7282 T180 oasc.CoreContainer.load Registering Log Listener
[junit4:junit4]   2> 7298 T180 oasc.CoreContainer.initZooKeeper Zookeeper client=127.0.0.1:37391/solr
[junit4:junit4]   2> 7298 T180 oaz.ZooKeeper.<init> Initiating client connection, connectString=127.0.0.1:37391/solr sessionTimeout=5000 watcher=org.apache.solr.common.cloud.ConnectionManager@2f6c199
[junit4:junit4]   2> 7300 T237 oaz.ClientCnxn$SendThread.startConnect Opening socket connection to server /127.0.0.1:37391
[junit4:junit4]   2> 7299 T180 oascc.ConnectionManager.waitForConnected Waiting for client to connect to ZooKeeper
[junit4:junit4]   2> 7301 T237 oaz.ClientCnxn$SendThread.primeConnection Socket connection established to localhost/127.0.0.1:37391, initiating session
[junit4:junit4]   2> 7301 T182 oazs.NIOServerCnxn$Factory.run Accepted socket connection from /140.211.11.196:37431
[junit4:junit4]   2> 7302 T182 oazs.NIOServerCnxn.readConnectRequest Client attempting to establish new session at /140.211.11.196:37431
[junit4:junit4]   2> 7305 T184 oazs.NIOServerCnxn.finishSessionInit Established session 0x139d624f0400005 with negotiated timeout 5000 for client /140.211.11.196:37431
[junit4:junit4]   2> 7305 T237 oaz.ClientCnxn$SendThread.readConnectResult Session establishment complete on server localhost/127.0.0.1:37391, sessionid = 0x139d624f0400005, negotiated timeout = 5000
[junit4:junit4]   2> 7305 T238 oascc.ConnectionManager.process Watcher org.apache.solr.common.cloud.ConnectionManager@2f6c199 name:ZooKeeperConnection Watcher:127.0.0.1:37391/solr got event WatchedEvent state:SyncConnected type:None path:null path:null type:None
[junit4:junit4]   2> 7306 T180 oascc.ConnectionManager.waitForConnected Client is connected to ZooKeeper
[junit4:junit4]   2> 7307 T185 oazs.PrepRequestProcessor.pRequest Got user-level KeeperException when processing sessionid:0x139d624f0400005 type:create cxid:0x1 zxid:0xfffffffffffffffe txntype:unknown reqpath:n/a Error Path:/solr/overseer Error:KeeperErrorCode = NodeExists for /solr/overseer
[junit4:junit4]   2> 7318 T185 oazs.PrepRequestProcessor.pRequest Got user-level KeeperException when processing sessionid:0x139d624f0400005 type:create cxid:0x2 zxid:0xfffffffffffffffe txntype:unknown reqpath:n/a Error Path:/solr/overseer Error:KeeperErrorCode = NodeExists for /solr/overseer
[junit4:junit4]   2> 7320 T180 oasc.ZkController.createEphemeralLiveNode Register node as live in ZooKeeper:/live_nodes/127.0.0.1:37430_solr
[junit4:junit4]   2> 7321 T185 oazs.PrepRequestProcessor.pRequest Got user-level KeeperException when processing sessionid:0x139d624f0400005 type:delete cxid:0x4 zxid:0xfffffffffffffffe txntype:unknown reqpath:n/a Error Path:/solr/live_nodes/127.0.0.1:37430_solr Error:KeeperErrorCode = NoNode for /solr/live_nodes/127.0.0.1:37430_solr
[junit4:junit4]   2> 7323 T180 oascc.SolrZkClient.makePath makePath: /live_nodes/127.0.0.1:37430_solr
[junit4:junit4]   2> 7326 T226 oascc.ZkStateReader$3.process Updating live nodes
[junit4:junit4]   2> 7326 T214 oascc.ZkStateReader$3.process Updating live nodes
[junit4:junit4]   2> 7326 T200 oascc.ZkStateReader$3.process Updating live nodes
[junit4:junit4]   2> 7328 T180 oashc.HttpShardHandlerFactory.getParameter Setting socketTimeout to: 0
[junit4:junit4]   2> 7328 T180 oashc.HttpShardHandlerFactory.getParameter Setting urlScheme to: http://
[junit4:junit4]   2> 7329 T180 oashc.HttpShardHandlerFactory.getParameter Setting connTimeout to: 0
[junit4:junit4]   2> 7329 T180 oashc.HttpShardHandlerFactory.getParameter Setting maxConnectionsPerHost to: 20
[junit4:junit4]   2> 7330 T180 oashc.HttpShardHandlerFactory.getParameter Setting corePoolSize to: 0
[junit4:junit4]   2> 7330 T180 oashc.HttpShardHandlerFactory.getParameter Setting maximumPoolSize to: 2147483647
[junit4:junit4]   2> 7331 T180 oashc.HttpShardHandlerFactory.getParameter Setting maxThreadIdleTime to: 5
[junit4:junit4]   2> 7331 T180 oashc.HttpShardHandlerFactory.getParameter Setting sizeOfQueue to: -1
[junit4:junit4]   2> 7331 T180 oashc.HttpShardHandlerFactory.getParameter Setting fairnessPolicy to: false
[junit4:junit4]   2> 7332 T180 oascsi.HttpClientUtil.createClient Creating new http client, config:maxConnectionsPerHost=20&maxConnections=10000&socketTimeout=0&connTimeout=0&retry=false
[junit4:junit4]   2> 7356 T180 oascc.ZkStateReader.createClusterStateWatchersAndUpdate Updating cluster state from ZooKeeper... 
[junit4:junit4]   2> 7364 T180 oasc.CoreContainer.create Creating SolrCore 'collection1' using instanceDir: /usr/home/hudson/hudson-slave/workspace/Lucene-Solr-Tests-trunk-java7/solr/build/solr-core/test/J1/./solrtest-jetty3-1347917515376/collection1
[junit4:junit4]   2> 7364 T180 oasc.ZkController.createCollectionZkNode Check for collection zkNode:collection1
[junit4:junit4]   2> 7365 T180 oasc.ZkController.createCollectionZkNode Collection zkNode exists
[junit4:junit4]   2> 7366 T180 oasc.ZkController.readConfigName Load collection config from:/collections/collection1
[junit4:junit4]   2> 7368 T180 oasc.SolrResourceLoader.<init> new SolrResourceLoader for directory: '/usr/home/hudson/hudson-slave/workspace/Lucene-Solr-Tests-trunk-java7/solr/build/solr-core/test/J1/./solrtest-jetty3-1347917515376/collection1/'
[junit4:junit4]   2> 7369 T180 oasc.SolrResourceLoader.replaceClassLoader Adding 'file:/usr/home/hudson/hudson-slave/workspace/Lucene-Solr-Tests-trunk-java7/solr/build/solr-core/test/J1/solrtest-jetty3-1347917515376/collection1/lib/README' to classloader
[junit4:junit4]   2> 7370 T180 oasc.SolrResourceLoader.replaceClassLoader Adding 'file:/usr/home/hudson/hudson-slave/workspace/Lucene-Solr-Tests-trunk-java7/solr/build/solr-core/test/J1/solrtest-jetty3-1347917515376/collection1/lib/classes/' to classloader
[junit4:junit4]   2> 7425 T180 oasc.SolrConfig.<init> Using Lucene MatchVersion: LUCENE_50
[junit4:junit4]   2> 7500 T180 oasc.SolrConfig.<init> Loaded SolrConfig: solrconfig.xml
[junit4:junit4]   2> 7524 T201 oascc.ZkStateReader.updateClusterState Updating cloud state from ZooKeeper... 
[junit4:junit4]   2> 7545 T226 oascc.ZkStateReader$2.process A cluster state change has occurred - updating...
[junit4:junit4]   2> 7546 T214 oascc.ZkStateReader$2.process A cluster state change has occurred - updating...
[junit4:junit4]   2> 7546 T200 oascc.ZkStateReader$2.process A cluster state change has occurred - updating...
[junit4:junit4]   2> 7602 T238 oascc.ZkStateReader$2.process A cluster state change has occurred - updating...
[junit4:junit4]   2> 7602 T180 oass.IndexSchema.readSchema Reading Solr Schema
[junit4:junit4]   2> 7610 T180 oass.IndexSchema.readSchema Schema name=test
[junit4:junit4]   2> 8338 T180 oass.OpenExchangeRatesOrgProvider.init Initialized with rates=open-exchange-rates.json, refreshInterval=1440.
[junit4:junit4]   2> 8350 T180 oass.IndexSchema.readSchema default search field in schema is text
[junit4:junit4]   2> 8355 T180 oass.IndexSchema.readSchema unique key field: id
[junit4:junit4]   2> 8377 T180 oass.FileExchangeRateProvider.reload Reloading exchange rates from file currency.xml
[junit4:junit4]   2> 8383 T180 oass.FileExchangeRateProvider.reload Reloading exchange rates from file currency.xml
[junit4:junit4]   2> 8388 T180 oass.OpenExchangeRatesOrgProvider.reload Reloading exchange rates from open-exchange-rates.json
[junit4:junit4]   2> 8391 T180 oass.OpenExchangeRatesOrgProvider.reload Reloading exchange rates from open-exchange-rates.json
[junit4:junit4]   2> 8393 T180 oasc.SolrCore.<init> [collection1] Opening new SolrCore at /usr/home/hudson/hudson-slave/workspace/Lucene-Solr-Tests-trunk-java7/solr/build/solr-core/test/J1/./solrtest-jetty3-1347917515376/collection1/, dataDir=./org.apache.solr.cloud.BasicDistributedZk2Test-1347917508319/jetty3/
[junit4:junit4]   2> 8394 T180 oasc.JmxMonitoredMap.<init> JMX monitoring is enabled. Adding Solr mbeans to JMX Server: com.sun.jmx.mbeanserver.JmxMBeanServer@b35f26b
[junit4:junit4]   2> 8395 T180 oasc.SolrCore.getNewIndexDir WARNING New index directory detected: old=null new=./org.apache.solr.cloud.BasicDistributedZk2Test-1347917508319/jetty3/index/
[junit4:junit4]   2> 8396 T180 oasc.SolrCore.initIndex WARNING [collection1] Solr index directory './org.apache.solr.cloud.BasicDistributedZk2Test-1347917508319/jetty3/index' doesn't exist. Creating new index...
[junit4:junit4]   2> 8397 T180 oasc.CachingDirectoryFactory.get return new directory for /usr/home/hudson/hudson-slave/workspace/Lucene-Solr-Tests-trunk-java7/solr/build/solr-core/test/J1/./org.apache.solr.cloud.BasicDistributedZk2Test-1347917508319/jetty3/index forceNew:false
[junit4:junit4]   2> 8406 T180 oasc.SolrDeletionPolicy.onCommit SolrDeletionPolicy.onCommit: commits:num=1
[junit4:junit4]   2> 		commit{dir=NRTCachingDirectory(org.apache.lucene.store.NIOFSDirectory@/usr/home/hudson/hudson-slave/workspace/Lucene-Solr-Tests-trunk-java7/solr/build/solr-core/test/J1/org.apache.solr.cloud.BasicDistributedZk2Test-1347917508319/jetty3/index lockFactory=org.apache.lucene.store.NativeFSLockFactory@5c620819; maxCacheMB=48.0 maxMergeSizeMB=4.0),segFN=segments_1,generation=1,filenames=[segments_1]
[junit4:junit4]   2> 8406 T180 oasc.SolrDeletionPolicy.updateCommits newest commit = 1
[junit4:junit4]   2> 8407 T180 oasc.SolrCore.initWriters created xml: solr.XMLResponseWriter
[junit4:junit4]   2> 8411 T180 oasup.UpdateRequestProcessorChain.init inserting DistributedUpdateProcessorFactory into updateRequestProcessorChain "dedupe"
[junit4:junit4]   2> 8411 T180 oasup.UpdateRequestProcessorChain.init inserting DistributedUpdateProcessorFactory into updateRequestProcessorChain "dedupe-allfields"
[junit4:junit4]   2> 8412 T180 oasup.UpdateRequestProcessorChain.init inserting DistributedUpdateProcessorFactory into updateRequestProcessorChain "stored_sig"
[junit4:junit4]   2> 8413 T180 oasup.UpdateRequestProcessorChain.init inserting DistributedUpdateProcessorFactory into updateRequestProcessorChain "uniq-fields"
[junit4:junit4]   2> 8415 T180 oasup.UpdateRequestProcessorChain.init inserting DistributedUpdateProcessorFactory into updateRequestProcessorChain "distrib-dup-test-chain-implicit"
[junit4:junit4]   2> 8416 T180 oasc.RequestHandlers.initHandlersFromConfig adding lazy requestHandler: solr.ReplicationHandler
[junit4:junit4]   2> 8417 T180 oasc.RequestHandlers.initHandlersFromConfig created /replication: solr.ReplicationHandler
[junit4:junit4]   2> 8418 T180 oasc.RequestHandlers.initHandlersFromConfig created standard: solr.StandardRequestHandler
[junit4:junit4]   2> 8419 T180 oasc.RequestHandlers.initHandlersFromConfig created /get: solr.RealTimeGetHandler
[junit4:junit4]   2> 8420 T180 oasc.RequestHandlers.initHandlersFromConfig created dismax: solr.SearchHandler
[junit4:junit4]   2> 8422 T180 oasc.RequestHandlers.initHandlersFromConfig created mock: org.apache.solr.core.MockQuerySenderListenerReqHandler
[junit4:junit4]   2> 8422 T180 oasc.RequestHandlers.initHandlersFromConfig created /admin/: org.apache.solr.handler.admin.AdminHandlers
[junit4:junit4]   2> 8423 T180 oasc.RequestHandlers.initHandlersFromConfig created defaults: solr.StandardRequestHandler
[junit4:junit4]   2> 8424 T180 oasc.RequestHandlers.initHandlersFromConfig adding lazy requestHandler: solr.StandardRequestHandler
[junit4:junit4]   2> 8425 T180 oasc.RequestHandlers.initHandlersFromConfig created lazy: solr.StandardRequestHandler
[junit4:junit4]   2> 8426 T180 oasc.RequestHandlers.initHandlersFromConfig created /update: solr.UpdateRequestHandler
[junit4:junit4]   2> 8427 T180 oasc.RequestHandlers.initHandlersFromConfig created /terms: org.apache.solr.handler.component.SearchHandler
[junit4:junit4]   2> 8428 T180 oasc.RequestHandlers.initHandlersFromConfig created spellCheckCompRH: org.apache.solr.handler.component.SearchHandler
[junit4:junit4]   2> 8429 T180 oasc.RequestHandlers.initHandlersFromConfig created spellCheckCompRH_Direct: org.apache.solr.handler.component.SearchHandler
[junit4:junit4]   2> 8430 T180 oasc.RequestHandlers.initHandlersFromConfig created spellCheckWithWordbreak: org.apache.solr.handler.component.SearchHandler
[junit4:junit4]   2> 8431 T180 oasc.RequestHandlers.initHandlersFromConfig created spellCheckWithWordbreak_Direct: org.apache.solr.handler.component.SearchHandler
[junit4:junit4]   2> 8432 T180 oasc.RequestHandlers.initHandlersFromConfig created spellCheckCompRH1: org.apache.solr.handler.component.SearchHandler
[junit4:junit4]   2> 8433 T180 oasc.RequestHandlers.initHandlersFromConfig created tvrh: org.apache.solr.handler.component.SearchHandler
[junit4:junit4]   2> 8435 T180 oasc.RequestHandlers.initHandlersFromConfig created /mlt: solr.MoreLikeThisHandler
[junit4:junit4]   2> 8436 T180 oasc.RequestHandlers.initHandlersFromConfig created /debug/dump: solr.DumpRequestHandler
[junit4:junit4]   2> 8441 T180 oashl.XMLLoader.init xsltCacheLifetimeSeconds=60
[junit4:junit4]   2> 8448 T180 oasc.SolrCore.initDeprecatedSupport WARNING solrconfig.xml uses deprecated <admin/gettableFiles>, Please update your config to use the ShowFileRequestHandler.
[junit4:junit4]   2> 8450 T180 oasc.SolrCore.initDeprecatedSupport WARNING adding ShowFileRequestHandler with hidden files: [SCHEMA.XML, OLD_SYNONYMS.TXT, STOPWORDS.TXT, PROTWORDS.TXT, OPEN-EXCHANGE-RATES.JSON, SYNONYMS.TXT, CURRENCY.XML, MAPPING-ISOLATIN1ACCENT.TXT]
[junit4:junit4]   2> 8456 T180 oass.SolrIndexSearcher.<init> Opening Searcher@4fdb97c8 main
[junit4:junit4]   2> 8457 T180 oasu.CommitTracker.<init> Hard AutoCommit: disabled
[junit4:junit4]   2> 8458 T180 oasu.CommitTracker.<init> Soft AutoCommit: disabled
[junit4:junit4]   2> 8459 T180 oashc.SpellCheckComponent.inform Initializing spell checkers
[junit4:junit4]   2> 8470 T180 oass.DirectSolrSpellChecker.init init: {name=direct,classname=DirectSolrSpellChecker,field=lowerfilt,minQueryLength=3}
[junit4:junit4]   2> 8516 T239 oasc.SolrCore.registerSearcher [collection1] Registered new searcher Searcher@4fdb97c8 main{StandardDirectoryReader(segments_1:1)}
[junit4:junit4]   2> 8564 T201 oascc.ZkStateReader.updateClusterState Updating cloud state from ZooKeeper... 
[junit4:junit4]   2> 8572 T226 oascc.ZkStateReader$2.process A cluster state change has occurred - updating...
[junit4:junit4]   2> 8572 T200 oascc.ZkStateReader$2.process A cluster state change has occurred - updating...
[junit4:junit4]   2> 8572 T214 oascc.ZkStateReader$2.process A cluster state change has occurred - updating...
[junit4:junit4]   2> 8572 T238 oascc.ZkStateReader$2.process A cluster state change has occurred - updating...
[junit4:junit4]   2> 9026 T180 oasc.CoreContainer.register registering core: collection1
[junit4:junit4]   2> 9026 T180 oasc.ZkController.register Register shard - core:collection1 address:http://127.0.0.1:37430/solr shardId:shard1
[junit4:junit4]   2> 9031 T180 oasc.ZkController.register We are http://127.0.0.1:37430/solr/collection1/ and leader is http://127.0.0.1:37408/solr/collection1/
[junit4:junit4]   2> 9032 T180 oasc.ZkController.register No LogReplay needed for core=collection1 baseURL=http://127.0.0.1:37430/solr
[junit4:junit4]   2> 9032 T180 oasc.ZkController.checkRecovery Core needs to recover:collection1
[junit4:junit4]   2> 9033 T180 oasu.DefaultSolrCoreState.doRecovery Running recovery - first canceling any ongoing recovery
[junit4:junit4]   2> ASYNC  NEW_CORE C25 name=collection1 org.apache.solr.core.SolrCore@77f14fbf url=http://127.0.0.1:37430/solr/collection1 node=127.0.0.1:37430_solr
[junit4:junit4]   2> 9040 T240 C25 P37430 oasc.RecoveryStrategy.run Starting recovery process.  core=collection1 recoveringAfterStartup=true
[junit4:junit4]   2> 9041 T240 C25 P37430 oasc.RecoveryStrategy.doRecovery ###### startupVersions=[]
[junit4:junit4]   2> 9041 T180 oascc.ZkStateReader.updateClusterState Updating cloud state from ZooKeeper... 
[junit4:junit4]   2> 9043 T240 C25 P37430 oasc.RecoveryStrategy.doRecovery Attempting to PeerSync from http://127.0.0.1:37408/solr/collection1/ core=collection1 - recoveringAfterStartup=true
[junit4:junit4]   2> 9043 T180 oass.SolrDispatchFilter.init user.dir=/usr/home/hudson/hudson-slave/workspace/Lucene-Solr-Tests-trunk-java7/solr/build/solr-core/test/J1
[junit4:junit4]   2> 9044 T180 oass.SolrDispatchFilter.init SolrDispatchFilter.init() done
[junit4:junit4]   2> 9044 T180 oascsi.HttpClientUtil.createClient Creating new http client, config:maxConnections=128&maxConnectionsPerHost=32&followRedirects=false
[junit4:junit4]   2> 9053 T240 C25 P37430 oascsi.HttpClientUtil.createClient Creating new http client, config:maxConnectionsPerHost=20&maxConnections=10000&connTimeout=30000&socketTimeout=30000&retry=false
[junit4:junit4]   2> 9077 T240 C25 P37430 oasu.PeerSync.sync PeerSync: core=collection1 url=http://127.0.0.1:37430/solr START replicas=[http://127.0.0.1:37408/solr/collection1/] nUpdates=100
[junit4:junit4]   2> 9078 T240 C25 P37430 oasu.PeerSync.sync WARNING no frame of reference to tell of we've missed updates
[junit4:junit4]   2> 9079 T240 C25 P37430 oasc.RecoveryStrategy.doRecovery PeerSync Recovery was not successful - trying replication. core=collection1
[junit4:junit4]   2> 9079 T240 C25 P37430 oasc.RecoveryStrategy.doRecovery Starting Replication Recovery. core=collection1
[junit4:junit4]   2> 9080 T240 C25 P37430 oascsi.HttpClientUtil.createClient Creating new http client, config:maxConnections=128&maxConnectionsPerHost=32&followRedirects=false
[junit4:junit4]   2> ASYNC  NEW_CORE C26 name=collection1 org.apache.solr.core.SolrCore@12d2681c url=http://127.0.0.1:37408/solr/collection1 node=127.0.0.1:37408_solr
[junit4:junit4]   2> 9092 T206 C26 P37408 REQ /get {distrib=false&qt=/get&wt=javabin&version=2&getVersions=100} status=0 QTime=0 
[junit4:junit4]   2> 9094 T201 oascc.ZkStateReader.updateClusterState Updating cloud state from ZooKeeper... 
[junit4:junit4]   2> 9107 T226 oascc.ZkStateReader$2.process A cluster state change has occurred - updating...
[junit4:junit4]   2> 9108 T214 oascc.ZkStateReader$2.process A cluster state change has occurred - updating...
[junit4:junit4]   2> 9108 T200 oascc.ZkStateReader$2.process A cluster state change has occurred - updating...
[junit4:junit4]   2> 9108 T238 oascc.ZkStateReader$2.process A cluster state change has occurred - updating...
[junit4:junit4]   2> 9227 T180 oejs.Server.doStart jetty-8.1.2.v20120308
[junit4:junit4]   2> 9230 T180 oejs.AbstractConnector.doStart Started SocketConnector@0.0.0.0:37439
[junit4:junit4]   2> 9230 T180 oasc.SolrResourceLoader.locateSolrHome JNDI not configured for solr (NoInitialContextEx)
[junit4:junit4]   2> 9231 T180 oasc.SolrResourceLoader.locateSolrHome using system property solr.solr.home: /usr/home/hudson/hudson-slave/workspace/Lucene-Solr-Tests-trunk-java7/solr/build/solr-core/test/J1/./solrtest-jetty4-1347917517376
[junit4:junit4]   2> 9231 T180 oasc.SolrResourceLoader.<init> new SolrResourceLoader for deduced Solr Home: '/usr/home/hudson/hudson-slave/workspace/Lucene-Solr-Tests-trunk-java7/solr/build/solr-core/test/J1/./solrtest-jetty4-1347917517376/'
[junit4:junit4]   2> 9271 T180 oass.SolrDispatchFilter.init SolrDispatchFilter.init()
[junit4:junit4]   2> 9272 T180 oasc.SolrResourceLoader.locateSolrHome JNDI not configured for solr (NoInitialContextEx)
[junit4:junit4]   2> 9273 T180 oasc.SolrResourceLoader.locateSolrHome using system property solr.solr.home: /usr/home/hudson/hudson-slave/workspace/Lucene-Solr-Tests-trunk-java7/solr/build/solr-core/test/J1/./solrtest-jetty4-1347917517376
[junit4:junit4]   2> 9273 T180 oasc.CoreContainer$Initializer.initialize looking for solr.xml: /usr/home/hudson/hudson-slave/workspace/Lucene-Solr-Tests-trunk-java7/solr/build/solr-core/test/J1/./solrtest-jetty4-1347917517376/solr.xml
[junit4:junit4]   2> 9273 T180 oasc.CoreContainer.<init> New CoreContainer 1238997437
[junit4:junit4]   2> 9274 T180 oasc.CoreContainer.load Loading CoreContainer using Solr Home: '/usr/home/hudson/hudson-slave/workspace/Lucene-Solr-Tests-trunk-java7/solr/build/solr-core/test/J1/./solrtest-jetty4-1347917517376/'
[junit4:junit4]   2> 9275 T180 oasc.SolrResourceLoader.<init> new SolrResourceLoader for directory: '/usr/home/hudson/hudson-slave/workspace/Lucene-Solr-Tests-trunk-java7/solr/build/solr-core/test/J1/./solrtest-jetty4-1347917517376/'
[junit4:junit4]   2> 9307 T180 oasc.CoreContainer.load Registering Log Listener
[junit4:junit4]   2> 9323 T180 oasc.CoreContainer.initZooKeeper Zookeeper client=127.0.0.1:37391/solr
[junit4:junit4]   2> 9323 T180 oaz.ZooKeeper.<init> Initiating client connection, connectString=127.0.0.1:37391/solr sessionTimeout=5000 watcher=org.apache.solr.common.cloud.ConnectionManager@75d88b48
[junit4:junit4]   2> 9325 T251 oaz.ClientCnxn$SendThread.startConnect Opening socket connection to server /127.0.0.1:37391
[junit4:junit4]   2> 9325 T180 oascc.ConnectionManager.waitForConnected Waiting for client to connect to ZooKeeper
[junit4:junit4]   2> 9326 T251 oaz.ClientCnxn$SendThread.primeConnection Socket connection established to localhost/127.0.0.1:37391, initiating session
[junit4:junit4]   2> 9326 T182 oazs.NIOServerCnxn$Factory.run Accepted socket connection from /140.211.11.196:37440
[junit4:junit4]   2> 9326 T182 oazs.NIOServerCnxn.readConnectRequest Client attempting to establish new session at /140.211.11.196:37440
[junit4:junit4]   2> 9328 T184 oazs.NIOServerCnxn.finishSessionInit Established session 0x139d624f0400006 with negotiated timeout 5000 for client /140.211.11.196:37440
[junit4:junit4]   2> 9328 T251 oaz.ClientCnxn$SendThread.readConnectResult Session establishment complete on server localhost/127.0.0.1:37391, sessionid = 0x139d624f0400006, negotiated timeout = 5000
[junit4:junit4]   2> 9329 T252 oascc.ConnectionManager.process Watcher org.apache.solr.common.cloud.ConnectionManager@75d88b48 name:ZooKeeperConnection Watcher:127.0.0.1:37391/solr got event WatchedEvent state:SyncConnected type:None path:null path:null type:None
[junit4:junit4]   2> 9329 T180 oascc.ConnectionManager.waitForConnected Client is connected to ZooKeeper
[junit4:junit4]   2> 9330 T185 oazs.PrepRequestProcessor.pRequest Got user-level KeeperException when processing sessionid:0x139d624f0400006 type:create cxid:0x1 zxid:0xfffffffffffffffe txntype:unknown reqpath:n/a Error Path:/solr/overseer Error:KeeperErrorCode = NodeExists for /solr/overseer
[junit4:junit4]   2> 9331 T185 oazs.PrepRequestProcessor.pRequest Got user-level KeeperException when processing sessionid:0x139d624f0400006 type:create cxid:0x2 zxid:0xfffffffffffffffe txntype:unknown reqpath:n/a Error Path:/solr/overseer Error:KeeperErrorCode = NodeExists for /solr/overseer
[junit4:junit4]   2> 9343 T180 oasc.ZkController.createEphemeralLiveNode Register node as live in ZooKeeper:/live_nodes/127.0.0.1:37439_solr
[junit4:junit4]   2> 9344 T185 oazs.PrepRequestProcessor.pRequest Got user-level KeeperException when processing sessionid:0x139d624f0400006 type:delete cxid:0x4 zxid:0xfffffffffffffffe txntype:unknown reqpath:n/a Error Path:/solr/live_nodes/127.0.0.1:37439_solr Error:KeeperErrorCode = NoNode for /solr/live_nodes/127.0.0.1:37439_solr
[junit4:junit4]   2> 9345 T180 oascc.SolrZkClient.makePath makePath: /live_nodes/127.0.0.1:37439_solr
[junit4:junit4]   2> 9348 T238 oascc.ZkStateReader$3.process Updating live nodes
[junit4:junit4]   2> 9348 T200 oascc.ZkStateReader$3.process Updating live nodes
[junit4:junit4]   2> 9348 T214 oascc.ZkStateReader$3.process Updating live nodes
[junit4:junit4]   2> 9348 T226 oascc.ZkStateReader$3.process Updating live nodes
[junit4:junit4]   2> 9350 T180 oashc.HttpShardHandlerFactory.getParameter Setting socketTimeout to: 0
[junit4:junit4]   2> 9350 T180 oashc.HttpShardHandlerFactory.getParameter Setting urlScheme to: http://
[junit4:junit4]   2> 9351 T180 oashc.HttpShardHandlerFactory.getParameter Setting connTimeout to: 0
[junit4:junit4]   2> 9351 T180 oashc.HttpShardHandlerFactory.getParameter Setting maxConnectionsPerHost to: 20
[junit4:junit4]   2> 9351 T180 oashc.HttpShardHandlerFactory.getParameter Setting corePoolSize to: 0
[junit4:junit4]   2> 9352 T180 oashc.HttpShardHandlerFactory.getParameter Setting maximumPoolSize to: 2147483647
[junit4:junit4]   2> 9352 T180 oashc.HttpShardHandlerFactory.getParameter Setting maxThreadIdleTime to: 5
[junit4:junit4]   2> 9353 T180 oashc.HttpShardHandlerFactory.getParameter Setting sizeOfQueue to: -1
[junit4:junit4]   2> 9353 T180 oashc.HttpShardHandlerFactory.getParameter Setting fairnessPolicy to: false
[junit4:junit4]   2> 9354 T180 oascsi.HttpClientUtil.createClient Creating new http client, config:maxConnectionsPerHost=20&maxConnections=10000&socketTimeout=0&connTimeout=0&retry=false
[junit4:junit4]   2> 9372 T180 oascc.ZkStateReader.createClusterStateWatchersAndUpdate Updating cluster state from ZooKeeper... 
[junit4:junit4]   2> 9379 T180 oasc.CoreContainer.create Creating SolrCore 'collection1' using instanceDir: /usr/home/hudson/hudson-slave/workspace/Lucene-Solr-Tests-trunk-java7/solr/build/solr-core/test/J1/./solrtest-jetty4-1347917517376/collection1
[junit4:junit4]   2> 9380 T180 oasc.ZkController.createCollectionZkNode Check for collection zkNode:collection1
[junit4:junit4]   2> 9381 T180 oasc.ZkController.createCollectionZkNode Collection zkNode exists
[junit4:junit4]   2> 9381 T180 oasc.ZkController.readConfigName Load collection config from:/collections/collection1
[junit4:junit4]   2> 9383 T180 oasc.SolrResourceLoader.<init> new SolrResourceLoader for directory: '/usr/home/hudson/hudson-slave/workspace/Lucene-Solr-Tests-trunk-java7/solr/build/solr-core/test/J1/./solrtest-jetty4-1347917517376/collection1/'
[junit4:junit4]   2> 9384 T180 oasc.SolrResourceLoader.replaceClassLoader Adding 'file:/usr/home/hudson/hudson-slave/workspace/Lucene-Solr-Tests-trunk-java7/solr/build/solr-core/test/J1/solrtest-jetty4-1347917517376/collection1/lib/README' to classloader
[junit4:junit4]   2> 9385 T180 oasc.SolrResourceLoader.replaceClassLoader Adding 'file:/usr/home/hudson/hudson-slave/workspace/Lucene-Solr-Tests-trunk-java7/solr/build/solr-core/test/J1/solrtest-jetty4-1347917517376/collection1/lib/classes/' to classloader
[junit4:junit4]   2> 9433 T180 oasc.SolrConfig.<init> Using Lucene MatchVersion: LUCENE_50
[junit4:junit4]   2> 9499 T180 oasc.SolrConfig.<init> Loaded SolrConfig: solrconfig.xml
[junit4:junit4]   2> 9600 T180 oass.IndexSchema.readSchema Reading Solr Schema
[junit4:junit4]   2> 9608 T180 oass.IndexSchema.readSchema Schema name=test
[junit4:junit4]   2> 10049 T180 oass.OpenExchangeRatesOrgProvider.init Initialized with rates=open-exchange-rates.json, refreshInterval=1440.
[junit4:junit4]   2> 10058 T180 oass.IndexSchema.readSchema default search field in schema is text
[junit4:junit4]   2> 10061 T180 oass.IndexSchema.readSchema unique key field: id
[junit4:junit4]   2> 10082 T180 oass.FileExchangeRateProvider.reload Reloading exchange rates from file currency.xml
[junit4:junit4]   2> 10086 T180 oass.FileExchangeRateProvider.reload Reloading exchange rates from file currency.xml
[junit4:junit4]   2> 10090 T180 oass.OpenExchangeRatesOrgProvider.reload Reloading exchange rates from open-exchange-rates.json
[junit4:junit4]   2> 10092 T180 oass.OpenExchangeRatesOrgProvider.reload Reloading exchange rates from open-exchange-rates.json
[junit4:junit4]   2> 10094 T180 oasc.SolrCore.<init> [collection1] Opening new SolrCore at /usr/home/hudson/hudson-slave/workspace/Lucene-Solr-Tests-trunk-java7/solr/build/solr-core/test/J1/./solrtest-jetty4-1347917517376/collection1/, dataDir=./org.apache.solr.cloud.BasicDistributedZk2Test-1347917508319/jetty4/
[junit4:junit4]   2> 10094 T180 oasc.JmxMonitoredMap.<init> JMX monitoring is enabled. Adding Solr mbeans to JMX Server: com.sun.jmx.mbeanserver.JmxMBeanServer@b35f26b
[junit4:junit4]   2> 10096 T180 oasc.SolrCore.getNewIndexDir WARNING New index directory detected: old=null new=./org.apache.solr.cloud.BasicDistributedZk2Test-1347917508319/jetty4/index/
[junit4:junit4]   2> 10096 T180 oasc.SolrCore.initIndex WARNING [collection1] Solr index directory './org.apache.solr.cloud.BasicDistributedZk2Test-1347917508319/jetty4/index' doesn't exist. Creating new index...
[junit4:junit4]   2> 10097 T180 oasc.CachingDirectoryFactory.get return new directory for /usr/home/hudson/hudson-slave/workspace/Lucene-Solr-Tests-trunk-java7/solr/build/solr-core/test/J1/./org.apache.solr.cloud.BasicDistributedZk2Test-1347917508319/jetty4/index forceNew:false
[junit4:junit4]   2> 10133 T180 oasc.SolrDeletionPolicy.onCommit SolrDeletionPolicy.onCommit: commits:num=1
[junit4:junit4]   2> 		commit{dir=NRTCachingDirectory(org.apache.lucene.store.NIOFSDirectory@/usr/home/hudson/hudson-slave/workspace/Lucene-Solr-Tests-trunk-java7/solr/build/solr-core/test/J1/org.apache.solr.cloud.BasicDistributedZk2Test-1347917508319/jetty4/index lockFactory=org.apache.lucene.store.NativeFSLockFactory@59ac902c; maxCacheMB=48.0 maxMergeSizeMB=4.0),segFN=segments_1,generation=1,filenames=[segments_1]
[junit4:junit4]   2> 10133 T180 oasc.SolrDeletionPolicy.updateCommits newest commit = 1
[junit4:junit4]   2> 10134 T180 oasc.SolrCore.initWriters created xml: solr.XMLResponseWriter
[junit4:junit4]   2> 10136 T180 oasup.UpdateRequestProcessorChain.init inserting DistributedUpdateProcessorFactory into updateRequestProcessorChain "dedupe"
[junit4:junit4]   2> 10137 T180 oasup.UpdateRequestProcessorChain.init inserting DistributedUpdateProcessorFactory into updateRequestProcessorChain "dedupe-allfields"
[junit4:junit4]   2> 10137 T180 oasup.UpdateRequestProcessorChain.init inserting DistributedUpdateProcessorFactory into updateRequestProcessorChain "stored_sig"
[junit4:junit4]   2> 10138 T180 oasup.UpdateRequestProcessorChain.init inserting DistributedUpdateProcessorFactory into updateRequestProcessorChain "uniq-fields"
[junit4:junit4]   2> 10138 T180 oasup.UpdateRequestProcessorChain.init inserting DistributedUpdateProcessorFactory into updateRequestProcessorChain "distrib-dup-test-chain-implicit"
[junit4:junit4]   2> 10138 T180 oasc.RequestHandlers.initHandlersFromConfig adding lazy requestHandler: solr.ReplicationHandler
[junit4:junit4]   2> 10139 T180 oasc.RequestHandlers.initHandlersFromConfig created /replication: solr.ReplicationHandler
[junit4:junit4]   2> 10140 T180 oasc.RequestHandlers.initHandlersFromConfig created standard: solr.StandardRequestHandler
[junit4:junit4]   2> 10140 T180 oasc.RequestHandlers.initHandlersFromConfig created /get: solr.RealTimeGetHandler
[junit4:junit4]   2> 10141 T180 oasc.RequestHandlers.initHandlersFromConfig created dismax: solr.SearchHandler
[junit4:junit4]   2> 10141 T180 oasc.RequestHandlers.initHandlersFromConfig created mock: org.apache.solr.core.MockQuerySenderListenerReqHandler
[junit4:junit4]   2> 10142 T180 oasc.RequestHandlers.initHandlersFromConfig created /admin/: org.apache.solr.handler.admin.AdminHandlers
[junit4:junit4]   2> 10142 T180 oasc.RequestHandlers.initHandlersFromConfig created defaults: solr.StandardRequestHandler
[junit4:junit4]   2> 10142 T180 oasc.RequestHandlers.initHandlersFromConfig adding lazy requestHandler: solr.StandardRequestHandler
[junit4:junit4]   2> 10143 T180 oasc.RequestHandlers.initHandlersFromConfig created lazy: solr.StandardRequestHandler
[junit4:junit4]   2> 10143 T180 oasc.RequestHandlers.initHandlersFromConfig created /update: solr.UpdateRequestHandler
[junit4:junit4]   2> 10144 T180 oasc.RequestHandlers.initHandlersFromConfig created /terms: org.apache.solr.handler.component.SearchHandler
[junit4:junit4]   2> 10145 T180 oasc.RequestHandlers.initHandlersFromConfig created spellCheckCompRH: org.apache.solr.handler.component.SearchHandler
[junit4:junit4]   2> 10145 T180 oasc.RequestHandlers.initHandlersFromConfig created spellCheckCompRH_Direct: org.apache.solr.handler.component.SearchHandler
[junit4:junit4]   2> 10146 T180 oasc.RequestHandlers.initHandlersFromConfig created spellCheckWithWordbreak: org.apache.solr.handler.component.SearchHandler
[junit4:junit4]   2> 10146 T180 oasc.RequestHandlers.initHandlersFromConfig created spellCheckWithWordbreak_Direct: org.apache.solr.handler.component.SearchHandler
[junit4:junit4]   2> 10147 T180 oasc.RequestHandlers.initHandlersFromConfig created spellCheckCompRH1: org.apache.solr.handler.component.SearchHandler
[junit4:junit4]   2> 10147 T180 oasc.RequestHandlers.initHandlersFromConfig created tvrh: org.apache.solr.handler.component.SearchHandler
[junit4:junit4]   2> 10148 T180 oasc.RequestHandlers.initHandlersFromConfig created /mlt: solr.MoreLikeThisHandler
[junit4:junit4]   2> 10148 T180 oasc.RequestHandlers.initHandlersFromConfig created /debug/dump: solr.DumpRequestHandler
[junit4:junit4]   2> 10152 T180 oashl.XMLLoader.init xsltCacheLifetimeSeconds=60
[junit4:junit4]   2> 10155 T180 oasc.SolrCore.initDeprecatedSupport WARNING solrconfig.xml uses deprecated <admin/gettableFiles>, Please update your config to use the ShowFileRequestHandler.
[junit4:junit4]   2> 10157 T180 oasc.SolrCore.initDeprecatedSupport WARNING adding ShowFileRequestHandler with hidden files: [SCHEMA.XML, OLD_SYNONYMS.TXT, STOPWORDS.TXT, PROTWORDS.TXT, OPEN-EXCHANGE-RATES.JSON, SYNONYMS.TXT, CURRENCY.XML, MAPPING-ISOLATIN1ACCENT.TXT]
[junit4:junit4]   2> 10160 T180 oass.SolrIndexSearcher.<init> Opening Searcher@7a6ffb64 main
[junit4:junit4]   2> 10161 T180 oasu.CommitTracker.<init> Hard AutoCommit: disabled
[junit4:junit4]   2> 10161 T180 oasu.CommitTracker.<init> Soft AutoCommit: disabled
[junit4:junit4]   2> 10162 T180 oashc.SpellCheckComponent.inform Initializing spell checkers
[junit4:junit4]   2> 10168 T180 oass.DirectSolrSpellChecker.init init: {name=direct,classname=DirectSolrSpellChecker,field=lowerfilt,minQueryLength=3}
[junit4:junit4]   2> 10212 T253 oasc.SolrCore.registerSearcher [collection1] Registered new searcher Searcher@7a6ffb64 main{StandardDirectoryReader(segments_1:1)}
[junit4:junit4]   2> 10618 T201 oascc.ZkStateReader.updateClusterState Updating cloud state from ZooKeeper... 
[junit4:junit4]   2> 10629 T214 oascc.ZkStateReader$2.process A cluster state change has occurred - updating...
[junit4:junit4]   2> 10629 T238 oascc.ZkStateReader$2.process A cluster state change has occurred - updating...
[junit4:junit4]   2> 10629 T200 oascc.ZkStateReader$2.process A cluster state change has occurred - updating...
[junit4:junit4]   2> 10629 T226 oascc.ZkStateReader$2.process A cluster state change has occurred - updating...
[junit4:junit4]   2> 10629 T252 oascc.ZkStateReader$2.process A cluster state change has occurred - updating...
[junit4:junit4]   2> 10719 T180 oasc.CoreContainer.register registering core: collection1
[junit4:junit4]   2> 10719 T180 oasc.ZkController.register Register shard - core:collection1 address:http://127.0.0.1:37439/solr shardId:shard2
[junit4:junit4]   2> 10723 T180 oasc.ZkController.register We are http://127.0.0.1:37439/solr/collection1/ and leader is http://127.0.0.1:37420/solr/collection1/
[junit4:junit4]   2> 10723 T180 oasc.ZkController.register No LogReplay needed for core=collection1 baseURL=http://127.0.0.1:37439/solr
[junit4:junit4]   2> 10723 T180 oasc.ZkController.checkRecovery Core needs to recover:collection1
[junit4:junit4]   2> 10724 T180 oasu.DefaultSolrCoreState.doRecovery Running recovery - first canceling any ongoing recovery
[junit4:junit4]   2> ASYNC  NEW_CORE C27 name=collection1 org.apache.solr.core.SolrCore@2499c773 url=http://127.0.0.1:37439/solr/collection1 node=127.0.0.1:37439_solr
[junit4:junit4]   2> 10725 T254 C27 P37439 oasc.RecoveryStrategy.run Starting recovery process.  core=collection1 recoveringAfterStartup=true
[junit4:junit4]   2> 10725 T254 C27 P37439 oasc.RecoveryStrategy.doRecovery ###### startupVersions=[]
[junit4:junit4]   2> 10725 T180 oascc.ZkStateReader.updateClusterState Updating cloud state from ZooKeeper... 
[junit4:junit4]   2> 10726 T180 oass.SolrDispatchFilter.init user.dir=/usr/home/hudson/hudson-slave/workspace/Lucene-Solr-Tests-trunk-java7/solr/build/solr-core/test/J1
[junit4:junit4]   2> 10727 T180 oass.SolrDispatchFilter.init SolrDispatchFilter.init() done
[junit4:junit4]   2> 10727 T254 C27 P37439 oasc.RecoveryStrategy.doRecovery Attempting to PeerSync from http://127.0.0.1:37420/solr/collection1/ core=collection1 - recoveringAfterStartup=true
[junit4:junit4]   2> 10728 T254 C27 P37439 oasu.PeerSync.sync PeerSync: core=collection1 url=http://127.0.0.1:37439/solr START replicas=[http://127.0.0.1:37420/solr/collection1/] nUpdates=100
[junit4:junit4]   2> 10727 T180 oascsi.HttpClientUtil.createClient Creating new http client, config:maxConnections=128&maxConnectionsPerHost=32&followRedirects=false
[junit4:junit4]   2> 10728 T254 C27 P37439 oasu.PeerSync.sync WARNING no frame of reference to tell of we've missed updates
[junit4:junit4]   2> 10728 T254 C27 P37439 oasc.RecoveryStrategy.doRecovery PeerSync Recovery was not successful - trying replication. core=collection1
[junit4:junit4]   2> 10729 T254 C27 P37439 oasc.RecoveryStrategy.doRecovery Starting Replication Recovery. core=collection1
[junit4:junit4]   2> 10729 T254 C27 P37439 oascsi.HttpClientUtil.createClient Creating new http client, config:maxConnections=128&maxConnectionsPerHost=32&followRedirects=false
[junit4:junit4]   2> ASYNC  NEW_CORE C28 name=collection1 org.apache.solr.core.SolrCore@6518c731 url=http://127.0.0.1:37420/solr/collection1 node=127.0.0.1:37420_solr
[junit4:junit4]   2> 10736 T218 C28 P37420 REQ /get {distrib=false&qt=/get&wt=javabin&version=2&getVersions=100} status=0 QTime=0 
[junit4:junit4]   2> 10751 T180 oaz.ZooKeeper.<init> Initiating client connection, connectString=127.0.0.1:37391/solr sessionTimeout=10000 watcher=org.apache.solr.common.cloud.ConnectionManager@4624b29a
[junit4:junit4]   2> 10752 T256 oaz.ClientCnxn$SendThread.startConnect Opening socket connection to server /127.0.0.1:37391
[junit4:junit4]   2> 10752 T180 oascc.ConnectionManager.waitForConnected Waiting for client to connect to ZooKeeper
[junit4:junit4]   2> 10753 T256 oaz.ClientCnxn$SendThread.primeConnection Socket connection established to localhost/127.0.0.1:37391, initiating session
[junit4:junit4]   2> 10753 T182 oazs.NIOServerCnxn$Factory.run Accepted socket connection from /140.211.11.196:37445
[junit4:junit4]   2> 10754 T182 oazs.NIOServerCnxn.readConnectRequest Client attempting to establish new session at /140.211.11.196:37445
[junit4:junit4]   2> 10755 T184 oazs.NIOServerCnxn.finishSessionInit Established session 0x139d624f0400007 with negotiated timeout 10000 for client /140.211.11.196:37445
[junit4:junit4]   2> 10755 T256 oaz.ClientCnxn$SendThread.readConnectResult Session establishment complete on server localhost/127.0.0.1:37391, sessionid = 0x139d624f0400007, negotiated timeout = 10000
[junit4:junit4]   2> 10755 T257 oascc.ConnectionManager.process Watcher org.apache.solr.common.cloud.ConnectionManager@4624b29a name:ZooKeeperConnection Watcher:127.0.0.1:37391/solr got event WatchedEvent state:SyncConnected type:None path:null path:null type:None
[junit4:junit4]   2> 10756 T180 oascc.ConnectionManager.waitForConnected Client is connected to ZooKeeper
[junit4:junit4]   2> 10756 T180 oascc.ZkStateReader.createClusterStateWatchersAndUpdate Updating cluster state from ZooKeeper... 
[junit4:junit4]   2> 10760 T180 oasc.ChaosMonkey.monkeyLog monkey: init - expire sessions:true cause connection loss:true
[junit4:junit4]   2> 10760 T180 oascsi.HttpClientUtil.createClient Creating new http client, config:
[junit4:junit4]   2> 10770 T180 oascc.ZkStateReader.updateClusterState Updating cloud state from ZooKeeper... 
[junit4:junit4]   2> ASYNC  NEW_CORE C29 name=collection1 org.apache.solr.core.SolrCore@6316e085 url=http://127.0.0.1:37397/solr/collection1 node=127.0.0.1:37397_solr
[junit4:junit4]   2> 10789 T192 C29 P37397 oascsi.HttpClientUtil.createClient Creating new http client, config:maxConnections=500&maxConnectionsPerHost=16
[junit4:junit4]   2> 10805 T192 C29 P37397 oasc.SolrDeletionPolicy.onInit SolrDeletionPolicy.onInit: commits:num=1
[junit4:junit4]   2> 		commit{dir=NRTCachingDirectory(org.apache.lucene.store.NIOFSDirectory@/usr/home/hudson/hudson-slave/workspace/Lucene-Solr-Tests-trunk-java7/solr/build/solr-core/test/J1/org.apache.solr.cloud.BasicDistributedZk2Test-1347917508319/control/data/index lockFactory=org.apache.lucene.store.NativeFSLockFactory@3392aed7; maxCacheMB=48.0 maxMergeSizeMB=4.0),segFN=segments_1,generation=1,filenames=[segments_1]
[junit4:junit4]   2> 10805 T192 C29 P37397 oasc.SolrDeletionPolicy.updateCommits newest commit = 1
[junit4:junit4]   2> 10811 T192 C29 P37397 /update {wt=javabin&version=2} {add=[1 (1413393960524578816)]} 0 32
[junit4:junit4]   2> 10812 T180 oaz.ZooKeeper.<init> Initiating client connection, connectString=127.0.0.1:37391/solr sessionTimeout=10000 watcher=org.apache.solr.common.cloud.ConnectionManager@4067eeca
[junit4:junit4]   2> 10813 T258 oaz.ClientCnxn$SendThread.startConnect Opening socket connection to server /127.0.0.1:37391
[junit4:junit4]   2> 10813 T180 oascc.ConnectionManager.waitForConnected Waiting for client to connect to ZooKeeper
[junit4:junit4]   2> 10814 T258 oaz.ClientCnxn$SendThread.primeConnection Socket connection established to localhost/127.0.0.1:37391, initiating session
[junit4:junit4]   2> 10814 T182 oazs.NIOServerCnxn$Factory.run Accepted socket connection from /140.211.11.196:37451
[junit4:junit4]   2> 10814 T182 oazs.NIOServerCnxn.readConnectRequest Client attempting to establish new session at /140.211.11.196:37451
[junit4:junit4]   2> 10815 T184 oazs.NIOServerCnxn.finishSessionInit Established session 0x139d624f0400008 with negotiated timeout 10000 for client /140.211.11.196:37451
[junit4:junit4]   2> 10815 T258 oaz.ClientCnxn$SendThread.readConnectResult Session establishment complete on server localhost/127.0.0.1:37391, sessionid = 0x139d624f0400008, negotiated timeout = 10000
[junit4:junit4]   2> 10816 T259 oascc.ConnectionManager.process Watcher org.apache.solr.common.cloud.ConnectionManager@4067eeca name:ZooKeeperConnection Watcher:127.0.0.1:37391/solr got event WatchedEvent state:SyncConnected type:None path:null path:null type:None
[junit4:junit4]   2> 10816 T180 oascc.ConnectionManager.waitForConnected Client is connected to ZooKeeper
[junit4:junit4]   2> 10817 T180 oascc.ZkStateReader.createClusterStateWatchersAndUpdate Updating cluster state from ZooKeeper... 
[junit4:junit4]   2> 10864 T208 C26 P37408 oasc.SolrDeletionPolicy.onInit SolrDeletionPolicy.onInit: commits:num=1
[junit4:junit4]   2> 		commit{dir=NRTCachingDirectory(org.apache.lucene.store.NIOFSDirectory@/usr/home/hudson/hudson-slave/workspace/Lucene-Solr-Tests-trunk-java7/solr/build/solr-core/test/J1/org.apache.solr.cloud.BasicDistributedZk2Test-1347917508319/jetty1/index lockFactory=org.apache.lucene.store.NativeFSLockFactory@6fd45b15; maxCacheMB=48.0 maxMergeSizeMB=4.0),segFN=segments_1,generation=1,filenames=[segments_1]
[junit4:junit4]   2> 10864 T208 C26 P37408 oasc.SolrDeletionPolicy.updateCommits newest commit = 1
[junit4:junit4]   2>  C25_STATE=coll:collection1 core:collection1 props:{shard=shard1, roles=null, state=recovering, core=collection1, collection=collection1, node_name=127.0.0.1:37430_solr, base_url=http://127.0.0.1:37430/solr}
[junit4:junit4]   2> 10881 T230 C25 P37430 oasc.SolrDeletionPolicy.onInit SolrDeletionPolicy.onInit: commits:num=1
[junit4:junit4]   2> 		commit{dir=NRTCachingDirectory(org.apache.lucene.store.NIOFSDirectory@/usr/home/hudson/hudson-slave/workspace/Lucene-Solr-Tests-trunk-java7/solr/build/solr-core/test/J1/org.apache.solr.cloud.BasicDistributedZk2Test-1347917508319/jetty3/index lockFactory=org.apache.lucene.store.NativeFSLockFactory@5c620819; maxCacheMB=48.0 maxMergeSizeMB=4.0),segFN=segments_1,generation=1,filenames=[segments_1]
[junit4:junit4]   2> 10881 T230 C25 P37430 oasc.SolrDeletionPolicy.updateCommits newest commit = 1
[junit4:junit4]   2> 10887 T230 C25 P37430 REQ /update {update.distrib=FROMLEADER&distrib.from=http://127.0.0.1:37408/solr/collection1/&wt=javabin&version=2} status=0 QTime=10 
[junit4:junit4]   2> 10887 T208 C26 P37408 REQ /update {distrib.from=http://127.0.0.1:37420/solr/collection1/&update.distrib=TOLEADER&wt=javabin&version=2} status=0 QTime=27 
[junit4:junit4]   2> 10888 T220 C28 P37420 /update {wt=javabin&version=2} {add=[1]} 0 67
[junit4:junit4]   2> 10889 T180 oasc.AbstractDistribZkTestBase.waitForRecoveriesToFinish Wait for recoveries to finish - collection: collection1 failOnTimeout:true timeout (sec):1800
[junit4:junit4]   2> 10890 T180 oascc.ZkStateReader.updateClusterState Updating cloud state from ZooKeeper... 
[junit4:junit4]   2> 11117 T240 C25 P37430 oasc.RecoveryStrategy.doRecovery Begin buffering updates. core=collection1
[junit4:junit4]   2> 11117 T240 C25 P37430 oasu.UpdateLog.bufferUpdates Starting to buffer updates. FSUpdateLog{state=ACTIVE, tlog=tlog{file=./org.apache.solr.cloud.BasicDistributedZk2Test-1347917508319/jetty3/tlog/tlog.0000000000000000000 refcount=1}}
[junit4:junit4]   2> 11117 T240 C25 P37430 oasc.RecoveryStrategy.replicate Attempting to replicate from http://127.0.0.1:37408/solr/collection1/. core=collection1
[junit4:junit4]   2> 11117 T240 C25 P37430 oascsi.HttpClientUtil.createClient Creating new http client, config:maxConnections=128&maxConnectionsPerHost=32&followRedirects=false
[junit4:junit4]   2> 11133 T209 C26 P37408 oasu.DirectUpdateHandler2.commit start commit{flags=0,_version_=0,optimize=false,openSearcher=true,waitSearcher=true,expungeDeletes=false,softCommit=false}
[junit4:junit4]   2> 11144 T201 oascc.ZkStateReader.updateClusterState Updating cloud state from ZooKeeper... 
[junit4:junit4]   2> 11172 T238 oascc.ZkStateReader$2.process A cluster state change has occurred - updating...
[junit4:junit4]   2> 11172 T200 oascc.ZkStateReader$2.process A cluster state change has occurred - updating...
[junit4:junit4]   2> 11172 T257 oascc.ZkStateReader$2.process A cluster state change has occurred - updating...
[junit4:junit4]   2> 11172 T214 oascc.ZkStateReader$2.process A cluster state change has occurred - updating...
[junit4:junit4]   2> 11172 T226 oascc.ZkStateReader$2.process A cluster state change has occurred - updating...
[junit4:junit4]   2> 11172 T252 oascc.ZkStateReader$2.process A cluster state change has occurred - updating...
[junit4:junit4]   2> 11172 T259 oascc.ZkStateReader$2.process A cluster state change has occurred - updating...
[junit4:junit4]   2> 11201 T209 C26 P37408 oasc.SolrDeletionPolicy.onCommit SolrDeletionPolicy.onCommit: commits:num=2
[junit4:junit4]   2> 		commit{dir=NRTCachingDirectory(org.apache.lucene.store.NIOFSDirectory@/usr/home/hudson/hudson-slave/workspace/Lucene-Solr-Tests-trunk-java7/solr/build/solr-core/test/J1/org.apache.solr.cloud.BasicDistributedZk2Test-1347917508319/jetty1/index lockFactory=org.apache.lucene.store.NativeFSLockFactory@6fd45b15; maxCacheMB=48.0 maxMergeSizeMB=4.0),segFN=segments_1,generation=1,filenames=[segments_1]
[junit4:junit4]   2> 		commit{dir=NRTCachingDirectory(org.apache.lucene.store.NIOFSDirectory@/usr/home/hudson/hudson-slave/workspace/Lucene-Solr-Tests-trunk-java7/solr/build/solr-core/test/J1/org.apache.solr.cloud.BasicDistributedZk2Test-1347917508319/jetty1/index lockFactory=org.apache.lucene.store.NativeFSLockFactory@6fd45b15; maxCacheMB=48.0 maxMergeSizeMB=4.0),segFN=segments_2,generation=2,filenames=[_0.fnm, _0.frq, _0.tim, _0_nrm.cfe, segments_2, _0.fdx, _0_nrm.cfs, _0.si, _0.prx, _0.tip, _0.fdt]
[junit4:junit4]   2> 11202 T209 C26 P37408 oasc.SolrDeletionPolicy.updateCommits newest commit = 2
[junit4:junit4]   2> 11210 T209 C26 P37408 oass.SolrIndexSearcher.<init> Opening Searcher@361f7de2 main
[junit4:junit4]   2> 11211 T209 C26 P37408 oasu.DirectUpdateHandler2.commit end_commit_flush
[junit4:junit4]   2> 11212 T215 oasc.SolrCore.registerSearcher [collection1] Registered new searcher Searcher@361f7de2 main{StandardDirectoryReader(segments_2:3 _0(5.0):C1)}
[junit4:junit4]   2> 11213 T209 C26 P37408 /update {waitSearcher=true&commit=true&commit_end_point=true&wt=javabin&softCommit=false&version=2} {commit=} 0 80
[junit4:junit4]   2> 11257 T240 C25 P37430 oash.ReplicationHandler.inform Commits will be reserved for  10000
[junit4:junit4]   2> 11257 T240 C25 P37430 oascsi.HttpClientUtil.createClient Creating new http client, config:connTimeout=5000&socketTimeout=20000&allowCompression=false&maxConnections=10000&maxConnectionsPerHost=10000
[junit4:junit4]   2> 11277 T240 C25 P37430 oash.SnapPuller.<init>  No value set for 'pollInterval'. Timer Task not started.
[junit4:junit4]   2> 11279 T210 C26 P37408 oash.ReplicationHandler.inform Commits will be reserved for  10000
[junit4:junit4]   2> 11280 T210 C26 P37408 REQ /replication {command=indexversion&wt=javabin&qt=/replication&version=2} status=0 QTime=2 
[junit4:junit4]   2> 11281 T240 C25 P37430 oash.SnapPuller.fetchLatestIndex Master's generation: 2
[junit4:junit4]   2> 11281 T240 C25 P37430 oash.SnapPuller.fetchLatestIndex Slave's generation: 1
[junit4:junit4]   2> 11281 T240 C25 P37430 oash.SnapPuller.fetchLatestIndex Starting replication process
[junit4:junit4]   2> 11285 T210 C26 P37408 REQ /replication {command=filelist&generation=2&wt=javabin&qt=/replication&version=2} status=0 QTime=1 
[junit4:junit4]   2> 11286 T240 C25 P37430 oash.SnapPuller.fetchLatestIndex Number of files in latest index in master: 11
[junit4:junit4]   2> 11289 T240 C25 P37430 oash.SnapPuller.fetchLatestIndex Starting download to ./org.apache.solr.cloud.BasicDistributedZk2Test-1347917508319/jetty3/index.20120918090159601 fullCopy=true
[junit4:junit4]   2> 11303 T210 C26 P37408 REQ /replication {file=_0.fnm&command=filecontent&checksum=true&generation=2&qt=/replication&wt=filestream} status=0 QTime=7 
[junit4:junit4]   2> 11318 T210 C26 P37408 REQ /replication {file=_0_nrm.cfe&command=filecontent&checksum=true&generation=2&qt=/replication&wt=filestream} status=0 QTime=1 
[junit4:junit4]   2> 11322 T210 C26 P37408 REQ /replication {file=_0.tim&command=filecontent&checksum=true&generation=2&qt=/replication&wt=filestream} status=0 QTime=0 
[junit4:junit4]   2> 11327 T210 C26 P37408 REQ /replication {file=_0.frq&command=filecontent&checksum=true&generation=2&qt=/replication&wt=filestream} status=0 QTime=0 
[junit4:junit4]   2> 11331 T210 C26 P37408 REQ /replication {file=segments_2&command=filecontent&checksum=true&generation=2&qt=/replication&wt=filestream} status=0 QTime=0 
[junit4:junit4]   2> 11335 T210 C26 P37408 REQ /replication {file=_0.fdx&command=filecontent&checksum=true&generation=2&qt=/replication&wt=filestream} status=0 QTime=0 
[junit4:junit4]   2> 11339 T210 C26 P37408 REQ /replication {file=_0_nrm.cfs&command=filecontent&checksum=true&generation=2&qt=/replication&wt=filestream} status=0 QTime=0 
[junit4:junit4]   2> 11344 T210 C26 P37408 REQ /replication {file=_0.si&command=filecontent&checksum=true&generation=2&qt=/replication&wt=filestream} status=0 QTime=0 
[junit4:junit4]   2> 11351 T210 C26 P37408 REQ /replication {file=_0.tip&command=filecontent&checksum=true&generation=2&qt=/replication&wt=filestream} status=0 QTime=0 
[junit4:junit4]   2> 11356 T210 C26 P37408 REQ /replication {file=_0.prx&command=filecontent&checksum=true&generation=2&qt=/replication&wt=filestream} status=0 QTime=0 
[junit4:junit4]   2> 11360 T210 C26 P37408 REQ /replication {file=_0.fdt&command=filecontent&checksum=true&generation=2&qt=/replication&wt=filestream} status=0 QTime=0 
[junit4:junit4]   2> 11362 T240 C25 P37430 oash.SnapPuller.fetchLatestIndex Total time taken for download : 0 secs
[junit4:junit4]   2> 11362 T240 C25 P37430 oash.SnapPuller.modifyIndexProps New index installed. Updating index properties... index=index.20120918090159601
[junit4:junit4]   2> 11371 T240 C25 P37430 oasu.DefaultSolrCoreState.newIndexWriter Creating new IndexWriter...
[junit4:junit4]   2> 11371 T240 C25 P37430 oasu.DefaultSolrCoreState.newIndexWriter Waiting until IndexWriter is unused... core=collection1
[junit4:junit4]   2> 11371 T240 C25 P37430 oasu.DefaultSolrCoreState.newIndexWriter Rollback old IndexWriter... core=collection1
[junit4:junit4]   2> 11374 T240 C25 P37430 oasc.SolrCore.getNewIndexDir WARNING New index directory detected: old=./org.apache.solr.cloud.BasicDistributedZk2Test-1347917508319/jetty3/index/ new=./org.apache.solr.cloud.BasicDistributedZk2Test-1347917508319/jetty3/index.20120918090159601
[junit4:junit4]   2> 11375 T240 C25 P37430 oasc.CachingDirectoryFactory.get return new directory for /usr/home/hudson/hudson-slave/workspace/Lucene-Solr-Tests-trunk-java7/solr/build/solr-core/test/J1/./org.apache.solr.cloud.BasicDistributedZk2Test-1347917508319/jetty3/index.20120918090159601 forceNew:true
[junit4:junit4]   2> 11380 T240 C25 P37430 oasc.SolrDeletionPolicy.onInit SolrDeletionPolicy.onInit: commits:num=1
[junit4:junit4]   2> 		commit{dir=NRTCachingDirectory(org.apache.lucene.store.NIOFSDirectory@/usr/home/hudson/hudson-slave/workspace/Lucene-Solr-Tests-trunk-java7/solr/build/solr-core/test/J1/org.apache.solr.cloud.BasicDistributedZk2Test-1347917508319/jetty3/index.20120918090159601 lockFactory=org.apache.lucene.store.NativeFSLockFactory@4613b85f; maxCacheMB=48.0 maxMergeSizeMB=4.0),segFN=segments_2,generation=2,filenames=[_0.fnm, _0_nrm.cfe, _0.tim, _0.frq, segments_2, _0.fdx, _0_nrm.cfs, _0.si, _0.tip, _0.prx, _0.fdt]
[junit4:junit4]   2> 11380 T240 C25 P37430 oasc.SolrDeletionPolicy.updateCommits newest commit = 2
[junit4:junit4]   2> 11381 T240 C25 P37430 oasu.DefaultSolrCoreState.newIndexWriter New IndexWriter is ready to be used.
[junit4:junit4]   2> 11384 T240 C25 P37430 oass.SolrIndexSearcher.<init> Opening Searcher@6d2fc1ac main
[junit4:junit4]   2> 11386 T239 oasc.SolrCore.registerSearcher [collection1] Registered new searcher Searcher@6d2fc1ac main{StandardDirectoryReader(segments_2:3:nrt _0(5.0):C1)}
[junit4:junit4]   2> 11386 T239 oasc.CachingDirectoryFactory.close Closing directory:/usr/home/hudson/hudson-slave/workspace/Lucene-Solr-Tests-trunk-java7/solr/build/solr-core/test/J1/./org.apache.solr.cloud.BasicDistributedZk2Test-1347917508319/jetty3/index
[junit4:junit4]   2> 11386 T239 oash.SnapPuller$2.onClose removing old index directory ./org.apache.solr.cloud.BasicDistributedZk2Test-1347917508319/jetty3/index
[junit4:junit4]   2> 11388 T240 C25 P37430 oasu.DirectUpdateHandler2.commit start commit{flags=0,_version_=0,optimize=false,openSearcher=false,waitSearcher=false,expungeDeletes=false,softCommit=false}
[junit4:junit4]   2> 11389 T240 C25 P37430 oasu.DirectUpdateHandler2.commit end_commit_flush
[junit4:junit4]   2> 11389 T240 C25 P37430 oasc.RecoveryStrategy.replay Replaying buffered documents. core=collection1
[junit4:junit4]   2> 11389 T263 C25 P37430 oasu.UpdateLog$LogReplayer.doReplay WARNING Starting log replay tlog{file=./org.apache.solr.cloud.BasicDistributedZk2Test-1347917508319/jetty3/tlog/tlog.0000000000000000000 refcount=2} active=true starting pos=430
[junit4:junit4]   2> 11389 T263 C25 P37430 oasu.DirectUpdateHandler2.commit start commit{flags=2,_version_=0,optimize=false,openSearcher=true,waitSearcher=true,expungeDeletes=false,softCommit=false}
[junit4:junit4]   2> 11391 T263 C25 P37430 oass.SolrIndexSearcher.<init> Opening Searcher@407dcb1e main
[junit4:junit4]   2> 11391 T263 C25 P37430 oasu.DirectUpdateHandler2.commit end_commit_flush
[junit4:junit4]   2> 11393 T239 oasc.SolrCore.registerSearcher [collection1] Registered new searcher Searcher@407dcb1e main{StandardDirectoryReader(segments_2:3:nrt _0(5.0):C1)}
[junit4:junit4]   2> 11393 T263 C25 P37430 oasu.UpdateLog$LogReplayer.run WARNING Log replay finished. recoveryInfo=RecoveryInfo{adds=0 deletes=0 deleteByQuery=0 errors=0 positionOfStart=430}
[junit4:junit4]   2> 11393 T240 C25 P37430 oasc.RecoveryStrategy.doRecovery Replication Recovery was successful - registering as Active. core=collection1
[junit4:junit4]   2> 11395 T240 C25 P37430 oasc.RecoveryStrategy.doRecovery Finished recovery process. core=collection1
[junit4:junit4]   2> 11686 T201 oascc.ZkStateReader.updateClusterState Updating cloud state from ZooKeeper... 
[junit4:junit4]   2> 11721 T214 oascc.ZkStateReader$2.process A cluster state change has occurred - updating...
[junit4:junit4]   2> 11725 T200 oascc.ZkStateReader$2.process A cluster state change has occurred - updating...
[junit4:junit4]   2> 11725 T252 oascc.ZkStateReader$2.process A cluster state change has occurred - updating...
[junit4:junit4]   2> 11725 T259 oascc.ZkStateReader$2.process A cluster state change has occurred - updating...
[junit4:junit4]   2> 11725 T238 oascc.ZkStateReader$2.process A cluster state change has occurred - updating...
[junit4:junit4]   2> 11725 T257 oascc.ZkStateReader$2.process A cluster state change has occurred - updating...
[junit4:junit4]   2> 11725 T226 oascc.ZkStateReader$2.process A cluster state change has occurred - updating...
[junit4:junit4]   2> 11892 T180 oascc.ZkStateReader.updateClusterState Updating cloud state from ZooKeeper... 
[junit4:junit4]   2> 12896 T180 oascc.ZkStateReader.updateClusterState Updating cloud state from ZooKeeper... 
[junit4:junit4]   2>  C27_STATE=coll:collection1 core:collection1 props:{shard=shard2, roles=null, state=recovering, core=collection1, collection=collection1, node_name=127.0.0.1:37439_solr, base_url=http://127.0.0.1:37439/solr}
[junit4:junit4]   2> 13751 T254 C27 P37439 oasc.RecoveryStrategy.doRecovery Begin buffering updates. core=collection1
[junit4:junit4]   2> 13751 T254 C27 P37439 oasu.UpdateLog.bufferUpdates Starting to buffer updates. FSUpdateLog{state=ACTIVE, tlog=null}
[junit4:junit4]   2> 13751 T254 C27 P37439 oasc.RecoveryStrategy.replicate Attempting to replicate from http://127.0.0.1:37420/solr/collection1/. core=collection1
[junit4:junit4]   2> 13752 T254 C27 P37439 oascsi.HttpClientUtil.createClient Creating new http client, config:maxConnections=128&maxConnectionsPerHost=32&followRedirects=false
[junit4:junit4]   2> 13774 T221 C28 P37420 oasu.DirectUpdateHandler2.commit start commit{flags=0,_version_=0,optimize=false,openSearcher=true,waitSearcher=true,expungeDeletes=false,softCommit=false}
[junit4:junit4]   2> 13778 T221 C28 P37420 oasc.SolrDeletionPolicy.onInit SolrDeletionPolicy.onInit: commits:num=1
[junit4:junit4]   2> 		commit{dir=NRTCachingDirectory(org.apache.lucene.store.NIOFSDirectory@/usr/home/hudson/hudson-slave/workspace/Lucene-Solr-Tests-trunk-java7/solr/build/solr-core/test/J1/org.apache.solr.cloud.BasicDistributedZk2Test-1347917508319/jetty2/index lockFactory=org.apache.lucene.store.NativeFSLockFactory@5d6a32f1; maxCacheMB=48.0 maxMergeSizeMB=4.0),segFN=segments_1,generation=1,filenames=[segments_1]
[junit4:junit4]   2> 13778 T221 C28 P37420 oasc.SolrDeletionPolicy.updateCommits newest commit = 1
[junit4:junit4]   2> 13780 T221 C28 P37420 oass.SolrIndexSearcher.<init> Opening Searcher@36b2c1c1 main
[junit4:junit4]   2> 13780 T221 C28 P37420 oasu.DirectUpdateHandler2.commit end_commit_flush
[junit4:junit4]   2> 13781 T227 oasc.SolrCore.registerSearcher [collection1] Registered new searcher Searcher@36b2c1c1 main{StandardDirectoryReader(segments_1:1)}
[junit4:junit4]   2> 13782 T221 C28 P37420 /update {waitSearcher=true&commit=true&commit_end_point=true&wt=javabin&softCommit=false&version=2} {commit=} 0 8
[junit4:junit4]   2> 13783 T254 C27 P37439 oash.ReplicationHandler.inform Commits will be reserved for  10000
[junit4:junit4]   2> 13788 T254 C27 P37439 oash.SnapPuller.<init>  No value set for 'pollInterval'. Timer Task not started.
[junit4:junit4]   2> 13790 T222 C28 P37420 oash.ReplicationHandler.inform Commits will be reserved for  10000
[junit4:junit4]   2> 13790 T222 C28 P37420 REQ /replication {command=indexversion&wt=javabin&qt=/replication&version=2} status=0 QTime=0 
[junit4:junit4]   2> 13795 T254 C27 P37439 oasc.SolrDeletionPolicy.onInit SolrDeletionPolicy.onInit: commits:num=1
[junit4:junit4]   2> 		commit{dir=NRTCachingDirectory(org.apache.lucene.store.NIOFSDirectory@/usr/home/hudson/hudson-slave/workspace/Lucene-Solr-Tests-trunk-java7/solr/build/solr-core/test/J1/org.apache.solr.cloud.BasicDistributedZk2Test-1347917508319/jetty4/index lockFactory=org.apache.lucene.store.NativeFSLockFactory@59ac902c; maxCacheMB=48.0 maxMergeSizeMB=4.0),segFN=segments_1,generation=1,filenames=[segments_1]
[junit4:junit4]   2> 13796 T254 C27 P37439 oasc.SolrDeletionPolicy.updateCommits newest commit = 1
[junit4:junit4]   2> 13796 T254 C27 P37439 oasu.DirectUpdateHandler2.commit start commit{flags=0,_version_=0,optimize=false,openSearcher=true,waitSearcher=true,expungeDeletes=false,softCommit=false}
[junit4:junit4]   2> 13806 T254 C27 P37439 oasc.SolrDeletionPolicy.onCommit SolrDeletionPolicy.onCommit: commits:num=2
[junit4:junit4]   2> 		commit{dir=NRTCachingDirectory(org.apache.lucene.store.NIOFSDirectory@/usr/home/hudson/hudson-slave/workspace/Lucene-Solr-Tests-trunk-java7/solr/build/solr-core/test/J1/org.apache.solr.cloud.BasicDistributedZk2Test-1347917508319/jetty4/index lockFactory=org.apache.lucene.store.NativeFSLockFactory@59ac902c; maxCacheMB=48.0 maxMergeSizeMB=4.0),segFN=segments_1,generation=1,filenames=[segments_1]
[junit4:junit4]   2> 		commit{dir=NRTCachingDirectory(org.apache.lucene.store.NIOFSDirectory@/usr/home/hudson/hudson-slave/workspace/Lucene-Solr-Tests-trunk-java7/solr/build/solr-core/test/J1/org.apache.solr.cloud.BasicDistributedZk2Test-1347917508319/jetty4/index lockFactory=org.apache.lucene.store.NativeFSLockFactory@59ac902c; maxCacheMB=48.0 maxMergeSizeMB=4.0),segFN=segments_2,generation=2,filenames=[segments_2]
[junit4:junit4]   2> 13807 T254 C27 P37439 oasc.SolrDeletionPolicy.updateCommits newest commit = 2
[junit4:junit4]   2> 13810 T254 C27 P37439 oass.SolrIndexSearcher.<init> Opening Searcher@3f78aa8c main
[junit4:junit4]   2> 13811 T254 C27 P37439 oasu.DirectUpdateHandler2.commit end_commit_flush
[junit4:junit4]   2> 13812 T253 oasc.SolrCore.registerSearcher [collection1] Registered new searcher Searcher@3f78aa8c main{StandardDirectoryReader(segments_2:2)}
[junit4:junit4]   2> 13812 T254 C27 P37439 oasc.RecoveryStrategy.replay No replay needed. core=collection1
[junit4:junit4]   2> 13813 T254 C27 P37439 oasc.RecoveryStrategy.doRecovery Replication Recovery was successful - registering as Active. core=collection1
[junit4:junit4]   2> 13814 T254 C27 P37439 oasc.RecoveryStrategy.doRecovery Finished recovery process. core=collection1
[junit4:junit4]   2> 13898 T180 oascc.ZkStateReader.updateClusterState Updating cloud state from ZooKeeper... 
[junit4:junit4]   2> 14241 T201 oascc.ZkStateReader.updateClusterState Updating cloud state from ZooKeeper... 
[junit4:junit4]   2> 14255 T238 oascc.ZkStateReader$2.process A cluster state change has occurred - updating...
[junit4:junit4]   2> 14255 T214 oascc.ZkStateReader$2.process A cluster state change has occurred - updating...
[junit4:junit4]   2> 14255 T252 oascc.ZkStateReader$2.process A cluster state change has occurred - updating...
[junit4:junit4]   2> 14255 T226 oascc.ZkStateReader$2.process A cluster state change has occurred - updating...
[junit4:junit4]   2> 14255 T257 oascc.ZkStateReader$2.process A cluster state change has occurred - updating...
[junit4:junit4]   2> 14255 T259 oascc.ZkStateReader$2.process A cluster state change has occurred - updating...
[junit4:junit4]   2> 14255 T200 oascc.ZkStateReader$2.process A cluster state change has occurred - updating...
[junit4:junit4]   2> 14902 T180 oascc.ZkStateReader.updateClusterState Updating cloud state from ZooKeeper... 
[junit4:junit4]   2> 14906 T192 C29 P37397 oasu.DirectUpdateHandler2.commit start commit{flags=0,_version_=0,optimize=false,openSearcher=true,waitSearcher=true,expungeDeletes=false,softCommit=false}
[junit4:junit4]   2> 14952 T192 C29 P37397 oasc.SolrDeletionPolicy.onCommit SolrDeletionPolicy.onCommit: commits:num=2
[junit4:junit4]   2> 		commit{dir=NRTCachingDirectory(org.apache.lucene.store.NIOFSDirectory@/usr/home/hudson/hudson-slave/workspace/Lucene-Solr-Tests-trunk-java7/solr/build/solr-core/test/J1/org.apache.solr.cloud.BasicDistributedZk2Test-1347917508319/control/data/index lockFactory=org.apache.lucene.store.NativeFSLockFactory@3392aed7; maxCacheMB=48.0 maxMergeSizeMB=4.0),segFN=segments_1,generation=1,filenames=[segments_1]
[junit4:junit4]   2> 		commit{dir=NRTCachingDirectory(org.apache.lucene.store.NIOFSDirectory@/usr/home/hudson/hudson-slave/workspace/Lucene-Solr-Tests-trunk-java7/solr/build/solr-core/test/J1/org.apache.solr.cloud.BasicDistributedZk2Test-1347917508319/control/data/index lockFactory=org.apache.lucene.store.NativeFSLockFactory@3392aed7; maxCacheMB=48.0 maxMergeSizeMB=4.0),segFN=segments_2,generation=2,filenames=[_0.fnm, _0.frq, _0.tim, _0_nrm.cfe, segments_2, _0.fdx, _0_nrm.cfs, _0.si, _0.prx, _0.tip, _0.fdt]
[junit4:junit4]   2> 14952 T192 C29 P37397 oasc.SolrDeletionPolicy.updateCommits newest commit = 2
[junit4:junit4]   2> 14966 T192 C29 P37397 oass.SolrIndexSearcher.<init> Opening Searcher@56401d7e main
[junit4:junit4]   2> 14967 T192 C29 P37397 oasu.DirectUpdateHandler2.commit end_commit_flush
[junit4:junit4]   2> 14968 T203 oasc.SolrCore.registerSearcher [collection1] Registered new searcher Searcher@56401d7e main{StandardDirectoryReader(segments_2:3 _0(5.0):C1)}
[junit4:junit4]   2> 14969 T192 C29 P37397 /update {waitSearcher=true&wt=javabin&commit=true&softCommit=false&version=2} {commit=} 0 64
[junit4:junit4]   2> 14972 T220 C28 P37420 oasu.DirectUpdateHandler2.commit start commit{flags=0,_version_=0,optimize=false,openSearcher=true,waitSearcher=true,expungeDeletes=false,softCommit=false}
[junit4:junit4]   2> 14976 T220 C28 P37420 oass.SolrIndexSearcher.<init> Opening Searcher@44ea1a45 main
[junit4:junit4]   2> 14977 T220 C28 P37420 oasu.DirectUpdateHandler2.commit end_commit_flush
[junit4:junit4]   2> 14978 T227 oasc.SolrCore.registerSearcher [collection1] Registered new searcher Searcher@44ea1a45 main{StandardDirectoryReader(segments_1:1)}
[junit4:junit4]   2> 14979 T220 C28 P37420 oasu.SolrCmdDistributor.distribCommit Distrib commit to:[StdNode: http://127.0.0.1:37408/solr/collection1/, StdNode: http://127.0.0.1:37430/solr/collection1/, StdNode: http://127.0.0.1:37439/solr/collection1/]
[junit4:junit4]   2> 14983 T208 C26 P37408 oasu.DirectUpdateHandler2.commit start commit{flags=0,_version_=0,optimize=false,openSearcher=true,waitSearcher=true,expungeDeletes=false,softCommit=false}
[junit4:junit4]   2>  C25_STATE=coll:collection1 core:collection1 props:{shard=shard1, roles=null, state=active, core=collection1, collection=collection1, node_name=127.0.0.1:37430_solr, base_url=http://127.0.0.1:37430/solr}
[junit4:junit4]   2> 14983 T230 C25 P37430 oasu.DirectUpdateHandler2.commit start commit{flags=0,_version_=0,optimize=false,openSearcher=true,waitSearcher=true,expungeDeletes=false,softCommit=false}
[junit4:junit4]   2> 14986 T230 C25 P37430 oass.SolrIndexSearcher.<init> Opening Searcher@7ae9dc0f main
[junit4:junit4]   2> 14986 T230 C25 P37430 oasu.DirectUpdateHandler2.commit end_commit_flush
[junit4:junit4]   2> 14988 T239 oasc.SolrCore.registerSearcher [collection1] Registered new searcher Searcher@7ae9dc0f main{StandardDirectoryReader(segments_2:3:nrt _0(5.0):C1)}
[junit4:junit4]   2> 14989 T230 C25 P37430 /update {waitSearcher=true&commit=true&wt=javabin&commit_end_point=true&expungeDeletes=false&softCommit=false&version=2} {commit=} 0 6
[junit4:junit4]   2> 14991 T208 C26 P37408 oass.SolrIndexSearcher.<init> Opening Searcher@26b88336 main
[junit4:junit4]   2> 14992 T208 C26 P37408 oasu.DirectUpdateHandler2.commit end_commit_flush
[junit4:junit4]   2>  C27_STATE=coll:collection1 core:collection1 props:{shard=shard2, roles=null, state=active, core=collection1, collection=collection1, node_name=127.0.0.1:37439_solr, base_url=http://127.0.0.1:37439/solr}
[junit4:junit4]   2> 14992 T244 C27 P37439 oasu.DirectUpdateHandler2.commit start commit{flags=0,_version_=0,optimize=false,openSearcher=true,waitSearcher=true,expungeDeletes=false,softCommit=false}
[junit4:junit4]   2> 14993 T215 oasc.SolrCore.registerSearcher [collection1] Registered new searcher Searcher@26b88336 main{StandardDirectoryReader(segments_2:3 _0(5.0):C1)}
[junit4:junit4]   2> 14994 T208 C26 P37408 /update {waitSearcher=true&commit=true&wt=javabin&commit_end_point=true&expungeDeletes=false&softCommit=false&version=2} {commit=} 0 11
[junit4:junit4]   2> 14996 T244 C27 P37439 oass.SolrIndexSearcher.<init> Opening Searcher@4c8006cb main
[junit4:junit4]   2> 14997 T244 C27 P37439 oasu.DirectUpdateHandler2.commit end_commit_flush
[junit4:junit4]   2> 14998 T253 oasc.SolrCore.registerSearcher [collection1] Registered new searcher Searcher@4c8006cb main{StandardDirectoryReader(segments_2:2)}
[junit4:junit4]   2> 14999 T244 C27 P37439 /update {waitSearcher=true&commit=true&wt=javabin&commit_end_point=true&expungeDeletes=false&softCommit=false&version=2} {commit=} 0 7
[junit4:junit4]   2> 15000 T220 C28 P37420 /update {waitSearcher=true&wt=javabin&commit=true&softCommit=false&version=2} {commit=} 0 28
[junit4:junit4]   2> 15006 T193 C29 P37397 REQ /select {fl=id,score&shard.url=127.0.0.1:37397/solr/collection1/&NOW=1347917523317&start=0&q=*:*&distrib=false&isShard=true&wt=javabin&fsv=true&rows=10&version=2} hits=1 status=0 QTime=1 
[junit4:junit4]   2> 15014 T193 C29 P37397 REQ /select {shard.url=127.0.0.1:37397/solr/collection1/&NOW=1347917523317&q=*:*&ids=1&distrib=false&isShard=true&wt=javabin&version=2} status=0 QTime=1 
[junit4:junit4]   2> 15015 T192 C29 P37397 REQ /select {wt=javabin&q=*:*&version=2} hits=1 status=0 QTime=13 
[junit4:junit4]   2> 15016 T180 oaz.ZooKeeper.<init> Initiating client connection, connectString=127.0.0.1:37391/solr sessionTimeout=10000 watcher=org.apache.solr.common.cloud.ConnectionManager@7db8da6c
[junit4:junit4]   2> 15017 T267 oaz.ClientCnxn$SendThread.startConnect Opening socket connection to server /127.0.0.1:37391
[junit4:junit4]   2> 15017 T180 oascc.ConnectionManager.waitForConnected Waiting for client to connect to ZooKeeper
[junit4:junit4]   2> 15018 T267 oaz.ClientCnxn$SendThread.primeConnection Socket connection established to localhost/127.0.0.1:37391, initiating session
[junit4:junit4]   2> 15018 T182 oazs.NIOServerCnxn$Factory.run Accepted socket connection from /140.211.11.196:37479
[junit4:junit4]   2> 15018 T182 oazs.NIOServerCnxn.readConnectRequest Client attempting to establish new session at /140.211.11.196:37479
[junit4:junit4]   2> 15020 T184 oazs.NIOServerCnxn.finishSessionInit Established session 0x139d624f0400009 with negotiated timeout 10000 for client /140.211.11.196:37479
[junit4:junit4]   2> 15020 T267 oaz.ClientCnxn$SendThread.readConnectResult Session establishment complete on server localhost/127.0.0.1:37391, sessionid = 0x139d624f0400009, negotiated timeout = 10000
[junit4:junit4]   2> 15021 T268 oascc.ConnectionManager.process Watcher org.apache.solr.common.cloud.ConnectionManager@7db8da6c name:ZooKeeperConnection Watcher:127.0.0.1:37391/solr got event WatchedEvent state:SyncConnected type:None path:null path:null type:None
[junit4:junit4]   2> 15021 T180 oascc.ConnectionManager.waitForConnected Client is connected to ZooKeeper
[junit4:junit4]   2> 15022 T180 oascc.ZkStateReader.createClusterStateWatchersAndUpdate Updating cluster state from ZooKeeper... 
[junit4:junit4]   2> 15024 T185 oazs.PrepRequestProcessor.pRequest Processed session termination for sessionid: 0x139d624f0400009
[junit4:junit4]   2> 15025 T268 oaz.ClientCnxn$EventThread.run EventThread shut down
[junit4:junit4]   2> 15025 T180 oaz.ZooKeeper.close Session: 0x139d624f0400009 closed
[junit4:junit4]   2> 15025 T182 oazs.NIOServerCnxn.closeSock Closed socket connection for client /140.211.11.196:37479 which had sessionid 0x139d624f0400009
[junit4:junit4]   2> 15027 T211 C26 P37408 REQ /select {distrib=false&wt=javabin&q=*:*&version=2} hits=1 status=0 QTime=0 
[junit4:junit4]   2> 15031 T223 C28 P37420 REQ /select {distrib=false&wt=javabin&q=*:*&version=2} hits=0 status=0 QTime=1 
[junit4:junit4]   2> 15036 T212 C26 P37408 REQ /select {fl=id,score&shard.url=127.0.0.1:37408/solr/collection1/|127.0.0.1:37430/solr/collection1/&NOW=1347917523348&start=0&q=*:*&distrib=false&isShard=true&wt=javabin&fsv=true&rows=10&version=2} hits=1 status=0 QTime=0 
[junit4:junit4]   2> 15036 T224 C28 P37420 REQ /select {fl=id,score&shard.url=127.0.0.1:37420/solr/collection1/|127.0.0.1:37439/solr/collection1/&NOW=1347917523348&start=0&q=*:*&distrib=false&isShard=true&wt=javabin&fsv=true&rows=10&version=2} hits=0 status=0 QTime=0 
[junit4:junit4]   2> 15040 T212 C26 P37408 REQ /select {shard.url=127.0.0.1:37408/solr/collection1/|127.0.0.1:37430/solr/collection1/&NOW=1347917523348&q=*:*&ids=1&distrib=false&isShard=true&wt=javabin&version=2} status=0 QTime=1 
[junit4:junit4]   2> 15040 T231 C25 P37430 REQ /select {wt=javabin&q=*:*&version=2} hits=1 status=0 QTime=7 
[junit4:junit4]   2> 15049 T192 C29 P37397 /update {wt=javabin&version=2} {add=[2 (1413393964974735360)]} 0 5
[junit4:junit4]   2> 15071 T244 C27 P37439 REQ /update {distrib.from=http://127.0.0.1:37420/solr/collection1/&update.distrib=FROMLEADER&wt=javabin&version=2} status=0 QTime=8 
[junit4:junit4]   2> 15072 T220 C28 P37420 /update {wt=javabin&version=2} {add=[2 (1413393964984172544)]} 0 19
[junit4:junit4]   2> 15080 T192 C29 P37397 /update {wt=javabin&version=2} {add=[3 (1413393965007241216)]} 0 5
[junit4:junit4]   2> 15097 T244 C27 P37439 REQ /update {update.distrib=FROMLEADER&distrib.from=http://127.0.0.1:37420/solr/collection1/&wt=javabin&version=2} status=0 QTime=4 
[junit4:junit4]   2> 15098 T219 C28 P37420 REQ /update {distrib.from=http://127.0.0.1:37408/solr/collection1/&update.distrib=TOLEADER&wt=javabin&version=2} status=0 QTime=14 
[junit4:junit4]   2> 15099 T207 C26 P37408 /update {wt=javabin&version=2} {add=[3]} 0 17
[junit4:junit4]   2> 15107 T192 C29 P37397 /update {wt=javabin&version=2} {add=[4 (1413393965035552768)]} 0 5
[junit4:junit4]   2> 15128 T230 C25 P37430 REQ /update {distrib.from=http://127.0.0.1:37408/solr/collection1/&update.distrib=FROMLEADER&wt=javabin&version=2} status=0 QTime=8 
[junit4:junit4]   2> 15128 T207 C26 P37408 /update {wt=javabin&version=2} {add=[4 (1413393965043941376)]} 0 18
[junit4:junit4]   2> 15136 T192 C29 P37397 /update {wt=javabin&version=2} {add=[5 (1413393965067010048)]} 0 4
[junit4:junit4]   2> 15155 T244 C27 P37439 REQ /update {update.distrib=FROMLEADER&distrib.from=http://127.0.0.1:37420/solr/collection1/&wt=javabin&version=2} status=0 QTime=6 
[junit4:junit4]   2> 15156 T219 C28 P37420 REQ /update {distrib.from=http://127.0.0.1:37408/solr/collection1/&update.distrib=TOLEADER&wt=javabin&version=2} status=0 QTime=14 
[junit4:junit4]   2> 15157 T207 C26 P37408 /update {wt=javabin&version=2} {add=[5]} 0 18
[junit4:junit4]   2> 15164 T192 C29 P37397 /update {wt=javabin&version=2} {add=[6 (1413393965096370176)]} 0 4
[junit4:junit4]   2> 15179 T244 C27 P37439 REQ /update {distrib.from=http://127.0.0.1:37420/solr/collection1/&update.distrib=FROMLEADER&wt=javabin&version=2} status=0 QTime=5 
[junit4:junit4]   2> 15180 T220 C28 P37420 /update {wt=javabin&version=2} {add=[6 (1413393965103710208)]} 0 13
[junit4:junit4]   2> 15187 T192 C29 P37397 /update {wt=javabin&version=2} {add=[7 (1413393965121536000)]} 0 3
[junit4:junit4]   2> 15206 T244 C27 P37439 REQ /update {update.distrib=FROMLEADER&distrib.from=http://127.0.0.1:37420/solr/collection1/&wt=javabin&version=2} status=0 QTime=5 
[junit4:junit4]   2> 15207 T219 C28 P37420 REQ /update {distrib.from=http://127.0.0.1:37408/solr/collection1/&update.distrib=TOLEADER&wt=javabin&version=2} status=0 QTime=13 
[junit4:junit4]   2> 15208 T207 C26 P37408 /update {wt=javabin&version=2} {add=[7]} 0 17
[junit4:junit4]   2> 15214 T192 C29 P37397 /update {wt=javabin&version=2} {add=[8 (1413393965149847552)]} 0 3
[junit4:junit4]   2> 15231 T230 C25 P37430 REQ /update {update.distrib=FROMLEADER&distrib.from=http://127.0.0.1:37408/solr/collection1/&wt=javabin&version=2} status=0 QTime=4 
[junit4:junit4]   2> 15232 T208 C26 P37408 REQ /update {distrib.from=http://127.0.0.1:37420/solr/collection1/&update.distrib=TOLEADER&wt=javabin&version=2} status=0 QTime=12 
[junit4:junit4]   2> 15233 T220 C28 P37420 /update {wt=javabin&version=2} {add=[8]} 0 16
[junit4:junit4]   2> 15240 T192 C29 P37397 /update {wt=javabin&version=2} {add=[9 (1413393965176061952)]} 0 4
[junit4:junit4]   2> 15259 T244 C27 P37439 REQ /update {update.distrib=FROMLEADER&distrib.from=http://127.0.0.1:37420/solr/collection1/&wt=javabin&version=2} status=0 QTime=5 
[junit4:junit4]   2> 15260 T219 C28 P37420 REQ /update {distrib.from=http://127.0.0.1:37408/solr/collection1/&update.distrib=TOLEADER&wt=javabin&version=2} status=0 QTime=14 
[junit4:junit4]   2> 15261 T207 C26 P37408 /update {wt=javabin&version=2} {add=[9]} 0 18
[junit4:junit4]   2> 15268 T192 C29 P37397 /update {wt=javabin&version=2} {add=[10 (1413393965205422080)]} 0 4
[junit4:junit4]   2> 15282 T230 C25 P37430 REQ /update {distrib.from=http://127.0.0.1:37408/solr/collection1/&update.distrib=FROMLEADER&wt=javabin&version=2} status=0 QTime=4 
[junit4:junit4]   2> 15283 T207 C26 P37408 /update {wt=javabin&version=2} {add=[10 (1413393965212762112)]} 0 12
[junit4:junit4]   2> 15311 T192 C29 P37397 /update {wt=javabin&version=2} {add=[11 (1413393965228490752)]} 0 25
[junit4:junit4]   2> 15327 T230 C25 P37430 REQ /update {distrib.from=http://127.0.0.1:37408/solr/collection1/&update.distrib=FROMLEADER&wt=javabin&version=2} status=0 QTime=5 
[junit4:junit4]   2> 15328 T207 C26 P37408 /update {wt=javabin&version=2} {add=[11 (1413393965258899456)]} 0 13
[junit4:junit4]   2> 15337 T192 C29 P37397 /update {wt=javabin&version=2} {add=[12 (1413393965275676672)]} 0 6
[junit4:junit4]   2> 15351 T230 C25 P37430 REQ /update {distrib.from=http://127.0.0.1:37408/solr/collection1/&update.distrib=FROMLEADER&wt=javabin&version=2} status=0 QTime=5 
[junit4:junit4]   2> 15351 T207 C26 P37408 /update {wt=javabin&version=2} {add=[12 (1413393965285113856)]} 0 11
[junit4:junit4]   2> 15359 T192 C29 P37397 /update {wt=javabin&version=2} {add=[13 (1413393965300842496)]} 0 4
[junit4:junit4]   2> 15374 T230 C25 P37430 REQ /update {distrib.from=http://127.0.0.1:37408/solr/collection1/&update.distrib=FROMLEADER&wt=javabin&version=2} status=0 QTime=5 
[junit4:junit4]   2> 15375 T207 C26 P37408 /update {wt=javabin&version=2} {add=[13 (1413393965309231104)]} 0 12
[junit4:junit4]   2> 15382 T192 C29 P37397 /update {wt=javabin&version=2} {add=[14 (1413393965324959744)]} 0 4
[junit4:junit4]   2> 15395 T230 C25 P37430 REQ /update {distrib.from=http://127.0.0.1:37408/solr/collection1/&update.distrib=FROMLEADER&wt=javabin&version=2} status=0 QTime=4 
[junit4:junit4]   2> 15396 T207 C26 P37408 /update {wt=javabin&version=2} {add=[14 (1413393965332299776)]} 0 11
[junit4:junit4]   2> 15403 T192 C29 P37397 /update {wt=javabin&version=2} {add=[15 (1413393965346979840)]} 0 3
[junit4:junit4]   2> 15416 T230 C25 P37430 REQ /update {distrib.from=http://127.0.0.1:37408/solr/collection1/&update.distrib=FROMLEADER&wt=javabin&version=2} status=0 QTime=4 
[junit4:junit4]   2> 15417 T207 C26 P37408 /update {wt=javabin&version=2} {add=[15 (1413393965354319872)]} 0 11
[junit4:junit4]   2> 15423 T192 C29 P37397 /update {wt=javabin&version=2} {add=[16 (1413393965368999936)]} 0 3
[junit4:junit4]   2> 15438 T230 C25 P37430 REQ /update {update.distrib=FROMLEADER&distrib.from=http://127.0.0.1:37408/solr/collection1/&wt=javabin&version=2} status=0 QTime=4 
[junit4:junit4]   2> 15438 T208 C26 P37408 REQ /update {distrib.from=http://127.0.0.1:37420/solr/collection1/&update.distrib=TOLEADER&wt=javabin&version=2} status=0 QTime=9 
[junit4:junit4]   2> 15439 T220 C28 P37420 /update {wt=javabin&version=2} {add=[16]} 0 13
[junit4:junit4]   2> 15452 T192 C29 P37397 /update {wt=javabin&version=2} {add=[17 (1413393965394165760)]} 0 9
[junit4:junit4]   2> 15487 T244 C27 P37439 REQ /update {update.distrib=FROMLEADER&distrib.from=http://127.0.0.1:37420/solr/collection1/&wt=javabin&version=2} status=0 QTime=13 
[junit4:junit4]   2> 15489 T219 C28 P37420 REQ /update {distrib.from=http://127.0.0.1:37408/solr/collection1/&update.distrib=TOLEADER&wt=javabin&version=2} status=0 QTime=28 
[junit4:junit4]   2> 15489 T207 C26 P37408 /update {wt=javabin&version=2} {add=[17]} 0 34
[junit4:junit4]   2> 15496 T192 C29 P37397 /update {wt=javabin&version=2} {add=[100 (1413393965445545984)]} 0 3
[junit4:junit4]   2> 15545 T230 C25 P37430 REQ /update {distrib.from=http://127.0.0.1:37408/solr/collection1/&update.distrib=FROMLEADER&wt=javabin&version=2} status=0 QTime=22 
[junit4:junit4]   2> 15547 T207 C26 P37408 /update {wt=javabin&version=2} {add=[100 (1413393965451837440)]} 0 48
[junit4:junit4]   2> 15554 T192 C29 P37397 /update {wt=javabin&version=2} {add=[101 (1413393965505314816)]} 0 4
[junit4:junit4]   2> 15569 T230 C25 P37430 REQ /update {distrib.from=http://127.0.0.1:37408/solr/collection1/&update.distrib=FROMLEADER&wt=javabin&version=2} status=0 QTime=5 
[junit4:junit4]   2> 15570 T207 C26 P37408 /update {wt=javabin&version=2} {add=[101 (1413393965512654848)]} 0 13
[junit4:junit4]   2> 15578 T192 C29 P37397 /update {wt=javabin&version=2} {add=[102 (1413393965530480640)]} 0 4
[junit4:junit4]   2> 15591 T230 C25 P37430 REQ /update {distrib.from=http://127.0.0.1:37408/solr/collection1/&update.distrib=FROMLEADER&wt=javabin&version=2} status=0 QTime=4 
[junit4:junit4]   2> 15592 T207 C26 P37408 /update {wt=javabin&version=2} {add=[102 (1413393965537820672)]} 0 11
[junit4:junit4]   2> 15619 T192 C29 P37397 /update {wt=javabin&version=2} {add=[103 (1413393965552500736)]} 0 24
[junit4:junit4]   2> 15633 T244 C27 P37439 REQ /update {distrib.from=http://127.0.0.1:37420/solr/collection1/&update.distrib=FROMLEADER&wt=javabin&version=2} status=0 QTime=4 
[junit4:junit4]   2> 15634 T220 C28 P37420 /update {wt=javabin&version=2} {add=[103 (1413393965581860864)]} 0 11
[junit4:junit4]   2> 15642 T192 C29 P37397 /update {wt=javabin&version=2} {add=[104 (1413393965596540928)]} 0 5
[junit4:junit4]   2> 15654 T244 C27 P37439 REQ /update {distrib.from=http://127.0.0.1:37420/solr/collection1/&update.distrib=FROMLEADER&wt=javabin&version=2} status=0 QTime=3 
[junit4:junit4]   2> 15655 T220 C28 P37420 /update {wt=javabin&version=2} {add=[104 (1413393965604929536)]} 0 10
[junit4:junit4]   2> 15662 T192 C29 P37397 /update {wt=javabin&version=2} {add=[105 (1413393965618561024)]} 0 3
[junit4:junit4]   2> 15699 T244 C27 P37439 REQ /update {update.distrib=FROMLEADER&distrib.from=http://127.0.0.1:37420/solr/collection1/&wt=javabin&version=2} status=0 QTime=14 
[junit4:junit4]   2> 15700 T219 C28 P37420 REQ /update {distrib.from=http://127.0.0.1:37408/solr/collection1/&update.distrib=TOLEADER&wt=javabin&version=2} status=0 QTime=31 
[junit4:junit4]   2> 15701 T207 C26 P37408 /update {wt=javabin&version=2} {add=[105]} 0 36
[junit4:junit4]   2> 15707 T192 C29 P37397 /update {wt=javabin&version=2} {add=[106 (1413393965666795520)]} 0 3
[junit4:junit4]   2> 15723 T244 C27 P37439 REQ /update {distrib.from=http://127.0.0.1:37420/solr/collection1/&update.distrib=FROMLEADER&wt=javabin&version=2} status=0 QTime=5 
[junit4:junit4]   2> 15723 T220 C28 P37420 /update {wt=javabin&version=2} {add=[106 (1413393965674135552)]} 0 12
[junit4:junit4]   2> 15730 T192 C29 P37397 /update {wt=javabin&version=2} {add=[107 (1413393965690912768)]} 0 3
[junit4:junit4]   2> 15742 T230 C25 P37430 REQ /update {distrib.from=http://127.0.0.1:37408/solr/collection1/&update.distrib=FROMLEADER&wt=javabin&version=2} status=0 QTime=4 
[junit4:junit4]   2> 15742 T207 C26 P37408 /update {wt=javabin&version=2} {add=[107 (1413393965697204224)]} 0 9
[junit4:junit4]   2> 15749 T192 C29 P37397 /update {wt=javabin&version=2} {add=[108 (1413393965710835712)]} 0 3
[junit4:junit4]   2> 15763 T230 C25 P37430 REQ /update {update.distrib=FROMLEADER&distrib.from=http://127.0.0.1:37408/solr/collection1/&wt=javabin&version=2} status=0 QTime=3 
[junit4:junit4]   2> 15764 T208 C26 P37408 REQ /update {distrib.from=http://127.0.0.1:37420/solr/collection1/&update.distrib=TOLEADER&wt=javabin&version=2} status=0 QTime=9 
[junit4:junit4]   2> 15765 T220 C28 P37420 /update {wt=javabin&version=2} {add=[108]} 0 13
[junit4:junit4]   2> 15771 T192 C29 P37397 /update {wt=javabin&version=2} {add=[109 (1413393965733904384)]} 0 3
[junit4:junit4]   2> 15782 T230 C25 P37430 REQ /update {distrib.from=http://127.0.0.1:37408/solr/collection1/&update.distrib=FROMLEADER&wt=javabin&version=2} status=0 QTime=3 
[junit4:junit4]   2> 15783 T207 C26 P37408 /update {wt=javabin&version=2} {add=[109 (1413393965740195840)]} 0 9
[junit4:junit4]   2> 15792 T192 C29 P37397 /update {wt=javabin&version=2} {add=[110 (1413393965753827328)]} 0 5
[junit4:junit4]   2> 15806 T230 C25 P37430 REQ /update {distrib.from=http://127.0.0.1:37408/solr/collection1/&update.distrib=FROMLEADER&wt=javabin&version=2} status=0 QTime=4 
[junit4:junit4]   2> 15807 T207 C26 P37408 /update {wt=javabin&version=2} {add=[110 (1413393965764313088)]} 0 10
[junit4:junit4]   2> 15813 T192 C29 P37397 /update {wt=javabin&version=2} {add=[111 (1413393965777944576)]} 0 3
[junit4:junit4]   2> 15827 T230 C25 P37430 REQ /update {update.distrib=FROMLEADER&distrib.from=http://127.0.0.1:37408/solr/collection1/&wt=javabin&version=2} status=0 QTime=3 
[junit4:junit4]   2> 15828 T208 C26 P37408 REQ /update {distrib.from=http://127.0.0.1:37420/solr/collection1/&update.distrib=TOLEADER&wt=javabin&version=2} status=0 QTime=9 
[junit4:junit4]   2> 15829 T220 C28 P37420 /update {wt=javabin&version=2} {add=[111]} 0 13
[junit4:junit4]   2> 15835 T192 C29 P37397 /update {wt=javabin&version=2} {add=[112 (1413393965801013248)]} 0 3
[junit4:junit4]   2> 15847 T244 C27 P37439 REQ /update {distrib.from=http://127.0.0.1:37420/solr/collection1/&update.distrib=FROMLEADER&wt=javabin&version=2} status=0 QTime=3 
[junit4:junit4]   2> 15848 T220 C28 P37420 /update {wt=javabin&version=2} {add=[112 (1413393965807304704)]} 0 10
[junit4:junit4]   2> 15863 T192 C29 P37397 /update {wt=javabin&version=2} {add=[113 (1413393965820936192)]} 0 12
[junit4:junit4]   2> 15878 T230 C25 P37430 REQ /update {update.distrib=FROMLEADER&distrib.from=http://127.0.0.1:37408/solr/collection1/&wt=javabin&version=2} status=0 QTime=3 
[junit4:junit4]   2> 15879 T208 C26 P37408 REQ /update {distrib.from=http://127.0.0.1:37420/solr/collection1/&update.distrib=TOLEADER&wt=javabin&version=2} status=0 QTime=10 
[junit4:junit4]   2> 15880 T220 C28 P37420 /update {wt=javabin&version=2} {add=[113]} 0 14
[junit4:junit4]   2> 15889 T192 C29 P37397 /update {wt=javabin&version=2} {add=[114 (1413393965855539200)]} 0 5
[junit4:junit4]   2> 15901 T230 C25 P37430 REQ /update {distrib.from=http://127.0.0.1:37408/solr/collection1/&update.distrib=FROMLEADER&wt=javabin&version=2} status=0 QTime=4 
[junit4:junit4]   2> 15902 T207 C26 P37408 /update {wt=javabin&version=2} {add=[114 (1413393965863927808)]} 0 10
[junit4:junit4]   2> 15908 T192 C29 P37397 /update {wt=javabin&version=2} {add=[115 (1413393965877559296)]} 0 3
[junit4:junit4]   2> 15919 T244 C27 P37439 REQ /update {distrib.from=http://127.0.0.1:37420/solr/collection1/&update.distrib=FROMLEADER&wt=javabin&version=2} status=0 QTime=3 
[junit4:junit4]   2> 15920 T220 C28 P37420 /update {wt=javabin&version=2} {add=[115 (1413393965883850752)]} 0 8
[junit4:junit4]   2> 15926 T192 C29 P37397 /update {wt=javabin&version=2} {add=[116 (1413393965896433664)]} 0 3
[junit4:junit4]   2> 15939 T244 C27 P37439 REQ /update {distrib.from=http://127.0.0.1:37420/solr/collection1/&update.distrib=FROMLEADER&wt=javabin&version=2} status=0 QTime=3 
[junit4:junit4]   2> 15940 T220 C28 P37420 /update {wt=javabin&version=2} {add=[116 (1413393965903773696)]} 0 9
[junit4:junit4]   2> 15946 T192 C29 P37397 /update {wt=javabin&version=2} {add=[117 (1413393965917405184)]} 0 3
[junit4:junit4]   2> 15957 T244 C27 P37439 REQ /update {distrib.from=http://127.0.0.1:37420/solr/collection1/&update.distrib=FROMLEADER&wt=javabin&version=2} status=0 QTime=3 
[junit4:junit4]   2> 15958 T220 C28 P37420 /update {wt=javabin&version=2} {add=[117 (1413393965923696640)]} 0 9
[junit4:junit4]   2> 15965 T192 C29 P37397 /update {wt=javabin&version=2} {add=[118 (1413393965937328128)]} 0 3
[junit4:junit4]   2> 16000 T230 C25 P37430 REQ /update {update.distrib=FROMLEADER&distrib.from=http://127.0.0.1:37408/solr/collection1/&wt=javabin&version=2} status=0 QTime=16 
[junit4:junit4]   2> 16001 T208 C26 P37408 REQ /update {distrib.from=http://127.0.0.1:37420/solr/collection1/&update.distrib=TOLEADER&wt=javabin&version=2} status=0 QTime=30 
[junit4:junit4]   2> 16002 T220 C28 P37420 /update {wt=javabin&version=2} {add=[118]} 0 34
[junit4:junit4]   2> 16008 T192 C29 P37397 /update {wt=javabin&version=2} {add=[119 (1413393965982416896)]} 0 3
[junit4:junit4]   2> 16022 T244 C27 P37439 REQ /update {update.distrib=FROMLEADER&distrib.from=http://127.0.0.1:37420/solr/collection1/&wt=javabin&version=2} status=0 QTime=3 
[junit4:junit4]   2> 16023 T219 C28 P37420 REQ /update {distrib.from=http://127.0.0.1:37408/solr/collection1/&update.distrib=TOLEADER&wt=javabin&version=2} status=0 QTime=9 
[junit4:junit4]   2> 16024 T207 C26 P37408 /update {wt=javabin&version=2} {add=[119]} 0 13
[junit4:junit4]   2> 16030 T192 C29 P37397 /update {wt=javabin&version=2} {add=[120 (1413393966005485568)]} 0 3
[junit4:junit4]   2> 16042 T244 C27 P37439 REQ /update {distrib.from=http://127.0.0.1:37420/solr/collection1/&update.distrib=FROMLEADER&wt=javabin&version=2} status=0 QTime=2 
[junit4:junit4]   2> 16043 T220 C28 P37420 /update {wt=javabin&version=2} {add=[120 (1413393966011777024)]} 0 10
[junit4:junit4]   2> 16049 T192 C29 P37397 /update {wt=javabin&version=2} {add=[121 (1413393966025408512)]} 0 3
[junit4:junit4]   2> 16063 T244 C27 P37439 REQ /update {update.distrib=FROMLEADER&distrib.from=http://127.0.0.1:37420/solr/collection1/&wt=javabin&version=2} status=0 QTime=3 
[junit4:junit4]   2> 16064 T219 C28 P37420 REQ /update {distrib.from=http://127.0.0.1:37408/solr/collection1/&update.distrib=TOLEADER&wt=javabin&version=2} status=0 QTime=9 
[junit4:junit4]   2> 16065 T207 C26 P37408 /update {wt=javabin&version=2} {add=[121]} 0 12
[junit4:junit4]   2> 16071 T192 C29 P37397 /update {wt=jav

[...truncated too long message...]

	at org.apache.lucene.util.TestRuleAssertionsRequired$1.evaluate(TestRuleAssertionsRequired.java:43)
[junit4:junit4]    > 	at org.apache.lucene.util.TestRuleMarkFailure$1.evaluate(TestRuleMarkFailure.java:48)
[junit4:junit4]    > 	at org.apache.lucene.util.TestRuleIgnoreAfterMaxFailures$1.evaluate(TestRuleIgnoreAfterMaxFailures.java:70)
[junit4:junit4]    > 	at org.apache.lucene.util.TestRuleIgnoreTestSuites$1.evaluate(TestRuleIgnoreTestSuites.java:55)
[junit4:junit4]    > 	at com.carrotsearch.randomizedtesting.rules.StatementAdapter.evaluate(StatementAdapter.java:36)
[junit4:junit4]    > 	at com.carrotsearch.randomizedtesting.ThreadLeakControl$StatementRunner.run(ThreadLeakControl.java:358)
[junit4:junit4]    > 	at java.lang.Thread.run(Thread.java:722)
[junit4:junit4]   2> 172316 T817 oas.SolrTestCaseJ4.deleteCore ###deleteCore
[junit4:junit4]   2> 173967 T891 oasc.SolrException.log SEVERE Errir checking for the number of election participants:org.apache.zookeeper.KeeperException$SessionExpiredException: KeeperErrorCode = Session expired for /collections/collection1/leader_elect/shard1/election
[junit4:junit4]   2> 		at org.apache.zookeeper.KeeperException.create(KeeperException.java:118)
[junit4:junit4]   2> 		at org.apache.zookeeper.KeeperException.create(KeeperException.java:42)
[junit4:junit4]   2> 		at org.apache.zookeeper.ZooKeeper.getChildren(ZooKeeper.java:1249)
[junit4:junit4]   2> 		at org.apache.solr.common.cloud.SolrZkClient$6.execute(SolrZkClient.java:278)
[junit4:junit4]   2> 		at org.apache.solr.common.cloud.SolrZkClient$6.execute(SolrZkClient.java:275)
[junit4:junit4]   2> 		at org.apache.solr.common.cloud.ZkCmdExecutor.retryOperation(ZkCmdExecutor.java:67)
[junit4:junit4]   2> 		at org.apache.solr.common.cloud.SolrZkClient.getChildren(SolrZkClient.java:275)
[junit4:junit4]   2> 		at org.apache.solr.cloud.ShardLeaderElectionContext.waitForReplicasToComeUp(ElectionContext.java:275)
[junit4:junit4]   2> 		at org.apache.solr.cloud.ShardLeaderElectionContext.runLeaderProcess(ElectionContext.java:142)
[junit4:junit4]   2> 		at org.apache.solr.cloud.LeaderElector.runIamLeaderProcess(LeaderElector.java:158)
[junit4:junit4]   2> 		at org.apache.solr.cloud.LeaderElector.checkIfIamLeader(LeaderElector.java:102)
[junit4:junit4]   2> 		at org.apache.solr.cloud.LeaderElector.joinElection(LeaderElector.java:275)
[junit4:junit4]   2> 		at org.apache.solr.cloud.ShardLeaderElectionContext.rejoinLeaderElection(ElectionContext.java:326)
[junit4:junit4]   2> 		at org.apache.solr.cloud.ShardLeaderElectionContext.runLeaderProcess(ElectionContext.java:159)
[junit4:junit4]   2> 		at org.apache.solr.cloud.LeaderElector.runIamLeaderProcess(LeaderElector.java:158)
[junit4:junit4]   2> 		at org.apache.solr.cloud.LeaderElector.checkIfIamLeader(LeaderElector.java:102)
[junit4:junit4]   2> 		at org.apache.solr.cloud.LeaderElector.access$000(LeaderElector.java:56)
[junit4:junit4]   2> 		at org.apache.solr.cloud.LeaderElector$1.process(LeaderElector.java:131)
[junit4:junit4]   2> 		at org.apache.zookeeper.ClientCnxn$EventThread.processEvent(ClientCnxn.java:526)
[junit4:junit4]   2> 		at org.apache.zookeeper.ClientCnxn$EventThread.run(ClientCnxn.java:502)
[junit4:junit4]   2> 	
[junit4:junit4]   2> 173968 T891 oasc.ShardLeaderElectionContext.waitForReplicasToComeUp Waiting until we see more replicas up: total=4 found=0 timeoutin=75096
[junit4:junit4]   2> 174469 T891 oasc.SolrCore.close [collection1]  CLOSING SolrCore org.apache.solr.core.SolrCore@71dd3ae
[junit4:junit4]   2> 174471 T891 oasc.SolrCore.closeSearcher [collection1] Closing main searcher on request.
[junit4:junit4]   2> 174471 T891 oasu.DirectUpdateHandler2.close closing DirectUpdateHandler2{commits=7,autocommits=0,soft autocommits=0,optimizes=0,rollbacks=0,expungeDeletes=0,docsPending=0,adds=0,deletesById=0,deletesByQuery=0,errors=0,cumulative_adds=5,cumulative_deletesById=0,cumulative_deletesByQuery=1,cumulative_errors=0}
[junit4:junit4]   2> 174471 T891 oasu.DefaultSolrCoreState.decref SolrCoreState ref count has reached 0 - closing IndexWriter
[junit4:junit4]   2> 174474 T891 oasu.DefaultSolrCoreState.decref Closing SolrCoreState - canceling any ongoing recovery
[junit4:junit4]   2> 174475 T891 oasc.LeaderElector$1.process WARNING  org.apache.zookeeper.KeeperException$SessionExpiredException: KeeperErrorCode = Session expired for /collections/collection1/leader_elect/shard1/election/88337151742574598-127.0.0.1:56520_solr_collection1-n_0000000016
[junit4:junit4]   2> 	at org.apache.zookeeper.KeeperException.create(KeeperException.java:118)
[junit4:junit4]   2> 	at org.apache.zookeeper.KeeperException.create(KeeperException.java:42)
[junit4:junit4]   2> 	at org.apache.zookeeper.ZooKeeper.delete(ZooKeeper.java:734)
[junit4:junit4]   2> 	at org.apache.solr.common.cloud.SolrZkClient$2.execute(SolrZkClient.java:178)
[junit4:junit4]   2> 	at org.apache.solr.common.cloud.SolrZkClient$2.execute(SolrZkClient.java:175)
[junit4:junit4]   2> 	at org.apache.solr.common.cloud.ZkCmdExecutor.retryOperation(ZkCmdExecutor.java:67)
[junit4:junit4]   2> 	at org.apache.solr.common.cloud.SolrZkClient.delete(SolrZkClient.java:175)
[junit4:junit4]   2> 	at org.apache.solr.cloud.ElectionContext.cancelElection(ElectionContext.java:60)
[junit4:junit4]   2> 	at org.apache.solr.cloud.ShardLeaderElectionContext.runLeaderProcess(ElectionContext.java:151)
[junit4:junit4]   2> 	at org.apache.solr.cloud.LeaderElector.runIamLeaderProcess(LeaderElector.java:158)
[junit4:junit4]   2> 	at org.apache.solr.cloud.LeaderElector.checkIfIamLeader(LeaderElector.java:102)
[junit4:junit4]   2> 	at org.apache.solr.cloud.LeaderElector.joinElection(LeaderElector.java:275)
[junit4:junit4]   2> 	at org.apache.solr.cloud.ShardLeaderElectionContext.rejoinLeaderElection(ElectionContext.java:326)
[junit4:junit4]   2> 	at org.apache.solr.cloud.ShardLeaderElectionContext.runLeaderProcess(ElectionContext.java:159)
[junit4:junit4]   2> 	at org.apache.solr.cloud.LeaderElector.runIamLeaderProcess(LeaderElector.java:158)
[junit4:junit4]   2> 	at org.apache.solr.cloud.LeaderElector.checkIfIamLeader(LeaderElector.java:102)
[junit4:junit4]   2> 	at org.apache.solr.cloud.LeaderElector.access$000(LeaderElector.java:56)
[junit4:junit4]   2> 	at org.apache.solr.cloud.LeaderElector$1.process(LeaderElector.java:131)
[junit4:junit4]   2> 	at org.apache.zookeeper.ClientCnxn$EventThread.processEvent(ClientCnxn.java:526)
[junit4:junit4]   2> 	at org.apache.zookeeper.ClientCnxn$EventThread.run(ClientCnxn.java:502)
[junit4:junit4]   2> 
[junit4:junit4]   2> 174475 T891 oascc.ZkStateReader$2.process A cluster state change has occurred - updating...
[junit4:junit4]   2> 174476 T891 oascc.ZkStateReader$2.process WARNING ZooKeeper watch triggered, but Solr cannot talk to ZK
[junit4:junit4]   2> 174476 T891 oascc.ConnectionManager.process Watcher org.apache.solr.common.cloud.ConnectionManager@c26f377 name:ZooKeeperConnection Watcher:127.0.0.1:14415/solr got event WatchedEvent state:Disconnected type:None path:null path:null type:None
[junit4:junit4]   2> 174476 T891 oascc.ConnectionManager.process Client->ZooKeeper status change trigger but we are already closed
[junit4:junit4]   2> 174476 T891 oaz.ClientCnxn$EventThread.run EventThread shut down
[junit4:junit4]   2> NOTE: test params are: codec=Lucene40: {range_facet_l=Lucene40(minBlockSize=90 maxBlockSize=208), text=PostingsFormat(name=Direct), _version_=PostingsFormat(name=SimpleText), rnd_b=PostingsFormat(name=Memory doPackFST= true), intDefault=Lucene40(minBlockSize=90 maxBlockSize=208), timestamp=Lucene40(minBlockSize=90 maxBlockSize=208), id=PostingsFormat(name=Memory doPackFST= true), a_t=Lucene40(minBlockSize=90 maxBlockSize=208), range_facet_sl=PostingsFormat(name=Memory doPackFST= true), range_facet_si=Lucene40(minBlockSize=90 maxBlockSize=208), other_tl1=Lucene40(minBlockSize=90 maxBlockSize=208), multiDefault=Lucene40(minBlockSize=90 maxBlockSize=208), a_si=PostingsFormat(name=SimpleText)}, sim=DefaultSimilarity, locale=ar_SD, timezone=America/Blanc-Sablon
[junit4:junit4]   2> NOTE: FreeBSD 9.0-RELEASE amd64/Oracle Corporation 1.7.0_06 (64-bit)/cpus=16,threads=1,free=308304680,total=482344960
[junit4:junit4]   2> NOTE: All tests run in this JVM: [SuggesterTest, TestStressRecovery, TestLRUCache, StatsComponentTest, SignatureUpdateProcessorFactoryTest, TestPluginEnable, TermVectorComponentDistributedTest, DocumentBuilderTest, StandardRequestHandlerTest, DirectUpdateHandlerTest, BasicDistributedZk2Test, RecoveryZkTest, TestPropInject, TestCodecSupport, PathHierarchyTokenizerFactoryTest, TestOmitPositions, LeaderElectionTest, DOMUtilTest, SoftAutoCommitTest, TestRecovery, TestPhraseSuggestions, ClusterStateUpdateTest, TestStressLucene, TestPropInjectDefaults, BasicZkTest, HighlighterTest, SolrInfoMBeanTest, TestBinaryField, IndexSchemaTest, TestFoldingMultitermQuery, TestJmxIntegration, TestRemoteStreaming, SyncSliceTest]
[junit4:junit4] Completed on J1 in 175.34s, 1 test, 1 error <<< FAILURES!

[...truncated 424 lines...]
BUILD FAILED
/usr/home/hudson/hudson-slave/workspace/Lucene-Solr-Tests-trunk-java7/build.xml:32: The following error occurred while executing this line:
/usr/home/hudson/hudson-slave/workspace/Lucene-Solr-Tests-trunk-java7/solr/build.xml:146: The following error occurred while executing this line:
/usr/home/hudson/hudson-slave/workspace/Lucene-Solr-Tests-trunk-java7/lucene/module-build.xml:63: The following error occurred while executing this line:
/usr/home/hudson/hudson-slave/workspace/Lucene-Solr-Tests-trunk-java7/lucene/common-build.xml:1133: The following error occurred while executing this line:
/usr/home/hudson/hudson-slave/workspace/Lucene-Solr-Tests-trunk-java7/lucene/common-build.xml:810: There were test failures: 230 suites, 950 tests, 1 error, 1 failure, 7 ignored (2 assumptions)

Total time: 30 minutes 57 seconds
Build step 'Invoke Ant' marked build as failure
Recording test results
Email was triggered for: Failure
Sending email for trigger: Failure



Mime
View raw message