lucene-dev mailing list archives

Site index · List index
Message view « Date » · « Thread »
Top « Date » · « Thread »
From Apache Jenkins Server <jenk...@builds.apache.org>
Subject [JENKINS] Lucene-Solr-Tests-trunk-Java6 - Build # 15265 - Still Failing
Date Wed, 19 Sep 2012 13:23:04 GMT
Build: https://builds.apache.org/job/Lucene-Solr-Tests-trunk-Java6/15265/

1 tests failed.
FAILED:  org.apache.solr.cloud.BasicDistributedZk2Test.testDistribSearch

Error Message:
Shard still reported as live in zk

Stack Trace:
java.lang.AssertionError: Shard still reported as live in zk
	at __randomizedtesting.SeedInfo.seed([509517B9DB9BBABD:D17399A1ACC4DA81]:0)
	at org.junit.Assert.fail(Assert.java:93)
	at org.apache.solr.cloud.AbstractFullDistribZkTestBase.waitToSeeNotLive(AbstractFullDistribZkTestBase.java:1220)
	at org.apache.solr.cloud.BasicDistributedZk2Test.brindDownShardIndexSomeDocsAndRecover(BasicDistributedZk2Test.java:190)
	at org.apache.solr.cloud.BasicDistributedZk2Test.doTest(BasicDistributedZk2Test.java:83)
	at org.apache.solr.BaseDistributedSearchTestCase.testDistribSearch(BaseDistributedSearchTestCase.java:695)
	at sun.reflect.NativeMethodAccessorImpl.invoke0(Native Method)
	at sun.reflect.NativeMethodAccessorImpl.invoke(NativeMethodAccessorImpl.java:57)
	at sun.reflect.DelegatingMethodAccessorImpl.invoke(DelegatingMethodAccessorImpl.java:43)
	at java.lang.reflect.Method.invoke(Method.java:616)
	at com.carrotsearch.randomizedtesting.RandomizedRunner.invoke(RandomizedRunner.java:1559)
	at com.carrotsearch.randomizedtesting.RandomizedRunner.access$600(RandomizedRunner.java:79)
	at com.carrotsearch.randomizedtesting.RandomizedRunner$6.evaluate(RandomizedRunner.java:737)
	at com.carrotsearch.randomizedtesting.RandomizedRunner$7.evaluate(RandomizedRunner.java:773)
	at com.carrotsearch.randomizedtesting.RandomizedRunner$8.evaluate(RandomizedRunner.java:787)
	at com.carrotsearch.randomizedtesting.rules.SystemPropertiesRestoreRule$1.evaluate(SystemPropertiesRestoreRule.java:53)
	at org.apache.lucene.util.TestRuleSetupTeardownChained$1.evaluate(TestRuleSetupTeardownChained.java:50)
	at org.apache.lucene.util.TestRuleFieldCacheSanity$1.evaluate(TestRuleFieldCacheSanity.java:51)
	at org.apache.lucene.util.AbstractBeforeAfterRule$1.evaluate(AbstractBeforeAfterRule.java:45)
	at com.carrotsearch.randomizedtesting.rules.SystemPropertiesInvariantRule$1.evaluate(SystemPropertiesInvariantRule.java:55)
	at org.apache.lucene.util.TestRuleThreadAndTestName$1.evaluate(TestRuleThreadAndTestName.java:48)
	at org.apache.lucene.util.TestRuleIgnoreAfterMaxFailures$1.evaluate(TestRuleIgnoreAfterMaxFailures.java:70)
	at org.apache.lucene.util.TestRuleMarkFailure$1.evaluate(TestRuleMarkFailure.java:48)
	at com.carrotsearch.randomizedtesting.rules.StatementAdapter.evaluate(StatementAdapter.java:36)
	at com.carrotsearch.randomizedtesting.ThreadLeakControl$StatementRunner.run(ThreadLeakControl.java:358)
	at com.carrotsearch.randomizedtesting.ThreadLeakControl.forkTimeoutingTask(ThreadLeakControl.java:782)
	at com.carrotsearch.randomizedtesting.ThreadLeakControl$3.evaluate(ThreadLeakControl.java:442)
	at com.carrotsearch.randomizedtesting.RandomizedRunner.runSingleTest(RandomizedRunner.java:746)
	at com.carrotsearch.randomizedtesting.RandomizedRunner$3.evaluate(RandomizedRunner.java:648)
	at com.carrotsearch.randomizedtesting.RandomizedRunner$4.evaluate(RandomizedRunner.java:682)
	at com.carrotsearch.randomizedtesting.RandomizedRunner$5.evaluate(RandomizedRunner.java:693)
	at com.carrotsearch.randomizedtesting.rules.StatementAdapter.evaluate(StatementAdapter.java:36)
	at com.carrotsearch.randomizedtesting.rules.SystemPropertiesRestoreRule$1.evaluate(SystemPropertiesRestoreRule.java:53)
	at org.apache.lucene.util.AbstractBeforeAfterRule$1.evaluate(AbstractBeforeAfterRule.java:45)
	at org.apache.lucene.util.TestRuleStoreClassName$1.evaluate(TestRuleStoreClassName.java:42)
	at com.carrotsearch.randomizedtesting.rules.SystemPropertiesInvariantRule$1.evaluate(SystemPropertiesInvariantRule.java:55)
	at com.carrotsearch.randomizedtesting.rules.NoShadowingOrOverridesOnMethodsRule$1.evaluate(NoShadowingOrOverridesOnMethodsRule.java:39)
	at com.carrotsearch.randomizedtesting.rules.NoShadowingOrOverridesOnMethodsRule$1.evaluate(NoShadowingOrOverridesOnMethodsRule.java:39)
	at com.carrotsearch.randomizedtesting.rules.StatementAdapter.evaluate(StatementAdapter.java:36)
	at org.apache.lucene.util.TestRuleAssertionsRequired$1.evaluate(TestRuleAssertionsRequired.java:43)
	at org.apache.lucene.util.TestRuleMarkFailure$1.evaluate(TestRuleMarkFailure.java:48)
	at org.apache.lucene.util.TestRuleIgnoreAfterMaxFailures$1.evaluate(TestRuleIgnoreAfterMaxFailures.java:70)
	at org.apache.lucene.util.TestRuleIgnoreTestSuites$1.evaluate(TestRuleIgnoreTestSuites.java:55)
	at com.carrotsearch.randomizedtesting.rules.StatementAdapter.evaluate(StatementAdapter.java:36)
	at com.carrotsearch.randomizedtesting.ThreadLeakControl$StatementRunner.run(ThreadLeakControl.java:358)
	at java.lang.Thread.run(Thread.java:679)




Build Log:
[...truncated 7594 lines...]
[junit4:junit4] Suite: org.apache.solr.cloud.BasicDistributedZk2Test
[junit4:junit4]   2> 2 T2250 oas.SolrTestCaseJ4.setUp ###Starting testDistribSearch
[junit4:junit4]   2> Creating dataDir: /usr/home/hudson/hudson-slave/workspace/Lucene-Solr-Tests-trunk-Java6/solr/build/solr-core/test/J0/./solrtest-BasicDistributedZk2Test-1348060670324
[junit4:junit4]   2> 3 T2250 oasc.ZkTestServer.run STARTING ZK TEST SERVER
[junit4:junit4]   2> 6 T2251 oazs.ZooKeeperServer.setTickTime tickTime set to 1000
[junit4:junit4]   2> 6 T2251 oazs.NIOServerCnxn$Factory.<init> binding to port 0.0.0.0/0.0.0.0:0
[junit4:junit4]   2> 7 T2251 oazsp.FileTxnSnapLog.save Snapshotting: 0
[junit4:junit4]   2> 105 T2250 oasc.ZkTestServer.run start zk server on port:65394
[junit4:junit4]   2> 105 T2250 oaz.ZooKeeper.<init> Initiating client connection, connectString=127.0.0.1:65394 sessionTimeout=10000 watcher=org.apache.solr.common.cloud.ConnectionManager@109299cd
[junit4:junit4]   2> 106 T2250 oascc.ConnectionManager.waitForConnected Waiting for client to connect to ZooKeeper
[junit4:junit4]   2> 106 T2256 oaz.ClientCnxn$SendThread.startConnect Opening socket connection to server /127.0.0.1:65394
[junit4:junit4]   2> 107 T2256 oaz.ClientCnxn$SendThread.primeConnection Socket connection established to localhost/127.0.0.1:65394, initiating session
[junit4:junit4]   2> 107 T2252 oazs.NIOServerCnxn$Factory.run Accepted socket connection from /140.211.11.196:65395
[junit4:junit4]   2> 108 T2252 oazs.NIOServerCnxn.readConnectRequest Client attempting to establish new session at /140.211.11.196:65395
[junit4:junit4]   2> 108 T2254 oazsp.FileTxnLog.append Creating new log file: log.1
[junit4:junit4]   2> 111 T2254 oazs.NIOServerCnxn.finishSessionInit Established session 0x139dead69790000 with negotiated timeout 10000 for client /140.211.11.196:65395
[junit4:junit4]   2> 111 T2256 oaz.ClientCnxn$SendThread.readConnectResult Session establishment complete on server localhost/127.0.0.1:65394, sessionid = 0x139dead69790000, negotiated timeout = 10000
[junit4:junit4]   2> 111 T2257 oascc.ConnectionManager.process Watcher org.apache.solr.common.cloud.ConnectionManager@109299cd name:ZooKeeperConnection Watcher:127.0.0.1:65394 got event WatchedEvent state:SyncConnected type:None path:null path:null type:None
[junit4:junit4]   2> 111 T2250 oascc.ConnectionManager.waitForConnected Client is connected to ZooKeeper
[junit4:junit4]   2> 112 T2250 oascc.SolrZkClient.makePath makePath: /solr
[junit4:junit4]   2> 114 T2255 oazs.PrepRequestProcessor.pRequest Processed session termination for sessionid: 0x139dead69790000
[junit4:junit4]   2> 124 T2257 oaz.ClientCnxn$EventThread.run EventThread shut down
[junit4:junit4]   2> 124 T2250 oaz.ZooKeeper.close Session: 0x139dead69790000 closed
[junit4:junit4]   2> 124 T2252 oazs.NIOServerCnxn.closeSock Closed socket connection for client /140.211.11.196:65395 which had sessionid 0x139dead69790000
[junit4:junit4]   2> 124 T2250 oaz.ZooKeeper.<init> Initiating client connection, connectString=127.0.0.1:65394/solr sessionTimeout=10000 watcher=org.apache.solr.common.cloud.ConnectionManager@38b5eca8
[junit4:junit4]   2> 125 T2258 oaz.ClientCnxn$SendThread.startConnect Opening socket connection to server /127.0.0.1:65394
[junit4:junit4]   2> 125 T2250 oascc.ConnectionManager.waitForConnected Waiting for client to connect to ZooKeeper
[junit4:junit4]   2> 126 T2258 oaz.ClientCnxn$SendThread.primeConnection Socket connection established to localhost/127.0.0.1:65394, initiating session
[junit4:junit4]   2> 126 T2252 oazs.NIOServerCnxn$Factory.run Accepted socket connection from /140.211.11.196:65396
[junit4:junit4]   2> 126 T2252 oazs.NIOServerCnxn.readConnectRequest Client attempting to establish new session at /140.211.11.196:65396
[junit4:junit4]   2> 128 T2254 oazs.NIOServerCnxn.finishSessionInit Established session 0x139dead69790001 with negotiated timeout 10000 for client /140.211.11.196:65396
[junit4:junit4]   2> 128 T2258 oaz.ClientCnxn$SendThread.readConnectResult Session establishment complete on server localhost/127.0.0.1:65394, sessionid = 0x139dead69790001, negotiated timeout = 10000
[junit4:junit4]   2> 128 T2259 oascc.ConnectionManager.process Watcher org.apache.solr.common.cloud.ConnectionManager@38b5eca8 name:ZooKeeperConnection Watcher:127.0.0.1:65394/solr got event WatchedEvent state:SyncConnected type:None path:null path:null type:None
[junit4:junit4]   2> 128 T2250 oascc.ConnectionManager.waitForConnected Client is connected to ZooKeeper
[junit4:junit4]   2> 128 T2250 oascc.SolrZkClient.makePath makePath: /collections/collection1
[junit4:junit4]   2> 139 T2250 oascc.SolrZkClient.makePath makePath: /collections/collection1/shards
[junit4:junit4]   2> 140 T2250 oascc.SolrZkClient.makePath makePath: /collections/control_collection
[junit4:junit4]   2> 147 T2250 oascc.SolrZkClient.makePath makePath: /collections/control_collection/shards
[junit4:junit4]   2> 149 T2250 oasc.AbstractZkTestCase.putConfig put /usr/home/hudson/hudson-slave/workspace/Lucene-Solr-Tests-trunk-Java6/solr/build/solr-core/test-files/solr/collection1/conf/solrconfig.xml to /configs/conf1/solrconfig.xml
[junit4:junit4]   2> 149 T2250 oascc.SolrZkClient.makePath makePath: /configs/conf1/solrconfig.xml
[junit4:junit4]   2> 161 T2250 oasc.AbstractZkTestCase.putConfig put /usr/home/hudson/hudson-slave/workspace/Lucene-Solr-Tests-trunk-Java6/solr/build/solr-core/test-files/solr/collection1/conf/schema.xml to /configs/conf1/schema.xml
[junit4:junit4]   2> 161 T2250 oascc.SolrZkClient.makePath makePath: /configs/conf1/schema.xml
[junit4:junit4]   2> 264 T2250 oasc.AbstractZkTestCase.putConfig put /usr/home/hudson/hudson-slave/workspace/Lucene-Solr-Tests-trunk-Java6/solr/build/solr-core/test-files/solr/collection1/conf/solrconfig.xml to /configs/conf1/solrconfig.xml
[junit4:junit4]   2> 264 T2250 oascc.SolrZkClient.makePath makePath: /configs/conf1/solrconfig.xml
[junit4:junit4]   2> 267 T2250 oasc.AbstractZkTestCase.putConfig put /usr/home/hudson/hudson-slave/workspace/Lucene-Solr-Tests-trunk-Java6/solr/build/solr-core/test-files/solr/collection1/conf/stopwords.txt to /configs/conf1/stopwords.txt
[junit4:junit4]   2> 267 T2250 oascc.SolrZkClient.makePath makePath: /configs/conf1/stopwords.txt
[junit4:junit4]   2> 280 T2250 oasc.AbstractZkTestCase.putConfig put /usr/home/hudson/hudson-slave/workspace/Lucene-Solr-Tests-trunk-Java6/solr/build/solr-core/test-files/solr/collection1/conf/protwords.txt to /configs/conf1/protwords.txt
[junit4:junit4]   2> 280 T2250 oascc.SolrZkClient.makePath makePath: /configs/conf1/protwords.txt
[junit4:junit4]   2> 282 T2250 oasc.AbstractZkTestCase.putConfig put /usr/home/hudson/hudson-slave/workspace/Lucene-Solr-Tests-trunk-Java6/solr/build/solr-core/test-files/solr/collection1/conf/currency.xml to /configs/conf1/currency.xml
[junit4:junit4]   2> 283 T2250 oascc.SolrZkClient.makePath makePath: /configs/conf1/currency.xml
[junit4:junit4]   2> 285 T2250 oasc.AbstractZkTestCase.putConfig put /usr/home/hudson/hudson-slave/workspace/Lucene-Solr-Tests-trunk-Java6/solr/build/solr-core/test-files/solr/collection1/conf/open-exchange-rates.json to /configs/conf1/open-exchange-rates.json
[junit4:junit4]   2> 285 T2250 oascc.SolrZkClient.makePath makePath: /configs/conf1/open-exchange-rates.json
[junit4:junit4]   2> 289 T2250 oasc.AbstractZkTestCase.putConfig put /usr/home/hudson/hudson-slave/workspace/Lucene-Solr-Tests-trunk-Java6/solr/build/solr-core/test-files/solr/collection1/conf/mapping-ISOLatin1Accent.txt to /configs/conf1/mapping-ISOLatin1Accent.txt
[junit4:junit4]   2> 289 T2250 oascc.SolrZkClient.makePath makePath: /configs/conf1/mapping-ISOLatin1Accent.txt
[junit4:junit4]   2> 291 T2250 oasc.AbstractZkTestCase.putConfig put /usr/home/hudson/hudson-slave/workspace/Lucene-Solr-Tests-trunk-Java6/solr/build/solr-core/test-files/solr/collection1/conf/old_synonyms.txt to /configs/conf1/old_synonyms.txt
[junit4:junit4]   2> 292 T2250 oascc.SolrZkClient.makePath makePath: /configs/conf1/old_synonyms.txt
[junit4:junit4]   2> 300 T2250 oasc.AbstractZkTestCase.putConfig put /usr/home/hudson/hudson-slave/workspace/Lucene-Solr-Tests-trunk-Java6/solr/build/solr-core/test-files/solr/collection1/conf/synonyms.txt to /configs/conf1/synonyms.txt
[junit4:junit4]   2> 300 T2250 oascc.SolrZkClient.makePath makePath: /configs/conf1/synonyms.txt
[junit4:junit4]   2> 302 T2255 oazs.PrepRequestProcessor.pRequest Processed session termination for sessionid: 0x139dead69790001
[junit4:junit4]   2> 303 T2259 oaz.ClientCnxn$EventThread.run EventThread shut down
[junit4:junit4]   2> 303 T2250 oaz.ZooKeeper.close Session: 0x139dead69790001 closed
[junit4:junit4]   2> 303 T2252 oazs.NIOServerCnxn.closeSock Closed socket connection for client /140.211.11.196:65396 which had sessionid 0x139dead69790001
[junit4:junit4]   2> 305 T2250 oejs.Server.doStart jetty-8.1.2.v20120308
[junit4:junit4]   2> 309 T2250 oejs.AbstractConnector.doStart Started SocketConnector@0.0.0.0:65397
[junit4:junit4]   2> 309 T2250 oasc.SolrResourceLoader.locateSolrHome JNDI not configured for solr (NoInitialContextEx)
[junit4:junit4]   2> 309 T2250 oasc.SolrResourceLoader.locateSolrHome using system property solr.solr.home: /usr/home/hudson/hudson-slave/workspace/Lucene-Solr-Tests-trunk-Java6/solr/build/solr-core/test-files/solr
[junit4:junit4]   2> 310 T2250 oasc.SolrResourceLoader.<init> new SolrResourceLoader for deduced Solr Home: '/usr/home/hudson/hudson-slave/workspace/Lucene-Solr-Tests-trunk-Java6/solr/build/solr-core/test-files/solr/'
[junit4:junit4]   2> 337 T2250 oass.SolrDispatchFilter.init SolrDispatchFilter.init()
[junit4:junit4]   2> 337 T2250 oasc.SolrResourceLoader.locateSolrHome JNDI not configured for solr (NoInitialContextEx)
[junit4:junit4]   2> 337 T2250 oasc.SolrResourceLoader.locateSolrHome using system property solr.solr.home: /usr/home/hudson/hudson-slave/workspace/Lucene-Solr-Tests-trunk-Java6/solr/build/solr-core/test-files/solr
[junit4:junit4]   2> 338 T2250 oasc.CoreContainer$Initializer.initialize looking for solr.xml: /usr/home/hudson/hudson-slave/workspace/Lucene-Solr-Tests-trunk-Java6/solr/build/solr-core/test-files/solr/solr.xml
[junit4:junit4]   2> 338 T2250 oasc.CoreContainer.<init> New CoreContainer 1456496425
[junit4:junit4]   2> 338 T2250 oasc.CoreContainer.load Loading CoreContainer using Solr Home: '/usr/home/hudson/hudson-slave/workspace/Lucene-Solr-Tests-trunk-Java6/solr/build/solr-core/test-files/solr/'
[junit4:junit4]   2> 339 T2250 oasc.SolrResourceLoader.<init> new SolrResourceLoader for directory: '/usr/home/hudson/hudson-slave/workspace/Lucene-Solr-Tests-trunk-Java6/solr/build/solr-core/test-files/solr/'
[junit4:junit4]   2> 357 T2250 oasc.CoreContainer.load Registering Log Listener
[junit4:junit4]   2> 369 T2250 oasc.CoreContainer.initZooKeeper Zookeeper client=127.0.0.1:65394/solr
[junit4:junit4]   2> 369 T2250 oaz.ZooKeeper.<init> Initiating client connection, connectString=127.0.0.1:65394/solr sessionTimeout=5000 watcher=org.apache.solr.common.cloud.ConnectionManager@176a37d7
[junit4:junit4]   2> 370 T2269 oaz.ClientCnxn$SendThread.startConnect Opening socket connection to server /127.0.0.1:65394
[junit4:junit4]   2> 370 T2250 oascc.ConnectionManager.waitForConnected Waiting for client to connect to ZooKeeper
[junit4:junit4]   2> 371 T2269 oaz.ClientCnxn$SendThread.primeConnection Socket connection established to localhost/127.0.0.1:65394, initiating session
[junit4:junit4]   2> 372 T2252 oazs.NIOServerCnxn$Factory.run Accepted socket connection from /140.211.11.196:65398
[junit4:junit4]   2> 372 T2252 oazs.NIOServerCnxn.readConnectRequest Client attempting to establish new session at /140.211.11.196:65398
[junit4:junit4]   2> 373 T2254 oazs.NIOServerCnxn.finishSessionInit Established session 0x139dead69790002 with negotiated timeout 5000 for client /140.211.11.196:65398
[junit4:junit4]   2> 373 T2269 oaz.ClientCnxn$SendThread.readConnectResult Session establishment complete on server localhost/127.0.0.1:65394, sessionid = 0x139dead69790002, negotiated timeout = 5000
[junit4:junit4]   2> 374 T2270 oascc.ConnectionManager.process Watcher org.apache.solr.common.cloud.ConnectionManager@176a37d7 name:ZooKeeperConnection Watcher:127.0.0.1:65394/solr got event WatchedEvent state:SyncConnected type:None path:null path:null type:None
[junit4:junit4]   2> 374 T2250 oascc.ConnectionManager.waitForConnected Client is connected to ZooKeeper
[junit4:junit4]   2> 375 T2255 oazs.PrepRequestProcessor.pRequest Got user-level KeeperException when processing sessionid:0x139dead69790002 type:create cxid:0x2 zxid:0xfffffffffffffffe txntype:unknown reqpath:n/a Error Path:/solr/overseer Error:KeeperErrorCode = NodeExists for /solr/overseer
[junit4:junit4]   2> 384 T2250 oascc.SolrZkClient.makePath makePath: /live_nodes
[junit4:junit4]   2> 386 T2250 oasc.ZkController.createEphemeralLiveNode Register node as live in ZooKeeper:/live_nodes/127.0.0.1:65397_solr
[junit4:junit4]   2> 386 T2255 oazs.PrepRequestProcessor.pRequest Got user-level KeeperException when processing sessionid:0x139dead69790002 type:delete cxid:0x7 zxid:0xfffffffffffffffe txntype:unknown reqpath:n/a Error Path:/solr/live_nodes/127.0.0.1:65397_solr Error:KeeperErrorCode = NoNode for /solr/live_nodes/127.0.0.1:65397_solr
[junit4:junit4]   2> 387 T2250 oascc.SolrZkClient.makePath makePath: /live_nodes/127.0.0.1:65397_solr
[junit4:junit4]   2> 394 T2250 oashc.HttpShardHandlerFactory.getParameter Setting socketTimeout to: 0
[junit4:junit4]   2> 394 T2250 oashc.HttpShardHandlerFactory.getParameter Setting urlScheme to: http://
[junit4:junit4]   2> 395 T2250 oashc.HttpShardHandlerFactory.getParameter Setting connTimeout to: 0
[junit4:junit4]   2> 395 T2250 oashc.HttpShardHandlerFactory.getParameter Setting maxConnectionsPerHost to: 20
[junit4:junit4]   2> 395 T2250 oashc.HttpShardHandlerFactory.getParameter Setting corePoolSize to: 0
[junit4:junit4]   2> 396 T2250 oashc.HttpShardHandlerFactory.getParameter Setting maximumPoolSize to: 2147483647
[junit4:junit4]   2> 396 T2250 oashc.HttpShardHandlerFactory.getParameter Setting maxThreadIdleTime to: 5
[junit4:junit4]   2> 396 T2250 oashc.HttpShardHandlerFactory.getParameter Setting sizeOfQueue to: -1
[junit4:junit4]   2> 397 T2250 oashc.HttpShardHandlerFactory.getParameter Setting fairnessPolicy to: false
[junit4:junit4]   2> 397 T2250 oascsi.HttpClientUtil.createClient Creating new http client, config:maxConnectionsPerHost=20&maxConnections=10000&socketTimeout=0&connTimeout=0&retry=false
[junit4:junit4]   2> 407 T2250 oascc.SolrZkClient.makePath makePath: /overseer_elect/election
[junit4:junit4]   2> 411 T2255 oazs.PrepRequestProcessor.pRequest Got user-level KeeperException when processing sessionid:0x139dead69790002 type:delete cxid:0x15 zxid:0xfffffffffffffffe txntype:unknown reqpath:n/a Error Path:/solr/overseer_elect/leader Error:KeeperErrorCode = NoNode for /solr/overseer_elect/leader
[junit4:junit4]   2> 424 T2250 oascc.SolrZkClient.makePath makePath: /overseer_elect/leader
[junit4:junit4]   2> 425 T2250 oasc.Overseer.start Overseer (id=88346504090681346-127.0.0.1:65397_solr-n_0000000000) starting
[junit4:junit4]   2> 426 T2255 oazs.PrepRequestProcessor.pRequest Got user-level KeeperException when processing sessionid:0x139dead69790002 type:create cxid:0x1a zxid:0xfffffffffffffffe txntype:unknown reqpath:n/a Error Path:/solr/overseer Error:KeeperErrorCode = NodeExists for /solr/overseer
[junit4:junit4]   2> 427 T2255 oazs.PrepRequestProcessor.pRequest Got user-level KeeperException when processing sessionid:0x139dead69790002 type:create cxid:0x1b zxid:0xfffffffffffffffe txntype:unknown reqpath:n/a Error Path:/solr/overseer Error:KeeperErrorCode = NodeExists for /solr/overseer
[junit4:junit4]   2> 428 T2255 oazs.PrepRequestProcessor.pRequest Got user-level KeeperException when processing sessionid:0x139dead69790002 type:create cxid:0x1c zxid:0xfffffffffffffffe txntype:unknown reqpath:n/a Error Path:/solr/overseer Error:KeeperErrorCode = NodeExists for /solr/overseer
[junit4:junit4]   2> 439 T2255 oazs.PrepRequestProcessor.pRequest Got user-level KeeperException when processing sessionid:0x139dead69790002 type:create cxid:0x1d zxid:0xfffffffffffffffe txntype:unknown reqpath:n/a Error Path:/solr/overseer Error:KeeperErrorCode = NodeExists for /solr/overseer
[junit4:junit4]   2> 440 T2272 oasc.OverseerCollectionProcessor.run Process current queue of collection creations
[junit4:junit4]   2> 440 T2250 oascc.SolrZkClient.makePath makePath: /clusterstate.json
[junit4:junit4]   2> 450 T2250 oascc.ZkStateReader.createClusterStateWatchersAndUpdate Updating cluster state from ZooKeeper... 
[junit4:junit4]   2> 451 T2271 oasc.Overseer$ClusterStateUpdater.run Starting to work on the main queue
[junit4:junit4]   2> 454 T2250 oasc.CoreContainer.create Creating SolrCore 'collection1' using instanceDir: /usr/home/hudson/hudson-slave/workspace/Lucene-Solr-Tests-trunk-Java6/solr/build/solr-core/test-files/solr/collection1
[junit4:junit4]   2> 455 T2250 oasc.ZkController.createCollectionZkNode Check for collection zkNode:control_collection
[junit4:junit4]   2> 455 T2250 oasc.ZkController.createCollectionZkNode Collection zkNode exists
[junit4:junit4]   2> 455 T2250 oasc.ZkController.readConfigName Load collection config from:/collections/control_collection
[junit4:junit4]   2> 456 T2250 oasc.SolrResourceLoader.<init> new SolrResourceLoader for directory: '/usr/home/hudson/hudson-slave/workspace/Lucene-Solr-Tests-trunk-Java6/solr/build/solr-core/test-files/solr/collection1/'
[junit4:junit4]   2> 457 T2250 oasc.SolrResourceLoader.replaceClassLoader Adding 'file:/usr/home/hudson/hudson-slave/workspace/Lucene-Solr-Tests-trunk-Java6/solr/build/solr-core/test-files/solr/collection1/lib/classes/' to classloader
[junit4:junit4]   2> 458 T2250 oasc.SolrResourceLoader.replaceClassLoader Adding 'file:/usr/home/hudson/hudson-slave/workspace/Lucene-Solr-Tests-trunk-Java6/solr/build/solr-core/test-files/solr/collection1/lib/README' to classloader
[junit4:junit4]   2> 496 T2250 oasc.SolrConfig.<init> Using Lucene MatchVersion: LUCENE_50
[junit4:junit4]   2> 548 T2250 oasc.SolrConfig.<init> Loaded SolrConfig: solrconfig.xml
[junit4:junit4]   2> 648 T2250 oass.IndexSchema.readSchema Reading Solr Schema
[junit4:junit4]   2> 657 T2250 oass.IndexSchema.readSchema Schema name=test
[junit4:junit4]   2> 1266 T2250 oass.OpenExchangeRatesOrgProvider.init Initialized with rates=open-exchange-rates.json, refreshInterval=1440.
[junit4:junit4]   2> 1274 T2250 oass.IndexSchema.readSchema default search field in schema is text
[junit4:junit4]   2> 1277 T2250 oass.IndexSchema.readSchema unique key field: id
[junit4:junit4]   2> 1285 T2250 oass.FileExchangeRateProvider.reload Reloading exchange rates from file currency.xml
[junit4:junit4]   2> 1288 T2250 oass.FileExchangeRateProvider.reload Reloading exchange rates from file currency.xml
[junit4:junit4]   2> 1291 T2250 oass.OpenExchangeRatesOrgProvider.reload Reloading exchange rates from open-exchange-rates.json
[junit4:junit4]   2> 1292 T2250 oass.OpenExchangeRatesOrgProvider.reload Reloading exchange rates from open-exchange-rates.json
[junit4:junit4]   2> 1293 T2250 oasc.SolrCore.<init> [collection1] Opening new SolrCore at /usr/home/hudson/hudson-slave/workspace/Lucene-Solr-Tests-trunk-Java6/solr/build/solr-core/test-files/solr/collection1/, dataDir=./org.apache.solr.cloud.BasicDistributedZk2Test-1348060670324/control/data/
[junit4:junit4]   2> 1293 T2250 oasc.JmxMonitoredMap.<init> JMX monitoring is enabled. Adding Solr mbeans to JMX Server: com.sun.jmx.mbeanserver.JmxMBeanServer@27bc4ec8
[junit4:junit4]   2> 1294 T2250 oasc.SolrCore.getNewIndexDir WARNING New index directory detected: old=null new=./org.apache.solr.cloud.BasicDistributedZk2Test-1348060670324/control/data/index/
[junit4:junit4]   2> 1295 T2250 oasc.SolrCore.initIndex WARNING [collection1] Solr index directory './org.apache.solr.cloud.BasicDistributedZk2Test-1348060670324/control/data/index' doesn't exist. Creating new index...
[junit4:junit4]   2> 1296 T2250 oasc.CachingDirectoryFactory.get return new directory for /usr/home/hudson/hudson-slave/workspace/Lucene-Solr-Tests-trunk-Java6/solr/build/solr-core/test/J0/./org.apache.solr.cloud.BasicDistributedZk2Test-1348060670324/control/data/index forceNew:false
[junit4:junit4]   2> 1337 T2250 oasc.SolrDeletionPolicy.onCommit SolrDeletionPolicy.onCommit: commits:num=1
[junit4:junit4]   2> 		commit{dir=NRTCachingDirectory(org.apache.lucene.store.NIOFSDirectory@/usr/home/hudson/hudson-slave/workspace/Lucene-Solr-Tests-trunk-Java6/solr/build/solr-core/test/J0/org.apache.solr.cloud.BasicDistributedZk2Test-1348060670324/control/data/index lockFactory=org.apache.lucene.store.NativeFSLockFactory@798ded3f; maxCacheMB=48.0 maxMergeSizeMB=4.0),segFN=segments_1,generation=1,filenames=[segments_1]
[junit4:junit4]   2> 1337 T2250 oasc.SolrDeletionPolicy.updateCommits newest commit = 1
[junit4:junit4]   2> 1338 T2250 oasc.SolrCore.initWriters created xml: solr.XMLResponseWriter
[junit4:junit4]   2> 1339 T2250 oasup.UpdateRequestProcessorChain.init inserting DistributedUpdateProcessorFactory into updateRequestProcessorChain "dedupe"
[junit4:junit4]   2> 1340 T2250 oasup.UpdateRequestProcessorChain.init inserting DistributedUpdateProcessorFactory into updateRequestProcessorChain "dedupe-allfields"
[junit4:junit4]   2> 1340 T2250 oasup.UpdateRequestProcessorChain.init inserting DistributedUpdateProcessorFactory into updateRequestProcessorChain "stored_sig"
[junit4:junit4]   2> 1341 T2250 oasup.UpdateRequestProcessorChain.init inserting DistributedUpdateProcessorFactory into updateRequestProcessorChain "uniq-fields"
[junit4:junit4]   2> 1341 T2250 oasup.UpdateRequestProcessorChain.init inserting DistributedUpdateProcessorFactory into updateRequestProcessorChain "distrib-dup-test-chain-implicit"
[junit4:junit4]   2> 1341 T2250 oasc.RequestHandlers.initHandlersFromConfig adding lazy requestHandler: solr.ReplicationHandler
[junit4:junit4]   2> 1342 T2250 oasc.RequestHandlers.initHandlersFromConfig created /replication: solr.ReplicationHandler
[junit4:junit4]   2> 1342 T2250 oasc.RequestHandlers.initHandlersFromConfig created standard: solr.StandardRequestHandler
[junit4:junit4]   2> 1343 T2250 oasc.RequestHandlers.initHandlersFromConfig created /get: solr.RealTimeGetHandler
[junit4:junit4]   2> 1343 T2250 oasc.RequestHandlers.initHandlersFromConfig created dismax: solr.SearchHandler
[junit4:junit4]   2> 1344 T2250 oasc.RequestHandlers.initHandlersFromConfig created mock: org.apache.solr.core.MockQuerySenderListenerReqHandler
[junit4:junit4]   2> 1344 T2250 oasc.RequestHandlers.initHandlersFromConfig created /admin/: org.apache.solr.handler.admin.AdminHandlers
[junit4:junit4]   2> 1344 T2250 oasc.RequestHandlers.initHandlersFromConfig created defaults: solr.StandardRequestHandler
[junit4:junit4]   2> 1345 T2250 oasc.RequestHandlers.initHandlersFromConfig adding lazy requestHandler: solr.StandardRequestHandler
[junit4:junit4]   2> 1345 T2250 oasc.RequestHandlers.initHandlersFromConfig created lazy: solr.StandardRequestHandler
[junit4:junit4]   2> 1346 T2250 oasc.RequestHandlers.initHandlersFromConfig created /update: solr.UpdateRequestHandler
[junit4:junit4]   2> 1346 T2250 oasc.RequestHandlers.initHandlersFromConfig created /terms: org.apache.solr.handler.component.SearchHandler
[junit4:junit4]   2> 1347 T2250 oasc.RequestHandlers.initHandlersFromConfig created spellCheckCompRH: org.apache.solr.handler.component.SearchHandler
[junit4:junit4]   2> 1347 T2250 oasc.RequestHandlers.initHandlersFromConfig created spellCheckCompRH_Direct: org.apache.solr.handler.component.SearchHandler
[junit4:junit4]   2> 1347 T2250 oasc.RequestHandlers.initHandlersFromConfig created spellCheckWithWordbreak: org.apache.solr.handler.component.SearchHandler
[junit4:junit4]   2> 1348 T2250 oasc.RequestHandlers.initHandlersFromConfig created spellCheckWithWordbreak_Direct: org.apache.solr.handler.component.SearchHandler
[junit4:junit4]   2> 1348 T2250 oasc.RequestHandlers.initHandlersFromConfig created spellCheckCompRH1: org.apache.solr.handler.component.SearchHandler
[junit4:junit4]   2> 1349 T2250 oasc.RequestHandlers.initHandlersFromConfig created tvrh: org.apache.solr.handler.component.SearchHandler
[junit4:junit4]   2> 1349 T2250 oasc.RequestHandlers.initHandlersFromConfig created /mlt: solr.MoreLikeThisHandler
[junit4:junit4]   2> 1350 T2250 oasc.RequestHandlers.initHandlersFromConfig created /debug/dump: solr.DumpRequestHandler
[junit4:junit4]   2> 1352 T2250 oashl.XMLLoader.init xsltCacheLifetimeSeconds=60
[junit4:junit4]   2> 1355 T2250 oasc.SolrCore.initDeprecatedSupport WARNING solrconfig.xml uses deprecated <admin/gettableFiles>, Please update your config to use the ShowFileRequestHandler.
[junit4:junit4]   2> 1356 T2250 oasc.SolrCore.initDeprecatedSupport WARNING adding ShowFileRequestHandler with hidden files: [SCHEMA.XML, OLD_SYNONYMS.TXT, STOPWORDS.TXT, PROTWORDS.TXT, OPEN-EXCHANGE-RATES.JSON, SYNONYMS.TXT, CURRENCY.XML, MAPPING-ISOLATIN1ACCENT.TXT]
[junit4:junit4]   2> 1359 T2250 oass.SolrIndexSearcher.<init> Opening Searcher@6798186d main
[junit4:junit4]   2> 1360 T2250 oasu.CommitTracker.<init> Hard AutoCommit: disabled
[junit4:junit4]   2> 1360 T2250 oasu.CommitTracker.<init> Soft AutoCommit: disabled
[junit4:junit4]   2> 1361 T2250 oashc.SpellCheckComponent.inform Initializing spell checkers
[junit4:junit4]   2> 1367 T2250 oass.DirectSolrSpellChecker.init init: {name=direct,classname=DirectSolrSpellChecker,field=lowerfilt,minQueryLength=3}
[junit4:junit4]   2> 1486 T2273 oasc.SolrCore.registerSearcher [collection1] Registered new searcher Searcher@6798186d main{StandardDirectoryReader(segments_1:1)}
[junit4:junit4]   2> 1489 T2255 oazs.PrepRequestProcessor.pRequest Got user-level KeeperException when processing sessionid:0x139dead69790002 type:create cxid:0x56 zxid:0xfffffffffffffffe txntype:unknown reqpath:n/a Error Path:/solr/overseer/queue Error:KeeperErrorCode = NoNode for /solr/overseer/queue
[junit4:junit4]   2> 1503 T2250 oasc.CoreContainer.register registering core: collection1
[junit4:junit4]   2> 1504 T2250 oasc.ZkController.register Register shard - core:collection1 address:http://127.0.0.1:65397/solr shardId:control_shard
[junit4:junit4]   2> 1504 T2250 oascc.SolrZkClient.makePath makePath: /collections/control_collection/leader_elect/control_shard/election
[junit4:junit4]   2> 1516 T2255 oazs.PrepRequestProcessor.pRequest Got user-level KeeperException when processing sessionid:0x139dead69790002 type:delete cxid:0x65 zxid:0xfffffffffffffffe txntype:unknown reqpath:n/a Error Path:/solr/collections/control_collection/leaders Error:KeeperErrorCode = NoNode for /solr/collections/control_collection/leaders
[junit4:junit4]   2> 1517 T2250 oasc.ShardLeaderElectionContext.runLeaderProcess Running the leader process.
[junit4:junit4]   2> 1517 T2255 oazs.PrepRequestProcessor.pRequest Got user-level KeeperException when processing sessionid:0x139dead69790002 type:create cxid:0x66 zxid:0xfffffffffffffffe txntype:unknown reqpath:n/a Error Path:/solr/overseer Error:KeeperErrorCode = NodeExists for /solr/overseer
[junit4:junit4]   2> 1956 T2271 oascc.ZkStateReader.updateClusterState Updating cloud state from ZooKeeper... 
[junit4:junit4]   2> 1957 T2255 oazs.PrepRequestProcessor.pRequest Got user-level KeeperException when processing sessionid:0x139dead69790002 type:create cxid:0x6d zxid:0xfffffffffffffffe txntype:unknown reqpath:n/a Error Path:/solr/overseer/queue-work Error:KeeperErrorCode = NoNode for /solr/overseer/queue-work
[junit4:junit4]   2> 1984 T2270 oascc.ZkStateReader$2.process A cluster state change has occurred - updating...
[junit4:junit4]   2> 2028 T2250 oasc.ShardLeaderElectionContext.waitForReplicasToComeUp Enough replicas found to continue.
[junit4:junit4]   2> 2029 T2250 oasc.ShardLeaderElectionContext.runLeaderProcess I may be the new leader - try and sync
[junit4:junit4]   2> 2029 T2250 oasc.SyncStrategy.sync Sync replicas to http://127.0.0.1:65397/solr/collection1/
[junit4:junit4]   2> 2030 T2250 oasc.SyncStrategy.syncReplicas Sync Success - now sync replicas to me
[junit4:junit4]   2> 2030 T2250 oasc.SyncStrategy.syncToMe http://127.0.0.1:65397/solr/collection1/ has no replicas
[junit4:junit4]   2> 2031 T2250 oasc.ShardLeaderElectionContext.runLeaderProcess I am the new leader: http://127.0.0.1:65397/solr/collection1/
[junit4:junit4]   2> 2031 T2250 oascc.SolrZkClient.makePath makePath: /collections/control_collection/leaders/control_shard
[junit4:junit4]   2> 2034 T2255 oazs.PrepRequestProcessor.pRequest Got user-level KeeperException when processing sessionid:0x139dead69790002 type:create cxid:0x8b zxid:0xfffffffffffffffe txntype:unknown reqpath:n/a Error Path:/solr/overseer Error:KeeperErrorCode = NodeExists for /solr/overseer
[junit4:junit4]   2> 2488 T2271 oascc.ZkStateReader.updateClusterState Updating cloud state from ZooKeeper... 
[junit4:junit4]   2> 2507 T2270 oascc.ZkStateReader$2.process A cluster state change has occurred - updating...
[junit4:junit4]   2> 2546 T2250 oasc.ZkController.register We are http://127.0.0.1:65397/solr/collection1/ and leader is http://127.0.0.1:65397/solr/collection1/
[junit4:junit4]   2> 2546 T2250 oasc.ZkController.register No LogReplay needed for core=collection1 baseURL=http://127.0.0.1:65397/solr
[junit4:junit4]   2> 2547 T2250 oasc.ZkController.checkRecovery I am the leader, no recovery necessary
[junit4:junit4]   2> 2549 T2250 oascc.ZkStateReader.updateClusterState Updating cloud state from ZooKeeper... 
[junit4:junit4]   2> 2550 T2250 oass.SolrDispatchFilter.init user.dir=/usr/home/hudson/hudson-slave/workspace/Lucene-Solr-Tests-trunk-Java6/solr/build/solr-core/test/J0
[junit4:junit4]   2> 2550 T2250 oass.SolrDispatchFilter.init SolrDispatchFilter.init() done
[junit4:junit4]   2> 2551 T2250 oascsi.HttpClientUtil.createClient Creating new http client, config:maxConnections=128&maxConnectionsPerHost=32&followRedirects=false
[junit4:junit4]   2> 3010 T2271 oascc.ZkStateReader.updateClusterState Updating cloud state from ZooKeeper... 
[junit4:junit4]   2> 3188 T2270 oascc.ZkStateReader$2.process A cluster state change has occurred - updating...
[junit4:junit4]   2> 3581 T2250 oejs.Server.doStart jetty-8.1.2.v20120308
[junit4:junit4]   2> 3585 T2250 oejs.AbstractConnector.doStart Started SocketConnector@0.0.0.0:65410
[junit4:junit4]   2> 3586 T2250 oasc.SolrResourceLoader.locateSolrHome JNDI not configured for solr (NoInitialContextEx)
[junit4:junit4]   2> 3587 T2250 oasc.SolrResourceLoader.locateSolrHome using system property solr.solr.home: /usr/home/hudson/hudson-slave/workspace/Lucene-Solr-Tests-trunk-Java6/solr/build/solr-core/test/J0/./solrtest-jetty1-1348060672886
[junit4:junit4]   2> 3587 T2250 oasc.SolrResourceLoader.<init> new SolrResourceLoader for deduced Solr Home: '/usr/home/hudson/hudson-slave/workspace/Lucene-Solr-Tests-trunk-Java6/solr/build/solr-core/test/J0/./solrtest-jetty1-1348060672886/'
[junit4:junit4]   2> 3620 T2250 oass.SolrDispatchFilter.init SolrDispatchFilter.init()
[junit4:junit4]   2> 3621 T2250 oasc.SolrResourceLoader.locateSolrHome JNDI not configured for solr (NoInitialContextEx)
[junit4:junit4]   2> 3621 T2250 oasc.SolrResourceLoader.locateSolrHome using system property solr.solr.home: /usr/home/hudson/hudson-slave/workspace/Lucene-Solr-Tests-trunk-Java6/solr/build/solr-core/test/J0/./solrtest-jetty1-1348060672886
[junit4:junit4]   2> 3622 T2250 oasc.CoreContainer$Initializer.initialize looking for solr.xml: /usr/home/hudson/hudson-slave/workspace/Lucene-Solr-Tests-trunk-Java6/solr/build/solr-core/test/J0/./solrtest-jetty1-1348060672886/solr.xml
[junit4:junit4]   2> 3622 T2250 oasc.CoreContainer.<init> New CoreContainer 891128047
[junit4:junit4]   2> 3623 T2250 oasc.CoreContainer.load Loading CoreContainer using Solr Home: '/usr/home/hudson/hudson-slave/workspace/Lucene-Solr-Tests-trunk-Java6/solr/build/solr-core/test/J0/./solrtest-jetty1-1348060672886/'
[junit4:junit4]   2> 3623 T2250 oasc.SolrResourceLoader.<init> new SolrResourceLoader for directory: '/usr/home/hudson/hudson-slave/workspace/Lucene-Solr-Tests-trunk-Java6/solr/build/solr-core/test/J0/./solrtest-jetty1-1348060672886/'
[junit4:junit4]   2> 3646 T2250 oasc.CoreContainer.load Registering Log Listener
[junit4:junit4]   2> 3661 T2250 oasc.CoreContainer.initZooKeeper Zookeeper client=127.0.0.1:65394/solr
[junit4:junit4]   2> 3662 T2250 oaz.ZooKeeper.<init> Initiating client connection, connectString=127.0.0.1:65394/solr sessionTimeout=5000 watcher=org.apache.solr.common.cloud.ConnectionManager@209aa5f3
[junit4:junit4]   2> 3663 T2283 oaz.ClientCnxn$SendThread.startConnect Opening socket connection to server /127.0.0.1:65394
[junit4:junit4]   2> 3663 T2250 oascc.ConnectionManager.waitForConnected Waiting for client to connect to ZooKeeper
[junit4:junit4]   2> 3664 T2283 oaz.ClientCnxn$SendThread.primeConnection Socket connection established to localhost/127.0.0.1:65394, initiating session
[junit4:junit4]   2> 3664 T2252 oazs.NIOServerCnxn$Factory.run Accepted socket connection from /140.211.11.196:65411
[junit4:junit4]   2> 3665 T2252 oazs.NIOServerCnxn.readConnectRequest Client attempting to establish new session at /140.211.11.196:65411
[junit4:junit4]   2> 3667 T2254 oazs.NIOServerCnxn.finishSessionInit Established session 0x139dead69790003 with negotiated timeout 5000 for client /140.211.11.196:65411
[junit4:junit4]   2> 3667 T2283 oaz.ClientCnxn$SendThread.readConnectResult Session establishment complete on server localhost/127.0.0.1:65394, sessionid = 0x139dead69790003, negotiated timeout = 5000
[junit4:junit4]   2> 3667 T2284 oascc.ConnectionManager.process Watcher org.apache.solr.common.cloud.ConnectionManager@209aa5f3 name:ZooKeeperConnection Watcher:127.0.0.1:65394/solr got event WatchedEvent state:SyncConnected type:None path:null path:null type:None
[junit4:junit4]   2> 3667 T2250 oascc.ConnectionManager.waitForConnected Client is connected to ZooKeeper
[junit4:junit4]   2> 3668 T2255 oazs.PrepRequestProcessor.pRequest Got user-level KeeperException when processing sessionid:0x139dead69790003 type:create cxid:0x1 zxid:0xfffffffffffffffe txntype:unknown reqpath:n/a Error Path:/solr/overseer Error:KeeperErrorCode = NodeExists for /solr/overseer
[junit4:junit4]   2> 3677 T2255 oazs.PrepRequestProcessor.pRequest Got user-level KeeperException when processing sessionid:0x139dead69790003 type:create cxid:0x2 zxid:0xfffffffffffffffe txntype:unknown reqpath:n/a Error Path:/solr/overseer Error:KeeperErrorCode = NodeExists for /solr/overseer
[junit4:junit4]   2> 3678 T2250 oasc.ZkController.createEphemeralLiveNode Register node as live in ZooKeeper:/live_nodes/127.0.0.1:65410_solr
[junit4:junit4]   2> 3678 T2255 oazs.PrepRequestProcessor.pRequest Got user-level KeeperException when processing sessionid:0x139dead69790003 type:delete cxid:0x4 zxid:0xfffffffffffffffe txntype:unknown reqpath:n/a Error Path:/solr/live_nodes/127.0.0.1:65410_solr Error:KeeperErrorCode = NoNode for /solr/live_nodes/127.0.0.1:65410_solr
[junit4:junit4]   2> 3685 T2250 oascc.SolrZkClient.makePath makePath: /live_nodes/127.0.0.1:65410_solr
[junit4:junit4]   2> 3686 T2270 oascc.ZkStateReader$3.process Updating live nodes
[junit4:junit4]   2> 3687 T2250 oashc.HttpShardHandlerFactory.getParameter Setting socketTimeout to: 0
[junit4:junit4]   2> 3687 T2250 oashc.HttpShardHandlerFactory.getParameter Setting urlScheme to: http://
[junit4:junit4]   2> 3688 T2250 oashc.HttpShardHandlerFactory.getParameter Setting connTimeout to: 0
[junit4:junit4]   2> 3688 T2250 oashc.HttpShardHandlerFactory.getParameter Setting maxConnectionsPerHost to: 20
[junit4:junit4]   2> 3689 T2250 oashc.HttpShardHandlerFactory.getParameter Setting corePoolSize to: 0
[junit4:junit4]   2> 3689 T2250 oashc.HttpShardHandlerFactory.getParameter Setting maximumPoolSize to: 2147483647
[junit4:junit4]   2> 3690 T2250 oashc.HttpShardHandlerFactory.getParameter Setting maxThreadIdleTime to: 5
[junit4:junit4]   2> 3690 T2250 oashc.HttpShardHandlerFactory.getParameter Setting sizeOfQueue to: -1
[junit4:junit4]   2> 3690 T2250 oashc.HttpShardHandlerFactory.getParameter Setting fairnessPolicy to: false
[junit4:junit4]   2> 3691 T2250 oascsi.HttpClientUtil.createClient Creating new http client, config:maxConnectionsPerHost=20&maxConnections=10000&socketTimeout=0&connTimeout=0&retry=false
[junit4:junit4]   2> 3710 T2250 oascc.ZkStateReader.createClusterStateWatchersAndUpdate Updating cluster state from ZooKeeper... 
[junit4:junit4]   2> 3715 T2250 oasc.CoreContainer.create Creating SolrCore 'collection1' using instanceDir: /usr/home/hudson/hudson-slave/workspace/Lucene-Solr-Tests-trunk-Java6/solr/build/solr-core/test/J0/./solrtest-jetty1-1348060672886/collection1
[junit4:junit4]   2> 3716 T2250 oasc.ZkController.createCollectionZkNode Check for collection zkNode:collection1
[junit4:junit4]   2> 3716 T2250 oasc.ZkController.createCollectionZkNode Collection zkNode exists
[junit4:junit4]   2> 3717 T2250 oasc.ZkController.readConfigName Load collection config from:/collections/collection1
[junit4:junit4]   2> 3718 T2250 oasc.SolrResourceLoader.<init> new SolrResourceLoader for directory: '/usr/home/hudson/hudson-slave/workspace/Lucene-Solr-Tests-trunk-Java6/solr/build/solr-core/test/J0/./solrtest-jetty1-1348060672886/collection1/'
[junit4:junit4]   2> 3719 T2250 oasc.SolrResourceLoader.replaceClassLoader Adding 'file:/usr/home/hudson/hudson-slave/workspace/Lucene-Solr-Tests-trunk-Java6/solr/build/solr-core/test/J0/solrtest-jetty1-1348060672886/collection1/lib/README' to classloader
[junit4:junit4]   2> 3720 T2250 oasc.SolrResourceLoader.replaceClassLoader Adding 'file:/usr/home/hudson/hudson-slave/workspace/Lucene-Solr-Tests-trunk-Java6/solr/build/solr-core/test/J0/solrtest-jetty1-1348060672886/collection1/lib/classes/' to classloader
[junit4:junit4]   2> 3772 T2250 oasc.SolrConfig.<init> Using Lucene MatchVersion: LUCENE_50
[junit4:junit4]   2> 3854 T2250 oasc.SolrConfig.<init> Loaded SolrConfig: solrconfig.xml
[junit4:junit4]   2> 3955 T2250 oass.IndexSchema.readSchema Reading Solr Schema
[junit4:junit4]   2> 3970 T2250 oass.IndexSchema.readSchema Schema name=test
[junit4:junit4]   2> 4612 T2250 oass.OpenExchangeRatesOrgProvider.init Initialized with rates=open-exchange-rates.json, refreshInterval=1440.
[junit4:junit4]   2> 4624 T2250 oass.IndexSchema.readSchema default search field in schema is text
[junit4:junit4]   2> 4628 T2250 oass.IndexSchema.readSchema unique key field: id
[junit4:junit4]   2> 4639 T2250 oass.FileExchangeRateProvider.reload Reloading exchange rates from file currency.xml
[junit4:junit4]   2> 4644 T2250 oass.FileExchangeRateProvider.reload Reloading exchange rates from file currency.xml
[junit4:junit4]   2> 4648 T2250 oass.OpenExchangeRatesOrgProvider.reload Reloading exchange rates from open-exchange-rates.json
[junit4:junit4]   2> 4649 T2250 oass.OpenExchangeRatesOrgProvider.reload Reloading exchange rates from open-exchange-rates.json
[junit4:junit4]   2> 4650 T2250 oasc.SolrCore.<init> [collection1] Opening new SolrCore at /usr/home/hudson/hudson-slave/workspace/Lucene-Solr-Tests-trunk-Java6/solr/build/solr-core/test/J0/./solrtest-jetty1-1348060672886/collection1/, dataDir=./org.apache.solr.cloud.BasicDistributedZk2Test-1348060670324/jetty1/
[junit4:junit4]   2> 4651 T2250 oasc.JmxMonitoredMap.<init> JMX monitoring is enabled. Adding Solr mbeans to JMX Server: com.sun.jmx.mbeanserver.JmxMBeanServer@27bc4ec8
[junit4:junit4]   2> 4652 T2250 oasc.SolrCore.getNewIndexDir WARNING New index directory detected: old=null new=./org.apache.solr.cloud.BasicDistributedZk2Test-1348060670324/jetty1/index/
[junit4:junit4]   2> 4653 T2250 oasc.SolrCore.initIndex WARNING [collection1] Solr index directory './org.apache.solr.cloud.BasicDistributedZk2Test-1348060670324/jetty1/index' doesn't exist. Creating new index...
[junit4:junit4]   2> 4654 T2250 oasc.CachingDirectoryFactory.get return new directory for /usr/home/hudson/hudson-slave/workspace/Lucene-Solr-Tests-trunk-Java6/solr/build/solr-core/test/J0/./org.apache.solr.cloud.BasicDistributedZk2Test-1348060670324/jetty1/index forceNew:false
[junit4:junit4]   2> 4661 T2250 oasc.SolrDeletionPolicy.onCommit SolrDeletionPolicy.onCommit: commits:num=1
[junit4:junit4]   2> 		commit{dir=NRTCachingDirectory(org.apache.lucene.store.NIOFSDirectory@/usr/home/hudson/hudson-slave/workspace/Lucene-Solr-Tests-trunk-Java6/solr/build/solr-core/test/J0/org.apache.solr.cloud.BasicDistributedZk2Test-1348060670324/jetty1/index lockFactory=org.apache.lucene.store.NativeFSLockFactory@2225a390; maxCacheMB=48.0 maxMergeSizeMB=4.0),segFN=segments_1,generation=1,filenames=[segments_1]
[junit4:junit4]   2> 4661 T2250 oasc.SolrDeletionPolicy.updateCommits newest commit = 1
[junit4:junit4]   2> 4662 T2250 oasc.SolrCore.initWriters created xml: solr.XMLResponseWriter
[junit4:junit4]   2> 4665 T2250 oasup.UpdateRequestProcessorChain.init inserting DistributedUpdateProcessorFactory into updateRequestProcessorChain "dedupe"
[junit4:junit4]   2> 4665 T2250 oasup.UpdateRequestProcessorChain.init inserting DistributedUpdateProcessorFactory into updateRequestProcessorChain "dedupe-allfields"
[junit4:junit4]   2> 4666 T2250 oasup.UpdateRequestProcessorChain.init inserting DistributedUpdateProcessorFactory into updateRequestProcessorChain "stored_sig"
[junit4:junit4]   2> 4666 T2250 oasup.UpdateRequestProcessorChain.init inserting DistributedUpdateProcessorFactory into updateRequestProcessorChain "uniq-fields"
[junit4:junit4]   2> 4667 T2250 oasup.UpdateRequestProcessorChain.init inserting DistributedUpdateProcessorFactory into updateRequestProcessorChain "distrib-dup-test-chain-implicit"
[junit4:junit4]   2> 4668 T2250 oasc.RequestHandlers.initHandlersFromConfig adding lazy requestHandler: solr.ReplicationHandler
[junit4:junit4]   2> 4668 T2250 oasc.RequestHandlers.initHandlersFromConfig created /replication: solr.ReplicationHandler
[junit4:junit4]   2> 4669 T2250 oasc.RequestHandlers.initHandlersFromConfig created standard: solr.StandardRequestHandler
[junit4:junit4]   2> 4670 T2250 oasc.RequestHandlers.initHandlersFromConfig created /get: solr.RealTimeGetHandler
[junit4:junit4]   2> 4671 T2250 oasc.RequestHandlers.initHandlersFromConfig created dismax: solr.SearchHandler
[junit4:junit4]   2> 4671 T2250 oasc.RequestHandlers.initHandlersFromConfig created mock: org.apache.solr.core.MockQuerySenderListenerReqHandler
[junit4:junit4]   2> 4672 T2250 oasc.RequestHandlers.initHandlersFromConfig created /admin/: org.apache.solr.handler.admin.AdminHandlers
[junit4:junit4]   2> 4673 T2250 oasc.RequestHandlers.initHandlersFromConfig created defaults: solr.StandardRequestHandler
[junit4:junit4]   2> 4673 T2250 oasc.RequestHandlers.initHandlersFromConfig adding lazy requestHandler: solr.StandardRequestHandler
[junit4:junit4]   2> 4674 T2250 oasc.RequestHandlers.initHandlersFromConfig created lazy: solr.StandardRequestHandler
[junit4:junit4]   2> 4675 T2250 oasc.RequestHandlers.initHandlersFromConfig created /update: solr.UpdateRequestHandler
[junit4:junit4]   2> 4675 T2250 oasc.RequestHandlers.initHandlersFromConfig created /terms: org.apache.solr.handler.component.SearchHandler
[junit4:junit4]   2> 4676 T2250 oasc.RequestHandlers.initHandlersFromConfig created spellCheckCompRH: org.apache.solr.handler.component.SearchHandler
[junit4:junit4]   2> 4677 T2250 oasc.RequestHandlers.initHandlersFromConfig created spellCheckCompRH_Direct: org.apache.solr.handler.component.SearchHandler
[junit4:junit4]   2> 4677 T2250 oasc.RequestHandlers.initHandlersFromConfig created spellCheckWithWordbreak: org.apache.solr.handler.component.SearchHandler
[junit4:junit4]   2> 4678 T2250 oasc.RequestHandlers.initHandlersFromConfig created spellCheckWithWordbreak_Direct: org.apache.solr.handler.component.SearchHandler
[junit4:junit4]   2> 4679 T2250 oasc.RequestHandlers.initHandlersFromConfig created spellCheckCompRH1: org.apache.solr.handler.component.SearchHandler
[junit4:junit4]   2> 4680 T2250 oasc.RequestHandlers.initHandlersFromConfig created tvrh: org.apache.solr.handler.component.SearchHandler
[junit4:junit4]   2> 4681 T2250 oasc.RequestHandlers.initHandlersFromConfig created /mlt: solr.MoreLikeThisHandler
[junit4:junit4]   2> 4681 T2250 oasc.RequestHandlers.initHandlersFromConfig created /debug/dump: solr.DumpRequestHandler
[junit4:junit4]   2> 4685 T2250 oashl.XMLLoader.init xsltCacheLifetimeSeconds=60
[junit4:junit4]   2> 4691 T2250 oasc.SolrCore.initDeprecatedSupport WARNING solrconfig.xml uses deprecated <admin/gettableFiles>, Please update your config to use the ShowFileRequestHandler.
[junit4:junit4]   2> 4692 T2250 oasc.SolrCore.initDeprecatedSupport WARNING adding ShowFileRequestHandler with hidden files: [SCHEMA.XML, OLD_SYNONYMS.TXT, STOPWORDS.TXT, PROTWORDS.TXT, OPEN-EXCHANGE-RATES.JSON, SYNONYMS.TXT, CURRENCY.XML, MAPPING-ISOLATIN1ACCENT.TXT]
[junit4:junit4]   2> 4696 T2250 oass.SolrIndexSearcher.<init> Opening Searcher@7fd0ec04 main
[junit4:junit4]   2> 4697 T2250 oasu.CommitTracker.<init> Hard AutoCommit: disabled
[junit4:junit4]   2> 4698 T2250 oasu.CommitTracker.<init> Soft AutoCommit: disabled
[junit4:junit4]   2> 4699 T2250 oashc.SpellCheckComponent.inform Initializing spell checkers
[junit4:junit4]   2> 4707 T2250 oass.DirectSolrSpellChecker.init init: {name=direct,classname=DirectSolrSpellChecker,field=lowerfilt,minQueryLength=3}
[junit4:junit4]   2> 4767 T2285 oasc.SolrCore.registerSearcher [collection1] Registered new searcher Searcher@7fd0ec04 main{StandardDirectoryReader(segments_1:1)}
[junit4:junit4]   2> 5204 T2271 oascc.ZkStateReader.updateClusterState Updating cloud state from ZooKeeper... 
[junit4:junit4]   2> 5214 T2270 oascc.ZkStateReader$2.process A cluster state change has occurred - updating...
[junit4:junit4]   2> 5214 T2284 oascc.ZkStateReader$2.process A cluster state change has occurred - updating...
[junit4:junit4]   2> 5275 T2250 oasc.CoreContainer.register registering core: collection1
[junit4:junit4]   2> 5275 T2250 oasc.ZkController.register Register shard - core:collection1 address:http://127.0.0.1:65410/solr shardId:shard1
[junit4:junit4]   2> 5276 T2250 oascc.SolrZkClient.makePath makePath: /collections/collection1/leader_elect/shard1/election
[junit4:junit4]   2> 5295 T2255 oazs.PrepRequestProcessor.pRequest Got user-level KeeperException when processing sessionid:0x139dead69790003 type:delete cxid:0x42 zxid:0xfffffffffffffffe txntype:unknown reqpath:n/a Error Path:/solr/collections/collection1/leaders Error:KeeperErrorCode = NoNode for /solr/collections/collection1/leaders
[junit4:junit4]   2> 5296 T2250 oasc.ShardLeaderElectionContext.runLeaderProcess Running the leader process.
[junit4:junit4]   2> 5297 T2255 oazs.PrepRequestProcessor.pRequest Got user-level KeeperException when processing sessionid:0x139dead69790003 type:create cxid:0x43 zxid:0xfffffffffffffffe txntype:unknown reqpath:n/a Error Path:/solr/overseer Error:KeeperErrorCode = NodeExists for /solr/overseer
[junit4:junit4]   2> 5309 T2250 oasc.ShardLeaderElectionContext.waitForReplicasToComeUp Enough replicas found to continue.
[junit4:junit4]   2> 5310 T2250 oasc.ShardLeaderElectionContext.runLeaderProcess I may be the new leader - try and sync
[junit4:junit4]   2> 5310 T2250 oasc.SyncStrategy.sync Sync replicas to http://127.0.0.1:65410/solr/collection1/
[junit4:junit4]   2> 5310 T2250 oasc.SyncStrategy.syncReplicas Sync Success - now sync replicas to me
[junit4:junit4]   2> 5311 T2250 oasc.SyncStrategy.syncToMe http://127.0.0.1:65410/solr/collection1/ has no replicas
[junit4:junit4]   2> 5311 T2250 oasc.ShardLeaderElectionContext.runLeaderProcess I am the new leader: http://127.0.0.1:65410/solr/collection1/
[junit4:junit4]   2> 5311 T2250 oascc.SolrZkClient.makePath makePath: /collections/collection1/leaders/shard1
[junit4:junit4]   2> 5322 T2255 oazs.PrepRequestProcessor.pRequest Got user-level KeeperException when processing sessionid:0x139dead69790003 type:create cxid:0x4d zxid:0xfffffffffffffffe txntype:unknown reqpath:n/a Error Path:/solr/overseer Error:KeeperErrorCode = NodeExists for /solr/overseer
[junit4:junit4]   2> 5736 T2271 oascc.ZkStateReader.updateClusterState Updating cloud state from ZooKeeper... 
[junit4:junit4]   2> 5752 T2270 oascc.ZkStateReader$2.process A cluster state change has occurred - updating...
[junit4:junit4]   2> 5752 T2284 oascc.ZkStateReader$2.process A cluster state change has occurred - updating...
[junit4:junit4]   2> 5790 T2250 oasc.ZkController.register We are http://127.0.0.1:65410/solr/collection1/ and leader is http://127.0.0.1:65410/solr/collection1/
[junit4:junit4]   2> 5790 T2250 oasc.ZkController.register No LogReplay needed for core=collection1 baseURL=http://127.0.0.1:65410/solr
[junit4:junit4]   2> 5790 T2250 oasc.ZkController.checkRecovery I am the leader, no recovery necessary
[junit4:junit4]   2> 5792 T2250 oascc.ZkStateReader.updateClusterState Updating cloud state from ZooKeeper... 
[junit4:junit4]   2> 5792 T2250 oass.SolrDispatchFilter.init user.dir=/usr/home/hudson/hudson-slave/workspace/Lucene-Solr-Tests-trunk-Java6/solr/build/solr-core/test/J0
[junit4:junit4]   2> 5793 T2250 oass.SolrDispatchFilter.init SolrDispatchFilter.init() done
[junit4:junit4]   2> 5793 T2250 oascsi.HttpClientUtil.createClient Creating new http client, config:maxConnections=128&maxConnectionsPerHost=32&followRedirects=false
[junit4:junit4]   2> 6071 T2250 oejs.Server.doStart jetty-8.1.2.v20120308
[junit4:junit4]   2> 6089 T2250 oejs.AbstractConnector.doStart Started SocketConnector@0.0.0.0:65416
[junit4:junit4]   2> 6089 T2250 oasc.SolrResourceLoader.locateSolrHome JNDI not configured for solr (NoInitialContextEx)
[junit4:junit4]   2> 6090 T2250 oasc.SolrResourceLoader.locateSolrHome using system property solr.solr.home: /usr/home/hudson/hudson-slave/workspace/Lucene-Solr-Tests-trunk-Java6/solr/build/solr-core/test/J0/./solrtest-jetty2-1348060676123
[junit4:junit4]   2> 6090 T2250 oasc.SolrResourceLoader.<init> new SolrResourceLoader for deduced Solr Home: '/usr/home/hudson/hudson-slave/workspace/Lucene-Solr-Tests-trunk-Java6/solr/build/solr-core/test/J0/./solrtest-jetty2-1348060676123/'
[junit4:junit4]   2> 6114 T2250 oass.SolrDispatchFilter.init SolrDispatchFilter.init()
[junit4:junit4]   2> 6114 T2250 oasc.SolrResourceLoader.locateSolrHome JNDI not configured for solr (NoInitialContextEx)
[junit4:junit4]   2> 6114 T2250 oasc.SolrResourceLoader.locateSolrHome using system property solr.solr.home: /usr/home/hudson/hudson-slave/workspace/Lucene-Solr-Tests-trunk-Java6/solr/build/solr-core/test/J0/./solrtest-jetty2-1348060676123
[junit4:junit4]   2> 6115 T2250 oasc.CoreContainer$Initializer.initialize looking for solr.xml: /usr/home/hudson/hudson-slave/workspace/Lucene-Solr-Tests-trunk-Java6/solr/build/solr-core/test/J0/./solrtest-jetty2-1348060676123/solr.xml
[junit4:junit4]   2> 6115 T2250 oasc.CoreContainer.<init> New CoreContainer 866737652
[junit4:junit4]   2> 6116 T2250 oasc.CoreContainer.load Loading CoreContainer using Solr Home: '/usr/home/hudson/hudson-slave/workspace/Lucene-Solr-Tests-trunk-Java6/solr/build/solr-core/test/J0/./solrtest-jetty2-1348060676123/'
[junit4:junit4]   2> 6116 T2250 oasc.SolrResourceLoader.<init> new SolrResourceLoader for directory: '/usr/home/hudson/hudson-slave/workspace/Lucene-Solr-Tests-trunk-Java6/solr/build/solr-core/test/J0/./solrtest-jetty2-1348060676123/'
[junit4:junit4]   2> 6147 T2250 oasc.CoreContainer.load Registering Log Listener
[junit4:junit4]   2> 6159 T2250 oasc.CoreContainer.initZooKeeper Zookeeper client=127.0.0.1:65394/solr
[junit4:junit4]   2> 6159 T2250 oaz.ZooKeeper.<init> Initiating client connection, connectString=127.0.0.1:65394/solr sessionTimeout=5000 watcher=org.apache.solr.common.cloud.ConnectionManager@527e5d65
[junit4:junit4]   2> 6160 T2295 oaz.ClientCnxn$SendThread.startConnect Opening socket connection to server /127.0.0.1:65394
[junit4:junit4]   2> 6160 T2250 oascc.ConnectionManager.waitForConnected Waiting for client to connect to ZooKeeper
[junit4:junit4]   2> 6162 T2295 oaz.ClientCnxn$SendThread.primeConnection Socket connection established to localhost/127.0.0.1:65394, initiating session
[junit4:junit4]   2> 6162 T2252 oazs.NIOServerCnxn$Factory.run Accepted socket connection from /140.211.11.196:65417
[junit4:junit4]   2> 6162 T2252 oazs.NIOServerCnxn.readConnectRequest Client attempting to establish new session at /140.211.11.196:65417
[junit4:junit4]   2> 6196 T2254 oazs.NIOServerCnxn.finishSessionInit Established session 0x139dead69790004 with negotiated timeout 5000 for client /140.211.11.196:65417
[junit4:junit4]   2> 6196 T2295 oaz.ClientCnxn$SendThread.readConnectResult Session establishment complete on server localhost/127.0.0.1:65394, sessionid = 0x139dead69790004, negotiated timeout = 5000
[junit4:junit4]   2> 6196 T2296 oascc.ConnectionManager.process Watcher org.apache.solr.common.cloud.ConnectionManager@527e5d65 name:ZooKeeperConnection Watcher:127.0.0.1:65394/solr got event WatchedEvent state:SyncConnected type:None path:null path:null type:None
[junit4:junit4]   2> 6196 T2250 oascc.ConnectionManager.waitForConnected Client is connected to ZooKeeper
[junit4:junit4]   2> 6197 T2255 oazs.PrepRequestProcessor.pRequest Got user-level KeeperException when processing sessionid:0x139dead69790004 type:create cxid:0x1 zxid:0xfffffffffffffffe txntype:unknown reqpath:n/a Error Path:/solr/overseer Error:KeeperErrorCode = NodeExists for /solr/overseer
[junit4:junit4]   2> 6219 T2255 oazs.PrepRequestProcessor.pRequest Got user-level KeeperException when processing sessionid:0x139dead69790004 type:create cxid:0x2 zxid:0xfffffffffffffffe txntype:unknown reqpath:n/a Error Path:/solr/overseer Error:KeeperErrorCode = NodeExists for /solr/overseer
[junit4:junit4]   2> 6221 T2250 oasc.ZkController.createEphemeralLiveNode Register node as live in ZooKeeper:/live_nodes/127.0.0.1:65416_solr
[junit4:junit4]   2> 6222 T2255 oazs.PrepRequestProcessor.pRequest Got user-level KeeperException when processing sessionid:0x139dead69790004 type:delete cxid:0x4 zxid:0xfffffffffffffffe txntype:unknown reqpath:n/a Error Path:/solr/live_nodes/127.0.0.1:65416_solr Error:KeeperErrorCode = NoNode for /solr/live_nodes/127.0.0.1:65416_solr
[junit4:junit4]   2> 6223 T2250 oascc.SolrZkClient.makePath makePath: /live_nodes/127.0.0.1:65416_solr
[junit4:junit4]   2> 6253 T2270 oascc.ZkStateReader$3.process Updating live nodes
[junit4:junit4]   2> 6253 T2284 oascc.ZkStateReader$3.process Updating live nodes
[junit4:junit4]   2> 6254 T2250 oashc.HttpShardHandlerFactory.getParameter Setting socketTimeout to: 0
[junit4:junit4]   2> 6254 T2250 oashc.HttpShardHandlerFactory.getParameter Setting urlScheme to: http://
[junit4:junit4]   2> 6255 T2250 oashc.HttpShardHandlerFactory.getParameter Setting connTimeout to: 0
[junit4:junit4]   2> 6255 T2250 oashc.HttpShardHandlerFactory.getParameter Setting maxConnectionsPerHost to: 20
[junit4:junit4]   2> 6256 T2250 oashc.HttpShardHandlerFactory.getParameter Setting corePoolSize to: 0
[junit4:junit4]   2> 6256 T2250 oashc.HttpShardHandlerFactory.getParameter Setting maximumPoolSize to: 2147483647
[junit4:junit4]   2> 6257 T2250 oashc.HttpShardHandlerFactory.getParameter Setting maxThreadIdleTime to: 5
[junit4:junit4]   2> 6257 T2250 oashc.HttpShardHandlerFactory.getParameter Setting sizeOfQueue to: -1
[junit4:junit4]   2> 6258 T2250 oashc.HttpShardHandlerFactory.getParameter Setting fairnessPolicy to: false
[junit4:junit4]   2> 6258 T2250 oascsi.HttpClientUtil.createClient Creating new http client, config:maxConnectionsPerHost=20&maxConnections=10000&socketTimeout=0&connTimeout=0&retry=false
[junit4:junit4]   2> 6267 T2271 oascc.ZkStateReader.updateClusterState Updating cloud state from ZooKeeper... 
[junit4:junit4]   2> 6401 T2270 oascc.ZkStateReader$2.process A cluster state change has occurred - updating...
[junit4:junit4]   2> 6401 T2284 oascc.ZkStateReader$2.process A cluster state change has occurred - updating...
[junit4:junit4]   2> 6402 T2250 oascc.ZkStateReader.createClusterStateWatchersAndUpdate Updating cluster state from ZooKeeper... 
[junit4:junit4]   2> 6409 T2250 oasc.CoreContainer.create Creating SolrCore 'collection1' using instanceDir: /usr/home/hudson/hudson-slave/workspace/Lucene-Solr-Tests-trunk-Java6/solr/build/solr-core/test/J0/./solrtest-jetty2-1348060676123/collection1
[junit4:junit4]   2> 6409 T2250 oasc.ZkController.createCollectionZkNode Check for collection zkNode:collection1
[junit4:junit4]   2> 6410 T2250 oasc.ZkController.createCollectionZkNode Collection zkNode exists
[junit4:junit4]   2> 6410 T2250 oasc.ZkController.readConfigName Load collection config from:/collections/collection1
[junit4:junit4]   2> 6411 T2250 oasc.SolrResourceLoader.<init> new SolrResourceLoader for directory: '/usr/home/hudson/hudson-slave/workspace/Lucene-Solr-Tests-trunk-Java6/solr/build/solr-core/test/J0/./solrtest-jetty2-1348060676123/collection1/'
[junit4:junit4]   2> 6413 T2250 oasc.SolrResourceLoader.replaceClassLoader Adding 'file:/usr/home/hudson/hudson-slave/workspace/Lucene-Solr-Tests-trunk-Java6/solr/build/solr-core/test/J0/solrtest-jetty2-1348060676123/collection1/lib/classes/' to classloader
[junit4:junit4]   2> 6413 T2250 oasc.SolrResourceLoader.replaceClassLoader Adding 'file:/usr/home/hudson/hudson-slave/workspace/Lucene-Solr-Tests-trunk-Java6/solr/build/solr-core/test/J0/solrtest-jetty2-1348060676123/collection1/lib/README' to classloader
[junit4:junit4]   2> 6465 T2250 oasc.SolrConfig.<init> Using Lucene MatchVersion: LUCENE_50
[junit4:junit4]   2> 6540 T2250 oasc.SolrConfig.<init> Loaded SolrConfig: solrconfig.xml
[junit4:junit4]   2> 6641 T2250 oass.IndexSchema.readSchema Reading Solr Schema
[junit4:junit4]   2> 6649 T2250 oass.IndexSchema.readSchema Schema name=test
[junit4:junit4]   2> 7261 T2250 oass.OpenExchangeRatesOrgProvider.init Initialized with rates=open-exchange-rates.json, refreshInterval=1440.
[junit4:junit4]   2> 7268 T2250 oass.IndexSchema.readSchema default search field in schema is text
[junit4:junit4]   2> 7271 T2250 oass.IndexSchema.readSchema unique key field: id
[junit4:junit4]   2> 7279 T2250 oass.FileExchangeRateProvider.reload Reloading exchange rates from file currency.xml
[junit4:junit4]   2> 7283 T2250 oass.FileExchangeRateProvider.reload Reloading exchange rates from file currency.xml
[junit4:junit4]   2> 7287 T2250 oass.OpenExchangeRatesOrgProvider.reload Reloading exchange rates from open-exchange-rates.json
[junit4:junit4]   2> 7287 T2250 oass.OpenExchangeRatesOrgProvider.reload Reloading exchange rates from open-exchange-rates.json
[junit4:junit4]   2> 7288 T2250 oasc.SolrCore.<init> [collection1] Opening new SolrCore at /usr/home/hudson/hudson-slave/workspace/Lucene-Solr-Tests-trunk-Java6/solr/build/solr-core/test/J0/./solrtest-jetty2-1348060676123/collection1/, dataDir=./org.apache.solr.cloud.BasicDistributedZk2Test-1348060670324/jetty2/
[junit4:junit4]   2> 7289 T2250 oasc.JmxMonitoredMap.<init> JMX monitoring is enabled. Adding Solr mbeans to JMX Server: com.sun.jmx.mbeanserver.JmxMBeanServer@27bc4ec8
[junit4:junit4]   2> 7290 T2250 oasc.SolrCore.getNewIndexDir WARNING New index directory detected: old=null new=./org.apache.solr.cloud.BasicDistributedZk2Test-1348060670324/jetty2/index/
[junit4:junit4]   2> 7290 T2250 oasc.SolrCore.initIndex WARNING [collection1] Solr index directory './org.apache.solr.cloud.BasicDistributedZk2Test-1348060670324/jetty2/index' doesn't exist. Creating new index...
[junit4:junit4]   2> 7291 T2250 oasc.CachingDirectoryFactory.get return new directory for /usr/home/hudson/hudson-slave/workspace/Lucene-Solr-Tests-trunk-Java6/solr/build/solr-core/test/J0/./org.apache.solr.cloud.BasicDistributedZk2Test-1348060670324/jetty2/index forceNew:false
[junit4:junit4]   2> 7296 T2250 oasc.SolrDeletionPolicy.onCommit SolrDeletionPolicy.onCommit: commits:num=1
[junit4:junit4]   2> 		commit{dir=NRTCachingDirectory(org.apache.lucene.store.NIOFSDirectory@/usr/home/hudson/hudson-slave/workspace/Lucene-Solr-Tests-trunk-Java6/solr/build/solr-core/test/J0/org.apache.solr.cloud.BasicDistributedZk2Test-1348060670324/jetty2/index lockFactory=org.apache.lucene.store.NativeFSLockFactory@17b7ca8f; maxCacheMB=48.0 maxMergeSizeMB=4.0),segFN=segments_1,generation=1,filenames=[segments_1]
[junit4:junit4]   2> 7297 T2250 oasc.SolrDeletionPolicy.updateCommits newest commit = 1
[junit4:junit4]   2> 7297 T2250 oasc.SolrCore.initWriters created xml: solr.XMLResponseWriter
[junit4:junit4]   2> 7299 T2250 oasup.UpdateRequestProcessorChain.init inserting DistributedUpdateProcessorFactory into updateRequestProcessorChain "dedupe"
[junit4:junit4]   2> 7300 T2250 oasup.UpdateRequestProcessorChain.init inserting DistributedUpdateProcessorFactory into updateRequestProcessorChain "dedupe-allfields"
[junit4:junit4]   2> 7300 T2250 oasup.UpdateRequestProcessorChain.init inserting DistributedUpdateProcessorFactory into updateRequestProcessorChain "stored_sig"
[junit4:junit4]   2> 7300 T2250 oasup.UpdateRequestProcessorChain.init inserting DistributedUpdateProcessorFactory into updateRequestProcessorChain "uniq-fields"
[junit4:junit4]   2> 7301 T2250 oasup.UpdateRequestProcessorChain.init inserting DistributedUpdateProcessorFactory into updateRequestProcessorChain "distrib-dup-test-chain-implicit"
[junit4:junit4]   2> 7301 T2250 oasc.RequestHandlers.initHandlersFromConfig adding lazy requestHandler: solr.ReplicationHandler
[junit4:junit4]   2> 7302 T2250 oasc.RequestHandlers.initHandlersFromConfig created /replication: solr.ReplicationHandler
[junit4:junit4]   2> 7302 T2250 oasc.RequestHandlers.initHandlersFromConfig created standard: solr.StandardRequestHandler
[junit4:junit4]   2> 7303 T2250 oasc.RequestHandlers.initHandlersFromConfig created /get: solr.RealTimeGetHandler
[junit4:junit4]   2> 7303 T2250 oasc.RequestHandlers.initHandlersFromConfig created dismax: solr.SearchHandler
[junit4:junit4]   2> 7304 T2250 oasc.RequestHandlers.initHandlersFromConfig created mock: org.apache.solr.core.MockQuerySenderListenerReqHandler
[junit4:junit4]   2> 7304 T2250 oasc.RequestHandlers.initHandlersFromConfig created /admin/: org.apache.solr.handler.admin.AdminHandlers
[junit4:junit4]   2> 7305 T2250 oasc.RequestHandlers.initHandlersFromConfig created defaults: solr.StandardRequestHandler
[junit4:junit4]   2> 7305 T2250 oasc.RequestHandlers.initHandlersFromConfig adding lazy requestHandler: solr.StandardRequestHandler
[junit4:junit4]   2> 7305 T2250 oasc.RequestHandlers.initHandlersFromConfig created lazy: solr.StandardRequestHandler
[junit4:junit4]   2> 7306 T2250 oasc.RequestHandlers.initHandlersFromConfig created /update: solr.UpdateRequestHandler
[junit4:junit4]   2> 7306 T2250 oasc.RequestHandlers.initHandlersFromConfig created /terms: org.apache.solr.handler.component.SearchHandler
[junit4:junit4]   2> 7307 T2250 oasc.RequestHandlers.initHandlersFromConfig created spellCheckCompRH: org.apache.solr.handler.component.SearchHandler
[junit4:junit4]   2> 7307 T2250 oasc.RequestHandlers.initHandlersFromConfig created spellCheckCompRH_Direct: org.apache.solr.handler.component.SearchHandler
[junit4:junit4]   2> 7308 T2250 oasc.RequestHandlers.initHandlersFromConfig created spellCheckWithWordbreak: org.apache.solr.handler.component.SearchHandler
[junit4:junit4]   2> 7308 T2250 oasc.RequestHandlers.initHandlersFromConfig created spellCheckWithWordbreak_Direct: org.apache.solr.handler.component.SearchHandler
[junit4:junit4]   2> 7309 T2250 oasc.RequestHandlers.initHandlersFromConfig created spellCheckCompRH1: org.apache.solr.handler.component.SearchHandler
[junit4:junit4]   2> 7309 T2250 oasc.RequestHandlers.initHandlersFromConfig created tvrh: org.apache.solr.handler.component.SearchHandler
[junit4:junit4]   2> 7310 T2250 oasc.RequestHandlers.initHandlersFromConfig created /mlt: solr.MoreLikeThisHandler
[junit4:junit4]   2> 7310 T2250 oasc.RequestHandlers.initHandlersFromConfig created /debug/dump: solr.DumpRequestHandler
[junit4:junit4]   2> 7313 T2250 oashl.XMLLoader.init xsltCacheLifetimeSeconds=60
[junit4:junit4]   2> 7317 T2250 oasc.SolrCore.initDeprecatedSupport WARNING solrconfig.xml uses deprecated <admin/gettableFiles>, Please update your config to use the ShowFileRequestHandler.
[junit4:junit4]   2> 7318 T2250 oasc.SolrCore.initDeprecatedSupport WARNING adding ShowFileRequestHandler with hidden files: [SCHEMA.XML, OLD_SYNONYMS.TXT, STOPWORDS.TXT, PROTWORDS.TXT, OPEN-EXCHANGE-RATES.JSON, SYNONYMS.TXT, CURRENCY.XML, MAPPING-ISOLATIN1ACCENT.TXT]
[junit4:junit4]   2> 7321 T2250 oass.SolrIndexSearcher.<init> Opening Searcher@4e0c0454 main
[junit4:junit4]   2> 7322 T2250 oasu.CommitTracker.<init> Hard AutoCommit: disabled
[junit4:junit4]   2> 7322 T2250 oasu.CommitTracker.<init> Soft AutoCommit: disabled
[junit4:junit4]   2> 7323 T2250 oashc.SpellCheckComponent.inform Initializing spell checkers
[junit4:junit4]   2> 7328 T2250 oass.DirectSolrSpellChecker.init init: {name=direct,classname=DirectSolrSpellChecker,field=lowerfilt,minQueryLength=3}
[junit4:junit4]   2> 7370 T2297 oasc.SolrCore.registerSearcher [collection1] Registered new searcher Searcher@4e0c0454 main{StandardDirectoryReader(segments_1:1)}
[junit4:junit4]   2> 7406 T2271 oascc.ZkStateReader.updateClusterState Updating cloud state from ZooKeeper... 
[junit4:junit4]   2> 7417 T2270 oascc.ZkStateReader$2.process A cluster state change has occurred - updating...
[junit4:junit4]   2> 7418 T2284 oascc.ZkStateReader$2.process A cluster state change has occurred - updating...
[junit4:junit4]   2> 7417 T2296 oascc.ZkStateReader$2.process A cluster state change has occurred - updating...
[junit4:junit4]   2> 7876 T2250 oasc.CoreContainer.register registering core: collection1
[junit4:junit4]   2> 7876 T2250 oasc.ZkController.register Register shard - core:collection1 address:http://127.0.0.1:65416/solr shardId:shard2
[junit4:junit4]   2> 7877 T2250 oascc.SolrZkClient.makePath makePath: /collections/collection1/leader_elect/shard2/election
[junit4:junit4]   2> 7890 T2255 oazs.PrepRequestProcessor.pRequest Got user-level KeeperException when processing sessionid:0x139dead69790004 type:delete cxid:0x41 zxid:0xfffffffffffffffe txntype:unknown reqpath:n/a Error Path:/solr/collections/collection1/leaders/shard2 Error:KeeperErrorCode = NoNode for /solr/collections/collection1/leaders/shard2
[junit4:junit4]   2> 7891 T2250 oasc.ShardLeaderElectionContext.runLeaderProcess Running the leader process.
[junit4:junit4]   2> 7891 T2255 oazs.PrepRequestProcessor.pRequest Got user-level KeeperException when processing sessionid:0x139dead69790004 type:create cxid:0x42 zxid:0xfffffffffffffffe txntype:unknown reqpath:n/a Error Path:/solr/overseer Error:KeeperErrorCode = NodeExists for /solr/overseer
[junit4:junit4]   2> 7902 T2250 oasc.ShardLeaderElectionContext.waitForReplicasToComeUp Enough replicas found to continue.
[junit4:junit4]   2> 7903 T2250 oasc.ShardLeaderElectionContext.runLeaderProcess I may be the new leader - try and sync
[junit4:junit4]   2> 7903 T2250 oasc.SyncStrategy.sync Sync replicas to http://127.0.0.1:65416/solr/collection1/
[junit4:junit4]   2> 7904 T2250 oasc.SyncStrategy.syncReplicas Sync Success - now sync replicas to me
[junit4:junit4]   2> 7904 T2250 oasc.SyncStrategy.syncToMe http://127.0.0.1:65416/solr/collection1/ has no replicas
[junit4:junit4]   2> 7904 T2250 oasc.ShardLeaderElectionContext.runLeaderProcess I am the new leader: http://127.0.0.1:65416/solr/collection1/
[junit4:junit4]   2> 7905 T2250 oascc.SolrZkClient.makePath makePath: /collections/collection1/leaders/shard2
[junit4:junit4]   2> 7907 T2255 oazs.PrepRequestProcessor.pRequest Got user-level KeeperException when processing sessionid:0x139dead69790004 type:create cxid:0x4b zxid:0xfffffffffffffffe txntype:unknown reqpath:n/a Error Path:/solr/overseer Error:KeeperErrorCode = NodeExists for /solr/overseer
[junit4:junit4]   2> 7920 T2271 oascc.ZkStateReader.updateClusterState Updating cloud state from ZooKeeper... 
[junit4:junit4]   2> 7925 T2296 oascc.ZkStateReader$2.process A cluster state change has occurred - updating...
[junit4:junit4]   2> 7925 T2270 oascc.ZkStateReader$2.process A cluster state change has occurred - updating...
[junit4:junit4]   2> 7925 T2284 oascc.ZkStateReader$2.process A cluster state change has occurred - updating...
[junit4:junit4]   2> 7969 T2250 oasc.ZkController.register We are http://127.0.0.1:65416/solr/collection1/ and leader is http://127.0.0.1:65416/solr/collection1/
[junit4:junit4]   2> 7969 T2250 oasc.ZkController.register No LogReplay needed for core=collection1 baseURL=http://127.0.0.1:65416/solr
[junit4:junit4]   2> 7969 T2250 oasc.ZkController.checkRecovery I am the leader, no recovery necessary
[junit4:junit4]   2> 7972 T2250 oascc.ZkStateReader.updateClusterState Updating cloud state from ZooKeeper... 
[junit4:junit4]   2> 7972 T2250 oass.SolrDispatchFilter.init user.dir=/usr/home/hudson/hudson-slave/workspace/Lucene-Solr-Tests-trunk-Java6/solr/build/solr-core/test/J0
[junit4:junit4]   2> 7973 T2250 oass.SolrDispatchFilter.init SolrDispatchFilter.init() done
[junit4:junit4]   2> 7973 T2250 oascsi.HttpClientUtil.createClient Creating new http client, config:maxConnections=128&maxConnectionsPerHost=32&followRedirects=false
[junit4:junit4]   2> 8243 T2250 oejs.Server.doStart jetty-8.1.2.v20120308
[junit4:junit4]   2> 8245 T2250 oejs.AbstractConnector.doStart Started SocketConnector@0.0.0.0:65421
[junit4:junit4]   2> 8246 T2250 oasc.SolrResourceLoader.locateSolrHome JNDI not configured for solr (NoInitialContextEx)
[junit4:junit4]   2> 8246 T2250 oasc.SolrResourceLoader.locateSolrHome using system property solr.solr.home: /usr/home/hudson/hudson-slave/workspace/Lucene-Solr-Tests-trunk-Java6/solr/build/solr-core/test/J0/./solrtest-jetty3-1348060678303
[junit4:junit4]   2> 8246 T2250 oasc.SolrResourceLoader.<init> new SolrResourceLoader for deduced Solr Home: '/usr/home/hudson/hudson-slave/workspace/Lucene-Solr-Tests-trunk-Java6/solr/build/solr-core/test/J0/./solrtest-jetty3-1348060678303/'
[junit4:junit4]   2> 8270 T2250 oass.SolrDispatchFilter.init SolrDispatchFilter.init()
[junit4:junit4]   2> 8270 T2250 oasc.SolrResourceLoader.locateSolrHome JNDI not configured for solr (NoInitialContextEx)
[junit4:junit4]   2> 8270 T2250 oasc.SolrResourceLoader.locateSolrHome using system property solr.solr.home: /usr/home/hudson/hudson-slave/workspace/Lucene-Solr-Tests-trunk-Java6/solr/build/solr-core/test/J0/./solrtest-jetty3-1348060678303
[junit4:junit4]   2> 8271 T2250 oasc.CoreContainer$Initializer.initialize looking for solr.xml: /usr/home/hudson/hudson-slave/workspace/Lucene-Solr-Tests-trunk-Java6/solr/build/solr-core/test/J0/./solrtest-jetty3-1348060678303/solr.xml
[junit4:junit4]   2> 8271 T2250 oasc.CoreContainer.<init> New CoreContainer 841468269
[junit4:junit4]   2> 8271 T2250 oasc.CoreContainer.load Loading CoreContainer using Solr Home: '/usr/home/hudson/hudson-slave/workspace/Lucene-Solr-Tests-trunk-Java6/solr/build/solr-core/test/J0/./solrtest-jetty3-1348060678303/'
[junit4:junit4]   2> 8272 T2250 oasc.SolrResourceLoader.<init> new SolrResourceLoader for directory: '/usr/home/hudson/hudson-slave/workspace/Lucene-Solr-Tests-trunk-Java6/solr/build/solr-core/test/J0/./solrtest-jetty3-1348060678303/'
[junit4:junit4]   2> 8288 T2250 oasc.CoreContainer.load Registering Log Listener
[junit4:junit4]   2> 8298 T2250 oasc.CoreContainer.initZooKeeper Zookeeper client=127.0.0.1:65394/solr
[junit4:junit4]   2> 8298 T2250 oaz.ZooKeeper.<init> Initiating client connection, connectString=127.0.0.1:65394/solr sessionTimeout=5000 watcher=org.apache.solr.common.cloud.ConnectionManager@72ce3c67
[junit4:junit4]   2> 8299 T2307 oaz.ClientCnxn$SendThread.startConnect Opening socket connection to server /127.0.0.1:65394
[junit4:junit4]   2> 8299 T2250 oascc.ConnectionManager.waitForConnected Waiting for client to connect to ZooKeeper
[junit4:junit4]   2> 8300 T2307 oaz.ClientCnxn$SendThread.primeConnection Socket connection established to localhost/127.0.0.1:65394, initiating session
[junit4:junit4]   2> 8300 T2252 oazs.NIOServerCnxn$Factory.run Accepted socket connection from /140.211.11.196:65423
[junit4:junit4]   2> 8301 T2252 oazs.NIOServerCnxn.readConnectRequest Client attempting to establish new session at /140.211.11.196:65423
[junit4:junit4]   2> 8302 T2254 oazs.NIOServerCnxn.finishSessionInit Established session 0x139dead69790005 with negotiated timeout 5000 for client /140.211.11.196:65423
[junit4:junit4]   2> 8302 T2307 oaz.ClientCnxn$SendThread.readConnectResult Session establishment complete on server localhost/127.0.0.1:65394, sessionid = 0x139dead69790005, negotiated timeout = 5000
[junit4:junit4]   2> 8303 T2308 oascc.ConnectionManager.process Watcher org.apache.solr.common.cloud.ConnectionManager@72ce3c67 name:ZooKeeperConnection Watcher:127.0.0.1:65394/solr got event WatchedEvent state:SyncConnected type:None path:null path:null type:None
[junit4:junit4]   2> 8303 T2250 oascc.ConnectionManager.waitForConnected Client is connected to ZooKeeper
[junit4:junit4]   2> 8304 T2255 oazs.PrepRequestProcessor.pRequest Got user-level KeeperException when processing sessionid:0x139dead69790005 type:create cxid:0x1 zxid:0xfffffffffffffffe txntype:unknown reqpath:n/a Error Path:/solr/overseer Error:KeeperErrorCode = NodeExists for /solr/overseer
[junit4:junit4]   2> 8305 T2255 oazs.PrepRequestProcessor.pRequest Got user-level KeeperException when processing sessionid:0x139dead69790005 type:create cxid:0x2 zxid:0xfffffffffffffffe txntype:unknown reqpath:n/a Error Path:/solr/overseer Error:KeeperErrorCode = NodeExists for /solr/overseer
[junit4:junit4]   2> 8317 T2250 oasc.ZkController.createEphemeralLiveNode Register node as live in ZooKeeper:/live_nodes/127.0.0.1:65421_solr
[junit4:junit4]   2> 8318 T2255 oazs.PrepRequestProcessor.pRequest Got user-level KeeperException when processing sessionid:0x139dead69790005 type:delete cxid:0x4 zxid:0xfffffffffffffffe txntype:unknown reqpath:n/a Error Path:/solr/live_nodes/127.0.0.1:65421_solr Error:KeeperErrorCode = NoNode for /solr/live_nodes/127.0.0.1:65421_solr
[junit4:junit4]   2> 8319 T2250 oascc.SolrZkClient.makePath makePath: /live_nodes/127.0.0.1:65421_solr
[junit4:junit4]   2> 8326 T2296 oascc.ZkStateReader$3.process Updating live nodes
[junit4:junit4]   2> 8327 T2284 oascc.ZkStateReader$3.process Updating live nodes
[junit4:junit4]   2> 8327 T2270 oascc.ZkStateReader$3.process Updating live nodes
[junit4:junit4]   2> 8327 T2250 oashc.HttpShardHandlerFactory.getParameter Setting socketTimeout to: 0
[junit4:junit4]   2> 8328 T2250 oashc.HttpShardHandlerFactory.getParameter Setting urlScheme to: http://
[junit4:junit4]   2> 8328 T2250 oashc.HttpShardHandlerFactory.getParameter Setting connTimeout to: 0
[junit4:junit4]   2> 8328 T2250 oashc.HttpShardHandlerFactory.getParameter Setting maxConnectionsPerHost to: 20
[junit4:junit4]   2> 8329 T2250 oashc.HttpShardHandlerFactory.getParameter Setting corePoolSize to: 0
[junit4:junit4]   2> 8329 T2250 oashc.HttpShardHandlerFactory.getParameter Setting maximumPoolSize to: 2147483647
[junit4:junit4]   2> 8329 T2250 oashc.HttpShardHandlerFactory.getParameter Setting maxThreadIdleTime to: 5
[junit4:junit4]   2> 8329 T2250 oashc.HttpShardHandlerFactory.getParameter Setting sizeOfQueue to: -1
[junit4:junit4]   2> 8330 T2250 oashc.HttpShardHandlerFactory.getParameter Setting fairnessPolicy to: false
[junit4:junit4]   2> 8330 T2250 oascsi.HttpClientUtil.createClient Creating new http client, config:maxConnectionsPerHost=20&maxConnections=10000&socketTimeout=0&connTimeout=0&retry=false
[junit4:junit4]   2> 8347 T2250 oascc.ZkStateReader.createClusterStateWatchersAndUpdate Updating cluster state from ZooKeeper... 
[junit4:junit4]   2> 8351 T2250 oasc.CoreContainer.create Creating SolrCore 'collection1' using instanceDir: /usr/home/hudson/hudson-slave/workspace/Lucene-Solr-Tests-trunk-Java6/solr/build/solr-core/test/J0/./solrtest-jetty3-1348060678303/collection1
[junit4:junit4]   2> 8352 T2250 oasc.ZkController.createCollectionZkNode Check for collection zkNode:collection1
[junit4:junit4]   2> 8352 T2250 oasc.ZkController.createCollectionZkNode Collection zkNode exists
[junit4:junit4]   2> 8353 T2250 oasc.ZkController.readConfigName Load collection config from:/collections/collection1
[junit4:junit4]   2> 8353 T2250 oasc.SolrResourceLoader.<init> new SolrResourceLoader for directory: '/usr/home/hudson/hudson-slave/workspace/Lucene-Solr-Tests-trunk-Java6/solr/build/solr-core/test/J0/./solrtest-jetty3-1348060678303/collection1/'
[junit4:junit4]   2> 8354 T2250 oasc.SolrResourceLoader.replaceClassLoader Adding 'file:/usr/home/hudson/hudson-slave/workspace/Lucene-Solr-Tests-trunk-Java6/solr/build/solr-core/test/J0/solrtest-jetty3-1348060678303/collection1/lib/README' to classloader
[junit4:junit4]   2> 8355 T2250 oasc.SolrResourceLoader.replaceClassLoader Adding 'file:/usr/home/hudson/hudson-slave/workspace/Lucene-Solr-Tests-trunk-Java6/solr/build/solr-core/test/J0/solrtest-jetty3-1348060678303/collection1/lib/classes/' to classloader
[junit4:junit4]   2> 8390 T2250 oasc.SolrConfig.<init> Using Lucene MatchVersion: LUCENE_50
[junit4:junit4]   2> 8429 T2271 oascc.ZkStateReader.updateClusterState Updating cloud state from ZooKeeper... 
[junit4:junit4]   2> 8439 T2296 oascc.ZkStateReader$2.process A cluster state change has occurred - updating...
[junit4:junit4]   2> 8439 T2270 oascc.ZkStateReader$2.process A cluster state change has occurred - updating...
[junit4:junit4]   2> 8439 T2284 oascc.ZkStateReader$2.process A cluster state change has occurred - updating...
[junit4:junit4]   2> 8439 T2308 oascc.ZkStateReader$2.process A cluster state change has occurred - updating...
[junit4:junit4]   2> 8440 T2250 oasc.SolrConfig.<init> Loaded SolrConfig: solrconfig.xml
[junit4:junit4]   2> 8441 T2250 oass.IndexSchema.readSchema Reading Solr Schema
[junit4:junit4]   2> 8447 T2250 oass.IndexSchema.readSchema Schema name=test
[junit4:junit4]   2> 8924 T2250 oass.OpenExchangeRatesOrgProvider.init Initialized with rates=open-exchange-rates.json, refreshInterval=1440.
[junit4:junit4]   2> 8931 T2250 oass.IndexSchema.readSchema default search field in schema is text
[junit4:junit4]   2> 8935 T2250 oass.IndexSchema.readSchema unique key field: id
[junit4:junit4]   2> 8943 T2250 oass.FileExchangeRateProvider.reload Reloading exchange rates from file currency.xml
[junit4:junit4]   2> 8947 T2250 oass.FileExchangeRateProvider.reload Reloading exchange rates from file currency.xml
[junit4:junit4]   2> 8950 T2250 oass.OpenExchangeRatesOrgProvider.reload Reloading exchange rates from open-exchange-rates.json
[junit4:junit4]   2> 8950 T2250 oass.OpenExchangeRatesOrgProvider.reload Reloading exchange rates from open-exchange-rates.json
[junit4:junit4]   2> 8951 T2250 oasc.SolrCore.<init> [collection1] Opening new SolrCore at /usr/home/hudson/hudson-slave/workspace/Lucene-Solr-Tests-trunk-Java6/solr/build/solr-core/test/J0/./solrtest-jetty3-1348060678303/collection1/, dataDir=./org.apache.solr.cloud.BasicDistributedZk2Test-1348060670324/jetty3/
[junit4:junit4]   2> 8952 T2250 oasc.JmxMonitoredMap.<init> JMX monitoring is enabled. Adding Solr mbeans to JMX Server: com.sun.jmx.mbeanserver.JmxMBeanServer@27bc4ec8
[junit4:junit4]   2> 8953 T2250 oasc.SolrCore.getNewIndexDir WARNING New index directory detected: old=null new=./org.apache.solr.cloud.BasicDistributedZk2Test-1348060670324/jetty3/index/
[junit4:junit4]   2> 8953 T2250 oasc.SolrCore.initIndex WARNING [collection1] Solr index directory './org.apache.solr.cloud.BasicDistributedZk2Test-1348060670324/jetty3/index' doesn't exist. Creating new index...
[junit4:junit4]   2> 8954 T2250 oasc.CachingDirectoryFactory.get return new directory for /usr/home/hudson/hudson-slave/workspace/Lucene-Solr-Tests-trunk-Java6/solr/build/solr-core/test/J0/./org.apache.solr.cloud.BasicDistributedZk2Test-1348060670324/jetty3/index forceNew:false
[junit4:junit4]   2> 8958 T2250 oasc.SolrDeletionPolicy.onCommit SolrDeletionPolicy.onCommit: commits:num=1
[junit4:junit4]   2> 		commit{dir=NRTCachingDirectory(org.apache.lucene.store.NIOFSDirectory@/usr/home/hudson/hudson-slave/workspace/Lucene-Solr-Tests-trunk-Java6/solr/build/solr-core/test/J0/org.apache.solr.cloud.BasicDistributedZk2Test-1348060670324/jetty3/index lockFactory=org.apache.lucene.store.NativeFSLockFactory@2e4cda87; maxCacheMB=48.0 maxMergeSizeMB=4.0),segFN=segments_1,generation=1,filenames=[segments_1]
[junit4:junit4]   2> 8959 T2250 oasc.SolrDeletionPolicy.updateCommits newest commit = 1
[junit4:junit4]   2> 8960 T2250 oasc.SolrCore.initWriters created xml: solr.XMLResponseWriter
[junit4:junit4]   2> 8961 T2250 oasup.UpdateRequestProcessorChain.init inserting DistributedUpdateProcessorFactory into updateRequestProcessorChain "dedupe"
[junit4:junit4]   2> 8962 T2250 oasup.UpdateRequestProcessorChain.init inserting DistributedUpdateProcessorFactory into updateRequestProcessorChain "dedupe-allfields"
[junit4:junit4]   2> 8962 T2250 oasup.UpdateRequestProcessorChain.init inserting DistributedUpdateProcessorFactory into updateRequestProcessorChain "stored_sig"
[junit4:junit4]   2> 8962 T2250 oasup.UpdateRequestProcessorChain.init inserting DistributedUpdateProcessorFactory into updateRequestProcessorChain "uniq-fields"
[junit4:junit4]   2> 8963 T2250 oasup.UpdateRequestProcessorChain.init inserting DistributedUpdateProcessorFactory into updateRequestProcessorChain "distrib-dup-test-chain-implicit"
[junit4:junit4]   2> 8963 T2250 oasc.RequestHandlers.initHandlersFromConfig adding lazy requestHandler: solr.ReplicationHandler
[junit4:junit4]   2> 8964 T2250 oasc.RequestHandlers.initHandlersFromConfig created /replication: solr.ReplicationHandler
[junit4:junit4]   2> 8964 T2250 oasc.RequestHandlers.initHandlersFromConfig created standard: solr.StandardRequestHandler
[junit4:junit4]   2> 8965 T2250 oasc.RequestHandlers.initHandlersFromConfig created /get: solr.RealTimeGetHandler
[junit4:junit4]   2> 8965 T2250 oasc.RequestHandlers.initHandlersFromConfig created dismax: solr.SearchHandler
[junit4:junit4]   2> 8966 T2250 oasc.RequestHandlers.initHandlersFromConfig created mock: org.apache.solr.core.MockQuerySenderListenerReqHandler
[junit4:junit4]   2> 8966 T2250 oasc.RequestHandlers.initHandlersFromConfig created /admin/: org.apache.solr.handler.admin.AdminHandlers
[junit4:junit4]   2> 8967 T2250 oasc.RequestHandlers.initHandlersFromConfig created defaults: solr.StandardRequestHandler
[junit4:junit4]   2> 8967 T2250 oasc.RequestHandlers.initHandlersFromConfig adding lazy requestHandler: solr.StandardRequestHandler
[junit4:junit4]   2> 8968 T2250 oasc.RequestHandlers.initHandlersFromConfig created lazy: solr.StandardRequestHandler
[junit4:junit4]   2> 8968 T2250 oasc.RequestHandlers.initHandlersFromConfig created /update: solr.UpdateRequestHandler
[junit4:junit4]   2> 8969 T2250 oasc.RequestHandlers.initHandlersFromConfig created /terms: org.apache.solr.handler.component.SearchHandler
[junit4:junit4]   2> 8969 T2250 oasc.RequestHandlers.initHandlersFromConfig created spellCheckCompRH: org.apache.solr.handler.component.SearchHandler
[junit4:junit4]   2> 8970 T2250 oasc.RequestHandlers.initHandlersFromConfig created spellCheckCompRH_Direct: org.apache.solr.handler.component.SearchHandler
[junit4:junit4]   2> 8970 T2250 oasc.RequestHandlers.initHandlersFromConfig created spellCheckWithWordbreak: org.apache.solr.handler.component.SearchHandler
[junit4:junit4]   2> 8970 T2250 oasc.RequestHandlers.initHandlersFromConfig created spellCheckWithWordbreak_Direct: org.apache.solr.handler.component.SearchHandler
[junit4:junit4]   2> 8971 T2250 oasc.RequestHandlers.initHandlersFromConfig created spellCheckCompRH1: org.apache.solr.handler.component.SearchHandler
[junit4:junit4]   2> 8971 T2250 oasc.RequestHandlers.initHandlersFromConfig created tvrh: org.apache.solr.handler.component.SearchHandler
[junit4:junit4]   2> 8972 T2250 oasc.RequestHandlers.initHandlersFromConfig created /mlt: solr.MoreLikeThisHandler
[junit4:junit4]   2> 8973 T2250 oasc.RequestHandlers.initHandlersFromConfig created /debug/dump: solr.DumpRequestHandler
[junit4:junit4]   2> 8975 T2250 oashl.XMLLoader.init xsltCacheLifetimeSeconds=60
[junit4:junit4]   2> 8978 T2250 oasc.SolrCore.initDeprecatedSupport WARNING solrconfig.xml uses deprecated <admin/gettableFiles>, Please update your config to use the ShowFileRequestHandler.
[junit4:junit4]   2> 8979 T2250 oasc.SolrCore.initDeprecatedSupport WARNING adding ShowFileRequestHandler with hidden files: [SCHEMA.XML, OLD_SYNONYMS.TXT, STOPWORDS.TXT, PROTWORDS.TXT, OPEN-EXCHANGE-RATES.JSON, SYNONYMS.TXT, CURRENCY.XML, MAPPING-ISOLATIN1ACCENT.TXT]
[junit4:junit4]   2> 8983 T2250 oass.SolrIndexSearcher.<init> Opening Searcher@ae3e57f main
[junit4:junit4]   2> 8984 T2250 oasu.CommitTracker.<init> Hard AutoCommit: disabled
[junit4:junit4]   2> 8984 T2250 oasu.CommitTracker.<init> Soft AutoCommit: disabled
[junit4:junit4]   2> 8984 T2250 oashc.SpellCheckComponent.inform Initializing spell checkers
[junit4:junit4]   2> 8990 T2250 oass.DirectSolrSpellChecker.init init: {name=direct,classname=DirectSolrSpellChecker,field=lowerfilt,minQueryLength=3}
[junit4:junit4]   2> 9033 T2309 oasc.SolrCore.registerSearcher [collection1] Registered new searcher Searcher@ae3e57f main{StandardDirectoryReader(segments_1:1)}
[junit4:junit4]   2> 9444 T2271 oascc.ZkStateReader.updateClusterState Updating cloud state from ZooKeeper... 
[junit4:junit4]   2> 9457 T2296 oascc.ZkStateReader$2.process A cluster state change has occurred - updating...
[junit4:junit4]   2> 9461 T2270 oascc.ZkStateReader$2.process A cluster state change has occurred - updating...
[junit4:junit4]   2> 9461 T2308 oascc.ZkStateReader$2.process A cluster state change has occurred - updating...
[junit4:junit4]   2> 9461 T2284 oascc.ZkStateReader$2.process A cluster state change has occurred - updating...
[junit4:junit4]   2> 9539 T2250 oasc.CoreContainer.register registering core: collection1
[junit4:junit4]   2> 9539 T2250 oasc.ZkController.register Register shard - core:collection1 address:http://127.0.0.1:65421/solr shardId:shard1
[junit4:junit4]   2> 9542 T2250 oasc.ZkController.register We are http://127.0.0.1:65421/solr/collection1/ and leader is http://127.0.0.1:65410/solr/collection1/
[junit4:junit4]   2> 9542 T2250 oasc.ZkController.register No LogReplay needed for core=collection1 baseURL=http://127.0.0.1:65421/solr
[junit4:junit4]   2> 9542 T2250 oasc.ZkController.checkRecovery Core needs to recover:collection1
[junit4:junit4]   2> 9542 T2250 oasu.DefaultSolrCoreState.doRecovery Running recovery - first canceling any ongoing recovery
[junit4:junit4]   2> ASYNC  NEW_CORE C148 name=collection1 org.apache.solr.core.SolrCore@3bb3b322 url=http://127.0.0.1:65421/solr/collection1 node=127.0.0.1:65421_solr
[junit4:junit4]   2> 9543 T2310 C148 P65421 oasc.RecoveryStrategy.run Starting recovery process.  core=collection1 recoveringAfterStartup=true
[junit4:junit4]   2> 9544 T2310 C148 P65421 oasc.RecoveryStrategy.doRecovery ###### startupVersions=[]
[junit4:junit4]   2> 9544 T2250 oascc.ZkStateReader.updateClusterState Updating cloud state from ZooKeeper... 
[junit4:junit4]   2> 9545 T2310 C148 P65421 oasc.RecoveryStrategy.doRecovery Attempting to PeerSync from http://127.0.0.1:65410/solr/collection1/ core=collection1 - recoveringAfterStartup=true
[junit4:junit4]   2> 9545 T2310 C148 P65421 oasu.PeerSync.sync PeerSync: core=collection1 url=http://127.0.0.1:65421/solr START replicas=[http://127.0.0.1:65410/solr/collection1/] nUpdates=100
[junit4:junit4]   2> 9545 T2250 oass.SolrDispatchFilter.init user.dir=/usr/home/hudson/hudson-slave/workspace/Lucene-Solr-Tests-trunk-Java6/solr/build/solr-core/test/J0
[junit4:junit4]   2> 9545 T2310 C148 P65421 oasu.PeerSync.sync WARNING no frame of reference to tell of we've missed updates
[junit4:junit4]   2> 9545 T2250 oass.SolrDispatchFilter.init SolrDispatchFilter.init() done
[junit4:junit4]   2> 9546 T2310 C148 P65421 oasc.RecoveryStrategy.doRecovery PeerSync Recovery was not successful - trying replication. core=collection1
[junit4:junit4]   2> 9546 T2310 C148 P65421 oasc.RecoveryStrategy.doRecovery Starting Replication Recovery. core=collection1
[junit4:junit4]   2> 9546 T2250 oascsi.HttpClientUtil.createClient Creating new http client, config:maxConnections=128&maxConnectionsPerHost=32&followRedirects=false
[junit4:junit4]   2> 9546 T2310 C148 P65421 oascsi.HttpClientUtil.createClient Creating new http client, config:maxConnections=128&maxConnectionsPerHost=32&followRedirects=false
[junit4:junit4]   2> ASYNC  NEW_CORE C149 name=collection1 org.apache.solr.core.SolrCore@394723cb url=http://127.0.0.1:65410/solr/collection1 node=127.0.0.1:65410_solr
[junit4:junit4]   2> 9554 T2276 C149 P65410 REQ /get {distrib=false&qt=/get&wt=javabin&version=2&getVersions=100} status=0 QTime=0 
[junit4:junit4]   2> 9859 T2250 oejs.Server.doStart jetty-8.1.2.v20120308
[junit4:junit4]   2> 9861 T2250 oejs.AbstractConnector.doStart Started SocketConnector@0.0.0.0:65430
[junit4:junit4]   2> 9862 T2250 oasc.SolrResourceLoader.locateSolrHome JNDI not configured for solr (NoInitialContextEx)
[junit4:junit4]   2> 9862 T2250 oasc.SolrResourceLoader.locateSolrHome using system property solr.solr.home: /usr/home/hudson/hudson-slave/workspace/Lucene-Solr-Tests-trunk-Java6/solr/build/solr-core/test/J0/./solrtest-jetty4-1348060679880
[junit4:junit4]   2> 9863 T2250 oasc.SolrResourceLoader.<init> new SolrResourceLoader for deduced Solr Home: '/usr/home/hudson/hudson-slave/workspace/Lucene-Solr-Tests-trunk-Java6/solr/build/solr-core/test/J0/./solrtest-jetty4-1348060679880/'
[junit4:junit4]   2> 9888 T2250 oass.SolrDispatchFilter.init SolrDispatchFilter.init()
[junit4:junit4]   2> 9889 T2250 oasc.SolrResourceLoader.locateSolrHome JNDI not configured for solr (NoInitialContextEx)
[junit4:junit4]   2> 9889 T2250 oasc.SolrResourceLoader.locateSolrHome using system property solr.solr.home: /usr/home/hudson/hudson-slave/workspace/Lucene-Solr-Tests-trunk-Java6/solr/build/solr-core/test/J0/./solrtest-jetty4-1348060679880
[junit4:junit4]   2> 9889 T2250 oasc.CoreContainer$Initializer.initialize looking for solr.xml: /usr/home/hudson/hudson-slave/workspace/Lucene-Solr-Tests-trunk-Java6/solr/build/solr-core/test/J0/./solrtest-jetty4-1348060679880/solr.xml
[junit4:junit4]   2> 9890 T2250 oasc.CoreContainer.<init> New CoreContainer 1262782621
[junit4:junit4]   2> 9890 T2250 oasc.CoreContainer.load Loading CoreContainer using Solr Home: '/usr/home/hudson/hudson-slave/workspace/Lucene-Solr-Tests-trunk-Java6/solr/build/solr-core/test/J0/./solrtest-jetty4-1348060679880/'
[junit4:junit4]   2> 9890 T2250 oasc.SolrResourceLoader.<init> new SolrResourceLoader for directory: '/usr/home/hudson/hudson-slave/workspace/Lucene-Solr-Tests-trunk-Java6/solr/build/solr-core/test/J0/./solrtest-jetty4-1348060679880/'
[junit4:junit4]   2> 9908 T2250 oasc.CoreContainer.load Registering Log Listener
[junit4:junit4]   2> 9920 T2250 oasc.CoreContainer.initZooKeeper Zookeeper client=127.0.0.1:65394/solr
[junit4:junit4]   2> 9920 T2250 oaz.ZooKeeper.<init> Initiating client connection, connectString=127.0.0.1:65394/solr sessionTimeout=5000 watcher=org.apache.solr.common.cloud.ConnectionManager@6f9cb81d
[junit4:junit4]   2> 9921 T2321 oaz.ClientCnxn$SendThread.startConnect Opening socket connection to server /127.0.0.1:65394
[junit4:junit4]   2> 9921 T2250 oascc.ConnectionManager.waitForConnected Waiting for client to connect to ZooKeeper
[junit4:junit4]   2> 9922 T2321 oaz.ClientCnxn$SendThread.primeConnection Socket connection established to localhost/127.0.0.1:65394, initiating session
[junit4:junit4]   2> 9922 T2252 oazs.NIOServerCnxn$Factory.run Accepted socket connection from /140.211.11.196:65431
[junit4:junit4]   2> 9923 T2252 oazs.NIOServerCnxn.readConnectRequest Client attempting to establish new session at /140.211.11.196:65431
[junit4:junit4]   2> 9924 T2254 oazs.NIOServerCnxn.finishSessionInit Established session 0x139dead69790006 with negotiated timeout 5000 for client /140.211.11.196:65431
[junit4:junit4]   2> 9924 T2321 oaz.ClientCnxn$SendThread.readConnectResult Session establishment complete on server localhost/127.0.0.1:65394, sessionid = 0x139dead69790006, negotiated timeout = 5000
[junit4:junit4]   2> 9925 T2322 oascc.ConnectionManager.process Watcher org.apache.solr.common.cloud.ConnectionManager@6f9cb81d name:ZooKeeperConnection Watcher:127.0.0.1:65394/solr got event WatchedEvent state:SyncConnected type:None path:null path:null type:None
[junit4:junit4]   2> 9925 T2250 oascc.ConnectionManager.waitForConnected Client is connected to ZooKeeper
[junit4:junit4]   2> 9926 T2255 oazs.PrepRequestProcessor.pRequest Got user-level KeeperException when processing sessionid:0x139dead69790006 type:create cxid:0x1 zxid:0xfffffffffffffffe txntype:unknown reqpath:n/a Error Path:/solr/overseer Error:KeeperErrorCode = NodeExists for /solr/overseer
[junit4:junit4]   2> 9927 T2255 oazs.PrepRequestProcessor.pRequest Got user-level KeeperException when processing sessionid:0x139dead69790006 type:create cxid:0x2 zxid:0xfffffffffffffffe txntype:unknown reqpath:n/a Error Path:/solr/overseer Error:KeeperErrorCode = NodeExists for /solr/overseer
[junit4:junit4]   2> 9935 T2250 oasc.ZkController.createEphemeralLiveNode Register node as live in ZooKeeper:/live_nodes/127.0.0.1:65430_solr
[junit4:junit4]   2> 9935 T2255 oazs.PrepRequestProcessor.pRequest Got user-level KeeperException when processing sessionid:0x139dead69790006 type:delete cxid:0x4 zxid:0xfffffffffffffffe txntype:unknown reqpath:n/a Error Path:/solr/live_nodes/127.0.0.1:65430_solr Error:KeeperErrorCode = NoNode for /solr/live_nodes/127.0.0.1:65430_solr
[junit4:junit4]   2> 9936 T2250 oascc.SolrZkClient.makePath makePath: /live_nodes/127.0.0.1:65430_solr
[junit4:junit4]   2> 9938 T2308 oascc.ZkStateReader$3.process Updating live nodes
[junit4:junit4]   2> 9938 T2270 oascc.ZkStateReader$3.process Updating live nodes
[junit4:junit4]   2> 9938 T2296 oascc.ZkStateReader$3.process Updating live nodes
[junit4:junit4]   2> 9938 T2284 oascc.ZkStateReader$3.process Updating live nodes
[junit4:junit4]   2> 9939 T2250 oashc.HttpShardHandlerFactory.getParameter Setting socketTimeout to: 0
[junit4:junit4]   2> 9939 T2250 oashc.HttpShardHandlerFactory.getParameter Setting urlScheme to: http://
[junit4:junit4]   2> 9939 T2250 oashc.HttpShardHandlerFactory.getParameter Setting connTimeout to: 0
[junit4:junit4]   2> 9940 T2250 oashc.HttpShardHandlerFactory.getParameter Setting maxConnectionsPerHost to: 20
[junit4:junit4]   2> 9940 T2250 oashc.HttpShardHandlerFactory.getParameter Setting corePoolSize to: 0
[junit4:junit4]   2> 9940 T2250 oashc.HttpShardHandlerFactory.getParameter Setting maximumPoolSize to: 2147483647
[junit4:junit4]   2> 9941 T2250 oashc.HttpShardHandlerFactory.getParameter Setting maxThreadIdleTime to: 5
[junit4:junit4]   2> 9941 T2250 oashc.HttpShardHandlerFactory.getParameter Setting sizeOfQueue to: -1
[junit4:junit4]   2> 9941 T2250 oashc.HttpShardHandlerFactory.getParameter Setting fairnessPolicy to: false
[junit4:junit4]   2> 9942 T2250 oascsi.HttpClientUtil.createClient Creating new http client, config:maxConnectionsPerHost=20&maxConnections=10000&socketTimeout=0&connTimeout=0&retry=false
[junit4:junit4]   2> 9954 T2250 oascc.ZkStateReader.createClusterStateWatchersAndUpdate Updating cluster state from ZooKeeper... 
[junit4:junit4]   2> 9958 T2250 oasc.CoreContainer.create Creating SolrCore 'collection1' using instanceDir: /usr/home/hudson/hudson-slave/workspace/Lucene-Solr-Tests-trunk-Java6/solr/build/solr-core/test/J0/./solrtest-jetty4-1348060679880/collection1
[junit4:junit4]   2> 9959 T2250 oasc.ZkController.createCollectionZkNode Check for collection zkNode:collection1
[junit4:junit4]   2> 9959 T2250 oasc.ZkController.createCollectionZkNode Collection zkNode exists
[junit4:junit4]   2> 9960 T2250 oasc.ZkController.readConfigName Load collection config from:/collections/collection1
[junit4:junit4]   2> 9961 T2250 oasc.SolrResourceLoader.<init> new SolrResourceLoader for directory: '/usr/home/hudson/hudson-slave/workspace/Lucene-Solr-Tests-trunk-Java6/solr/build/solr-core/test/J0/./solrtest-jetty4-1348060679880/collection1/'
[junit4:junit4]   2> 9962 T2250 oasc.SolrResourceLoader.replaceClassLoader Adding 'file:/usr/home/hudson/hudson-slave/workspace/Lucene-Solr-Tests-trunk-Java6/solr/build/solr-core/test/J0/solrtest-jetty4-1348060679880/collection1/lib/README' to classloader
[junit4:junit4]   2> 9962 T2250 oasc.SolrResourceLoader.replaceClassLoader Adding 'file:/usr/home/hudson/hudson-slave/workspace/Lucene-Solr-Tests-trunk-Java6/solr/build/solr-core/test/J0/solrtest-jetty4-1348060679880/collection1/lib/classes/' to classloader
[junit4:junit4]   2> 9964 T2271 oascc.ZkStateReader.updateClusterState Updating cloud state from ZooKeeper... 
[junit4:junit4]   2> 9968 T2296 oascc.ZkStateReader$2.process A cluster state change has occurred - updating...
[junit4:junit4]   2> 9968 T2284 oascc.ZkStateReader$2.process A cluster state change has occurred - updating...
[junit4:junit4]   2> 9968 T2308 oascc.ZkStateReader$2.process A cluster state change has occurred - updating...
[junit4:junit4]   2> 9968 T2322 oascc.ZkStateReader$2.process A cluster state change has occurred - updating...
[junit4:junit4]   2> 9968 T2270 oascc.ZkStateReader$2.process A cluster state change has occurred - updating...
[junit4:junit4]   2> 9999 T2250 oasc.SolrConfig.<init> Using Lucene MatchVersion: LUCENE_50
[junit4:junit4]   2> 10053 T2250 oasc.SolrConfig.<init> Loaded SolrConfig: solrconfig.xml
[junit4:junit4]   2> 10153 T2250 oass.IndexSchema.readSchema Reading Solr Schema
[junit4:junit4]   2> 10159 T2250 oass.IndexSchema.readSchema Schema name=test
[junit4:junit4]   2> 10760 T2250 oass.OpenExchangeRatesOrgProvider.init Initialized with rates=open-exchange-rates.json, refreshInterval=1440.
[junit4:junit4]   2> 10768 T2250 oass.IndexSchema.readSchema default search field in schema is text
[junit4:junit4]   2> 10771 T2250 oass.IndexSchema.readSchema unique key field: id
[junit4:junit4]   2> 10779 T2250 oass.FileExchangeRateProvider.reload Reloading exchange rates from file currency.xml
[junit4:junit4]   2> 10782 T2250 oass.FileExchangeRateProvider.reload Reloading exchange rates from file currency.xml
[junit4:junit4]   2> 10785 T2250 oass.OpenExchangeRatesOrgProvider.reload Reloading exchange rates from open-exchange-rates.json
[junit4:junit4]   2> 10786 T2250 oass.OpenExchangeRatesOrgProvider.reload Reloading exchange rates from open-exchange-rates.json
[junit4:junit4]   2> 10787 T2250 oasc.SolrCore.<init> [collection1] Opening new SolrCore at /usr/home/hudson/hudson-slave/workspace/Lucene-Solr-Tests-trunk-Java6/solr/build/solr-core/test/J0/./solrtest-jetty4-1348060679880/collection1/, dataDir=./org.apache.solr.cloud.BasicDistributedZk2Test-1348060670324/jetty4/
[junit4:junit4]   2> 10787 T2250 oasc.JmxMonitoredMap.<init> JMX monitoring is enabled. Adding Solr mbeans to JMX Server: com.sun.jmx.mbeanserver.JmxMBeanServer@27bc4ec8
[junit4:junit4]   2> 10788 T2250 oasc.SolrCore.getNewIndexDir WARNING New index directory detected: old=null new=./org.apache.solr.cloud.BasicDistributedZk2Test-1348060670324/jetty4/index/
[junit4:junit4]   2> 10789 T2250 oasc.SolrCore.initIndex WARNING [collection1] Solr index directory './org.apache.solr.cloud.BasicDistributedZk2Test-1348060670324/jetty4/index' doesn't exist. Creating new index...
[junit4:junit4]   2> 10789 T2250 oasc.CachingDirectoryFactory.get return new directory for /usr/home/hudson/hudson-slave/workspace/Lucene-Solr-Tests-trunk-Java6/solr/build/solr-core/test/J0/./org.apache.solr.cloud.BasicDistributedZk2Test-1348060670324/jetty4/index forceNew:false
[junit4:junit4]   2> 10803 T2250 oasc.SolrDeletionPolicy.onCommit SolrDeletionPolicy.onCommit: commits:num=1
[junit4:junit4]   2> 		commit{dir=NRTCachingDirectory(org.apache.lucene.store.NIOFSDirectory@/usr/home/hudson/hudson-slave/workspace/Lucene-Solr-Tests-trunk-Java6/solr/build/solr-core/test/J0/org.apache.solr.cloud.BasicDistributedZk2Test-1348060670324/jetty4/index lockFactory=org.apache.lucene.store.NativeFSLockFactory@16dc40fe; maxCacheMB=48.0 maxMergeSizeMB=4.0),segFN=segments_1,generation=1,filenames=[segments_1]
[junit4:junit4]   2> 10803 T2250 oasc.SolrDeletionPolicy.updateCommits newest commit = 1
[junit4:junit4]   2> 10804 T2250 oasc.SolrCore.initWriters created xml: solr.XMLResponseWriter
[junit4:junit4]   2> 10806 T2250 oasup.UpdateRequestProcessorChain.init inserting DistributedUpdateProcessorFactory into updateRequestProcessorChain "dedupe"
[junit4:junit4]   2> 10806 T2250 oasup.UpdateRequestProcessorChain.init inserting DistributedUpdateProcessorFactory into updateRequestProcessorChain "dedupe-allfields"
[junit4:junit4]   2> 10807 T2250 oasup.UpdateRequestProcessorChain.init inserting DistributedUpdateProcessorFactory into updateRequestProcessorChain "stored_sig"
[junit4:junit4]   2> 10807 T2250 oasup.UpdateRequestProcessorChain.init inserting DistributedUpdateProcessorFactory into updateRequestProcessorChain "uniq-fields"
[junit4:junit4]   2> 10807 T2250 oasup.UpdateRequestProcessorChain.init inserting DistributedUpdateProcessorFactory into updateRequestProcessorChain "distrib-dup-test-chain-implicit"
[junit4:junit4]   2> 10808 T2250 oasc.RequestHandlers.initHandlersFromConfig adding lazy requestHandler: solr.ReplicationHandler
[junit4:junit4]   2> 10808 T2250 oasc.RequestHandlers.initHandlersFromConfig created /replication: solr.ReplicationHandler
[junit4:junit4]   2> 10809 T2250 oasc.RequestHandlers.initHandlersFromConfig created standard: solr.StandardRequestHandler
[junit4:junit4]   2> 10809 T2250 oasc.RequestHandlers.initHandlersFromConfig created /get: solr.RealTimeGetHandler
[junit4:junit4]   2> 10810 T2250 oasc.RequestHandlers.initHandlersFromConfig created dismax: solr.SearchHandler
[junit4:junit4]   2> 10810 T2250 oasc.RequestHandlers.initHandlersFromConfig created mock: org.apache.solr.core.MockQuerySenderListenerReqHandler
[junit4:junit4]   2> 10811 T2250 oasc.RequestHandlers.initHandlersFromConfig created /admin/: org.apache.solr.handler.admin.AdminHandlers
[junit4:junit4]   2> 10811 T2250 oasc.RequestHandlers.initHandlersFromConfig created defaults: solr.StandardRequestHandler
[junit4:junit4]   2> 10812 T2250 oasc.RequestHandlers.initHandlersFromConfig adding lazy requestHandler: solr.StandardRequestHandler
[junit4:junit4]   2> 10812 T2250 oasc.RequestHandlers.initHandlersFromConfig created lazy: solr.StandardRequestHandler
[junit4:junit4]   2> 10813 T2250 oasc.RequestHandlers.initHandlersFromConfig created /update: solr.UpdateRequestHandler
[junit4:junit4]   2> 10813 T2250 oasc.RequestHandlers.initHandlersFromConfig created /terms: org.apache.solr.handler.component.SearchHandler
[junit4:junit4]   2> 10814 T2250 oasc.RequestHandlers.initHandlersFromConfig created spellCheckCompRH: org.apache.solr.handler.component.SearchHandler
[junit4:junit4]   2> 10814 T2250 oasc.RequestHandlers.initHandlersFromConfig created spellCheckCompRH_Direct: org.apache.solr.handler.component.SearchHandler
[junit4:junit4]   2> 10815 T2250 oasc.RequestHandlers.initHandlersFromConfig created spellCheckWithWordbreak: org.apache.solr.handler.component.SearchHandler
[junit4:junit4]   2> 10815 T2250 oasc.RequestHandlers.initHandlersFromConfig created spellCheckWithWordbreak_Direct: org.apache.solr.handler.component.SearchHandler
[junit4:junit4]   2> 10816 T2250 oasc.RequestHandlers.initHandlersFromConfig created spellCheckCompRH1: org.apache.solr.handler.component.SearchHandler
[junit4:junit4]   2> 10816 T2250 oasc.RequestHandlers.initHandlersFromConfig created tvrh: org.apache.solr.handler.component.SearchHandler
[junit4:junit4]   2> 10817 T2250 oasc.RequestHandlers.initHandlersFromConfig created /mlt: solr.MoreLikeThisHandler
[junit4:junit4]   2> 10817 T2250 oasc.RequestHandlers.initHandlersFromConfig created /debug/dump: solr.DumpRequestHandler
[junit4:junit4]   2> 10820 T2250 oashl.XMLLoader.init xsltCacheLifetimeSeconds=60
[junit4:junit4]   2> 10823 T2250 oasc.SolrCore.initDeprecatedSupport WARNING solrconfig.xml uses deprecated <admin/gettableFiles>, Please update your config to use the ShowFileRequestHandler.
[junit4:junit4]   2> 10824 T2250 oasc.SolrCore.initDeprecatedSupport WARNING adding ShowFileRequestHandler with hidden files: [SCHEMA.XML, OLD_SYNONYMS.TXT, STOPWORDS.TXT, PROTWORDS.TXT, OPEN-EXCHANGE-RATES.JSON, SYNONYMS.TXT, CURRENCY.XML, MAPPING-ISOLATIN1ACCENT.TXT]
[junit4:junit4]   2> 10827 T2250 oass.SolrIndexSearcher.<init> Opening Searcher@48ac5582 main
[junit4:junit4]   2> 10828 T2250 oasu.CommitTracker.<init> Hard AutoCommit: disabled
[junit4:junit4]   2> 10828 T2250 oasu.CommitTracker.<init> Soft AutoCommit: disabled
[junit4:junit4]   2> 10829 T2250 oashc.SpellCheckComponent.inform Initializing spell checkers
[junit4:junit4]   2> 10845 T2250 oass.DirectSolrSpellChecker.init init: {name=direct,classname=DirectSolrSpellChecker,field=lowerfilt,minQueryLength=3}
[junit4:junit4]   2> 10892 T2323 oasc.SolrCore.registerSearcher [collection1] Registered new searcher Searcher@48ac5582 main{StandardDirectoryReader(segments_1:1)}
[junit4:junit4]   2> 10972 T2271 oascc.ZkStateReader.updateClusterState Updating cloud state from ZooKeeper... 
[junit4:junit4]   2> 10975 T2322 oascc.ZkStateReader$2.process A cluster state change has occurred - updating...
[junit4:junit4]   2> 10975 T2270 oascc.ZkStateReader$2.process A cluster state change has occurred - updating...
[junit4:junit4]   2> 10975 T2308 oascc.ZkStateReader$2.process A cluster state change has occurred - updating...
[junit4:junit4]   2> 10975 T2284 oascc.ZkStateReader$2.process A cluster state change has occurred - updating...
[junit4:junit4]   2> 10975 T2296 oascc.ZkStateReader$2.process A cluster state change has occurred - updating...
[junit4:junit4]   2> 11399 T2250 oasc.CoreContainer.register registering core: collection1
[junit4:junit4]   2> 11399 T2250 oasc.ZkController.register Register shard - core:collection1 address:http://127.0.0.1:65430/solr shardId:shard2
[junit4:junit4]   2> 11401 T2250 oasc.ZkController.register We are http://127.0.0.1:65430/solr/collection1/ and leader is http://127.0.0.1:65416/solr/collection1/
[junit4:junit4]   2> 11402 T2250 oasc.ZkController.register No LogReplay needed for core=collection1 baseURL=http://127.0.0.1:65430/solr
[junit4:junit4]   2> 11402 T2250 oasc.ZkController.checkRecovery Core needs to recover:collection1
[junit4:junit4]   2> 11402 T2250 oasu.DefaultSolrCoreState.doRecovery Running recovery - first canceling any ongoing recovery
[junit4:junit4]   2> ASYNC  NEW_CORE C150 name=collection1 org.apache.solr.core.SolrCore@66610523 url=http://127.0.0.1:65430/solr/collection1 node=127.0.0.1:65430_solr
[junit4:junit4]   2> 11403 T2324 C150 P65430 oasc.RecoveryStrategy.run Starting recovery process.  core=collection1 recoveringAfterStartup=true
[junit4:junit4]   2> 11404 T2250 oascc.ZkStateReader.updateClusterState Updating cloud state from ZooKeeper... 
[junit4:junit4]   2> 11404 T2324 C150 P65430 oasc.RecoveryStrategy.doRecovery ###### startupVersions=[]
[junit4:junit4]   2> 11404 T2250 oass.SolrDispatchFilter.init user.dir=/usr/home/hudson/hudson-slave/workspace/Lucene-Solr-Tests-trunk-Java6/solr/build/solr-core/test/J0
[junit4:junit4]   2> 11405 T2250 oass.SolrDispatchFilter.init SolrDispatchFilter.init() done
[junit4:junit4]   2> 11405 T2324 C150 P65430 oasc.RecoveryStrategy.doRecovery Attempting to PeerSync from http://127.0.0.1:65416/solr/collection1/ core=collection1 - recoveringAfterStartup=true
[junit4:junit4]   2> 11405 T2324 C150 P65430 oasu.PeerSync.sync PeerSync: core=collection1 url=http://127.0.0.1:65430/solr START replicas=[http://127.0.0.1:65416/solr/collection1/] nUpdates=100
[junit4:junit4]   2> 11405 T2250 oascsi.HttpClientUtil.createClient Creating new http client, config:maxConnections=128&maxConnectionsPerHost=32&followRedirects=false
[junit4:junit4]   2> 11406 T2324 C150 P65430 oasu.PeerSync.sync WARNING no frame of reference to tell of we've missed updates
[junit4:junit4]   2> 11406 T2324 C150 P65430 oasc.RecoveryStrategy.doRecovery PeerSync Recovery was not successful - trying replication. core=collection1
[junit4:junit4]   2> 11406 T2324 C150 P65430 oasc.RecoveryStrategy.doRecovery Starting Replication Recovery. core=collection1
[junit4:junit4]   2> 11406 T2324 C150 P65430 oascsi.HttpClientUtil.createClient Creating new http client, config:maxConnections=128&maxConnectionsPerHost=32&followRedirects=false
[junit4:junit4]   2> ASYNC  NEW_CORE C151 name=collection1 org.apache.solr.core.SolrCore@3da67df5 url=http://127.0.0.1:65416/solr/collection1 node=127.0.0.1:65416_solr
[junit4:junit4]   2> 11414 T2288 C151 P65416 REQ /get {distrib=false&qt=/get&wt=javabin&version=2&getVersions=100} status=0 QTime=0 
[junit4:junit4]   2> 11421 T2250 oaz.ZooKeeper.<init> Initiating client connection, connectString=127.0.0.1:65394/solr sessionTimeout=10000 watcher=org.apache.solr.common.cloud.ConnectionManager@73e5941e
[junit4:junit4]   2> 11422 T2326 oaz.ClientCnxn$SendThread.startConnect Opening socket connection to server /127.0.0.1:65394
[junit4:junit4]   2> 11422 T2250 oascc.ConnectionManager.waitForConnected Waiting for client to connect to ZooKeeper
[junit4:junit4]   2> 11423 T2326 oaz.ClientCnxn$SendThread.primeConnection Socket connection established to localhost/127.0.0.1:65394, initiating session
[junit4:junit4]   2> 11423 T2252 oazs.NIOServerCnxn$Factory.run Accepted socket connection from /140.211.11.196:65440
[junit4:junit4]   2> 11423 T2252 oazs.NIOServerCnxn.readConnectRequest Client attempting to establish new session at /140.211.11.196:65440
[junit4:junit4]   2> 11442 T2254 oazs.NIOServerCnxn.finishSessionInit Established session 0x139dead69790007 with negotiated timeout 10000 for client /140.211.11.196:65440
[junit4:junit4]   2> 11442 T2326 oaz.ClientCnxn$SendThread.readConnectResult Session establishment complete on server localhost/127.0.0.1:65394, sessionid = 0x139dead69790007, negotiated timeout = 10000
[junit4:junit4]   2> 11442 T2327 oascc.ConnectionManager.process Watcher org.apache.solr.common.cloud.ConnectionManager@73e5941e name:ZooKeeperConnection Watcher:127.0.0.1:65394/solr got event WatchedEvent state:SyncConnected type:None path:null path:null type:None
[junit4:junit4]   2> 11443 T2250 oascc.ConnectionManager.waitForConnected Client is connected to ZooKeeper
[junit4:junit4]   2> 11443 T2250 oascc.ZkStateReader.createClusterStateWatchersAndUpdate Updating cluster state from ZooKeeper... 
[junit4:junit4]   2> 11444 T2250 oasc.ChaosMonkey.monkeyLog monkey: init - expire sessions:true cause connection loss:true
[junit4:junit4]   2> 11444 T2250 oascsi.HttpClientUtil.createClient Creating new http client, config:
[junit4:junit4]   2> 11450 T2250 oascc.ZkStateReader.updateClusterState Updating cloud state from ZooKeeper... 
[junit4:junit4]   2> ASYNC  NEW_CORE C152 name=collection1 org.apache.solr.core.SolrCore@69be85d0 url=http://127.0.0.1:65397/solr/collection1 node=127.0.0.1:65397_solr
[junit4:junit4]   2> 11460 T2262 C152 P65397 oasc.SolrDeletionPolicy.onInit SolrDeletionPolicy.onInit: commits:num=1
[junit4:junit4]   2> 		commit{dir=NRTCachingDirectory(org.apache.lucene.store.NIOFSDirectory@/usr/home/hudson/hudson-slave/workspace/Lucene-Solr-Tests-trunk-Java6/solr/build/solr-core/test/J0/org.apache.solr.cloud.BasicDistributedZk2Test-1348060670324/control/data/index lockFactory=org.apache.lucene.store.NativeFSLockFactory@798ded3f; maxCacheMB=48.0 maxMergeSizeMB=4.0),segFN=segments_1,generation=1,filenames=[segments_1]
[junit4:junit4]   2> 11461 T2262 C152 P65397 oasc.SolrDeletionPolicy.updateCommits newest commit = 1
[junit4:junit4]   2> 11464 T2262 C152 P65397 /update {wt=javabin&version=2} {add=[1 (1413544077456048128)]} 0 8
[junit4:junit4]   2> 11464 T2250 oaz.ZooKeeper.<init> Initiating client connection, connectString=127.0.0.1:65394/solr sessionTimeout=10000 watcher=org.apache.solr.common.cloud.ConnectionManager@7ee821c5
[junit4:junit4]   2> 11465 T2328 oaz.ClientCnxn$SendThread.startConnect Opening socket connection to server /127.0.0.1:65394
[junit4:junit4]   2> 11465 T2250 oascc.ConnectionManager.waitForConnected Waiting for client to connect to ZooKeeper
[junit4:junit4]   2> 11466 T2328 oaz.ClientCnxn$SendThread.primeConnection Socket connection established to localhost/127.0.0.1:65394, initiating session
[junit4:junit4]   2> 11466 T2252 oazs.NIOServerCnxn$Factory.run Accepted socket connection from /140.211.11.196:65442
[junit4:junit4]   2> 11466 T2252 oazs.NIOServerCnxn.readConnectRequest Client attempting to establish new session at /140.211.11.196:65442
[junit4:junit4]   2> 11468 T2254 oazs.NIOServerCnxn.finishSessionInit Established session 0x139dead69790008 with negotiated timeout 10000 for client /140.211.11.196:65442
[junit4:junit4]   2> 11468 T2328 oaz.ClientCnxn$SendThread.readConnectResult Session establishment complete on server localhost/127.0.0.1:65394, sessionid = 0x139dead69790008, negotiated timeout = 10000
[junit4:junit4]   2> 11468 T2329 oascc.ConnectionManager.process Watcher org.apache.solr.common.cloud.ConnectionManager@7ee821c5 name:ZooKeeperConnection Watcher:127.0.0.1:65394/solr got event WatchedEvent state:SyncConnected type:None path:null path:null type:None
[junit4:junit4]   2> 11468 T2250 oascc.ConnectionManager.waitForConnected Client is connected to ZooKeeper
[junit4:junit4]   2> 11469 T2250 oascc.ZkStateReader.createClusterStateWatchersAndUpdate Updating cluster state from ZooKeeper... 
[junit4:junit4]   2> 11475 T2278 C149 P65410 oasc.SolrDeletionPolicy.onInit SolrDeletionPolicy.onInit: commits:num=1
[junit4:junit4]   2> 		commit{dir=NRTCachingDirectory(org.apache.lucene.store.NIOFSDirectory@/usr/home/hudson/hudson-slave/workspace/Lucene-Solr-Tests-trunk-Java6/solr/build/solr-core/test/J0/org.apache.solr.cloud.BasicDistributedZk2Test-1348060670324/jetty1/index lockFactory=org.apache.lucene.store.NativeFSLockFactory@2225a390; maxCacheMB=48.0 maxMergeSizeMB=4.0),segFN=segments_1,generation=1,filenames=[segments_1]
[junit4:junit4]   2> 11475 T2278 C149 P65410 oasc.SolrDeletionPolicy.updateCommits newest commit = 1
[junit4:junit4]   2>  C148_STATE=coll:collection1 core:collection1 props:{shard=shard1, roles=null, state=recovering, core=collection1, collection=collection1, node_name=127.0.0.1:65421_solr, base_url=http://127.0.0.1:65421/solr}
[junit4:junit4]   2> 11488 T2300 C148 P65421 oasc.SolrDeletionPolicy.onInit SolrDeletionPolicy.onInit: commits:num=1
[junit4:junit4]   2> 		commit{dir=NRTCachingDirectory(org.apache.lucene.store.NIOFSDirectory@/usr/home/hudson/hudson-slave/workspace/Lucene-Solr-Tests-trunk-Java6/solr/build/solr-core/test/J0/org.apache.solr.cloud.BasicDistributedZk2Test-1348060670324/jetty3/index lockFactory=org.apache.lucene.store.NativeFSLockFactory@2e4cda87; maxCacheMB=48.0 maxMergeSizeMB=4.0),segFN=segments_1,generation=1,filenames=[segments_1]
[junit4:junit4]   2> 11489 T2300 C148 P65421 oasc.SolrDeletionPolicy.updateCommits newest commit = 1
[junit4:junit4]   2> 11490 T2271 oascc.ZkStateReader.updateClusterState Updating cloud state from ZooKeeper... 
[junit4:junit4]   2> 11492 T2300 C148 P65421 REQ /update {distrib.from=http://127.0.0.1:65410/solr/collection1/&update.distrib=FROMLEADER&wt=javabin&version=2} status=0 QTime=7 
[junit4:junit4]   2> 11493 T2278 C149 P65410 /update {wt=javabin&version=2} {add=[1 (1413544077470728192)]} 0 22
[junit4:junit4]   2> 11493 T2250 oasc.AbstractDistribZkTestBase.waitForRecoveriesToFinish Wait for recoveries to finish - collection: collection1 failOnTimeout:true timeout (sec):1800
[junit4:junit4]   2> 11518 T2250 oascc.ZkStateReader.updateClusterState Updating cloud state from ZooKeeper... 
[junit4:junit4]   2> 11585 T2270 oascc.ZkStateReader$2.process A cluster state change has occurred - updating...
[junit4:junit4]   2> 11585 T2308 oascc.ZkStateReader$2.process A cluster state change has occurred - updating...
[junit4:junit4]   2> 11585 T2296 oascc.ZkStateReader$2.process A cluster state change has occurred - updating...
[junit4:junit4]   2> 11585 T2327 oascc.ZkStateReader$2.process A cluster state change has occurred - updating...
[junit4:junit4]   2> 11585 T2329 oascc.ZkStateReader$2.process A cluster state change has occurred - updating...
[junit4:junit4]   2> 11585 T2284 oascc.ZkStateReader$2.process A cluster state change has occurred - updating...
[junit4:junit4]   2> 11585 T2322 oascc.ZkStateReader$2.process A cluster state change has occurred - updating...
[junit4:junit4]   2> 12562 T2310 C148 P65421 oasc.RecoveryStrategy.doRecovery Begin buffering updates. core=collection1
[junit4:junit4]   2> 12562 T2310 C148 P65421 oasu.UpdateLog.bufferUpdates Starting to buffer updates. FSUpdateLog{state=ACTIVE, tlog=tlog{file=./org.apache.solr.cloud.BasicDistributedZk2Test-1348060670324/jetty3/tlog/tlog.0000000000000000000 refcount=1}}
[junit4:junit4]   2> 12562 T2310 C148 P65421 oasc.RecoveryStrategy.replicate Attempting to replicate from http://127.0.0.1:65410/solr/collection1/. core=collection1
[junit4:junit4]   2> 12562 T2310 C148 P65421 oascsi.HttpClientUtil.createClient Creating new http client, config:maxConnections=128&maxConnectionsPerHost=32&followRedirects=false
[junit4:junit4]   2> 12577 T2279 C149 P65410 oasu.DirectUpdateHandler2.commit start commit{flags=0,_version_=0,optimize=false,openSearcher=true,waitSearcher=true,expungeDeletes=false,softCommit=false}
[junit4:junit4]   2> 12587 T2250 oascc.ZkStateReader.updateClusterState Updating cloud state from ZooKeeper... 
[junit4:junit4]   2> 12635 T2279 C149 P65410 oasc.SolrDeletionPolicy.onCommit SolrDeletionPolicy.onCommit: commits:num=2
[junit4:junit4]   2> 		commit{dir=NRTCachingDirectory(org.apache.lucene.store.NIOFSDirectory@/usr/home/hudson/hudson-slave/workspace/Lucene-Solr-Tests-trunk-Java6/solr/build/solr-core/test/J0/org.apache.solr.cloud.BasicDistributedZk2Test-1348060670324/jetty1/index lockFactory=org.apache.lucene.store.NativeFSLockFactory@2225a390; maxCacheMB=48.0 maxMergeSizeMB=4.0),segFN=segments_1,generation=1,filenames=[segments_1]
[junit4:junit4]   2> 		commit{dir=NRTCachingDirectory(org.apache.lucene.store.NIOFSDirectory@/usr/home/hudson/hudson-slave/workspace/Lucene-Solr-Tests-trunk-Java6/solr/build/solr-core/test/J0/org.apache.solr.cloud.BasicDistributedZk2Test-1348060670324/jetty1/index lockFactory=org.apache.lucene.store.NativeFSLockFactory@2225a390; maxCacheMB=48.0 maxMergeSizeMB=4.0),segFN=segments_2,generation=2,filenames=[_0_MockRandom_0.tib, _0_Block_0.pos, _0_Block_0.tip, _0.fnm, _0_Pulsing40_0.tim, _0_Block_0.doc, _0_Block_0.tim, _0_MockRandom_0.prx, _0_nrm.cfs, _0_Pulsing40_0.prx, _0_Pulsing40_0.frq, _0_MockRandom_0.frq, _0_MockRandom_0.sd, _0_Lucene40WithOrds_0.tii, _0_Lucene40WithOrds_0.frq, _0_nrm.cfe, _0_MockRandom_0.tii, _0_Pulsing40_0.tip, segments_2, _0.fdx, _0_Lucene40WithOrds_0.prx, _0.si, _0_Lucene40WithOrds_0.tib, _0.fdt]
[junit4:junit4]   2> 12636 T2279 C149 P65410 oasc.SolrDeletionPolicy.updateCommits newest commit = 2
[junit4:junit4]   2> 12651 T2279 C149 P65410 oass.SolrIndexSearcher.<init> Opening Searcher@122914af main
[junit4:junit4]   2> 12652 T2279 C149 P65410 oasu.DirectUpdateHandler2.commit end_commit_flush
[junit4:junit4]   2> 12653 T2285 oasc.SolrCore.registerSearcher [collection1] Registered new searcher Searcher@122914af main{StandardDirectoryReader(segments_2:3 _0(5.0):C1)}
[junit4:junit4]   2> 12654 T2279 C149 P65410 /update {waitSearcher=true&commit=true&commit_end_point=true&wt=javabin&softCommit=false&version=2} {commit=} 0 78
[junit4:junit4]   2> 12655 T2310 C148 P65421 oash.ReplicationHandler.inform Commits will be reserved for  10000
[junit4:junit4]   2> 12655 T2310 C148 P65421 oash.SnapPuller.<init>  No value set for 'pollInterval'. Timer Task not started.
[junit4:junit4]   2> 12657 T2280 C149 P65410 oash.ReplicationHandler.inform Commits will be reserved for  10000
[junit4:junit4]   2> 12658 T2280 C149 P65410 REQ /replication {command=indexversion&wt=javabin&qt=/replication&version=2} status=0 QTime=2 
[junit4:junit4]   2> 12658 T2310 C148 P65421 oash.SnapPuller.fetchLatestIndex Master's generation: 2
[junit4:junit4]   2> 12659 T2310 C148 P65421 oash.SnapPuller.fetchLatestIndex Slave's generation: 1
[junit4:junit4]   2> 12659 T2310 C148 P65421 oash.SnapPuller.fetchLatestIndex Starting replication process
[junit4:junit4]   2> 12663 T2280 C149 P65410 REQ /replication {command=filelist&generation=2&wt=javabin&qt=/replication&version=2} status=0 QTime=2 
[junit4:junit4]   2> 12664 T2310 C148 P65421 oash.SnapPuller.fetchLatestIndex Number of files in latest index in master: 24
[junit4:junit4]   2> 12671 T2310 C148 P65421 oash.SnapPuller.fetchLatestIndex Starting download to ./org.apache.solr.cloud.BasicDistributedZk2Test-1348060670324/jetty3/index.20120919181802986 fullCopy=true
[junit4:junit4]   2> 12675 T2280 C149 P65410 REQ /replication {file=_0_Block_0.tip&command=filecontent&checksum=true&generation=2&qt=/replication&wt=filestream} status=0 QTime=0 
[junit4:junit4]   2> 12680 T2280 C149 P65410 REQ /replication {file=_0_Block_0.pos&command=filecontent&checksum=true&generation=2&qt=/replication&wt=filestream} status=0 QTime=0 
[junit4:junit4]   2> 12684 T2280 C149 P65410 REQ /replication {file=_0_Block_0.tim&command=filecontent&checksum=true&generation=2&qt=/replication&wt=filestream} status=0 QTime=0 
[junit4:junit4]   2> 12688 T2280 C149 P65410 REQ /replication {file=_0_MockRandom_0.prx&command=filecontent&checksum=true&generation=2&qt=/replication&wt=filestream} status=0 QTime=0 
[junit4:junit4]   2> 12692 T2280 C149 P65410 REQ /replication {file=_0_Pulsing40_0.prx&command=filecontent&checksum=true&generation=2&qt=/replication&wt=filestream} status=0 QTime=0 
[junit4:junit4]   2> 12696 T2280 C149 P65410 REQ /replication {file=_0_Pulsing40_0.frq&command=filecontent&checksum=true&generation=2&qt=/replication&wt=filestream} status=0 QTime=0 
[junit4:junit4]   2> 12700 T2280 C149 P65410 REQ /replication {file=_0_Lucene40WithOrds_0.tii&command=filecontent&checksum=true&generation=2&qt=/replication&wt=filestream} status=0 QTime=0 
[junit4:junit4]   2> 12704 T2280 C149 P65410 REQ /replication {file=_0_Lucene40WithOrds_0.frq&command=filecontent&checksum=true&generation=2&qt=/replication&wt=filestream} status=0 QTime=0 
[junit4:junit4]   2> 12708 T2280 C149 P65410 REQ /replication {file=_0_Pulsing40_0.tip&command=filecontent&checksum=true&generation=2&qt=/replication&wt=filestream} status=0 QTime=0 
[junit4:junit4]   2> 12712 T2280 C149 P65410 REQ /replication {file=_0.si&command=filecontent&checksum=true&generation=2&qt=/replication&wt=filestream} status=0 QTime=0 
[junit4:junit4]   2> 12716 T2280 C149 P65410 REQ /replication {file=_0_Lucene40WithOrds_0.tib&command=filecontent&checksum=true&generation=2&qt=/replication&wt=filestream} status=0 QTime=0 
[junit4:junit4]   2> 12720 T2280 C149 P65410 REQ /replication {file=_0_MockRandom_0.tib&command=filecontent&checksum=true&generation=2&qt=/replication&wt=filestream} status=0 QTime=0 
[junit4:junit4]   2> 12724 T2280 C149 P65410 REQ /replication {file=_0_Block_0.doc&command=filecontent&checksum=true&generation=2&qt=/replication&wt=filestream} status=0 QTime=0 
[junit4:junit4]   2> 12729 T2280 C149 P65410 REQ /replication {file=_0_Pulsing40_0.tim&command=filecontent&checksum=true&generation=2&qt=/replication&wt=filestream} status=0 QTime=0 
[junit4:junit4]   2> 12733 T2280 C149 P65410 REQ /replication {file=_0.fnm&command=filecontent&checksum=true&generation=2&qt=/replication&wt=filestream} status=0 QTime=0 
[junit4:junit4]   2> 12737 T2280 C149 P65410 REQ /replication {file=_0_nrm.cfs&command=filecontent&checksum=true&generation=2&qt=/replication&wt=filestream} status=0 QTime=0 
[junit4:junit4]   2> 12741 T2280 C149 P65410 REQ /replication {file=_0_MockRandom_0.sd&command=filecontent&checksum=true&generation=2&qt=/replication&wt=filestream} status=0 QTime=0 
[junit4:junit4]   2> 12745 T2280 C149 P65410 REQ /replication {file=_0_MockRandom_0.frq&command=filecontent&checksum=true&generation=2&qt=/replication&wt=filestream} status=0 QTime=0 
[junit4:junit4]   2> 12749 T2280 C149 P65410 REQ /replication {file=_0_nrm.cfe&command=filecontent&checksum=true&generation=2&qt=/replication&wt=filestream} status=0 QTime=0 
[junit4:junit4]   2> 12753 T2280 C149 P65410 REQ /replication {file=segments_2&command=filecontent&checksum=true&generation=2&qt=/replication&wt=filestream} status=0 QTime=0 
[junit4:junit4]   2> 12757 T2280 C149 P65410 REQ /replication {file=_0_MockRandom_0.tii&command=filecontent&checksum=true&generation=2&qt=/replication&wt=filestream} status=0 QTime=0 
[junit4:junit4]   2> 12761 T2280 C149 P65410 REQ /replication {file=_0.fdx&command=filecontent&checksum=true&generation=2&qt=/replication&wt=filestream} status=0 QTime=0 
[junit4:junit4]   2> 12765 T2280 C149 P65410 REQ /replication {file=_0_Lucene40WithOrds_0.prx&command=filecontent&checksum=true&generation=2&qt=/replication&wt=filestream} status=0 QTime=0 
[junit4:junit4]   2> 12769 T2280 C149 P65410 REQ /replication {file=_0.fdt&command=filecontent&checksum=true&generation=2&qt=/replication&wt=filestream} status=0 QTime=0 
[junit4:junit4]   2> 12770 T2310 C148 P65421 oash.SnapPuller.fetchLatestIndex Total time taken for download : 0 secs
[junit4:junit4]   2> 12771 T2310 C148 P65421 oash.SnapPuller.modifyIndexProps New index installed. Updating index properties... index=index.20120919181802986
[junit4:junit4]   2> 12772 T2310 C148 P65421 oasu.DefaultSolrCoreState.newIndexWriter Creating new IndexWriter...
[junit4:junit4]   2> 12773 T2310 C148 P65421 oasu.DefaultSolrCoreState.newIndexWriter Waiting until IndexWriter is unused... core=collection1
[junit4:junit4]   2> 12773 T2310 C148 P65421 oasu.DefaultSolrCoreState.newIndexWriter Rollback old IndexWriter... core=collection1
[junit4:junit4]   2> 12777 T2310 C148 P65421 oasc.SolrCore.getNewIndexDir WARNING New index directory detected: old=./org.apache.solr.cloud.BasicDistributedZk2Test-1348060670324/jetty3/index/ new=./org.apache.solr.cloud.BasicDistributedZk2Test-1348060670324/jetty3/index.20120919181802986
[junit4:junit4]   2> 12778 T2310 C148 P65421 oasc.CachingDirectoryFactory.get return new directory for /usr/home/hudson/hudson-slave/workspace/Lucene-Solr-Tests-trunk-Java6/solr/build/solr-core/test/J0/./org.apache.solr.cloud.BasicDistributedZk2Test-1348060670324/jetty3/index.20120919181802986 forceNew:true
[junit4:junit4]   2> 12788 T2310 C148 P65421 oasc.SolrDeletionPolicy.onInit SolrDeletionPolicy.onInit: commits:num=1
[junit4:junit4]   2> 		commit{dir=NRTCachingDirectory(org.apache.lucene.store.NIOFSDirectory@/usr/home/hudson/hudson-slave/workspace/Lucene-Solr-Tests-trunk-Java6/solr/build/solr-core/test/J0/org.apache.solr.cloud.BasicDistributedZk2Test-1348060670324/jetty3/index.20120919181802986 lockFactory=org.apache.lucene.store.NativeFSLockFactory@236ab1ff; maxCacheMB=48.0 maxMergeSizeMB=4.0),segFN=segments_2,generation=2,filenames=[_0_MockRandom_0.tib, _0_Block_0.pos, _0_Block_0.tip, _0.fnm, _0_Pulsing40_0.tim, _0_Block_0.doc, _0_Block_0.tim, _0_MockRandom_0.prx, _0_nrm.cfs, _0_Pulsing40_0.prx, _0_Pulsing40_0.frq, _0_Lucene40WithOrds_0.tii, _0_MockRandom_0.frq, _0_MockRandom_0.sd, _0_Lucene40WithOrds_0.frq, _0_nrm.cfe, _0_Pulsing40_0.tip, _0_MockRandom_0.tii, segments_2, _0.fdx, _0_Lucene40WithOrds_0.prx, _0.si, _0_Lucene40WithOrds_0.tib, _0.fdt]
[junit4:junit4]   2> 12789 T2310 C148 P65421 oasc.SolrDeletionPolicy.updateCommits newest commit = 2
[junit4:junit4]   2> 12789 T2310 C148 P65421 oasu.DefaultSolrCoreState.newIndexWriter New IndexWriter is ready to be used.
[junit4:junit4]   2> 12793 T2310 C148 P65421 oass.SolrIndexSearcher.<init> Opening Searcher@28915cfe main
[junit4:junit4]   2> 12795 T2309 oasc.SolrCore.registerSearcher [collection1] Registered new searcher Searcher@28915cfe main{StandardDirectoryReader(segments_2:3:nrt _0(5.0):C1)}
[junit4:junit4]   2> 12796 T2309 oasc.CachingDirectoryFactory.close Closing directory:/usr/home/hudson/hudson-slave/workspace/Lucene-Solr-Tests-trunk-Java6/solr/build/solr-core/test/J0/./org.apache.solr.cloud.BasicDistributedZk2Test-1348060670324/jetty3/index
[junit4:junit4]   2> 12796 T2309 oash.SnapPuller$2.onClose removing old index directory ./org.apache.solr.cloud.BasicDistributedZk2Test-1348060670324/jetty3/index
[junit4:junit4]   2> 12798 T2310 C148 P65421 oasu.DirectUpdateHandler2.commit start commit{flags=0,_version_=0,optimize=false,openSearcher=false,waitSearcher=false,expungeDeletes=false,softCommit=false}
[junit4:junit4]   2> 12799 T2310 C148 P65421 oasu.DirectUpdateHandler2.commit end_commit_flush
[junit4:junit4]   2> 12805 T2310 C148 P65421 oasc.RecoveryStrategy.replay Replaying buffered documents. core=collection1
[junit4:junit4]   2> 12805 T2332 C148 P65421 oasu.UpdateLog$LogReplayer.doReplay WARNING Starting log replay tlog{file=./org.apache.solr.cloud.BasicDistributedZk2Test-1348060670324/jetty3/tlog/tlog.0000000000000000000 refcount=2} active=true starting pos=431
[junit4:junit4]   2> 12809 T2332 C148 P65421 oasu.DirectUpdateHandler2.commit start commit{flags=2,_version_=0,optimize=false,openSearcher=true,waitSearcher=true,expungeDeletes=false,softCommit=false}
[junit4:junit4]   2> 12811 T2332 C148 P65421 oass.SolrIndexSearcher.<init> Opening Searcher@2c6b5e6 main
[junit4:junit4]   2> 12812 T2332 C148 P65421 oasu.DirectUpdateHandler2.commit end_commit_flush
[junit4:junit4]   2> 12813 T2309 oasc.SolrCore.registerSearcher [collection1] Registered new searcher Searcher@2c6b5e6 main{StandardDirectoryReader(segments_2:3:nrt _0(5.0):C1)}
[junit4:junit4]   2> 12814 T2332 C148 P65421 oasu.UpdateLog$LogReplayer.run WARNING Log replay finished. recoveryInfo=RecoveryInfo{adds=0 deletes=0 deleteByQuery=0 errors=0 positionOfStart=431}
[junit4:junit4]   2> 12814 T2310 C148 P65421 oasc.RecoveryStrategy.doRecovery Replication Recovery was successful - registering as Active. core=collection1
[junit4:junit4]   2> 12816 T2310 C148 P65421 oasc.RecoveryStrategy.doRecovery Finished recovery process. core=collection1
[junit4:junit4]   2> 13122 T2271 oascc.ZkStateReader.updateClusterState Updating cloud state from ZooKeeper... 
[junit4:junit4]   2> 13137 T2284 oascc.ZkStateReader$2.process A cluster state change has occurred - updating...
[junit4:junit4]   2> 13137 T2270 oascc.ZkStateReader$2.process A cluster state change has occurred - updating...
[junit4:junit4]   2> 13137 T2329 oascc.ZkStateReader$2.process A cluster state change has occurred - updating...
[junit4:junit4]   2> 13137 T2327 oascc.ZkStateReader$2.process A cluster state change has occurred - updating...
[junit4:junit4]   2> 13137 T2296 oascc.ZkStateReader$2.process A cluster state change has occurred - updating...
[junit4:junit4]   2> 13137 T2322 oascc.ZkStateReader$2.process A cluster state change has occurred - updating...
[junit4:junit4]   2> 13137 T2308 oascc.ZkStateReader$2.process A cluster state change has occurred - updating...
[junit4:junit4]   2> 13589 T2250 oascc.ZkStateReader.updateClusterState Updating cloud state from ZooKeeper... 
[junit4:junit4]   2>  C150_STATE=coll:collection1 core:collection1 props:{shard=shard2, roles=null, state=recovering, core=collection1, collection=collection1, node_name=127.0.0.1:65430_solr, base_url=http://127.0.0.1:65430/solr}
[junit4:junit4]   2> 14424 T2324 C150 P65430 oasc.RecoveryStrategy.doRecovery Begin buffering updates. core=collection1
[junit4:junit4]   2> 14424 T2324 C150 P65430 oasu.UpdateLog.bufferUpdates Starting to buffer updates. FSUpdateLog{state=ACTIVE, tlog=null}
[junit4:junit4]   2> 14424 T2324 C150 P65430 oasc.RecoveryStrategy.replicate Attempting to replicate from http://127.0.0.1:65416/solr/collection1/. core=collection1
[junit4:junit4]   2> 14424 T2324 C150 P65430 oascsi.HttpClientUtil.createClient Creating new http client, config:maxConnections=128&maxConnectionsPerHost=32&followRedirects=false
[junit4:junit4]   2> 14439 T2290 C151 P65416 oasu.DirectUpdateHandler2.commit start commit{flags=0,_version_=0,optimize=false,openSearcher=true,waitSearcher=true,expungeDeletes=false,softCommit=false}
[junit4:junit4]   2> 14443 T2290 C151 P65416 oasc.SolrDeletionPolicy.onInit SolrDeletionPolicy.onInit: commits:num=1
[junit4:junit4]   2> 		commit{dir=NRTCachingDirectory(org.apache.lucene.store.NIOFSDirectory@/usr/home/hudson/hudson-slave/workspace/Lucene-Solr-Tests-trunk-Java6/solr/build/solr-core/test/J0/org.apache.solr.cloud.BasicDistributedZk2Test-1348060670324/jetty2/index lockFactory=org.apache.lucene.store.NativeFSLockFactory@17b7ca8f; maxCacheMB=48.0 maxMergeSizeMB=4.0),segFN=segments_1,generation=1,filenames=[segments_1]
[junit4:junit4]   2> 14444 T2290 C151 P65416 oasc.SolrDeletionPolicy.updateCommits newest commit = 1
[junit4:junit4]   2> 14445 T2290 C151 P65416 oass.SolrIndexSearcher.<init> Opening Searcher@22e7d73 main
[junit4:junit4]   2> 14446 T2290 C151 P65416 oasu.DirectUpdateHandler2.commit end_commit_flush
[junit4:junit4]   2> 14448 T2297 oasc.SolrCore.registerSearcher [collection1] Registered new searcher Searcher@22e7d73 main{StandardDirectoryReader(segments_1:1)}
[junit4:junit4]   2> 14448 T2290 C151 P65416 /update {waitSearcher=true&commit=true&commit_end_point=true&wt=javabin&softCommit=false&version=2} {commit=} 0 9
[junit4:junit4]   2> 14449 T2324 C150 P65430 oash.ReplicationHandler.inform Commits will be reserved for  10000
[junit4:junit4]   2> 14449 T2324 C150 P65430 oash.SnapPuller.<init>  No value set for 'pollInterval'. Timer Task not started.
[junit4:junit4]   2> 14451 T2291 C151 P65416 oash.ReplicationHandler.inform Commits will be reserved for  10000
[junit4:junit4]   2> 14451 T2291 C151 P65416 REQ /replication {command=indexversion&wt=javabin&qt=/replication&version=2} status=0 QTime=1 
[junit4:junit4]   2> 14455 T2324 C150 P65430 oasc.SolrDeletionPolicy.onInit SolrDeletionPolicy.onInit: commits:num=1
[junit4:junit4]   2> 		commit{dir=NRTCachingDirectory(org.apache.lucene.store.NIOFSDirectory@/usr/home/hudson/hudson-slave/workspace/Lucene-Solr-Tests-trunk-Java6/solr/build/solr-core/test/J0/org.apache.solr.cloud.BasicDistributedZk2Test-1348060670324/jetty4/index lockFactory=org.apache.lucene.store.NativeFSLockFactory@16dc40fe; maxCacheMB=48.0 maxMergeSizeMB=4.0),segFN=segments_1,generation=1,filenames=[segments_1]
[junit4:junit4]   2> 14456 T2324 C150 P65430 oasc.SolrDeletionPolicy.updateCommits newest commit = 1
[junit4:junit4]   2> 14456 T2324 C150 P65430 oasu.DirectUpdateHandler2.commit start commit{flags=0,_version_=0,optimize=false,openSearcher=true,waitSearcher=true,expungeDeletes=false,softCommit=false}
[junit4:junit4]   2> 14486 T2324 C150 P65430 oasc.SolrDeletionPolicy.onCommit SolrDeletionPolicy.onCommit: commits:num=2
[junit4:junit4]   2> 		commit{dir=NRTCachingDirectory(org.apache.lucene.store.NIOFSDirectory@/usr/home/hudson/hudson-slave/workspace/Lucene-Solr-Tests-trunk-Java6/solr/build/solr-core/test/J0/org.apache.solr.cloud.BasicDistributedZk2Test-1348060670324/jetty4/index lockFactory=org.apache.lucene.store.NativeFSLockFactory@16dc40fe; maxCacheMB=48.0 maxMergeSizeMB=4.0),segFN=segments_1,generation=1,filenames=[segments_1]
[junit4:junit4]   2> 		commit{dir=NRTCachingDirectory(org.apache.lucene.store.NIOFSDirectory@/usr/home/hudson/hudson-slave/workspace/Lucene-Solr-Tests-trunk-Java6/solr/build/solr-core/test/J0/org.apache.solr.cloud.BasicDistributedZk2Test-1348060670324/jetty4/index lockFactory=org.apache.lucene.store.NativeFSLockFactory@16dc40fe; maxCacheMB=48.0 maxMergeSizeMB=4.0),segFN=segments_2,generation=2,filenames=[segments_2]
[junit4:junit4]   2> 14486 T2324 C150 P65430 oasc.SolrDeletionPolicy.updateCommits newest commit = 2
[junit4:junit4]   2> 14489 T2324 C150 P65430 oass.SolrIndexSearcher.<init> Opening Searcher@50523931 main
[junit4:junit4]   2> 14490 T2324 C150 P65430 oasu.DirectUpdateHandler2.commit end_commit_flush
[junit4:junit4]   2> 14491 T2323 oasc.SolrCore.registerSearcher [collection1] Registered new searcher Searcher@50523931 main{StandardDirectoryReader(segments_2:2)}
[junit4:junit4]   2> 14492 T2324 C150 P65430 oasc.RecoveryStrategy.replay No replay needed. core=collection1
[junit4:junit4]   2> 14492 T2324 C150 P65430 oasc.RecoveryStrategy.doRecovery Replication Recovery was successful - registering as Active. core=collection1
[junit4:junit4]   2> 14493 T2324 C150 P65430 oasc.RecoveryStrategy.doRecovery Finished recovery process. core=collection1
[junit4:junit4]   2> 14591 T2250 oascc.ZkStateReader.updateClusterState Updating cloud state from ZooKeeper... 
[junit4:junit4]   2> 14642 T2271 oascc.ZkStateReader.updateClusterState Updating cloud state from ZooKeeper... 
[junit4:junit4]   2> 14656 T2296 oascc.ZkStateReader$2.process A cluster state change has occurred - updating...
[junit4:junit4]   2> 14656 T2308 oascc.ZkStateReader$2.process A cluster state change has occurred - updating...
[junit4:junit4]   2> 14656 T2284 oascc.ZkStateReader$2.process A cluster state change has occurred - updating...
[junit4:junit4]   2> 14656 T2322 oascc.ZkStateReader$2.process A cluster state change has occurred - updating...
[junit4:junit4]   2> 14656 T2327 oascc.ZkStateReader$2.process A cluster state change has occurred - updating...
[junit4:junit4]   2> 14656 T2329 oascc.ZkStateReader$2.process A cluster state change has occurred - updating...
[junit4:junit4]   2> 14656 T2270 oascc.ZkStateReader$2.process A cluster state change has occurred - updating...
[junit4:junit4]   2> 15593 T2250 oascc.ZkStateReader.updateClusterState Updating cloud state from ZooKeeper... 
[junit4:junit4]   2> 15596 T2262 C152 P65397 oasu.DirectUpdateHandler2.commit start commit{flags=0,_version_=0,optimize=false,openSearcher=true,waitSearcher=true,expungeDeletes=false,softCommit=false}
[junit4:junit4]   2> 15644 T2262 C152 P65397 oasc.SolrDeletionPolicy.onCommit SolrDeletionPolicy.onCommit: commits:num=2
[junit4:junit4]   2> 		commit{dir=NRTCachingDirectory(org.apache.lucene.store.NIOFSDirectory@/usr/home/hudson/hudson-slave/workspace/Lucene-Solr-Tests-trunk-Java6/solr/build/solr-core/test/J0/org.apache.solr.cloud.BasicDistributedZk2Test-1348060670324/control/data/index lockFactory=org.apache.lucene.store.NativeFSLockFactory@798ded3f; maxCacheMB=48.0 maxMergeSizeMB=4.0),segFN=segments_1,generation=1,filenames=[segments_1]
[junit4:junit4]   2> 		commit{dir=NRTCachingDirectory(org.apache.lucene.store.NIOFSDirectory@/usr/home/hudson/hudson-slave/workspace/Lucene-Solr-Tests-trunk-Java6/solr/build/solr-core/test/J0/org.apache.solr.cloud.BasicDistributedZk2Test-1348060670324/control/data/index lockFactory=org.apache.lucene.store.NativeFSLockFactory@798ded3f; maxCacheMB=48.0 maxMergeSizeMB=4.0),segFN=segments_2,generation=2,filenames=[_0_MockRandom_0.tib, _0_Block_0.pos, _0_Block_0.tip, _0.fnm, _0_Pulsing40_0.tim, _0_Block_0.doc, _0_Block_0.tim, _0_MockRandom_0.prx, _0_nrm.cfs, _0_Pulsing40_0.prx, _0_Pulsing40_0.frq, _0_MockRandom_0.frq, _0_MockRandom_0.sd, _0_Lucene40WithOrds_0.tii, _0_Lucene40WithOrds_0.frq, _0_nrm.cfe, _0_MockRandom_0.tii, _0_Pulsing40_0.tip, segments_2, _0.fdx, _0_Lucene40WithOrds_0.prx, _0.si, _0_Lucene40WithOrds_0.tib, _0.fdt]
[junit4:junit4]   2> 15645 T2262 C152 P65397 oasc.SolrDeletionPolicy.updateCommits newest commit = 2
[junit4:junit4]   2> 15661 T2262 C152 P65397 oass.SolrIndexSearcher.<init> Opening Searcher@27bdf5e8 main
[junit4:junit4]   2> 15661 T2262 C152 P65397 oasu.DirectUpdateHandler2.commit end_commit_flush
[junit4:junit4]   2> 15663 T2273 oasc.SolrCore.registerSearcher [collection1] Registered new searcher Searcher@27bdf5e8 main{StandardDirectoryReader(segments_2:3 _0(5.0):C1)}
[junit4:junit4]   2> 15663 T2262 C152 P65397 /update {waitSearcher=true&wt=javabin&commit=true&softCommit=false&version=2} {commit=} 0 67
[junit4:junit4]   2> 15666 T2278 C149 P65410 oasu.DirectUpdateHandler2.commit start commit{flags=0,_version_=0,optimize=false,openSearcher=true,waitSearcher=true,expungeDeletes=false,softCommit=false}
[junit4:junit4]   2> 15677 T2278 C149 P65410 oass.SolrIndexSearcher.<init> Opening Searcher@7bf35bdf main
[junit4:junit4]   2> 15677 T2278 C149 P65410 oasu.DirectUpdateHandler2.commit end_commit_flush
[junit4:junit4]   2> 15679 T2285 oasc.SolrCore.registerSearcher [collection1] Registered new searcher Searcher@7bf35bdf main{StandardDirectoryReader(segments_2:3 _0(5.0):C1)}
[junit4:junit4]   2> 15679 T2278 C149 P65410 oasu.SolrCmdDistributor.distribCommit Distrib commit to:[StdNode: http://127.0.0.1:65421/solr/collection1/, StdNode: http://127.0.0.1:65416/solr/collection1/, StdNode: http://127.0.0.1:65430/solr/collection1/]
[junit4:junit4]   2> 15681 T2292 C151 P65416 oasu.DirectUpdateHandler2.commit start commit{flags=0,_version_=0,optimize=false,openSearcher=true,waitSearcher=true,expungeDeletes=false,softCommit=false}
[junit4:junit4]   2>  C148_STATE=coll:collection1 core:collection1 props:{shard=shard1, roles=null, state=active, core=collection1, collection=collection1, node_name=127.0.0.1:65421_solr, base_url=http://127.0.0.1:65421/solr}
[junit4:junit4]   2> 15683 T2300 C148 P65421 oasu.DirectUpdateHandler2.commit start commit{flags=0,_version_=0,optimize=false,openSearcher=true,waitSearcher=true,expungeDeletes=false,softCommit=false}
[junit4:junit4]   2> 15685 T2300 C148 P65421 oass.SolrIndexSearcher.<init> Opening Searcher@736eb109 main
[junit4:junit4]   2> 15685 T2292 C151 P65416 oass.SolrIndexSearcher.<init> Opening Searcher@5c05bbd1 main
[junit4:junit4]   2> 15686 T2292 C151 P65416 oasu.DirectUpdateHandler2.commit end_commit_flush
[junit4:junit4]   2> 15686 T2300 C148 P65421 oasu.DirectUpdateHandler2.commit end_commit_flush
[junit4:junit4]   2> 15687 T2297 oasc.JmxMonitoredMap.put WARNING Failed to register info bean: searcher javax.management.InstanceNotFoundException: solr/collection1:type=searcher,id=org.apache.solr.search.SolrIndexSearcher
[junit4:junit4]   2> 	at com.sun.jmx.interceptor.DefaultMBeanServerInterceptor.getMBean(DefaultMBeanServerInterceptor.java:1118)
[junit4:junit4]   2> 	at com.sun.jmx.interceptor.DefaultMBeanServerInterceptor.exclusiveUnregisterMBean(DefaultMBeanServerInterceptor.java:433)
[junit4:junit4]   2> 	at com.sun.jmx.interceptor.DefaultMBeanServerInterceptor.unregisterMBean(DefaultMBeanServerInterceptor.java:421)
[junit4:junit4]   2> 	at com.sun.jmx.mbeanserver.JmxMBeanServer.unregisterMBean(JmxMBeanServer.java:540)
[junit4:junit4]   2> 	at org.apache.solr.core.JmxMonitoredMap.put(JmxMonitoredMap.java:138)
[junit4:junit4]   2> 	at org.apache.solr.core.JmxMonitoredMap.put(JmxMonitoredMap.java:51)
[junit4:junit4]   2> 	at org.apache.solr.search.SolrIndexSearcher.register(SolrIndexSearcher.java:242)
[junit4:junit4]   2> 	at org.apache.solr.core.SolrCore.registerSearcher(SolrCore.java:1642)
[junit4:junit4]   2> 	at org.apache.solr.core.SolrCore.access$000(SolrCore.java:121)
[junit4:junit4]   2> 	at org.apache.solr.core.SolrCore$7.call(SolrCore.java:1519)
[junit4:junit4]   2> 	at java.util.concurrent.FutureTask$Sync.innerRun(FutureTask.java:334)
[junit4:junit4]   2> 	at java.util.concurrent.FutureTask.run(FutureTask.java:166)
[junit4:junit4]   2> 	at java.util.concurrent.ThreadPoolExecutor.runWorker(ThreadPoolExecutor.java:1110)
[junit4:junit4]   2> 	at java.util.concurrent.ThreadPoolExecutor$Worker.run(ThreadPoolExecutor.java:603)
[junit4:junit4]   2> 	at java.lang.Thread.run(Thread.java:679)
[junit4:junit4]   2> 
[junit4:junit4]   2> 15688 T2309 oasc.SolrCore.registerSearcher [collection1] Registered new searcher Searcher@736eb109 main{StandardDirectoryReader(segments_2:3:nrt _0(5.0):C1)}
[junit4:junit4]   2> 15689 T2300 C148 P65421 /update {waitSearcher=true&commit=true&wt=javabin&commit_end_point=true&expungeDeletes=false&softCommit=false&version=2} {commit=} 0 6
[junit4:junit4]   2> 15689 T2297 oasc.SolrCore.registerSearcher [collection1] Registered new searcher Searcher@5c05bbd1 main{StandardDirectoryReader(segments_1:1)}
[junit4:junit4]   2> 15690 T2292 C151 P65416 /update {waitSearcher=true&commit=true&wt=javabin&commit_end_point=true&expungeDeletes=false&softCommit=false&version=2} {commit=} 0 9
[junit4:junit4]   2>  C150_STATE=coll:collection1 core:collection1 props:{shard=shard2, roles=null, state=active, core=collection1, collection=collection1, node_name=127.0.0.1:65430_solr, base_url=http://127.0.0.1:65430/solr}
[junit4:junit4]   2> 15692 T2314 C150 P65430 oasu.DirectUpdateHandler2.commit start commit{flags=0,_version_=0,optimize=false,openSearcher=true,waitSearcher=true,expungeDeletes=false,softCommit=false}
[junit4:junit4]   2> 15696 T2314 C150 P65430 oass.SolrIndexSearcher.<init> Opening Searcher@1d76e3ec main
[junit4:junit4]   2> 15697 T2314 C150 P65430 oasu.DirectUpdateHandler2.commit end_commit_flush
[junit4:junit4]   2> 15698 T2323 oasc.SolrCore.registerSearcher [collection1] Registered new searcher Searcher@1d76e3ec main{StandardDirectoryReader(segments_2:2)}
[junit4:junit4]   2> 15699 T2314 C150 P65430 /update {waitSearcher=true&commit=true&wt=javabin&commit_end_point=true&expungeDeletes=false&softCommit=false&version=2} {commit=} 0 7
[junit4:junit4]   2> 15699 T2278 C149 P65410 /update {waitSearcher=true&wt=javabin&commit=true&softCommit=false&version=2} {commit=} 0 33
[junit4:junit4]   2> 15705 T2263 C152 P65397 REQ /select {fl=id,score&shard.url=127.0.0.1:65397/solr/collection1/&NOW=1348060686023&start=0&q=*:*&distrib=false&isShard=true&wt=javabin&fsv=true&rows=10&version=2} hits=1 status=0 QTime=0 
[junit4:junit4]   2> 15709 T2263 C152 P65397 REQ /select {shard.url=127.0.0.1:65397/solr/collection1/&NOW=1348060686023&q=*:*&ids=1&distrib=false&isShard=true&wt=javabin&version=2} status=0 QTime=0 
[junit4:junit4]   2> 15711 T2262 C152 P65397 REQ /select {wt=javabin&q=*:*&version=2} hits=1 status=0 QTime=9 
[junit4:junit4]   2> 15711 T2250 oaz.ZooKeeper.<init> Initiating client connection, connectString=127.0.0.1:65394/solr sessionTimeout=10000 watcher=org.apache.solr.common.cloud.ConnectionManager@63802aef
[junit4:junit4]   2> 15712 T2336 oaz.ClientCnxn$SendThread.startConnect Opening socket connection to server /127.0.0.1:65394
[junit4:junit4]   2> 15712 T2250 oascc.ConnectionManager.waitForConnected Waiting for client to connect to ZooKeeper
[junit4:junit4]   2> 15713 T2336 oaz.ClientCnxn$SendThread.primeConnection Socket connection established to localhost/127.0.0.1:65394, initiating session
[junit4:junit4]   2> 15713 T2252 oazs.NIOServerCnxn$Factory.run Accepted socket connection from /140.211.11.196:65457
[junit4:junit4]   2> 15714 T2252 oazs.NIOServerCnxn.readConnectRequest Client attempting to establish new session at /140.211.11.196:65457
[junit4:junit4]   2> 15715 T2254 oazs.NIOServerCnxn.finishSessionInit Established session 0x139dead69790009 with negotiated timeout 10000 for client /140.211.11.196:65457
[junit4:junit4]   2> 15715 T2336 oaz.ClientCnxn$SendThread.readConnectResult Session establishment complete on server localhost/127.0.0.1:65394, sessionid = 0x139dead69790009, negotiated timeout = 10000
[junit4:junit4]   2> 15716 T2337 oascc.ConnectionManager.process Watcher org.apache.solr.common.cloud.ConnectionManager@63802aef name:ZooKeeperConnection Watcher:127.0.0.1:65394/solr got event WatchedEvent state:SyncConnected type:None path:null path:null type:None
[junit4:junit4]   2> 15716 T2250 oascc.ConnectionManager.waitForConnected Client is connected to ZooKeeper
[junit4:junit4]   2> 15717 T2250 oascc.ZkStateReader.createClusterStateWatchersAndUpdate Updating cluster state from ZooKeeper... 
[junit4:junit4]   2> 15718 T2255 oazs.PrepRequestProcessor.pRequest Processed session termination for sessionid: 0x139dead69790009
[junit4:junit4]   2> 15729 T2337 oaz.ClientCnxn$EventThread.run EventThread shut down
[junit4:junit4]   2> 15729 T2252 oazs.NIOServerCnxn.closeSock Closed socket connection for client /140.211.11.196:65457 which had sessionid 0x139dead69790009
[junit4:junit4]   2> 15729 T2250 oaz.ZooKeeper.close Session: 0x139dead69790009 closed
[junit4:junit4]   2> 15731 T2281 C149 P65410 REQ /select {distrib=false&wt=javabin&q=*:*&version=2} hits=1 status=0 QTime=0 
[junit4:junit4]   2> 15733 T2293 C151 P65416 REQ /select {distrib=false&wt=javabin&q=*:*&version=2} hits=0 status=0 QTime=0 
[junit4:junit4]   2> 15738 T2301 C148 P65421 REQ /select {fl=id,score&shard.url=127.0.0.1:65410/solr/collection1/|127.0.0.1:65421/solr/collection1/&NOW=1348060686056&start=0&q=*:*&distrib=false&isShard=true&wt=javabin&fsv=true&rows=10&version=2} hits=1 status=0 QTime=0 
[junit4:junit4]   2> 15738 T2316 C150 P65430 REQ /select {fl=id,score&shard.url=127.0.0.1:65416/solr/collection1/|127.0.0.1:65430/solr/collection1/&NOW=1348060686056&start=0&q=*:*&distrib=false&isShard=true&wt=javabin&fsv=true&rows=10&version=2} hits=0 status=0 QTime=0 
[junit4:junit4]   2> 15741 T2301 C148 P65421 REQ /select {shard.url=127.0.0.1:65410/solr/collection1/|127.0.0.1:65421/solr/collection1/&NOW=1348060686056&q=*:*&ids=1&distrib=false&isShard=true&wt=javabin&version=2} status=0 QTime=0 
[junit4:junit4]   2> 15742 T2315 C150 P65430 REQ /select {wt=javabin&q=*:*&version=2} hits=1 status=0 QTime=7 
[junit4:junit4]   2> 15748 T2262 C152 P65397 /update {wt=javabin&version=2} {add=[2 (1413544081952342016)]} 0 3
[junit4:junit4]   2> 15767 T2314 C150 P65430 REQ /update {distrib.from=http://127.0.0.1:65416/solr/collection1/&update.distrib=FROMLEADER&wt=javabin&version=2} status=0 QTime=4 
[junit4:junit4]   2> 15769 T2294 C151 P65416 /update {wt=javabin&version=2} {add=[2 (1413544081964924928)]} 0 13
[junit4:junit4]   2> 15774 T2262 C152 P65397 /update {wt=javabin&version=2} {add=[3 (1413544081981702144)]} 0 2
[junit4:junit4]   2> 15782 T2314 C150 P65430 REQ /update {distrib.from=http://127.0.0.1:65416/solr/collection1/&update.distrib=FROMLEADER&wt=javabin&version=2} status=0 QTime=2 
[junit4:junit4]   2> 15783 T2294 C151 P65416 /update {wt=javabin&version=2} {add=[3 (1413544081984847872)]} 0 7
[junit4:junit4]   2> 15786 T2262 C152 P65397 /update {wt=javabin&version=2} {add=[4 (1413544081994285056)]} 0 1
[junit4:junit4]   2> 15800 T2300 C148 P65421 REQ /update {distrib.from=http://127.0.0.1:65410/solr/collection1/&update.distrib=FROMLEADER&wt=javabin&version=2} status=0 QTime=6 
[junit4:junit4]   2> 15800 T2278 C149 P65410 /update {wt=javabin&version=2} {add=[4 (1413544081998479360)]} 0 11
[junit4:junit4]   2> 15804 T2262 C152 P65397 /update {wt=javabin&version=2} {add=[5 (1413544082013159424)]} 0 1
[junit4:junit4]   2> 15811 T2314 C150 P65430 REQ /update {distrib.from=http://127.0.0.1:65416/solr/collection1/&update.distrib=FROMLEADER&wt=javabin&version=2} status=0 QTime=1 
[junit4:junit4]   2> 15812 T2294 C151 P65416 /update {wt=javabin&version=2} {add=[5 (1413544082017353728)]} 0 5
[junit4:junit4]   2> 15816 T2262 C152 P65397 /update {wt=javabin&version=2} {add=[6 (1413544082025742336)]} 0 1
[junit4:junit4]   2> 15825 T2314 C150 P65430 REQ /update {update.distrib=FROMLEADER&distrib.from=http://127.0.0.1:65416/solr/collection1/&wt=javabin&version=2} status=0 QTime=1 
[junit4:junit4]   2> 15826 T2292 C151 P65416 REQ /update {distrib.from=http://127.0.0.1:65410/solr/collection1/&update.distrib=TOLEADER&wt=javabin&version=2} status=0 QTime=6 
[junit4:junit4]   2> 15827 T2278 C149 P65410 /update {wt=javabin&version=2} {add=[6]} 0 8
[junit4:junit4]   2> 15831 T2262 C152 P65397 /update {wt=javabin&version=2} {add=[7 (1413544082041470976)]} 0 1
[junit4:junit4]   2> 15841 T2314 C150 P65430 REQ /update {update.distrib=FROMLEADER&distrib.from=http://127.0.0.1:65416/solr/collection1/&wt=javabin&version=2} status=0 QTime=1 
[junit4:junit4]   2> 15842 T2292 C151 P65416 REQ /update {distrib.from=http://127.0.0.1:65410/solr/collection1/&update.distrib=TOLEADER&wt=javabin&version=2} status=0 QTime=5 
[junit4:junit4]   2> 15843 T2278 C149 P65410 /update {wt=javabin&version=2} {add=[7]} 0 9
[junit4:junit4]   2> 15846 T2262 C152 P65397 /update {wt=javabin&version=2} {add=[8 (1413544082057199616)]} 0 1
[junit4:junit4]   2> 15854 T2300 C148 P65421 REQ /update {distrib.from=http://127.0.0.1:65410/solr/collection1/&update.distrib=FROMLEADER&wt=javabin&version=2} status=0 QTime=1 
[junit4:junit4]   2> 15855 T2278 C149 P65410 /update {wt=javabin&version=2} {add=[8 (1413544082061393920)]} 0 6
[junit4:junit4]   2> 15859 T2262 C152 P65397 /update {wt=javabin&version=2} {add=[9 (1413544082070831104)]} 0 1
[junit4:junit4]   2> 15867 T2314 C150 P65430 REQ /update {distrib.from=http://127.0.0.1:65416/solr/collection1/&update.distrib=FROMLEADER&wt=javabin&version=2} status=0 QTime=1 
[junit4:junit4]   2> 15868 T2294 C151 P65416 /update {wt=javabin&version=2} {add=[9 (1413544082076073984)]} 0 6
[junit4:junit4]   2> 15872 T2262 C152 P65397 /update {wt=javabin&version=2} {add=[10 (1413544082084462592)]} 0 1
[junit4:junit4]   2> 15881 T2300 C148 P65421 REQ /update {update.distrib=FROMLEADER&distrib.from=http://127.0.0.1:65410/solr/collection1/&wt=javabin&version=2} status=0 QTime=1 
[junit4:junit4]   2> 15882 T2282 C149 P65410 REQ /update {distrib.from=http://127.0.0.1:65416/solr/collection1/&update.distrib=TOLEADER&wt=javabin&version=2} status=0 QTime=5 
[junit4:junit4]   2> 15883 T2294 C151 P65416 /update {wt=javabin&version=2} {add=[10]} 0 8
[junit4:junit4]   2> 15905 T2262 C152 P65397 /update {wt=javabin&version=2} {add=[11 (1413544082100191232)]} 0 19
[junit4:junit4]   2> 15913 T2300 C148 P65421 REQ /update {distrib.from=http://127.0.0.1:65410/solr/collection1/&update.distrib=FROMLEADER&wt=javabin&version=2} status=0 QTime=1 
[junit4:junit4]   2> 15914 T2278 C149 P65410 /update {wt=javabin&version=2} {add=[11 (1413544082123259904)]} 0 6
[junit4:junit4]   2> 15919 T2262 C152 P65397 /update {wt=javabin&version=2} {add=[12 (1413544082132697088)]} 0 2
[junit4:junit4]   2> 15929 T2300 C148 P65421 REQ /update {update.distrib=FROMLEADER&distrib.from=http://127.0.0.1:65410/solr/collection1/&wt=javabin&version=2} status=0 QTime=1 
[junit4:junit4]   2> 15930 T2282 C149 P65410 REQ /update {distrib.from=http://127.0.0.1:65416/solr/collection1/&update.distrib=TOLEADER&wt=javabin&version=2} status=0 QTime=5 
[junit4:junit4]   2> 15931 T2294 C151 P65416 /update {wt=javabin&version=2} {add=[12]} 0 9
[junit4:junit4]   2> 15935 T2262 C152 P65397 /update {wt=javabin&version=2} {add=[13 (1413544082150522880)]} 0 1
[junit4:junit4]   2> 15946 T2300 C148 P65421 REQ /update {update.distrib=FROMLEADER&distrib.from=http://127.0.0.1:65410/solr/collection1/&wt=javabin&version=2} status=0 QTime=1 
[junit4:junit4]   2> 15947 T2282 C149 P65410 REQ /update {distrib.from=http://127.0.0.1:65416/solr/collection1/&update.distrib=TOLEADER&wt=javabin&version=2} status=0 QTime=6 
[junit4:junit4]   2> 15948 T2294 C151 P65416 /update {wt=javabin&version=2} {add=[13]} 0 10
[junit4:junit4]   2> 15952 T2262 C152 P65397 /update {wt=javabin&version=2} {add=[14 (1413544082168348672)]} 0 1
[junit4:junit4]   2> 15962 T2300 C148 P65421 REQ /update {update.distrib=FROMLEADER&distrib.from=http://127.0.0.1:65410/solr/collection1/&wt=javabin&version=2} status=0 QTime=1 
[junit4:junit4]   2> 15963 T2282 C149 P65410 REQ /update {distrib.from=http://127.0.0.1:65416/solr/collection1/&update.distrib=TOLEADER&wt=javabin&version=2} status=0 QTime=5 
[junit4:junit4]   2> 15963 T2294 C151 P65416 /update {wt=javabin&version=2} {add=[14]} 0 8
[junit4:junit4]   2> 15967 T2262 C152 P65397 /update {wt=javabin&version=2} {add=[15 (1413544082184077312)]} 0 1
[junit4:junit4]   2> 15978 T2300 C148 P65421 REQ /update {update.distrib=FROMLEADER&distrib.from=http://127.0.0.1:65410/solr/collection1/&wt=javabin&version=2} status=0 QTime=1 
[junit4:junit4]   2> 15979 T2282 C149 P65410 REQ /update {distrib.from=http://127.0.0.1:65416/solr/collection1/&update.distrib=TOLEADER&wt=javabin&version=2} status=0 QTime=6 
[junit4:junit4]   2> 15980 T2294 C151 P65416 /update {wt=javabin&version=2} {add=[15]} 0 10
[junit4:junit4]   2> 15983 T2262 C152 P65397 /update {wt=javabin&version=2} {add=[16 (1413544082200854528)]} 0 1
[junit4:junit4]   2> 15994 T2300 C148 P65421 REQ /update {update.distrib=FROMLEADER&distrib.from=http://127.0.0.1:65410/solr/collection1/&wt=javabin&version=2} status=0 QTime=1 
[junit4:junit4]   2> 15995 T2282 C149 P65410 REQ /update {distrib.from=http://127.0.0.1:65416/solr/collection1/&update.distrib=TOLEADER&wt=javabin&version=2} status=0 QTime=6 
[junit4:junit4]   2> 15996 T2294 C151 P65416 /update {wt=javabin&version=2} {add=[16]} 0 10
[junit4:junit4]   2> 16001 T2262 C152 P65397 /update {wt=javabin&version=2} {add=[17 (1413544082218680320)]} 0 3
[junit4:junit4]   2> 16019 T2314 C150 P65430 REQ /update {update.distrib=FROMLEADER&distrib.from=http://127.0.0.1:65416/solr/collection1/&wt=javabin&version=2} status=0 QTime=5 
[junit4:junit4]   2> 16019 T2292 C151 P65416 REQ /update {distrib.from=http://127.0.0.1:65410/solr/collection1/&update.distrib=TOLEADER&wt=javabin&version=2} status=0 QTime=12 
[junit4:junit4]   2> 16020 T2278 C149 P65410 /update {wt=javabin&version=2} {add=[17]} 0 16
[junit4:junit4]   2> 16024 T2262 C152 P65397 /update {wt=javabin&version=2} {add=[100 (1413544082243846144)]} 0 1
[junit4:junit4]   2> 16064 T2300 C148 P65421 REQ /update {update.distrib=FROMLEADER&distrib.from=http://127.0.0.1:65410/solr/collection1/&wt=javabin&version=2} status=0 QTime=14 
[junit4:junit4]   2> 16065 T2282 C149 P65410 REQ /update {distrib.from=http://127.0.0.1:65416/solr/collection1/&update.distrib=TOLEADER&wt=javabin&version=2} status=0 QTime=35 
[junit4:junit4]   2> 16066 T2294 C151 P65416 /update {wt=javabin&version=2} {add=[100]} 0 39
[junit4:junit4]   2> 16071 T2262 C152 P65397 /update {wt=javabin&version=2} {add=[101 (1413544082293129216)]} 0 2
[junit4:junit4]   2> 16079 T2300 C148 P65421 REQ /update {distrib.from=http://127.0.0.1:65410/solr/collection1/&update.distrib=FROMLEADER&wt=javabin&version=2} status=0 QTime=2 
[junit4:junit4]   2> 16080 T2278 C149 P65410 /update {wt=javabin&version=2} {add=[101 (1413544082296274944)]} 0 7
[junit4:junit4]   2> 16084 T2262 C152 P65397 /update {wt=javabin&version=2} {add=[102 (1413544082306760704)]} 0 1
[junit4:junit4]   2> 16094 T2300 C148 P65421 REQ /update {update.distrib=FROMLEADER&distrib.from=http://127.0.0.1:65410/solr/collection1/&wt=javabin&version=2} status=0 QTime=1 
[junit4:junit4]   2> 16095 T2282 C149 P65410 REQ /update {distrib.from=http://127.0.0.1:65416/solr/collection1/&update.distrib=TOLEADER&wt=javabin&version=2} status=0 QTime=6 
[junit4:junit4]   2> 16095 T2294 C151 P65416 /update {wt=javabin&version=2} {add=[102]} 0 8
[junit4:junit4]   2> 16111 T2262 C152 P65397 /update {wt=javabin&version=2} {add=[103 (1413544082322489344)]} 0 13
[junit4:junit4]   2> 16118 T2314 C150 P65430 REQ /update {distrib.from=http://127.0.0.1:65416/solr/collection1/&update.distrib=FROMLEADER&wt=javabin&version=2} status=0 QTime=2 
[junit4:junit4]   2> 16119 T2294 C151 P65416 /update {wt=javabin&version=2} {add=[103 (1413544082338217984)]} 0 6
[junit4:junit4]   2> 16124 T2262 C152 P65397 /update {wt=javabin&version=2} {add=[104 (1413544082347655168)]} 0 2
[junit4:junit4]   2> 16135 T2314 C150 P65430 REQ /update {update.distrib=FROMLEADER&distrib.from=http://127.0.0.1:65416/solr/collection1/&wt=javabin&version=2} status=0 QTime=1 
[junit4:junit4]   2> 16136 T2292 C151 P65416 REQ /update {distrib.from=http://127.0.0.1:65410/solr/collection1/&update.distrib=TOLEADER&wt=javabin&version=2} status=0 QTime=6 
[junit4:junit4]   2> 16137 T2278 C149 P65410 /update {wt=javabin&version=2} {add=[104]} 0 10
[junit4:junit4]   2> 16143 T2262 C152 P65397 /update {wt=javabin&version=2} {add=[105 (1413544082368626688)]} 0 2
[junit4:junit4]   2> 16173 T2314 C150 P65430 REQ /update {distrib.from=http://127.0.0.1:65416/solr/collection1/&update.distrib=FROMLEADER&wt=javabin&version=2} status=0 QTime=13 
[junit4:junit4]   2> 16174 T2294 C151 P65416 /update {wt=javabin&version=2} {add=[105 (1413544082371772416)]} 0 29
[junit4:junit4]   2> 16178 T2262 C152 P65397 /update {wt=javabin&version=2} {add=[106 (1413544082405326848)]} 0 1
[junit4:junit4]   2> 16188 T2314 C150 P65430 REQ /update {distrib.from=http://127.0.0.1:65416/solr/collection1/&update.distrib=FROMLEADER&wt=javabin&version=2} status=0 QTime=2 
[junit4:junit4]   2> 16189 T2294 C151 P65416 /update {wt=javabin&version=2} {add=[106 (1413544082409521152)]} 0 8
[junit4:junit4]   2> 16193 T2262 C152 P65397 /update {wt=javabin&version=2} {add=[107 (1413544082421055488)]} 0 1
[junit4:junit4]   2> 16200 T2300 C148 P65421 REQ /update {distrib.from=http://127.0.0.1:65410/solr/collection1/&update.distrib=FROMLEADER&wt=javabin&version=2} status=0 QTime=1 
[junit4:junit4]   2> 16201 T2278 C149 P65410 /update {wt=javabin&version=2} {add=[107 (1413544082425249792)]} 0 5
[junit4:junit4]   2> 16205 T2262 C152 P65397 /update {wt=javabin&version=2} {add=[108 (1413544082433638400)]} 0 1
[junit4:junit4]   2> 16212 T2300 C148 P65421 REQ /update {distrib.from=http://127.0.0.1:65410/solr/collection1/&update.distrib=FROMLEADER&wt=javabin&version=2} status=0 QTime=1 
[junit4:junit4]   2> 16213 T2278 C149 P65410 /update {wt=javabin&version=2} {add=[108 (1413544082437832704)]} 0 5
[junit4:junit4]   2> 16216 T2262 C152 P65397 /update {wt=javabin&version=2} {add=[109 (1413544082445172736)]} 0 1
[junit4:junit4]   2> 16223 T2300 C148 P65421 REQ /update {distrib.from=http://127.0.0.1:65410/solr/collection1/&update.distrib=FROMLEADER&wt=javabin&version=2} status=0 QTime=1 
[junit4:junit4]   2> 16224 T2278 C149 P65410 /update {wt=javabin&version=2} {add=[109 (1413544082449367040)]} 0 5
[junit4:junit4]   2> 16227 T2262 C152 P65397 /update {wt=javabin&version=2} {add=[110 (1413544082456707072)]} 0 1
[junit4:junit4]   2> 16234 T2300 C148 P65421 REQ /update {distrib.from=http://127.0.0.1:65410/solr/collection1/&update.distrib=FROMLEADER&wt=javabin&version=2} status=0 QTime=1 
[junit4:junit4]   2> 16235 T2278 C149 P65410 /update {wt=javabin&version=2} {add=[110 (1413544082460901376)]} 0 5
[junit4:junit4]   2> 16239 T2262 C152 P65397 /update {wt=javabin&version=2} {add=[111 (1413544082469289984)]} 0 1
[junit4:junit4]   2> 16246 T2300 C148 P65421 REQ /update {distrib.from=http://127.0.0.1:65410/solr/collection1/&update.distrib=FROMLEADER&wt=javabin&version=2} status=0 QTime=1 
[junit4:junit4]   2> 16247 T2278 C149 P65410 /update {wt=javabin&version=2} {add=[111 (1413544082473484288)]} 0 5
[junit4:junit4]   2> 16250 T2262 C152 P65397 /update {wt=javabin&version=2} {add=[112 (1413544082480824320)]} 0 1
[junit4:junit4]   2> 16257 T2314 C150 P65430 REQ /update {distrib.from=http://127.0.0.1:65416/solr/collection1/&update.distrib=FROMLEADER&wt=javabin&version=2} status=0 QTime=1 
[junit4:junit4]   2> 16257 T2294 C151 P65416 /update {wt=javabin&version=2} {add=[112 (1413544082485018624)]} 0 4
[junit4:junit4]   2> 16271 T2262 C152 P65397 /update {wt=javabin&version=2} {add=[113 (1413544082492358656)]} 0 11
[junit4:junit4]   2> 16280 T2300 C148 P65421 REQ /update {update.distrib=FROMLEADER&distrib.from=http://127.0.0.1:65410/solr/collection1/&wt=javabin&version=2} status=0 QTime=1 
[junit4:junit4]   2> 16281 T2282 C149 P65410 REQ /update {distrib.from=http://127.0.0.1:65416/solr/collection1/&update.distrib=TOLEADER&wt=javabin&version=2} status=0 QTime=5 
[junit4:junit4]   2> 16281 T2294 C151 P65416 /update {wt=javabin&version=2} {add=[113]} 0 7
[junit4:junit4]   2> 16286 T2262 C152 P65397 /update {wt=javabin&version=2} {add=[114 (1413544082517524480)]} 0 2
[junit4:junit4]   2> 16294 T2300 C148 P65421 REQ /update {update.distrib=FROMLEADER&distrib.from=http://127.0.0.1:65410/solr/collection1/&wt=javabin&version=2} status=0 QTime=1 
[junit4:junit4]   2> 16294 T2282 C149 P65410 REQ /update {distrib.from=http://127.0.0.1:65416/solr/collection1/&update.distrib=TOLEADER&wt=javabin&version=2} status=0 QTime=4 
[junit4:junit4]   2> 16295 T2294 C151 P65416 /update {wt=javabin&version=2} {add=[114]} 0 7
[junit4:junit4]   2> 16299 T2262 C152 P65397 /update {wt=javabin&version=2} {add=[115 (1413544082532204544)]} 0 1
[junit4:junit4]   2> 16306 T2314 C150 P65430 REQ /update {distrib.from=http://127.0.0.1:65416/solr/collection1/&update.distrib=FROMLEADER&wt=javabin&version=2} status=0 QTime=1 
[junit4:junit4]   2> 16306 T2294 C151 P65416 /update {wt=javabin&version=2} {add=[115 (1413544082536398848)]} 0 4
[junit4:junit4]   2> 16310 T2262 C152 P65397 /update {wt=javabin&version=2} {add=[116 (1413544082543738880)]} 0 1
[junit4:junit4]   2> 16316 T2314 C150 P65430 REQ /update {distrib.from=http://127.0.0.1:65416/solr/collection1/&update.distrib=FROMLEADER&wt=javabin&version=2} status=0 QTime=1 
[junit4:junit4]   2> 16316 T2294 C151 P65416 /update {wt=javabin&version=2} {add=[116 (1413544082546884608)]} 0 4
[junit4:junit4]   2> 16320 T2262 C152 P65397 /update {wt=javabin&version=2} {add=[117 (1413544082554224640)]} 0 1
[junit4:junit4]   2> 16329 T2314 C150 P65430 REQ /update {update.distrib=FROMLEADER&distrib.from=http://127.0.0.1:65416/solr/collection1/&wt=javabin&version=2} status=0 QTime=1 
[junit4:junit4]   2> 16329 T2292 C151 P65416 REQ /update {distrib.from=http://127.0.0.1:65410/solr/collection1/&update.distrib=TOLEADER&wt=javabin&version=2} status=0 QTime=4 
[junit4:junit4]   2> 16330 T2278 C149 P65410 /update {wt=javabin&version=2} {add=[117]} 0 8
[junit4:junit4]   2> 16334 T2262 C152 P65397 /update {wt=javabin&version=2} {add=[118 (1413544082568904704)]} 0 1
[junit4:junit4]   2> 16362 T2300 C148 P65421 REQ /update {distrib.from=http://127.0.0.1:65410/solr/collection1/&update.distrib=FROMLEADER&wt=javabin&version=2} status=0 QTime=11 
[junit4:junit4]   2> 16363 T2278 C149 P65410 /update {wt=javabin&version=2} {add=[118 (1413544082573099008)]} 0 26
[junit4:junit4]   2> 16367 T2262 C152 P65397 /update {wt=javabin&version=2} {add=[119 (1413544082603507712)]} 0 1
[junit4:junit4]   2> 16374 T2314 C150 P65430 REQ /update {distrib.from=http://127.0.0.1:65416/solr/collection1/&update.distrib=FROMLEADER&wt=javabin&version=2} status=0 QTime=1 
[junit4:junit4]   2> 16375 T2294 C151 P65416 /update {wt=javabin&version=2} {add=[119 (1413544082607702016)]} 0 5
[junit4:junit4]   2> 16378 T2262 C152 P65397 /update {wt=javabin&version=2} {add=[120 (1413544082615042048)]} 0 1
[junit4:junit4]   2> 16386 T2314 C150 P65430 REQ /update {distrib.from=http://127.0.0.1:65416/solr/collection1/&update.distrib=FROMLEADER&wt=javabin&version=2} status=0 QTime=1 
[junit4:junit4]   2> 16387 T2294 C151 P65416 /update {wt=javabin&version=2} {add=[120 (1413544082620284928)]} 0 6
[junit4:junit4]   2> 16391 T2262 C152 P65397 /update {wt=javabin&version=2} {add=[121 (1413544082628673536)]} 0 1
[junit4:junit4]   2> 16401 T2314 C150 P65430 REQ /update {update.distrib=FROMLEADER&distrib.from=http://127.0.0.1:65416/solr/collection1/&wt=javabin&version=2} status=0 QTime=1 
[junit4:junit4]   2> 16402 T2292 C151 P65416 REQ /update {distrib.from=http://127.0.0.1:65410/solr/collection1/&update.distrib=TOLEADER&wt=javabin&version=2} status=0 QTime=5 
[junit4:junit4]   2> 16402 T2278 C149 P65410 /update {wt=javabin&version=2} {add=[121]} 0 8
[junit4:junit4]   2> 16406 T2262 C152 P65397 /update {wt=javabin&version=2} {add=[122 (1413544082644402176)]} 0 1
[junit4:junit4]   2> 16416 T2300 C148 P65421 REQ /update {distrib.from=http://127.0.0.1:65410/solr/collection1/&update.distrib=FROMLEADER&wt=javabin&version=2} status=0 QTime=2 
[junit4:junit4]   2> 16416 T2278 C149 P65410 /update {wt=javabin&version=2} {add=[122 (1413544082648596480)]} 0 7
[junit4:junit4]   2> 16431 T2262 C152 P65397 /update {wt=javabin&version=2} {add=[123 (1413544082659082240)]} 0 12
[junit4:junit4]   2> 16440 T2300 C148 P65421 REQ /update {update.distrib=FROMLEADER&distrib.from=http://127.0.0.1:65410/solr/collection1/&wt=javabin&version=2} status=0 QTime=1 
[junit4:junit4]   2> 16441 T2282 C149 P65410 REQ /update {distrib.from=http://127.0.0.1:65416/solr/collection1/&update.distrib=TOLEADER&wt=javabin&version=2} status=0 QTime=5 
[junit4:junit4]   2> 16441 T2294 C151 P65416 /update {wt=javabin&version=2} {add=[123]} 0 7
[junit4:junit4]   2> 16446 T2262 C152 P65397 /update {wt=javabin&version=2} {add=[124 (1413544082685296640)]} 0 2
[junit4:junit4]   2> 16454 T2300 C148 P65421 REQ /update {update.distrib=FROMLEADER&distrib.from=http://127.0.0.1:65410/solr/collection1/&wt=javabin&version=2} status=0 QTime=1 
[junit4:junit4]   2> 16455 T2282 C149 P65410 REQ /update {distrib.from=http://127.0.0.1:65416/solr/collection1/&update.distrib=TOLEADER&wt=javabin&version=2} status=0 QTime=5 
[junit4:junit4]   2> 16455 T2294 C151 P65416 /update {wt=javabin&version=2} {add=[124]} 0 7
[junit4:junit4]   2> 16459 T2262 C152 P65397 /update {wt=javabin&version=2} {add=[125 (1413544082699976704)]} 0 1
[junit4:junit4]   2> 16467 T2300 C148 P65421 REQ /update {update.distrib=FROMLEADER&distrib.from=http://127.0.0.1:65410/solr/collection1/&wt=javabin&version=2} status=0 QTime=1 
[junit4:junit4]   2> 16468 T2282 C149 P65410 REQ /update {distrib.from=http://127.0.0.1:65416/solr/collection1/&update.distrib=TOLEADER&wt=javabin&version=2} status=0 QTime=5 
[junit4:junit4]   2> 16468 T2294 C151 P65416 /update {wt=javabin&version=2} {add=[125]} 0 7
[junit4:junit4]   2> 16472 T2262 C152 P65397 /update {wt=javabin&version=2} {add=[126 (1413544082713608192)]} 0 1
[junit4:junit4]   2> 16479 T2314 C150 P65430 REQ /update {distrib.from=http://127.0.0.1:65416/solr/collection1/&update.distrib=FROMLEADER&wt=javabin&version=2} status=0 QTime=1 
[junit4:junit4]   2> 16480 T2294 C151 P65416 /update {wt=javabin&version=2} {add=[126 (1413544082717802496)]} 0 5
[junit4:junit4]   2> 16484 T2262 C152 P65397 /update {wt=javabin&version=2} {add=[127 (1413544082726191104)]} 0 1
[junit4:junit4]   2> 16511 T2314 C150 P65430 REQ /update {distrib.from=http://127.0.0.1:65416/solr/collection1/&update.distrib=FROMLEADER&wt=javabin&version=2} status=0 QTime=11 
[junit4:junit4]   2> 16512 T2294 C151 P65416 /update {wt=javabin&version=2} {add=[127 (1413544082730385408)]} 0 25
[junit4:junit4]   2> 16516 T2262 C152 P65397 /update {wt=javabin&version=2} {add=[128 (1413544082759745536)]} 0 1
[junit4:junit4]   2> 16528 T2314 C150 P65430 REQ /update {update.distrib=FROMLEADER&distrib.from=http://127.0.0.1:65416/solr/collection1/&wt=javabin&version=2} status=0 QTime=2 
[junit4:junit4]   2> 16529 T2292 C151 P65416 REQ /update {distrib.from=http://127.0.0.1:65410/solr/collection1/&update.distrib=TOLEADER&wt=javabin&version=2} status=0 QTime=7 
[junit4:junit4]   2> 16530 T2278 C149 P65410 /update {wt=javabin&version=2} {add=[128]} 0 11
[junit4:junit4]   2> 16533 T2262 C152 P65397 /update {wt=javabin&version=2} {add=[129 (1413544082777571328)]} 0 1
[junit4:junit4]   2> 16543 T2300 C148 P65421 REQ /update {update.distrib=FROMLEADER&distrib.from=http://127.0.0.1:65410/solr/collection1/&wt=javabin&version=2} status=0 QTime=1 
[junit4:junit4]   2> 16544 T2282 C149 P65410 REQ /update {distrib.from=http://127.0.0.1:65416/solr/collection1/&update.distrib=TOLEADER&wt=javabin&version=2} status=0 QTime=6 
[junit4:junit4]   2> 16544 T2294 C151 P65416 /update {wt=javabin&version=2} {add=[129]} 0 8
[junit4:junit4]   2> 16548 T2262 C152 P65397 /update {wt=javabin&version=2} {add=[130 (1413544082793299968)]} 0 1
[junit4:junit4]   2> 16557 T2314 C150 P65430 REQ /update {update.distrib=FROMLEADER&distrib.from=http://127.0.0.1:65416/solr/collection1/&wt=javabin&version=2} status=0 QTime=1 
[junit4:junit4]   2> 16558 T2292 C151 P65416 REQ /update {distrib.from=http://127.0.0.1:65410/solr/collection1/&update.distrib=TOLEADER&wt=javabin&version=2} status=0 QTime=5 
[junit4:junit4]   2> 16558 T2278 C149 P65410 /update {wt=javabin&version=2} {add=[130]} 0 7
[junit4:junit4]   2> 16562 T2262 C152 P65397 /update {wt=javabin&version=2} {add=[131 (1413544082807980032)]} 0 1
[junit4:junit4]   2> 16571 T2314 C150 P65430 REQ /update {update.distrib=FROMLEADER&distrib.from=http://127.0.0.1:65416/solr/collection1/&wt=javabin&version=2} status=0 QTime=1 
[junit4:junit4]   2> 16572 T2292 C151 P65416 REQ /update {distrib.from=http://127.0.0.1:65410/solr/collection1/&update.distrib=TOLEADER&wt=javabin&version=2} status=0 QTime=5 
[junit4:junit4]   2> 16572 T2278 C149 P65410 /update {wt=javabin&version=2} {add=[131]} 0 7
[junit4:junit4]   2> 16576 T2262 C152 P65397 /update {wt=javabin&version=2} {add=[132 (1413544082822660096)]} 0 1
[junit4:junit4]   2> 16583 T2300 C148 P65421 REQ /update {distrib.from=http://127.0.0.1:65410/solr/collection1/&update.distrib=FROMLEADER&wt=javabin&version=2} status=0 QTime=1 
[junit4:junit4]   2> 16584 T2278 C149 P65410 /update {wt=javabin&version=2} {add=[132 (1413544082826854400)]} 0 5
[junit4:junit4]   2> 16599 T2262 C152 P65397 /update {wt=javabin&version=2} {add=[133 (1413544082835243008)]} 0 12
[junit4:junit4]   2> 16609 T2300 C148 P65421 REQ /update {update.distrib=FROMLEADER&distrib.from=http://127.0.0.1:65410/solr/collection1/&wt=javabin&version=2} status=0 QTime=1 
[junit4:junit4]   2> 16610 T2282 C149 P65410 REQ /update {distrib.from=http://127.0.0.1:65416/solr/collection1/&update.distrib=TOLEADER&wt=javabin&version=2} status=0 QTime=6 
[junit4:junit4]   2> 16611 T2294 C151 P65416 /update {wt=javabin&version=2} {add=[133]} 0 9
[junit4:junit4]   2> 16615 T2262 C152 P65397 /update {wt=javabin&version=2} {add=[134 (1413544082862505984)]} 0 2
[junit4:junit4]   2> 16622 T2314 C150 P65430 REQ /update {distrib.from=http://127.0.0.1:65416/solr/collection1/&update.distrib=FROMLEADER&wt=javabin&version=2} status=0 QTime=1 
[junit4:junit4]   2> 16623 T2294 C151 P65416 /update {wt=javabin&version=2} {add=[134 (1413544082867748864)]} 0 5
[junit4:junit4]   2> 16627 T2262 C152 P65397 /update {wt=javabin&version=2} {add=[135 (1413544082876137472)]} 0 1
[junit4:junit4]   2> 16638 T2300 C148 P65421 REQ /update {update.distrib=FROMLEADER&distrib.from=http://127.0.0.1:65410/solr/collection1/&wt=javabin&version=2} status=0 QTime=1 
[junit4:junit4]   2> 16639 T2282 C149 P65410 REQ /update {distrib.from=http://127.0.0.1:65416/solr/collection1/&update.distrib=TOLEADER&wt=javabin&version=2} status=0 QTime=6 
[junit4:junit4]   2> 16640 T2294 C151 P65416 /update {wt=javabin&version=2} {add=[135]} 0 10
[junit4:junit4]   2> 16643 T2262 C152 P65397 /update {wt=javabin&version=2} {add=[136 (1413544082892914688)]} 0 1
[junit4:junit4]   2> 16650 T2314 C150 P65430 REQ /update {distrib.from=http://127.0.0.1:65416/solr/collection1/&update.distrib=FROMLEADER&wt=javabin&version=2} status=0 QTime=1 
[junit4:junit4]   2> 16651 T2294 C151 P65416 /update {wt=javabin&version=2} {add=[136 (1413544082897108992)]} 0 5
[junit4:junit4]   2> 16654 T2262 C152 P65397 /update {wt=javabin&version=2} {add=[137 (1413544082904449024)]} 0 1
[junit4:junit4]   2> 16665 T2314 C150 P65430 REQ /update {update.distrib=FROMLEADER&distrib.from=http://127.0.0.1:65416/solr/collection1/&wt=javabin&version=2} status=0 QTime=1 
[junit4:junit4]   2> 16666 T2292 C151 P65416 REQ /update {distrib.from=http://127.0.0.1:65410/solr/collection1/&update.distrib=TOLEADER&wt=javabin&version=2} status=0 QTime=6 
[junit4:junit4]   2> 16667 T2278 C149 P65410 /update {wt=javabin&version=2} {add=[137]} 0 10
[junit4:junit4]   2> 16671 T2262 C152 P65397 /update {wt=javabin&version=2} {add=[138 (1413544082922274816)]} 0 1
[junit4:junit4]   2> 16679 T2300 C148 P65421 REQ /update {distrib.from=http://127.0.0.1:65410/solr/collection1/&update.distrib=FROMLEADER&wt=javabin&version=2} status=0 QTime=1 
[junit4:junit4]   2> 16680 T2278 C149 P65410 /update {wt=javabin&version=2} {add=[138 (1413544082926469120)]} 0 6
[junit4:junit4]   2> 16684 T2262 C152 P65397 /update {wt=javabin&version=2} {add=[139 (1413544082935906304)]} 0 1
[junit4:junit4]   2> 16692 T2314 C150 P65430 REQ /update {distrib.from=http://127.0.0.1:65416/solr/collection1/&update.distrib=FROMLEADER&wt=javabin&version=2} status=0 QTime=1 
[junit4:junit4]   2> 16693 T2294 C151 P65416 /update {wt=javabin&version=2} {add=[139 (1413544082941149184)]} 0 6
[junit4:junit4]   2> 16697 T2262 C152 P65397 /update {wt=javabin&version=2} {add=[140 (1413544082949537792)]} 0 1
[junit4:junit4]   2> 16708 T2314 C150 P65430 REQ /update {update.distrib=FROMLEADER&distrib.from=http://127.0.0.1:65416/solr/collection1/&wt=javabin&version=2} status=0 QTime=1 
[junit4:junit4]   2> 16709 T2292 C151 P65416 REQ /update {distrib.from=http://127.0.0.1:65410/solr/collection1/&update.distrib=TOLEADER&wt=javabin&version=2} status=0 QTime=6 
[junit4:junit4]   2> 16710 T2278 C149 P65410 /update {wt=javabin&version=2} {add=[140]} 0 10
[junit4:junit4]   2> 16714 T2262 C152 P65397 /update {wt=javabin&version=2} {add=[141 (1413544082967363584)]} 0 1
[junit4:junit4]   2> 16725 T2314 C150 P65430 REQ /update {update.distrib=FROMLEADER&distrib.from=http://127.0.0.1:65416/solr/collection1/&wt=javabin&version=2} status=0 QTime=1 
[junit4:junit4]   2> 16726 T2292 C151 P65416 REQ /update {distrib.from=http://127.0.0.1:65410/solr/collection1/&update.distrib=TOLEADER&wt=javabin&version=2} status=0 QTime=6 
[junit4:junit4]   2> 16727 T2278 C149 P65410 /update {wt=javabin&version=2} {add=[141]} 0 10
[junit4:junit4]   2> 16731 T2262 C152 P65397 /update {wt=javabin&version=2} {add=[142 (1413544082985189376)]} 0 1
[junit4:junit4]   2> 16766 T2314 C150 P65430 REQ /update {update.distrib=FROMLEADER&distrib.from=http://127.0.0.1:65416/solr/collection1/&wt=javabin&version=2} status=0 QTime=11 
[junit4:junit4]   2> 16767 T2292 C151 P65416 REQ /update {distrib.from=http://127.0.0.1:65410/solr/collection1/&update.distrib=TOLEADER&wt=javabin&version=2} status=0 QTime=30 
[junit4:junit4]   2> 16768 T2278 C149 P65410 /update {wt=javabin&version=2} {add=[142]} 0 34
[junit4:junit4]   2> 16784 T2262 C152 P65397 /update {wt=javabin&version=2} {add=[143 (1413544083028180992)]} 0 13
[junit4:junit4]   2> 16793 T2314 C150 P65430 REQ /update {distrib.from=http://127.0.0.1:65416/solr/collection1/&update.distrib=FROMLEADER&wt=javabin&version=2} status=0 QTime=2 
[junit4:junit4]   2> 16793 T2294 C151 P65416 /update {wt=javabin&version=2} {add=[143 (1413544083044958208)]} 0 6
[junit4:junit4]   2> 16798 T2262 C152 P65397 /update {wt=javabin&version=2} {add=[144 (1413544083054395392)]} 0 2
[junit4:junit4]   2> 16806 T2314 C150 P65430 REQ /update {update.distrib=FROMLEADER&distrib.from=http://127.0.0.1:65416/solr/collection1/&wt=javabin&version=2} status=0 QTime=1 
[junit4:junit4]   2> 16806 T2292 C151 P65416 REQ /update {distrib.from=http://127.0.0.1:65410/solr/collection1/&update.distrib=TOLEADER&wt=javabin&version=2} status=0 QTime=4 
[junit4:junit4]   2> 16807 T2278 C149 P65410 /update {wt=javabin&version=2} {add=[144]} 0 7
[junit4:junit4]   2> 16811 T2262 C152 P65397 /update {wt=javabin&version=2} {add=[145 (1413544083069075456)]} 0 1
[junit4:junit4]   2> 16820 T2314 C150 P65430 REQ /update {update.distrib=FROMLEADER&distrib.from=http://127.0.0.1:65416/solr/collection1/&wt=javabin&version=2} status=0 QTime=1 
[junit4:junit4]   2> 16821 T2292 C151 P65416 REQ /update {distrib.from=http://127.0.0.1:65410/solr/collection1/&update.distrib=TOLEADER&wt=javabin&version=2} status=0 QTime=5 
[junit4:junit4]   2> 16821 T2278 C149 P65410 /update {wt=javabin&version=2} {add=[145]} 0 7
[junit4:junit4]   2> 16825 T2262 C152 P65397 /update {wt=javabin&version=2} {add=[146 (1413544083083755520)]} 0 1
[junit4:junit4]   2> 16848 T2300 C148 P65421 REQ /update {distrib.from=http://127.0.0.1:65410/solr/collection1/&update.distrib=FROMLEADER&wt=javabin&version=2} status=0 QTime=10 
[junit4:junit4]   2> 16848 T2278 C149 P65410 /update {wt=javabin&version=2} {add=[146 (1413544083086901248)]} 0 21
[junit4:junit4]   2> 16852 T2262 C152 P65397 /update {wt=javabin&version=2} {add=[147 (1413544083112067072)]} 0 1
[junit4:junit4]   2> 16859 T2314 C150 P65430 REQ /update {distrib.from=http://127.0.0.1:65416/solr/collection1/&update.distrib=FROMLEADER&wt=javabin&version=2} status=0 QTime=1 
[junit4:junit4]   2> 16859 T2294 C151 P65416 /update {wt=javabin&version=2} {add=[147 (1413544083116261376)]} 0 4
[junit4:junit4]   2> 16863 T2262 C152 P65397 /update {wt=javabin&version=2} {add=[148 (1413544083123601408)]} 0 1
[junit4:junit4]   2> 16873 T2300 C148 P65421 REQ /update {update.distrib=FROMLEADER&distrib.from=http://127.0.0.1:65410/solr/collection1/&wt=javabin&version=2} status=0 QTime=2 
[junit4:junit4]   2> 16873 T2282 C149 P65410 REQ /update {distrib.from=http://127.0.0.1:65416/solr/collection1/&update.distrib=TOLEADER&wt=javabin&version=2} status=0 QTime=6 
[junit4:junit4]   2> 16874 T2294 C151 P65416 /update {wt=javabin&version=2} {add=[148]} 0 9
[junit4:junit4]   2> 16878 T2262 C152 P65397 /update {wt=javabin&version=2} {add=[149 (1413544083139330048)]} 0 1
[junit4:junit4]   2> 16884 T2314 C150 P65430 REQ /update {distrib.from=http://127.0.0.1:65416/solr/collection1/&update.distrib=FROMLEADER&wt=javabin&version=2} status=0 QTime=1 
[junit4:junit4]   2> 16884 T2294 C151 P65416 /update {wt=javabin&version=2} {add=[149 (1413544083142475776)]} 0 4
[junit4:junit4]   2> 16885 T2250 oasc.AbstractDistribZkTestBase.waitForRecoveriesToFinish Wait for recoveries to finish - collection: collection1 failOnTimeout:true timeout (sec):1800
[junit4:junit4]   2> 16886 T2250 oascc.ZkStateReader.updateClusterState Updating cloud state from ZooKeeper... 
[junit4:junit4]   2> 16889 T2262 C152 P65397 oasu.DirectUpdateHandler2.commit start commit{flags=0,_version_=0,optimize=false,openSearcher=true,waitSearcher=true,expungeDeletes=false,softCommit=false}
[junit4:junit4]   2> 17505 T2262 C152 P65397 oasc.SolrDeletionPolicy.onCommit SolrDeletionPolicy.onCommit: commits:num=2
[junit4:junit4]   2> 		commit{dir=NRTCachingDirectory(org.apache.lucene.store.NIOFSDirectory@/usr/home/hudson/hudson-slave/workspace/Lucene-Solr-Tests-trunk-Java6/solr/build/solr-core/test/J0/org.apache.solr.cloud.BasicDistributedZk2Test-1348060670324/control/data/index lockFactory=org.apache.lucene.store.NativeFSLockFactory@798ded3f; maxCacheMB=48.0 maxMergeSizeMB=4.0),segFN=segments_2,generation=2,filenames=[_0_MockRandom_0.tib, _0_Block_0.pos, _0_Block_0.tip, _0.fnm, _0_Pulsing40_0.tim, _0_Block_0.doc, _0_Block_0.tim, _0_MockRandom_0.prx, _0_nrm.cfs, _0_Pulsing40_0.prx, _0_Pulsing40_0.frq, _0_MockRandom_0.frq, _0_MockRandom_0.sd, _0_Lucene40WithOrds_0.tii, _0_Lucene40WithOrds_0.frq, _0_nrm.cfe, _0_MockRandom_0.tii, _0_Pulsing40_0.tip, segments_2, _0.fdx, _0_Lucene40WithOrds_0.prx, _0.si, _0_Lucene40WithOrds_0.tib, _0.fdt]
[junit4:junit4]   2> 		commit{dir=NRTCachingDirectory(org.apache.lucene.store.NIOFSDirectory@/usr/home/hudson/hudson-slave/workspace/Lucene-Solr-Tests-trunk-Java6/solr/build/solr-core/test/J0/org.apache.solr.cloud.BasicDistributedZk2Test-1348060670324/control/data/index lockFactory=org.apache.lucene.store.NativeFSLockFactory@798ded3f; maxCacheMB=48.0 maxMergeSizeMB=4.0),segFN=segments_3,generation=3,filenames=[_5_nrm.cfe, _2_Block_0.pos, _0_MockRandom_0.prx, _7.si, _3.fdt, _5_Lucene40WithOrds_0.tib, _0_Pulsing40_0.frq, _7.fnm, _6_Block_0.pos, _0_Lucene40WithOrds_0.tii, _5_Lucene40WithOrds_0.tii, _0_Lucene40WithOrds_0.frq, _1_Lucene40WithOrds_0.tib, _7_Lucene40WithOrds_0.frq, _3_MockRandom_0.skp, _4_MockRandom_0.pyl, _5_MockRandom_0.pyl, _1_Lucene40WithOrds_0.tii, _0_Lucene40WithOrds_0.tib, _5_MockRandom_0.pos, _6_MockRandom_0.skp, _1_Block_0.tip, _1_Block_0.pos, _1_Lucene40WithOrds_0.frq, _0_Pulsing40_0.tim, _1_Block_0.tim, _1_MockRandom_0.tip, _2.fdt, _7.fdx, _1_MockRandom_0.tim, _1_MockRandom_0.sd, _7_MockRandom_0.skp, _2.fdx, _7.fdt, _3_Block_0.pos, _3_Block_0.doc, _1.fdx, _0_MockRandom_0.frq, _7_MockRandom_0.doc, _5_nrm.cfs, _1.fdt, _4_MockRandom_0.sd, _7_MockRandom_0.sd, _7_Block_0.pos, _3.si, _6.fdt, _5_Lucene40WithOrds_0.prx, _2.si, _2_Pulsing40_0.tim, _4_Lucene40WithOrds_0.tib, _2_MockRandom_0.tip, _2_Block_0.tim, _4_Lucene40WithOrds_0.tii, _6.fdx, _2_Pulsing40_0.tip, _2_MockRandom_0.tim, _2_Block_0.tip, _1_Lucene40WithOrds_0.prx, _3_MockRandom_0.frq, _3.fnm, _5_Block_0.tim, _6_MockRandom_0.tiv, _7_MockRandom_0.pos, _2_nrm.cfe, _6_MockRandom_0.tib, _7_MockRandom_0.pyl, _6_MockRandom_0.pyl, _0_Pulsing40_0.tip, _6_MockRandom_0.doc, _2_nrm.cfs, _5_MockRandom_0.doc, _5_Block_0.doc, _4_MockRandom_0.skp, _4_Block_0.pos, _2_MockRandom_0.prx, _3_Block_0.tip, _4_Block_0.tip, _2_Lucene40WithOrds_0.frq, _5_MockRandom_0.skp, _2.fnm, _3.fdx, _2_MockRandom_0.sd, _1.si, _3_MockRandom_0.pyl, _6.si, _6.fnm, _0_Lucene40WithOrds_0.prx, _3_Lucene40WithOrds_0.prx, _3_MockRandom_0.pos, _6_MockRandom_0.frq, _3_nrm.cfe, _4_MockRandom_0.pos, _0_Block_0.tip, _5.fdt, _1_Pulsing40_0.tip, _0_Block_0.tim, _1_Pulsing40_0.tim, _3_Lucene40WithOrds_0.tii, _7_Block_0.tim, _6_Lucene40WithOrds_0.prx, _4_nrm.cfe, _4.fnm, _7_Block_0.tip, _0_Pulsing40_0.prx, _1.fnm, _3_Lucene40WithOrds_0.tib, _7_MockRandom_0.tip, _4.fdx, _1_Pulsing40_0.frq, _4_MockRandom_0.doc, _7_MockRandom_0.tim, _7_MockRandom_0.frq, _3_Block_0.tim, _5_MockRandom_0.sd, _1_Pulsing40_0.prx, _4_MockRandom_0.tip, _1_Block_0.doc, _4_MockRandom_0.tim, _2_Pulsing40_0.prx, _6_Lucene40WithOrds_0.frq, _0.fnm, _4_Block_0.tim, _6_Block_0.doc, _7_Lucene40WithOrds_0.tib, _6_Lucene40WithOrds_0.tii, _2_Pulsing40_0.frq, _5.si, _5_Lucene40WithOrds_0.frq, _3_nrm.cfs, _7_Lucene40WithOrds_0.tii, _6_MockRandom_0.sd, _3_MockRan

[...truncated too long message...]

ext.runLeaderProcess(ElectionContext.java:213)
[junit4:junit4]   2> 	at org.apache.solr.cloud.LeaderElector.runIamLeaderProcess(LeaderElector.java:158)
[junit4:junit4]   2> 	at org.apache.solr.cloud.LeaderElector.checkIfIamLeader(LeaderElector.java:102)
[junit4:junit4]   2> 	at org.apache.solr.cloud.LeaderElector.access$000(LeaderElector.java:56)
[junit4:junit4]   2> 	at org.apache.solr.cloud.LeaderElector$1.process(LeaderElector.java:131)
[junit4:junit4]   2> 	at org.apache.zookeeper.ClientCnxn$EventThread.processEvent(ClientCnxn.java:526)
[junit4:junit4]   2> 	at org.apache.zookeeper.ClientCnxn$EventThread.run(ClientCnxn.java:502)
[junit4:junit4]   2> 
[junit4:junit4]   2> 307555 T2322 oasc.JmxMonitoredMap$SolrDynamicMBean.getMBeanInfo WARNING Could not getStatistics on info bean Lazy[solr.ReplicationHandler] java.lang.IllegalArgumentException: /usr/home/hudson/hudson-slave/workspace/Lucene-Solr-Tests-trunk-Java6/solr/build/solr-core/test/J0/org.apache.solr.cloud.BasicDistributedZk2Test-1348060670324/jetty4/index does not exist
[junit4:junit4]   2> 	at org.apache.commons.io.FileUtils.sizeOfDirectory(FileUtils.java:2074)
[junit4:junit4]   2> 	at org.apache.solr.handler.ReplicationHandler.getIndexSize(ReplicationHandler.java:477)
[junit4:junit4]   2> 	at org.apache.solr.handler.ReplicationHandler.getStatistics(ReplicationHandler.java:525)
[junit4:junit4]   2> 	at org.apache.solr.core.RequestHandlers$LazyRequestHandlerWrapper.getStatistics(RequestHandlers.java:310)
[junit4:junit4]   2> 	at org.apache.solr.core.JmxMonitoredMap$SolrDynamicMBean.getMBeanInfo(JmxMonitoredMap.java:231)
[junit4:junit4]   2> 	at com.sun.jmx.interceptor.DefaultMBeanServerInterceptor.getClassName(DefaultMBeanServerInterceptor.java:1824)
[junit4:junit4]   2> 	at com.sun.jmx.interceptor.DefaultMBeanServerInterceptor.safeGetClassName(DefaultMBeanServerInterceptor.java:1661)
[junit4:junit4]   2> 	at com.sun.jmx.interceptor.DefaultMBeanServerInterceptor.checkMBeanPermission(DefaultMBeanServerInterceptor.java:1833)
[junit4:junit4]   2> 	at com.sun.jmx.interceptor.DefaultMBeanServerInterceptor.exclusiveUnregisterMBean(DefaultMBeanServerInterceptor.java:436)
[junit4:junit4]   2> 	at com.sun.jmx.interceptor.DefaultMBeanServerInterceptor.unregisterMBean(DefaultMBeanServerInterceptor.java:421)
[junit4:junit4]   2> 	at com.sun.jmx.mbeanserver.JmxMBeanServer.unregisterMBean(JmxMBeanServer.java:540)
[junit4:junit4]   2> 	at org.apache.solr.core.JmxMonitoredMap.unregister(JmxMonitoredMap.java:175)
[junit4:junit4]   2> 	at org.apache.solr.core.JmxMonitoredMap.clear(JmxMonitoredMap.java:116)
[junit4:junit4]   2> 	at org.apache.solr.core.SolrCore.close(SolrCore.java:864)
[junit4:junit4]   2> 	at org.apache.solr.cloud.ShardLeaderElectionContext.runLeaderProcess(ElectionContext.java:213)
[junit4:junit4]   2> 	at org.apache.solr.cloud.LeaderElector.runIamLeaderProcess(LeaderElector.java:158)
[junit4:junit4]   2> 	at org.apache.solr.cloud.LeaderElector.checkIfIamLeader(LeaderElector.java:102)
[junit4:junit4]   2> 	at org.apache.solr.cloud.LeaderElector.access$000(LeaderElector.java:56)
[junit4:junit4]   2> 	at org.apache.solr.cloud.LeaderElector$1.process(LeaderElector.java:131)
[junit4:junit4]   2> 	at org.apache.zookeeper.ClientCnxn$EventThread.processEvent(ClientCnxn.java:526)
[junit4:junit4]   2> 	at org.apache.zookeeper.ClientCnxn$EventThread.run(ClientCnxn.java:502)
[junit4:junit4]   2> 
[junit4:junit4]   2> 307560 T2322 oasc.SolrCore.closeSearcher [collection1] Closing main searcher on request.
[junit4:junit4]   2> 307562 T2322 oasu.DirectUpdateHandler2.close closing DirectUpdateHandler2{commits=5,autocommits=0,soft autocommits=0,optimizes=0,rollbacks=0,expungeDeletes=0,docsPending=0,adds=0,deletesById=0,deletesByQuery=0,errors=0,cumulative_adds=35,cumulative_deletesById=0,cumulative_deletesByQuery=0,cumulative_errors=0}
[junit4:junit4]   2> 307563 T2322 oasu.DefaultSolrCoreState.decref SolrCoreState ref count has reached 0 - closing IndexWriter
[junit4:junit4]   2> 307566 T2322 oasu.DefaultSolrCoreState.decref Closing SolrCoreState - canceling any ongoing recovery
[junit4:junit4]   2> 307566 T2322 oascc.ZkStateReader$3.process Updating live nodes
[junit4:junit4]   2> 307566 T2322 oascc.ZkStateReader$3.process WARNING ZooKeeper watch triggered, but Solr cannot talk to ZK
[junit4:junit4]   2> 307566 T2322 oascc.ZkStateReader$2.process A cluster state change has occurred - updating...
[junit4:junit4]   2> 307566 T2322 oascc.ZkStateReader$2.process WARNING ZooKeeper watch triggered, but Solr cannot talk to ZK
[junit4:junit4]   2> 307567 T2322 oascc.ConnectionManager.process Watcher org.apache.solr.common.cloud.ConnectionManager@6f9cb81d name:ZooKeeperConnection Watcher:127.0.0.1:65394/solr got event WatchedEvent state:Disconnected type:None path:null path:null type:None
[junit4:junit4]   2> 307567 T2322 oascc.ConnectionManager.process Client->ZooKeeper status change trigger but we are already closed
[junit4:junit4]   2> 307567 T2322 oaz.ClientCnxn$EventThread.run EventThread shut down
[junit4:junit4]   2> NOTE: test params are: codec=Lucene40: {n_f1=PostingsFormat(name=MockRandom), foo_b=Pulsing40(freqCutoff=1 minBlockSize=12 maxBlockSize=115), foo_d=PostingsFormat(name=Lucene40WithOrds), foo_f=Pulsing40(freqCutoff=1 minBlockSize=12 maxBlockSize=115), n_tl1=PostingsFormat(name=MockRandom), n_d1=Block(blocksize=128), rnd_b=PostingsFormat(name=Lucene40WithOrds), intDefault=PostingsFormat(name=MockRandom), n_td1=PostingsFormat(name=MockRandom), id=PostingsFormat(name=Lucene40WithOrds), timestamp=Block(blocksize=128), range_facet_sl=PostingsFormat(name=Lucene40WithOrds), range_facet_si=Block(blocksize=128), oddField_s=PostingsFormat(name=Lucene40WithOrds), multiDefault=Block(blocksize=128), n_tf1=Block(blocksize=128), n_dt1=PostingsFormat(name=MockRandom), n_ti1=PostingsFormat(name=Lucene40WithOrds), range_facet_l=Block(blocksize=128), text=Pulsing40(freqCutoff=1 minBlockSize=12 maxBlockSize=115), _version_=PostingsFormat(name=MockRandom), SubjectTerms_mfacet=PostingsFormat(name=MockRandom), a_t=Block(blocksize=128), n_tdt1=PostingsFormat(name=MockRandom), other_tl1=PostingsFormat(name=MockRandom), n_l1=Block(blocksize=128), a_si=PostingsFormat(name=MockRandom)}, sim=RandomSimilarityProvider(queryNorm=false,coord=yes): {}, locale=fr_CA, timezone=Indian/Kerguelen
[junit4:junit4]   2> NOTE: FreeBSD 9.0-RELEASE amd64/Sun Microsystems Inc. 1.6.0_32 (64-bit)/cpus=16,threads=2,free=155282192,total=359530496
[junit4:junit4]   2> NOTE: All tests run in this JVM: [LoggingHandlerTest, SolrPluginUtilsTest, TestStressReorder, NumericFieldsTest, NoCacheHeaderTest, DateMathParserTest, DistributedSpellCheckComponentTest, JSONWriterTest, ZkControllerTest, TestBadConfig, SpatialFilterTest, TestFastWriter, CoreContainerCoreInitFailuresTest, RequestHandlersTest, ClusterStateTest, ResourceLoaderTest, TestBinaryResponseWriter, UniqFieldsUpdateProcessorFactoryTest, TestSearchPerf, CircularListTest, JsonLoaderTest, CSVRequestHandlerTest, TestDefaultSimilarityFactory, TestRangeQuery, ResponseLogComponentTest, WordBreakSolrSpellCheckerTest, TestSolr4Spatial, SpellCheckComponentTest, MBeansHandlerTest, TestSystemIdResolver, FastVectorHighlighterTest, CurrencyFieldTest, TestCollationField, CoreAdminHandlerTest, HighlighterConfigTest, SuggesterFSTTest, NotRequiredUniqueKeyTest, TermsComponentTest, BasicDistributedZkTest, AutoCommitTest, DirectUpdateHandlerOptimizeTest, CopyFieldTest, SystemInfoHandlerTest, MoreLikeThisHandlerTest, TestLuceneMatchVersion, TestSuggestSpellingConverter, TestLMJelinekMercerSimilarityFactory, ZkCLITest, TestLMDirichletSimilarityFactory, TestElisionMultitermQuery, CacheHeaderTest, SimplePostToolTest, SolrCmdDistributorTest, OverseerTest, LeaderElectionIntegrationTest, TestRealTimeGet, TestRandomFaceting, SpellCheckCollatorTest, TestExtendedDismaxParser, SoftAutoCommitTest, ZkSolrClientTest, TestHashPartitioner, StatsComponentTest, IndexBasedSpellCheckerTest, SimpleFacetsTest, TestCoreContainer, LukeRequestHandlerTest, TestSort, TestGroupingSearch, DirectSolrSpellCheckerTest, TestFiltering, TestTrie, DirectSolrConnectionTest, QueryEqualityTest, PolyFieldTest, TestPseudoReturnFields, DisMaxRequestHandlerTest, QueryParsingTest, SolrInfoMBeanTest, MinimalSchemaTest, TestPHPSerializedResponseWriter, FieldAnalysisRequestHandlerTest, SuggesterWFSTTest, TestSolrQueryParser, TestReversedWildcardFilterFactory, SearchHandlerTest, TestOmitPositions, SuggesterTest, TestFoldingMultitermQuery, UpdateRequestProcessorFactoryTest, TestIndexingPerformance, BadComponentTest, TestUpdate, TestXIncludeConfig, TestLFUCache, TestNumberUtils, MultiTermTest, TestJmxMonitoredMap, SpellPossibilityIteratorTest, TestPerFieldSimilarity, TestIBSimilarityFactory, TimeZoneUtilsTest, URLClassifyProcessorTest, TestLRUCache, UUIDFieldTest, TestUtils, ZkNodePropsTest, PathHierarchyTokenizerFactoryTest, TestCharFilters, BasicDistributedZk2Test]
[junit4:junit4] Completed on J0 in 308.03s, 1 test, 1 failure <<< FAILURES!

[...truncated 5 lines...]
BUILD FAILED
/usr/home/hudson/hudson-slave/workspace/Lucene-Solr-Tests-trunk-Java6/build.xml:32: The following error occurred while executing this line:
/usr/home/hudson/hudson-slave/workspace/Lucene-Solr-Tests-trunk-Java6/solr/build.xml:146: The following error occurred while executing this line:
/usr/home/hudson/hudson-slave/workspace/Lucene-Solr-Tests-trunk-Java6/lucene/module-build.xml:63: The following error occurred while executing this line:
/usr/home/hudson/hudson-slave/workspace/Lucene-Solr-Tests-trunk-Java6/lucene/common-build.xml:1136: The following error occurred while executing this line:
/usr/home/hudson/hudson-slave/workspace/Lucene-Solr-Tests-trunk-Java6/lucene/common-build.xml:810: There were test failures: 230 suites, 950 tests, 1 failure, 7 ignored (2 assumptions)

Total time: 28 minutes 51 seconds
Build step 'Invoke Ant' marked build as failure
Recording test results
Email was triggered for: Failure
Sending email for trigger: Failure



Mime
View raw message