lucene-dev mailing list archives

Site index · List index
Message view « Date » · « Thread »
Top « Date » · « Thread »
From Apache Jenkins Server <jenk...@builds.apache.org>
Subject [JENKINS-MAVEN] Lucene-Solr-Maven-trunk #614: POMs out of sync
Date Sat, 15 Sep 2012 16:38:22 GMT
Build: https://builds.apache.org/job/Lucene-Solr-Maven-trunk/614/

1 tests failed.
REGRESSION:  org.apache.solr.cloud.SyncSliceTest.testDistribSearch

Error Message:
There are still nodes recoverying

Stack Trace:
java.lang.AssertionError: There are still nodes recoverying
	at __randomizedtesting.SeedInfo.seed([FC11FB9F56BC1271:7DF7758721E3724D]:0)
	at org.junit.Assert.fail(Assert.java:93)
	at org.apache.solr.cloud.AbstractDistribZkTestBase.waitForRecoveriesToFinish(AbstractDistribZkTestBase.java:153)
	at org.apache.solr.cloud.AbstractFullDistribZkTestBase.waitForRecoveriesToFinish(AbstractFullDistribZkTestBase.java:555)
	at org.apache.solr.cloud.AbstractFullDistribZkTestBase.waitForThingsToLevelOut(AbstractFullDistribZkTestBase.java:1130)
	at org.apache.solr.cloud.SyncSliceTest.doTest(SyncSliceTest.java:162)
	at org.apache.solr.BaseDistributedSearchTestCase.testDistribSearch(BaseDistributedSearchTestCase.java:691)
	at sun.reflect.NativeMethodAccessorImpl.invoke0(Native Method)
	at sun.reflect.NativeMethodAccessorImpl.invoke(NativeMethodAccessorImpl.java:57)
	at sun.reflect.DelegatingMethodAccessorImpl.invoke(DelegatingMethodAccessorImpl.java:43)
	at java.lang.reflect.Method.invoke(Method.java:616)
	at com.carrotsearch.randomizedtesting.RandomizedRunner.invoke(RandomizedRunner.java:1559)
	at com.carrotsearch.randomizedtesting.RandomizedRunner.access$600(RandomizedRunner.java:79)
	at com.carrotsearch.randomizedtesting.RandomizedRunner$6.evaluate(RandomizedRunner.java:737)
	at com.carrotsearch.randomizedtesting.RandomizedRunner$7.evaluate(RandomizedRunner.java:773)
	at com.carrotsearch.randomizedtesting.RandomizedRunner$8.evaluate(RandomizedRunner.java:787)
	at com.carrotsearch.randomizedtesting.rules.SystemPropertiesRestoreRule$1.evaluate(SystemPropertiesRestoreRule.java:53)
	at org.apache.lucene.util.TestRuleSetupTeardownChained$1.evaluate(TestRuleSetupTeardownChained.java:50)
	at org.apache.lucene.util.TestRuleFieldCacheSanity$1.evaluate(TestRuleFieldCacheSanity.java:51)
	at org.apache.lucene.util.AbstractBeforeAfterRule$1.evaluate(AbstractBeforeAfterRule.java:45)
	at com.carrotsearch.randomizedtesting.rules.SystemPropertiesInvariantRule$1.evaluate(SystemPropertiesInvariantRule.java:55)
	at org.apache.lucene.util.TestRuleThreadAndTestName$1.evaluate(TestRuleThreadAndTestName.java:48)
	at org.apache.lucene.util.TestRuleIgnoreAfterMaxFailures$1.evaluate(TestRuleIgnoreAfterMaxFailures.java:70)
	at org.apache.lucene.util.TestRuleMarkFailure$1.evaluate(TestRuleMarkFailure.java:48)
	at com.carrotsearch.randomizedtesting.rules.StatementAdapter.evaluate(StatementAdapter.java:36)
	at com.carrotsearch.randomizedtesting.ThreadLeakControl$StatementRunner.run(ThreadLeakControl.java:358)
	at com.carrotsearch.randomizedtesting.ThreadLeakControl.forkTimeoutingTask(ThreadLeakControl.java:782)
	at com.carrotsearch.randomizedtesting.ThreadLeakControl$3.evaluate(ThreadLeakControl.java:442)
	at com.carrotsearch.randomizedtesting.RandomizedRunner.runSingleTest(RandomizedRunner.java:746)
	at com.carrotsearch.randomizedtesting.RandomizedRunner$3.evaluate(RandomizedRunner.java:648)
	at com.carrotsearch.randomizedtesting.RandomizedRunner$4.evaluate(RandomizedRunner.java:682)
	at com.carrotsearch.randomizedtesting.RandomizedRunner$5.evaluate(RandomizedRunner.java:693)
	at com.carrotsearch.randomizedtesting.rules.StatementAdapter.evaluate(StatementAdapter.java:36)
	at com.carrotsearch.randomizedtesting.rules.SystemPropertiesRestoreRule$1.evaluate(SystemPropertiesRestoreRule.java:53)
	at org.apache.lucene.util.AbstractBeforeAfterRule$1.evaluate(AbstractBeforeAfterRule.java:45)
	at org.apache.lucene.util.TestRuleStoreClassName$1.evaluate(TestRuleStoreClassName.java:42)
	at com.carrotsearch.randomizedtesting.rules.SystemPropertiesInvariantRule$1.evaluate(SystemPropertiesInvariantRule.java:55)
	at com.carrotsearch.randomizedtesting.rules.NoShadowingOrOverridesOnMethodsRule$1.evaluate(NoShadowingOrOverridesOnMethodsRule.java:39)
	at com.carrotsearch.randomizedtesting.rules.NoShadowingOrOverridesOnMethodsRule$1.evaluate(NoShadowingOrOverridesOnMethodsRule.java:39)
	at com.carrotsearch.randomizedtesting.rules.StatementAdapter.evaluate(StatementAdapter.java:36)
	at org.apache.lucene.util.TestRuleAssertionsRequired$1.evaluate(TestRuleAssertionsRequired.java:43)
	at org.apache.lucene.util.TestRuleMarkFailure$1.evaluate(TestRuleMarkFailure.java:48)
	at org.apache.lucene.util.TestRuleIgnoreAfterMaxFailures$1.evaluate(TestRuleIgnoreAfterMaxFailures.java:70)
	at org.apache.lucene.util.TestRuleIgnoreTestSuites$1.evaluate(TestRuleIgnoreTestSuites.java:55)
	at com.carrotsearch.randomizedtesting.rules.StatementAdapter.evaluate(StatementAdapter.java:36)
	at com.carrotsearch.randomizedtesting.ThreadLeakControl$StatementRunner.run(ThreadLeakControl.java:358)
	at java.lang.Thread.run(Thread.java:679)




Build Log:
[...truncated 4703 lines...]
      [mvn] 201 T3 oasc.SolrCore.finalize SEVERE REFCOUNT ERROR: unreferenced org.apache.solr.core.SolrCore@7fa69b6 (col_bad) has a reference count of 1
      [mvn] Tests run: 2, Failures: 0, Errors: 0, Skipped: 0, Time elapsed: 0.226 sec
      [mvn] Running org.apache.solr.highlight.FastVectorHighlighterTest
      [mvn] Creating dataDir: /usr/home/hudson/hudson-slave/workspace/Lucene-Solr-Maven-trunk/maven-build/solr/core/src/test/target/test/./solrtest-FastVectorHighlighterTest-1347726143135
      [mvn] Tests run: 2, Failures: 0, Errors: 0, Skipped: 0, Time elapsed: 0.587 sec
      [mvn] Running org.apache.solr.internal.csv.CSVPrinterTest
      [mvn] Tests run: 6, Failures: 0, Errors: 0, Skipped: 0, Time elapsed: 0.514 sec
      [mvn] Running org.apache.solr.spelling.suggest.SuggesterTest
      [mvn] Creating dataDir: /usr/home/hudson/hudson-slave/workspace/Lucene-Solr-Maven-trunk/maven-build/solr/core/src/test/target/test/./solrtest-SuggesterTest-1347726144240
      [mvn] NOTE: per solr.test.leavedatadir, dataDir will not be removed: /usr/home/hudson/hudson-slave/workspace/Lucene-Solr-Maven-trunk/maven-build/solr/core/src/test/target/test/./solrtest-SuggesterTest-1347726144240
      [mvn] Tests run: 4, Failures: 0, Errors: 0, Skipped: 0, Time elapsed: 0.975 sec
      [mvn] Running org.apache.solr.cloud.ZkNodePropsTest
      [mvn] Tests run: 1, Failures: 0, Errors: 0, Skipped: 0, Time elapsed: 0.018 sec
      [mvn] Running org.apache.solr.schema.PreAnalyzedFieldTest
      [mvn] Tests run: 3, Failures: 0, Errors: 0, Skipped: 0, Time elapsed: 0.042 sec
      [mvn] Running org.apache.solr.search.function.SortByFunctionTest
      [mvn] Tests run: 2, Failures: 0, Errors: 0, Skipped: 0, Time elapsed: 0.929 sec
      [mvn] Running org.apache.solr.highlight.HighlighterConfigTest
      [mvn] Tests run: 1, Failures: 0, Errors: 0, Skipped: 0, Time elapsed: 0.434 sec
      [mvn] Running org.apache.solr.search.similarities.TestDFRSimilarityFactory
      [mvn] Creating dataDir: /usr/home/hudson/hudson-slave/workspace/Lucene-Solr-Maven-trunk/maven-build/solr/core/src/test/target/test/./solrtest-TestDFRSimilarityFactory-1347726146642
      [mvn] Tests run: 3, Failures: 0, Errors: 0, Skipped: 0, Time elapsed: 0.112 sec
      [mvn] Running org.apache.solr.util.TestFastOutputStream
      [mvn] Tests run: 1, Failures: 0, Errors: 0, Skipped: 0, Time elapsed: 0.282 sec
      [mvn] Running org.apache.solr.handler.JsonLoaderTest
      [mvn] Creating dataDir: /usr/home/hudson/hudson-slave/workspace/Lucene-Solr-Maven-trunk/maven-build/solr/core/src/test/target/test/./solrtest-JsonLoaderTest-1347726147041
      [mvn] Tests run: 6, Failures: 0, Errors: 0, Skipped: 0, Time elapsed: 0.544 sec
      [mvn] Running org.apache.solr.internal.csv.CSVStrategyTest
      [mvn] Tests run: 5, Failures: 0, Errors: 0, Skipped: 0, Time elapsed: 0 sec
      [mvn] Running org.apache.solr.core.SOLR749Test
      [mvn] Creating dataDir: /usr/home/hudson/hudson-slave/workspace/Lucene-Solr-Maven-trunk/maven-build/solr/core/src/test/target/test/./solrtest-SOLR749Test-1347726147584
      [mvn] Tests run: 1, Failures: 0, Errors: 0, Skipped: 0, Time elapsed: 0.405 sec
      [mvn] Running org.apache.solr.response.TestCSVResponseWriter
      [mvn] Creating dataDir: /usr/home/hudson/hudson-slave/workspace/Lucene-Solr-Maven-trunk/maven-build/solr/core/src/test/target/test/./solrtest-TestCSVResponseWriter-1347726147992
      [mvn] Tests run: 1, Failures: 0, Errors: 0, Skipped: 0, Time elapsed: 0.528 sec
      [mvn] Running org.apache.solr.MinimalSchemaTest
      [mvn] Creating dataDir: /usr/home/hudson/hudson-slave/workspace/Lucene-Solr-Maven-trunk/maven-build/solr/core/src/test/target/test/./solrtest-MinimalSchemaTest-1347726148522
      [mvn] Tests run: 3, Failures: 0, Errors: 0, Skipped: 0, Time elapsed: 0.462 sec
      [mvn] Running org.apache.solr.search.TestFiltering
      [mvn] Creating dataDir: /usr/home/hudson/hudson-slave/workspace/Lucene-Solr-Maven-trunk/maven-build/solr/core/src/test/target/test/./solrtest-TestFiltering-1347726148995
      [mvn] Tests run: 2, Failures: 0, Errors: 0, Skipped: 0, Time elapsed: 2.103 sec
      [mvn] Running org.apache.solr.servlet.DirectSolrConnectionTest
      [mvn] Tests run: 2, Failures: 0, Errors: 0, Skipped: 0, Time elapsed: 0.179 sec
      [mvn] Running org.apache.solr.search.TestSurroundQueryParser
      [mvn] Tests run: 1, Failures: 0, Errors: 0, Skipped: 0, Time elapsed: 0.384 sec
      [mvn] Running org.apache.solr.request.TestWriterPerf
      [mvn] Tests run: 1, Failures: 0, Errors: 0, Skipped: 0, Time elapsed: 0.711 sec
      [mvn] Running org.apache.solr.search.similarities.TestPerFieldSimilarity
      [mvn] Creating dataDir: /usr/home/hudson/hudson-slave/workspace/Lucene-Solr-Maven-trunk/maven-build/solr/core/src/test/target/test/./solrtest-TestPerFieldSimilarity-1347726152361
      [mvn] Tests run: 7, Failures: 0, Errors: 0, Skipped: 0, Time elapsed: 0.099 sec
      [mvn] Running org.apache.solr.update.processor.DefaultValueUpdateProcessorTest
      [mvn] Creating dataDir: /usr/home/hudson/hudson-slave/workspace/Lucene-Solr-Maven-trunk/maven-build/solr/core/src/test/target/test/./solrtest-DefaultValueUpdateProcessorTest-1347726152460
      [mvn] Tests run: 1, Failures: 0, Errors: 0, Skipped: 0, Time elapsed: 0.442 sec
      [mvn] Running org.apache.solr.search.SpatialFilterTest
      [mvn] Creating dataDir: /usr/home/hudson/hudson-slave/workspace/Lucene-Solr-Maven-trunk/maven-build/solr/core/src/test/target/test/./solrtest-SpatialFilterTest-1347726152906
      [mvn] Tests run: 3, Failures: 0, Errors: 0, Skipped: 0, Time elapsed: 0.719 sec
      [mvn] Running org.apache.solr.schema.BadIndexSchemaTest
      [mvn] Creating dataDir: /usr/home/hudson/hudson-slave/workspace/Lucene-Solr-Maven-trunk/maven-build/solr/core/src/test/target/test/./solrtest-BadIndexSchemaTest-1347726153624
      [mvn] 52 T1879 oass.IndexSchema.readSchema SEVERE FieldType 'sim1' is configured with a similarity, but the global similarity does not support it: class org.apache.solr.search.similarities.DefaultSimilarityFactory
      [mvn] Creating dataDir: /usr/home/hudson/hudson-slave/workspace/Lucene-Solr-Maven-trunk/maven-build/solr/core/src/test/target/test/./solrtest-BadIndexSchemaTest-1347726153677
      [mvn] Creating dataDir: /usr/home/hudson/hudson-slave/workspace/Lucene-Solr-Maven-trunk/maven-build/solr/core/src/test/target/test/./solrtest-BadIndexSchemaTest-1347726153725
      [mvn] Creating dataDir: /usr/home/hudson/hudson-slave/workspace/Lucene-Solr-Maven-trunk/maven-build/solr/core/src/test/target/test/./solrtest-BadIndexSchemaTest-1347726153776
      [mvn] Creating dataDir: /usr/home/hudson/hudson-slave/workspace/Lucene-Solr-Maven-trunk/maven-build/solr/core/src/test/target/test/./solrtest-BadIndexSchemaTest-1347726153825
      [mvn] Creating dataDir: /usr/home/hudson/hudson-slave/workspace/Lucene-Solr-Maven-trunk/maven-build/solr/core/src/test/target/test/./solrtest-BadIndexSchemaTest-1347726153875
      [mvn] 309 T1879 oasc.SolrCore.initCodec SEVERE FieldType 'pulsing1' is configured with a postings format, but the codec does not support it: class org.apache.solr.core.SolrCore$3
      [mvn] Creating dataDir: /usr/home/hudson/hudson-slave/workspace/Lucene-Solr-Maven-trunk/maven-build/solr/core/src/test/target/test/./solrtest-BadIndexSchemaTest-1347726153934
      [mvn] Creating dataDir: /usr/home/hudson/hudson-slave/workspace/Lucene-Solr-Maven-trunk/maven-build/solr/core/src/test/target/test/./solrtest-BadIndexSchemaTest-1347726153985
      [mvn] Creating dataDir: /usr/home/hudson/hudson-slave/workspace/Lucene-Solr-Maven-trunk/maven-build/solr/core/src/test/target/test/./solrtest-BadIndexSchemaTest-1347726154044
      [mvn] 467 T3 oasc.CoreContainer.finalize SEVERE CoreContainer was not shutdown prior to finalize(), indicates a bug -- POSSIBLE RESOURCE LEAK!!!  instance=1408627982
      [mvn] 467 T3 oasc.SolrCore.finalize SEVERE REFCOUNT ERROR: unreferenced org.apache.solr.core.SolrCore@38ab9532 (collection1) has a reference count of 1
      [mvn] Creating dataDir: /usr/home/hudson/hudson-slave/workspace/Lucene-Solr-Maven-trunk/maven-build/solr/core/src/test/target/test/./solrtest-BadIndexSchemaTest-1347726154097
      [mvn] Creating dataDir: /usr/home/hudson/hudson-slave/workspace/Lucene-Solr-Maven-trunk/maven-build/solr/core/src/test/target/test/./solrtest-BadIndexSchemaTest-1347726154148
      [mvn] Creating dataDir: /usr/home/hudson/hudson-slave/workspace/Lucene-Solr-Maven-trunk/maven-build/solr/core/src/test/target/test/./solrtest-BadIndexSchemaTest-1347726154198
      [mvn] Creating dataDir: /usr/home/hudson/hudson-slave/workspace/Lucene-Solr-Maven-trunk/maven-build/solr/core/src/test/target/test/./solrtest-BadIndexSchemaTest-1347726154248
      [mvn] Creating dataDir: /usr/home/hudson/hudson-slave/workspace/Lucene-Solr-Maven-trunk/maven-build/solr/core/src/test/target/test/./solrtest-BadIndexSchemaTest-1347726154299
      [mvn] Creating dataDir: /usr/home/hudson/hudson-slave/workspace/Lucene-Solr-Maven-trunk/maven-build/solr/core/src/test/target/test/./solrtest-BadIndexSchemaTest-1347726154348
      [mvn] Creating dataDir: /usr/home/hudson/hudson-slave/workspace/Lucene-Solr-Maven-trunk/maven-build/solr/core/src/test/target/test/./solrtest-BadIndexSchemaTest-1347726154401
      [mvn] 829 T1879 oass.IndexSchema.readSchema SEVERE uniqueKey field (id) can not be the dest of a copyField (src=XXX)
      [mvn] Creating dataDir: /usr/home/hudson/hudson-slave/workspace/Lucene-Solr-Maven-trunk/maven-build/solr/core/src/test/target/test/./solrtest-BadIndexSchemaTest-1347726154452
      [mvn] 879 T1879 oass.IndexSchema.readSchema SEVERE uniqueKey field (null) can not be configured with a default value (XXX)
      [mvn] Creating dataDir: /usr/home/hudson/hudson-slave/workspace/Lucene-Solr-Maven-trunk/maven-build/solr/core/src/test/target/test/./solrtest-BadIndexSchemaTest-1347726154502
      [mvn] 929 T1879 oass.IndexSchema.readSchema SEVERE uniqueKey field (null) can not be configured to be multivalued
      [mvn] Tests run: 10, Failures: 0, Errors: 0, Skipped: 0, Time elapsed: 0.942 sec
      [mvn] Running org.apache.solr.cloud.BasicDistributedZk2Test
      [mvn] Creating dataDir: /usr/home/hudson/hudson-slave/workspace/Lucene-Solr-Maven-trunk/maven-build/solr/core/src/test/target/test/./solrtest-BasicDistributedZk2Test-1347726154571
      [mvn] ASYNC  NEW_CORE C4 name=collection1 org.apache.solr.core.SolrCore@7ec8af8e url=http://127.0.0.1:37982/solr/collection1 node=127.0.0.1:37982_solr
      [mvn] 43537 T1893 C4 P37982 oasc.SolrException.log SEVERE org.apache.solr.common.SolrException: Document is missing mandatory uniqueKey field: id
      [mvn] 		at org.apache.solr.update.AddUpdateCommand.getHashableId(AddUpdateCommand.java:132)
      [mvn] 		at org.apache.solr.update.processor.DistributedUpdateProcessor.hash(DistributedUpdateProcessor.java:1060)
      [mvn] 		at org.apache.solr.update.processor.DistributedUpdateProcessor.processAdd(DistributedUpdateProcessor.java:316)
      [mvn] 		at org.apache.solr.handler.loader.XMLLoader.processUpdate(XMLLoader.java:230)
      [mvn] 		at org.apache.solr.handler.loader.XMLLoader.load(XMLLoader.java:157)
      [mvn] 		at org.apache.solr.handler.UpdateRequestHandler$1.load(UpdateRequestHandler.java:92)
      [mvn] 		at org.apache.solr.handler.ContentStreamHandlerBase.handleRequestBody(ContentStreamHandlerBase.java:74)
      [mvn] 		at org.apache.solr.handler.RequestHandlerBase.handleRequest(RequestHandlerBase.java:129)
      [mvn] 		at org.apache.solr.core.SolrCore.execute(SolrCore.java:1701)
      [mvn] 		at org.apache.solr.servlet.SolrDispatchFilter.execute(SolrDispatchFilter.java:455)
      [mvn] 		at org.apache.solr.servlet.SolrDispatchFilter.doFilter(SolrDispatchFilter.java:276)
      [mvn] 		at org.eclipse.jetty.servlet.ServletHandler$CachedChain.doFilter(ServletHandler.java:1337)
      [mvn] 		at org.eclipse.jetty.servlet.ServletHandler.doHandle(ServletHandler.java:484)
      [mvn] 		at org.eclipse.jetty.server.session.SessionHandler.doHandle(SessionHandler.java:231)
      [mvn] 		at org.eclipse.jetty.server.handler.ScopedHandler.handle(ScopedHandler.java:119)
      [mvn] 		at org.eclipse.jetty.server.handler.GzipHandler.handle(GzipHandler.java:267)
      [mvn] 		at org.eclipse.jetty.server.handler.ContextHandler.doHandle(ContextHandler.java:1067)
      [mvn] 		at org.eclipse.jetty.servlet.ServletHandler.doScope(ServletHandler.java:413)
      [mvn] 		at org.eclipse.jetty.server.session.SessionHandler.doScope(SessionHandler.java:192)
      [mvn] 		at org.eclipse.jetty.server.handler.ContextHandler.doScope(ContextHandler.java:999)
      [mvn] 		at org.eclipse.jetty.server.handler.ScopedHandler.handle(ScopedHandler.java:117)
      [mvn] 		at org.eclipse.jetty.server.handler.HandlerWrapper.handle(HandlerWrapper.java:111)
      [mvn] 		at org.eclipse.jetty.server.Server.handle(Server.java:351)
      [mvn] 		at org.eclipse.jetty.server.AbstractHttpConnection.handleRequest(AbstractHttpConnection.java:454)
      [mvn] 		at org.eclipse.jetty.server.BlockingHttpConnection.handleRequest(BlockingHttpConnection.java:47)
      [mvn] 		at org.eclipse.jetty.server.AbstractHttpConnection.content(AbstractHttpConnection.java:900)
      [mvn] 		at org.eclipse.jetty.server.AbstractHttpConnection$RequestHandler.content(AbstractHttpConnection.java:954)
      [mvn] 		at org.eclipse.jetty.http.HttpParser.parseNext(HttpParser.java:952)
      [mvn] 		at org.eclipse.jetty.http.HttpParser.parseAvailable(HttpParser.java:235)
      [mvn] 		at org.eclipse.jetty.server.BlockingHttpConnection.handle(BlockingHttpConnection.java:66)
      [mvn] 		at org.eclipse.jetty.server.bio.SocketConnector$ConnectorEndPoint.run(SocketConnector.java:254)
      [mvn] 		at org.eclipse.jetty.util.thread.QueuedThreadPool.runJob(QueuedThreadPool.java:599)
      [mvn] 		at org.eclipse.jetty.util.thread.QueuedThreadPool$3.run(QueuedThreadPool.java:534)
      [mvn] 		at java.lang.Thread.run(Thread.java:679)
      [mvn] 	
      [mvn] Tests run: 1, Failures: 0, Errors: 0, Skipped: 0, Time elapsed: 45.728 sec
      [mvn] Running org.apache.solr.schema.PolyFieldTest
      [mvn] Creating dataDir: /usr/home/hudson/hudson-slave/workspace/Lucene-Solr-Maven-trunk/maven-build/solr/core/src/test/target/test/./solrtest-PolyFieldTest-1347726200301
      [mvn] Tests run: 4, Failures: 0, Errors: 0, Skipped: 0, Time elapsed: 0.8 sec
      [mvn] Running org.apache.solr.update.DocumentBuilderTest
      [mvn] Creating dataDir: /usr/home/hudson/hudson-slave/workspace/Lucene-Solr-Maven-trunk/maven-build/solr/core/src/test/target/test/./solrtest-DocumentBuilderTest-1347726201100
      [mvn] Tests run: 11, Failures: 0, Errors: 0, Skipped: 0, Time elapsed: 0.568 sec
      [mvn] Running org.apache.solr.core.TestPropInjectDefaults
      [mvn] Creating dataDir: /usr/home/hudson/hudson-slave/workspace/Lucene-Solr-Maven-trunk/maven-build/solr/core/src/test/target/test/./solrtest-TestPropInjectDefaults-1347726201669
      [mvn] Tests run: 2, Failures: 0, Errors: 0, Skipped: 0, Time elapsed: 0.412 sec
      [mvn] Running org.apache.solr.analysis.PathHierarchyTokenizerFactoryTest
      [mvn] Creating dataDir: /usr/home/hudson/hudson-slave/workspace/Lucene-Solr-Maven-trunk/maven-build/solr/core/src/test/target/test/./solrtest-PathHierarchyTokenizerFactoryTest-1347726202081
      [mvn] Tests run: 2, Failures: 0, Errors: 0, Skipped: 0, Time elapsed: 0.733 sec
      [mvn] Running org.apache.solr.handler.admin.MBeansHandlerTest
      [mvn] Creating dataDir: /usr/home/hudson/hudson-slave/workspace/Lucene-Solr-Maven-trunk/maven-build/solr/core/src/test/target/test/./solrtest-MBeansHandlerTest-1347726202816
      [mvn] Tests run: 1, Failures: 0, Errors: 0, Skipped: 0, Time elapsed: 0.517 sec
      [mvn] Running org.apache.solr.schema.UUIDFieldTest
      [mvn] Tests run: 1, Failures: 0, Errors: 0, Skipped: 0, Time elapsed: 0.022 sec
      [mvn] Running org.apache.solr.schema.RequiredFieldsTest
      [mvn] Creating dataDir: /usr/home/hudson/hudson-slave/workspace/Lucene-Solr-Maven-trunk/maven-build/solr/core/src/test/target/test/./solrtest-RequiredFieldsTest-1347726203357
      [mvn] Tests run: 3, Failures: 0, Errors: 0, Skipped: 0, Time elapsed: 0.466 sec
      [mvn] Running org.apache.solr.search.TestStressReorder
      [mvn] Creating dataDir: /usr/home/hudson/hudson-slave/workspace/Lucene-Solr-Maven-trunk/maven-build/solr/core/src/test/target/test/./solrtest-TestStressReorder-1347726203825
      [mvn] Tests run: 1, Failures: 0, Errors: 0, Skipped: 0, Time elapsed: 2.339 sec
      [mvn] Running org.apache.solr.search.TestRealTimeGet
      [mvn] Creating dataDir: /usr/home/hudson/hudson-slave/workspace/Lucene-Solr-Maven-trunk/maven-build/solr/core/src/test/target/test/./solrtest-TestRealTimeGet-1347726206173
      [mvn] Tests run: 4, Failures: 0, Errors: 0, Skipped: 0, Time elapsed: 2.319 sec
      [mvn] Running org.apache.solr.search.TestElisionMultitermQuery
      [mvn] Creating dataDir: /usr/home/hudson/hudson-slave/workspace/Lucene-Solr-Maven-trunk/maven-build/solr/core/src/test/target/test/./solrtest-TestElisionMultitermQuery-1347726208484
      [mvn] Tests run: 1, Failures: 0, Errors: 0, Skipped: 0, Time elapsed: 0.235 sec
      [mvn] Running org.apache.solr.update.processor.FieldMutatingUpdateProcessorTest
      [mvn] Creating dataDir: /usr/home/hudson/hudson-slave/workspace/Lucene-Solr-Maven-trunk/maven-build/solr/core/src/test/target/test/./solrtest-FieldMutatingUpdateProcessorTest-1347726208724
      [mvn] Tests run: 26, Failures: 0, Errors: 0, Skipped: 0, Time elapsed: 0.547 sec
      [mvn] Running org.apache.solr.search.TestStressVersions
      [mvn] Creating dataDir: /usr/home/hudson/hudson-slave/workspace/Lucene-Solr-Maven-trunk/maven-build/solr/core/src/test/target/test/./solrtest-TestStressVersions-1347726209269
      [mvn] Tests run: 1, Failures: 0, Errors: 0, Skipped: 0, Time elapsed: 1.681 sec
      [mvn] Running org.apache.solr.TestRandomFaceting
      [mvn] Creating dataDir: /usr/home/hudson/hudson-slave/workspace/Lucene-Solr-Maven-trunk/maven-build/solr/core/src/test/target/test/./solrtest-TestRandomFaceting-1347726210950
      [mvn] Tests run: 1, Failures: 0, Errors: 0, Skipped: 0, Time elapsed: 19.398 sec
      [mvn] Running org.apache.solr.search.TestQueryUtils
      [mvn] Tests run: 1, Failures: 0, Errors: 0, Skipped: 0, Time elapsed: 0.442 sec
      [mvn] Running org.apache.solr.internal.csv.writer.CSVWriterTest
      [mvn] Tests run: 2, Failures: 0, Errors: 0, Skipped: 0, Time elapsed: 0.002 sec
      [mvn] Running org.apache.solr.update.DirectUpdateHandlerTest
      [mvn] Creating dataDir: /usr/home/hudson/hudson-slave/workspace/Lucene-Solr-Maven-trunk/maven-build/solr/core/src/test/target/test/./solrtest-DirectUpdateHandlerTest-1347726230799
      [mvn] Creating dataDir: /usr/home/hudson/hudson-slave/workspace/Lucene-Solr-Maven-trunk/maven-build/solr/core/src/test/target/test/./solrtest-DirectUpdateHandlerTest-1347726231121
      [mvn] Creating dataDir: /usr/home/hudson/hudson-slave/workspace/Lucene-Solr-Maven-trunk/maven-build/solr/core/src/test/target/test/./solrtest-DirectUpdateHandlerTest-1347726231793
      [mvn] Tests run: 6, Failures: 0, Errors: 0, Skipped: 0, Time elapsed: 1.601 sec
      [mvn] Running org.apache.solr.cloud.BasicZkTest
      [mvn] azt beforeclass
      [mvn] Creating dataDir: /usr/home/hudson/hudson-slave/workspace/Lucene-Solr-Maven-trunk/maven-build/solr/core/src/test/target/test/./solrtest-BasicZkTest-1347726232398
      [mvn] 3846 T2380 oasc.CoreContainer.reload SEVERE Unable to reload core: collection1 Ignoring exception matching SAXParseException
      [mvn] Tests run: 1, Failures: 0, Errors: 0, Skipped: 0, Time elapsed: 16.128 sec
      [mvn] Running org.apache.solr.schema.DateFieldTest
      [mvn] Tests run: 8, Failures: 0, Errors: 0, Skipped: 1, Time elapsed: 0.055 sec
      [mvn] Running org.apache.solr.core.TestSolrDeletionPolicy2
      [mvn] Creating dataDir: /usr/home/hudson/hudson-slave/workspace/Lucene-Solr-Maven-trunk/maven-build/solr/core/src/test/target/test/./solrtest-TestSolrDeletionPolicy2-1347726248582
      [mvn] Tests run: 1, Failures: 0, Errors: 0, Skipped: 0, Time elapsed: 0.423 sec
      [mvn] Running org.apache.solr.core.TestCodecSupport
      [mvn] Creating dataDir: /usr/home/hudson/hudson-slave/workspace/Lucene-Solr-Maven-trunk/maven-build/solr/core/src/test/target/test/./solrtest-TestCodecSupport-1347726249006
      [mvn] Tests run: 3, Failures: 0, Errors: 0, Skipped: 0, Time elapsed: 0.102 sec
      [mvn] Running org.apache.solr.cloud.ZkSolrClientTest
      [mvn] Tests run: 4, Failures: 0, Errors: 0, Skipped: 0, Time elapsed: 8.517 sec
      [mvn] Running org.apache.solr.handler.component.TermsComponentTest
      [mvn] Creating dataDir: /usr/home/hudson/hudson-slave/workspace/Lucene-Solr-Maven-trunk/maven-build/solr/core/src/test/target/test/./solrtest-TermsComponentTest-1347726257630
      [mvn] Tests run: 13, Failures: 0, Errors: 0, Skipped: 0, Time elapsed: 0.647 sec
      [mvn] Running org.apache.solr.highlight.HighlighterTest
      [mvn] Creating dataDir: /usr/home/hudson/hudson-slave/workspace/Lucene-Solr-Maven-trunk/maven-build/solr/core/src/test/target/test/./solrtest-HighlighterTest-1347726258281
      [mvn] Tests run: 27, Failures: 0, Errors: 0, Skipped: 0, Time elapsed: 1.315 sec
      [mvn] Running org.apache.solr.update.PeerSyncTest
      [mvn] Tests run: 1, Failures: 0, Errors: 0, Skipped: 0, Time elapsed: 2.17 sec
      [mvn] Running org.apache.solr.util.TestUtils
      [mvn] Tests run: 3, Failures: 0, Errors: 0, Skipped: 0, Time elapsed: 0.043 sec
      [mvn] Running org.apache.solr.spelling.TestSuggestSpellingConverter
      [mvn] Tests run: 2, Failures: 0, Errors: 0, Skipped: 0, Time elapsed: 0.041 sec
      [mvn] Running org.apache.solr.cloud.LeaderElectionIntegrationTest
      [mvn] Creating dataDir: /usr/home/hudson/hudson-slave/workspace/Lucene-Solr-Maven-trunk/maven-build/solr/core/src/test/target/test/./solrtest-LeaderElectionIntegrationTest-1347726261852
      [mvn] Creating dataDir: /usr/home/hudson/hudson-slave/workspace/Lucene-Solr-Maven-trunk/maven-build/solr/core/src/test/target/test/./solrtest-LeaderElectionIntegrationTest-1347726270964
      [mvn] Tests run: 2, Failures: 0, Errors: 0, Skipped: 0, Time elapsed: 22.786 sec
      [mvn] Running org.apache.solr.schema.TestCollationField
      [mvn] Creating dataDir: /usr/home/hudson/hudson-slave/workspace/Lucene-Solr-Maven-trunk/maven-build/solr/core/src/test/target/test/./solrtest-TestCollationField-1347726284676
      [mvn] Tests run: 8, Failures: 0, Errors: 0, Skipped: 0, Time elapsed: 0.315 sec
      [mvn] Running org.apache.solr.handler.component.TermVectorComponentTest
      [mvn] Creating dataDir: /usr/home/hudson/hudson-slave/workspace/Lucene-Solr-Maven-trunk/maven-build/solr/core/src/test/target/test/./solrtest-TermVectorComponentTest-1347726284953
      [mvn] Tests run: 3, Failures: 0, Errors: 0, Skipped: 0, Time elapsed: 0.623 sec
      [mvn] Running org.apache.solr.analysis.TestCharFilters
      [mvn] Creating dataDir: /usr/home/hudson/hudson-slave/workspace/Lucene-Solr-Maven-trunk/maven-build/solr/core/src/test/target/test/./solrtest-TestCharFilters-1347726285576
      [mvn] Tests run: 2, Failures: 0, Errors: 0, Skipped: 0, Time elapsed: 0.152 sec
      [mvn] Running org.apache.solr.search.TestLRUCache
      [mvn] Tests run: 3, Failures: 0, Errors: 0, Skipped: 0, Time elapsed: 0.042 sec
      [mvn] Running org.apache.solr.schema.OpenExchangeRatesOrgProviderTest
      [mvn] Tests run: 5, Failures: 0, Errors: 0, Skipped: 0, Time elapsed: 0.064 sec
      [mvn] Running org.apache.solr.request.TestRemoteStreaming
      [mvn] Creating dataDir: /usr/home/hudson/hudson-slave/workspace/Lucene-Solr-Maven-trunk/maven-build/solr/core/src/test/target/test/./solrtest-TestRemoteStreaming-1347726285868
      [mvn] Tests run: 4, Failures: 0, Errors: 0, Skipped: 0, Time elapsed: 0.689 sec
      [mvn] Running org.apache.solr.core.TestSolrDeletionPolicy1
      [mvn] Creating dataDir: /usr/home/hudson/hudson-slave/workspace/Lucene-Solr-Maven-trunk/maven-build/solr/core/src/test/target/test/./solrtest-TestSolrDeletionPolicy1-1347726286529
      [mvn] Tests run: 3, Failures: 0, Errors: 0, Skipped: 0, Time elapsed: 0.675 sec
      [mvn] Running org.apache.solr.util.TestNumberUtils
      [mvn] Tests run: 1, Failures: 0, Errors: 0, Skipped: 0, Time elapsed: 0.274 sec
      [mvn] Running org.apache.solr.handler.admin.ShowFileRequestHandlerTest
      [mvn] Creating dataDir: /usr/home/hudson/hudson-slave/workspace/Lucene-Solr-Maven-trunk/maven-build/solr/core/src/test/target/test/./solrtest-ShowFileRequestHandlerTest-1347726287481
      [mvn] Tests run: 2, Failures: 0, Errors: 0, Skipped: 0, Time elapsed: 0.889 sec
      [mvn] Running org.apache.solr.search.QueryParsingTest
      [mvn] Creating dataDir: /usr/home/hudson/hudson-slave/workspace/Lucene-Solr-Maven-trunk/maven-build/solr/core/src/test/target/test/./solrtest-QueryParsingTest-1347726288370
      [mvn] Tests run: 4, Failures: 0, Errors: 0, Skipped: 0, Time elapsed: 0.511 sec
      [mvn] Running org.apache.solr.EchoParamsTest
      [mvn] Creating dataDir: /usr/home/hudson/hudson-slave/workspace/Lucene-Solr-Maven-trunk/maven-build/solr/core/src/test/target/test/./solrtest-EchoParamsTest-1347726288882
      [mvn] Tests run: 1, Failures: 0, Errors: 0, Skipped: 0, Time elapsed: 0.104 sec
      [mvn] Running org.apache.solr.update.TestIndexingPerformance
      [mvn] Tests run: 1, Failures: 0, Errors: 0, Skipped: 0, Time elapsed: 0.669 sec
      [mvn] Running org.apache.solr.spelling.SpellCheckCollatorTest
      [mvn] Creating dataDir: /usr/home/hudson/hudson-slave/workspace/Lucene-Solr-Maven-trunk/maven-build/solr/core/src/test/target/test/./solrtest-SpellCheckCollatorTest-1347726289663
      [mvn] Tests run: 7, Failures: 0, Errors: 0, Skipped: 0, Time elapsed: 0.959 sec
      [mvn] Running org.apache.solr.handler.CSVRequestHandlerTest
      [mvn] Creating dataDir: /usr/home/hudson/hudson-slave/workspace/Lucene-Solr-Maven-trunk/maven-build/solr/core/src/test/target/test/./solrtest-CSVRequestHandlerTest-1347726290616
      [mvn] Tests run: 1, Failures: 0, Errors: 0, Skipped: 0, Time elapsed: 0.507 sec
      [mvn] Running org.apache.solr.handler.TestCSVLoader
      [mvn] Creating dataDir: /usr/home/hudson/hudson-slave/workspace/Lucene-Solr-Maven-trunk/maven-build/solr/core/src/test/target/test/./solrtest-TestCSVLoader-1347726291126
      [mvn] Tests run: 5, Failures: 0, Errors: 0, Skipped: 0, Time elapsed: 0.693 sec
      [mvn] Running org.apache.solr.handler.component.DistributedSpellCheckComponentTest
      [mvn] Tests run: 1, Failures: 0, Errors: 0, Skipped: 0, Time elapsed: 8.274 sec
      [mvn] Running org.apache.solr.spelling.suggest.TestPhraseSuggestions
      [mvn] Creating dataDir: /usr/home/hudson/hudson-slave/workspace/Lucene-Solr-Maven-trunk/maven-build/solr/core/src/test/target/test/./solrtest-TestPhraseSuggestions-1347726300095
      [mvn] Tests run: 1, Failures: 0, Errors: 0, Skipped: 0, Time elapsed: 0.11 sec
      [mvn] Running org.apache.solr.search.TestFastLRUCache
      [mvn] Tests run: 7, Failures: 0, Errors: 0, Skipped: 0, Time elapsed: 0.079 sec
      [mvn] Running org.apache.solr.servlet.CacheHeaderTest
      [mvn] 194 T3 oasu.ConcurrentLRUCache.finalize SEVERE ConcurrentLRUCache was not destroyed prior to finalize(), indicates a bug -- POSSIBLE RESOURCE LEAK!!!
      [mvn] Creating dataDir: /usr/home/hudson/hudson-slave/workspace/Lucene-Solr-Maven-trunk/maven-build/solr/core/src/test/target/test/./solrtest-CacheHeaderTest-1347726300291
      [mvn] Tests run: 5, Failures: 0, Errors: 0, Skipped: 0, Time elapsed: 0.688 sec
      [mvn] Running org.apache.solr.core.TestPropInject
      [mvn] Tests run: 2, Failures: 0, Errors: 0, Skipped: 0, Time elapsed: 0.762 sec
      [mvn] Running org.apache.solr.update.processor.UniqFieldsUpdateProcessorFactoryTest
      [mvn] Creating dataDir: /usr/home/hudson/hudson-slave/workspace/Lucene-Solr-Maven-trunk/maven-build/solr/core/src/test/target/test/./solrtest-UniqFieldsUpdateProcessorFactoryTest-1347726301732
      [mvn] Tests run: 1, Failures: 0, Errors: 0, Skipped: 0, Time elapsed: 0.351 sec
      [mvn] Running org.apache.solr.spelling.SpellingQueryConverterTest
      [mvn] Tests run: 5, Failures: 0, Errors: 0, Skipped: 0, Time elapsed: 0.041 sec
      [mvn] Running org.apache.solr.core.IndexReaderFactoryTest
      [mvn] Tests run: 1, Failures: 0, Errors: 0, Skipped: 0, Time elapsed: 0.416 sec
      [mvn] Running org.apache.solr.search.function.TestFunctionQuery
      [mvn] Creating dataDir: /usr/home/hudson/hudson-slave/workspace/Lucene-Solr-Maven-trunk/maven-build/solr/core/src/test/target/test/./solrtest-TestFunctionQuery-1347726302549
      [mvn] ASYNC  NEW_CORE C5 name=collection1 org.apache.solr.core.SolrCore@1dab8107
      [mvn] 1083 T2803 C5 oassf.FileFloatSource.getFloats SEVERE Error loading external value source + fileName + java.lang.NumberFormatException: For input string: ""
      [mvn] Tests run: 14, Failures: 0, Errors: 0, Skipped: 0, Time elapsed: 1.271 sec
      [mvn] Running org.apache.solr.cloud.ZkCLITest
      [mvn] Creating dataDir: /usr/home/hudson/hudson-slave/workspace/Lucene-Solr-Maven-trunk/maven-build/solr/core/src/test/target/test/./solrtest-ZkCLITest-1347726303815
      [mvn] Creating dataDir: /usr/home/hudson/hudson-slave/workspace/Lucene-Solr-Maven-trunk/maven-build/solr/core/src/test/target/test/./solrtest-ZkCLITest-1347726305687
      [mvn] Creating dataDir: /usr/home/hudson/hudson-slave/workspace/Lucene-Solr-Maven-trunk/maven-build/solr/core/src/test/target/test/./solrtest-ZkCLITest-1347726306099
      [mvn] Tests run: 3, Failures: 0, Errors: 0, Skipped: 0, Time elapsed: 4.234 sec
      [mvn] Running org.apache.solr.TestDistributedGrouping
      [mvn] Tests run: 1, Failures: 0, Errors: 0, Skipped: 0, Time elapsed: 12.875 sec
      [mvn] Running org.apache.solr.cloud.TestMultiCoreConfBootstrap
      [mvn] Creating dataDir: /usr/home/hudson/hudson-slave/workspace/Lucene-Solr-Maven-trunk/maven-build/solr/core/src/test/target/test/./solrtest-TestMultiCoreConfBootstrap-1347726320933
      [mvn] !!!! WARNING: best effort to remove /usr/home/hudson/hudson-slave/workspace/Lucene-Solr-Maven-trunk/maven-build/solr/core/src/test/target/test/./solrtest-TestMultiCoreConfBootstrap-1347726320933 FAILED !!!!!
      [mvn] Tests run: 1, Failures: 0, Errors: 0, Skipped: 0, Time elapsed: 4.009 sec
      [mvn] Running org.apache.solr.core.PluginInfoTest
      [mvn] Tests run: 9, Failures: 0, Errors: 0, Skipped: 0, Time elapsed: 0.084 sec
      [mvn] Running org.apache.solr.schema.PrimitiveFieldTypeTest
      [mvn] Tests run: 1, Failures: 0, Errors: 0, Skipped: 0, Time elapsed: 0.678 sec
      [mvn] Running org.apache.solr.update.processor.StatelessScriptUpdateProcessorFactoryTest
      [mvn] Creating dataDir: /usr/home/hudson/hudson-slave/workspace/Lucene-Solr-Maven-trunk/maven-build/solr/core/src/test/target/test/./solrtest-StatelessScriptUpdateProcessorFactoryTest-1347726325846
      [mvn] Tests run: 7, Failures: 0, Errors: 0, Skipped: 0, Time elapsed: 1.147 sec
      [mvn] Running org.apache.solr.AnalysisAfterCoreReloadTest
      [mvn] Tests run: 1, Failures: 0, Errors: 0, Skipped: 0, Time elapsed: 1.657 sec
      [mvn] Running org.apache.solr.search.TestSolrQueryParser
      [mvn] Creating dataDir: /usr/home/hudson/hudson-slave/workspace/Lucene-Solr-Maven-trunk/maven-build/solr/core/src/test/target/test/./solrtest-TestSolrQueryParser-1347726328511
      [mvn] Tests run: 1, Failures: 0, Errors: 0, Skipped: 0, Time elapsed: 0.493 sec
      [mvn] Running org.apache.solr.update.SoftAutoCommitTest
      [mvn] Tests run: 3, Failures: 0, Errors: 0, Skipped: 0, Time elapsed: 9.144 sec
      [mvn] Running org.apache.solr.util.DateMathParserTest
      [mvn] Tests run: 8, Failures: 0, Errors: 0, Skipped: 0, Time elapsed: 0.089 sec
      [mvn] Running org.apache.solr.search.TestSolrJ
      [mvn] Tests run: 1, Failures: 0, Errors: 0, Skipped: 0, Time elapsed: 0.023 sec
      [mvn] Running org.apache.solr.internal.csv.CSVUtilsTest
      [mvn] Tests run: 14, Failures: 0, Errors: 0, Skipped: 0, Time elapsed: 0.003 sec
      [mvn] Running org.apache.solr.core.TestBadConfig
      [mvn] Creating dataDir: /usr/home/hudson/hudson-slave/workspace/Lucene-Solr-Maven-trunk/maven-build/solr/core/src/test/target/test/./solrtest-TestBadConfig-1347726338269
      [mvn] Creating dataDir: /usr/home/hudson/hudson-slave/workspace/Lucene-Solr-Maven-trunk/maven-build/solr/core/src/test/target/test/./solrtest-TestBadConfig-1347726338327
      [mvn] Creating dataDir: /usr/home/hudson/hudson-slave/workspace/Lucene-Solr-Maven-trunk/maven-build/solr/core/src/test/target/test/./solrtest-TestBadConfig-1347726338345
      [mvn] 295 T3 oasc.SolrCore.finalize SEVERE REFCOUNT ERROR: unreferenced org.apache.solr.core.SolrCore@7d119f5f (collection1) has a reference count of 1
      [mvn] 296 T3 oasc.CoreContainer.finalize SEVERE CoreContainer was not shutdown prior to finalize(), indicates a bug -- POSSIBLE RESOURCE LEAK!!!  instance=656271899
      [mvn] 508 T3034 oasup.StatelessScriptUpdateProcessorFactory.inform SEVERE Unable to initialize scripts: Unable to evaluate script: currency.xml Ignoring exception matching \Qcurrency.xml\E
      [mvn] Creating dataDir: /usr/home/hudson/hudson-slave/workspace/Lucene-Solr-Maven-trunk/maven-build/solr/core/src/test/target/test/./solrtest-TestBadConfig-1347726338782
      [mvn] 730 T3 oasc.CoreContainer.finalize SEVERE CoreContainer was not shutdown prior to finalize(), indicates a bug -- POSSIBLE RESOURCE LEAK!!!  instance=1972376936
      [mvn] 911 T3034 oasup.StatelessScriptUpdateProcessorFactory.inform SEVERE Unable to initialize scripts: No ScriptEngine found by name: giberish -- supported names: js, rhino, JavaScript, javascript, ECMAScript, ecmascript Ignoring exception matching \Qgiberish\E
      [mvn] Creating dataDir: /usr/home/hudson/hudson-slave/workspace/Lucene-Solr-Maven-trunk/maven-build/solr/core/src/test/target/test/./solrtest-TestBadConfig-1347726339188
      [mvn] 1127 T3 oasc.CoreContainer.finalize SEVERE CoreContainer was not shutdown prior to finalize(), indicates a bug -- POSSIBLE RESOURCE LEAK!!!  instance=1783378921
      [mvn] 1322 T3034 oasup.StatelessScriptUpdateProcessorFactory.inform SEVERE Unable to initialize scripts: Unable to evaluate script: a-file-name-that-does-not-exist.js Ignoring exception matching \Qa-file-name-that-does-not-exist.js\E
      [mvn] Creating dataDir: /usr/home/hudson/hudson-slave/workspace/Lucene-Solr-Maven-trunk/maven-build/solr/core/src/test/target/test/./solrtest-TestBadConfig-1347726339594
      [mvn] 1500 T3 oasc.CoreContainer.finalize SEVERE CoreContainer was not shutdown prior to finalize(), indicates a bug -- POSSIBLE RESOURCE LEAK!!!  instance=588104392
      [mvn] 1609 T3034 oasu.UpdateLog.init SEVERE Unable to use updateLog: _version_field must exist in schema, using indexed="true" stored="true" and multiValued="false" (_version_ does not exist) Ignoring exception matching \Q_version_\E
      [mvn] Tests run: 6, Failures: 0, Errors: 0, Skipped: 0, Time elapsed: 1.626 sec
      [mvn] Running org.apache.solr.schema.MultiTermTest
      [mvn] Creating dataDir: /usr/home/hudson/hudson-slave/workspace/Lucene-Solr-Maven-trunk/maven-build/solr/core/src/test/target/test/./solrtest-MultiTermTest-1347726339892
      [mvn] Tests run: 3, Failures: 0, Errors: 0, Skipped: 0, Time elapsed: 0.151 sec
      [mvn] Running org.apache.solr.spelling.suggest.SuggesterWFSTTest
      [mvn] Creating dataDir: /usr/home/hudson/hudson-slave/workspace/Lucene-Solr-Maven-trunk/maven-build/solr/core/src/test/target/test/./solrtest-SuggesterWFSTTest-1347726340046
      [mvn] NOTE: per solr.test.leavedatadir, dataDir will not be removed: /usr/home/hudson/hudson-slave/workspace/Lucene-Solr-Maven-trunk/maven-build/solr/core/src/test/target/test/./solrtest-SuggesterWFSTTest-1347726340046
      [mvn] Tests run: 4, Failures: 0, Errors: 0, Skipped: 0, Time elapsed: 0.539 sec
      [mvn] Running org.apache.solr.handler.XmlUpdateRequestHandlerTest
      [mvn] Creating dataDir: /usr/home/hudson/hudson-slave/workspace/Lucene-Solr-Maven-trunk/maven-build/solr/core/src/test/target/test/./solrtest-XmlUpdateRequestHandlerTest-1347726340585
      [mvn] Tests run: 3, Failures: 0, Errors: 0, Skipped: 0, Time elapsed: 0.517 sec
      [mvn] Running org.apache.solr.util.TimeZoneUtilsTest
      [mvn] Tests run: 5, Failures: 0, Errors: 0, Skipped: 0, Time elapsed: 0.134 sec
      [mvn] Running org.apache.solr.handler.component.TermVectorComponentDistributedTest
      [mvn] Tests run: 1, Failures: 0, Errors: 0, Skipped: 0, Time elapsed: 6.017 sec
      [mvn] Running org.apache.solr.spelling.DirectSolrSpellCheckerTest
      [mvn] Creating dataDir: /usr/home/hudson/hudson-slave/workspace/Lucene-Solr-Maven-trunk/maven-build/solr/core/src/test/target/test/./solrtest-DirectSolrSpellCheckerTest-1347726347258
      [mvn] Tests run: 2, Failures: 0, Errors: 0, Skipped: 0, Time elapsed: 1.011 sec
      [mvn] Running org.apache.solr.TestGroupingSearch
      [mvn] Creating dataDir: /usr/home/hudson/hudson-slave/workspace/Lucene-Solr-Maven-trunk/maven-build/solr/core/src/test/target/test/./solrtest-TestGroupingSearch-1347726348278
      [mvn] Tests run: 12, Failures: 0, Errors: 0, Skipped: 0, Time elapsed: 2.412 sec
      [mvn] Running org.apache.solr.schema.IndexSchemaRuntimeFieldTest
      [mvn] Creating dataDir: /usr/home/hudson/hudson-slave/workspace/Lucene-Solr-Maven-trunk/maven-build/solr/core/src/test/target/test/./solrtest-IndexSchemaRuntimeFieldTest-1347726350677
      [mvn] Tests run: 1, Failures: 0, Errors: 0, Skipped: 0, Time elapsed: 0.399 sec
      [mvn] Running org.apache.solr.cloud.BasicDistributedZkTest
      [mvn] Creating dataDir: /usr/home/hudson/hudson-slave/workspace/Lucene-Solr-Maven-trunk/maven-build/solr/core/src/test/target/test/./solrtest-BasicDistributedZkTest-1347726351084
      [mvn] 17353 T3298 oasc.SolrException.log SEVERE Sync Failed
      [mvn] 17382 T3302 oasc.SolrException.log SEVERE Sync Failed
      [mvn] 23610 T3330 oasc.SolrException.log SEVERE Sync Failed
      [mvn] 23630 T3329 oasc.SolrException.log SEVERE Sync Failed
      [mvn] 39463 T3192 oasc.SolrException.log SEVERE Sync Failed
      [mvn] 39933 T3321 oasc.SolrException.log SEVERE Sync Failed
      [mvn] 43649 T3192 oasc.SolrException.log SEVERE Sync Failed
      [mvn] 48678 T3237 oasc.SolrException.log SEVERE Sync Failed
      [mvn] 48679 T3225 oasc.SolrException.log SEVERE Sync Failed
      [mvn] ASYNC  NEW_CORE C6 name=awholynewcollection_0 org.apache.solr.core.SolrCore@79ab7c81 url=http://127.0.0.1:26433/solr/awholynewcollection_0 node=127.0.0.1:26433_solr
      [mvn] 93710 T3436 C6 P26433 oasc.SolrException.log SEVERE Error while trying to recover. core=awholynewcollection_0:org.apache.solr.client.solrj.SolrServerException: IOException occured when talking to server at: http://127.0.0.1:26425/solr
      [mvn] 		at org.apache.solr.client.solrj.impl.HttpSolrServer.request(HttpSolrServer.java:414)
      [mvn] 		at org.apache.solr.client.solrj.impl.HttpSolrServer.request(HttpSolrServer.java:182)
      [mvn] 		at org.apache.solr.cloud.RecoveryStrategy.sendPrepRecoveryCmd(RecoveryStrategy.java:199)
      [mvn] 		at org.apache.solr.cloud.RecoveryStrategy.doRecovery(RecoveryStrategy.java:388)
      [mvn] 		at org.apache.solr.cloud.RecoveryStrategy.run(RecoveryStrategy.java:220)
      [mvn] 	Caused by: org.apache.http.conn.ConnectTimeoutException: Connect to 127.0.0.1:26425 timed out
      [mvn] 		at org.apache.http.conn.scheme.PlainSocketFactory.connectSocket(PlainSocketFactory.java:125)
      [mvn] 		at org.apache.http.impl.conn.DefaultClientConnectionOperator.openConnection(DefaultClientConnectionOperator.java:148)
      [mvn] 		at org.apache.http.impl.conn.AbstractPoolEntry.open(AbstractPoolEntry.java:150)
      [mvn] 		at org.apache.http.impl.conn.AbstractPooledConnAdapter.open(AbstractPooledConnAdapter.java:121)
      [mvn] 		at org.apache.http.impl.client.DefaultRequestDirector.tryConnect(DefaultRequestDirector.java:575)
      [mvn] 		at org.apache.http.impl.client.DefaultRequestDirector.execute(DefaultRequestDirector.java:425)
      [mvn] 		at org.apache.http.impl.client.AbstractHttpClient.execute(AbstractHttpClient.java:820)
      [mvn] 		at org.apache.http.impl.client.AbstractHttpClient.execute(AbstractHttpClient.java:754)
      [mvn] 		at org.apache.http.impl.client.AbstractHttpClient.execute(AbstractHttpClient.java:732)
      [mvn] 		at org.apache.solr.client.solrj.impl.HttpSolrServer.request(HttpSolrServer.java:353)
      [mvn] 		... 4 more
      [mvn] 	
      [mvn] ASYNC  NEW_CORE C7 name=awholynewcollection_2 org.apache.solr.core.SolrCore@760d52c5 url=http://127.0.0.1:26430/solr/awholynewcollection_2 node=127.0.0.1:26430_solr
      [mvn] 93710 T3437 C7 P26430 oasc.SolrException.log SEVERE Error while trying to recover. core=awholynewcollection_2:org.apache.solr.client.solrj.SolrServerException: IOException occured when talking to server at: http://127.0.0.1:26425/solr
      [mvn] 		at org.apache.solr.client.solrj.impl.HttpSolrServer.request(HttpSolrServer.java:414)
      [mvn] 		at org.apache.solr.client.solrj.impl.HttpSolrServer.request(HttpSolrServer.java:182)
      [mvn] 		at org.apache.solr.cloud.RecoveryStrategy.sendPrepRecoveryCmd(RecoveryStrategy.java:199)
      [mvn] 		at org.apache.solr.cloud.RecoveryStrategy.doRecovery(RecoveryStrategy.java:388)
      [mvn] 		at org.apache.solr.cloud.RecoveryStrategy.run(RecoveryStrategy.java:220)
      [mvn] 	Caused by: org.apache.http.conn.ConnectTimeoutException: Connect to 127.0.0.1:26425 timed out
      [mvn] 		at org.apache.http.conn.scheme.PlainSocketFactory.connectSocket(PlainSocketFactory.java:125)
      [mvn] 		at org.apache.http.impl.conn.DefaultClientConnectionOperator.openConnection(DefaultClientConnectionOperator.java:148)
      [mvn] 		at org.apache.http.impl.conn.AbstractPoolEntry.open(AbstractPoolEntry.java:150)
      [mvn] 		at org.apache.http.impl.conn.AbstractPooledConnAdapter.open(AbstractPooledConnAdapter.java:121)
      [mvn] 		at org.apache.http.impl.client.DefaultRequestDirector.tryConnect(DefaultRequestDirector.java:575)
      [mvn] 		at org.apache.http.impl.client.DefaultRequestDirector.execute(DefaultRequestDirector.java:425)
      [mvn] 		at org.apache.http.impl.client.AbstractHttpClient.execute(AbstractHttpClient.java:820)
      [mvn] 		at org.apache.http.impl.client.AbstractHttpClient.execute(AbstractHttpClient.java:754)
      [mvn] 		at org.apache.http.impl.client.AbstractHttpClient.execute(AbstractHttpClient.java:732)
      [mvn] 		at org.apache.solr.client.solrj.impl.HttpSolrServer.request(HttpSolrServer.java:353)
      [mvn] 		... 4 more
      [mvn] 	
      [mvn] 93712 T3436 C6 P26433 oasc.RecoveryStrategy.doRecovery SEVERE Recovery failed - trying again... core=awholynewcollection_0
      [mvn] 93712 T3437 C7 P26430 oasc.RecoveryStrategy.doRecovery SEVERE Recovery failed - trying again... core=awholynewcollection_2
      [mvn] 93713 T3437 C7 P26430 oasc.SolrException.log SEVERE Recovery failed - max retries exceeded. core=awholynewcollection_2
      [mvn] 93713 T3437 C7 P26430 oasc.SolrException.log SEVERE Recovery failed - I give up. core=awholynewcollection_2
      [mvn] 139726 T3436 C6 P26433 oasc.SolrException.log SEVERE Error while trying to recover. core=awholynewcollection_0:org.apache.solr.client.solrj.SolrServerException: IOException occured when talking to server at: http://127.0.0.1:26425/solr
      [mvn] 		at org.apache.solr.client.solrj.impl.HttpSolrServer.request(HttpSolrServer.java:414)
      [mvn] 		at org.apache.solr.client.solrj.impl.HttpSolrServer.request(HttpSolrServer.java:182)
      [mvn] 		at org.apache.solr.cloud.RecoveryStrategy.sendPrepRecoveryCmd(RecoveryStrategy.java:199)
      [mvn] 		at org.apache.solr.cloud.RecoveryStrategy.doRecovery(RecoveryStrategy.java:388)
      [mvn] 		at org.apache.solr.cloud.RecoveryStrategy.run(RecoveryStrategy.java:220)
      [mvn] 	Caused by: org.apache.http.conn.ConnectTimeoutException: Connect to 127.0.0.1:26425 timed out
      [mvn] 		at org.apache.http.conn.scheme.PlainSocketFactory.connectSocket(PlainSocketFactory.java:125)
      [mvn] 		at org.apache.http.impl.conn.DefaultClientConnectionOperator.openConnection(DefaultClientConnectionOperator.java:148)
      [mvn] 		at org.apache.http.impl.conn.AbstractPoolEntry.open(AbstractPoolEntry.java:150)
      [mvn] 		at org.apache.http.impl.conn.AbstractPooledConnAdapter.open(AbstractPooledConnAdapter.java:121)
      [mvn] 		at org.apache.http.impl.client.DefaultRequestDirector.tryConnect(DefaultRequestDirector.java:575)
      [mvn] 		at org.apache.http.impl.client.DefaultRequestDirector.execute(DefaultRequestDirector.java:425)
      [mvn] 		at org.apache.http.impl.client.AbstractHttpClient.execute(AbstractHttpClient.java:820)
      [mvn] 		at org.apache.http.impl.client.AbstractHttpClient.execute(AbstractHttpClient.java:754)
      [mvn] 		at org.apache.http.impl.client.AbstractHttpClient.execute(AbstractHttpClient.java:732)
      [mvn] 		at org.apache.solr.client.solrj.impl.HttpSolrServer.request(HttpSolrServer.java:353)
      [mvn] 		... 4 more
      [mvn] 	
      [mvn] 139726 T3436 C6 P26433 oasc.RecoveryStrategy.doRecovery SEVERE Recovery failed - trying again... core=awholynewcollection_0
      [mvn] 139727 T3436 C6 P26433 oasc.SolrException.log SEVERE Recovery failed - max retries exceeded. core=awholynewcollection_0
      [mvn] 139727 T3436 C6 P26433 oasc.SolrException.log SEVERE Recovery failed - I give up. core=awholynewcollection_0
      [mvn] Tests run: 1, Failures: 0, Errors: 0, Skipped: 0, Time elapsed: 140.33 sec
      [mvn] Running org.apache.solr.util.FileUtilsTest
      [mvn] Tests run: 1, Failures: 0, Errors: 0, Skipped: 0, Time elapsed: 0.023 sec
      [mvn] Running org.apache.solr.OutputWriterTest
      [mvn] Creating dataDir: /usr/home/hudson/hudson-slave/workspace/Lucene-Solr-Maven-trunk/maven-build/solr/core/src/test/target/test/./solrtest-OutputWriterTest-1347726491437
      [mvn] Tests run: 5, Failures: 0, Errors: 0, Skipped: 0, Time elapsed: 0.165 sec
      [mvn] Running org.apache.solr.update.processor.SignatureUpdateProcessorFactoryTest
      [mvn] Creating dataDir: /usr/home/hudson/hudson-slave/workspace/Lucene-Solr-Maven-trunk/maven-build/solr/core/src/test/target/test/./solrtest-SignatureUpdateProcessorFactoryTest-1347726491605
      [mvn] Tests run: 6, Failures: 0, Errors: 0, Skipped: 0, Time elapsed: 0.776 sec
      [mvn] Running org.apache.solr.core.RAMDirectoryFactoryTest
      [mvn] Tests run: 1, Failures: 0, Errors: 0, Skipped: 0, Time elapsed: 0.022 sec
      [mvn] Running org.apache.solr.analysis.TestReversedWildcardFilterFactory
      [mvn] Creating dataDir: /usr/home/hudson/hudson-slave/workspace/Lucene-Solr-Maven-trunk/maven-build/solr/core/src/test/target/test/./solrtest-TestReversedWildcardFilterFactory-1347726492405
      [mvn] Tests run: 4, Failures: 0, Errors: 0, Skipped: 0, Time elapsed: 0.488 sec
      [mvn] Running org.apache.solr.internal.csv.writer.CSVConfigGuesserTest
      [mvn] Tests run: 3, Failures: 0, Errors: 0, Skipped: 0, Time elapsed: 0.002 sec
      [mvn] Running org.apache.solr.analysis.TestLuceneMatchVersion
      [mvn] Creating dataDir: /usr/home/hudson/hudson-slave/workspace/Lucene-Solr-Maven-trunk/maven-build/solr/core/src/test/target/test/./solrtest-TestLuceneMatchVersion-1347726492896
      [mvn] Tests run: 1, Failures: 0, Errors: 0, Skipped: 0, Time elapsed: 0.199 sec
      [mvn] Running org.apache.solr.util.CircularListTest
      [mvn] Tests run: 1, Failures: 0, Errors: 0, Skipped: 0, Time elapsed: 0.022 sec
      [mvn] Running org.apache.solr.core.TestJmxIntegration
      [mvn] Tests run: 3, Failures: 0, Errors: 0, Skipped: 1, Time elapsed: 0.892 sec
      [mvn] Running org.apache.solr.response.TestPHPSerializedResponseWriter
      [mvn] Creating dataDir: /usr/home/hudson/hudson-slave/workspace/Lucene-Solr-Maven-trunk/maven-build/solr/core/src/test/target/test/./solrtest-TestPHPSerializedResponseWriter-1347726494174
      [mvn] Tests run: 2, Failures: 0, Errors: 0, Skipped: 0, Time elapsed: 0.481 sec
      [mvn] Running org.apache.solr.core.TestArbitraryIndexDir
      [mvn] Tests run: 1, Failures: 0, Errors: 0, Skipped: 0, Time elapsed: 0.516 sec
      [mvn] Running org.apache.solr.handler.component.DebugComponentTest
      [mvn] Creating dataDir: /usr/home/hudson/hudson-slave/workspace/Lucene-Solr-Maven-trunk/maven-build/solr/core/src/test/target/test/./solrtest-DebugComponentTest-1347726495173
      [mvn] Tests run: 2, Failures: 0, Errors: 0, Skipped: 0, Time elapsed: 0.557 sec
      [mvn] Running org.apache.solr.ConvertedLegacyTest
      [mvn] Creating dataDir: /usr/home/hudson/hudson-slave/workspace/Lucene-Solr-Maven-trunk/maven-build/solr/core/src/test/target/test/./solrtest-ConvertedLegacyTest-1347726495731
      [mvn] Tests run: 1, Failures: 0, Errors: 0, Skipped: 0, Time elapsed: 1.721 sec
      [mvn] Running org.apache.solr.cloud.ChaosMonkeyNothingIsSafeTest
      [mvn] Tests run: 1, Failures: 0, Errors: 0, Skipped: 1, Time elapsed: 0 sec
      [mvn] Running org.apache.solr.core.TestSolrXMLSerializer
      [mvn] Tests run: 1, Failures: 0, Errors: 0, Skipped: 0, Time elapsed: 0.04 sec
      [mvn] Running org.apache.solr.SolrInfoMBeanTest
      [mvn] Creating dataDir: /usr/home/hudson/hudson-slave/workspace/Lucene-Solr-Maven-trunk/maven-build/solr/core/src/test/target/test/./solrtest-SolrInfoMBeanTest-1347726497494
      [mvn] Tests run: 1, Failures: 0, Errors: 0, Skipped: 0, Time elapsed: 0.464 sec
      [mvn] Running org.apache.solr.search.TestRangeQuery
      [mvn] Creating dataDir: /usr/home/hudson/hudson-slave/workspace/Lucene-Solr-Maven-trunk/maven-build/solr/core/src/test/target/test/./solrtest-TestRangeQuery-1347726497959
      [mvn] Tests run: 2, Failures: 0, Errors: 0, Skipped: 0, Time elapsed: 2.442 sec
      [mvn] Running org.apache.solr.update.SolrIndexConfigTest
      [mvn] Tests run: 2, Failures: 0, Errors: 0, Skipped: 0, Time elapsed: 0.282 sec
      [mvn] Running org.apache.solr.handler.component.QueryElevationComponentTest
      [mvn] Creating dataDir: /usr/home/hudson/hudson-slave/workspace/Lucene-Solr-Maven-trunk/maven-build/solr/core/src/test/target/test/./solrtest-QueryElevationComponentTest-1347726500685
      [mvn] Creating dataDir: /usr/home/hudson/hudson-slave/workspace/Lucene-Solr-Maven-trunk/maven-build/solr/core/src/test/target/test/./solrtest-QueryElevationComponentTest-1347726500989
      [mvn] Creating dataDir: /usr/home/hudson/hudson-slave/workspace/Lucene-Solr-Maven-trunk/maven-build/solr/core/src/test/target/test/./solrtest-QueryElevationComponentTest-1347726501310
      [mvn] Creating dataDir: /usr/home/hudson/hudson-slave/workspace/Lucene-Solr-Maven-trunk/maven-build/solr/core/src/test/target/test/./solrtest-QueryElevationComponentTest-1347726501580
      [mvn] Creating dataDir: /usr/home/hudson/hudson-slave/workspace/Lucene-Solr-Maven-trunk/maven-build/solr/core/src/test/target/test/./solrtest-QueryElevationComponentTest-1347726501866
      [mvn] Creating dataDir: /usr/home/hudson/hudson-slave/workspace/Lucene-Solr-Maven-trunk/maven-build/solr/core/src/test/target/test/./solrtest-QueryElevationComponentTest-1347726502140
      [mvn] Creating dataDir: /usr/home/hudson/hudson-slave/workspace/Lucene-Solr-Maven-trunk/maven-build/solr/core/src/test/target/test/./solrtest-QueryElevationComponentTest-1347726502442
      [mvn] Tests run: 7, Failures: 0, Errors: 0, Skipped: 0, Time elapsed: 1.959 sec
      [mvn] Running org.apache.solr.analysis.TestWordDelimiterFilterFactory
      [mvn] Creating dataDir: /usr/home/hudson/hudson-slave/workspace/Lucene-Solr-Maven-trunk/maven-build/solr/core/src/test/target/test/./solrtest-TestWordDelimiterFilterFactory-1347726502643
      [mvn] Tests run: 7, Failures: 0, Errors: 0, Skipped: 0, Time elapsed: 0.721 sec
      [mvn] Running org.apache.solr.core.SolrCoreCheckLockOnStartupTest
      [mvn] Creating dataDir: /usr/home/hudson/hudson-slave/workspace/Lucene-Solr-Maven-trunk/maven-build/solr/core/src/test/target/test/./solrtest-SolrCoreCheckLockOnStartupTest-1347726503366
      [mvn] 346 T3512 oasc.SolrCore.initIndex SEVERE [collection1] Solr index directory '/usr/home/hudson/hudson-slave/workspace/Lucene-Solr-Maven-trunk/maven-build/solr/core/src/test/target/test/./solrtest-SolrCoreCheckLockOnStartupTest-1347726503366/index/' is locked.  Throwing exception
      [mvn] Creating dataDir: /usr/home/hudson/hudson-slave/workspace/Lucene-Solr-Maven-trunk/maven-build/solr/core/src/test/target/test/./solrtest-SolrCoreCheckLockOnStartupTest-1347726503721
      [mvn] 574 T3 oasc.CoreContainer.finalize SEVERE CoreContainer was not shutdown prior to finalize(), indicates a bug -- POSSIBLE RESOURCE LEAK!!!  instance=1277834220
      [mvn] 575 T3 oasc.SolrCore.finalize SEVERE REFCOUNT ERROR: unreferenced org.apache.solr.core.SolrCore@66b6f204 (collection1) has a reference count of 1
      [mvn] 758 T3512 oasc.SolrCore.initIndex SEVERE [collection1] Solr index directory '/usr/home/hudson/hudson-slave/workspace/Lucene-Solr-Maven-trunk/maven-build/solr/core/src/test/target/test/./solrtest-SolrCoreCheckLockOnStartupTest-1347726503721/index/' is locked.  Throwing exception
      [mvn] Tests run: 2, Failures: 0, Errors: 0, Skipped: 0, Time elapsed: 0.773 sec
      [mvn] Running org.apache.solr.SampleTest
      [mvn] Creating dataDir: /usr/home/hudson/hudson-slave/workspace/Lucene-Solr-Maven-trunk/maven-build/solr/core/src/test/target/test/./solrtest-SampleTest-1347726504142
      [mvn] Tests run: 2, Failures: 0, Errors: 0, Skipped: 0, Time elapsed: 0.239 sec
      [mvn] Running org.apache.solr.util.SolrPluginUtilsTest
      [mvn] Creating dataDir: /usr/home/hudson/hudson-slave/workspace/Lucene-Solr-Maven-trunk/maven-build/solr/core/src/test/target/test/./solrtest-SolrPluginUtilsTest-1347726504383
      [mvn] 74 T3 oasc.SolrCore.finalize SEVERE REFCOUNT ERROR: unreferenced org.apache.solr.core.SolrCore@2190a214 (collection1) has a reference count of 1
      [mvn] 74 T3 oasc.CoreContainer.finalize SEVERE CoreContainer was not shutdown prior to finalize(), indicates a bug -- POSSIBLE RESOURCE LEAK!!!  instance=719779765
      [mvn] Tests run: 7, Failures: 0, Errors: 0, Skipped: 0, Time elapsed: 0.566 sec
      [mvn] Running org.apache.solr.search.similarities.TestLMJelinekMercerSimilarityFactory
      [mvn] Creating dataDir: /usr/home/hudson/hudson-slave/workspace/Lucene-Solr-Maven-trunk/maven-build/solr/core/src/test/target/test/./solrtest-TestLMJelinekMercerSimilarityFactory-1347726504955
      [mvn] Tests run: 2, Failures: 0, Errors: 0, Skipped: 0, Time elapsed: 0.106 sec
      [mvn] Running org.apache.solr.handler.component.DistributedQueryElevationComponentTest
      [mvn] Tests run: 1, Failures: 0, Errors: 0, Skipped: 0, Time elapsed: 1.226 sec
      [mvn] Running org.apache.solr.search.function.distance.DistanceFunctionTest
      [mvn] Creating dataDir: /usr/home/hudson/hudson-slave/workspace/Lucene-Solr-Maven-trunk/maven-build/solr/core/src/test/target/test/./solrtest-DistanceFunctionTest-1347726506284
      [mvn] Tests run: 3, Failures: 0, Errors: 0, Skipped: 0, Time elapsed: 0.616 sec
      [mvn] Running org.apache.solr.core.SolrCoreTest
      [mvn] Creating dataDir: /usr/home/hudson/hudson-slave/workspace/Lucene-Solr-Maven-trunk/maven-build/solr/core/src/test/target/test/./solrtest-SolrCoreTest-1347726506904
      [mvn] Creating dataDir: /usr/home/hudson/hudson-slave/workspace/Lucene-Solr-Maven-trunk/maven-build/solr/core/src/test/target/test/./solrtest-SolrCoreTest-1347726507393
      [mvn] Creating dataDir: /usr/home/hudson/hudson-slave/workspace/Lucene-Solr-Maven-trunk/maven-build/solr/core/src/test/target/test/./solrtest-SolrCoreTest-1347726508061
      [mvn] Creating dataDir: /usr/home/hudson/hudson-slave/workspace/Lucene-Solr-Maven-trunk/maven-build/solr/core/src/test/target/test/./solrtest-SolrCoreTest-1347726508572
      [mvn] Creating dataDir: /usr/home/hudson/hudson-slave/workspace/Lucene-Solr-Maven-trunk/maven-build/solr/core/src/test/target/test/./solrtest-SolrCoreTest-1347726510295
      [mvn] Creating dataDir: /usr/home/hudson/hudson-slave/workspace/Lucene-Solr-Maven-trunk/maven-build/solr/core/src/test/target/test/./solrtest-SolrCoreTest-1347726510768
      [mvn] Tests run: 6, Failures: 0, Errors: 0, Skipped: 0, Time elapsed: 4.469 sec
      [mvn] Running org.apache.solr.TestTrie
      [mvn] Creating dataDir: /usr/home/hudson/hudson-slave/workspace/Lucene-Solr-Maven-trunk/maven-build/solr/core/src/test/target/test/./solrtest-TestTrie-1347726511372
      [mvn] Tests run: 8, Failures: 0, Errors: 0, Skipped: 0, Time elapsed: 0.846 sec
      [mvn] Running org.apache.solr.search.similarities.TestIBSimilarityFactory
      [mvn] Creating dataDir: /usr/home/hudson/hudson-slave/workspace/Lucene-Solr-Maven-trunk/maven-build/solr/core/src/test/target/test/./solrtest-TestIBSimilarityFactory-1347726512216
      [mvn] Tests run: 2, Failures: 0, Errors: 0, Skipped: 0, Time elapsed: 0.094 sec
      [mvn] Running org.apache.solr.schema.CopyFieldTest
      [mvn] Creating dataDir: /usr/home/hudson/hudson-slave/workspace/Lucene-Solr-Maven-trunk/maven-build/solr/core/src/test/target/test/./solrtest-CopyFieldTest-1347726512312
      [mvn] Tests run: 6, Failures: 0, Errors: 0, Skipped: 0, Time elapsed: 0.571 sec
      [mvn] Running org.apache.solr.schema.NumericFieldsTest
      [mvn] Creating dataDir: /usr/home/hudson/hudson-slave/workspace/Lucene-Solr-Maven-trunk/maven-build/solr/core/src/test/target/test/./solrtest-NumericFieldsTest-1347726512883
      [mvn] Tests run: 1, Failures: 0, Errors: 0, Skipped: 0, Time elapsed: 0.244 sec
      [mvn] Running org.apache.solr.TestJoin
      [mvn] Creating dataDir: /usr/home/hudson/hudson-slave/workspace/Lucene-Solr-Maven-trunk/maven-build/solr/core/src/test/target/test/./solrtest-TestJoin-1347726513129
      [mvn] Tests run: 2, Failures: 0, Errors: 0, Skipped: 0, Time elapsed: 4.412 sec
      [mvn] Running org.apache.solr.schema.NotRequiredUniqueKeyTest
      [mvn] Creating dataDir: /usr/home/hudson/hudson-slave/workspace/Lucene-Solr-Maven-trunk/maven-build/solr/core/src/test/target/test/./solrtest-NotRequiredUniqueKeyTest-1347726517538
      [mvn] Tests run: 1, Failures: 0, Errors: 0, Skipped: 0, Time elapsed: 0.25 sec
      [mvn] Running org.apache.solr.update.processor.ScriptEngineTest
      [mvn] Tests run: 6, Failures: 0, Errors: 0, Skipped: 1, Time elapsed: 0.131 sec
      [mvn] Running org.apache.solr.request.TestBinaryResponseWriter
      [mvn] Tests run: 2, Failures: 0, Errors: 0, Skipped: 0, Time elapsed: 0.919 sec
      [mvn] Running org.apache.solr.spelling.suggest.SuggesterFSTTest
      [mvn] Creating dataDir: /usr/home/hudson/hudson-slave/workspace/Lucene-Solr-Maven-trunk/maven-build/solr/core/src/test/target/test/./solrtest-SuggesterFSTTest-1347726518845
      [mvn] NOTE: per solr.test.leavedatadir, dataDir will not be removed: /usr/home/hudson/hudson-slave/workspace/Lucene-Solr-Maven-trunk/maven-build/solr/core/src/test/target/test/./solrtest-SuggesterFSTTest-1347726518845
      [mvn] Tests run: 4, Failures: 0, Errors: 0, Skipped: 0, Time elapsed: 1.125 sec
      [mvn] Running org.apache.solr.search.TestValueSourceCache
      [mvn] Creating dataDir: /usr/home/hudson/hudson-slave/workspace/Lucene-Solr-Maven-trunk/maven-build/solr/core/src/test/target/test/./solrtest-TestValueSourceCache-1347726519971
      [mvn] Tests run: 2, Failures: 0, Errors: 0, Skipped: 0, Time elapsed: 0.601 sec
      [mvn] Running org.apache.solr.search.TestStressRecovery
      [mvn] Creating dataDir: /usr/home/hudson/hudson-slave/workspace/Lucene-Solr-Maven-trunk/maven-build/solr/core/src/test/target/test/./solrtest-TestStressRecovery-1347726520573
      [mvn] Tests run: 1, Failures: 0, Errors: 0, Skipped: 0, Time elapsed: 6.008 sec
      [mvn] Running org.apache.solr.internal.csv.writer.CSVConfigTest
      [mvn] Tests run: 7, Failures: 0, Errors: 0, Skipped: 0, Time elapsed: 0.001 sec
      [mvn] Running org.apache.solr.util.TestSystemIdResolver
      [mvn] Tests run: 1, Failures: 0, Errors: 0, Skipped: 0, Time elapsed: 0.033 sec
      [mvn] Running org.apache.solr.search.TestDocSet
      [mvn] Tests run: 2, Failures: 0, Errors: 0, Skipped: 0, Time elapsed: 0.634 sec
      [mvn] Running org.apache.solr.spelling.WordBreakSolrSpellCheckerTest
      [mvn] Creating dataDir: /usr/home/hudson/hudson-slave/workspace/Lucene-Solr-Maven-trunk/maven-build/solr/core/src/test/target/test/./solrtest-WordBreakSolrSpellCheckerTest-1347726527247
      [mvn] Tests run: 3, Failures: 0, Errors: 0, Skipped: 0, Time elapsed: 1.266 sec
      [mvn] Running org.apache.solr.handler.PingRequestHandlerTest
      [mvn] Creating dataDir: /usr/home/hudson/hudson-slave/workspace/Lucene-Solr-Maven-trunk/maven-build/solr/core/src/test/target/test/./solrtest-PingRequestHandlerTest-1347726528519
      [mvn] Tests run: 5, Failures: 0, Errors: 0, Skipped: 0, Time elapsed: 0.531 sec
      [mvn] Running org.apache.solr.update.processor.UpdateRequestProcessorFactoryTest
      [mvn] Tests run: 2, Failures: 0, Errors: 0, Skipped: 0, Time elapsed: 0.798 sec
      [mvn] Running org.apache.solr.search.QueryEqualityTest
      [mvn] Creating dataDir: /usr/home/hudson/hudson-slave/workspace/Lucene-Solr-Maven-trunk/maven-build/solr/core/src/test/target/test/./solrtest-QueryEqualityTest-1347726529849
      [mvn] Tests run: 60, Failures: 0, Errors: 0, Skipped: 0, Time elapsed: 0.508 sec
      [mvn] Running org.apache.solr.search.TestRecovery
      [mvn] Creating dataDir: /usr/home/hudson/hudson-slave/workspace/Lucene-Solr-Maven-trunk/maven-build/solr/core/src/test/target/test/./solrtest-TestRecovery-1347726530356
      [mvn] Tests run: 10, Failures: 0, Errors: 0, Skipped: 0, Time elapsed: 6.415 sec
      [mvn] Running org.apache.solr.cloud.ZkControllerTest
      [mvn] Creating dataDir: /usr/home/hudson/hudson-slave/workspace/Lucene-Solr-Maven-trunk/maven-build/solr/core/src/test/target/test/./solrtest-ZkControllerTest-1347726536775
      [mvn] Tests run: 2, Failures: 0, Errors: 0, Skipped: 0, Time elapsed: 3.774 sec
      [mvn] Running org.apache.solr.core.RequestHandlersTest
      [mvn] Creating dataDir: /usr/home/hudson/hudson-slave/workspace/Lucene-Solr-Maven-trunk/maven-build/solr/core/src/test/target/test/./solrtest-RequestHandlersTest-1347726540551
      [mvn] Tests run: 3, Failures: 0, Errors: 0, Skipped: 0, Time elapsed: 0.563 sec
      [mvn] Running org.apache.solr.handler.component.BadComponentTest
      [mvn] Creating dataDir: /usr/home/hudson/hudson-slave/workspace/Lucene-Solr-Maven-trunk/maven-build/solr/core/src/test/target/test/./solrtest-BadComponentTest-1347726541116
      [mvn] Tests run: 1, Failures: 0, Errors: 0, Skipped: 0, Time elapsed: 0.363 sec
      [mvn] Running org.apache.solr.DisMaxRequestHandlerTest
      [mvn] Creating dataDir: /usr/home/hudson/hudson-slave/workspace/Lucene-Solr-Maven-trunk/maven-build/solr/core/src/test/target/test/./solrtest-DisMaxRequestHandlerTest-1347726541481
      [mvn] Tests run: 2, Failures: 0, Errors: 0, Skipped: 0, Time elapsed: 0.596 sec
      [mvn] Running org.apache.solr.cloud.SyncSliceTest
      [mvn] Creating dataDir: /usr/home/hudson/hudson-slave/workspace/Lucene-Solr-Maven-trunk/maven-build/solr/core/src/test/target/test/./solrtest-SyncSliceTest-1347726542089
      [mvn] check const of shard1
      [mvn] client0
      [mvn] PROPS:shard=shard1
      [mvn] roles=null
      [mvn] leader=true
      [mvn] state=active
      [mvn] core=collection1
      [mvn] collection=collection1
      [mvn] node_name=127.0.0.1:17714_solr
      [mvn] base_url=http://127.0.0.1:17714/solr
      [mvn] 
      [mvn]  live:true
      [mvn]  num:4
      [mvn] 
      [mvn] client1
      [mvn] PROPS:shard=shard1
      [mvn] roles=null
      [mvn] state=active
      [mvn] core=collection1
      [mvn] collection=collection1
      [mvn] node_name=127.0.0.1:41605_solr
      [mvn] base_url=http://127.0.0.1:41605/solr
      [mvn] 
      [mvn]  live:true
      [mvn]  num:2
      [mvn] 
      [mvn] ######shard1 is not consistent.  Got 4 from http://127.0.0.1:17714/solr/collection1lastClient and got 2 from http://127.0.0.1:41605/solr/collection1
      [mvn] ######http://127.0.0.1:17714/solr/collection1: {numFound=4,start=0,docs=[SolrDocument{id=0, _version_=1413193720352735232}, SolrDocument{id=1, _version_=1413193720363220992}, SolrDocument{id=2, _version_=1413193720372658176}, SolrDocument{id=3, _version_=1413193720382095360}]}
      [mvn] ######http://127.0.0.1:41605/solr/collection1: {numFound=2,start=0,docs=[SolrDocument{id=0, _version_=1413193720352735232}, SolrDocument{id=1, _version_=1413193720363220992}]}
      [mvn] ###### sizes=4,2
      [mvn] ###### Only in http://127.0.0.1:17714/solr/collection1: [{id=2, _version_=1413193720372658176}, {id=3, _version_=1413193720382095360}]
      [mvn] client2
      [mvn] PROPS:shard=shard1
      [mvn] roles=null
      [mvn] state=active
      [mvn] core=collection1
      [mvn] collection=collection1
      [mvn] node_name=127.0.0.1:43729_solr
      [mvn] base_url=http://127.0.0.1:43729/solr
      [mvn] 
      [mvn]  live:true
      [mvn]  num:3
      [mvn] 
      [mvn] client3
      [mvn] PROPS:shard=shard1
      [mvn] roles=null
      [mvn] state=active
      [mvn] core=collection1
      [mvn] collection=collection1
      [mvn] node_name=127.0.0.1:41571_solr
      [mvn] base_url=http://127.0.0.1:41571/solr
      [mvn] 
      [mvn]  live:true
      [mvn]  num:4
      [mvn] 
      [mvn] Control Docs:4
      [mvn] check const of shard1
      [mvn] client0
      [mvn] PROPS:shard=shard1
      [mvn] roles=null
      [mvn] leader=true
      [mvn] state=active
      [mvn] core=collection1
      [mvn] collection=collection1
      [mvn] node_name=127.0.0.1:17714_solr
      [mvn] base_url=http://127.0.0.1:17714/solr
      [mvn] 
      [mvn]  live:true
      [mvn]  num:4
      [mvn] 
      [mvn] client1
      [mvn] PROPS:shard=shard1
      [mvn] roles=null
      [mvn] state=active
      [mvn] core=collection1
      [mvn] collection=collection1
      [mvn] node_name=127.0.0.1:41605_solr
      [mvn] base_url=http://127.0.0.1:41605/solr
      [mvn] 
      [mvn]  live:true
      [mvn]  num:4
      [mvn] 
      [mvn] client2
      [mvn] PROPS:shard=shard1
      [mvn] roles=null
      [mvn] state=active
      [mvn] core=collection1
      [mvn] collection=collection1
      [mvn] node_name=127.0.0.1:43729_solr
      [mvn] base_url=http://127.0.0.1:43729/solr
      [mvn] 
      [mvn]  live:true
      [mvn]  num:4
      [mvn] 
      [mvn] client3
      [mvn] PROPS:shard=shard1
      [mvn] roles=null
      [mvn] state=active
      [mvn] core=collection1
      [mvn] collection=collection1
      [mvn] node_name=127.0.0.1:41571_solr
      [mvn] base_url=http://127.0.0.1:41571/solr
      [mvn] 
      [mvn]  live:true
      [mvn]  num:4
      [mvn] 
      [mvn] 45938 T3782 oasc.SolrException.log SEVERE Sync Failed
      [mvn] ASYNC  NEW_CORE C8 name=collection1 org.apache.solr.core.SolrCore@29afd77d url=http://127.0.0.1:41571/solr/collection1 node=127.0.0.1:41571_solr
      [mvn] 46988 T3805 C8 P41571 oasu.PeerSync.handleUpdates SEVERE PeerSync: core=collection1 url=http://127.0.0.1:41571/solr Error applying updates from [Ljava.lang.String;@7777a681 ,update=[1, 1413193722966835200, SolrInputDocument[id=4, a_si=50, other_tl1=50, a_t=to come to the aid of their country., rnd_b=true, _version_=1413193722966835200]] org.apache.solr.common.SolrException: No registered leader was found, collection:collection1 slice:shard1
      [mvn] 	at org.apache.solr.common.cloud.ZkStateReader.getLeaderProps(ZkStateReader.java:413)
      [mvn] 	at org.apache.solr.common.cloud.ZkStateReader.getLeaderProps(ZkStateReader.java:399)
      [mvn] 	at org.apache.solr.update.processor.DistributedUpdateProcessor.setupRequest(DistributedUpdateProcessor.java:188)
      [mvn] 	at org.apache.solr.update.processor.DistributedUpdateProcessor.processAdd(DistributedUpdateProcessor.java:317)
      [mvn] 	at org.apache.solr.update.PeerSync.handleUpdates(PeerSync.java:487)
      [mvn] 	at org.apache.solr.update.PeerSync.handleResponse(PeerSync.java:331)
      [mvn] 	at org.apache.solr.update.PeerSync.sync(PeerSync.java:266)
      [mvn] 	at org.apache.solr.handler.component.RealTimeGetComponent.processSync(RealTimeGetComponent.java:529)
      [mvn] 	at org.apache.solr.handler.component.RealTimeGetComponent.processGetVersions(RealTimeGetComponent.java:507)
      [mvn] 	at org.apache.solr.handler.component.RealTimeGetComponent.process(RealTimeGetComponent.java:91)
      [mvn] 	at org.apache.solr.handler.component.SearchHandler.handleRequestBody(SearchHandler.java:206)
      [mvn] 	at org.apache.solr.handler.RequestHandlerBase.handleRequest(RequestHandlerBase.java:129)
      [mvn] 	at org.apache.solr.core.SolrCore.execute(SolrCore.java:1701)
      [mvn] 	at org.apache.solr.servlet.SolrDispatchFilter.execute(SolrDispatchFilter.java:455)
      [mvn] 	at org.apache.solr.servlet.SolrDispatchFilter.doFilter(SolrDispatchFilter.java:276)
      [mvn] 	at org.eclipse.jetty.servlet.ServletHandler$CachedChain.doFilter(ServletHandler.java:1337)
      [mvn] 	at org.eclipse.jetty.servlet.ServletHandler.doHandle(ServletHandler.java:484)
      [mvn] 	at org.eclipse.jetty.server.session.SessionHandler.doHandle(SessionHandler.java:231)
      [mvn] 	at org.eclipse.jetty.server.handler.ScopedHandler.handle(ScopedHandler.java:119)
      [mvn] 	at org.eclipse.jetty.server.handler.GzipHandler.handle(GzipHandler.java:267)
      [mvn] 	at org.eclipse.jetty.server.handler.ContextHandler.doHandle(ContextHandler.java:1067)
      [mvn] 	at org.eclipse.jetty.servlet.ServletHandler.doScope(ServletHandler.java:413)
      [mvn] 	at org.eclipse.jetty.server.session.SessionHandler.doScope(SessionHandler.java:192)
      [mvn] 	at org.eclipse.jetty.server.handler.ContextHandler.doScope(ContextHandler.java:999)
      [mvn] 	at org.eclipse.jetty.server.handler.ScopedHandler.handle(ScopedHandler.java:117)
      [mvn] 	at org.eclipse.jetty.server.handler.HandlerWrapper.handle(HandlerWrapper.java:111)
      [mvn] 	at org.eclipse.jetty.server.Server.handle(Server.java:351)
      [mvn] 	at org.eclipse.jetty.server.AbstractHttpConnection.handleRequest(AbstractHttpConnection.java:454)
      [mvn] 	at org.eclipse.jetty.server.BlockingHttpConnection.handleRequest(BlockingHttpConnection.java:47)
      [mvn] 	at org.eclipse.jetty.server.AbstractHttpConnection.content(AbstractHttpConnection.java:900)
      [mvn] 	at org.eclipse.jetty.server.AbstractHttpConnection$RequestHandler.content(AbstractHttpConnection.java:954)
      [mvn] 	at org.eclipse.jetty.http.HttpParser.parseNext(HttpParser.java:857)
      [mvn] 	at org.eclipse.jetty.http.HttpParser.parseAvailable(HttpParser.java:235)
      [mvn] 	at org.eclipse.jetty.server.BlockingHttpConnection.handle(BlockingHttpConnection.java:66)
      [mvn] 	at org.eclipse.jetty.server.bio.SocketConnector$ConnectorEndPoint.run(SocketConnector.java:254)
      [mvn] 	at org.eclipse.jetty.util.thread.QueuedThreadPool.runJob(QueuedThreadPool.java:599)
      [mvn] 	at org.eclipse.jetty.util.thread.QueuedThreadPool$3.run(QueuedThreadPool.java:534)
      [mvn] 	at java.lang.Thread.run(Thread.java:679)
      [mvn] 
      [mvn] ######shard1 is not consistent.  Got 5 from http://127.0.0.1:43729/solr/collection1lastClient and got 4 from http://127.0.0.1:41571/solr/collection1
      [mvn] ######http://127.0.0.1:43729/solr/collection1: {numFound=5,start=0,docs=[SolrDocument{id=0, _version_=1413193720352735232}, SolrDocument{id=1, _version_=1413193720363220992}, SolrDocument{id=2, _version_=1413193720372658176}, SolrDocument{id=3, _version_=1413193720382095360}, SolrDocument{id=4, _version_=1413193722966835200}]}
      [mvn] ######http://127.0.0.1:41571/solr/collection1: {numFound=4,start=0,docs=[SolrDocument{id=0, _version_=1413193720352735232}, SolrDocument{id=1, _version_=1413193720363220992}, SolrDocument{id=2, _version_=1413193720372658176}, SolrDocument{id=3, _version_=1413193720382095360}]}
      [mvn] ###### sizes=5,4
      [mvn] ###### Only in http://127.0.0.1:43729/solr/collection1: [{id=4, _version_=1413193722966835200}]
      [mvn] ASYNC  NEW_CORE C9 name=collection1 org.apache.solr.core.SolrCore@286042dc url=http://127.0.0.1:41605/solr/collection1 node=127.0.0.1:41605_solr
      [mvn] 120966 T3835 C9 P41605 oasc.SolrException.log SEVERE Error while trying to recover. core=collection1:org.apache.solr.client.solrj.SolrServerException: IOException occured when talking to server at: http://127.0.0.1:17714/solr
      [mvn] 		at org.apache.solr.client.solrj.impl.HttpSolrServer.request(HttpSolrServer.java:414)
      [mvn] 		at org.apache.solr.client.solrj.impl.HttpSolrServer.request(HttpSolrServer.java:182)
      [mvn] 		at org.apache.solr.cloud.RecoveryStrategy.sendPrepRecoveryCmd(RecoveryStrategy.java:199)
      [mvn] 		at org.apache.solr.cloud.RecoveryStrategy.doRecovery(RecoveryStrategy.java:388)
      [mvn] 		at org.apache.solr.cloud.RecoveryStrategy.run(RecoveryStrategy.java:220)
      [mvn] 	Caused by: org.apache.http.conn.ConnectTimeoutException: Connect to 127.0.0.1:17714 timed out
      [mvn] 		at org.apache.http.conn.scheme.PlainSocketFactory.connectSocket(PlainSocketFactory.java:125)
      [mvn] 		at org.apache.http.impl.conn.DefaultClientConnectionOperator.openConnection(DefaultClientConnectionOperator.java:148)
      [mvn] 		at org.apache.http.impl.conn.AbstractPoolEntry.open(AbstractPoolEntry.java:150)
      [mvn] 		at org.apache.http.impl.conn.AbstractPooledConnAdapter.open(AbstractPooledConnAdapter.java:121)
      [mvn] 		at org.apache.http.impl.client.DefaultRequestDirector.tryConnect(DefaultRequestDirector.java:575)
      [mvn] 		at org.apache.http.impl.client.DefaultRequestDirector.execute(DefaultRequestDirector.java:425)
      [mvn] 		at org.apache.http.impl.client.AbstractHttpClient.execute(AbstractHttpClient.java:820)
      [mvn] 		at org.apache.http.impl.client.AbstractHttpClient.execute(AbstractHttpClient.java:754)
      [mvn] 		at org.apache.http.impl.client.AbstractHttpClient.execute(AbstractHttpClient.java:732)
      [mvn] 		at org.apache.solr.client.solrj.impl.HttpSolrServer.request(HttpSolrServer.java:353)
      [mvn] 		... 4 more
      [mvn] 	
      [mvn] 120967 T3835 C9 P41605 oasc.RecoveryStrategy.doRecovery SEVERE Recovery failed - trying again... core=collection1
      [mvn] 120967 T3835 C9 P41605 oasc.SolrException.log SEVERE Recovery failed - max retries exceeded. core=collection1
      [mvn] 120967 T3835 C9 P41605 oasc.SolrException.log SEVERE Recovery failed - I give up. core=collection1
      [mvn] 125908 T3835 C9 P41605 oasc.SolrException.log SEVERE Could not publish that recovery failed:org.apache.zookeeper.KeeperException$ConnectionLossException: KeeperErrorCode = ConnectionLoss for /overseer/queue/qn-
      [mvn] 		at org.apache.zookeeper.KeeperException.create(KeeperException.java:90)
      [mvn] 		at org.apache.zookeeper.KeeperException.create(KeeperException.java:42)
      [mvn] 		at org.apache.zookeeper.ZooKeeper.create(ZooKeeper.java:643)
      [mvn] 		at org.apache.solr.common.cloud.SolrZkClient$5.execute(SolrZkClient.java:256)
      [mvn] 		at org.apache.solr.common.cloud.SolrZkClient$5.execute(SolrZkClient.java:253)
      [mvn] 		at org.apache.solr.common.cloud.ZkCmdExecutor.retryOperation(ZkCmdExecutor.java:67)
      [mvn] 		at org.apache.solr.common.cloud.SolrZkClient.create(SolrZkClient.java:253)
      [mvn] 		at org.apache.solr.cloud.DistributedQueue.offer(DistributedQueue.java:236)
      [mvn] 		at org.apache.solr.cloud.ZkController.publish(ZkController.java:867)
      [mvn] 		at org.apache.solr.cloud.ZkController.publish(ZkController.java:838)
      [mvn] 		at org.apache.solr.cloud.RecoveryStrategy.recoveryFailed(RecoveryStrategy.java:112)
      [mvn] 		at org.apache.solr.cloud.RecoveryStrategy.doRecovery(RecoveryStrategy.java:466)
      [mvn] 		at org.apache.solr.cloud.RecoveryStrategy.run(RecoveryStrategy.java:220)
      [mvn] 	
      [mvn] NOTE: reproduce with: ant test  -Dtestcase=SyncSliceTest -Dtests.method=testDistribSearch -Dtests.seed=FC11FB9F56BC1271 -Dtests.locale=en_IE -Dtests.timezone=Asia/Oral -Dtests.file.encoding=ISO8859-1
      [mvn] NOTE: test params are: codec=Lucene40: {range_facet_l=PostingsFormat(name=Direct), text=PostingsFormat(name=MockSep), _version_=Pulsing40(freqCutoff=19 minBlockSize=69 maxBlockSize=179), rnd_b=PostingsFormat(name=TestBloomFilteredLucene40Postings), intDefault=Pulsing40(freqCutoff=19 minBlockSize=69 maxBlockSize=179), id=PostingsFormat(name=TestBloomFilteredLucene40Postings), timestamp=PostingsFormat(name=Direct), a_t=PostingsFormat(name=Direct), range_facet_sl=PostingsFormat(name=TestBloomFilteredLucene40Postings), range_facet_si=PostingsFormat(name=Direct), other_tl1=Pulsing40(freqCutoff=19 minBlockSize=69 maxBlockSize=179), multiDefault=PostingsFormat(name=Direct), a_si=Pulsing40(freqCutoff=19 minBlockSize=69 maxBlockSize=179)}, sim=DefaultSimilarity, locale=en_IE, timezone=Asia/Oral
      [mvn] NOTE: FreeBSD 9.0-RELEASE amd64/Sun Microsystems Inc. 1.6.0_32 (64-bit)/cpus=16,threads=1,free=125166488,total=300875776
      [mvn] NOTE: All tests run in this JVM: [TestConfig, DirectUpdateHandlerOptimizeTest, TestFastWriter, ClusterStateTest, MoreLikeThisHandlerTest, ClusterStateUpdateTest, SpellPossibilityIteratorTest, TestBM25SimilarityFactory, DocumentAnalysisRequestHandlerTest, StandardRequestHandlerTest, BasicFunctionalityTest, LoggingHandlerTest, TestHashPartitioner, TestSearchPerf, SolrRequestParserTest, IndexBasedSpellCheckerTest, DistributedTermsComponentTest, FileBasedSpellCheckerTest, AutoCommitTest, FieldAnalysisRequestHandlerTest, TestXIncludeConfig, TestQuerySenderListener, LegacyHTMLStripCharFilterTest, LeaderElectionTest, URLClassifyProcessorTest, TestDefaultSimilarityFactory, TestSort, IndexSchemaTest, SystemInfoHandlerTest, TestSolrCoreProperties, TestReplicationHandler, XsltUpdateRequestHandlerTest, TestDistributedSearch, TestBinaryField, CurrencyFieldTest, SpellCheckComponentTest, TestFoldingMultitermQuery, TestExtendedDismaxParser, TestOmitPositions, TestLMDirichletSimilarityFactory, TestReload, TestPluginEnable, UpdateParamsTest, FullSolrCloudDistribCmdsTest, StatsComponentTest, NoCacheHeaderTest, BinaryUpdateRequestHandlerTest, TestUpdate, TestStressLucene, TestLFUCache, SimpleFacetsTest, RecoveryZkTest, TestRTGBase, AlternateDirectoryTest, TestMergePolicyConfig, TestFaceting, SuggesterTSTTest, LukeRequestHandlerTest, TestQueryTypes, TestCoreContainer, OverseerTest, PrimUtilsTest, SearchHandlerTest, ReturnFieldsTest, TestJmxMonitoredMap, ResourceLoaderTest, TestPseudoReturnFields, TestDocumentBuilder, TestIndexSearcher, JSONWriterTest, SolrCmdDistributorTest, CoreAdminHandlerTest, TestQuerySenderNoQuery, DOMUtilTest, SimplePostToolTest, CoreContainerCoreInitFailuresTest, FastVectorHighlighterTest, SuggesterTest, ZkNodePropsTest, PreAnalyzedFieldTest, SortByFunctionTest, HighlighterConfigTest, TestDFRSimilarityFactory, TestFastOutputStream, JsonLoaderTest, SOLR749Test, TestCSVResponseWriter, MinimalSchemaTest, TestFiltering, DirectSolrConnectionTest, TestSurroundQueryParser, TestWriterPerf, TestPerFieldSimilarity, DefaultValueUpdateProcessorTest, SpatialFilterTest, BadIndexSchemaTest, BasicDistributedZk2Test, PolyFieldTest, DocumentBuilderTest, TestPropInjectDefaults, PathHierarchyTokenizerFactoryTest, MBeansHandlerTest, UUIDFieldTest, RequiredFieldsTest, TestStressReorder, TestRealTimeGet, TestElisionMultitermQuery, FieldMutatingUpdateProcessorTest, TestStressVersions, TestRandomFaceting, TestQueryUtils, DirectUpdateHandlerTest, BasicZkTest, DateFieldTest, TestSolrDeletionPolicy2, TestCodecSupport, ZkSolrClientTest, TermsComponentTest, HighlighterTest, PeerSyncTest, TestUtils, TestSuggestSpellingConverter, LeaderElectionIntegrationTest, TestCollationField, TermVectorComponentTest, TestCharFilters, TestLRUCache, OpenExchangeRatesOrgProviderTest, TestRemoteStreaming, TestSolrDeletionPolicy1, TestNumberUtils, ShowFileRequestHandlerTest, QueryParsingTest, EchoParamsTest, TestIndexingPerformance, SpellCheckCollatorTest, CSVRequestHandlerTest, TestCSVLoader, DistributedSpellCheckComponentTest, TestPhraseSuggestions, TestFastLRUCache, CacheHeaderTest, TestPropInject, UniqFieldsUpdateProcessorFactoryTest, SpellingQueryConverterTest, IndexReaderFactoryTest, TestFunctionQuery, ZkCLITest, TestDistributedGrouping, TestMultiCoreConfBootstrap, PluginInfoTest, PrimitiveFieldTypeTest, StatelessScriptUpdateProcessorFactoryTest, AnalysisAfterCoreReloadTest, TestSolrQueryParser, SoftAutoCommitTest, DateMathParserTest, TestSolrJ, TestBadConfig, MultiTermTest, SuggesterWFSTTest, XmlUpdateRequestHandlerTest, TimeZoneUtilsTest, TermVectorComponentDistributedTest, DirectSolrSpellCheckerTest, TestGroupingSearch, IndexSchemaRuntimeFieldTest, BasicDistributedZkTest, FileUtilsTest, OutputWriterTest, SignatureUpdateProcessorFactoryTest, RAMDirectoryFactoryTest, TestReversedWildcardFilterFactory, TestLuceneMatchVersion, CircularListTest, TestJmxIntegration, TestPHPSerializedResponseWriter, TestArbitraryIndexDir, DebugComponentTest, ConvertedLegacyTest, TestSolrXMLSerializer, SolrInfoMBeanTest, TestRangeQuery, SolrIndexConfigTest, QueryElevationComponentTest, TestWordDelimiterFilterFactory, SolrCoreCheckLockOnStartupTest, SampleTest, SolrPluginUtilsTest, TestLMJelinekMercerSimilarityFactory, DistributedQueryElevationComponentTest, DistanceFunctionTest, SolrCoreTest, TestTrie, TestIBSimilarityFactory, CopyFieldTest, NumericFieldsTest, TestJoin, NotRequiredUniqueKeyTest, ScriptEngineTest, TestBinaryResponseWriter, SuggesterFSTTest, TestValueSourceCache, TestStressRecovery, TestSystemIdResolver, TestDocSet, WordBreakSolrSpellCheckerTest, PingRequestHandlerTest, UpdateRequestProcessorFactoryTest, QueryEqualityTest, TestRecovery, ZkControllerTest, RequestHandlersTest, BadComponentTest, DisMaxRequestHandlerTest, SyncSliceTest]
      [mvn] Tests run: 1, Failures: 1, Errors: 0, Skipped: 0, Time elapsed: 141.345 sec <<< FAILURE!
      [mvn] 
      [mvn] Results :
      [mvn] 
      [mvn] Failed tests:   testDistribSearch(org.apache.solr.cloud.SyncSliceTest): There are still nodes recoverying
      [mvn] 
      [mvn] Tests run: 925, Failures: 1, Errors: 0, Skipped: 8
      [mvn] 
      [mvn] [INFO] ------------------------------------------------------------------------
      [mvn] [INFO] Building Apache Solr Core aggregator POM
      [mvn] [INFO]    task-segment: [install]
      [mvn] [INFO] ------------------------------------------------------------------------
      [mvn] [INFO] [groovy:execute {execution: generate-timestamps}]
      [mvn] [INFO] [buildnumber:create {execution: default}]
      [mvn] [INFO] [enforcer:enforce {execution: enforce-java-compat-version-and-maven-2.2.1}]
      [mvn] [INFO] [remote-resources:process {execution: default}]
      [mvn] [INFO] [bundle:manifest {execution: bundle-manifest}]
      [mvn] [WARNING] Ignoring project type pom - supportedProjectTypes = [jar, bundle]
      [mvn] [INFO] [site:attach-descriptor {execution: default-attach-descriptor}]
      [mvn] [INFO] [install:install {execution: default-install}]
      [mvn] [INFO] Installing /usr/home/hudson/hudson-slave/workspace/Lucene-Solr-Maven-trunk/maven-build/solr/core/pom.xml to /home/hudson/.m2/repository/org/apache/solr/solr-core-aggregator/5.0-SNAPSHOT/solr-core-aggregator-5.0-SNAPSHOT.pom
      [mvn] [INFO] ------------------------------------------------------------------------
      [mvn] [INFO] Building Apache Solr Solrj tests
      [mvn] [INFO]    task-segment: [install]
      [mvn] [INFO] ------------------------------------------------------------------------
      [mvn] [INFO] [groovy:execute {execution: generate-timestamps}]
      [mvn] [INFO] [buildnumber:create {execution: default}]
      [mvn] [INFO] [enforcer:enforce {execution: enforce-java-compat-version-and-maven-2.2.1}]
      [mvn] [INFO] [remote-resources:process {execution: default}]
      [mvn] [debug] execute contextualize
      [mvn] [INFO] [resources:resources {execution: default-resources}]
      [mvn] [INFO] Using 'UTF-8' encoding to copy filtered resources.
      [mvn] [INFO] skip non existing resourceDirectory /usr/home/hudson/hudson-slave/workspace/Lucene-Solr-Maven-trunk/maven-build/solr/solrj/src/test/src/main/resources
      [mvn] [INFO] Copying 3 resources
      [mvn] [INFO] [compiler:compile {execution: default-compile}]
      [mvn] [INFO] No sources to compile
      [mvn] [INFO] [bundle:manifest {execution: bundle-manifest}]
      [mvn] [debug] execute contextualize
      [mvn] [INFO] [resources:testResources {execution: default-testResources}]
      [mvn] [INFO] Using 'UTF-8' encoding to copy filtered resources.
      [mvn] [INFO] Copying 17 resources
      [mvn] [INFO] Copying 1 resource
      [mvn] [INFO] Copying 3 resources
      [mvn] [INFO] [compiler:testCompile {execution: default-testCompile}]
      [mvn] [INFO] Compiling 50 source files to /usr/home/hudson/hudson-slave/workspace/Lucene-Solr-Maven-trunk/maven-build/solr/solrj/src/test/target/test-classes
      [mvn] [INFO] [surefire:test {execution: default-test}]
      [mvn] [INFO] Surefire report directory: /usr/home/hudson/hudson-slave/workspace/Lucene-Solr-Maven-trunk/maven-build/solr/solrj/src/test/target/surefire-reports
      [mvn] 
      [mvn] -------------------------------------------------------
      [mvn]  T E S T S
      [mvn] -------------------------------------------------------
      [mvn] Running org.apache.solr.common.SolrDocumentTest
      [mvn] Tests run: 5, Failures: 0, Errors: 0, Skipped: 0, Time elapsed: 0.356 sec
      [mvn] Running org.apache.solr.client.solrj.SolrQueryTest
      [mvn] Tests run: 9, Failures: 0, Errors: 0, Skipped: 0, Time elapsed: 0.123 sec
      [mvn] Running org.apache.solr.common.util.IteratorChainTest
      [mvn] Tests run: 7, Failures: 0, Errors: 0, Skipped: 0, Time elapsed: 0.07 sec
      [mvn] Running org.apache.solr.client.solrj.embedded.SolrExampleStreamingTest
      [mvn] Creating dataDir: /usr/home/hudson/hudson-slave/workspace/Lucene-Solr-Maven-trunk/maven-build/solr/solrj/src/test/target/test/./solrtest-SolrExampleStreamingTest-1347726687946
      [mvn] Tests run: 22, Failures: 0, Errors: 0, Skipped: 0, Time elapsed: 14.672 sec
      [mvn] Running org.apache.solr.client.solrj.response.TermsResponseTest
      [mvn] Creating dataDir: /usr/home/hudson/hudson-slave/workspace/Lucene-Solr-Maven-trunk/maven-build/solr/solrj/src/test/target/test/./solrtest-TermsResponseTest-1347726702526
      [mvn] Tests run: 1, Failures: 0, Errors: 0, Skipped: 0, Time elapsed: 1.069 sec
      [mvn] Running org.apache.solr.client.solrj.embedded.MultiCoreExampleJettyTest
      [mvn] Tests run: 2, Failures: 0, Errors: 0, Skipped: 0, Time elapsed: 1.611 sec
      [mvn] Running org.apache.solr.client.solrj.TestLBHttpSolrServer
      [mvn] Tests run: 3, Failures: 0, Errors: 0, Skipped: 0, Time elapsed: 37.659 sec
      [mvn] Running org.apache.solr.client.solrj.embedded.SolrExampleStreamingBinaryTest
      [mvn] Creating dataDir: /usr/home/hudson/hudson-slave/workspace/Lucene-Solr-Maven-trunk/maven-build/solr/solrj/src/test/target/test/./solrtest-SolrExampleStreamingBinaryTest-1347726742860
      [mvn] ASYNC  NEW_CORE C0 name=collection1 org.apache.solr.core.SolrCore@31af895e
      [mvn] 10873 T226 C0 oasc.SolrException.log SEVERE org.apache.solr.common.SolrException: Document contains multiple values for uniqueKey field: id=[DOCID, DOCID2]
      [mvn] 		at org.apache.solr.update.AddUpdateCommand.getIndexedId(AddUpdateCommand.java:91)
      [mvn] 		at org.apache.solr.update.processor.DistributedUpdateProcessor.versionAdd(DistributedUpdateProcessor.java:449)
      [mvn] 		at org.apache.solr.update.processor.DistributedUpdateProcessor.processAdd(DistributedUpdateProcessor.java:326)
      [mvn] 		at org.apache.solr.handler.loader.JavabinLoader$1.update(JavabinLoader.java:86)
      [mvn] 		at org.apache.solr.client.solrj.request.JavaBinUpdateRequestCodec$1.readOuterMostDocIterator(JavaBinUpdateRequestCodec.java:140)
      [mvn] 		at org.apache.solr.client.solrj.request.JavaBinUpdateRequestCodec$1.readIterator(JavaBinUpdateRequestCodec.java:120)
      [mvn] 		at org.apache.solr.common.util.JavaBinCodec.readVal(JavaBinCodec.java:221)
      [mvn] 		at org.apache.solr.client.solrj.request.JavaBinUpdateRequestCodec$1.readNamedList(JavaBinUpdateRequestCodec.java:105)
      [mvn] 		at org.apache.solr.common.util.JavaBinCodec.readVal(JavaBinCodec.java:186)
      [mvn] 		at org.apache.solr.common.util.JavaBinCodec.unmarshal(JavaBinCodec.java:112)
      [mvn] 		at org.apache.solr.client.solrj.request.JavaBinUpdateRequestCodec.unmarshal(JavaBinUpdateRequestCodec.java:147)
      [mvn] 		at org.apache.solr.handler.loader.JavabinLoader.parseAndLoadDocs(JavabinLoader.java:96)
      [mvn] 		at org.apache.solr.handler.loader.JavabinLoader.load(JavabinLoader.java:55)
      [mvn] 		at org.apache.solr.handler.UpdateRequestHandler$1.load(UpdateRequestHandler.java:92)
      [mvn] 		at org.apache.solr.handler.ContentStreamHandlerBase.handleRequestBody(ContentStreamHandlerBase.java:74)
      [mvn] 		at org.apache.solr.handler.RequestHandlerBase.handleRequest(RequestHandlerBase.java:129)
      [mvn] 		at org.apache.solr.core.SolrCore.execute(SolrCore.java:1701)
      [mvn] 		at org.apache.solr.servlet.SolrDispatchFilter.execute(SolrDispatchFilter.java:455)
      [mvn] 		at org.apache.solr.servlet.SolrDispatchFilter.doFilter(SolrDispatchFilter.java:276)
      [mvn] 		at org.eclipse.jetty.servlet.ServletHandler$CachedChain.doFilter(ServletHandler.java:1337)
      [mvn] 		at org.eclipse.jetty.servlet.ServletHandler.doHandle(ServletHandler.java:484)
      [mvn] 		at org.eclipse.jetty.server.session.SessionHandler.doHandle(SessionHandler.java:231)
      [mvn] 		at org.eclipse.jetty.server.handler.ScopedHandler.handle(ScopedHandler.java:119)
      [mvn] 		at org.eclipse.jetty.server.handler.GzipHandler.handle(GzipHandler.java:267)
      [mvn] 		at org.eclipse.jetty.server.handler.ContextHandler.doHandle(ContextHandler.java:1067)
      [mvn] 		at org.eclipse.jetty.servlet.ServletHandler.doScope(ServletHandler.java:413)
      [mvn] 		at org.eclipse.jetty.server.session.SessionHandler.doScope(SessionHandler.java:192)
      [mvn] 		at org.eclipse.jetty.server.handler.ContextHandler.doScope(ContextHandler.java:999)
      [mvn] 		at org.eclipse.jetty.server.handler.ScopedHandler.handle(ScopedHandler.java:117)
      [mvn] 		at org.eclipse.jetty.server.handler.HandlerWrapper.handle(HandlerWrapper.java:111)
      [mvn] 		at org.eclipse.jetty.server.Server.handle(Server.java:351)
      [mvn] 		at org.eclipse.jetty.server.AbstractHttpConnection.handleRequest(AbstractHttpConnection.java:454)
      [mvn] 		at org.eclipse.jetty.server.BlockingHttpConnection.handleRequest(BlockingHttpConnection.java:47)
      [mvn] 		at org.eclipse.jetty.server.AbstractHttpConnection.content(AbstractHttpConnection.java:900)
      [mvn] 		at org.eclipse.jetty.server.AbstractHttpConnection$RequestHandler.content(AbstractHttpConnection.java:954)
      [mvn] 		at org.eclipse.jetty.http.HttpParser.parseNext(HttpParser.java:952)
      [mvn] 		at org.eclipse.jetty.http.HttpParser.parseAvailable(HttpParser.java:235)
      [mvn] 		at org.eclipse.jetty.server.BlockingHttpConnection.handle(BlockingHttpConnection.java:66)
      [mvn] 		at org.eclipse.jetty.server.bio.SocketConnector$ConnectorEndPoint.run(SocketConnector.java:254)
      [mvn] 		at org.eclipse.jetty.util.thread.QueuedThreadPool.runJob(QueuedThreadPool.java:599)
      [mvn] 		at org.eclipse.jetty.util.thread.QueuedThreadPool$3.run(QueuedThreadPool.java:534)
      [mvn] 		at java.lang.Thread.run(Thread.java:679)
      [mvn] 	
      [mvn] Tests run: 22, Failures: 0, Errors: 0, Skipped: 0, Time elapsed: 12.455 sec
      [mvn] Running org.apache.solr.client.solrj.response.DocumentAnalysisResponseTest
      [mvn] Tests run: 1, Failures: 0, Errors: 0, Skipped: 0, Time elapsed: 0.023 sec
      [mvn] Running org.apache.solr.client.solrj.impl.BasicHttpSolrServerTest
      [mvn] Creating dataDir: /usr/home/hudson/hudson-slave/workspace/Lucene-Solr-Maven-trunk/maven-build/solr/solrj/src/test/target/test/./solrtest-BasicHttpSolrServerTest-1347726755334
      [mvn] Tests run: 9, Failures: 0, Errors: 0, Skipped: 0, Time elapsed: 78.122 sec
      [mvn] Running org.apache.solr.client.solrj.response.QueryResponseTest
      [mvn] Tests run: 3, Failures: 0, Errors: 0, Skipped: 0, Time elapsed: 0.061 sec
      [mvn] Running org.apache.solr.client.solrj.embedded.TestEmbeddedSolrServer
      [mvn] Tests run: 2, Failures: 0, Errors: 0, Skipped: 0, Time elapsed: 0.614 sec
      [mvn] Running org.apache.solr.common.params.ModifiableSolrParamsTest
      [mvn] Tests run: 5, Failures: 0, Errors: 0, Skipped: 0, Time elapsed: 0.025 sec
      [mvn] Running org.apache.solr.client.solrj.SolrExampleXMLTest
      [mvn] Creating dataDir: /usr/home/hudson/hudson-slave/workspace/Lucene-Solr-Maven-trunk/maven-build/solr/solrj/src/test/target/test/./solrtest-SolrExampleXMLTest-1347726834166
      [mvn] ASYNC  NEW_CORE C1 name=collection1 org.apache.solr.core.SolrCore@1e1c1e6c
      [mvn] 3711 T268 C1 oasc.SolrException.log SEVERE org.apache.solr.common.SolrException: Document contains multiple values for uniqueKey field: id=[DOCID, DOCID2]
      [mvn] 		at org.apache.solr.update.AddUpdateCommand.getIndexedId(AddUpdateCommand.java:91)
      [mvn] 		at org.apache.solr.update.processor.DistributedUpdateProcessor.versionAdd(DistributedUpdateProcessor.java:449)
      [mvn] 		at org.apache.solr.update.processor.DistributedUpdateProcessor.processAdd(DistributedUpdateProcessor.java:326)
      [mvn] 		at org.apache.solr.handler.loader.XMLLoader.processUpdate(XMLLoader.java:230)
      [mvn] 		at org.apache.solr.handler.loader.XMLLoader.load(XMLLoader.java:157)
      [mvn] 		at org.apache.solr.handler.UpdateRequestHandler$1.load(UpdateRequestHandler.java:92)
      [mvn] 		at org.apache.solr.handler.ContentStreamHandlerBase.handleRequestBody(ContentStreamHandlerBase.java:74)
      [mvn] 		at org.apache.solr.handler.RequestHandlerBase.handleRequest(RequestHandlerBase.java:129)
      [mvn] 		at org.apache.solr.core.SolrCore.execute(SolrCore.java:1701)
      [mvn] 		at org.apache.solr.servlet.SolrDispatchFilter.execute(SolrDispatchFilter.java:455)
      [mvn] 		at org.apache.solr.servlet.SolrDispatchFilter.doFilter(SolrDispatchFilter.java:276)
      [mvn] 		at org.eclipse.jetty.servlet.ServletHandler$CachedChain.doFilter(ServletHandler.java:1337)
      [mvn] 		at org.eclipse.jetty.servlet.ServletHandler.doHandle(ServletHandler.java:484)
      [mvn] 		at org.eclipse.jetty.server.session.SessionHandler.doHandle(SessionHandler.java:231)
      [mvn] 		at org.eclipse.jetty.server.handler.ScopedHandler.handle(ScopedHandler.java:119)
      [mvn] 		at org.eclipse.jetty.server.handler.GzipHandler.handle(GzipHandler.java:267)
      [mvn] 		at org.eclipse.jetty.server.handler.ContextHandler.doHandle(ContextHandler.java:1067)
      [mvn] 		at org.eclipse.jetty.servlet.ServletHandler.doScope(ServletHandler.java:413)
      [mvn] 		at org.eclipse.jetty.server.session.SessionHandler.doScope(SessionHandler.java:192)
      [mvn] 		at org.eclipse.jetty.server.handler.ContextHandler.doScope(ContextHandler.java:999)
      [mvn] 		at org.eclipse.jetty.server.handler.ScopedHandler.handle(ScopedHandler.java:117)
      [mvn] 		at org.eclipse.jetty.server.handler.HandlerWrapper.handle(HandlerWrapper.java:111)
      [mvn] 		at org.eclipse.jetty.server.Server.handle(Server.java:351)
      [mvn] 		at org.eclipse.jetty.server.AbstractHttpConnection.handleRequest(AbstractHttpConnection.java:454)
      [mvn] 		at org.eclipse.jetty.server.BlockingHttpConnection.handleRequest(BlockingHttpConnection.java:47)
      [mvn] 		at org.eclipse.jetty.server.AbstractHttpConnection.content(AbstractHttpConnection.java:900)
      [mvn] 		at org.eclipse.jetty.server.AbstractHttpConnection$RequestHandler.content(AbstractHttpConnection.java:954)
      [mvn] 		at org.eclipse.jetty.http.HttpParser.parseNext(HttpParser.java:952)
      [mvn] 		at org.eclipse.jetty.http.HttpParser.parseAvailable(HttpParser.java:235)
      [mvn] 		at org.eclipse.jetty.server.BlockingHttpConnection.handle(BlockingHttpConnection.java:66)
      [mvn] 		at org.eclipse.jetty.server.bio.SocketConnector$ConnectorEndPoint.run(SocketConnector.java:254)
      [mvn] 		at org.eclipse.jetty.util.thread.QueuedThreadPool.runJob(QueuedThreadPool.java:599)
      [mvn] 		at org.eclipse.jetty.util.thread.QueuedThreadPool$3.run(QueuedThreadPool.java:534)
      [mvn] 		at java.lang.Thread.run(Thread.java:679)
      [mvn] 	
      [mvn] Tests run: 22, Failures: 0, Errors: 0, Skipped: 0, Time elapsed: 4.935 sec
      [mvn] Running org.apache.solr.common.util.NamedListTest
      [mvn] Tests run: 1, Failures: 0, Errors: 0, Skipped: 0, Time elapsed: 0.016 sec
      [mvn] Running org.apache.solr.common.util.TestHash
      [mvn] Tests run: 2, Failures: 0, Errors: 0, Skipped: 0, Time elapsed: 0.204 sec
      [mvn] Running org.apache.solr.client.solrj.SolrExampleBinaryTest
      [mvn] Creating dataDir: /usr/home/hudson/hudson-slave/workspace/Lucene-Solr-Maven-trunk/maven-build/solr/solrj/src/test/target/test/./solrtest-SolrExampleBinaryTest-1347726839321
      [mvn] ASYNC  NEW_CORE C2 name=collection1 org.apache.solr.core.SolrCore@1f7ea427
      [mvn] 2638 T287 C2 oasc.SolrException.log SEVERE org.apache.solr.common.SolrException: Document contains multiple values for uniqueKey field: id=[DOCID, DOCID2]
      [mvn] 		at org.apache.solr.update.AddUpdateCommand.getIndexedId(AddUpdateCommand.java:91)
      [mvn] 		at org.apache.solr.update.processor.DistributedUpdateProcessor.versionAdd(DistributedUpdateProcessor.java:449)
      [mvn] 		at org.apache.solr.update.processor.DistributedUpdateProcessor.processAdd(DistributedUpdateProcessor.java:326)
      [mvn] 		at org.apache.solr.handler.loader.JavabinLoader$1.update(JavabinLoader.java:86)
      [mvn] 		at org.apache.solr.client.solrj.request.JavaBinUpdateRequestCodec$1.readOuterMostDocIterator(JavaBinUpdateRequestCodec.java:140)
      [mvn] 		at org.apache.solr.client.solrj.request.JavaBinUpdateRequestCodec$1.readIterator(JavaBinUpdateRequestCodec.java:120)
      [mvn] 		at org.apache.solr.common.util.JavaBinCodec.readVal(JavaBinCodec.java:221)
      [mvn] 		at org.apache.solr.client.solrj.request.JavaBinUpdateRequestCodec$1.readNamedList(JavaBinUpdateRequestCodec.java:105)
      [mvn] 		at org.apache.solr.common.util.JavaBinCodec.readVal(JavaBinCodec.java:186)
      [mvn] 		at org.apache.solr.common.util.JavaBinCodec.unmarshal(JavaBinCodec.java:112)
      [mvn] 		at org.apache.solr.client.solrj.request.JavaBinUpdateRequestCodec.unmarshal(JavaBinUpdateRequestCodec.java:147)
      [mvn] 		at org.apache.solr.handler.loader.JavabinLoader.parseAndLoadDocs(JavabinLoader.java:96)
      [mvn] 		at org.apache.solr.handler.loader.JavabinLoader.load(JavabinLoader.java:55)
      [mvn] 		at org.apache.solr.handler.UpdateRequestHandler$1.load(UpdateRequestHandler.java:92)
      [mvn] 		at org.apache.solr.handler.ContentStreamHandlerBase.handleRequestBody(ContentStreamHandlerBase.java:74)
      [mvn] 		at org.apache.solr.handler.RequestHandlerBase.handleRequest(RequestHandlerBase.java:129)
      [mvn] 		at org.apache.solr.core.SolrCore.execute(SolrCore.java:1701)
      [mvn] 		at org.apache.solr.servlet.SolrDispatchFilter.execute(SolrDispatchFilter.java:455)
      [mvn] 		at org.apache.solr.servlet.SolrDispatchFilter.doFilter(SolrDispatchFilter.java:276)
      [mvn] 		at org.eclipse.jetty.servlet.ServletHandler$CachedChain.doFilter(ServletHandler.java:1337)
      [mvn] 		at org.eclipse.jetty.servlet.ServletHandler.doHandle(ServletHandler.java:484)
      [mvn] 		at org.eclipse.jetty.server.session.SessionHandler.doHandle(SessionHandler.java:231)
      [mvn] 		at org.eclipse.jetty.server.handler.ScopedHandler.handle(ScopedHandler.java:119)
      [mvn] 		at org.eclipse.jetty.server.handler.GzipHandler.handle(GzipHandler.java:267)
      [mvn] 		at org.eclipse.jetty.server.handler.ContextHandler.doHandle(ContextHandler.java:1067)
      [mvn] 		at org.eclipse.jetty.servlet.ServletHandler.doScope(ServletHandler.java:413)
      [mvn] 		at org.eclipse.jetty.server.session.SessionHandler.doScope(SessionHandler.java:192)
      [mvn] 		at org.eclipse.jetty.server.handler.ContextHandler.doScope(ContextHandler.java:999)
      [mvn] 		at org.eclipse.jetty.server.handler.ScopedHandler.handle(ScopedHandler.java:117)
      [mvn] 		at org.eclipse.jetty.server.handler.HandlerWrapper.handle(HandlerWrapper.java:111)
      [mvn] 		at org.eclipse.jetty.server.Server.handle(Server.java:351)
      [mvn] 		at org.eclipse.jetty.server.AbstractHttpConnection.handleRequest(AbstractHttpConnection.java:454)
      [mvn] 		at org.eclipse.jetty.server.BlockingHttpConnection.handleRequest(BlockingHttpConnection.java:47)
      [mvn] 		at org.eclipse.jetty.server.AbstractHttpConnection.content(AbstractHttpConnection.java:900)
      [mvn] 		at org.eclipse.jetty.server.AbstractHttpConnection$RequestHandler.content(AbstractHttpConnection.java:954)
      [mvn] 		at org.eclipse.jetty.http.HttpParser.parseNext(HttpParser.java:952)
      [mvn] 		at org.eclipse.jetty.http.HttpParser.parseAvailable(HttpParser.java:235)
      [mvn] 		at org.eclipse.jetty.server.BlockingHttpConnection.handle(BlockingHttpConnection.java:66)
      [mvn] 		at org.eclipse.jetty.server.bio.SocketConnector$ConnectorEndPoint.run(SocketConnector.java:254)
      [mvn] 		at org.eclipse.jetty.util.thread.QueuedThreadPool.runJob(QueuedThreadPool.java:599)
      [mvn] 		at org.eclipse.jetty.util.thread.QueuedThreadPool$3.run(QueuedThreadPool.java:534)
      [mvn] 		at java.lang.Thread.run(Thread.java:679)
      [mvn] 	
      [mvn] Tests run: 22, Failures: 0, Errors: 0, Skipped: 0, Time elapsed: 4.978 sec
      [mvn] Running org.apache.solr.common.util.ContentStreamTest
      [mvn] Tests run: 3, Failures: 0, Errors: 0, Skipped: 0, Time elapsed: 0.038 sec
      [mvn] Running org.apache.solr.client.solrj.embedded.LargeVolumeEmbeddedTest
      [mvn] Creating dataDir: /usr/home/hudson/hudson-slave/workspace/Lucene-Solr-Maven-trunk/maven-build/solr/solrj/src/test/target/test/./solrtest-LargeVolumeEmbeddedTest-1347726844336
      [mvn] Tests run: 1, Failures: 0, Errors: 0, Skipped: 0, Time elapsed: 1.13 sec
      [mvn] Running org.apache.solr.client.solrj.response.AnlysisResponseBaseTest
      [mvn] Tests run: 2, Failures: 0, Errors: 0, Skipped: 0, Time elapsed: 0.017 sec
      [mvn] Running org.apache.solr.client.solrj.impl.HttpClientUtilTest
      [mvn] Tests run: 3, Failures: 0, Errors: 0, Skipped: 0, Time elapsed: 0.048 sec
      [mvn] Running org.apache.solr.common.params.SolrParamTest
      [mvn] Tests run: 1, Failures: 0, Errors: 0, Skipped: 0, Time elapsed: 0.019 sec
      [mvn] Running org.apache.solr.common.util.TestFastInputStream
      [mvn] Tests run: 1, Failures: 0, Errors: 0, Skipped: 0, Time elapsed: 0.013 sec
      [mvn] Running org.apache.solr.client.solrj.response.FacetFieldTest
      [mvn] Tests run: 1, Failures: 0, Errors: 0, Skipped: 0, Time elapsed: 0.012 sec
      [mvn] Running org.apache.solr.client.solrj.embedded.LargeVolumeBinaryJettyTest
      [mvn] Creating dataDir: /usr/home/hudson/hudson-slave/workspace/Lucene-Solr-Maven-trunk/maven-build/solr/solrj/src/test/target/test/./solrtest-LargeVolumeBinaryJettyTest-1347726845583
      [mvn] Tests run: 1, Failures: 0, Errors: 0, Skipped: 0, Time elapsed: 1.102 sec
      [mvn] Running org.apache.solr.client.solrj.embedded.MultiCoreEmbeddedTest
      [mvn] Tests run: 1, Failures: 0, Errors: 0, Skipped: 0, Time elapsed: 0.545 sec
      [mvn] Running org.apache.solr.client.solrj.impl.CloudSolrServerTest
      [mvn] Creating dataDir: /usr/home/hudson/hudson-slave/workspace/Lucene-Solr-Maven-trunk/maven-build/solr/solrj/src/test/target/test/./solrtest-CloudSolrServerTest-1347726847250
      [mvn] 45651 T405 oasc.SolrException.log SEVERE Sync Failed
      [mvn] ASYNC  NEW_CORE C3 name=collection1 org.apache.solr.core.SolrCore@468d84de url=http://127.0.0.1:46623/solr/collection1 node=127.0.0.1:46623_solr
      [mvn] 45660 T405 C3 P46623 oasu.DirectUpdateHandler2.closeWriter SEVERE Error in final commit java.io.FileNotFoundException: _0.fdx
      [mvn] 	at org.apache.lucene.store.FSDirectory.fileLength(FSDirectory.java:267)
      [mvn] 	at org.apache.lucene.index.SegmentInfo.sizeInBytes(SegmentInfo.java:102)
      [mvn] 	at org.apache.lucene.index.IndexWriter.prepareFlushedSegment(IndexWriter.java:2139)
      [mvn] 	at org.apache.lucene.index.DocumentsWriter.publishFlushedSegment(DocumentsWriter.java:495)
      [mvn] 	at org.apache.lucene.index.DocumentsWriter.finishFlush(DocumentsWriter.java:474)
      [mvn] 	at org.apache.lucene.index.DocumentsWriterFlushQueue$SegmentFlushTicket.publish(DocumentsWriterFlushQueue.java:201)
      [mvn] 	at org.apache.lucene.index.DocumentsWriterFlushQueue.innerPurge(DocumentsWriterFlushQueue.java:119)
      [mvn] 	at org.apache.lucene.index.DocumentsWriterFlushQueue.tryPurge(DocumentsWriterFlushQueue.java:148)
      [mvn] 	at org.apache.lucene.index.DocumentsWriter.doFlush(DocumentsWriter.java:435)
      [mvn] 	at org.apache.lucene.index.DocumentsWriter.flushAllThreads(DocumentsWriter.java:551)
      [mvn] 	at org.apache.lucene.index.IndexWriter.prepareCommit(IndexWriter.java:2624)
      [mvn] 	at org.apache.lucene.index.IndexWriter.commitInternal(IndexWriter.java:2760)
      [mvn] 	at org.apache.lucene.index.IndexWriter.commit(IndexWriter.java:2740)
      [mvn] 	at org.apache.solr.update.DirectUpdateHandler2.closeWriter(DirectUpdateHandler2.java:715)
      [mvn] 	at org.apache.solr.update.DefaultSolrCoreState.decref(DefaultSolrCoreState.java:153)
      [mvn] 	at org.apache.solr.update.DirectUpdateHandler2.close(DirectUpdateHandler2.java:662)
      [mvn] 	at org.apache.solr.core.SolrCore.close(SolrCore.java:901)
      [mvn] 	at org.apache.solr.cloud.ShardLeaderElectionContext.runLeaderProcess(ElectionContext.java:213)
      [mvn] 	at org.apache.solr.cloud.LeaderElector.runIamLeaderProcess(LeaderElector.java:158)
      [mvn] 	at org.apache.solr.cloud.LeaderElector.checkIfIamLeader(LeaderElector.java:102)
      [mvn] 	at org.apache.solr.cloud.LeaderElector.access$000(LeaderElector.java:56)
      [mvn] 	at org.apache.solr.cloud.LeaderElector$1.process(LeaderElector.java:131)
      [mvn] 	at org.apache.zookeeper.ClientCnxn$EventThread.processEvent(ClientCnxn.java:526)
      [mvn] 	at org.apache.zookeeper.ClientCnxn$EventThread.run(ClientCnxn.java:502)
      [mvn] 
      [mvn] 45709 T419 oasc.SolrException.log SEVERE Sync Failed
      [mvn] 45774 T433 oasc.SolrException.log SEVERE Sync Failed
      [mvn] ASYNC  NEW_CORE C4 name=collection1 org.apache.solr.core.SolrCore@2464d330 url=http://127.0.0.1:13476/solr/collection1 node=127.0.0.1:13476_solr
      [mvn] 45780 T433 C4 P13476 oasu.DirectUpdateHandler2.closeWriter SEVERE Error in final commit java.io.FileNotFoundException: _0.fdx
      [mvn] 	at org.apache.lucene.store.FSDirectory.fileLength(FSDirectory.java:267)
      [mvn] 	at org.apache.lucene.index.SegmentInfo.sizeInBytes(SegmentInfo.java:102)
      [mvn] 	at org.apache.lucene.index.IndexWriter.prepareFlushedSegment(IndexWriter.java:2139)
      [mvn] 	at org.apache.lucene.index.DocumentsWriter.publishFlushedSegment(DocumentsWriter.java:495)
      [mvn] 	at org.apache.lucene.index.DocumentsWriter.finishFlush(DocumentsWriter.java:474)
      [mvn] 	at org.apache.lucene.index.DocumentsWriterFlushQueue$SegmentFlushTicket.publish(DocumentsWriterFlushQueue.java:201)
      [mvn] 	at org.apache.lucene.index.DocumentsWriterFlushQueue.innerPurge(DocumentsWriterFlushQueue.java:119)
      [mvn] 	at org.apache.lucene.index.DocumentsWriterFlushQueue.tryPurge(DocumentsWriterFlushQueue.java:148)
      [mvn] 	at org.apache.lucene.index.DocumentsWriter.doFlush(DocumentsWriter.java:435)
      [mvn] 	at org.apache.lucene.index.DocumentsWriter.flushAllThreads(DocumentsWriter.java:551)
      [mvn] 	at org.apache.lucene.index.IndexWriter.prepareCommit(IndexWriter.java:2624)
      [mvn] 	at org.apache.lucene.index.IndexWriter.commitInternal(IndexWriter.java:2760)
      [mvn] 	at org.apache.lucene.index.IndexWriter.commit(IndexWriter.java:2740)
      [mvn] 	at org.apache.solr.update.DirectUpdateHandler2.closeWriter(DirectUpdateHandler2.java:715)
      [mvn] 	at org.apache.solr.update.DefaultSolrCoreState.decref(DefaultSolrCoreState.java:153)
      [mvn] 	at org.apache.solr.update.DirectUpdateHandler2.close(DirectUpdateHandler2.java:662)
      [mvn] 	at org.apache.solr.core.SolrCore.close(SolrCore.java:901)
      [mvn] 	at org.apache.solr.cloud.ShardLeaderElectionContext.runLeaderProcess(ElectionContext.java:213)
      [mvn] 	at org.apache.solr.cloud.LeaderElector.runIamLeaderProcess(LeaderElector.java:158)
      [mvn] 	at org.apache.solr.cloud.LeaderElector.checkIfIamLeader(LeaderElector.java:102)
      [mvn] 	at org.apache.solr.cloud.LeaderElector.access$000(LeaderElector.java:56)
      [mvn] 	at org.apache.solr.cloud.LeaderElector$1.process(LeaderElector.java:131)
      [mvn] 	at org.apache.zookeeper.ClientCnxn$EventThread.processEvent(ClientCnxn.java:526)
      [mvn] 	at org.apache.zookeeper.ClientCnxn$EventThread.run(ClientCnxn.java:502)
      [mvn] 
      [mvn] 45832 T447 oasc.SolrException.log SEVERE Sync Failed
      [mvn] Tests run: 1, Failures: 0, Errors: 0, Skipped: 0, Time elapsed: 46.289 sec
      [mvn] Running org.apache.solr.client.solrj.TestBatchUpdate
      [mvn] Creating dataDir: /usr/home/hudson/hudson-slave/workspace/Lucene-Solr-Maven-trunk/maven-build/solr/solrj/src/test/target/test/./solrtest-TestBatchUpdate-1347726893522
      [mvn] Tests run: 3, Failures: 0, Errors: 0, Skipped: 0, Time elapsed: 2.009 sec
      [mvn] Running org.apache.solr.common.util.TestNamedListCodec
      [mvn] Tests run: 4, Failures: 0, Errors: 0, Skipped: 0, Time elapsed: 0.481 sec
      [mvn] Running org.apache.solr.client.solrj.beans.TestDocumentObjectBinder
      [mvn] Tests run: 5, Failures: 0, Errors: 0, Skipped: 0, Time elapsed: 0.044 sec
      [mvn] Running org.apache.solr.client.solrj.response.TestSpellCheckResponse
      [mvn] Creating dataDir: /usr/home/hudson/hudson-slave/workspace/Lucene-Solr-Maven-trunk/maven-build/solr/solrj/src/test/target/test/./solrtest-TestSpellCheckResponse-1347726896059
      [mvn] Tests run: 3, Failures: 0, Errors: 0, Skipped: 0, Time elapsed: 0.875 sec
      [mvn] Running org.apache.solr.client.solrj.SolrExceptionTest
      [mvn] Tests run: 1, Failures: 0, Errors: 0, Skipped: 0, Time elapsed: 0.019 sec
      [mvn] Running org.apache.solr.common.util.TestJavaBinCodec
      [mvn] Tests run: 1, Failures: 0, Errors: 0, Skipped: 0, Time elapsed: 0.178 sec
      [mvn] Running org.apache.solr.client.solrj.embedded.SolrExampleEmbeddedTest
      [mvn] Creating dataDir: /usr/home/hudson/hudson-slave/workspace/Lucene-Solr-Maven-trunk/maven-build/solr/solrj/src/test/target/test/./solrtest-SolrExampleEmbeddedTest-1347726897129
      [mvn] Tests run: 22, Failures: 0, Errors: 0, Skipped: 0, Time elapsed: 4.062 sec
      [mvn] Running org.apache.solr.client.solrj.response.FieldAnalysisResponseTest
      [mvn] Tests run: 1, Failures: 0, Errors: 0, Skipped: 0, Time elapsed: 0.014 sec
      [mvn] Running org.apache.solr.client.solrj.embedded.JettyWebappTest
      [mvn] Tests run: 1, Failures: 0, Errors: 0, Skipped: 0, Time elapsed: 1.025 sec
      [mvn] Running org.apache.solr.client.solrj.embedded.TestSolrProperties
      [mvn] Tests run: 1, Failures: 0, Errors: 0, Skipped: 0, Time elapsed: 0.908 sec
      [mvn] Running org.apache.solr.client.solrj.embedded.LargeVolumeJettyTest
      [mvn] Creating dataDir: /usr/home/hudson/hudson-slave/workspace/Lucene-Solr-Maven-trunk/maven-build/solr/solrj/src/test/target/test/./solrtest-LargeVolumeJettyTest-1347726903143
      [mvn] Tests run: 1, Failures: 0, Errors: 0, Skipped: 0, Time elapsed: 0.865 sec
      [mvn] Running org.apache.solr.common.util.TestXMLEscaping
      [mvn] Tests run: 7, Failures: 0, Errors: 0, Skipped: 0, Time elapsed: 0.018 sec
      [mvn] Running org.apache.solr.client.solrj.embedded.SolrExampleJettyTest
      [mvn] Creating dataDir: /usr/home/hudson/hudson-slave/workspace/Lucene-Solr-Maven-trunk/maven-build/solr/solrj/src/test/target/test/./solrtest-SolrExampleJettyTest-1347726904027
      [mvn] ASYNC  NEW_CORE C5 name=collection1 org.apache.solr.core.SolrCore@672825c9
      [mvn] 3867 T556 C5 oasc.SolrException.log SEVERE org.apache.solr.common.SolrException: Document contains multiple values for uniqueKey field: id=[DOCID, DOCID2]
      [mvn] 		at org.apache.solr.update.AddUpdateCommand.getIndexedId(AddUpdateCommand.java:91)
      [mvn] 		at org.apache.solr.update.processor.DistributedUpdateProcessor.versionAdd(DistributedUpdateProcessor.java:449)
      [mvn] 		at org.apache.solr.update.processor.DistributedUpdateProcessor.processAdd(DistributedUpdateProcessor.java:326)
      [mvn] 		at org.apache.solr.handler.loader.XMLLoader.processUpdate(XMLLoader.java:230)
      [mvn] 		at org.apache.solr.handler.loader.XMLLoader.load(XMLLoader.java:157)
      [mvn] 		at org.apache.solr.handler.UpdateRequestHandler$1.load(UpdateRequestHandler.java:92)
      [mvn] 		at org.apache.solr.handler.ContentStreamHandlerBase.handleRequestBody(ContentStreamHandlerBase.java:74)
      [mvn] 		at org.apache.solr.handler.RequestHandlerBase.handleRequest(RequestHandlerBase.java:129)
      [mvn] 		at org.apache.solr.core.SolrCore.execute(SolrCore.java:1701)
      [mvn] 		at org.apache.solr.servlet.SolrDispatchFilter.execute(SolrDispatchFilter.java:455)
      [mvn] 		at org.apache.solr.servlet.SolrDispatchFilter.doFilter(SolrDispatchFilter.java:276)
      [mvn] 		at org.eclipse.jetty.servlet.ServletHandler$CachedChain.doFilter(ServletHandler.java:1337)
      [mvn] 		at org.eclipse.jetty.servlet.ServletHandler.doHandle(ServletHandler.java:484)
      [mvn] 		at org.eclipse.jetty.server.session.SessionHandler.doHandle(SessionHandler.java:231)
      [mvn] 		at org.eclipse.jetty.server.handler.ScopedHandler.handle(ScopedHandler.java:119)
      [mvn] 		at org.eclipse.jetty.server.handler.GzipHandler.handle(GzipHandler.java:267)
      [mvn] 		at org.eclipse.jetty.server.handler.ContextHandler.doHandle(ContextHandler.java:1067)
      [mvn] 		at org.eclipse.jetty.servlet.ServletHandler.doScope(ServletHandler.java:413)
      [mvn] 		at org.eclipse.jetty.server.session.SessionHandler.doScope(SessionHandler.java:192)
      [mvn] 		at org.eclipse.jetty.server.handler.ContextHandler.doScope(ContextHandler.java:999)
      [mvn] 		at org.eclipse.jetty.server.handler.ScopedHandler.handle(ScopedHandler.java:117)
      [mvn] 		at org.eclipse.jetty.server.handler.HandlerWrapper.handle(HandlerWrapper.java:111)
      [mvn] 		at org.eclipse.jetty.server.Server.handle(Server.java:351)
      [mvn] 		at org.eclipse.jetty.server.AbstractHttpConnection.handleRequest(AbstractHttpConnection.java:454)
      [mvn] 		at org.eclipse.jetty.server.BlockingHttpConnection.handleRequest(BlockingHttpConnection.java:47)
      [mvn] 		at org.eclipse.jetty.server.AbstractHttpConnection.content(AbstractHttpConnection.java:900)
      [mvn] 		at org.eclipse.jetty.server.AbstractHttpConnection$RequestHandler.content(AbstractHttpConnection.java:954)
      [mvn] 		at org.eclipse.jetty.http.HttpParser.parseNext(HttpParser.java:952)
      [mvn] 		at org.eclipse.jetty.http.HttpParser.parseAvailable(HttpParser.java:235)
      [mvn] 		at org.eclipse.jetty.server.BlockingHttpConnection.handle(BlockingHttpConnection.java:66)
      [mvn] 		at org.eclipse.jetty.server.bio.SocketConnector$ConnectorEndPoint.run(SocketConnector.java:254)
      [mvn] 		at org.eclipse.jetty.util.thread.QueuedThreadPool.runJob(QueuedThreadPool.java:599)
      [mvn] 		at org.eclipse.jetty.util.thread.QueuedThreadPool$3.run(QueuedThreadPool.java:534)
      [mvn] 		at java.lang.Thread.run(Thread.java:679)
      [mvn] 	
      [mvn] Tests run: 23, Failures: 0, Errors: 0, Skipped: 0, Time elapsed: 4.482 sec
      [mvn] Running org.apache.solr.client.solrj.util.ClientUtilsTest
      [mvn] Tests run: 1, Failures: 0, Errors: 0, Skipped: 0, Time elapsed: 0.012 sec
      [mvn] Running org.apache.solr.client.solrj.request.TestUpdateRequestCodec
      [mvn] Tests run: 2, Failures: 0, Errors: 0, Skipped: 0, Time elapsed: 0.02 sec
      [mvn] Running org.apache.solr.client.solrj.embedded.MergeIndexesEmbeddedTest
      [mvn] !!!! WARNING: best effort to remove /usr/home/hudson/hudson-slave/workspace/Lucene-Solr-Maven-trunk/maven-build/solr/solrj/src/test/target/test/./org.apache.solr.client.solrj.embedded.MergeIndexesEmbeddedTest-1347726908546 FAILED !!!!!
      [mvn] !!!! WARNING: best effort to remove /usr/home/hudson/hudson-slave/workspace/Lucene-Solr-Maven-trunk/maven-build/solr/solrj/src/test/target/test/./org.apache.solr.client.solrj.embedded.MergeIndexesEmbeddedTest-1347726909017 FAILED !!!!!
      [mvn] Tests run: 2, Failures: 0, Errors: 0, Skipped: 0, Time elapsed: 1.01 sec
      [mvn] 
      [mvn] Results :
      [mvn] 
      [mvn] Tests run: 231, Failures: 0, Errors: 0, Skipped: 0
      [mvn] 
      [mvn] [INFO] [jar:jar {execution: default-jar}]
      [mvn] [INFO] Building jar: /usr/home/hudson/hudson-slave/workspace/Lucene-Solr-Maven-trunk/maven-build/solr/solrj/src/test/target/solr-solrj-tests-5.0-SNAPSHOT.jar
      [mvn] [INFO] [install:install {execution: default-install}]
      [mvn] [INFO] Skipping artifact installation
      [mvn] [INFO] ------------------------------------------------------------------------
      [mvn] [INFO] Building Apache Solr Solrj aggregator POM
      [mvn] [INFO]    task-segment: [install]
      [mvn] [INFO] ------------------------------------------------------------------------
      [mvn] [INFO] [groovy:execute {execution: generate-timestamps}]
      [mvn] [INFO] [buildnumber:create {execution: default}]
      [mvn] [INFO] [enforcer:enforce {execution: enforce-java-compat-version-and-maven-2.2.1}]
      [mvn] [INFO] [remote-resources:process {execution: default}]
      [mvn] [INFO] [bundle:manifest {execution: bundle-manifest}]
      [mvn] [WARNING] Ignoring project type pom - supportedProjectTypes = [jar, bundle]
      [mvn] [INFO] [site:attach-descriptor {execution: default-attach-descriptor}]
      [mvn] [INFO] [install:install {execution: default-install}]
      [mvn] [INFO] Installing /usr/home/hudson/hudson-slave/workspace/Lucene-Solr-Maven-trunk/maven-build/solr/solrj/pom.xml to /home/hudson/.m2/repository/org/apache/solr/solr-solrj-aggregator/5.0-SNAPSHOT/solr-solrj-aggregator-5.0-SNAPSHOT.pom
      [mvn] [INFO] ------------------------------------------------------------------------
      [mvn] [INFO] Building Apache Solr Search Server
      [mvn] [INFO]    task-segment: [install]
      [mvn] [INFO] ------------------------------------------------------------------------
      [mvn] [INFO] [groovy:execute {execution: generate-timestamps}]
      [mvn] [INFO] [buildnumber:create {execution: default}]
      [mvn] [INFO] [enforcer:enforce {execution: enforce-java-compat-version-and-maven-2.2.1}]
      [mvn] [INFO] [remote-resources:process {execution: default}]
      [mvn] [debug] execute contextualize
      [mvn] [INFO] [resources:resources {execution: default-resources}]
      [mvn] [INFO] Using 'UTF-8' encoding to copy filtered resources.
      [mvn] [INFO] skip non existing resourceDirectory /usr/home/hudson/hudson-slave/workspace/Lucene-Solr-Maven-trunk/maven-build/solr/webapp/src/main/resources
      [mvn] [INFO] Copying 3 resources
      [mvn] [INFO] [compiler:compile {execution: default-compile}]
      [mvn] [INFO] No sources to compile
      [mvn] [INFO] [bundle:manifest {execution: bundle-manifest}]
      [mvn] [WARNING] Ignoring project type war - supportedProjectTypes = [jar, bundle]
      [mvn] [debug] execute contextualize
      [mvn] [INFO] [resources:testResources {execution: default-testResources}]
      [mvn] [INFO] Using 'UTF-8' encoding to copy filtered resources.
      [mvn] [INFO] skip non existing resourceDirectory /usr/home/hudson/hudson-slave/workspace/Lucene-Solr-Maven-trunk/maven-build/solr/webapp/src/test/resources
      [mvn] [INFO] Copying 3 resources
      [mvn] [INFO] [compiler:testCompile {execution: default-testCompile}]
      [mvn] [INFO] No sources to compile
      [mvn] [INFO] [surefire:test {execution: default-test}]
      [mvn] [INFO] Surefire report directory: /usr/home/hudson/hudson-slave/workspace/Lucene-Solr-Maven-trunk/maven-build/solr/webapp/null/surefire-reports
      [mvn] 
      [mvn] -------------------------------------------------------
      [mvn]  T E S T S
      [mvn] -------------------------------------------------------
      [mvn] 
      [mvn] Results :
      [mvn] 
      [mvn] Tests run: 0, Failures: 0, Errors: 0, Skipped: 0
      [mvn] 
      [mvn] [INFO] [war:war {execution: default-war}]
      [mvn] [INFO] Packaging webapp
      [mvn] [INFO] Assembling webapp [solr] in [/usr/home/hudson/hudson-slave/workspace/Lucene-Solr-Maven-trunk/maven-build/solr/webapp/null/solr-5.0-SNAPSHOT]
      [mvn] [INFO] Processing war project
      [mvn] [INFO] Copying webapp resources [/usr/home/hudson/hudson-slave/workspace/Lucene-Solr-Maven-trunk/solr/webapp/web]
      [mvn] [INFO] Webapp assembled in [942 msecs]
      [mvn] [INFO] Building war: /usr/home/hudson/hudson-slave/workspace/Lucene-Solr-Maven-trunk/maven-build/solr/webapp/null/solr-5.0-SNAPSHOT.war
      [mvn] [INFO] WEB-INF/web.xml already added, skipping
      [mvn] [INFO] [install:install {execution: default-install}]
      [mvn] [INFO] Installing /usr/home/hudson/hudson-slave/workspace/Lucene-Solr-Maven-trunk/maven-build/solr/webapp/null/solr-5.0-SNAPSHOT.war to /home/hudson/.m2/repository/org/apache/solr/solr/5.0-SNAPSHOT/solr-5.0-SNAPSHOT.war
      [mvn] [INFO] ------------------------------------------------------------------------
      [mvn] [INFO] Building Apache Solr Analysis Extras
      [mvn] [INFO]    task-segment: [install]
      [mvn] [INFO] ------------------------------------------------------------------------
      [mvn] [INFO] [groovy:execute {execution: generate-timestamps}]
      [mvn] [INFO] [buildnumber:create {execution: default}]
      [mvn] [INFO] [enforcer:enforce {execution: enforce-java-compat-version-and-maven-2.2.1}]
      [mvn] [INFO] [remote-resources:process {execution: default}]
      [mvn] [debug] execute contextualize
      [mvn] [INFO] [resources:resources {execution: default-resources}]
      [mvn] [INFO] Using 'UTF-8' encoding to copy filtered resources.
      [mvn] [INFO] skip non existing resourceDirectory /usr/home/hudson/hudson-slave/workspace/Lucene-Solr-Maven-trunk/maven-build/solr/contrib/analysis-extras/src/main/resources
      [mvn] [INFO] Copying 3 resources
      [mvn] [INFO] [compiler:compile {execution: default-compile}]
      [mvn] [INFO] Compiling 1 source file to /usr/home/hudson/hudson-slave/workspace/Lucene-Solr-Maven-trunk/maven-build/solr/contrib/analysis-extras/target/classes
      [mvn] [INFO] [bundle:manifest {execution: bundle-manifest}]
      [mvn] [debug] execute contextualize
      [mvn] [INFO] [resources:testResources {execution: default-testResources}]
      [mvn] [INFO] Using 'UTF-8' encoding to copy filtered resources.
      [mvn] [INFO] Copying 4 resources
      [mvn] [INFO] Copying 1 resource
      [mvn] [INFO] Copying 3 resources
      [mvn] [INFO] [compiler:testCompile {execution: default-testCompile}]
      [mvn] [INFO] Compiling 3 source files to /usr/home/hudson/hudson-slave/workspace/Lucene-Solr-Maven-trunk/maven-build/solr/contrib/analysis-extras/target/test-classes
      [mvn] [INFO] [surefire:test {execution: default-test}]
      [mvn] [INFO] Surefire report directory: /usr/home/hudson/hudson-slave/workspace/Lucene-Solr-Maven-trunk/maven-build/solr/contrib/analysis-extras/target/surefire-reports
      [mvn] 
      [mvn] -------------------------------------------------------
      [mvn]  T E S T S
      [mvn] -------------------------------------------------------
      [mvn] Running org.apache.solr.schema.TestICUCollationFieldOptions
      [mvn] Creating dataDir: /usr/home/hudson/hudson-slave/workspace/Lucene-Solr-Maven-trunk/maven-build/solr/contrib/analysis-extras/target/test/./solrtest-TestICUCollationFieldOptions-1347726920527
      [mvn] Tests run: 5, Failures: 0, Errors: 0, Skipped: 0, Time elapsed: 1.941 sec
      [mvn] Running org.apache.solr.schema.TestICUCollationField
      [mvn] Creating dataDir: /usr/home/hudson/hudson-slave/workspace/Lucene-Solr-Maven-trunk/maven-build/solr/contrib/analysis-extras/target/test/./solrtest-TestICUCollationField-1347726922549
      [mvn] Tests run: 7, Failures: 0, Errors: 0, Skipped: 0, Time elapsed: 0.897 sec
      [mvn] Running org.apache.solr.analysis.TestFoldingMultitermExtrasQuery
      [mvn] Creating dataDir: /usr/home/hudson/hudson-slave/workspace/Lucene-Solr-Maven-trunk/maven-build/solr/contrib/analysis-extras/target/test/./solrtest-TestFoldingMultitermExtrasQuery-1347726923013
      [mvn] Tests run: 3, Failures: 0, Errors: 0, Skipped: 0, Time elapsed: 0.499 sec
      [mvn] 
      [mvn] Results :
      [mvn] 
      [mvn] Tests run: 15, Failures: 0, Errors: 0, Skipped: 0
      [mvn] 
      [mvn] [INFO] [jar:jar {execution: default-jar}]
      [mvn] [INFO] Building jar: /usr/home/hudson/hudson-slave/workspace/Lucene-Solr-Maven-trunk/maven-build/solr/contrib/analysis-extras/target/solr-analysis-extras-5.0-SNAPSHOT.jar
      [mvn] [INFO] [install:install {execution: default-install}]
      [mvn] [INFO] Installing /usr/home/hudson/hudson-slave/workspace/Lucene-Solr-Maven-trunk/maven-build/solr/contrib/analysis-extras/target/solr-analysis-extras-5.0-SNAPSHOT.jar to /home/hudson/.m2/repository/org/apache/solr/solr-analysis-extras/5.0-SNAPSHOT/solr-analysis-extras-5.0-SNAPSHOT.jar
      [mvn] [INFO] ------------------------------------------------------------------------
      [mvn] [INFO] Building Apache Solr Clustering
      [mvn] [INFO]    task-segment: [install]
      [mvn] [INFO] ------------------------------------------------------------------------
      [mvn] Downloading: http://repo1.maven.org/maven2/org/apache/lucene/lucene-memory/3.1.0/lucene-memory-3.1.0.pom
      [mvn] 2K downloaded  (lucene-memory-3.1.0.pom)
      [mvn] Downloading: http://repo1.maven.org/maven2/org/apache/lucene/lucene-parent/3.1.0/lucene-parent-3.1.0.pom
      [mvn] 1K downloaded  (lucene-parent-3.1.0.pom)
      [mvn] Downloading: http://repo1.maven.org/maven2/org/apache/lucene/lucene-solr-grandparent/3.1.0/lucene-solr-grandparent-3.1.0.pom
      [mvn] 31K downloaded  (lucene-solr-grandparent-3.1.0.pom)
      [mvn] [INFO] [groovy:execute {execution: generate-timestamps}]
      [mvn] [INFO] [buildnumber:create {execution: default}]
      [mvn] [INFO] [enforcer:enforce {execution: enforce-java-compat-version-and-maven-2.2.1}]
      [mvn] [INFO] [remote-resources:process {execution: default}]
      [mvn] [debug] execute contextualize
      [mvn] [INFO] [resources:resources {execution: default-resources}]
      [mvn] [INFO] Using 'UTF-8' encoding to copy filtered resources.
      [mvn] [INFO] skip non existing resourceDirectory /usr/home/hudson/hudson-slave/workspace/Lucene-Solr-Maven-trunk/maven-build/solr/contrib/clustering/src/main/resources
      [mvn] [INFO] Copying 3 resources
      [mvn] [INFO] [compiler:compile {execution: default-compile}]
      [mvn] [INFO] Compiling 10 source files to /usr/home/hudson/hudson-slave/workspace/Lucene-Solr-Maven-trunk/maven-build/solr/contrib/clustering/target/classes
      [mvn] [INFO] [bundle:manifest {execution: bundle-manifest}]
      [mvn] [debug] execute contextualize
      [mvn] [INFO] [resources:testResources {execution: default-testResources}]
      [mvn] [INFO] Using 'UTF-8' encoding to copy filtered resources.
      [mvn] [INFO] Copying 11 resources
      [mvn] [INFO] Copying 1 resource
      [mvn] [INFO] Copying 3 resources
      [mvn] [INFO] [compiler:testCompile {execution: default-testCompile}]
      [mvn] [INFO] Compiling 12 source files to /usr/home/hudson/hudson-slave/workspace/Lucene-Solr-Maven-trunk/maven-build/solr/contrib/clustering/target/test-classes
      [mvn] [INFO] [surefire:test {execution: default-test}]
      [mvn] [INFO] Surefire report directory: /usr/home/hudson/hudson-slave/workspace/Lucene-Solr-Maven-trunk/maven-build/solr/contrib/clustering/target/surefire-reports
      [mvn] 
      [mvn] -------------------------------------------------------
      [mvn]  T E S T S
      [mvn] -------------------------------------------------------
      [mvn] Running org.apache.solr.handler.clustering.carrot2.CarrotClusteringEngineTest
      [mvn] Creating dataDir: /usr/home/hudson/hudson-slave/workspace/Lucene-Solr-Maven-trunk/maven-build/solr/contrib/clustering/target/test/./solrtest-CarrotClusteringEngineTest-1347726928832
      [mvn] Tests run: 23, Failures: 0, Errors: 0, Skipped: 0, Time elapsed: 3.782 sec
      [mvn] Running org.apache.solr.handler.clustering.DistributedClusteringComponentTest
      [mvn] Tests run: 1, Failures: 0, Errors: 0, Skipped: 0, Time elapsed: 5.439 sec
      [mvn] Running org.apache.solr.handler.clustering.ClusteringComponentTest
      [mvn] Creating dataDir: /usr/home/hudson/hudson-slave/workspace/Lucene-Solr-Maven-trunk/maven-build/solr/contrib/clustering/target/test/./solrtest-ClusteringComponentTest-1347726937627
      [mvn] Tests run: 1, Failures: 0, Errors: 0, Skipped: 0, Time elapsed: 0.422 sec
      [mvn] 
      [mvn] Results :
      [mvn] 
      [mvn] Tests run: 25, Failures: 0, Errors: 0, Skipped: 0
      [mvn] 
      [mvn] [INFO] [jar:jar {execution: default-jar}]
      [mvn] [INFO] Building jar: /usr/home/hudson/hudson-slave/workspace/Lucene-Solr-Maven-trunk/maven-build/solr/contrib/clustering/target/solr-clustering-5.0-SNAPSHOT.jar
      [mvn] [INFO] [install:install {execution: default-install}]
      [mvn] [INFO] Installing /usr/home/hudson/hudson-slave/workspace/Lucene-Solr-Maven-trunk/maven-build/solr/contrib/clustering/target/solr-clustering-5.0-SNAPSHOT.jar to /home/hudson/.m2/repository/org/apache/solr/solr-clustering/5.0-SNAPSHOT/solr-clustering-5.0-SNAPSHOT.jar
      [mvn] [INFO] ------------------------------------------------------------------------
      [mvn] [INFO] Building Apache Solr DataImportHandler
      [mvn] [INFO]    task-segment: [install]
      [mvn] [INFO] ------------------------------------------------------------------------
      [mvn] [INFO] [groovy:execute {execution: generate-timestamps}]
      [mvn] [INFO] [buildnumber:create {execution: default}]
      [mvn] [INFO] [enforcer:enforce {execution: enforce-java-compat-version-and-maven-2.2.1}]
      [mvn] [INFO] [remote-resources:process {execution: default}]
      [mvn] [debug] execute contextualize
      [mvn] [INFO] [resources:resources {execution: default-resources}]
      [mvn] [INFO] Using 'UTF-8' encoding to copy filtered resources.
      [mvn] [INFO] skip non existing resourceDirectory /usr/home/hudson/hudson-slave/workspace/Lucene-Solr-Maven-trunk/maven-build/solr/contrib/dataimporthandler/src/main/resources
      [mvn] [INFO] Copying 3 resources
      [mvn] [INFO] [compiler:compile {execution: default-compile}]
      [mvn] [INFO] Compiling 67 source files to /usr/home/hudson/hudson-slave/workspace/Lucene-Solr-Maven-trunk/maven-build/solr/contrib/dataimporthandler/target/classes
      [mvn] [INFO] [bundle:manifest {execution: bundle-manifest}]
      [mvn] [debug] execute contextualize
      [mvn] [INFO] [resources:testResources {execution: default-testResources}]
      [mvn] [INFO] Using 'UTF-8' encoding to copy filtered resources.
      [mvn] [INFO] Copying 14 resources
      [mvn] [INFO] Copying 1 resource
      [mvn] [INFO] Copying 3 resources
      [mvn] [INFO] [compiler:testCompile {execution: default-testCompile}]
      [mvn] [INFO] Compiling 43 source files to /usr/home/hudson/hudson-slave/workspace/Lucene-Solr-Maven-trunk/maven-build/solr/contrib/dataimporthandler/target/test-classes
      [mvn] [INFO] [surefire:test {execution: default-test}]
      [mvn] [INFO] Surefire report directory: /usr/home/hudson/hudson-slave/workspace/Lucene-Solr-Maven-trunk/maven-build/solr/contrib/dataimporthandler/target/surefire-reports
      [mvn] 
      [mvn] -------------------------------------------------------
      [mvn]  T E S T S
      [mvn] -------------------------------------------------------
      [mvn] Running org.apache.solr.handler.dataimport.TestEntityProcessorBase
      [mvn] Tests run: 1, Failures: 0, Errors: 0, Skipped: 0, Time elapsed: 0.477 sec
      [mvn] Running org.apache.solr.handler.dataimport.TestSqlEntityProcessorDelta2
      [mvn] Tests run: 1, Failures: 0, Errors: 0, Skipped: 1, Time elapsed: 0 sec
      [mvn] Running org.apache.solr.handler.dataimport.TestDocBuilder2
      [mvn] Creating dataDir: /usr/home/hudson/hudson-slave/workspace/Lucene-Solr-Maven-trunk/maven-build/solr/contrib/dataimporthandler/target/test/./solrtest-TestDocBuilder2-1347726947089
      [mvn] Tests run: 11, Failures: 0, Errors: 0, Skipped: 1, Time elapsed: 1.401 sec
      [mvn] Running org.apache.solr.handler.dataimport.TestSqlEntityProcessor
      [mvn] Tests run: 1, Failures: 0, Errors: 0, Skipped: 1, Time elapsed: 0.001 sec
      [mvn] Running org.apache.solr.handler.dataimport.TestLineEntityProcessor
      [mvn] Tests run: 4, Failures: 0, Errors: 0, Skipped: 0, Time elapsed: 0.058 sec
      [mvn] Running org.apache.solr.handler.dataimport.TestFileListEntityProcessor
      [mvn] Tests run: 4, Failures: 0, Errors: 0, Skipped: 1, Time elapsed: 0.066 sec
      [mvn] Running org.apache.solr.handler.dataimport.TestSqlEntityProcessorDeltaPrefixedPk
      [mvn] Tests run: 1, Failures: 0, Errors: 0, Skipped: 1, Time elapsed: 0 sec
      [mvn] Running org.apache.solr.handler.dataimport.TestSqlEntityProcessor2
      [mvn] Tests run: 1, Failures: 0, Errors: 0, Skipped: 1, Time elapsed: 0.001 sec
      [mvn] Running org.apache.solr.handler.dataimport.TestContentStreamDataSource
      [mvn] Tests run: 2, Failures: 0, Errors: 0, Skipped: 0, Time elapsed: 2.2 sec
      [mvn] Running org.apache.solr.handler.dataimport.TestURLDataSource
      [mvn] Tests run: 1, Failures: 0, Errors: 0, Skipped: 0, Time elapsed: 0.056 sec
      [mvn] Running org.apache.solr.handler.dataimport.TestEphemeralCache
      [mvn] Creating dataDir: /usr/home/hudson/hudson-slave/workspace/Lucene-Solr-Maven-trunk/maven-build/solr/contrib/dataimporthandler/target/test/./solrtest-TestEphemeralCache-1347726950889
      [mvn] Tests run: 1, Failures: 0, Errors: 0, Skipped: 0, Time elapsed: 0.378 sec
      [mvn] Running org.apache.solr.handler.dataimport.TestXPathEntityProcessor
      [mvn] Tests run: 8, Failures: 0, Errors: 0, Skipped: 0, Time elapsed: 0.507 sec
      [mvn] Running org.apache.solr.handler.dataimport.TestClobTransformer
      [mvn] Tests run: 1, Failures: 0, Errors: 0, Skipped: 0, Time elapsed: 0.024 sec
      [mvn] Running org.apache.solr.handler.dataimport.TestScriptTransformer
      [mvn] Tests run: 4, Failures: 0, Errors: 0, Skipped: 0, Time elapsed: 0.173 sec
      [mvn] Running org.apache.solr.handler.dataimport.TestTemplateString
      [mvn] Tests run: 1, Failures: 0, Errors: 0, Skipped: 0, Time elapsed: 0.02 sec
      [mvn] Running org.apache.solr.handler.dataimport.TestEvaluatorBag
      [mvn] Tests run: 5, Failures: 0, Errors: 0, Skipped: 1, Time elapsed: 0.032 sec
      [mvn] Running org.apache.solr.handler.dataimport.TestNumberFormatTransformer
      [mvn] Tests run: 9, Failures: 0, Errors: 0, Skipped: 0, Time elapsed: 0.08 sec
      [mvn] Running org.apache.solr.handler.dataimport.TestVariableResolver
      [mvn] Tests run: 9, Failures: 0, Errors: 0, Skipped: 0, Time elapsed: 0.066 sec
      [mvn] Running org.apache.solr.handler.dataimport.TestFieldReader
      [mvn] Tests run: 1, Failures: 0, Errors: 0, Skipped: 0, Time elapsed: 0.021 sec
      [mvn] Running org.apache.solr.handler.dataimport.TestXPathRecordReader
      [mvn] Tests run: 22, Failures: 0, Errors: 0, Skipped: 0, Time elapsed: 0.125 sec
      [mvn] Running org.apache.solr.handler.dataimport.TestDIHEndToEnd
      [mvn] Creating dataDir: /usr/home/hudson/hudson-slave/workspace/Lucene-Solr-Maven-trunk/maven-build/solr/contrib/dataimporthandler/target/test/./solrtest-TestDIHEndToEnd-1347726952422
      [mvn] Tests run: 1, Failures: 0, Errors: 0, Skipped: 0, Time elapsed: 0.416 sec
      [mvn] Running org.apache.solr.handler.dataimport.TestDateFormatTransformer
      [mvn] Tests run: 2, Failures: 0, Errors: 0, Skipped: 0, Time elapsed: 0.033 sec
      [mvn] Running org.apache.solr.handler.dataimport.TestSqlEntityProcessorDelta3
      [mvn] Tests run: 1, Failures: 0, Errors: 0, Skipped: 1, Time elapsed: 0.001 sec
      [mvn] Running org.apache.solr.handler.dataimport.TestCachedSqlEntityProcessor
      [mvn] Tests run: 5, Failures: 0, Errors: 0, Skipped: 0, Time elapsed: 0.066 sec
      [mvn] Running org.apache.solr.handler.dataimport.TestSolrEntityProcessorEndToEnd
      [mvn] Creating dataDir: /usr/home/hudson/hudson-slave/workspace/Lucene-Solr-Maven-trunk/maven-build/solr/contrib/dataimporthandler/target/test/./solrtest-TestSolrEntityProcessorEndToEnd-1347726952821
      [mvn] ASYNC  NEW_CORE C0 name=collection1 org.apache.solr.core.SolrCore@5437086a
      [mvn] 552 T77 C0 oashd.DocBuilder.finish SEVERE Could not write property file org.apache.solr.handler.dataimport.DataImportHandlerException: Unable to persist Index Start Time Processing Document # 2
      [mvn] 	at org.apache.solr.handler.dataimport.SimplePropertiesWriter.persist(SimplePropertiesWriter.java:89)
      [mvn] 	at org.apache.solr.handler.dataimport.DocBuilder.finish(DocBuilder.java:310)
      [mvn] 	at org.apache.solr.handler.dataimport.DocBuilder.execute(DocBuilder.java:256)
      [mvn] 	at org.apache.solr.handler.dataimport.DataImporter.doFullImport(DataImporter.java:382)
      [mvn] 	at org.apache.solr.handler.dataimport.DataImporter.runCmd(DataImporter.java:448)
      [mvn] 	at org.apache.solr.handler.dataimport.DataImportHandler.handleRequestBody(DataImportHandler.java:177)
      [mvn] 	at org.apache.solr.handler.RequestHandlerBase.handleRequest(RequestHandlerBase.java:129)
      [mvn] 	at org.apache.solr.core.SolrCore.execute(SolrCore.java:1701)
      [mvn] 	at org.apache.solr.util.TestHarness.query(TestHarness.java:364)
      [mvn] 	at org.apache.solr.handler.dataimport.AbstractDataImportHandlerTestCase.runFullImport(AbstractDataImportHandlerTestCase.java:128)
      [mvn] 	at org.apache.solr.handler.dataimport.TestSolrEntityProcessorEndToEnd.testFullImportFqParam(TestSolrEntityProcessorEndToEnd.java:166)
      [mvn] 	at sun.reflect.NativeMethodAccessorImpl.invoke0(Native Method)
      [mvn] 	at sun.reflect.NativeMethodAccessorImpl.invoke(NativeMethodAccessorImpl.java:57)
      [mvn] 	at sun.reflect.DelegatingMethodAccessorImpl.invoke(DelegatingMethodAccessorImpl.java:43)
      [mvn] 	at java.lang.reflect.Method.invoke(Method.java:616)
      [mvn] 	at com.carrotsearch.randomizedtesting.RandomizedRunner.invoke(RandomizedRunner.java:1559)
      [mvn] 	at com.carrotsearch.randomizedtesting.RandomizedRunner.access$600(RandomizedRunner.java:79)
      [mvn] 	at com.carrotsearch.randomizedtesting.RandomizedRunner$6.evaluate(RandomizedRunner.java:737)
      [mvn] 	at com.carrotsearch.randomizedtesting.RandomizedRunner$7.evaluate(RandomizedRunner.java:773)
      [mvn] 	at com.carrotsearch.randomizedtesting.RandomizedRunner$8.evaluate(RandomizedRunner.java:787)
      [mvn] 	at com.carrotsearch.randomizedtesting.rules.SystemPropertiesRestoreRule$1.evaluate(SystemPropertiesRestoreRule.java:53)
      [mvn] 	at org.apache.lucene.util.TestRuleSetupTeardownChained$1.evaluate(TestRuleSetupTeardownChained.java:50)
      [mvn] 	at org.apache.lucene.util.TestRuleFieldCacheSanity$1.evaluate(TestRuleFieldCacheSanity.java:51)
      [mvn] 	at org.apache.lucene.util.AbstractBeforeAfterRule$1.evaluate(AbstractBeforeAfterRule.java:45)
      [mvn] 	at com.carrotsearch.randomizedtesting.rules.SystemPropertiesInvariantRule$1.evaluate(SystemPropertiesInvariantRule.java:55)
      [mvn] 	at org.apache.lucene.util.TestRuleThreadAndTestName$1.evaluate(TestRuleThreadAndTestName.java:48)
      [mvn] 	at org.apache.lucene.util.TestRuleIgnoreAfterMaxFailures$1.evaluate(TestRuleIgnoreAfterMaxFailures.java:70)
      [mvn] 	at org.apache.lucene.util.TestRuleMarkFailure$1.evaluate(TestRuleMarkFailure.java:48)
      [mvn] 	at com.carrotsearch.randomizedtesting.rules.StatementAdapter.evaluate(StatementAdapter.java:36)
      [mvn] 	at com.carrotsearch.randomizedtesting.ThreadLeakControl$StatementRunner.run(ThreadLeakControl.java:358)
      [mvn] 	at com.carrotsearch.randomizedtesting.ThreadLeakControl.forkTimeoutingTask(ThreadLeakControl.java:782)
      [mvn] 	at com.carrotsearch.randomizedtesting.ThreadLeakControl$3.evaluate(ThreadLeakControl.java:442)
      [mvn] 	at com.carrotsearch.randomizedtesting.RandomizedRunner.runSingleTest(RandomizedRunner.java:746)
      [mvn] 	at com.carrotsearch.randomizedtesting.RandomizedRunner$3.evaluate(RandomizedRunner.java:648)
      [mvn] 	at com.carrotsearch.randomizedtesting.RandomizedRunner$4.evaluate(RandomizedRunner.java:682)
      [mvn] 	at com.carrotsearch.randomizedtesting.RandomizedRunner$5.evaluate(RandomizedRunner.java:693)
      [mvn] 	at com.carrotsearch.randomizedtesting.rules.StatementAdapter.evaluate(StatementAdapter.java:36)
      [mvn] 	at com.carrotsearch.randomizedtesting.rules.SystemPropertiesRestoreRule$1.evaluate(SystemPropertiesRestoreRule.java:53)
      [mvn] 	at org.apache.lucene.util.AbstractBeforeAfterRule$1.evaluate(AbstractBeforeAfterRule.java:45)
      [mvn] 	at org.apache.lucene.util.TestRuleStoreClassName$1.evaluate(TestRuleStoreClassName.java:42)
      [mvn] 	at com.carrotsearch.randomizedtesting.rules.SystemPropertiesInvariantRule$1.evaluate(SystemPropertiesInvariantRule.java:55)
      [mvn] 	at com.carrotsearch.randomizedtesting.rules.NoShadowingOrOverridesOnMethodsRule$1.evaluate(NoShadowingOrOverridesOnMethodsRule.java:39)
      [mvn] 	at com.carrotsearch.randomizedtesting.rules.NoShadowingOrOverridesOnMethodsRule$1.evaluate(NoShadowingOrOverridesOnMethodsRule.java:39)
      [mvn] 	at com.carrotsearch.randomizedtesting.rules.StatementAdapter.evaluate(StatementAdapter.java:36)
      [mvn] 	at org.apache.lucene.util.TestRuleAssertionsRequired$1.evaluate(TestRuleAssertionsRequired.java:43)
      [mvn] 	at org.apache.lucene.util.TestRuleMarkFailure$1.evaluate(TestRuleMarkFailure.java:48)
      [mvn] 	at org.apache.lucene.util.TestRuleIgnoreAfterMaxFailures$1.evaluate(TestRuleIgnoreAfterMaxFailures.java:70)
      [mvn] 	at org.apache.lucene.util.TestRuleIgnoreTestSuites$1.evaluate(TestRuleIgnoreTestSuites.java:55)
      [mvn] 	at com.carrotsearch.randomizedtesting.rules.StatementAdapter.evaluate(StatementAdapter.java:36)
      [mvn] 	at com.carrotsearch.randomizedtesting.ThreadLeakControl$StatementRunner.run(ThreadLeakControl.java:358)
      [mvn] 	at java.lang.Thread.run(Thread.java:679)
      [mvn] Caused by: java.io.FileNotFoundException: dih/solr/collection1/conf/dataimport.properties (No such file or directory)
      [mvn] 	at java.io.FileOutputStream.open(Native Method)
      [mvn] 	at java.io.FileOutputStream.<init>(FileOutputStream.java:209)
      [mvn] 	at java.io.FileOutputStream.<init>(FileOutputStream.java:99)
      [mvn] 	at org.apache.solr.handler.dataimport.SimplePropertiesWriter.persist(SimplePropertiesWriter.java:85)
      [mvn] 	... 50 more
      [mvn] 
      [mvn] Creating dataDir: /usr/home/hudson/hudson-slave/workspace/Lucene-Solr-Maven-trunk/maven-build/solr/contrib/dataimporthandler/target/test/./solrtest-TestSolrEntityProcessorEndToEnd-1347726953440
      [mvn] ASYNC  NEW_CORE C1 name=collection1 org.apache.solr.core.SolrCore@76f33280
      [mvn] 896 T93 C1 oasc.SolrException.log SEVERE org.apache.solr.common.SolrException: undefined field bogus
      [mvn] 		at org.apache.solr.schema.IndexSchema.getDynamicFieldType(IndexSchema.java:1037)
      [mvn] 		at org.apache.solr.schema.IndexSchema$SolrQueryAnalyzer.getWrappedAnalyzer(IndexSchema.java:338)
      [mvn] 		at org.apache.lucene.analysis.AnalyzerWrapper.initReader(AnalyzerWrapper.java:81)
      [mvn] 		at org.apache.lucene.analysis.Analyzer.tokenStream(Analyzer.java:132)
      [mvn] 		at org.apache.lucene.queryparser.classic.QueryParserBase.newFieldQuery(QueryParserBase.java:482)
      [mvn] 		at org.apache.lucene.queryparser.classic.QueryParserBase.getFieldQuery(QueryParserBase.java:470)
      [mvn] 		at org.apache.solr.search.SolrQueryParser.getFieldQuery(SolrQueryParser.java:176)
      [mvn] 		at org.apache.lucene.queryparser.classic.QueryParserBase.handleBareTokenQuery(QueryParserBase.java:1068)
      [mvn] 		at org.apache.lucene.queryparser.classic.QueryParser.Term(QueryParser.java:358)
      [mvn] 		at org.apache.lucene.queryparser.classic.QueryParser.Clause(QueryParser.java:257)
      [mvn] 		at org.apache.lucene.queryparser.classic.QueryParser.Query(QueryParser.java:181)
      [mvn] 		at org.apache.lucene.queryparser.classic.QueryParser.TopLevelQuery(QueryParser.java:170)
      [mvn] 		at org.apache.lucene.queryparser.classic.QueryParserBase.parse(QueryParserBase.java:116)
      [mvn] 		at org.apache.solr.search.LuceneQParser.parse(LuceneQParserPlugin.java:72)
      [mvn] 		at org.apache.solr.search.QParser.getQuery(QParser.java:145)
      [mvn] 		at org.apache.solr.handler.component.QueryComponent.prepare(QueryComponent.java:118)
      [mvn] 		at org.apache.solr.handler.component.SearchHandler.handleRequestBody(SearchHandler.java:185)
      [mvn] 		at org.apache.solr.handler.RequestHandlerBase.handleRequest(RequestHandlerBase.java:129)
      [mvn] 		at org.apache.solr.core.SolrCore.execute(SolrCore.java:1701)
      [mvn] 		at org.apache.solr.servlet.SolrDispatchFilter.execute(SolrDispatchFilter.java:455)
      [mvn] 		at org.apache.solr.servlet.SolrDispatchFilter.doFilter(SolrDispatchFilter.java:276)
      [mvn] 		at org.eclipse.jetty.servlet.ServletHandler$CachedChain.doFilter(ServletHandler.java:1337)
      [mvn] 		at org.eclipse.jetty.servlet.ServletHandler.doHandle(ServletHandler.java:484)
      [mvn] 		at org.eclipse.jetty.server.session.SessionHandler.doHandle(SessionHandler.java:231)
      [mvn] 		at org.eclipse.jetty.server.handler.ScopedHandler.handle(ScopedHandler.java:119)
      [mvn] 		at org.eclipse.jetty.server.handler.GzipHandler.handle(GzipHandler.java:267)
      [mvn] 		at org.eclipse.jetty.server.handler.ContextHandler.doHandle(ContextHandler.java:1067)
      [mvn] 		at org.eclipse.jetty.servlet.ServletHandler.doScope(ServletHandler.java:413)
      [mvn] 		at org.eclipse.jetty.server.session.SessionHandler.doScope(SessionHandler.java:192)
      [mvn] 		at org.eclipse.jetty.server.handler.ContextHandler.doScope(ContextHandler.java:999)
      [mvn] 		at org.eclipse.jetty.server.handler.ScopedHandler.handle(ScopedHandler.java:117)
      [mvn] 		at org.eclipse.jetty.server.handler.HandlerWrapper.handle(HandlerWrapper.java:111)
      [mvn] 		at org.eclipse.jetty.server.Server.handle(Server.java:351)
      [mvn] 		at org.eclipse.jetty.server.AbstractHttpConnection.handleRequest(AbstractHttpConnection.java:454)
      [mvn] 		at org.eclipse.jetty.server.BlockingHttpConnection.handleRequest(BlockingHttpConnection.java:47)
      [mvn] 		at org.eclipse.jetty.server.AbstractHttpConnection.headerComplete(AbstractHttpConnection.java:890)
      [mvn] 		at org.eclipse.jetty.server.AbstractHttpConnection$RequestHandler.headerComplete(AbstractHttpConnection.java:944)
      [mvn] 		at org.eclipse.jetty.http.HttpParser.parseNext(HttpParser.java:634)
      [mvn] 		at org.eclipse.jetty.http.HttpParser.parseAvailable(HttpParser.java:230)
      [mvn] 		at org.eclipse.jetty.server.BlockingHttpConnection.handle(BlockingHttpConnection.java:66)
      [mvn] 		at org.eclipse.jetty.server.bio.SocketConnector$ConnectorEndPoint.run(SocketConnector.java:254)
      [mvn] 		at org.eclipse.jetty.util.thread.QueuedThreadPool.runJob(QueuedThreadPool.java:599)
      [mvn] 		at org.eclipse.jetty.util.thread.QueuedThreadPool$3.run(QueuedThreadPool.java:534)
      [mvn] 		at java.lang.Thread.run(Thread.java:679)
      [mvn] 	
      [mvn] ASYNC  NEW_CORE C2 name=collection1 org.apache.solr.core.SolrCore@5ce345c2
      [mvn] 900 T77 C2 oasc.SolrException.log SEVERE Exception while processing: se document : SolrInputDocument[]:org.apache.solr.handler.dataimport.DataImportHandlerException: org.apache.solr.common.SolrException: undefined field bogus
      [mvn] 		at org.apache.solr.handler.dataimport.DataImportHandlerException.wrapAndThrow(DataImportHandlerException.java:63)
      [mvn] 		at org.apache.solr.handler.dataimport.EntityProcessorWrapper.nextRow(EntityProcessorWrapper.java:246)
      [mvn] 		at org.apache.solr.handler.dataimport.DocBuilder.buildDocument(DocBuilder.java:472)
      [mvn] 		at org.apache.solr.handler.dataimport.DocBuilder.buildDocument(DocBuilder.java:411)
      [mvn] 		at org.apache.solr.handler.dataimport.DocBuilder.doFullDump(DocBuilder.java:326)
      [mvn] 		at org.apache.solr.handler.dataimport.DocBuilder.execute(DocBuilder.java:234)
      [mvn] 		at org.apache.solr.handler.dataimport.DataImporter.doFullImport(DataImporter.java:382)
      [mvn] 		at org.apache.solr.handler.dataimport.DataImporter.runCmd(DataImporter.java:448)
      [mvn] 		at org.apache.solr.handler.dataimport.DataImportHandler.handleRequestBody(DataImportHandler.java:177)
      [mvn] 		at org.apache.solr.handler.RequestHandlerBase.handleRequest(RequestHandlerBase.java:129)
      [mvn] 		at org.apache.solr.core.SolrCore.execute(SolrCore.java:1701)
      [mvn] 		at org.apache.solr.util.TestHarness.query(TestHarness.java:364)
      [mvn] 		at org.apache.solr.handler.dataimport.AbstractDataImportHandlerTestCase.runFullImport(AbstractDataImportHandlerTestCase.java:96)
      [mvn] 		at org.apache.solr.handler.dataimport.TestSolrEntityProcessorEndToEnd.testFullImportBadConfig(TestSolrEntityProcessorEndToEnd.java:247)
      [mvn] 		at sun.reflect.NativeMethodAccessorImpl.invoke0(Native Method)
      [mvn] 		at sun.reflect.NativeMethodAccessorImpl.invoke(NativeMethodAccessorImpl.java:57)
      [mvn] 		at sun.reflect.DelegatingMethodAccessorImpl.invoke(DelegatingMethodAccessorImpl.java:43)
      [mvn] 		at java.lang.reflect.Method.invoke(Method.java:616)
      [mvn] 		at com.carrotsearch.randomizedtesting.RandomizedRunner.invoke(RandomizedRunner.java:1559)
      [mvn] 		at com.carrotsearch.randomizedtesting.RandomizedRunner.access$600(RandomizedRunner.java:79)
      [mvn] 		at com.carrotsearch.randomizedtesting.RandomizedRunner$6.evaluate(RandomizedRunner.java:737)
      [mvn] 		at com.carrotsearch.randomizedtesting.RandomizedRunner$7.evaluate(RandomizedRunner.java:773)
      [mvn] 		at com.carrotsearch.randomizedtesting.RandomizedRunner$8.evaluate(RandomizedRunner.java:787)
      [mvn] 		at com.carrotsearch.randomizedtesting.rules.SystemPropertiesRestoreRule$1.evaluate(SystemPropertiesRestoreRule.java:53)
      [mvn] 		at org.apache.lucene.util.TestRuleSetupTeardownChained$1.evaluate(TestRuleSetupTeardownChained.java:50)
      [mvn] 		at org.apache.lucene.util.TestRuleFieldCacheSanity$1.evaluate(TestRuleFieldCacheSanity.java:51)
      [mvn] 		at org.apache.lucene.util.AbstractBeforeAfterRule$1.evaluate(AbstractBeforeAfterRule.java:45)
      [mvn] 		at com.carrotsearch.randomizedtesting.rules.SystemPropertiesInvariantRule$1.evaluate(SystemPropertiesInvariantRule.java:55)
      [mvn] 		at org.apache.lucene.util.TestRuleThreadAndTestName$1.evaluate(TestRuleThreadAndTestName.java:48)
      [mvn] 		at org.apache.lucene.util.TestRuleIgnoreAfterMaxFailures$1.evaluate(TestRuleIgnoreAfterMaxFailures.java:70)
      [mvn] 		at org.apache.lucene.util.TestRuleMarkFailure$1.evaluate(TestRuleMarkFailure.java:48)
      [mvn] 		at com.carrotsearch.randomizedtesting.rules.StatementAdapter.evaluate(StatementAdapter.java:36)
      [mvn] 		at com.carrotsearch.randomizedtesting.ThreadLeakControl$StatementRunner.run(ThreadLeakControl.java:358)
      [mvn] 		at com.carrotsearch.randomizedtesting.ThreadLeakControl.forkTimeoutingTask(ThreadLeakControl.java:782)
      [mvn] 		at com.carrotsearch.randomizedtesting.ThreadLeakControl$3.evaluate(ThreadLeakControl.java:442)
      [mvn] 		at com.carrotsearch.randomizedtesting.RandomizedRunner.runSingleTest(RandomizedRunner.java:746)
      [mvn] 		at com.carrotsearch.randomizedtesting.RandomizedRunner$3.evaluate(RandomizedRunner.java:648)
      [mvn] 		at com.carrotsearch.randomizedtesting.RandomizedRunner$4.evaluate(RandomizedRunner.java:682)
      [mvn] 		at com.carrotsearch.randomizedtesting.RandomizedRunner$5.evaluate(RandomizedRunner.java:693)
      [mvn] 		at com.carrotsearch.randomizedtesting.rules.StatementAdapter.evaluate(StatementAdapter.java:36)
      [mvn] 		at com.carrotsearch.randomizedtesting.rules.SystemPropertiesRestoreRule$1.evaluate(SystemPropertiesRestoreRule.java:53)
      [mvn] 		at org.apache.lucene.util.AbstractBeforeAfterRule$1.evaluate(AbstractBeforeAfterRule.java:45)
      [mvn] 		at org.apache.lucene.util.TestRuleStoreClassName$1.evaluate(TestRuleStoreClassName.java:42)
      [mvn] 		at com.carrotsearch.randomizedtesting.rules.SystemPropertiesInvariantRule$1.evaluate(SystemPropertiesInvariantRule.java:55)
      [mvn] 		at com.carrotsearch.randomizedtesting.rules.NoShadowingOrOverridesOnMethodsRule$1.evaluate(NoShadowingOrOverridesOnMethodsRule.java:39)
      [mvn] 		at com.carrotsearch.randomizedtesting.rules.NoShadowingOrOverridesOnMethodsRule$1.evaluate(NoShadowingOrOverridesOnMethodsRule.java:39)
      [mvn] 		at com.carrotsearch.randomizedtesting.rules.StatementAdapter.evaluate(StatementAdapter.java:36)
      [mvn] 		at org.apache.lucene.util.TestRuleAssertionsRequired$1.evaluate(TestRuleAssertionsRequired.java:43)
      [mvn] 		at org.apache.lucene.util.TestRuleMarkFailure$1.evaluate(TestRuleMarkFailure.java:48)
      [mvn] 		at org.apache.lucene.util.TestRuleIgnoreAfterMaxFailures$1.evaluate(TestRuleIgnoreAfterMaxFailures.java:70)
      [mvn] 		at org.apache.lucene.util.TestRuleIgnoreTestSuites$1.evaluate(TestRuleIgnoreTestSuites.java:55)
      [mvn] 		at com.carrotsearch.randomizedtesting.rules.StatementAdapter.evaluate(StatementAdapter.java:36)
      [mvn] 		at com.carrotsearch.randomizedtesting.ThreadLeakControl$StatementRunner.run(ThreadLeakControl.java:358)
      [mvn] 		at java.lang.Thread.run(Thread.java:679)
      [mvn] 	Caused by: org.apache.solr.common.SolrException: undefined field bogus
      [mvn] 		at org.apache.solr.client.solrj.impl.HttpSolrServer.request(HttpSolrServer.java:402)
      [mvn] 		at org.apache.solr.client.solrj.impl.HttpSolrServer.request(HttpSolrServer.java:182)
      [mvn] 		at org.apache.solr.client.solrj.request.QueryRequest.process(QueryRequest.java:90)
      [mvn] 		at org.apache.solr.client.solrj.SolrServer.query(SolrServer.java:324)
      [mvn] 		at org.apache.solr.handler.dataimport.SolrEntityProcessor.doQuery(SolrEntityProcessor.java:192)
      [mvn] 		at org.apache.solr.handler.dataimport.SolrEntityProcessor.buildIterator(SolrEntityProcessor.java:130)
      [mvn] 		at org.apache.solr.handler.dataimport.SolrEntityProcessor.nextRow(SolrEntityProcessor.java:116)
      [mvn] 		at org.apache.solr.handler.dataimport.EntityProcessorWrapper.nextRow(EntityProcessorWrapper.java:243)
      [mvn] 		... 52 more
      [mvn] 	
      [mvn] 902 T77 C2 oasc.SolrException.log SEVERE Full Import failed:java.lang.RuntimeException: java.lang.RuntimeException: org.apache.solr.handler.dataimport.DataImportHandlerException: org.apache.solr.common.SolrException: undefined field bogus
      [mvn] 		at org.apache.solr.handler.dataimport.DocBuilder.execute(DocBuilder.java:273)
      [mvn] 		at org.apache.solr.handler.dataimport.DataImporter.doFullImport(DataImporter.java:382)
      [mvn] 		at org.apache.solr.handler.dataimport.DataImporter.runCmd(DataImporter.java:448)
      [mvn] 		at org.apache.solr.handler.dataimport.DataImportHandler.handleRequestBody(DataImportHandler.java:177)
      [mvn] 		at org.apache.solr.handler.RequestHandlerBase.handleRequest(RequestHandlerBase.java:129)
      [mvn] 		at org.apache.solr.core.SolrCore.execute(SolrCore.java:1701)
      [mvn] 		at org.apache.solr.util.TestHarness.query(TestHarness.java:364)
      [mvn] 		at org.apache.solr.handler.dataimport.AbstractDataImportHandlerTestCase.runFullImport(AbstractDataImportHandlerTestCase.java:96)
      [mvn] 		at org.apache.solr.handler.dataimport.TestSolrEntityProcessorEndToEnd.testFullImportBadConfig(TestSolrEntityProcessorEndToEnd.java:247)
      [mvn] 		at sun.reflect.NativeMethodAccessorImpl.invoke0(Native Method)
      [mvn] 		at sun.reflect.NativeMethodAccessorImpl.invoke(NativeMethodAccessorImpl.java:57)
      [mvn] 		at sun.reflect.DelegatingMethodAccessorImpl.invoke(DelegatingMethodAccessorImpl.java:43)
      [mvn] 		at java.lang.reflect.Method.invoke(Method.java:616)
      [mvn] 		at com.carrotsearch.randomizedtesting.RandomizedRunner.invoke(RandomizedRunner.java:1559)
      [mvn] 		at com.carrotsearch.randomizedtesting.RandomizedRunner.access$600(RandomizedRunner.java:79)
      [mvn] 		at com.carrotsearch.randomizedtesting.RandomizedRunner$6.evaluate(RandomizedRunner.java:737)
      [mvn] 		at com.carrotsearch.randomizedtesting.RandomizedRunner$7.evaluate(RandomizedRunner.java:773)
      [mvn] 		at com.carrotsearch.randomizedtesting.RandomizedRunner$8.evaluate(RandomizedRunner.java:787)
      [mvn] 		at com.carrotsearch.randomizedtesting.rules.SystemPropertiesRestoreRule$1.evaluate(SystemPropertiesRestoreRule.java:53)
      [mvn] 		at org.apache.lucene.util.TestRuleSetupTeardownChained$1.evaluate(TestRuleSetupTeardownChained.java:50)
      [mvn] 		at org.apache.lucene.util.TestRuleFieldCacheSanity$1.evaluate(TestRuleFieldCacheSanity.java:51)
      [mvn] 		at org.apache.lucene.util.AbstractBeforeAfterRule$1.evaluate(AbstractBeforeAfterRule.java:45)
      [mvn] 		at com.carrotsearch.randomizedtesting.rules.SystemPropertiesInvariantRule$1.evaluate(SystemPropertiesInvariantRule.java:55)
      [mvn] 		at org.apache.lucene.util.TestRuleThreadAndTestName$1.evaluate(TestRuleThreadAndTestName.java:48)
      [mvn] 		at org.apache.lucene.util.TestRuleIgnoreAfterMaxFailures$1.evaluate(TestRuleIgnoreAfterMaxFailures.java:70)
      [mvn] 		at org.apache.lucene.util.TestRuleMarkFailure$1.evaluate(TestRuleMarkFailure.java:48)
      [mvn] 		at com.carrotsearch.randomizedtesting.rules.StatementAdapter.evaluate(StatementAdapter.java:36)
      [mvn] 		at com.carrotsearch.randomizedtesting.ThreadLeakControl$StatementRunner.run(ThreadLeakControl.java:358)
      [mvn] 		at com.carrotsearch.randomizedtesting.ThreadLeakControl.forkTimeoutingTask(ThreadLeakControl.java:782)
      [mvn] 		at com.carrotsearch.randomizedtesting.ThreadLeakControl$3.evaluate(ThreadLeakControl.java:442)
      [mvn] 		at com.carrotsearch.randomizedtesting.RandomizedRunner.runSingleTest(RandomizedRunner.java:746)
      [mvn] 		at com.carrotsearch.randomizedtesting.RandomizedRunner$3.evaluate(RandomizedRunner.java:648)
      [mvn] 		at com.carrotsearch.randomizedtesting.RandomizedRunner$4.evaluate(RandomizedRunner.java:682)
      [mvn] 		at com.carrotsearch.randomizedtesting.RandomizedRunner$5.evaluate(RandomizedRunner.java:693)
      [mvn] 		at com.carrotsearch.randomizedtesting.rules.StatementAdapter.evaluate(StatementAdapter.java:36)
      [mvn] 		at com.carrotsearch.randomizedtesting.rules.SystemPropertiesRestoreRule$1.evaluate(SystemPropertiesRestoreRule.java:53)
      [mvn] 		at org.apache.lucene.util.AbstractBeforeAfterRule$1.evaluate(AbstractBeforeAfterRule.java:45)
      [mvn] 		at org.apache.lucene.util.TestRuleStoreClassName$1.evaluate(TestRuleStoreClassName.java:42)
      [mvn] 		at com.carrotsearch.randomizedtesting.rules.SystemPropertiesInvariantRule$1.evaluate(SystemPropertiesInvariantRule.java:55)
      [mvn] 		at com.carrotsearch.randomizedtesting.rules.NoShadowingOrOverridesOnMethodsRule$1.evaluate(NoShadowingOrOverridesOnMethodsRule.java:39)
      [mvn] 		at com.carrotsearch.randomizedtesting.rules.NoShadowingOrOverridesOnMethodsRule$1.evaluate(NoShadowingOrOverridesOnMethodsRule.java:39)
      [mvn] 		at com.carrotsearch.randomizedtesting.rules.StatementAdapter.evaluate(StatementAdapter.java:36)
      [mvn] 		at org.apache.lucene.util.TestRuleAssertionsRequired$1.evaluate(TestRuleAssertionsRequired.java:43)
      [mvn] 		at org.apache.lucene.util.TestRuleMarkFailure$1.evaluate(TestRuleMarkFailure.java:48)
      [mvn] 		at org.apache.lucene.util.TestRuleIgnoreAfterMaxFailures$1.evaluate(TestRuleIgnoreAfterMaxFailures.java:70)
      [mvn] 		at org.apache.lucene.util.TestRuleIgnoreTestSuites$1.evaluate(TestRuleIgnoreTestSuites.java:55)
      [mvn] 		at com.carrotsearch.randomizedtesting.rules.StatementAdapter.evaluate(StatementAdapter.java:36)
      [mvn] 		at com.carrotsearch.randomizedtesting.ThreadLeakControl$StatementRunner.run(ThreadLeakControl.java:358)
      [mvn] 		at java.lang.Thread.run(Thread.java:679)
      [mvn] 	Caused by: java.lang.RuntimeException: org.apache.solr.handler.dataimport.DataImportHandlerException: org.apache.solr.common.SolrException: undefined field bogus
      [mvn] 		at org.apache.solr.handler.dataimport.DocBuilder.buildDocument(DocBuilder.java:413)
      [mvn] 		at org.apache.solr.handler.dataimport.DocBuilder.doFullDump(DocBuilder.java:326)
      [mvn] 		at org.apache.solr.handler.dataimport.DocBuilder.execute(DocBuilder.java:234)
      [mvn] 		... 48 more
      [mvn] 	Caused by: org.apache.solr.handler.dataimport.DataImportHandlerException: org.apache.solr.common.SolrException: undefined field bogus
      [mvn] 		at org.apache.solr.handler.dataimport.DataImportHandlerException.wrapAndThrow(DataImportHandlerException.java:63)
      [mvn] 		at org.apache.solr.handler.dataimport.EntityProcessorWrapper.nextRow(EntityProcessorWrapper.java:246)
      [mvn] 		at org.apache.solr.handler.dataimport.DocBuilder.buildDocument(DocBuilder.java:472)
      [mvn] 		at org.apache.solr.handler.dataimport.DocBuilder.buildDocument(DocBuilder.java:411)
      [mvn] 		... 50 more
      [mvn] 	Caused by: org.apache.solr.common.SolrException: undefined field bogus
      [mvn] 		at org.apache.solr.client.solrj.impl.HttpSolrServer.request(HttpSolrServer.java:402)
      [mvn] 		at org.apache.solr.client.solrj.impl.HttpSolrServer.request(HttpSolrServer.java:182)
      [mvn] 		at org.apache.solr.client.solrj.request.QueryRequest.process(QueryRequest.java:90)
      [mvn] 		at org.apache.solr.client.solrj.SolrServer.query(SolrServer.java:324)
      [mvn] 		at org.apache.solr.handler.dataimport.SolrEntityProcessor.doQuery(SolrEntityProcessor.java:192)
      [mvn] 		at org.apache.solr.handler.dataimport.SolrEntityProcessor.buildIterator(SolrEntityProcessor.java:130)
      [mvn] 		at org.apache.solr.handler.dataimport.SolrEntityProcessor.nextRow(SolrEntityProcessor.java:116)
      [mvn] 		at org.apache.solr.handler.dataimport.EntityProcessorWrapper.nextRow(EntityProcessorWrapper.java:243)
      [mvn] 		... 52 more
      [mvn] 	
      [mvn] Creating dataDir: /usr/home/hudson/hudson-slave/workspace/Lucene-Solr-Maven-trunk/maven-build/solr/contrib/dataimporthandler/target/test/./solrtest-TestSolrEntityProcessorEndToEnd-1347726953787
      [mvn] ASYNC  NEW_CORE C3 name=collection1 org.apache.solr.core.SolrCore@65454f68
      [mvn] 76383 T77 C3 oasc.SolrException.log SEVERE Exception in entity : se:org.apache.solr.handler.dataimport.DataImportHandlerException: org.apache.solr.client.solrj.SolrServerException: Server refused connection at: http://localhost:44694/solr
      [mvn] 		at org.apache.solr.handler.dataimport.DataImportHandlerException.wrapAndThrow(DataImportHandlerException.java:63)
      [mvn] 		at org.apache.solr.handler.dataimport.SolrEntityProcessor.doQuery(SolrEntityProcessor.java:197)
      [mvn] 		at org.apache.solr.handler.dataimport.SolrEntityProcessor.buildIterator(SolrEntityProcessor.java:130)
      [mvn] 		at org.apache.solr.handler.dataimport.SolrEntityProcessor.nextRow(SolrEntityProcessor.java:116)
      [mvn] 		at org.apache.solr.handler.dataimport.EntityProcessorWrapper.nextRow(EntityProcessorWrapper.java:243)
      [mvn] 		at org.apache.solr.handler.dataimport.DocBuilder.buildDocument(DocBuilder.java:472)
      [mvn] 		at org.apache.solr.handler.dataimport.DocBuilder.buildDocument(DocBuilder.java:411)
      [mvn] 		at org.apache.solr.handler.dataimport.DocBuilder.doFullDump(DocBuilder.java:326)
      [mvn] 		at org.apache.solr.handler.dataimport.DocBuilder.execute(DocBuilder.java:234)
      [mvn] 		at org.apache.solr.handler.dataimport.DataImporter.doFullImport(DataImporter.java:382)
      [mvn] 		at org.apache.solr.handler.dataimport.DataImporter.runCmd(DataImporter.java:448)
      [mvn] 		at org.apache.solr.handler.dataimport.DataImportHandler.handleRequestBody(DataImportHandler.java:177)
      [mvn] 		at org.apache.solr.handler.RequestHandlerBase.handleRequest(RequestHandlerBase.java:129)
      [mvn] 		at org.apache.solr.core.SolrCore.execute(SolrCore.java:1701)
      [mvn] 		at org.apache.solr.util.TestHarness.query(TestHarness.java:364)
      [mvn] 		at org.apache.solr.handler.dataimport.AbstractDataImportHandlerTestCase.runFullImport(AbstractDataImportHandlerTestCase.java:96)
      [mvn] 		at org.apache.solr.handler.dataimport.TestSolrEntityProcessorEndToEnd.testFullImportWrongSolrUrl(TestSolrEntityProcessorEndToEnd.java:234)
      [mvn] 		at sun.reflect.NativeMethodAccessorImpl.invoke0(Native Method)
      [mvn] 		at sun.reflect.NativeMethodAccessorImpl.invoke(NativeMethodAccessorImpl.java:57)
      [mvn] 		at sun.reflect.DelegatingMethodAccessorImpl.invoke(DelegatingMethodAccessorImpl.java:43)
      [mvn] 		at java.lang.reflect.Method.invoke(Method.java:616)
      [mvn] 		at com.carrotsearch.randomizedtesting.RandomizedRunner.invoke(RandomizedRunner.java:1559)
      [mvn] 		at com.carrotsearch.randomizedtesting.RandomizedRunner.access$600(RandomizedRunner.java:79)
      [mvn] 		at com.carrotsearch.randomizedtesting.RandomizedRunner$6.evaluate(RandomizedRunner.java:737)
      [mvn] 		at com.carrotsearch.randomizedtesting.RandomizedRunner$7.evaluate(RandomizedRunner.java:773)
      [mvn] 		at com.carrotsearch.randomizedtesting.RandomizedRunner$8.evaluate(RandomizedRunner.java:787)
      [mvn] 		at com.carrotsearch.randomizedtesting.rules.SystemPropertiesRestoreRule$1.evaluate(SystemPropertiesRestoreRule.java:53)
      [mvn] 		at org.apache.lucene.util.TestRuleSetupTeardownChained$1.evaluate(TestRuleSetupTeardownChained.java:50)
      [mvn] 		at org.apache.lucene.util.TestRuleFieldCacheSanity$1.evaluate(TestRuleFieldCacheSanity.java:51)
      [mvn] 		at org.apache.lucene.util.AbstractBeforeAfterRule$1.evaluate(AbstractBeforeAfterRule.java:45)
      [mvn] 		at com.carrotsearch.randomizedtesting.rules.SystemPropertiesInvariantRule$1.evaluate(SystemPropertiesInvariantRule.java:55)
      [mvn] 		at org.apache.lucene.util.TestRuleThreadAndTestName$1.evaluate(TestRuleThreadAndTestName.java:48)
      [mvn] 		at org.apache.lucene.util.TestRuleIgnoreAfterMaxFailures$1.evaluate(TestRuleIgnoreAfterMaxFailures.java:70)
      [mvn] 		at org.apache.lucene.util.TestRuleMarkFailure$1.evaluate(TestRuleMarkFailure.java:48)
      [mvn] 		at com.carrotsearch.randomizedtesting.rules.StatementAdapter.evaluate(StatementAdapter.java:36)
      [mvn] 		at com.carrotsearch.randomizedtesting.ThreadLeakControl$StatementRunner.run(ThreadLeakControl.java:358)
      [mvn] 		at com.carrotsearch.randomizedtesting.ThreadLeakControl.forkTimeoutingTask(ThreadLeakControl.java:782)
      [mvn] 		at com.carrotsearch.randomizedtesting.ThreadLeakControl$3.evaluate(ThreadLeakControl.java:442)
      [mvn] 		at com.carrotsearch.randomizedtesting.RandomizedRunner.runSingleTest(RandomizedRunner.java:746)
      [mvn] 		at com.carrotsearch.randomizedtesting.RandomizedRunner$3.evaluate(RandomizedRunner.java:648)
      [mvn] 		at com.carrotsearch.randomizedtesting.RandomizedRunner$4.evaluate(RandomizedRunner.java:682)
      [mvn] 		at com.carrotsearch.randomizedtesting.RandomizedRunner$5.evaluate(RandomizedRunner.java:693)
      [mvn] 		at com.carrotsearch.randomizedtesting.rules.StatementAdapter.evaluate(StatementAdapter.java:36)
      [mvn] 		at com.carrotsearch.randomizedtesting.rules.SystemPropertiesRestoreRule$1.evaluate(SystemPropertiesRestoreRule.java:53)
      [mvn] 		at org.apache.lucene.util.AbstractBeforeAfterRule$1.evaluate(AbstractBeforeAfterRule.java:45)
      [mvn] 		at org.apache.lucene.util.TestRuleStoreClassName$1.evaluate(TestRuleStoreClassName.java:42)
      [mvn] 		at com.carrotsearch.randomizedtesting.rules.SystemPropertiesInvariantRule$1.evaluate(SystemPropertiesInvariantRule.java:55)
      [mvn] 		at com.carrotsearch.randomizedtesting.rules.NoShadowingOrOverridesOnMethodsRule$1.evaluate(NoShadowingOrOverridesOnMethodsRule.java:39)
      [mvn] 		at com.carrotsearch.randomizedtesting.rules.NoShadowingOrOverridesOnMethodsRule$1.evaluate(NoShadowingOrOverridesOnMethodsRule.java:39)
      [mvn] 		at com.carrotsearch.randomizedtesting.rules.StatementAdapter.evaluate(StatementAdapter.java:36)
      [mvn] 		at org.apache.lucene.util.TestRuleAssertionsRequired$1.evaluate(TestRuleAssertionsRequired.java:43)
      [mvn] 		at org.apache.lucene.util.TestRuleMarkFailure$1.evaluate(TestRuleMarkFailure.java:48)
      [mvn] 		at org.apache.lucene.util.TestRuleIgnoreAfterMaxFailures$1.evaluate(TestRuleIgnoreAfterMaxFailures.java:70)
      [mvn] 		at org.apache.lucene.util.TestRuleIgnoreTestSuites$1.evaluate(TestRuleIgnoreTestSuites.java:55)
      [mvn] 		at com.carrotsearch.randomizedtesting.rules.StatementAdapter.evaluate(StatementAdapter.java:36)
      [mvn] 		at com.carrotsearch.randomizedtesting.ThreadLeakControl$StatementRunner.run(ThreadLeakControl.java:358)
      [mvn] 		at java.lang.Thread.run(Thread.java:679)
      [mvn] 	Caused by: org.apache.solr.client.solrj.SolrServerException: Server refused connection at: http://localhost:44694/solr
      [mvn] 		at org.apache.solr.client.solrj.impl.HttpSolrServer.request(HttpSolrServer.java:407)
      [mvn] 		at org.apache.solr.client.solrj.impl.HttpSolrServer.request(HttpSolrServer.java:182)
      [mvn] 		at org.apache.solr.client.solrj.request.QueryRequest.process(QueryRequest.java:90)
      [mvn] 		at org.apache.solr.client.solrj.SolrServer.query(SolrServer.java:324)
      [mvn] 		at org.apache.solr.handler.dataimport.SolrEntityProcessor.doQuery(SolrEntityProcessor.java:192)
      [mvn] 		... 55 more
      [mvn] 	Caused by: org.apache.http.conn.HttpHostConnectException: Connection to http://localhost:44694 refused
      [mvn] 		at org.apache.http.impl.conn.DefaultClientConnectionOperator.openConnection(DefaultClientConnectionOperator.java:158)
      [mvn] 		at org.apache.http.impl.conn.AbstractPoolEntry.open(AbstractPoolEntry.java:150)
      [mvn] 		at org.apache.http.impl.conn.AbstractPooledConnAdapter.open(AbstractPooledConnAdapter.java:121)
      [mvn] 		at org.apache.http.impl.client.DefaultRequestDirector.tryConnect(DefaultRequestDirector.java:575)
      [mvn] 		at org.apache.http.impl.client.DefaultRequestDirector.execute(DefaultRequestDirector.java:425)
      [mvn] 		at org.apache.http.impl.client.AbstractHttpClient.execute(AbstractHttpClient.java:820)
      [mvn] 		at org.apache.http.impl.client.AbstractHttpClient.execute(AbstractHttpClient.java:754)
      [mvn] 		at org.apache.http.impl.client.AbstractHttpClient.execute(AbstractHttpClient.java:732)
      [mvn] 		at org.apache.solr.client.solrj.impl.HttpSolrServer.request(HttpSolrServer.java:353)
      [mvn] 		... 59 more
      [mvn] 	Caused by: java.net.ConnectException: Operation timed out
      [mvn] 		at java.net.PlainSocketImpl.socketConnect(Native Method)
      [mvn] 		at java.net.AbstractPlainSocketImpl.doConnect(AbstractPlainSocketImpl.java:327)
      [mvn] 		at java.net.AbstractPlainSocketImpl.connectToAddress(AbstractPlainSocketImpl.java:193)
      [mvn] 		at java.net.AbstractPlainSocketImpl.connect(AbstractPlainSocketImpl.java:180)
      [mvn] 		at java.net.SocksSocketImpl.connect(SocksSocketImpl.java:384)
      [mvn] 		at java.net.Socket.connect(Socket.java:546)
      [mvn] 		at org.apache.http.conn.scheme.PlainSocketFactory.connectSocket(PlainSocketFactory.java:123)
      [mvn] 		at org.apache.http.impl.conn.DefaultClientConnectionOperator.openConnection(DefaultClientConnectionOperator.java:148)
      [mvn] 		... 67 more
      [mvn] 	
      [mvn] 76392 T77 C3 oashd.DocBuilder.finish SEVERE Could not write property file org.apache.solr.handler.dataimport.DataImportHandlerException: Unable to persist Index Start Time Processing Document # 1
      [mvn] 	at org.apache.solr.handler.dataimport.SimplePropertiesWriter.persist(SimplePropertiesWriter.java:89)
      [mvn] 	at org.apache.solr.handler.dataimport.DocBuilder.finish(DocBuilder.java:310)
      [mvn] 	at org.apache.solr.handler.dataimport.DocBuilder.execute(DocBuilder.java:256)
      [mvn] 	at org.apache.solr.handler.dataimport.DataImporter.doFullImport(DataImporter.java:382)
      [mvn] 	at org.apache.solr.handler.dataimport.DataImporter.runCmd(DataImporter.java:448)
      [mvn] 	at org.apache.solr.handler.dataimport.DataImportHandler.handleRequestBody(DataImportHandler.java:177)
      [mvn] 	at org.apache.solr.handler.RequestHandlerBase.handleRequest(RequestHandlerBase.java:129)
      [mvn] 	at org.apache.solr.core.SolrCore.execute(SolrCore.java:1701)
      [mvn] 	at org.apache.solr.util.TestHarness.query(TestHarness.java:364)
      [mvn] 	at org.apache.solr.handler.dataimport.AbstractDataImportHandlerTestCase.runFullImport(AbstractDataImportHandlerTestCase.java:96)
      [mvn] 	at org.apache.solr.handler.dataimport.TestSolrEntityProcessorEndToEnd.testFullImportWrongSolrUrl(TestSolrEntityProcessorEndToEnd.java:234)
      [mvn] 	at sun.reflect.NativeMethodAccessorImpl.invoke0(Native Method)
      [mvn] 	at sun.reflect.NativeMethodAccessorImpl.invoke(NativeMethodAccessorImpl.java:57)
      [mvn] 	at sun.reflect.DelegatingMethodAccessorImpl.invoke(DelegatingMethodAccessorImpl.java:43)
      [mvn] 	at java.lang.reflect.Method.invoke(Method.java:616)
      [mvn] 	at com.carrotsearch.randomizedtesting.RandomizedRunner.invoke(RandomizedRunner.java:1559)
      [mvn] 	at com.carrotsearch.randomizedtesting.RandomizedRunner.access$600(RandomizedRunner.java:79)
      [mvn] 	at com.carrotsearch.randomizedtesting.RandomizedRunner$6.evaluate(RandomizedRunner.java:737)
      [mvn] 	at com.carrotsearch.randomizedtesting.RandomizedRunner$7.evaluate(RandomizedRunner.java:773)
      [mvn] 	at com.carrotsearch.randomizedtesting.RandomizedRunner$8.evaluate(RandomizedRunner.java:787)
      [mvn] 	at com.carrotsearch.randomizedtesting.rules.SystemPropertiesRestoreRule$1.evaluate(SystemPropertiesRestoreRule.java:53)
      [mvn] 	at org.apache.lucene.util.TestRuleSetupTeardownChained$1.evaluate(TestRuleSetupTeardownChained.java:50)
      [mvn] 	at org.apache.lucene.util.TestRuleFieldCacheSanity$1.evaluate(TestRuleFieldCacheSanity.java:51)
      [mvn] 	at org.apache.lucene.util.AbstractBeforeAfterRule$1.evaluate(AbstractBeforeAfterRule.java:45)
      [mvn] 	at com.carrotsearch.randomizedtesting.rules.SystemPropertiesInvariantRule$1.evaluate(SystemPropertiesInvariantRule.java:55)
      [mvn] 	at org.apache.lucene.util.TestRuleThreadAndTestName$1.evaluate(TestRuleThreadAndTestName.java:48)
      [mvn] 	at org.apache.lucene.util.TestRuleIgnoreAfterMaxFailures$1.evaluate(TestRuleIgnoreAfterMaxFailures.java:70)
      [mvn] 	at org.apache.lucene.util.TestRuleMarkFailure$1.evaluate(TestRuleMarkFailure.java:48)
      [mvn] 	at com.carrotsearch.randomizedtesting.rules.StatementAdapter.evaluate(StatementAdapter.java:36)
      [mvn] 	at com.carrotsearch.randomizedtesting.ThreadLeakControl$StatementRunner.run(ThreadLeakControl.java:358)
      [mvn] 	at com.carrotsearch.randomizedtesting.ThreadLeakControl.forkTimeoutingTask(ThreadLeakControl.java:782)
      [mvn] 	at com.carrotsearch.randomizedtesting.ThreadLeakControl$3.evaluate(ThreadLeakControl.java:442)
      [mvn] 	at com.carrotsearch.randomizedtesting.RandomizedRunner.runSingleTest(RandomizedRunner.java:746)
      [mvn] 	at com.carrotsearch.randomizedtesting.RandomizedRunner$3.evaluate(RandomizedRunner.java:648)
      [mvn] 	at com.carrotsearch.randomizedtesting.RandomizedRunner$4.evaluate(RandomizedRunner.java:682)
      [mvn] 	at com.carrotsearch.randomizedtesting.RandomizedRunner$5.evaluate(RandomizedRunner.java:693)
      [mvn] 	at com.carrotsearch.randomizedtesting.rules.StatementAdapter.evaluate(StatementAdapter.java:36)
      [mvn] 	at com.carrotsearch.randomizedtesting.rules.SystemPropertiesRestoreRule$1.evaluate(SystemPropertiesRestoreRule.java:53)
      [mvn] 	at org.apache.lucene.util.AbstractBeforeAfterRule$1.evaluate(AbstractBeforeAfterRule.java:45)
      [mvn] 	at org.apache.lucene.util.TestRuleStoreClassName$1.evaluate(TestRuleStoreClassName.java:42)
      [mvn] 	at com.carrotsearch.randomizedtesting.rules.SystemPropertiesInvariantRule$1.evaluate(SystemPropertiesInvariantRule.java:55)
      [mvn] 	at com.carrotsearch.randomizedtesting.rules.NoShadowingOrOverridesOnMethodsRule$1.evaluate(NoShadowingOrOverridesOnMethodsRule.java:39)
      [mvn] 	at com.carrotsearch.randomizedtesting.rules.NoShadowingOrOverridesOnMethodsRule$1.evaluate(NoShadowingOrOverridesOnMethodsRule.java:39)
      [mvn] 	at com.carrotsearch.randomizedtesting.rules.StatementAdapter.evaluate(StatementAdapter.java:36)
      [mvn] 	at org.apache.lucene.util.TestRuleAssertionsRequired$1.evaluate(TestRuleAssertionsRequired.java:43)
      [mvn] 	at org.apache.lucene.util.TestRuleMarkFailure$1.evaluate(TestRuleMarkFailure.java:48)
      [mvn] 	at org.apache.lucene.util.TestRuleIgnoreAfterMaxFailures$1.evaluate(TestRuleIgnoreAfterMaxFailures.java:70)
      [mvn] 	at org.apache.lucene.util.TestRuleIgnoreTestSuites$1.evaluate(TestRuleIgnoreTestSuites.java:55)
      [mvn] 	at com.carrotsearch.randomizedtesting.rules.StatementAdapter.evaluate(StatementAdapter.java:36)
      [mvn] 	at com.carrotsearch.randomizedtesting.ThreadLeakControl$StatementRunner.run(ThreadLeakControl.java:358)
      [mvn] 	at java.lang.Thread.run(Thread.java:679)
      [mvn] Caused by: java.io.FileNotFoundException: dih/solr/collection1/conf/dataimport.properties (No such file or directory)
      [mvn] 	at java.io.FileOutputStream.open(Native Method)
      [mvn] 	at java.io.FileOutputStream.<init>(FileOutputStream.java:209)
      [mvn] 	at java.io.FileOutputStream.<init>(FileOutputStream.java:99)
      [mvn] 	at org.apache.solr.handler.dataimport.SimplePropertiesWriter.persist(SimplePropertiesWriter.java:85)
      [mvn] 	... 50 more
      [mvn] 
      [mvn] Creating dataDir: /usr/home/hudson/hudson-slave/workspace/Lucene-Solr-Maven-trunk/maven-build/solr/contrib/dataimporthandler/target/test/./solrtest-TestSolrEntityProcessorEndToEnd-1347727029220
      [mvn] ASYNC  NEW_CORE C4 name=collection1 org.apache.solr.core.SolrCore@17823918
      [mvn] 76906 T77 C4 oashd.DocBuilder.finish SEVERE Could not write property file org.apache.solr.handler.dataimport.DataImportHandlerException: Unable to persist Index Start Time Processing Document # 2
      [mvn] 	at org.apache.solr.handler.dataimport.SimplePropertiesWriter.persist(SimplePropertiesWriter.java:89)
      [mvn] 	at org.apache.solr.handler.dataimport.DocBuilder.finish(DocBuilder.java:310)
      [mvn] 	at org.apache.solr.handler.dataimport.DocBuilder.execute(DocBuilder.java:256)
      [mvn] 	at org.apache.solr.handler.dataimport.DataImporter.doFullImport(DataImporter.java:382)
      [mvn] 	at org.apache.solr.handler.dataimport.DataImporter.runCmd(DataImporter.java:448)
      [mvn] 	at org.apache.solr.handler.dataimport.DataImportHandler.handleRequestBody(DataImportHandler.java:177)
      [mvn] 	at org.apache.solr.handler.RequestHandlerBase.handleRequest(RequestHandlerBase.java:129)
      [mvn] 	at org.apache.solr.core.SolrCore.execute(SolrCore.java:1701)
      [mvn] 	at org.apache.solr.util.TestHarness.query(TestHarness.java:364)
      [mvn] 	at org.apache.solr.handler.dataimport.AbstractDataImportHandlerTestCase.runFullImport(AbstractDataImportHandlerTestCase.java:96)
      [mvn] 	at org.apache.solr.handler.dataimport.TestSolrEntityProcessorEndToEnd.testFullImport(TestSolrEntityProcessorEndToEnd.java:148)
      [mvn] 	at sun.reflect.NativeMethodAccessorImpl.invoke0(Native Method)
      [mvn] 	at sun.reflect.NativeMethodAccessorImpl.invoke(NativeMethodAccessorImpl.java:57)
      [mvn] 	at sun.reflect.DelegatingMethodAccessorImpl.invoke(DelegatingMethodAccessorImpl.java:43)
      [mvn] 	at java.lang.reflect.Method.invoke(Method.java:616)
      [mvn] 	at com.carrotsearch.randomizedtesting.RandomizedRunner.invoke(RandomizedRunner.java:1559)
      [mvn] 	at com.carrotsearch.randomizedtesting.RandomizedRunner.access$600(RandomizedRunner.java:79)
      [mvn] 	at com.carrotsearch.randomizedtesting.RandomizedRunner$6.evaluate(RandomizedRunner.java:737)
      [mvn] 	at com.carrotsearch.randomizedtesting.RandomizedRunner$7.evaluate(RandomizedRunner.java:773)
      [mvn] 	at com.carrotsearch.randomizedtesting.RandomizedRunner$8.evaluate(RandomizedRunner.java:787)
      [mvn] 	at com.carrotsearch.randomizedtesting.rules.SystemPropertiesRestoreRule$1.evaluate(SystemPropertiesRestoreRule.java:53)
      [mvn] 	at org.apache.lucene.util.TestRuleSetupTeardownChained$1.evaluate(TestRuleSetupTeardownChained.java:50)
      [mvn] 	at org.apache.lucene.util.TestRuleFieldCacheSanity$1.evaluate(TestRuleFieldCacheSanity.java:51)
      [mvn] 	at org.apache.lucene.util.AbstractBeforeAfterRule$1.evaluate(AbstractBeforeAfterRule.java:45)
      [mvn] 	at com.carrotsearch.randomizedtesting.rules.SystemPropertiesInvariantRule$1.evaluate(SystemPropertiesInvariantRule.java:55)
      [mvn] 	at org.apache.lucene.util.TestRuleThreadAndTestName$1.evaluate(TestRuleThreadAndTestName.java:48)
      [mvn] 	at org.apache.lucene.util.TestRuleIgnoreAfterMaxFailures$1.evaluate(TestRuleIgnoreAfterMaxFailures.java:70)
      [mvn] 	at org.apache.lucene.util.TestRuleMarkFailure$1.evaluate(TestRuleMarkFailure.java:48)
      [mvn] 	at com.carrotsearch.randomizedtesting.rules.StatementAdapter.evaluate(StatementAdapter.java:36)
      [mvn] 	at com.carrotsearch.randomizedtesting.ThreadLeakControl$StatementRunner.run(ThreadLeakControl.java:358)
      [mvn] 	at com.carrotsearch.randomizedtesting.ThreadLeakControl.forkTimeoutingTask(ThreadLeakControl.java:782)
      [mvn] 	at com.carrotsearch.randomizedtesting.ThreadLeakControl$3.evaluate(ThreadLeakControl.java:442)
      [mvn] 	at com.carrotsearch.randomizedtesting.RandomizedRunner.runSingleTest(RandomizedRunner.java:746)
      [mvn] 	at com.carrotsearch.randomizedtesting.RandomizedRunner$3.evaluate(RandomizedRunner.java:648)
      [mvn] 	at com.carrotsearch.randomizedtesting.RandomizedRunner$4.evaluate(RandomizedRunner.java:682)
      [mvn] 	at com.carrotsearch.randomizedtesting.RandomizedRunner$5.evaluate(RandomizedRunner.java:693)
      [mvn] 	at com.carrotsearch.randomizedtesting.rules.StatementAdapter.evaluate(StatementAdapter.java:36)
      [mvn] 	at com.carrotsearch.randomizedtesting.rules.SystemPropertiesRestoreRule$1.evaluate(SystemPropertiesRestoreRule.java:53)
      [mvn] 	at org.apache.lucene.util.AbstractBeforeAfterRule$1.evaluate(AbstractBeforeAfterRule.java:45)
      [mvn] 	at org.apache.lucene.util.TestRuleStoreClassName$1.evaluate(TestRuleStoreClassName.java:42)
      [mvn] 	at com.carrotsearch.randomizedtesting.rules.SystemPropertiesInvariantRule$1.evaluate(SystemPropertiesInvariantRule.java:55)
      [mvn] 	at com.carrotsearch.randomizedtesting.rules.NoShadowingOrOverridesOnMethodsRule$1.evaluate(NoShadowingOrOverridesOnMethodsRule.java:39)
      [mvn] 	at com.carrotsearch.randomizedtesting.rules.NoShadowingOrOverridesOnMethodsRule$1.evaluate(NoShadowingOrOverridesOnMethodsRule.java:39)
      [mvn] 	at com.carrotsearch.randomizedtesting.rules.StatementAdapter.evaluate(StatementAdapter.java:36)
      [mvn] 	at org.apache.lucene.util.TestRuleAssertionsRequired$1.evaluate(TestRuleAssertionsRequired.java:43)
      [mvn] 	at org.apache.lucene.util.TestRuleMarkFailure$1.evaluate(TestRuleMarkFailure.java:48)
      [mvn] 	at org.apache.lucene.util.TestRuleIgnoreAfterMaxFailures$1.evaluate(TestRuleIgnoreAfterMaxFailures.java:70)
      [mvn] 	at org.apache.lucene.util.TestRuleIgnoreTestSuites$1.evaluate(TestRuleIgnoreTestSuites.java:55)
      [mvn] 	at com

[...truncated too long message...]

n/hudson-slave/workspace/Lucene-Solr-Maven-trunk/maven-build/solr/contrib/velocity/src/main/resources
      [mvn] [INFO] Copying 3 resources
      [mvn] [INFO] [compiler:compile {execution: default-compile}]
      [mvn] [INFO] Compiling 4 source files to /usr/home/hudson/hudson-slave/workspace/Lucene-Solr-Maven-trunk/maven-build/solr/contrib/velocity/target/classes
      [mvn] [INFO] [bundle:manifest {execution: bundle-manifest}]
      [mvn] [debug] execute contextualize
      [mvn] [INFO] [resources:testResources {execution: default-testResources}]
      [mvn] [INFO] Using 'UTF-8' encoding to copy filtered resources.
      [mvn] [INFO] Copying 3 resources
      [mvn] [INFO] Copying 1 resource
      [mvn] [INFO] Copying 3 resources
      [mvn] [INFO] [compiler:testCompile {execution: default-testCompile}]
      [mvn] [INFO] Compiling 1 source file to /usr/home/hudson/hudson-slave/workspace/Lucene-Solr-Maven-trunk/maven-build/solr/contrib/velocity/target/test-classes
      [mvn] [INFO] [surefire:test {execution: default-test}]
      [mvn] [INFO] Surefire report directory: /usr/home/hudson/hudson-slave/workspace/Lucene-Solr-Maven-trunk/maven-build/solr/contrib/velocity/target/surefire-reports
      [mvn] 
      [mvn] -------------------------------------------------------
      [mvn]  T E S T S
      [mvn] -------------------------------------------------------
      [mvn] Running org.apache.solr.velocity.VelocityResponseWriterTest
      [mvn] Creating dataDir: /usr/home/hudson/hudson-slave/workspace/Lucene-Solr-Maven-trunk/maven-build/solr/contrib/velocity/target/test/./solrtest-VelocityResponseWriterTest-1347727092969
      [mvn] Tests run: 1, Failures: 0, Errors: 0, Skipped: 0, Time elapsed: 1.66 sec
      [mvn] 
      [mvn] Results :
      [mvn] 
      [mvn] Tests run: 1, Failures: 0, Errors: 0, Skipped: 0
      [mvn] 
      [mvn] [INFO] [jar:jar {execution: default-jar}]
      [mvn] [INFO] Building jar: /usr/home/hudson/hudson-slave/workspace/Lucene-Solr-Maven-trunk/maven-build/solr/contrib/velocity/target/solr-velocity-5.0-SNAPSHOT.jar
      [mvn] [INFO] [install:install {execution: default-install}]
      [mvn] [INFO] Installing /usr/home/hudson/hudson-slave/workspace/Lucene-Solr-Maven-trunk/maven-build/solr/contrib/velocity/target/solr-velocity-5.0-SNAPSHOT.jar to /home/hudson/.m2/repository/org/apache/solr/solr-velocity/5.0-SNAPSHOT/solr-velocity-5.0-SNAPSHOT.jar
      [mvn] [INFO] ------------------------------------------------------------------------
      [mvn] [INFO] Building Apache Solr Contrib aggregator POM
      [mvn] [INFO]    task-segment: [install]
      [mvn] [INFO] ------------------------------------------------------------------------
      [mvn] [INFO] [groovy:execute {execution: generate-timestamps}]
      [mvn] [INFO] [buildnumber:create {execution: default}]
      [mvn] [INFO] [enforcer:enforce {execution: enforce-java-compat-version-and-maven-2.2.1}]
      [mvn] [INFO] [remote-resources:process {execution: default}]
      [mvn] [INFO] [bundle:manifest {execution: bundle-manifest}]
      [mvn] [WARNING] Ignoring project type pom - supportedProjectTypes = [jar, bundle]
      [mvn] [INFO] [site:attach-descriptor {execution: default-attach-descriptor}]
      [mvn] [INFO] [install:install {execution: default-install}]
      [mvn] [INFO] Installing /usr/home/hudson/hudson-slave/workspace/Lucene-Solr-Maven-trunk/maven-build/solr/contrib/pom.xml to /home/hudson/.m2/repository/org/apache/solr/solr-contrib-aggregator/5.0-SNAPSHOT/solr-contrib-aggregator-5.0-SNAPSHOT.pom
      [mvn] [INFO] 
      [mvn] [INFO] 
      [mvn] [INFO] ------------------------------------------------------------------------
      [mvn] [INFO] Reactor Summary:
      [mvn] [INFO] ------------------------------------------------------------------------
      [mvn] [INFO] Grandparent POM for Apache Lucene Core and Apache Solr  SUCCESS [7.773s]
      [mvn] [INFO] Lucene parent POM ..................................... SUCCESS [0.114s]
      [mvn] [INFO] Lucene Core ........................................... SUCCESS [13.982s]
      [mvn] [INFO] Lucene codecs ......................................... SUCCESS [4.842s]
      [mvn] [INFO] Lucene Test Framework ................................. SUCCESS [4.641s]
      [mvn] [INFO] Lucene Core tests ..................................... SUCCESS [4:08.487s]
      [mvn] [INFO] Lucene Core aggregator POM ............................ SUCCESS [0.089s]
      [mvn] [INFO] Lucene codecs tests ................................... SUCCESS [3.179s]
      [mvn] [INFO] Lucene codecs aggregator POM .......................... SUCCESS [0.085s]
      [mvn] [INFO] Lucene Common Analyzers ............................... SUCCESS [2:03.093s]
      [mvn] [INFO] Lucene ICU Analysis Components ........................ SUCCESS [12.194s]
      [mvn] [INFO] Lucene Kuromoji Japanese Morphological Analyzer ....... SUCCESS [24.179s]
      [mvn] [INFO] Lucene Morfologik Polish Lemmatizer ................... SUCCESS [4.170s]
      [mvn] [INFO] Lucene Phonetic Filters ............................... SUCCESS [16.957s]
      [mvn] [INFO] Lucene Smart Chinese Analyzer ......................... SUCCESS [9.317s]
      [mvn] [INFO] Lucene Stempel Analyzer ............................... SUCCESS [7.399s]
      [mvn] [INFO] Lucene UIMA Analysis Components ....................... SUCCESS [19.351s]
      [mvn] [INFO] Lucene Analysis Modules aggregator POM ................ SUCCESS [0.080s]
      [mvn] [INFO] Lucene Queries ........................................ SUCCESS [10.346s]
      [mvn] [INFO] Lucene Sandbox ........................................ SUCCESS [8.591s]
      [mvn] [INFO] Lucene QueryParsers ................................... SUCCESS [15.282s]
      [mvn] [INFO] Lucene Memory ......................................... SUCCESS [9.149s]
      [mvn] [INFO] Lucene Highlighter .................................... SUCCESS [9.360s]
      [mvn] [INFO] Lucene Facets ......................................... SUCCESS [47.889s]
      [mvn] [INFO] Lucene Benchmark ...................................... SUCCESS [28.382s]
      [mvn] [INFO] Lucene Classification ................................. SUCCESS [5.337s]
      [mvn] [INFO] Lucene Demo ........................................... SUCCESS [4.006s]
      [mvn] [INFO] Lucene Grouping ....................................... SUCCESS [15.711s]
      [mvn] [INFO] Lucene Join ........................................... SUCCESS [22.624s]
      [mvn] [INFO] Lucene Miscellaneous .................................. SUCCESS [6.541s]
      [mvn] [INFO] Lucene Spatial ........................................ SUCCESS [14.104s]
      [mvn] [INFO] Lucene Suggest ........................................ SUCCESS [18.501s]
      [mvn] [INFO] Apache Solr parent POM ................................ SUCCESS [0.154s]
      [mvn] [INFO] Apache Solr Solrj ..................................... SUCCESS [5.009s]
      [mvn] [INFO] Apache Solr Core ...................................... SUCCESS [12.588s]
      [mvn] [INFO] Apache Solr Test Framework ............................ SUCCESS [3.074s]
      [mvn] [INFO] Apache Solr Core tests ................................ FAILED [16:01.673s]
      [mvn] [INFO] Apache Solr Core aggregator POM ....................... SUCCESS [0.082s]
      [mvn] [INFO] Apache Solr Solrj tests ............................... SUCCESS [3:46.877s]
      [mvn] [INFO] Apache Solr Solrj aggregator POM ...................... SUCCESS [0.089s]
      [mvn] [INFO] Apache Solr Search Server ............................. SUCCESS [5.471s]
      [mvn] [INFO] Apache Solr Analysis Extras ........................... SUCCESS [7.900s]
      [mvn] [INFO] Apache Solr Clustering ................................ SUCCESS [14.684s]
      [mvn] [INFO] Apache Solr DataImportHandler ......................... SUCCESS [1:35.401s]
      [mvn] [INFO] Apache Solr DataImportHandler Extras .................. SUCCESS [6.911s]
      [mvn] [INFO] Apache Solr Content Extraction Library ................ SUCCESS [11.036s]
      [mvn] [INFO] Apache Solr Language Identifier ....................... SUCCESS [8.370s]
      [mvn] [INFO] Apache Solr UIMA integration .......................... SUCCESS [29.817s]
      [mvn] [INFO] Apache Solr Velocity .................................. SUCCESS [4.656s]
      [mvn] [INFO] Apache Solr Contrib aggregator POM .................... SUCCESS [0.079s]
      [mvn] [INFO] ------------------------------------------------------------------------
      [mvn] [INFO] Error for project: Apache Solr Core tests (during install)
      [mvn] [INFO] ------------------------------------------------------------------------
      [mvn] [INFO] There are test failures.
      [mvn] 
      [mvn] Please refer to /usr/home/hudson/hudson-slave/workspace/Lucene-Solr-Maven-trunk/maven-build/solr/core/src/test/target/surefire-reports for the individual test results.
      [mvn] [INFO] ------------------------------------------------------------------------
      [mvn] [INFO] For more information, run Maven with the -e switch
      [mvn] [INFO] ------------------------------------------------------------------------
      [mvn] [INFO] BUILD ERRORS
      [mvn] [INFO] ------------------------------------------------------------------------
      [mvn] [INFO] Total time: 35 minutes 10 seconds
      [mvn] [INFO] Finished at: Sat Sep 15 16:38:15 UTC 2012
      [mvn] [INFO] Final Memory: 290M/2192M
      [mvn] [INFO] ------------------------------------------------------------------------

BUILD FAILED
/usr/home/hudson/hudson-slave/workspace/Lucene-Solr-Maven-trunk/build.xml:159: The following error occurred while executing this line:
/usr/home/hudson/hudson-slave/workspace/Lucene-Solr-Maven-trunk/extra-targets.xml:56: Java returned: 1

Total time: 35 minutes 17 seconds
Build step 'Invoke Ant' marked build as failure
Recording test results
Email was triggered for: Failure
Sending email for trigger: Failure




Mime
View raw message