lucene-dev mailing list archives

Site index · List index
Message view « Date » · « Thread »
Top « Date » · « Thread »
From Policeman Jenkins Server <jenk...@sd-datasolutions.de>
Subject [JENKINS] Lucene-Solr-4.x-Linux (64bit/ibm-j9-jdk7) - Build # 1200 - Still Failing!
Date Wed, 19 Sep 2012 04:20:35 GMT
Build: http://jenkins.sd-datasolutions.de/job/Lucene-Solr-4.x-Linux/1200/
Java: 64bit/ibm-j9-jdk7 -Xjit:exclude={org/apache/lucene/util/fst/FST.pack(IIF)Lorg/apache/lucene/util/fst/FST;}

6 tests failed.
REGRESSION:  org.apache.solr.TestDistributedGrouping.testDistribSearch

Error Message:
Server at http://127.0.0.1:37035/solr returned non ok status:500, message:Server Error

Stack Trace:
org.apache.solr.common.SolrException: Server at http://127.0.0.1:37035/solr returned non ok status:500, message:Server Error
	at __randomizedtesting.SeedInfo.seed([1663CC94E0BF23A5:9785428C97E04399]:0)
	at org.apache.solr.client.solrj.impl.HttpSolrServer.request(HttpSolrServer.java:373)
	at org.apache.solr.client.solrj.impl.HttpSolrServer.request(HttpSolrServer.java:182)
	at org.apache.solr.client.solrj.request.QueryRequest.process(QueryRequest.java:90)
	at org.apache.solr.client.solrj.SolrServer.query(SolrServer.java:324)
	at org.apache.solr.BaseDistributedSearchTestCase.queryServer(BaseDistributedSearchTestCase.java:371)
	at org.apache.solr.BaseDistributedSearchTestCase.query(BaseDistributedSearchTestCase.java:394)
	at org.apache.solr.BaseDistributedSearchTestCase.query(BaseDistributedSearchTestCase.java:376)
	at org.apache.solr.TestDistributedGrouping.doTest(TestDistributedGrouping.java:146)
	at org.apache.solr.BaseDistributedSearchTestCase.testDistribSearch(BaseDistributedSearchTestCase.java:701)
	at sun.reflect.NativeMethodAccessorImpl.invoke0(Native Method)
	at sun.reflect.NativeMethodAccessorImpl.invoke(NativeMethodAccessorImpl.java:88)
	at sun.reflect.DelegatingMethodAccessorImpl.invoke(DelegatingMethodAccessorImpl.java:55)
	at java.lang.reflect.Method.invoke(Method.java:613)
	at com.carrotsearch.randomizedtesting.RandomizedRunner.invoke(RandomizedRunner.java:1559)
	at com.carrotsearch.randomizedtesting.RandomizedRunner.access$600(RandomizedRunner.java:79)
	at com.carrotsearch.randomizedtesting.RandomizedRunner$6.evaluate(RandomizedRunner.java:737)
	at com.carrotsearch.randomizedtesting.RandomizedRunner$7.evaluate(RandomizedRunner.java:773)
	at com.carrotsearch.randomizedtesting.RandomizedRunner$8.evaluate(RandomizedRunner.java:787)
	at com.carrotsearch.randomizedtesting.rules.SystemPropertiesRestoreRule$1.evaluate(SystemPropertiesRestoreRule.java:53)
	at org.apache.lucene.util.TestRuleSetupTeardownChained$1.evaluate(TestRuleSetupTeardownChained.java:50)
	at org.apache.lucene.util.TestRuleFieldCacheSanity$1.evaluate(TestRuleFieldCacheSanity.java:51)
	at org.apache.lucene.util.AbstractBeforeAfterRule$1.evaluate(AbstractBeforeAfterRule.java:45)
	at com.carrotsearch.randomizedtesting.rules.SystemPropertiesInvariantRule$1.evaluate(SystemPropertiesInvariantRule.java:55)
	at org.apache.lucene.util.TestRuleThreadAndTestName$1.evaluate(TestRuleThreadAndTestName.java:48)
	at org.apache.lucene.util.TestRuleIgnoreAfterMaxFailures$1.evaluate(TestRuleIgnoreAfterMaxFailures.java:70)
	at org.apache.lucene.util.TestRuleMarkFailure$1.evaluate(TestRuleMarkFailure.java:48)
	at com.carrotsearch.randomizedtesting.rules.StatementAdapter.evaluate(StatementAdapter.java:36)
	at com.carrotsearch.randomizedtesting.ThreadLeakControl$StatementRunner.run(ThreadLeakControl.java:358)
	at com.carrotsearch.randomizedtesting.ThreadLeakControl.forkTimeoutingTask(ThreadLeakControl.java:782)
	at com.carrotsearch.randomizedtesting.ThreadLeakControl$3.evaluate(ThreadLeakControl.java:442)
	at com.carrotsearch.randomizedtesting.RandomizedRunner.runSingleTest(RandomizedRunner.java:746)
	at com.carrotsearch.randomizedtesting.RandomizedRunner$3.evaluate(RandomizedRunner.java:648)
	at com.carrotsearch.randomizedtesting.RandomizedRunner$4.evaluate(RandomizedRunner.java:682)
	at com.carrotsearch.randomizedtesting.RandomizedRunner$5.evaluate(RandomizedRunner.java:693)
	at com.carrotsearch.randomizedtesting.rules.StatementAdapter.evaluate(StatementAdapter.java:36)
	at com.carrotsearch.randomizedtesting.rules.SystemPropertiesRestoreRule$1.evaluate(SystemPropertiesRestoreRule.java:53)
	at org.apache.lucene.util.AbstractBeforeAfterRule$1.evaluate(AbstractBeforeAfterRule.java:45)
	at org.apache.lucene.util.TestRuleStoreClassName$1.evaluate(TestRuleStoreClassName.java:42)
	at com.carrotsearch.randomizedtesting.rules.SystemPropertiesInvariantRule$1.evaluate(SystemPropertiesInvariantRule.java:55)
	at com.carrotsearch.randomizedtesting.rules.NoShadowingOrOverridesOnMethodsRule$1.evaluate(NoShadowingOrOverridesOnMethodsRule.java:39)
	at com.carrotsearch.randomizedtesting.rules.NoShadowingOrOverridesOnMethodsRule$1.evaluate(NoShadowingOrOverridesOnMethodsRule.java:39)
	at com.carrotsearch.randomizedtesting.rules.StatementAdapter.evaluate(StatementAdapter.java:36)
	at org.apache.lucene.util.TestRuleAssertionsRequired$1.evaluate(TestRuleAssertionsRequired.java:43)
	at org.apache.lucene.util.TestRuleMarkFailure$1.evaluate(TestRuleMarkFailure.java:48)
	at org.apache.lucene.util.TestRuleIgnoreAfterMaxFailures$1.evaluate(TestRuleIgnoreAfterMaxFailures.java:70)
	at org.apache.lucene.util.TestRuleIgnoreTestSuites$1.evaluate(TestRuleIgnoreTestSuites.java:55)
	at com.carrotsearch.randomizedtesting.rules.StatementAdapter.evaluate(StatementAdapter.java:36)
	at com.carrotsearch.randomizedtesting.ThreadLeakControl$StatementRunner.run(ThreadLeakControl.java:358)
	at java.lang.Thread.run(Thread.java:777)


REGRESSION:  org.apache.solr.TestDistributedSearch.testDistribSearch

Error Message:
Server at http://127.0.0.1:51044/solr returned non ok status:500, message:Server Error

Stack Trace:
org.apache.solr.common.SolrException: Server at http://127.0.0.1:51044/solr returned non ok status:500, message:Server Error
	at __randomizedtesting.SeedInfo.seed([1663CC94E0BF23A5:9785428C97E04399]:0)
	at org.apache.solr.client.solrj.impl.HttpSolrServer.request(HttpSolrServer.java:373)
	at org.apache.solr.client.solrj.impl.HttpSolrServer.request(HttpSolrServer.java:182)
	at org.apache.solr.client.solrj.request.QueryRequest.process(QueryRequest.java:90)
	at org.apache.solr.client.solrj.SolrServer.query(SolrServer.java:324)
	at org.apache.solr.BaseDistributedSearchTestCase.query(BaseDistributedSearchTestCase.java:388)
	at org.apache.solr.BaseDistributedSearchTestCase.query(BaseDistributedSearchTestCase.java:376)
	at org.apache.solr.TestDistributedSearch.doTest(TestDistributedSearch.java:265)
	at org.apache.solr.BaseDistributedSearchTestCase.testDistribSearch(BaseDistributedSearchTestCase.java:701)
	at sun.reflect.NativeMethodAccessorImpl.invoke0(Native Method)
	at sun.reflect.NativeMethodAccessorImpl.invoke(NativeMethodAccessorImpl.java:88)
	at sun.reflect.DelegatingMethodAccessorImpl.invoke(DelegatingMethodAccessorImpl.java:55)
	at java.lang.reflect.Method.invoke(Method.java:613)
	at com.carrotsearch.randomizedtesting.RandomizedRunner.invoke(RandomizedRunner.java:1559)
	at com.carrotsearch.randomizedtesting.RandomizedRunner.access$600(RandomizedRunner.java:79)
	at com.carrotsearch.randomizedtesting.RandomizedRunner$6.evaluate(RandomizedRunner.java:737)
	at com.carrotsearch.randomizedtesting.RandomizedRunner$7.evaluate(RandomizedRunner.java:773)
	at com.carrotsearch.randomizedtesting.RandomizedRunner$8.evaluate(RandomizedRunner.java:787)
	at com.carrotsearch.randomizedtesting.rules.SystemPropertiesRestoreRule$1.evaluate(SystemPropertiesRestoreRule.java:53)
	at org.apache.lucene.util.TestRuleSetupTeardownChained$1.evaluate(TestRuleSetupTeardownChained.java:50)
	at org.apache.lucene.util.TestRuleFieldCacheSanity$1.evaluate(TestRuleFieldCacheSanity.java:51)
	at org.apache.lucene.util.AbstractBeforeAfterRule$1.evaluate(AbstractBeforeAfterRule.java:45)
	at com.carrotsearch.randomizedtesting.rules.SystemPropertiesInvariantRule$1.evaluate(SystemPropertiesInvariantRule.java:55)
	at org.apache.lucene.util.TestRuleThreadAndTestName$1.evaluate(TestRuleThreadAndTestName.java:48)
	at org.apache.lucene.util.TestRuleIgnoreAfterMaxFailures$1.evaluate(TestRuleIgnoreAfterMaxFailures.java:70)
	at org.apache.lucene.util.TestRuleMarkFailure$1.evaluate(TestRuleMarkFailure.java:48)
	at com.carrotsearch.randomizedtesting.rules.StatementAdapter.evaluate(StatementAdapter.java:36)
	at com.carrotsearch.randomizedtesting.ThreadLeakControl$StatementRunner.run(ThreadLeakControl.java:358)
	at com.carrotsearch.randomizedtesting.ThreadLeakControl.forkTimeoutingTask(ThreadLeakControl.java:782)
	at com.carrotsearch.randomizedtesting.ThreadLeakControl$3.evaluate(ThreadLeakControl.java:442)
	at com.carrotsearch.randomizedtesting.RandomizedRunner.runSingleTest(RandomizedRunner.java:746)
	at com.carrotsearch.randomizedtesting.RandomizedRunner$3.evaluate(RandomizedRunner.java:648)
	at com.carrotsearch.randomizedtesting.RandomizedRunner$4.evaluate(RandomizedRunner.java:682)
	at com.carrotsearch.randomizedtesting.RandomizedRunner$5.evaluate(RandomizedRunner.java:693)
	at com.carrotsearch.randomizedtesting.rules.StatementAdapter.evaluate(StatementAdapter.java:36)
	at com.carrotsearch.randomizedtesting.rules.SystemPropertiesRestoreRule$1.evaluate(SystemPropertiesRestoreRule.java:53)
	at org.apache.lucene.util.AbstractBeforeAfterRule$1.evaluate(AbstractBeforeAfterRule.java:45)
	at org.apache.lucene.util.TestRuleStoreClassName$1.evaluate(TestRuleStoreClassName.java:42)
	at com.carrotsearch.randomizedtesting.rules.SystemPropertiesInvariantRule$1.evaluate(SystemPropertiesInvariantRule.java:55)
	at com.carrotsearch.randomizedtesting.rules.NoShadowingOrOverridesOnMethodsRule$1.evaluate(NoShadowingOrOverridesOnMethodsRule.java:39)
	at com.carrotsearch.randomizedtesting.rules.NoShadowingOrOverridesOnMethodsRule$1.evaluate(NoShadowingOrOverridesOnMethodsRule.java:39)
	at com.carrotsearch.randomizedtesting.rules.StatementAdapter.evaluate(StatementAdapter.java:36)
	at org.apache.lucene.util.TestRuleAssertionsRequired$1.evaluate(TestRuleAssertionsRequired.java:43)
	at org.apache.lucene.util.TestRuleMarkFailure$1.evaluate(TestRuleMarkFailure.java:48)
	at org.apache.lucene.util.TestRuleIgnoreAfterMaxFailures$1.evaluate(TestRuleIgnoreAfterMaxFailures.java:70)
	at org.apache.lucene.util.TestRuleIgnoreTestSuites$1.evaluate(TestRuleIgnoreTestSuites.java:55)
	at com.carrotsearch.randomizedtesting.rules.StatementAdapter.evaluate(StatementAdapter.java:36)
	at com.carrotsearch.randomizedtesting.ThreadLeakControl$StatementRunner.run(ThreadLeakControl.java:358)
	at java.lang.Thread.run(Thread.java:777)


REGRESSION:  org.apache.solr.cloud.BasicDistributedZkTest.testDistribSearch

Error Message:
No live SolrServers available to handle this request:[http://127.0.0.1:49013/solr/collection1, http://127.0.0.1:44410/solr/collection1, http://127.0.0.1:36531/solr/collection1]

Stack Trace:
org.apache.solr.client.solrj.SolrServerException: No live SolrServers available to handle this request:[http://127.0.0.1:49013/solr/collection1, http://127.0.0.1:44410/solr/collection1, http://127.0.0.1:36531/solr/collection1]
	at __randomizedtesting.SeedInfo.seed([1663CC94E0BF23A5:9785428C97E04399]:0)
	at org.apache.solr.client.solrj.impl.LBHttpSolrServer.request(LBHttpSolrServer.java:325)
	at org.apache.solr.client.solrj.impl.CloudSolrServer.request(CloudSolrServer.java:257)
	at org.apache.solr.client.solrj.request.QueryRequest.process(QueryRequest.java:90)
	at org.apache.solr.client.solrj.SolrServer.query(SolrServer.java:324)
	at org.apache.solr.cloud.BasicDistributedZkTest.queryServer(BasicDistributedZkTest.java:1068)
	at org.apache.solr.BaseDistributedSearchTestCase.query(BaseDistributedSearchTestCase.java:394)
	at org.apache.solr.cloud.BasicDistributedZkTest.doTest(BasicDistributedZkTest.java:208)
	at org.apache.solr.BaseDistributedSearchTestCase.testDistribSearch(BaseDistributedSearchTestCase.java:695)
	at sun.reflect.NativeMethodAccessorImpl.invoke0(Native Method)
	at sun.reflect.NativeMethodAccessorImpl.invoke(NativeMethodAccessorImpl.java:88)
	at sun.reflect.DelegatingMethodAccessorImpl.invoke(DelegatingMethodAccessorImpl.java:55)
	at java.lang.reflect.Method.invoke(Method.java:613)
	at com.carrotsearch.randomizedtesting.RandomizedRunner.invoke(RandomizedRunner.java:1559)
	at com.carrotsearch.randomizedtesting.RandomizedRunner.access$600(RandomizedRunner.java:79)
	at com.carrotsearch.randomizedtesting.RandomizedRunner$6.evaluate(RandomizedRunner.java:737)
	at com.carrotsearch.randomizedtesting.RandomizedRunner$7.evaluate(RandomizedRunner.java:773)
	at com.carrotsearch.randomizedtesting.RandomizedRunner$8.evaluate(RandomizedRunner.java:787)
	at com.carrotsearch.randomizedtesting.rules.SystemPropertiesRestoreRule$1.evaluate(SystemPropertiesRestoreRule.java:53)
	at org.apache.lucene.util.TestRuleSetupTeardownChained$1.evaluate(TestRuleSetupTeardownChained.java:50)
	at org.apache.lucene.util.TestRuleFieldCacheSanity$1.evaluate(TestRuleFieldCacheSanity.java:51)
	at org.apache.lucene.util.AbstractBeforeAfterRule$1.evaluate(AbstractBeforeAfterRule.java:45)
	at com.carrotsearch.randomizedtesting.rules.SystemPropertiesInvariantRule$1.evaluate(SystemPropertiesInvariantRule.java:55)
	at org.apache.lucene.util.TestRuleThreadAndTestName$1.evaluate(TestRuleThreadAndTestName.java:48)
	at org.apache.lucene.util.TestRuleIgnoreAfterMaxFailures$1.evaluate(TestRuleIgnoreAfterMaxFailures.java:70)
	at org.apache.lucene.util.TestRuleMarkFailure$1.evaluate(TestRuleMarkFailure.java:48)
	at com.carrotsearch.randomizedtesting.rules.StatementAdapter.evaluate(StatementAdapter.java:36)
	at com.carrotsearch.randomizedtesting.ThreadLeakControl$StatementRunner.run(ThreadLeakControl.java:358)
	at com.carrotsearch.randomizedtesting.ThreadLeakControl.forkTimeoutingTask(ThreadLeakControl.java:782)
	at com.carrotsearch.randomizedtesting.ThreadLeakControl$3.evaluate(ThreadLeakControl.java:442)
	at com.carrotsearch.randomizedtesting.RandomizedRunner.runSingleTest(RandomizedRunner.java:746)
	at com.carrotsearch.randomizedtesting.RandomizedRunner$3.evaluate(RandomizedRunner.java:648)
	at com.carrotsearch.randomizedtesting.RandomizedRunner$4.evaluate(RandomizedRunner.java:682)
	at com.carrotsearch.randomizedtesting.RandomizedRunner$5.evaluate(RandomizedRunner.java:693)
	at com.carrotsearch.randomizedtesting.rules.StatementAdapter.evaluate(StatementAdapter.java:36)
	at com.carrotsearch.randomizedtesting.rules.SystemPropertiesRestoreRule$1.evaluate(SystemPropertiesRestoreRule.java:53)
	at org.apache.lucene.util.AbstractBeforeAfterRule$1.evaluate(AbstractBeforeAfterRule.java:45)
	at org.apache.lucene.util.TestRuleStoreClassName$1.evaluate(TestRuleStoreClassName.java:42)
	at com.carrotsearch.randomizedtesting.rules.SystemPropertiesInvariantRule$1.evaluate(SystemPropertiesInvariantRule.java:55)
	at com.carrotsearch.randomizedtesting.rules.NoShadowingOrOverridesOnMethodsRule$1.evaluate(NoShadowingOrOverridesOnMethodsRule.java:39)
	at com.carrotsearch.randomizedtesting.rules.NoShadowingOrOverridesOnMethodsRule$1.evaluate(NoShadowingOrOverridesOnMethodsRule.java:39)
	at com.carrotsearch.randomizedtesting.rules.StatementAdapter.evaluate(StatementAdapter.java:36)
	at org.apache.lucene.util.TestRuleAssertionsRequired$1.evaluate(TestRuleAssertionsRequired.java:43)
	at org.apache.lucene.util.TestRuleMarkFailure$1.evaluate(TestRuleMarkFailure.java:48)
	at org.apache.lucene.util.TestRuleIgnoreAfterMaxFailures$1.evaluate(TestRuleIgnoreAfterMaxFailures.java:70)
	at org.apache.lucene.util.TestRuleIgnoreTestSuites$1.evaluate(TestRuleIgnoreTestSuites.java:55)
	at com.carrotsearch.randomizedtesting.rules.StatementAdapter.evaluate(StatementAdapter.java:36)
	at com.carrotsearch.randomizedtesting.ThreadLeakControl$StatementRunner.run(ThreadLeakControl.java:358)
	at java.lang.Thread.run(Thread.java:777)
Caused by: org.apache.solr.common.SolrException: Server at http://127.0.0.1:49013/solr/collection1 returned non ok status:500, message:Server Error
	at org.apache.solr.client.solrj.impl.HttpSolrServer.request(HttpSolrServer.java:373)
	at org.apache.solr.client.solrj.impl.HttpSolrServer.request(HttpSolrServer.java:182)
	at org.apache.solr.client.solrj.impl.LBHttpSolrServer.request(LBHttpSolrServer.java:256)
	... 47 more


REGRESSION:  org.apache.solr.handler.component.DistributedQueryElevationComponentTest.testDistribSearch

Error Message:
Server at http://127.0.0.1:41792/solr returned non ok status:500, message:Server Error

Stack Trace:
org.apache.solr.common.SolrException: Server at http://127.0.0.1:41792/solr returned non ok status:500, message:Server Error
	at __randomizedtesting.SeedInfo.seed([1663CC94E0BF23A5:9785428C97E04399]:0)
	at org.apache.solr.client.solrj.impl.HttpSolrServer.request(HttpSolrServer.java:373)
	at org.apache.solr.client.solrj.impl.HttpSolrServer.request(HttpSolrServer.java:182)
	at org.apache.solr.client.solrj.request.QueryRequest.process(QueryRequest.java:90)
	at org.apache.solr.client.solrj.SolrServer.query(SolrServer.java:324)
	at org.apache.solr.BaseDistributedSearchTestCase.queryServer(BaseDistributedSearchTestCase.java:371)
	at org.apache.solr.BaseDistributedSearchTestCase.query(BaseDistributedSearchTestCase.java:394)
	at org.apache.solr.BaseDistributedSearchTestCase.query(BaseDistributedSearchTestCase.java:376)
	at org.apache.solr.handler.component.DistributedQueryElevationComponentTest.doTest(DistributedQueryElevationComponentTest.java:83)
	at org.apache.solr.BaseDistributedSearchTestCase.testDistribSearch(BaseDistributedSearchTestCase.java:695)
	at sun.reflect.NativeMethodAccessorImpl.invoke0(Native Method)
	at sun.reflect.NativeMethodAccessorImpl.invoke(NativeMethodAccessorImpl.java:88)
	at sun.reflect.DelegatingMethodAccessorImpl.invoke(DelegatingMethodAccessorImpl.java:55)
	at java.lang.reflect.Method.invoke(Method.java:613)
	at com.carrotsearch.randomizedtesting.RandomizedRunner.invoke(RandomizedRunner.java:1559)
	at com.carrotsearch.randomizedtesting.RandomizedRunner.access$600(RandomizedRunner.java:79)
	at com.carrotsearch.randomizedtesting.RandomizedRunner$6.evaluate(RandomizedRunner.java:737)
	at com.carrotsearch.randomizedtesting.RandomizedRunner$7.evaluate(RandomizedRunner.java:773)
	at com.carrotsearch.randomizedtesting.RandomizedRunner$8.evaluate(RandomizedRunner.java:787)
	at com.carrotsearch.randomizedtesting.rules.SystemPropertiesRestoreRule$1.evaluate(SystemPropertiesRestoreRule.java:53)
	at org.apache.lucene.util.TestRuleSetupTeardownChained$1.evaluate(TestRuleSetupTeardownChained.java:50)
	at org.apache.lucene.util.TestRuleFieldCacheSanity$1.evaluate(TestRuleFieldCacheSanity.java:51)
	at org.apache.lucene.util.AbstractBeforeAfterRule$1.evaluate(AbstractBeforeAfterRule.java:45)
	at com.carrotsearch.randomizedtesting.rules.SystemPropertiesInvariantRule$1.evaluate(SystemPropertiesInvariantRule.java:55)
	at org.apache.lucene.util.TestRuleThreadAndTestName$1.evaluate(TestRuleThreadAndTestName.java:48)
	at org.apache.lucene.util.TestRuleIgnoreAfterMaxFailures$1.evaluate(TestRuleIgnoreAfterMaxFailures.java:70)
	at org.apache.lucene.util.TestRuleMarkFailure$1.evaluate(TestRuleMarkFailure.java:48)
	at com.carrotsearch.randomizedtesting.rules.StatementAdapter.evaluate(StatementAdapter.java:36)
	at com.carrotsearch.randomizedtesting.ThreadLeakControl$StatementRunner.run(ThreadLeakControl.java:358)
	at com.carrotsearch.randomizedtesting.ThreadLeakControl.forkTimeoutingTask(ThreadLeakControl.java:782)
	at com.carrotsearch.randomizedtesting.ThreadLeakControl$3.evaluate(ThreadLeakControl.java:442)
	at com.carrotsearch.randomizedtesting.RandomizedRunner.runSingleTest(RandomizedRunner.java:746)
	at com.carrotsearch.randomizedtesting.RandomizedRunner$3.evaluate(RandomizedRunner.java:648)
	at com.carrotsearch.randomizedtesting.RandomizedRunner$4.evaluate(RandomizedRunner.java:682)
	at com.carrotsearch.randomizedtesting.RandomizedRunner$5.evaluate(RandomizedRunner.java:693)
	at com.carrotsearch.randomizedtesting.rules.StatementAdapter.evaluate(StatementAdapter.java:36)
	at com.carrotsearch.randomizedtesting.rules.SystemPropertiesRestoreRule$1.evaluate(SystemPropertiesRestoreRule.java:53)
	at org.apache.lucene.util.AbstractBeforeAfterRule$1.evaluate(AbstractBeforeAfterRule.java:45)
	at org.apache.lucene.util.TestRuleStoreClassName$1.evaluate(TestRuleStoreClassName.java:42)
	at com.carrotsearch.randomizedtesting.rules.SystemPropertiesInvariantRule$1.evaluate(SystemPropertiesInvariantRule.java:55)
	at com.carrotsearch.randomizedtesting.rules.NoShadowingOrOverridesOnMethodsRule$1.evaluate(NoShadowingOrOverridesOnMethodsRule.java:39)
	at com.carrotsearch.randomizedtesting.rules.NoShadowingOrOverridesOnMethodsRule$1.evaluate(NoShadowingOrOverridesOnMethodsRule.java:39)
	at com.carrotsearch.randomizedtesting.rules.StatementAdapter.evaluate(StatementAdapter.java:36)
	at org.apache.lucene.util.TestRuleAssertionsRequired$1.evaluate(TestRuleAssertionsRequired.java:43)
	at org.apache.lucene.util.TestRuleMarkFailure$1.evaluate(TestRuleMarkFailure.java:48)
	at org.apache.lucene.util.TestRuleIgnoreAfterMaxFailures$1.evaluate(TestRuleIgnoreAfterMaxFailures.java:70)
	at org.apache.lucene.util.TestRuleIgnoreTestSuites$1.evaluate(TestRuleIgnoreTestSuites.java:55)
	at com.carrotsearch.randomizedtesting.rules.StatementAdapter.evaluate(StatementAdapter.java:36)
	at com.carrotsearch.randomizedtesting.ThreadLeakControl$StatementRunner.run(ThreadLeakControl.java:358)
	at java.lang.Thread.run(Thread.java:777)


REGRESSION:  org.apache.solr.handler.component.StatsComponentTest.testStats

Error Message:
Exception during query

Stack Trace:
java.lang.RuntimeException: Exception during query
	at __randomizedtesting.SeedInfo.seed([1663CC94E0BF23A5:8CE2952B8863ED86]:0)
	at org.apache.solr.util.AbstractSolrTestCase.assertQ(AbstractSolrTestCase.java:283)
	at org.apache.solr.handler.component.StatsComponentTest.doTestFacetStatisticsResult(StatsComponentTest.java:239)
	at org.apache.solr.handler.component.StatsComponentTest.testStats(StatsComponentTest.java:68)
	at sun.reflect.NativeMethodAccessorImpl.invoke0(Native Method)
	at sun.reflect.NativeMethodAccessorImpl.invoke(NativeMethodAccessorImpl.java:88)
	at sun.reflect.DelegatingMethodAccessorImpl.invoke(DelegatingMethodAccessorImpl.java:55)
	at java.lang.reflect.Method.invoke(Method.java:613)
	at com.carrotsearch.randomizedtesting.RandomizedRunner.invoke(RandomizedRunner.java:1559)
	at com.carrotsearch.randomizedtesting.RandomizedRunner.access$600(RandomizedRunner.java:79)
	at com.carrotsearch.randomizedtesting.RandomizedRunner$6.evaluate(RandomizedRunner.java:737)
	at com.carrotsearch.randomizedtesting.RandomizedRunner$7.evaluate(RandomizedRunner.java:773)
	at com.carrotsearch.randomizedtesting.RandomizedRunner$8.evaluate(RandomizedRunner.java:787)
	at com.carrotsearch.randomizedtesting.rules.SystemPropertiesRestoreRule$1.evaluate(SystemPropertiesRestoreRule.java:53)
	at org.apache.lucene.util.TestRuleSetupTeardownChained$1.evaluate(TestRuleSetupTeardownChained.java:50)
	at org.apache.lucene.util.TestRuleFieldCacheSanity$1.evaluate(TestRuleFieldCacheSanity.java:51)
	at org.apache.lucene.util.AbstractBeforeAfterRule$1.evaluate(AbstractBeforeAfterRule.java:45)
	at com.carrotsearch.randomizedtesting.rules.SystemPropertiesInvariantRule$1.evaluate(SystemPropertiesInvariantRule.java:55)
	at org.apache.lucene.util.TestRuleThreadAndTestName$1.evaluate(TestRuleThreadAndTestName.java:48)
	at org.apache.lucene.util.TestRuleIgnoreAfterMaxFailures$1.evaluate(TestRuleIgnoreAfterMaxFailures.java:70)
	at org.apache.lucene.util.TestRuleMarkFailure$1.evaluate(TestRuleMarkFailure.java:48)
	at com.carrotsearch.randomizedtesting.rules.StatementAdapter.evaluate(StatementAdapter.java:36)
	at com.carrotsearch.randomizedtesting.ThreadLeakControl$StatementRunner.run(ThreadLeakControl.java:358)
	at com.carrotsearch.randomizedtesting.ThreadLeakControl.forkTimeoutingTask(ThreadLeakControl.java:782)
	at com.carrotsearch.randomizedtesting.ThreadLeakControl$3.evaluate(ThreadLeakControl.java:442)
	at com.carrotsearch.randomizedtesting.RandomizedRunner.runSingleTest(RandomizedRunner.java:746)
	at com.carrotsearch.randomizedtesting.RandomizedRunner$3.evaluate(RandomizedRunner.java:648)
	at com.carrotsearch.randomizedtesting.RandomizedRunner$4.evaluate(RandomizedRunner.java:682)
	at com.carrotsearch.randomizedtesting.RandomizedRunner$5.evaluate(RandomizedRunner.java:693)
	at com.carrotsearch.randomizedtesting.rules.StatementAdapter.evaluate(StatementAdapter.java:36)
	at com.carrotsearch.randomizedtesting.rules.SystemPropertiesRestoreRule$1.evaluate(SystemPropertiesRestoreRule.java:53)
	at org.apache.lucene.util.AbstractBeforeAfterRule$1.evaluate(AbstractBeforeAfterRule.java:45)
	at org.apache.lucene.util.TestRuleStoreClassName$1.evaluate(TestRuleStoreClassName.java:42)
	at com.carrotsearch.randomizedtesting.rules.SystemPropertiesInvariantRule$1.evaluate(SystemPropertiesInvariantRule.java:55)
	at com.carrotsearch.randomizedtesting.rules.NoShadowingOrOverridesOnMethodsRule$1.evaluate(NoShadowingOrOverridesOnMethodsRule.java:39)
	at com.carrotsearch.randomizedtesting.rules.NoShadowingOrOverridesOnMethodsRule$1.evaluate(NoShadowingOrOverridesOnMethodsRule.java:39)
	at com.carrotsearch.randomizedtesting.rules.StatementAdapter.evaluate(StatementAdapter.java:36)
	at org.apache.lucene.util.TestRuleAssertionsRequired$1.evaluate(TestRuleAssertionsRequired.java:43)
	at org.apache.lucene.util.TestRuleMarkFailure$1.evaluate(TestRuleMarkFailure.java:48)
	at org.apache.lucene.util.TestRuleIgnoreAfterMaxFailures$1.evaluate(TestRuleIgnoreAfterMaxFailures.java:70)
	at org.apache.lucene.util.TestRuleIgnoreTestSuites$1.evaluate(TestRuleIgnoreTestSuites.java:55)
	at com.carrotsearch.randomizedtesting.rules.StatementAdapter.evaluate(StatementAdapter.java:36)
	at com.carrotsearch.randomizedtesting.ThreadLeakControl$StatementRunner.run(ThreadLeakControl.java:358)
	at java.lang.Thread.run(Thread.java:777)
Caused by: java.lang.NullPointerException
	at org.apache.solr.util.NumberUtils.SortableStr2int(NumberUtils.java:162)
	at org.apache.solr.schema.SortableIntField.toObject(SortableIntField.java:96)
	at org.apache.solr.schema.SortableIntField.toObject(SortableIntField.java:55)
	at org.apache.solr.schema.FieldType.toObject(FieldType.java:342)
	at org.apache.solr.handler.component.AbstractStatsValues.accumulate(StatsValuesFactory.java:129)
	at org.apache.solr.handler.component.SimpleStats.getFieldCacheStats(StatsComponent.java:281)
	at org.apache.solr.handler.component.SimpleStats.getStatsFields(StatsComponent.java:227)
	at org.apache.solr.handler.component.SimpleStats.getStatsCounts(StatsComponent.java:201)
	at org.apache.solr.handler.component.StatsComponent.process(StatsComponent.java:70)
	at org.apache.solr.handler.component.SearchHandler.handleRequestBody(SearchHandler.java:206)
	at org.apache.solr.handler.RequestHandlerBase.handleRequest(RequestHandlerBase.java:129)
	at org.apache.solr.core.SolrCore.execute(SolrCore.java:1701)
	at org.apache.solr.util.TestHarness.query(TestHarness.java:364)
	at org.apache.solr.util.TestHarness.query(TestHarness.java:346)
	at org.apache.solr.util.AbstractSolrTestCase.assertQ(AbstractSolrTestCase.java:273)
	... 42 more


REGRESSION:  org.apache.solr.update.AutoCommitTest.testMaxTime

Error Message:
shouldn't find any query failed XPath: //result[@numFound=0]  xml response was: <?xml version="1.0" encoding="UTF-8"?> <response> <lst name="responseHeader"><int name="status">0</int><int name="QTime">1358</int></lst><result name="response" numFound="1" start="0"><doc><int name="id">529</int><int name="range_facet_si">529</int><arr name="range_facet_l"><long>529</long></arr><arr name="range_facet_sl"><long>529</long></arr><arr name="field_t"><str>what's inside?</str></arr><arr name="subject"><str>info</str></arr><int name="intDefault">42</int><date name="timestamp">2012-09-19T04:17:46.405Z</date><arr name="multiDefault"><str>muLti-Default</str></arr></doc></result> </response>   request was: q=id:529&start=0&qt=standard&version=2.2&rows=20

Stack Trace:
java.lang.AssertionError: shouldn't find any query failed XPath: //result[@numFound=0]
 xml response was: <?xml version="1.0" encoding="UTF-8"?>
<response>
<lst name="responseHeader"><int name="status">0</int><int name="QTime">1358</int></lst><result name="response" numFound="1" start="0"><doc><int name="id">529</int><int name="range_facet_si">529</int><arr name="range_facet_l"><long>529</long></arr><arr name="range_facet_sl"><long>529</long></arr><arr name="field_t"><str>what's inside?</str></arr><arr name="subject"><str>info</str></arr><int name="intDefault">42</int><date name="timestamp">2012-09-19T04:17:46.405Z</date><arr name="multiDefault"><str>muLti-Default</str></arr></doc></result>
</response>

 request was: q=id:529&start=0&qt=standard&version=2.2&rows=20
	at __randomizedtesting.SeedInfo.seed([1663CC94E0BF23A5:8C97B1767E25BF99]:0)
	at org.junit.Assert.fail(Assert.java:93)
	at org.apache.solr.util.AbstractSolrTestCase.assertQ(AbstractSolrTestCase.java:276)
	at org.apache.solr.update.AutoCommitTest.testMaxTime(AutoCommitTest.java:217)
	at sun.reflect.NativeMethodAccessorImpl.invoke0(Native Method)
	at sun.reflect.NativeMethodAccessorImpl.invoke(NativeMethodAccessorImpl.java:88)
	at sun.reflect.DelegatingMethodAccessorImpl.invoke(DelegatingMethodAccessorImpl.java:55)
	at java.lang.reflect.Method.invoke(Method.java:613)
	at com.carrotsearch.randomizedtesting.RandomizedRunner.invoke(RandomizedRunner.java:1559)
	at com.carrotsearch.randomizedtesting.RandomizedRunner.access$600(RandomizedRunner.java:79)
	at com.carrotsearch.randomizedtesting.RandomizedRunner$6.evaluate(RandomizedRunner.java:737)
	at com.carrotsearch.randomizedtesting.RandomizedRunner$7.evaluate(RandomizedRunner.java:773)
	at com.carrotsearch.randomizedtesting.RandomizedRunner$8.evaluate(RandomizedRunner.java:787)
	at com.carrotsearch.randomizedtesting.rules.SystemPropertiesRestoreRule$1.evaluate(SystemPropertiesRestoreRule.java:53)
	at org.apache.lucene.util.TestRuleSetupTeardownChained$1.evaluate(TestRuleSetupTeardownChained.java:50)
	at org.apache.lucene.util.TestRuleFieldCacheSanity$1.evaluate(TestRuleFieldCacheSanity.java:51)
	at org.apache.lucene.util.AbstractBeforeAfterRule$1.evaluate(AbstractBeforeAfterRule.java:45)
	at com.carrotsearch.randomizedtesting.rules.SystemPropertiesInvariantRule$1.evaluate(SystemPropertiesInvariantRule.java:55)
	at org.apache.lucene.util.TestRuleThreadAndTestName$1.evaluate(TestRuleThreadAndTestName.java:48)
	at org.apache.lucene.util.TestRuleIgnoreAfterMaxFailures$1.evaluate(TestRuleIgnoreAfterMaxFailures.java:70)
	at org.apache.lucene.util.TestRuleMarkFailure$1.evaluate(TestRuleMarkFailure.java:48)
	at com.carrotsearch.randomizedtesting.rules.StatementAdapter.evaluate(StatementAdapter.java:36)
	at com.carrotsearch.randomizedtesting.ThreadLeakControl$StatementRunner.run(ThreadLeakControl.java:358)
	at com.carrotsearch.randomizedtesting.ThreadLeakControl.forkTimeoutingTask(ThreadLeakControl.java:782)
	at com.carrotsearch.randomizedtesting.ThreadLeakControl$3.evaluate(ThreadLeakControl.java:442)
	at com.carrotsearch.randomizedtesting.RandomizedRunner.runSingleTest(RandomizedRunner.java:746)
	at com.carrotsearch.randomizedtesting.RandomizedRunner$3.evaluate(RandomizedRunner.java:648)
	at com.carrotsearch.randomizedtesting.RandomizedRunner$4.evaluate(RandomizedRunner.java:682)
	at com.carrotsearch.randomizedtesting.RandomizedRunner$5.evaluate(RandomizedRunner.java:693)
	at com.carrotsearch.randomizedtesting.rules.StatementAdapter.evaluate(StatementAdapter.java:36)
	at com.carrotsearch.randomizedtesting.rules.SystemPropertiesRestoreRule$1.evaluate(SystemPropertiesRestoreRule.java:53)
	at org.apache.lucene.util.AbstractBeforeAfterRule$1.evaluate(AbstractBeforeAfterRule.java:45)
	at org.apache.lucene.util.TestRuleStoreClassName$1.evaluate(TestRuleStoreClassName.java:42)
	at com.carrotsearch.randomizedtesting.rules.SystemPropertiesInvariantRule$1.evaluate(SystemPropertiesInvariantRule.java:55)
	at com.carrotsearch.randomizedtesting.rules.NoShadowingOrOverridesOnMethodsRule$1.evaluate(NoShadowingOrOverridesOnMethodsRule.java:39)
	at com.carrotsearch.randomizedtesting.rules.NoShadowingOrOverridesOnMethodsRule$1.evaluate(NoShadowingOrOverridesOnMethodsRule.java:39)
	at com.carrotsearch.randomizedtesting.rules.StatementAdapter.evaluate(StatementAdapter.java:36)
	at org.apache.lucene.util.TestRuleAssertionsRequired$1.evaluate(TestRuleAssertionsRequired.java:43)
	at org.apache.lucene.util.TestRuleMarkFailure$1.evaluate(TestRuleMarkFailure.java:48)
	at org.apache.lucene.util.TestRuleIgnoreAfterMaxFailures$1.evaluate(TestRuleIgnoreAfterMaxFailures.java:70)
	at org.apache.lucene.util.TestRuleIgnoreTestSuites$1.evaluate(TestRuleIgnoreTestSuites.java:55)
	at com.carrotsearch.randomizedtesting.rules.StatementAdapter.evaluate(StatementAdapter.java:36)
	at com.carrotsearch.randomizedtesting.ThreadLeakControl$StatementRunner.run(ThreadLeakControl.java:358)
	at java.lang.Thread.run(Thread.java:777)




Build Log:
[...truncated 7846 lines...]
[junit4:junit4] Suite: org.apache.solr.cloud.BasicDistributedZkTest
[junit4:junit4]   2> 4 T1203 oas.SolrTestCaseJ4.setUp ###Starting testDistribSearch
[junit4:junit4]   2> Creating dataDir: /mnt/ssd/jenkins/workspace/Lucene-Solr-4.x-Linux/solr/build/solr-core/test/J1/./solrtest-BasicDistributedZkTest-1348028169091
[junit4:junit4]   2> 5 T1203 oasc.ZkTestServer.run STARTING ZK TEST SERVER
[junit4:junit4]   2> 6 T1204 oazs.ZooKeeperServer.setTickTime tickTime set to 1000
[junit4:junit4]   2> 6 T1204 oazs.NIOServerCnxn$Factory.<init> binding to port 0.0.0.0/0.0.0.0:0
[junit4:junit4]   2> 7 T1204 oazsp.FileTxnSnapLog.save Snapshotting: 0
[junit4:junit4]   2> 105 T1203 oasc.ZkTestServer.run start zk server on port:51375
[junit4:junit4]   2> 106 T1203 oaz.ZooKeeper.<init> Initiating client connection, connectString=127.0.0.1:51375 sessionTimeout=10000 watcher=org.apache.solr.common.cloud.ConnectionManager@baefc1
[junit4:junit4]   2> 106 T1209 oaz.ClientCnxn$SendThread.startConnect Opening socket connection to server /127.0.0.1:51375
[junit4:junit4]   2> 106 T1203 oascc.ConnectionManager.waitForConnected Waiting for client to connect to ZooKeeper
[junit4:junit4]   2> 107 T1209 oaz.ClientCnxn$SendThread.primeConnection Socket connection established to localhost.localdomain/127.0.0.1:51375, initiating session
[junit4:junit4]   2> 107 T1205 oazs.NIOServerCnxn$Factory.run Accepted socket connection from /127.0.0.1:33805
[junit4:junit4]   2> 108 T1205 oazs.NIOServerCnxn.readConnectRequest Client attempting to establish new session at /127.0.0.1:33805
[junit4:junit4]   2> 108 T1207 oazsp.FileTxnLog.append Creating new log file: log.1
[junit4:junit4]   2> 133 T1207 oazs.NIOServerCnxn.finishSessionInit Established session 0x139dcbd7b860000 with negotiated timeout 10000 for client /127.0.0.1:33805
[junit4:junit4]   2> 133 T1209 oaz.ClientCnxn$SendThread.readConnectResult Session establishment complete on server localhost.localdomain/127.0.0.1:51375, sessionid = 0x139dcbd7b860000, negotiated timeout = 10000
[junit4:junit4]   2> 133 T1210 oascc.ConnectionManager.process Watcher org.apache.solr.common.cloud.ConnectionManager@baefc1 name:ZooKeeperConnection Watcher:127.0.0.1:51375 got event WatchedEvent state:SyncConnected type:None path:null path:null type:None
[junit4:junit4]   2> 134 T1203 oascc.ConnectionManager.waitForConnected Client is connected to ZooKeeper
[junit4:junit4]   2> 134 T1203 oascc.SolrZkClient.makePath makePath: /solr
[junit4:junit4]   2> 135 T1208 oazs.PrepRequestProcessor.pRequest Processed session termination for sessionid: 0x139dcbd7b860000
[junit4:junit4]   2> 135 T1203 oaz.ZooKeeper.close Session: 0x139dcbd7b860000 closed
[junit4:junit4]   2> 136 T1205 oazs.NIOServerCnxn.closeSock Closed socket connection for client /127.0.0.1:33805 which had sessionid 0x139dcbd7b860000
[junit4:junit4]   2> 136 T1203 oaz.ZooKeeper.<init> Initiating client connection, connectString=127.0.0.1:51375/solr sessionTimeout=10000 watcher=org.apache.solr.common.cloud.ConnectionManager@68e5a66c
[junit4:junit4]   2> 136 T1210 oaz.ClientCnxn$EventThread.run EventThread shut down
[junit4:junit4]   2> 137 T1211 oaz.ClientCnxn$SendThread.startConnect Opening socket connection to server /127.0.0.1:51375
[junit4:junit4]   2> 137 T1203 oascc.ConnectionManager.waitForConnected Waiting for client to connect to ZooKeeper
[junit4:junit4]   2> 137 T1211 oaz.ClientCnxn$SendThread.primeConnection Socket connection established to localhost.localdomain/127.0.0.1:51375, initiating session
[junit4:junit4]   2> 137 T1205 oazs.NIOServerCnxn$Factory.run Accepted socket connection from /127.0.0.1:33806
[junit4:junit4]   2> 138 T1205 oazs.NIOServerCnxn.readConnectRequest Client attempting to establish new session at /127.0.0.1:33806
[junit4:junit4]   2> 139 T1211 oaz.ClientCnxn$SendThread.readConnectResult Session establishment complete on server localhost.localdomain/127.0.0.1:51375, sessionid = 0x139dcbd7b860001, negotiated timeout = 10000
[junit4:junit4]   2> 139 T1207 oazs.NIOServerCnxn.finishSessionInit Established session 0x139dcbd7b860001 with negotiated timeout 10000 for client /127.0.0.1:33806
[junit4:junit4]   2> 139 T1212 oascc.ConnectionManager.process Watcher org.apache.solr.common.cloud.ConnectionManager@68e5a66c name:ZooKeeperConnection Watcher:127.0.0.1:51375/solr got event WatchedEvent state:SyncConnected type:None path:null path:null type:None
[junit4:junit4]   2> 140 T1203 oascc.ConnectionManager.waitForConnected Client is connected to ZooKeeper
[junit4:junit4]   2> 140 T1203 oascc.SolrZkClient.makePath makePath: /collections/collection1
[junit4:junit4]   2> 141 T1203 oascc.SolrZkClient.makePath makePath: /collections/collection1/shards
[junit4:junit4]   2> 143 T1203 oascc.SolrZkClient.makePath makePath: /collections/control_collection
[junit4:junit4]   2> 144 T1203 oascc.SolrZkClient.makePath makePath: /collections/control_collection/shards
[junit4:junit4]   2> 145 T1203 oasc.AbstractZkTestCase.putConfig put /mnt/ssd/jenkins/workspace/Lucene-Solr-4.x-Linux/solr/build/solr-core/test-files/solr/collection1/conf/solrconfig.xml to /configs/conf1/solrconfig.xml
[junit4:junit4]   2> 146 T1203 oascc.SolrZkClient.makePath makePath: /configs/conf1/solrconfig.xml
[junit4:junit4]   2> 148 T1203 oasc.AbstractZkTestCase.putConfig put /mnt/ssd/jenkins/workspace/Lucene-Solr-4.x-Linux/solr/build/solr-core/test-files/solr/collection1/conf/schema.xml to /configs/conf1/schema.xml
[junit4:junit4]   2> 148 T1203 oascc.SolrZkClient.makePath makePath: /configs/conf1/schema.xml
[junit4:junit4]   2> 150 T1203 oasc.AbstractZkTestCase.putConfig put /mnt/ssd/jenkins/workspace/Lucene-Solr-4.x-Linux/solr/build/solr-core/test-files/solr/collection1/conf/solrconfig.xml to /configs/conf1/solrconfig.xml
[junit4:junit4]   2> 151 T1203 oascc.SolrZkClient.makePath makePath: /configs/conf1/solrconfig.xml
[junit4:junit4]   2> 152 T1203 oasc.AbstractZkTestCase.putConfig put /mnt/ssd/jenkins/workspace/Lucene-Solr-4.x-Linux/solr/build/solr-core/test-files/solr/collection1/conf/stopwords.txt to /configs/conf1/stopwords.txt
[junit4:junit4]   2> 153 T1203 oascc.SolrZkClient.makePath makePath: /configs/conf1/stopwords.txt
[junit4:junit4]   2> 154 T1203 oasc.AbstractZkTestCase.putConfig put /mnt/ssd/jenkins/workspace/Lucene-Solr-4.x-Linux/solr/build/solr-core/test-files/solr/collection1/conf/protwords.txt to /configs/conf1/protwords.txt
[junit4:junit4]   2> 154 T1203 oascc.SolrZkClient.makePath makePath: /configs/conf1/protwords.txt
[junit4:junit4]   2> 156 T1203 oasc.AbstractZkTestCase.putConfig put /mnt/ssd/jenkins/workspace/Lucene-Solr-4.x-Linux/solr/build/solr-core/test-files/solr/collection1/conf/currency.xml to /configs/conf1/currency.xml
[junit4:junit4]   2> 156 T1203 oascc.SolrZkClient.makePath makePath: /configs/conf1/currency.xml
[junit4:junit4]   2> 157 T1203 oasc.AbstractZkTestCase.putConfig put /mnt/ssd/jenkins/workspace/Lucene-Solr-4.x-Linux/solr/build/solr-core/test-files/solr/collection1/conf/open-exchange-rates.json to /configs/conf1/open-exchange-rates.json
[junit4:junit4]   2> 158 T1203 oascc.SolrZkClient.makePath makePath: /configs/conf1/open-exchange-rates.json
[junit4:junit4]   2> 159 T1203 oasc.AbstractZkTestCase.putConfig put /mnt/ssd/jenkins/workspace/Lucene-Solr-4.x-Linux/solr/build/solr-core/test-files/solr/collection1/conf/mapping-ISOLatin1Accent.txt to /configs/conf1/mapping-ISOLatin1Accent.txt
[junit4:junit4]   2> 159 T1203 oascc.SolrZkClient.makePath makePath: /configs/conf1/mapping-ISOLatin1Accent.txt
[junit4:junit4]   2> 160 T1203 oasc.AbstractZkTestCase.putConfig put /mnt/ssd/jenkins/workspace/Lucene-Solr-4.x-Linux/solr/build/solr-core/test-files/solr/collection1/conf/old_synonyms.txt to /configs/conf1/old_synonyms.txt
[junit4:junit4]   2> 161 T1203 oascc.SolrZkClient.makePath makePath: /configs/conf1/old_synonyms.txt
[junit4:junit4]   2> 162 T1203 oasc.AbstractZkTestCase.putConfig put /mnt/ssd/jenkins/workspace/Lucene-Solr-4.x-Linux/solr/build/solr-core/test-files/solr/collection1/conf/synonyms.txt to /configs/conf1/synonyms.txt
[junit4:junit4]   2> 162 T1203 oascc.SolrZkClient.makePath makePath: /configs/conf1/synonyms.txt
[junit4:junit4]   2> 163 T1208 oazs.PrepRequestProcessor.pRequest Processed session termination for sessionid: 0x139dcbd7b860001
[junit4:junit4]   2> 164 T1212 oaz.ClientCnxn$EventThread.run EventThread shut down
[junit4:junit4]   2> 164 T1205 oazs.NIOServerCnxn.closeSock Closed socket connection for client /127.0.0.1:33806 which had sessionid 0x139dcbd7b860001
[junit4:junit4]   2> 164 T1203 oaz.ZooKeeper.close Session: 0x139dcbd7b860001 closed
[junit4:junit4]   2> 165 T1203 oejs.Server.doStart jetty-8.1.2.v20120308
[junit4:junit4]   2> 168 T1203 oejs.AbstractConnector.doStart Started SocketConnector@0.0.0.0:44082
[junit4:junit4]   2> 168 T1203 oasc.SolrResourceLoader.locateSolrHome JNDI not configured for solr (NoInitialContextEx)
[junit4:junit4]   2> 169 T1203 oasc.SolrResourceLoader.locateSolrHome using system property solr.solr.home: /mnt/ssd/jenkins/workspace/Lucene-Solr-4.x-Linux/solr/build/solr-core/test-files/solr
[junit4:junit4]   2> 169 T1203 oasc.SolrResourceLoader.<init> new SolrResourceLoader for deduced Solr Home: '/mnt/ssd/jenkins/workspace/Lucene-Solr-4.x-Linux/solr/build/solr-core/test-files/solr/'
[junit4:junit4]   2> 178 T1203 oass.SolrDispatchFilter.init SolrDispatchFilter.init()
[junit4:junit4]   2> 179 T1203 oasc.SolrResourceLoader.locateSolrHome JNDI not configured for solr (NoInitialContextEx)
[junit4:junit4]   2> 179 T1203 oasc.SolrResourceLoader.locateSolrHome using system property solr.solr.home: /mnt/ssd/jenkins/workspace/Lucene-Solr-4.x-Linux/solr/build/solr-core/test-files/solr
[junit4:junit4]   2> 180 T1203 oasc.CoreContainer$Initializer.initialize looking for solr.xml: /mnt/ssd/jenkins/workspace/Lucene-Solr-4.x-Linux/solr/build/solr-core/test-files/solr/solr.xml
[junit4:junit4]   2> 180 T1203 oasc.CoreContainer.<init> New CoreContainer 342453347
[junit4:junit4]   2> 181 T1203 oasc.CoreContainer.load Loading CoreContainer using Solr Home: '/mnt/ssd/jenkins/workspace/Lucene-Solr-4.x-Linux/solr/build/solr-core/test-files/solr/'
[junit4:junit4]   2> 181 T1203 oasc.SolrResourceLoader.<init> new SolrResourceLoader for directory: '/mnt/ssd/jenkins/workspace/Lucene-Solr-4.x-Linux/solr/build/solr-core/test-files/solr/'
[junit4:junit4]   2> 193 T1203 oasc.CoreContainer.load Registering Log Listener
[junit4:junit4]   2> 203 T1203 oasc.CoreContainer.initZooKeeper Zookeeper client=127.0.0.1:51375/solr
[junit4:junit4]   2> 203 T1203 oaz.ZooKeeper.<init> Initiating client connection, connectString=127.0.0.1:51375/solr sessionTimeout=5000 watcher=org.apache.solr.common.cloud.ConnectionManager@c9a28d08
[junit4:junit4]   2> 204 T1222 oaz.ClientCnxn$SendThread.startConnect Opening socket connection to server /127.0.0.1:51375
[junit4:junit4]   2> 204 T1203 oascc.ConnectionManager.waitForConnected Waiting for client to connect to ZooKeeper
[junit4:junit4]   2> 205 T1222 oaz.ClientCnxn$SendThread.primeConnection Socket connection established to localhost.localdomain/127.0.0.1:51375, initiating session
[junit4:junit4]   2> 205 T1205 oazs.NIOServerCnxn$Factory.run Accepted socket connection from /127.0.0.1:33808
[junit4:junit4]   2> 205 T1205 oazs.NIOServerCnxn.readConnectRequest Client attempting to establish new session at /127.0.0.1:33808
[junit4:junit4]   2> 206 T1207 oazs.NIOServerCnxn.finishSessionInit Established session 0x139dcbd7b860002 with negotiated timeout 5000 for client /127.0.0.1:33808
[junit4:junit4]   2> 206 T1222 oaz.ClientCnxn$SendThread.readConnectResult Session establishment complete on server localhost.localdomain/127.0.0.1:51375, sessionid = 0x139dcbd7b860002, negotiated timeout = 5000
[junit4:junit4]   2> 206 T1223 oascc.ConnectionManager.process Watcher org.apache.solr.common.cloud.ConnectionManager@c9a28d08 name:ZooKeeperConnection Watcher:127.0.0.1:51375/solr got event WatchedEvent state:SyncConnected type:None path:null path:null type:None
[junit4:junit4]   2> 207 T1203 oascc.ConnectionManager.waitForConnected Client is connected to ZooKeeper
[junit4:junit4]   2> 208 T1208 oazs.PrepRequestProcessor.pRequest Got user-level KeeperException when processing sessionid:0x139dcbd7b860002 type:create cxid:0x2 zxid:0xfffffffffffffffe txntype:unknown reqpath:n/a Error Path:/solr/overseer Error:KeeperErrorCode = NodeExists for /solr/overseer
[junit4:junit4]   2> 208 T1203 oascc.SolrZkClient.makePath makePath: /live_nodes
[junit4:junit4]   2> 210 T1203 oasc.ZkController.createEphemeralLiveNode Register node as live in ZooKeeper:/live_nodes/127.0.0.1:44082_solr
[junit4:junit4]   2> 210 T1208 oazs.PrepRequestProcessor.pRequest Got user-level KeeperException when processing sessionid:0x139dcbd7b860002 type:delete cxid:0x7 zxid:0xfffffffffffffffe txntype:unknown reqpath:n/a Error Path:/solr/live_nodes/127.0.0.1:44082_solr Error:KeeperErrorCode = NoNode for /solr/live_nodes/127.0.0.1:44082_solr
[junit4:junit4]   2> 211 T1203 oascc.SolrZkClient.makePath makePath: /live_nodes/127.0.0.1:44082_solr
[junit4:junit4]   2> 212 T1203 oashc.HttpShardHandlerFactory.getParameter Setting socketTimeout to: 0
[junit4:junit4]   2> 213 T1203 oashc.HttpShardHandlerFactory.getParameter Setting urlScheme to: http://
[junit4:junit4]   2> 213 T1203 oashc.HttpShardHandlerFactory.getParameter Setting connTimeout to: 0
[junit4:junit4]   2> 214 T1203 oashc.HttpShardHandlerFactory.getParameter Setting maxConnectionsPerHost to: 20
[junit4:junit4]   2> 214 T1203 oashc.HttpShardHandlerFactory.getParameter Setting corePoolSize to: 0
[junit4:junit4]   2> 215 T1203 oashc.HttpShardHandlerFactory.getParameter Setting maximumPoolSize to: 2147483647
[junit4:junit4]   2> 215 T1203 oashc.HttpShardHandlerFactory.getParameter Setting maxThreadIdleTime to: 5
[junit4:junit4]   2> 216 T1203 oashc.HttpShardHandlerFactory.getParameter Setting sizeOfQueue to: -1
[junit4:junit4]   2> 216 T1203 oashc.HttpShardHandlerFactory.getParameter Setting fairnessPolicy to: false
[junit4:junit4]   2> 217 T1203 oascsi.HttpClientUtil.createClient Creating new http client, config:maxConnectionsPerHost=20&maxConnections=10000&socketTimeout=0&connTimeout=0&retry=false
[junit4:junit4]   2> 220 T1203 oascc.SolrZkClient.makePath makePath: /overseer_elect/election
[junit4:junit4]   2> 222 T1208 oazs.PrepRequestProcessor.pRequest Got user-level KeeperException when processing sessionid:0x139dcbd7b860002 type:delete cxid:0x15 zxid:0xfffffffffffffffe txntype:unknown reqpath:n/a Error Path:/solr/overseer_elect/leader Error:KeeperErrorCode = NoNode for /solr/overseer_elect/leader
[junit4:junit4]   2> 223 T1203 oascc.SolrZkClient.makePath makePath: /overseer_elect/leader
[junit4:junit4]   2> 224 T1203 oasc.Overseer.start Overseer (id=88344374089744386-127.0.0.1:44082_solr-n_0000000000) starting
[junit4:junit4]   2> 225 T1208 oazs.PrepRequestProcessor.pRequest Got user-level KeeperException when processing sessionid:0x139dcbd7b860002 type:create cxid:0x1a zxid:0xfffffffffffffffe txntype:unknown reqpath:n/a Error Path:/solr/overseer Error:KeeperErrorCode = NodeExists for /solr/overseer
[junit4:junit4]   2> 225 T1208 oazs.PrepRequestProcessor.pRequest Got user-level KeeperException when processing sessionid:0x139dcbd7b860002 type:create cxid:0x1b zxid:0xfffffffffffffffe txntype:unknown reqpath:n/a Error Path:/solr/overseer Error:KeeperErrorCode = NodeExists for /solr/overseer
[junit4:junit4]   2> 225 T1208 oazs.PrepRequestProcessor.pRequest Got user-level KeeperException when processing sessionid:0x139dcbd7b860002 type:create cxid:0x1c zxid:0xfffffffffffffffe txntype:unknown reqpath:n/a Error Path:/solr/overseer Error:KeeperErrorCode = NodeExists for /solr/overseer
[junit4:junit4]   2> 226 T1208 oazs.PrepRequestProcessor.pRequest Got user-level KeeperException when processing sessionid:0x139dcbd7b860002 type:create cxid:0x1d zxid:0xfffffffffffffffe txntype:unknown reqpath:n/a Error Path:/solr/overseer Error:KeeperErrorCode = NodeExists for /solr/overseer
[junit4:junit4]   2> 227 T1225 oasc.OverseerCollectionProcessor.run Process current queue of collection creations
[junit4:junit4]   2> 227 T1203 oascc.SolrZkClient.makePath makePath: /clusterstate.json
[junit4:junit4]   2> 228 T1203 oascc.ZkStateReader.createClusterStateWatchersAndUpdate Updating cluster state from ZooKeeper... 
[junit4:junit4]   2> 229 T1224 oasc.Overseer$ClusterStateUpdater.run Starting to work on the main queue
[junit4:junit4]   2> 231 T1203 oasc.CoreContainer.create Creating SolrCore 'collection1' using instanceDir: /mnt/ssd/jenkins/workspace/Lucene-Solr-4.x-Linux/solr/build/solr-core/test-files/solr/collection1
[junit4:junit4]   2> 232 T1203 oasc.ZkController.createCollectionZkNode Check for collection zkNode:control_collection
[junit4:junit4]   2> 232 T1203 oasc.ZkController.createCollectionZkNode Collection zkNode exists
[junit4:junit4]   2> 233 T1203 oasc.ZkController.readConfigName Load collection config from:/collections/control_collection
[junit4:junit4]   2> 233 T1203 oasc.SolrResourceLoader.<init> new SolrResourceLoader for directory: '/mnt/ssd/jenkins/workspace/Lucene-Solr-4.x-Linux/solr/build/solr-core/test-files/solr/collection1/'
[junit4:junit4]   2> 234 T1203 oasc.SolrResourceLoader.replaceClassLoader Adding 'file:/mnt/ssd/jenkins/workspace/Lucene-Solr-4.x-Linux/solr/build/solr-core/test-files/solr/collection1/lib/README' to classloader
[junit4:junit4]   2> 235 T1203 oasc.SolrResourceLoader.replaceClassLoader Adding 'file:/mnt/ssd/jenkins/workspace/Lucene-Solr-4.x-Linux/solr/build/solr-core/test-files/solr/collection1/lib/classes/' to classloader
[junit4:junit4]   2> 270 T1203 oasc.SolrConfig.<init> Using Lucene MatchVersion: LUCENE_40
[junit4:junit4]   2> 311 T1203 oasc.SolrConfig.<init> Loaded SolrConfig: solrconfig.xml
[junit4:junit4]   2> 312 T1203 oass.IndexSchema.readSchema Reading Solr Schema
[junit4:junit4]   2> 317 T1203 oass.IndexSchema.readSchema Schema name=test
[junit4:junit4]   2> 689 T1203 oass.OpenExchangeRatesOrgProvider.init Initialized with rates=open-exchange-rates.json, refreshInterval=1440.
[junit4:junit4]   2> 696 T1203 oass.IndexSchema.readSchema default search field in schema is text
[junit4:junit4]   2> 699 T1203 oass.IndexSchema.readSchema unique key field: id
[junit4:junit4]   2> 706 T1203 oass.FileExchangeRateProvider.reload Reloading exchange rates from file currency.xml
[junit4:junit4]   2> 710 T1203 oass.FileExchangeRateProvider.reload Reloading exchange rates from file currency.xml
[junit4:junit4]   2> 714 T1203 oass.OpenExchangeRatesOrgProvider.reload Reloading exchange rates from open-exchange-rates.json
[junit4:junit4]   2> 715 T1203 oass.OpenExchangeRatesOrgProvider.reload Reloading exchange rates from open-exchange-rates.json
[junit4:junit4]   2> 716 T1203 oasc.SolrCore.<init> [collection1] Opening new SolrCore at /mnt/ssd/jenkins/workspace/Lucene-Solr-4.x-Linux/solr/build/solr-core/test-files/solr/collection1/, dataDir=./org.apache.solr.cloud.BasicDistributedZkTest-1348028169091/control/data/
[junit4:junit4]   2> 717 T1203 oasc.JmxMonitoredMap.<init> JMX monitoring is enabled. Adding Solr mbeans to JMX Server: com.sun.jmx.mbeanserver.JmxMBeanServer@600f5654
[junit4:junit4]   2> 717 T1203 oasc.SolrCore.getNewIndexDir WARNING New index directory detected: old=null new=./org.apache.solr.cloud.BasicDistributedZkTest-1348028169091/control/data/index/
[junit4:junit4]   2> 718 T1203 oasc.SolrCore.initIndex WARNING [collection1] Solr index directory './org.apache.solr.cloud.BasicDistributedZkTest-1348028169091/control/data/index' doesn't exist. Creating new index...
[junit4:junit4]   2> 718 T1203 oasc.CachingDirectoryFactory.get return new directory for /mnt/ssd/jenkins/workspace/Lucene-Solr-4.x-Linux/solr/build/solr-core/test/J1/./org.apache.solr.cloud.BasicDistributedZkTest-1348028169091/control/data/index forceNew:false
[junit4:junit4]   2> 722 T1203 oasc.SolrDeletionPolicy.onCommit SolrDeletionPolicy.onCommit: commits:num=1
[junit4:junit4]   2> 		commit{dir=NRTCachingDirectory(org.apache.lucene.store.MMapDirectory@/mnt/ssd/jenkins/workspace/Lucene-Solr-4.x-Linux/solr/build/solr-core/test/J1/org.apache.solr.cloud.BasicDistributedZkTest-1348028169091/control/data/index lockFactory=org.apache.lucene.store.NativeFSLockFactory@7dc2280c; maxCacheMB=48.0 maxMergeSizeMB=4.0),segFN=segments_1,generation=1,filenames=[segments_1]
[junit4:junit4]   2> 723 T1203 oasc.SolrDeletionPolicy.updateCommits newest commit = 1
[junit4:junit4]   2> 723 T1203 oasc.SolrCore.initWriters created xml: solr.XMLResponseWriter
[junit4:junit4]   2> 725 T1203 oasup.UpdateRequestProcessorChain.init inserting DistributedUpdateProcessorFactory into updateRequestProcessorChain "dedupe"
[junit4:junit4]   2> 725 T1203 oasup.UpdateRequestProcessorChain.init inserting DistributedUpdateProcessorFactory into updateRequestProcessorChain "dedupe-allfields"
[junit4:junit4]   2> 726 T1203 oasup.UpdateRequestProcessorChain.init inserting DistributedUpdateProcessorFactory into updateRequestProcessorChain "stored_sig"
[junit4:junit4]   2> 726 T1203 oasup.UpdateRequestProcessorChain.init inserting DistributedUpdateProcessorFactory into updateRequestProcessorChain "uniq-fields"
[junit4:junit4]   2> 727 T1203 oasup.UpdateRequestProcessorChain.init inserting DistributedUpdateProcessorFactory into updateRequestProcessorChain "distrib-dup-test-chain-implicit"
[junit4:junit4]   2> 728 T1203 oasc.RequestHandlers.initHandlersFromConfig adding lazy requestHandler: solr.ReplicationHandler
[junit4:junit4]   2> 729 T1203 oasc.RequestHandlers.initHandlersFromConfig created /replication: solr.ReplicationHandler
[junit4:junit4]   2> 730 T1203 oasc.RequestHandlers.initHandlersFromConfig created standard: solr.StandardRequestHandler
[junit4:junit4]   2> 730 T1203 oasc.RequestHandlers.initHandlersFromConfig created /get: solr.RealTimeGetHandler
[junit4:junit4]   2> 731 T1203 oasc.RequestHandlers.initHandlersFromConfig created dismax: solr.SearchHandler
[junit4:junit4]   2> 731 T1203 oasc.RequestHandlers.initHandlersFromConfig created mock: org.apache.solr.core.MockQuerySenderListenerReqHandler
[junit4:junit4]   2> 732 T1203 oasc.RequestHandlers.initHandlersFromConfig created /admin/: org.apache.solr.handler.admin.AdminHandlers
[junit4:junit4]   2> 732 T1203 oasc.RequestHandlers.initHandlersFromConfig created defaults: solr.StandardRequestHandler
[junit4:junit4]   2> 733 T1203 oasc.RequestHandlers.initHandlersFromConfig adding lazy requestHandler: solr.StandardRequestHandler
[junit4:junit4]   2> 733 T1203 oasc.RequestHandlers.initHandlersFromConfig created lazy: solr.StandardRequestHandler
[junit4:junit4]   2> 734 T1203 oasc.RequestHandlers.initHandlersFromConfig created /update: solr.UpdateRequestHandler
[junit4:junit4]   2> 734 T1203 oasc.RequestHandlers.initHandlersFromConfig created /terms: org.apache.solr.handler.component.SearchHandler
[junit4:junit4]   2> 735 T1203 oasc.RequestHandlers.initHandlersFromConfig created spellCheckCompRH: org.apache.solr.handler.component.SearchHandler
[junit4:junit4]   2> 735 T1203 oasc.RequestHandlers.initHandlersFromConfig created spellCheckCompRH_Direct: org.apache.solr.handler.component.SearchHandler
[junit4:junit4]   2> 736 T1203 oasc.RequestHandlers.initHandlersFromConfig created spellCheckWithWordbreak: org.apache.solr.handler.component.SearchHandler
[junit4:junit4]   2> 736 T1203 oasc.RequestHandlers.initHandlersFromConfig created spellCheckWithWordbreak_Direct: org.apache.solr.handler.component.SearchHandler
[junit4:junit4]   2> 737 T1203 oasc.RequestHandlers.initHandlersFromConfig created spellCheckCompRH1: org.apache.solr.handler.component.SearchHandler
[junit4:junit4]   2> 738 T1203 oasc.RequestHandlers.initHandlersFromConfig created tvrh: org.apache.solr.handler.component.SearchHandler
[junit4:junit4]   2> 738 T1203 oasc.RequestHandlers.initHandlersFromConfig created /mlt: solr.MoreLikeThisHandler
[junit4:junit4]   2> 739 T1203 oasc.RequestHandlers.initHandlersFromConfig created /debug/dump: solr.DumpRequestHandler
[junit4:junit4]   2> 739 T1203 oashl.XMLLoader.init xsltCacheLifetimeSeconds=60
[junit4:junit4]   2> 741 T1203 oasc.SolrCore.initDeprecatedSupport WARNING solrconfig.xml uses deprecated <admin/gettableFiles>, Please update your config to use the ShowFileRequestHandler.
[junit4:junit4]   2> 742 T1203 oasc.SolrCore.initDeprecatedSupport WARNING adding ShowFileRequestHandler with hidden files: [OLD_SYNONYMS.TXT, PROTWORDS.TXT, STOPWORDS.TXT, OPEN-EXCHANGE-RATES.JSON, CURRENCY.XML, SCHEMA.XML, SYNONYMS.TXT, MAPPING-ISOLATIN1ACCENT.TXT]
[junit4:junit4]   2> 744 T1203 oass.SolrIndexSearcher.<init> Opening Searcher@676917c2 main
[junit4:junit4]   2> 745 T1203 oasu.CommitTracker.<init> Hard AutoCommit: disabled
[junit4:junit4]   2> 746 T1203 oasu.CommitTracker.<init> Soft AutoCommit: disabled
[junit4:junit4]   2> 746 T1203 oashc.SpellCheckComponent.inform Initializing spell checkers
[junit4:junit4]   2> 750 T1203 oass.DirectSolrSpellChecker.init init: {name=direct,classname=DirectSolrSpellChecker,field=lowerfilt,minQueryLength=3}
[junit4:junit4]   2> 768 T1226 oasc.SolrCore.registerSearcher [collection1] Registered new searcher Searcher@676917c2 main{StandardDirectoryReader(segments_1:1)}
[junit4:junit4]   2> 773 T1208 oazs.PrepRequestProcessor.pRequest Got user-level KeeperException when processing sessionid:0x139dcbd7b860002 type:create cxid:0x53 zxid:0xfffffffffffffffe txntype:unknown reqpath:n/a Error Path:/solr/overseer/queue Error:KeeperErrorCode = NoNode for /solr/overseer/queue
[junit4:junit4]   2> 774 T1203 oasc.CoreContainer.register registering core: collection1
[junit4:junit4]   2> 775 T1203 oasc.ZkController.register Register shard - core:collection1 address:http://127.0.0.1:44082/solr shardId:control_shard
[junit4:junit4]   2> 776 T1203 oascc.SolrZkClient.makePath makePath: /collections/control_collection/leader_elect/control_shard/election
[junit4:junit4]   2> 780 T1208 oazs.PrepRequestProcessor.pRequest Got user-level KeeperException when processing sessionid:0x139dcbd7b860002 type:delete cxid:0x62 zxid:0xfffffffffffffffe txntype:unknown reqpath:n/a Error Path:/solr/collections/control_collection/leaders Error:KeeperErrorCode = NoNode for /solr/collections/control_collection/leaders
[junit4:junit4]   2> 781 T1203 oasc.ShardLeaderElectionContext.runLeaderProcess Running the leader process.
[junit4:junit4]   2> 782 T1208 oazs.PrepRequestProcessor.pRequest Got user-level KeeperException when processing sessionid:0x139dcbd7b860002 type:create cxid:0x63 zxid:0xfffffffffffffffe txntype:unknown reqpath:n/a Error Path:/solr/overseer Error:KeeperErrorCode = NodeExists for /solr/overseer
[junit4:junit4]   2> 1232 T1224 oascc.ZkStateReader.updateClusterState Updating cloud state from ZooKeeper... 
[junit4:junit4]   2> 1233 T1208 oazs.PrepRequestProcessor.pRequest Got user-level KeeperException when processing sessionid:0x139dcbd7b860002 type:create cxid:0x6a zxid:0xfffffffffffffffe txntype:unknown reqpath:n/a Error Path:/solr/overseer/queue-work Error:KeeperErrorCode = NoNode for /solr/overseer/queue-work
[junit4:junit4]   2> 1240 T1223 oascc.ZkStateReader$2.process A cluster state change has occurred - updating...
[junit4:junit4]   2> 1283 T1203 oasc.ShardLeaderElectionContext.waitForReplicasToComeUp Enough replicas found to continue.
[junit4:junit4]   2> 1284 T1203 oasc.ShardLeaderElectionContext.runLeaderProcess I may be the new leader - try and sync
[junit4:junit4]   2> 1285 T1203 oasc.SyncStrategy.sync Sync replicas to http://127.0.0.1:44082/solr/collection1/
[junit4:junit4]   2> 1286 T1203 oasc.SyncStrategy.syncReplicas Sync Success - now sync replicas to me
[junit4:junit4]   2> 1286 T1203 oasc.SyncStrategy.syncToMe http://127.0.0.1:44082/solr/collection1/ has no replicas
[junit4:junit4]   2> 1287 T1203 oasc.ShardLeaderElectionContext.runLeaderProcess I am the new leader: http://127.0.0.1:44082/solr/collection1/
[junit4:junit4]   2> 1288 T1203 oascc.SolrZkClient.makePath makePath: /collections/control_collection/leaders/control_shard
[junit4:junit4]   2> 1292 T1208 oazs.PrepRequestProcessor.pRequest Got user-level KeeperException when processing sessionid:0x139dcbd7b860002 type:create cxid:0x88 zxid:0xfffffffffffffffe txntype:unknown reqpath:n/a Error Path:/solr/overseer Error:KeeperErrorCode = NodeExists for /solr/overseer
[junit4:junit4]   2> 1744 T1224 oascc.ZkStateReader.updateClusterState Updating cloud state from ZooKeeper... 
[junit4:junit4]   2> 1748 T1223 oascc.ZkStateReader$2.process A cluster state change has occurred - updating...
[junit4:junit4]   2> 1794 T1203 oasc.ZkController.register We are http://127.0.0.1:44082/solr/collection1/ and leader is http://127.0.0.1:44082/solr/collection1/
[junit4:junit4]   2> 1795 T1203 oasc.ZkController.register No LogReplay needed for core=collection1 baseURL=http://127.0.0.1:44082/solr
[junit4:junit4]   2> 1796 T1203 oasc.ZkController.checkRecovery I am the leader, no recovery necessary
[junit4:junit4]   2> 1798 T1203 oascc.ZkStateReader.updateClusterState Updating cloud state from ZooKeeper... 
[junit4:junit4]   2> 1799 T1203 oass.SolrDispatchFilter.init user.dir=/mnt/ssd/jenkins/workspace/Lucene-Solr-4.x-Linux/solr/build/solr-core/test/J1
[junit4:junit4]   2> 1799 T1203 oass.SolrDispatchFilter.init SolrDispatchFilter.init() done
[junit4:junit4]   2> 1800 T1203 oascsi.HttpClientUtil.createClient Creating new http client, config:maxConnections=128&maxConnectionsPerHost=32&followRedirects=false
[junit4:junit4]   2> 1853 T1203 oejs.Server.doStart jetty-8.1.2.v20120308
[junit4:junit4]   2> 1855 T1203 oejs.AbstractConnector.doStart Started SocketConnector@0.0.0.0:49013
[junit4:junit4]   2> 1855 T1203 oasc.SolrResourceLoader.locateSolrHome JNDI not configured for solr (NoInitialContextEx)
[junit4:junit4]   2> 1856 T1203 oasc.SolrResourceLoader.locateSolrHome using system property solr.solr.home: /mnt/ssd/jenkins/workspace/Lucene-Solr-4.x-Linux/solr/build/solr-core/test/J1/./solrtest-jetty1-1348028170893
[junit4:junit4]   2> 1856 T1203 oasc.SolrResourceLoader.<init> new SolrResourceLoader for deduced Solr Home: '/mnt/ssd/jenkins/workspace/Lucene-Solr-4.x-Linux/solr/build/solr-core/test/J1/./solrtest-jetty1-1348028170893/'
[junit4:junit4]   2> 1865 T1203 oass.SolrDispatchFilter.init SolrDispatchFilter.init()
[junit4:junit4]   2> 1866 T1203 oasc.SolrResourceLoader.locateSolrHome JNDI not configured for solr (NoInitialContextEx)
[junit4:junit4]   2> 1866 T1203 oasc.SolrResourceLoader.locateSolrHome using system property solr.solr.home: /mnt/ssd/jenkins/workspace/Lucene-Solr-4.x-Linux/solr/build/solr-core/test/J1/./solrtest-jetty1-1348028170893
[junit4:junit4]   2> 1866 T1203 oasc.CoreContainer$Initializer.initialize looking for solr.xml: /mnt/ssd/jenkins/workspace/Lucene-Solr-4.x-Linux/solr/build/solr-core/test/J1/./solrtest-jetty1-1348028170893/solr.xml
[junit4:junit4]   2> 1867 T1203 oasc.CoreContainer.<init> New CoreContainer 567363051
[junit4:junit4]   2> 1867 T1203 oasc.CoreContainer.load Loading CoreContainer using Solr Home: '/mnt/ssd/jenkins/workspace/Lucene-Solr-4.x-Linux/solr/build/solr-core/test/J1/./solrtest-jetty1-1348028170893/'
[junit4:junit4]   2> 1868 T1203 oasc.SolrResourceLoader.<init> new SolrResourceLoader for directory: '/mnt/ssd/jenkins/workspace/Lucene-Solr-4.x-Linux/solr/build/solr-core/test/J1/./solrtest-jetty1-1348028170893/'
[junit4:junit4]   2> 1880 T1203 oasc.CoreContainer.load Registering Log Listener
[junit4:junit4]   2> 1889 T1203 oasc.CoreContainer.initZooKeeper Zookeeper client=127.0.0.1:51375/solr
[junit4:junit4]   2> 1890 T1203 oaz.ZooKeeper.<init> Initiating client connection, connectString=127.0.0.1:51375/solr sessionTimeout=5000 watcher=org.apache.solr.common.cloud.ConnectionManager@a8f36638
[junit4:junit4]   2> 1891 T1236 oaz.ClientCnxn$SendThread.startConnect Opening socket connection to server /127.0.0.1:51375
[junit4:junit4]   2> 1891 T1203 oascc.ConnectionManager.waitForConnected Waiting for client to connect to ZooKeeper
[junit4:junit4]   2> 1892 T1236 oaz.ClientCnxn$SendThread.primeConnection Socket connection established to localhost.localdomain/127.0.0.1:51375, initiating session
[junit4:junit4]   2> 1892 T1205 oazs.NIOServerCnxn$Factory.run Accepted socket connection from /127.0.0.1:33809
[junit4:junit4]   2> 1892 T1205 oazs.NIOServerCnxn.readConnectRequest Client attempting to establish new session at /127.0.0.1:33809
[junit4:junit4]   2> 1893 T1207 oazs.NIOServerCnxn.finishSessionInit Established session 0x139dcbd7b860003 with negotiated timeout 5000 for client /127.0.0.1:33809
[junit4:junit4]   2> 1893 T1236 oaz.ClientCnxn$SendThread.readConnectResult Session establishment complete on server localhost.localdomain/127.0.0.1:51375, sessionid = 0x139dcbd7b860003, negotiated timeout = 5000
[junit4:junit4]   2> 1893 T1237 oascc.ConnectionManager.process Watcher org.apache.solr.common.cloud.ConnectionManager@a8f36638 name:ZooKeeperConnection Watcher:127.0.0.1:51375/solr got event WatchedEvent state:SyncConnected type:None path:null path:null type:None
[junit4:junit4]   2> 1894 T1203 oascc.ConnectionManager.waitForConnected Client is connected to ZooKeeper
[junit4:junit4]   2> 1894 T1208 oazs.PrepRequestProcessor.pRequest Got user-level KeeperException when processing sessionid:0x139dcbd7b860003 type:create cxid:0x1 zxid:0xfffffffffffffffe txntype:unknown reqpath:n/a Error Path:/solr/overseer Error:KeeperErrorCode = NodeExists for /solr/overseer
[junit4:junit4]   2> 1895 T1208 oazs.PrepRequestProcessor.pRequest Got user-level KeeperException when processing sessionid:0x139dcbd7b860003 type:create cxid:0x2 zxid:0xfffffffffffffffe txntype:unknown reqpath:n/a Error Path:/solr/overseer Error:KeeperErrorCode = NodeExists for /solr/overseer
[junit4:junit4]   2> 1895 T1203 oasc.ZkController.createEphemeralLiveNode Register node as live in ZooKeeper:/live_nodes/127.0.0.1:49013_solr
[junit4:junit4]   2> 1896 T1208 oazs.PrepRequestProcessor.pRequest Got user-level KeeperException when processing sessionid:0x139dcbd7b860003 type:delete cxid:0x4 zxid:0xfffffffffffffffe txntype:unknown reqpath:n/a Error Path:/solr/live_nodes/127.0.0.1:49013_solr Error:KeeperErrorCode = NoNode for /solr/live_nodes/127.0.0.1:49013_solr
[junit4:junit4]   2> 1896 T1203 oascc.SolrZkClient.makePath makePath: /live_nodes/127.0.0.1:49013_solr
[junit4:junit4]   2> 1898 T1223 oascc.ZkStateReader$3.process Updating live nodes
[junit4:junit4]   2> 1898 T1203 oashc.HttpShardHandlerFactory.getParameter Setting socketTimeout to: 0
[junit4:junit4]   2> 1899 T1203 oashc.HttpShardHandlerFactory.getParameter Setting urlScheme to: http://
[junit4:junit4]   2> 1899 T1203 oashc.HttpShardHandlerFactory.getParameter Setting connTimeout to: 0
[junit4:junit4]   2> 1899 T1203 oashc.HttpShardHandlerFactory.getParameter Setting maxConnectionsPerHost to: 20
[junit4:junit4]   2> 1900 T1203 oashc.HttpShardHandlerFactory.getParameter Setting corePoolSize to: 0
[junit4:junit4]   2> 1900 T1203 oashc.HttpShardHandlerFactory.getParameter Setting maximumPoolSize to: 2147483647
[junit4:junit4]   2> 1901 T1203 oashc.HttpShardHandlerFactory.getParameter Setting maxThreadIdleTime to: 5
[junit4:junit4]   2> 1901 T1203 oashc.HttpShardHandlerFactory.getParameter Setting sizeOfQueue to: -1
[junit4:junit4]   2> 1902 T1203 oashc.HttpShardHandlerFactory.getParameter Setting fairnessPolicy to: false
[junit4:junit4]   2> 1902 T1203 oascsi.HttpClientUtil.createClient Creating new http client, config:maxConnectionsPerHost=20&maxConnections=10000&socketTimeout=0&connTimeout=0&retry=false
[junit4:junit4]   2> 1907 T1203 oascc.ZkStateReader.createClusterStateWatchersAndUpdate Updating cluster state from ZooKeeper... 
[junit4:junit4]   2> 1910 T1203 oasc.CoreContainer.create Creating SolrCore 'collection1' using instanceDir: /mnt/ssd/jenkins/workspace/Lucene-Solr-4.x-Linux/solr/build/solr-core/test/J1/./solrtest-jetty1-1348028170893/collection1
[junit4:junit4]   2> 1911 T1203 oasc.ZkController.createCollectionZkNode Check for collection zkNode:collection1
[junit4:junit4]   2> 1911 T1203 oasc.ZkController.createCollectionZkNode Collection zkNode exists
[junit4:junit4]   2> 1912 T1203 oasc.ZkController.readConfigName Load collection config from:/collections/collection1
[junit4:junit4]   2> 1913 T1203 oasc.SolrResourceLoader.<init> new SolrResourceLoader for directory: '/mnt/ssd/jenkins/workspace/Lucene-Solr-4.x-Linux/solr/build/solr-core/test/J1/./solrtest-jetty1-1348028170893/collection1/'
[junit4:junit4]   2> 1913 T1203 oasc.SolrResourceLoader.replaceClassLoader Adding 'file:/mnt/ssd/jenkins/workspace/Lucene-Solr-4.x-Linux/solr/build/solr-core/test/J1/solrtest-jetty1-1348028170893/collection1/lib/README' to classloader
[junit4:junit4]   2> 1914 T1203 oasc.SolrResourceLoader.replaceClassLoader Adding 'file:/mnt/ssd/jenkins/workspace/Lucene-Solr-4.x-Linux/solr/build/solr-core/test/J1/solrtest-jetty1-1348028170893/collection1/lib/classes/' to classloader
[junit4:junit4]   2> 1941 T1203 oasc.SolrConfig.<init> Using Lucene MatchVersion: LUCENE_40
[junit4:junit4]   2> 1982 T1203 oasc.SolrConfig.<init> Loaded SolrConfig: solrconfig.xml
[junit4:junit4]   2> 1983 T1203 oass.IndexSchema.readSchema Reading Solr Schema
[junit4:junit4]   2> 1989 T1203 oass.IndexSchema.readSchema Schema name=test
[junit4:junit4]   2> 2250 T1224 oascc.ZkStateReader.updateClusterState Updating cloud state from ZooKeeper... 
[junit4:junit4]   2> 2252 T1223 oascc.ZkStateReader$2.process A cluster state change has occurred - updating...
[junit4:junit4]   2> 2252 T1237 oascc.ZkStateReader$2.process A cluster state change has occurred - updating...
[junit4:junit4]   2> 2413 T1203 oass.OpenExchangeRatesOrgProvider.init Initialized with rates=open-exchange-rates.json, refreshInterval=1440.
[junit4:junit4]   2> 2419 T1203 oass.IndexSchema.readSchema default search field in schema is text
[junit4:junit4]   2> 2422 T1203 oass.IndexSchema.readSchema unique key field: id
[junit4:junit4]   2> 2429 T1203 oass.FileExchangeRateProvider.reload Reloading exchange rates from file currency.xml
[junit4:junit4]   2> 2433 T1203 oass.FileExchangeRateProvider.reload Reloading exchange rates from file currency.xml
[junit4:junit4]   2> 2437 T1203 oass.OpenExchangeRatesOrgProvider.reload Reloading exchange rates from open-exchange-rates.json
[junit4:junit4]   2> 2438 T1203 oass.OpenExchangeRatesOrgProvider.reload Reloading exchange rates from open-exchange-rates.json
[junit4:junit4]   2> 2439 T1203 oasc.SolrCore.<init> [collection1] Opening new SolrCore at /mnt/ssd/jenkins/workspace/Lucene-Solr-4.x-Linux/solr/build/solr-core/test/J1/./solrtest-jetty1-1348028170893/collection1/, dataDir=./org.apache.solr.cloud.BasicDistributedZkTest-1348028169091/jetty1/
[junit4:junit4]   2> 2439 T1203 oasc.JmxMonitoredMap.<init> JMX monitoring is enabled. Adding Solr mbeans to JMX Server: com.sun.jmx.mbeanserver.JmxMBeanServer@600f5654
[junit4:junit4]   2> 2440 T1203 oasc.SolrCore.getNewIndexDir WARNING New index directory detected: old=null new=./org.apache.solr.cloud.BasicDistributedZkTest-1348028169091/jetty1/index/
[junit4:junit4]   2> 2441 T1203 oasc.SolrCore.initIndex WARNING [collection1] Solr index directory './org.apache.solr.cloud.BasicDistributedZkTest-1348028169091/jetty1/index' doesn't exist. Creating new index...
[junit4:junit4]   2> 2441 T1203 oasc.CachingDirectoryFactory.get return new directory for /mnt/ssd/jenkins/workspace/Lucene-Solr-4.x-Linux/solr/build/solr-core/test/J1/./org.apache.solr.cloud.BasicDistributedZkTest-1348028169091/jetty1/index forceNew:false
[junit4:junit4]   2> 2554 T1203 oasc.SolrDeletionPolicy.onCommit SolrDeletionPolicy.onCommit: commits:num=1
[junit4:junit4]   2> 		commit{dir=NRTCachingDirectory(org.apache.lucene.store.MMapDirectory@/mnt/ssd/jenkins/workspace/Lucene-Solr-4.x-Linux/solr/build/solr-core/test/J1/org.apache.solr.cloud.BasicDistributedZkTest-1348028169091/jetty1/index lockFactory=org.apache.lucene.store.NativeFSLockFactory@7dfabfde; maxCacheMB=48.0 maxMergeSizeMB=4.0),segFN=segments_1,generation=1,filenames=[segments_1]
[junit4:junit4]   2> 2555 T1203 oasc.SolrDeletionPolicy.updateCommits newest commit = 1
[junit4:junit4]   2> 2556 T1203 oasc.SolrCore.initWriters created xml: solr.XMLResponseWriter
[junit4:junit4]   2> 2557 T1203 oasup.UpdateRequestProcessorChain.init inserting DistributedUpdateProcessorFactory into updateRequestProcessorChain "dedupe"
[junit4:junit4]   2> 2558 T1203 oasup.UpdateRequestProcessorChain.init inserting DistributedUpdateProcessorFactory into updateRequestProcessorChain "dedupe-allfields"
[junit4:junit4]   2> 2558 T1203 oasup.UpdateRequestProcessorChain.init inserting DistributedUpdateProcessorFactory into updateRequestProcessorChain "stored_sig"
[junit4:junit4]   2> 2559 T1203 oasup.UpdateRequestProcessorChain.init inserting DistributedUpdateProcessorFactory into updateRequestProcessorChain "uniq-fields"
[junit4:junit4]   2> 2560 T1203 oasup.UpdateRequestProcessorChain.init inserting DistributedUpdateProcessorFactory into updateRequestProcessorChain "distrib-dup-test-chain-implicit"
[junit4:junit4]   2> 2560 T1203 oasc.RequestHandlers.initHandlersFromConfig adding lazy requestHandler: solr.ReplicationHandler
[junit4:junit4]   2> 2561 T1203 oasc.RequestHandlers.initHandlersFromConfig created /replication: solr.ReplicationHandler
[junit4:junit4]   2> 2561 T1203 oasc.RequestHandlers.initHandlersFromConfig created standard: solr.StandardRequestHandler
[junit4:junit4]   2> 2562 T1203 oasc.RequestHandlers.initHandlersFromConfig created /get: solr.RealTimeGetHandler
[junit4:junit4]   2> 2562 T1203 oasc.RequestHandlers.initHandlersFromConfig created dismax: solr.SearchHandler
[junit4:junit4]   2> 2563 T1203 oasc.RequestHandlers.initHandlersFromConfig created mock: org.apache.solr.core.MockQuerySenderListenerReqHandler
[junit4:junit4]   2> 2564 T1203 oasc.RequestHandlers.initHandlersFromConfig created /admin/: org.apache.solr.handler.admin.AdminHandlers
[junit4:junit4]   2> 2564 T1203 oasc.RequestHandlers.initHandlersFromConfig created defaults: solr.StandardRequestHandler
[junit4:junit4]   2> 2565 T1203 oasc.RequestHandlers.initHandlersFromConfig adding lazy requestHandler: solr.StandardRequestHandler
[junit4:junit4]   2> 2565 T1203 oasc.RequestHandlers.initHandlersFromConfig created lazy: solr.StandardRequestHandler
[junit4:junit4]   2> 2566 T1203 oasc.RequestHandlers.initHandlersFromConfig created /update: solr.UpdateRequestHandler
[junit4:junit4]   2> 2567 T1203 oasc.RequestHandlers.initHandlersFromConfig created /terms: org.apache.solr.handler.component.SearchHandler
[junit4:junit4]   2> 2567 T1203 oasc.RequestHandlers.initHandlersFromConfig created spellCheckCompRH: org.apache.solr.handler.component.SearchHandler
[junit4:junit4]   2> 2568 T1203 oasc.RequestHandlers.initHandlersFromConfig created spellCheckCompRH_Direct: org.apache.solr.handler.component.SearchHandler
[junit4:junit4]   2> 2569 T1203 oasc.RequestHandlers.initHandlersFromConfig created spellCheckWithWordbreak: org.apache.solr.handler.component.SearchHandler
[junit4:junit4]   2> 2569 T1203 oasc.RequestHandlers.initHandlersFromConfig created spellCheckWithWordbreak_Direct: org.apache.solr.handler.component.SearchHandler
[junit4:junit4]   2> 2570 T1203 oasc.RequestHandlers.initHandlersFromConfig created spellCheckCompRH1: org.apache.solr.handler.component.SearchHandler
[junit4:junit4]   2> 2571 T1203 oasc.RequestHandlers.initHandlersFromConfig created tvrh: org.apache.solr.handler.component.SearchHandler
[junit4:junit4]   2> 2571 T1203 oasc.RequestHandlers.initHandlersFromConfig created /mlt: solr.MoreLikeThisHandler
[junit4:junit4]   2> 2572 T1203 oasc.RequestHandlers.initHandlersFromConfig created /debug/dump: solr.DumpRequestHandler
[junit4:junit4]   2> 2574 T1203 oashl.XMLLoader.init xsltCacheLifetimeSeconds=60
[junit4:junit4]   2> 2576 T1203 oasc.SolrCore.initDeprecatedSupport WARNING solrconfig.xml uses deprecated <admin/gettableFiles>, Please update your config to use the ShowFileRequestHandler.
[junit4:junit4]   2> 2577 T1203 oasc.SolrCore.initDeprecatedSupport WARNING adding ShowFileRequestHandler with hidden files: [OLD_SYNONYMS.TXT, PROTWORDS.TXT, STOPWORDS.TXT, OPEN-EXCHANGE-RATES.JSON, CURRENCY.XML, SCHEMA.XML, SYNONYMS.TXT, MAPPING-ISOLATIN1ACCENT.TXT]
[junit4:junit4]   2> 2580 T1203 oass.SolrIndexSearcher.<init> Opening Searcher@25ab0bc3 main
[junit4:junit4]   2> 2582 T1203 oasu.CommitTracker.<init> Hard AutoCommit: disabled
[junit4:junit4]   2> 2582 T1203 oasu.CommitTracker.<init> Soft AutoCommit: disabled
[junit4:junit4]   2> 2583 T1203 oashc.SpellCheckComponent.inform Initializing spell checkers
[junit4:junit4]   2> 2588 T1203 oass.DirectSolrSpellChecker.init init: {name=direct,classname=DirectSolrSpellChecker,field=lowerfilt,minQueryLength=3}
[junit4:junit4]   2> 2801 T1238 oasc.SolrCore.registerSearcher [collection1] Registered new searcher Searcher@25ab0bc3 main{StandardDirectoryReader(segments_1:1)}
[junit4:junit4]   2> 3256 T1224 oascc.ZkStateReader.updateClusterState Updating cloud state from ZooKeeper... 
[junit4:junit4]   2> 3258 T1223 oascc.ZkStateReader$2.process A cluster state change has occurred - updating...
[junit4:junit4]   2> 3258 T1237 oascc.ZkStateReader$2.process A cluster state change has occurred - updating...
[junit4:junit4]   2> 3308 T1203 oasc.CoreContainer.register registering core: collection1
[junit4:junit4]   2> 3309 T1203 oasc.ZkController.register Register shard - core:collection1 address:http://127.0.0.1:49013/solr shardId:shard1
[junit4:junit4]   2> 3310 T1203 oascc.SolrZkClient.makePath makePath: /collections/collection1/leader_elect/shard1/election
[junit4:junit4]   2> 3314 T1208 oazs.PrepRequestProcessor.pRequest Got user-level KeeperException when processing sessionid:0x139dcbd7b860003 type:delete cxid:0x43 zxid:0xfffffffffffffffe txntype:unknown reqpath:n/a Error Path:/solr/collections/collection1/leaders Error:KeeperErrorCode = NoNode for /solr/collections/collection1/leaders
[junit4:junit4]   2> 3314 T1203 oasc.ShardLeaderElectionContext.runLeaderProcess Running the leader process.
[junit4:junit4]   2> 3315 T1208 oazs.PrepRequestProcessor.pRequest Got user-level KeeperException when processing sessionid:0x139dcbd7b860003 type:create cxid:0x44 zxid:0xfffffffffffffffe txntype:unknown reqpath:n/a Error Path:/solr/overseer Error:KeeperErrorCode = NodeExists for /solr/overseer
[junit4:junit4]   2> 3316 T1203 oasc.ShardLeaderElectionContext.waitForReplicasToComeUp Enough replicas found to continue.
[junit4:junit4]   2> 3317 T1203 oasc.ShardLeaderElectionContext.runLeaderProcess I may be the new leader - try and sync
[junit4:junit4]   2> 3318 T1203 oasc.SyncStrategy.sync Sync replicas to http://127.0.0.1:49013/solr/collection1/
[junit4:junit4]   2> 3319 T1203 oasc.SyncStrategy.syncReplicas Sync Success - now sync replicas to me
[junit4:junit4]   2> 3320 T1203 oasc.SyncStrategy.syncToMe http://127.0.0.1:49013/solr/collection1/ has no replicas
[junit4:junit4]   2> 3321 T1203 oasc.ShardLeaderElectionContext.runLeaderProcess I am the new leader: http://127.0.0.1:49013/solr/collection1/
[junit4:junit4]   2> 3321 T1203 oascc.SolrZkClient.makePath makePath: /collections/collection1/leaders/shard1
[junit4:junit4]   2> 3324 T1208 oazs.PrepRequestProcessor.pRequest Got user-level KeeperException when processing sessionid:0x139dcbd7b860003 type:create cxid:0x4e zxid:0xfffffffffffffffe txntype:unknown reqpath:n/a Error Path:/solr/overseer Error:KeeperErrorCode = NodeExists for /solr/overseer
[junit4:junit4]   2> 3760 T1224 oascc.ZkStateReader.updateClusterState Updating cloud state from ZooKeeper... 
[junit4:junit4]   2> 3763 T1237 oascc.ZkStateReader$2.process A cluster state change has occurred - updating...
[junit4:junit4]   2> 3764 T1223 oascc.ZkStateReader$2.process A cluster state change has occurred - updating...
[junit4:junit4]   2> 3776 T1203 oasc.ZkController.register We are http://127.0.0.1:49013/solr/collection1/ and leader is http://127.0.0.1:49013/solr/collection1/
[junit4:junit4]   2> 3776 T1203 oasc.ZkController.register No LogReplay needed for core=collection1 baseURL=http://127.0.0.1:49013/solr
[junit4:junit4]   2> 3777 T1203 oasc.ZkController.checkRecovery I am the leader, no recovery necessary
[junit4:junit4]   2> 3778 T1203 oascc.ZkStateReader.updateClusterState Updating cloud state from ZooKeeper... 
[junit4:junit4]   2> 3779 T1203 oass.SolrDispatchFilter.init user.dir=/mnt/ssd/jenkins/workspace/Lucene-Solr-4.x-Linux/solr/build/solr-core/test/J1
[junit4:junit4]   2> 3779 T1203 oass.SolrDispatchFilter.init SolrDispatchFilter.init() done
[junit4:junit4]   2> 3780 T1203 oascsi.HttpClientUtil.createClient Creating new http client, config:maxConnections=128&maxConnectionsPerHost=32&followRedirects=false
[junit4:junit4]   2> 3834 T1203 oejs.Server.doStart jetty-8.1.2.v20120308
[junit4:junit4]   2> 3836 T1203 oejs.AbstractConnector.doStart Started SocketConnector@0.0.0.0:36531
[junit4:junit4]   2> 3837 T1203 oasc.SolrResourceLoader.locateSolrHome JNDI not configured for solr (NoInitialContextEx)
[junit4:junit4]   2> 3838 T1203 oasc.SolrResourceLoader.locateSolrHome using system property solr.solr.home: /mnt/ssd/jenkins/workspace/Lucene-Solr-4.x-Linux/solr/build/solr-core/test/J1/./solrtest-jetty2-1348028172870
[junit4:junit4]   2> 3838 T1203 oasc.SolrResourceLoader.<init> new SolrResourceLoader for deduced Solr Home: '/mnt/ssd/jenkins/workspace/Lucene-Solr-4.x-Linux/solr/build/solr-core/test/J1/./solrtest-jetty2-1348028172870/'
[junit4:junit4]   2> 3852 T1203 oass.SolrDispatchFilter.init SolrDispatchFilter.init()
[junit4:junit4]   2> 3853 T1203 oasc.SolrResourceLoader.locateSolrHome JNDI not configured for solr (NoInitialContextEx)
[junit4:junit4]   2> 3853 T1203 oasc.SolrResourceLoader.locateSolrHome using system property solr.solr.home: /mnt/ssd/jenkins/workspace/Lucene-Solr-4.x-Linux/solr/build/solr-core/test/J1/./solrtest-jetty2-1348028172870
[junit4:junit4]   2> 3854 T1203 oasc.CoreContainer$Initializer.initialize looking for solr.xml: /mnt/ssd/jenkins/workspace/Lucene-Solr-4.x-Linux/solr/build/solr-core/test/J1/./solrtest-jetty2-1348028172870/solr.xml
[junit4:junit4]   2> 3855 T1203 oasc.CoreContainer.<init> New CoreContainer -91024376
[junit4:junit4]   2> 3856 T1203 oasc.CoreContainer.load Loading CoreContainer using Solr Home: '/mnt/ssd/jenkins/workspace/Lucene-Solr-4.x-Linux/solr/build/solr-core/test/J1/./solrtest-jetty2-1348028172870/'
[junit4:junit4]   2> 3856 T1203 oasc.SolrResourceLoader.<init> new SolrResourceLoader for directory: '/mnt/ssd/jenkins/workspace/Lucene-Solr-4.x-Linux/solr/build/solr-core/test/J1/./solrtest-jetty2-1348028172870/'
[junit4:junit4]   2> 3876 T1203 oasc.CoreContainer.load Registering Log Listener
[junit4:junit4]   2> 3891 T1203 oasc.CoreContainer.initZooKeeper Zookeeper client=127.0.0.1:51375/solr
[junit4:junit4]   2> 3892 T1203 oaz.ZooKeeper.<init> Initiating client connection, connectString=127.0.0.1:51375/solr sessionTimeout=5000 watcher=org.apache.solr.common.cloud.ConnectionManager@fe99c6b2
[junit4:junit4]   2> 3893 T1248 oaz.ClientCnxn$SendThread.startConnect Opening socket connection to server /127.0.0.1:51375
[junit4:junit4]   2> 3893 T1203 oascc.ConnectionManager.waitForConnected Waiting for client to connect to ZooKeeper
[junit4:junit4]   2> 3894 T1248 oaz.ClientCnxn$SendThread.primeConnection Socket connection established to localhost.localdomain/127.0.0.1:51375, initiating session
[junit4:junit4]   2> 3894 T1205 oazs.NIOServerCnxn$Factory.run Accepted socket connection from /127.0.0.1:33817
[junit4:junit4]   2> 3895 T1205 oazs.NIOServerCnxn.readConnectRequest Client attempting to establish new session at /127.0.0.1:33817
[junit4:junit4]   2> 3895 T1207 oazs.NIOServerCnxn.finishSessionInit Established session 0x139dcbd7b860004 with negotiated timeout 5000 for client /127.0.0.1:33817
[junit4:junit4]   2> 3895 T1248 oaz.ClientCnxn$SendThread.readConnectResult Session establishment complete on server localhost.localdomain/127.0.0.1:51375, sessionid = 0x139dcbd7b860004, negotiated timeout = 5000
[junit4:junit4]   2> 3896 T1249 oascc.ConnectionManager.process Watcher org.apache.solr.common.cloud.ConnectionManager@fe99c6b2 name:ZooKeeperConnection Watcher:127.0.0.1:51375/solr got event WatchedEvent state:SyncConnected type:None path:null path:null type:None
[junit4:junit4]   2> 3896 T1203 oascc.ConnectionManager.waitForConnected Client is connected to ZooKeeper
[junit4:junit4]   2> 3897 T1208 oazs.PrepRequestProcessor.pRequest Got user-level KeeperException when processing sessionid:0x139dcbd7b860004 type:create cxid:0x1 zxid:0xfffffffffffffffe txntype:unknown reqpath:n/a Error Path:/solr/overseer Error:KeeperErrorCode = NodeExists for /solr/overseer
[junit4:junit4]   2> 3898 T1208 oazs.PrepRequestProcessor.pRequest Got user-level KeeperException when processing sessionid:0x139dcbd7b860004 type:create cxid:0x2 zxid:0xfffffffffffffffe txntype:unknown reqpath:n/a Error Path:/solr/overseer Error:KeeperErrorCode = NodeExists for /solr/overseer
[junit4:junit4]   2> 3899 T1203 oasc.ZkController.createEphemeralLiveNode Register node as live in ZooKeeper:/live_nodes/127.0.0.1:36531_solr
[junit4:junit4]   2> 3899 T1208 oazs.PrepRequestProcessor.pRequest Got user-level KeeperException when processing sessionid:0x139dcbd7b860004 type:delete cxid:0x4 zxid:0xfffffffffffffffe txntype:unknown reqpath:n/a Error Path:/solr/live_nodes/127.0.0.1:36531_solr Error:KeeperErrorCode = NoNode for /solr/live_nodes/127.0.0.1:36531_solr
[junit4:junit4]   2> 3900 T1203 oascc.SolrZkClient.makePath makePath: /live_nodes/127.0.0.1:36531_solr
[junit4:junit4]   2> 4541 T1223 oascc.ZkStateReader$3.process Updating live nodes
[junit4:junit4]   2> 4541 T1237 oascc.ZkStateReader$3.process Updating live nodes
[junit4:junit4]   2> 4542 T1224 oascc.ZkStateReader.updateClusterState Updating cloud state from ZooKeeper... 
[junit4:junit4]   2> 4542 T1203 oashc.HttpShardHandlerFactory.getParameter Setting socketTimeout to: 0
[junit4:junit4]   2> 4543 T1203 oashc.HttpShardHandlerFactory.getParameter Setting urlScheme to: http://
[junit4:junit4]   2> 4543 T1203 oashc.HttpShardHandlerFactory.getParameter Setting connTimeout to: 0
[junit4:junit4]   2> 4544 T1203 oashc.HttpShardHandlerFactory.getParameter Setting maxConnectionsPerHost to: 20
[junit4:junit4]   2> 4544 T1203 oashc.HttpShardHandlerFactory.getParameter Setting corePoolSize to: 0
[junit4:junit4]   2> 4545 T1203 oashc.HttpShardHandlerFactory.getParameter Setting maximumPoolSize to: 2147483647
[junit4:junit4]   2> 4545 T1237 oascc.ZkStateReader$2.process A cluster state change has occurred - updating...
[junit4:junit4]   2> 4546 T1203 oashc.HttpShardHandlerFactory.getParameter Setting maxThreadIdleTime to: 5
[junit4:junit4]   2> 4546 T1203 oashc.HttpShardHandlerFactory.getParameter Setting sizeOfQueue to: -1
[junit4:junit4]   2> 4547 T1223 oascc.ZkStateReader$2.process A cluster state change has occurred - updating...
[junit4:junit4]   2> 4547 T1203 oashc.HttpShardHandlerFactory.getParameter Setting fairnessPolicy to: false
[junit4:junit4]   2> 4547 T1203 oascsi.HttpClientUtil.createClient Creating new http client, config:maxConnectionsPerHost=20&maxConnections=10000&socketTimeout=0&connTimeout=0&retry=false
[junit4:junit4]   2> 4552 T1203 oascc.ZkStateReader.createClusterStateWatchersAndUpdate Updating cluster state from ZooKeeper... 
[junit4:junit4]   2> 4555 T1203 oasc.CoreContainer.create Creating SolrCore 'collection1' using instanceDir: /mnt/ssd/jenkins/workspace/Lucene-Solr-4.x-Linux/solr/build/solr-core/test/J1/./solrtest-jetty2-1348028172870/collection1
[junit4:junit4]   2> 4556 T1203 oasc.ZkController.createCollectionZkNode Check for collection zkNode:collection1
[junit4:junit4]   2> 4557 T1203 oasc.ZkController.createCollectionZkNode Collection zkNode exists
[junit4:junit4]   2> 4557 T1203 oasc.ZkController.readConfigName Load collection config from:/collections/collection1
[junit4:junit4]   2> 4558 T1203 oasc.SolrResourceLoader.<init> new SolrResourceLoader for directory: '/mnt/ssd/jenkins/workspace/Lucene-Solr-4.x-Linux/solr/build/solr-core/test/J1/./solrtest-jetty2-1348028172870/collection1/'
[junit4:junit4]   2> 4559 T1203 oasc.SolrResourceLoader.replaceClassLoader Adding 'file:/mnt/ssd/jenkins/workspace/Lucene-Solr-4.x-Linux/solr/build/solr-core/test/J1/solrtest-jetty2-1348028172870/collection1/lib/README' to classloader
[junit4:junit4]   2> 4559 T1203 oasc.SolrResourceLoader.replaceClassLoader Adding 'file:/mnt/ssd/jenkins/workspace/Lucene-Solr-4.x-Linux/solr/build/solr-core/test/J1/solrtest-jetty2-1348028172870/collection1/lib/classes/' to classloader
[junit4:junit4]   2> 4585 T1203 oasc.SolrConfig.<init> Using Lucene MatchVersion: LUCENE_40
[junit4:junit4]   2> 4627 T1203 oasc.SolrConfig.<init> Loaded SolrConfig: solrconfig.xml
[junit4:junit4]   2> 4628 T1203 oass.IndexSchema.readSchema Reading Solr Schema
[junit4:junit4]   2> 4633 T1203 oass.IndexSchema.readSchema Schema name=test
[junit4:junit4]   2> 5010 T1203 oass.OpenExchangeRatesOrgProvider.init Initialized with rates=open-exchange-rates.json, refreshInterval=1440.
[junit4:junit4]   2> 5015 T1203 oass.IndexSchema.readSchema default search field in schema is text
[junit4:junit4]   2> 5018 T1203 oass.IndexSchema.readSchema unique key field: id
[junit4:junit4]   2> 5025 T1203 oass.FileExchangeRateProvider.reload Reloading exchange rates from file currency.xml
[junit4:junit4]   2> 5029 T1203 oass.FileExchangeRateProvider.reload Reloading exchange rates from file currency.xml
[junit4:junit4]   2> 5033 T1203 oass.OpenExchangeRatesOrgProvider.reload Reloading exchange rates from open-exchange-rates.json
[junit4:junit4]   2> 5034 T1203 oass.OpenExchangeRatesOrgProvider.reload Reloading exchange rates from open-exchange-rates.json
[junit4:junit4]   2> 5035 T1203 oasc.SolrCore.<init> [collection1] Opening new SolrCore at /mnt/ssd/jenkins/workspace/Lucene-Solr-4.x-Linux/solr/build/solr-core/test/J1/./solrtest-jetty2-1348028172870/collection1/, dataDir=./org.apache.solr.cloud.BasicDistributedZkTest-1348028169091/jetty2/
[junit4:junit4]   2> 5036 T1203 oasc.JmxMonitoredMap.<init> JMX monitoring is enabled. Adding Solr mbeans to JMX Server: com.sun.jmx.mbeanserver.JmxMBeanServer@600f5654
[junit4:junit4]   2> 5037 T1203 oasc.SolrCore.getNewIndexDir WARNING New index directory detected: old=null new=./org.apache.solr.cloud.BasicDistributedZkTest-1348028169091/jetty2/index/
[junit4:junit4]   2> 5037 T1203 oasc.SolrCore.initIndex WARNING [collection1] Solr index directory './org.apache.solr.cloud.BasicDistributedZkTest-1348028169091/jetty2/index' doesn't exist. Creating new index...
[junit4:junit4]   2> 5038 T1203 oasc.CachingDirectoryFactory.get return new directory for /mnt/ssd/jenkins/workspace/Lucene-Solr-4.x-Linux/solr/build/solr-core/test/J1/./org.apache.solr.cloud.BasicDistributedZkTest-1348028169091/jetty2/index forceNew:false
[junit4:junit4]   2> 5041 T1203 oasc.SolrDeletionPolicy.onCommit SolrDeletionPolicy.onCommit: commits:num=1
[junit4:junit4]   2> 		commit{dir=NRTCachingDirectory(org.apache.lucene.store.MMapDirectory@/mnt/ssd/jenkins/workspace/Lucene-Solr-4.x-Linux/solr/build/solr-core/test/J1/org.apache.solr.cloud.BasicDistributedZkTest-1348028169091/jetty2/index lockFactory=org.apache.lucene.store.NativeFSLockFactory@1dee680; maxCacheMB=48.0 maxMergeSizeMB=4.0),segFN=segments_1,generation=1,filenames=[segments_1]
[junit4:junit4]   2> 5041 T1203 oasc.SolrDeletionPolicy.updateCommits newest commit = 1
[junit4:junit4]   2> 5042 T1203 oasc.SolrCore.initWriters created xml: solr.XMLResponseWriter
[junit4:junit4]   2> 5044 T1203 oasup.UpdateRequestProcessorChain.init inserting DistributedUpdateProcessorFactory into updateRequestProcessorChain "dedupe"
[junit4:junit4]   2> 5044 T1203 oasup.UpdateRequestProcessorChain.init inserting DistributedUpdateProcessorFactory into updateRequestProcessorChain "dedupe-allfields"
[junit4:junit4]   2> 5045 T1203 oasup.UpdateRequestProcessorChain.init inserting DistributedUpdateProcessorFactory into updateRequestProcessorChain "stored_sig"
[junit4:junit4]   2> 5045 T1203 oasup.UpdateRequestProcessorChain.init inserting DistributedUpdateProcessorFactory into updateRequestProcessorChain "uniq-fields"
[junit4:junit4]   2> 5046 T1203 oasup.UpdateRequestProcessorChain.init inserting DistributedUpdateProcessorFactory into updateRequestProcessorChain "distrib-dup-test-chain-implicit"
[junit4:junit4]   2> 5047 T1203 oasc.RequestHandlers.initHandlersFromConfig adding lazy requestHandler: solr.ReplicationHandler
[junit4:junit4]   2> 5047 T1203 oasc.RequestHandlers.initHandlersFromConfig created /replication: solr.ReplicationHandler
[junit4:junit4]   2> 5048 T1203 oasc.RequestHandlers.initHandlersFromConfig created standard: solr.StandardRequestHandler
[junit4:junit4]   2> 5048 T1203 oasc.RequestHandlers.initHandlersFromConfig created /get: solr.RealTimeGetHandler
[junit4:junit4]   2> 5049 T1203 oasc.RequestHandlers.initHandlersFromConfig created dismax: solr.SearchHandler
[junit4:junit4]   2> 5050 T1203 oasc.RequestHandlers.initHandlersFromConfig created mock: org.apache.solr.core.MockQuerySenderListenerReqHandler
[junit4:junit4]   2> 5050 T1203 oasc.RequestHandlers.initHandlersFromConfig created /admin/: org.apache.solr.handler.admin.AdminHandlers
[junit4:junit4]   2> 5051 T1203 oasc.RequestHandlers.initHandlersFromConfig created defaults: solr.StandardRequestHandler
[junit4:junit4]   2> 5051 T1203 oasc.RequestHandlers.initHandlersFromConfig adding lazy requestHandler: solr.StandardRequestHandler
[junit4:junit4]   2> 5052 T1203 oasc.RequestHandlers.initHandlersFromConfig created lazy: solr.StandardRequestHandler
[junit4:junit4]   2> 5053 T1203 oasc.RequestHandlers.initHandlersFromConfig created /update: solr.UpdateRequestHandler
[junit4:junit4]   2> 5053 T1203 oasc.RequestHandlers.initHandlersFromConfig created /terms: org.apache.solr.handler.component.SearchHandler
[junit4:junit4]   2> 5054 T1203 oasc.RequestHandlers.initHandlersFromConfig created spellCheckCompRH: org.apache.solr.handler.component.SearchHandler
[junit4:junit4]   2> 5054 T1203 oasc.RequestHandlers.initHandlersFromConfig created spellCheckCompRH_Direct: org.apache.solr.handler.component.SearchHandler
[junit4:junit4]   2> 5055 T1203 oasc.RequestHandlers.initHandlersFromConfig created spellCheckWithWordbreak: org.apache.solr.handler.component.SearchHandler
[junit4:junit4]   2> 5056 T1203 oasc.RequestHandlers.initHandlersFromConfig created spellCheckWithWordbreak_Direct: org.apache.solr.handler.component.SearchHandler
[junit4:junit4]   2> 5056 T1203 oasc.RequestHandlers.initHandlersFromConfig created spellCheckCompRH1: org.apache.solr.handler.component.SearchHandler
[junit4:junit4]   2> 5057 T1203 oasc.RequestHandlers.initHandlersFromConfig created tvrh: org.apache.solr.handler.component.SearchHandler
[junit4:junit4]   2> 5057 T1203 oasc.RequestHandlers.initHandlersFromConfig created /mlt: solr.MoreLikeThisHandler
[junit4:junit4]   2> 5058 T1203 oasc.RequestHandlers.initHandlersFromConfig created /debug/dump: solr.DumpRequestHandler
[junit4:junit4]   2> 5059 T1203 oashl.XMLLoader.init xsltCacheLifetimeSeconds=60
[junit4:junit4]   2> 5061 T1203 oasc.SolrCore.initDeprecatedSupport WARNING solrconfig.xml uses deprecated <admin/gettableFiles>, Please update your config to use the ShowFileRequestHandler.
[junit4:junit4]   2> 5062 T1203 oasc.SolrCore.initDeprecatedSupport WARNING adding ShowFileRequestHandler with hidden files: [OLD_SYNONYMS.TXT, PROTWORDS.TXT, STOPWORDS.TXT, OPEN-EXCHANGE-RATES.JSON, CURRENCY.XML, SCHEMA.XML, SYNONYMS.TXT, MAPPING-ISOLATIN1ACCENT.TXT]
[junit4:junit4]   2> 5064 T1203 oass.SolrIndexSearcher.<init> Opening Searcher@daa38b46 main
[junit4:junit4]   2> 5065 T1203 oasu.CommitTracker.<init> Hard AutoCommit: disabled
[junit4:junit4]   2> 5066 T1203 oasu.CommitTracker.<init> Soft AutoCommit: disabled
[junit4:junit4]   2> 5066 T1203 oashc.SpellCheckComponent.inform Initializing spell checkers
[junit4:junit4]   2> 5070 T1203 oass.DirectSolrSpellChecker.init init: {name=direct,classname=DirectSolrSpellChecker,field=lowerfilt,minQueryLength=3}
[junit4:junit4]   2> 5090 T1250 oasc.SolrCore.registerSearcher [collection1] Registered new searcher Searcher@daa38b46 main{StandardDirectoryReader(segments_1:1)}
[junit4:junit4]   2> 5548 T1224 oascc.ZkStateReader.updateClusterState Updating cloud state from ZooKeeper... 
[junit4:junit4]   2> 5551 T1249 oascc.ZkStateReader$2.process A cluster state change has occurred - updating...
[junit4:junit4]   2> 5551 T1223 oascc.ZkStateReader$2.process A cluster state change has occurred - updating...
[junit4:junit4]   2> 5551 T1237 oascc.ZkStateReader$2.process A cluster state change has occurred - updating...
[junit4:junit4]   2> 5598 T1203 oasc.CoreContainer.register registering core: collection1
[junit4:junit4]   2> 5599 T1203 oasc.ZkController.register Register shard - core:collection1 address:http://127.0.0.1:36531/solr shardId:shard2
[junit4:junit4]   2> 5600 T1203 oascc.SolrZkClient.makePath makePath: /collections/collection1/leader_elect/shard2/election
[junit4:junit4]   2> 5604 T1208 oazs.PrepRequestProcessor.pRequest Got user-level KeeperException when processing sessionid:0x139dcbd7b860004 type:delete cxid:0x41 zxid:0xfffffffffffffffe txntype:unknown reqpath:n/a Error Path:/solr/collections/collection1/leaders/shard2 Error:KeeperErrorCode = NoNode for /solr/collections/collection1/leaders/shard2
[junit4:junit4]   2> 5604 T1203 oasc.ShardLeaderElectionContext.runLeaderProcess Running the leader process.
[junit4:junit4]   2> 5605 T1208 oazs.PrepRequestProcessor.pRequest Got user-level KeeperException when processing sessionid:0x139dcbd7b860004 type:create cxid:0x42 zxid:0xfffffffffffffffe txntype:unknown reqpath:n/a Error Path:/solr/overseer Error:KeeperErrorCode = NodeExists for /solr/overseer
[junit4:junit4]   2> 5606 T1203 oasc.ShardLeaderElectionContext.waitForReplicasToComeUp Enough replicas found to continue.
[junit4:junit4]   2> 5607 T1203 oasc.ShardLeaderElectionContext.runLeaderProcess I may be the new leader - try and sync
[junit4:junit4]   2> 5608 T1203 oasc.SyncStrategy.sync Sync replicas to http://127.0.0.1:36531/solr/collection1/
[junit4:junit4]   2> 5609 T1203 oasc.SyncStrategy.syncReplicas Sync Success - now sync replicas to me
[junit4:junit4]   2> 5609 T1203 oasc.SyncStrategy.syncToMe http://127.0.0.1:36531/solr/collection1/ has no replicas
[junit4:junit4]   2> 5610 T1203 oasc.ShardLeaderElectionContext.runLeaderProcess I am the new leader: http://127.0.0.1:36531/solr/collection1/
[junit4:junit4]   2> 5611 T1203 oascc.SolrZkClient.makePath makePath: /collections/collection1/leaders/shard2
[junit4:junit4]   2> 5619 T1208 oazs.PrepRequestProcessor.pRequest Got user-level KeeperException when processing sessionid:0x139dcbd7b860004 type:create cxid:0x4b zxid:0xfffffffffffffffe txntype:unknown reqpath:n/a Error Path:/solr/overseer Error:KeeperErrorCode = NodeExists for /solr/overseer
[junit4:junit4]   2> 6053 T1224 oascc.ZkStateReader.updateClusterState Updating cloud state from ZooKeeper... 
[junit4:junit4]   2> 6056 T1223 oascc.ZkStateReader$2.process A cluster state change has occurred - updating...
[junit4:junit4]   2> 6056 T1237 oascc.ZkStateReader$2.process A cluster state change has occurred - updating...
[junit4:junit4]   2> 6056 T1249 oascc.ZkStateReader$2.process A cluster state change has occurred - updating...
[junit4:junit4]   2> 6071 T1203 oasc.ZkController.register We are http://127.0.0.1:36531/solr/collection1/ and leader is http://127.0.0.1:36531/solr/collection1/
[junit4:junit4]   2> 6071 T1203 oasc.ZkController.register No LogReplay needed for core=collection1 baseURL=http://127.0.0.1:36531/solr
[junit4:junit4]   2> 6072 T1203 oasc.ZkController.checkRecovery I am the leader, no recovery necessary
[junit4:junit4]   2> 6074 T1203 oascc.ZkStateReader.updateClusterState Updating cloud state from ZooKeeper... 
[junit4:junit4]   2> 6075 T1203 oass.SolrDispatchFilter.init user.dir=/mnt/ssd/jenkins/workspace/Lucene-Solr-4.x-Linux/solr/build/solr-core/test/J1
[junit4:junit4]   2> 6076 T1203 oass.SolrDispatchFilter.init SolrDispatchFilter.init() done
[junit4:junit4]   2> 6077 T1203 oascsi.HttpClientUtil.createClient Creating new http client, config:maxConnections=128&maxConnectionsPerHost=32&followRedirects=false
[junit4:junit4]   2> 6130 T1203 oejs.Server.doStart jetty-8.1.2.v20120308
[junit4:junit4]   2> 6132 T1203 oejs.AbstractConnector.doStart Started SocketConnector@0.0.0.0:44410
[junit4:junit4]   2> 6132 T1203 oasc.SolrResourceLoader.locateSolrHome JNDI not configured for solr (NoInitialContextEx)
[junit4:junit4]   2> 6133 T1203 oasc.SolrResourceLoader.locateSolrHome using system property solr.solr.home: /mnt/ssd/jenkins/workspace/Lucene-Solr-4.x-Linux/solr/build/solr-core/test/J1/./solrtest-jetty3-1348028175170
[junit4:junit4]   2> 6133 T1203 oasc.SolrResourceLoader.<init> new SolrResourceLoader for deduced Solr Home: '/mnt/ssd/jenkins/workspace/Lucene-Solr-4.x-Linux/solr/build/solr-core/test/J1/./solrtest-jetty3-1348028175170/'
[junit4:junit4]   2> 6142 T1203 oass.SolrDispatchFilter.init SolrDispatchFilter.init()
[junit4:junit4]   2> 6143 T1203 oasc.SolrResourceLoader.locateSolrHome JNDI not configured for solr (NoInitialContextEx)
[junit4:junit4]   2> 6143 T1203 oasc.SolrResourceLoader.locateSolrHome using system property solr.solr.home: /mnt/ssd/jenkins/workspace/Lucene-Solr-4.x-Linux/solr/build/solr-core/test/J1/./solrtest-jetty3-1348028175170
[junit4:junit4]   2> 6144 T1203 oasc.CoreContainer$Initializer.initialize looking for solr.xml: /mnt/ssd/jenkins/workspace/Lucene-Solr-4.x-Linux/solr/build/solr-core/test/J1/./solrtest-jetty3-1348028175170/solr.xml
[junit4:junit4]   2> 6144 T1203 oasc.CoreContainer.<init> New CoreContainer 244543434
[junit4:junit4]   2> 6144 T1203 oasc.CoreContainer.load Loading CoreContainer using Solr Home: '/mnt/ssd/jenkins/workspace/Lucene-Solr-4.x-Linux/solr/build/solr-core/test/J1/./solrtest-jetty3-1348028175170/'
[junit4:junit4]   2> 6145 T1203 oasc.SolrResourceLoader.<init> new SolrResourceLoader for directory: '/mnt/ssd/jenkins/workspace/Lucene-Solr-4.x-Linux/solr/build/solr-core/test/J1/./solrtest-jetty3-1348028175170/'
[junit4:junit4]   2> 6157 T1203 oasc.CoreContainer.load Registering Log Listener
[junit4:junit4]   2> 6167 T1203 oasc.CoreContainer.initZooKeeper Zookeeper client=127.0.0.1:51375/solr
[junit4:junit4]   2> 6168 T1203 oaz.ZooKeeper.<init> Initiating client connection, connectString=127.0.0.1:51375/solr sessionTimeout=5000 watcher=org.apache.solr.common.cloud.ConnectionManager@d4c6fd22
[junit4:junit4]   2> 6169 T1260 oaz.ClientCnxn$SendThread.startConnect Opening socket connection to server /127.0.0.1:51375
[junit4:junit4]   2> 6169 T1203 oascc.ConnectionManager.waitForConnected Waiting for client to connect to ZooKeeper
[junit4:junit4]   2> 6169 T1260 oaz.ClientCnxn$SendThread.primeConnection Socket connection established to localhost.localdomain/127.0.0.1:51375, initiating session
[junit4:junit4]   2> 6170 T1205 oazs.NIOServerCnxn$Factory.run Accepted socket connection from /127.0.0.1:33819
[junit4:junit4]   2> 6170 T1205 oazs.NIOServerCnxn.readConnectRequest Client attempting to establish new session at /127.0.0.1:33819
[junit4:junit4]   2> 6171 T1260 oaz.ClientCnxn$SendThread.readConnectResult Session establishment complete on server localhost.localdomain/127.0.0.1:51375, sessionid = 0x139dcbd7b860005, negotiated timeout = 5000
[junit4:junit4]   2> 6171 T1207 oazs.NIOServerCnxn.finishSessionInit Established session 0x139dcbd7b860005 with negotiated timeout 5000 for client /127.0.0.1:33819
[junit4:junit4]   2> 6171 T1261 oascc.ConnectionManager.process Watcher org.apache.solr.common.cloud.ConnectionManager@d4c6fd22 name:ZooKeeperConnection Watcher:127.0.0.1:51375/solr got event WatchedEvent state:SyncConnected type:None path:null path:null type:None
[junit4:junit4]   2> 6172 T1203 oascc.ConnectionManager.waitForConnected Client is connected to ZooKeeper
[junit4:junit4]   2> 6172 T1208 oazs.PrepRequestProcessor.pRequest Got user-level KeeperException when processing sessionid:0x139dcbd7b860005 type:create cxid:0x1 zxid:0xfffffffffffffffe txntype:unknown reqpath:n/a Error Path:/solr/overseer Error:KeeperErrorCode = NodeExists for /solr/overseer
[junit4:junit4]   2> 6173 T1208 oazs.PrepRequestProcessor.pRequest Got user-level KeeperException when processing sessionid:0x139dcbd7b860005 type:create cxid:0x2 zxid:0xfffffffffffffffe txntype:unknown reqpath:n/a Error Path:/solr/overseer Error:KeeperErrorCode = NodeExists for /solr/overseer
[junit4:junit4]   2> 6174 T1203 oasc.ZkController.createEphemeralLiveNode Register node as live in ZooKeeper:/live_nodes/127.0.0.1:44410_solr
[junit4:junit4]   2> 6175 T1208 oazs.PrepRequestProcessor.pRequest Got user-level KeeperException when processing sessionid:0x139dcbd7b860005 type:delete cxid:0x4 zxid:0xfffffffffffffffe txntype:unknown reqpath:n/a Error Path:/solr/live_nodes/127.0.0.1:44410_solr Error:KeeperErrorCode = NoNode for /solr/live_nodes/127.0.0.1:44410_solr
[junit4:junit4]   2> 6175 T1203 oascc.SolrZkClient.makePath makePath: /live_nodes/127.0.0.1:44410_solr
[junit4:junit4]   2> 6177 T1249 oascc.ZkStateReader$3.process Updating live nodes
[junit4:junit4]   2> 6177 T1223 oascc.ZkStateReader$3.process Updating live nodes
[junit4:junit4]   2> 6177 T1237 oascc.ZkStateReader$3.process Updating live nodes
[junit4:junit4]   2> 6178 T1203 oashc.HttpShardHandlerFactory.getParameter Setting socketTimeout to: 0
[junit4:junit4]   2> 6178 T1203 oashc.HttpShardHandlerFactory.getParameter Setting urlScheme to: http://
[junit4:junit4]   2> 6179 T1203 oashc.HttpShardHandlerFactory.getParameter Setting connTimeout to: 0
[junit4:junit4]   2> 6180 T1203 oashc.HttpShardHandlerFactory.getParameter Setting maxConnectionsPerHost to: 20
[junit4:junit4]   2> 6181 T1203 oashc.HttpShardHandlerFactory.getParameter Setting corePoolSize to: 0
[junit4:junit4]   2> 6182 T1203 oashc.HttpShardHandlerFactory.getParameter Setting maximumPoolSize to: 2147483647
[junit4:junit4]   2> 6182 T1203 oashc.HttpShardHandlerFactory.getParameter Setting maxThreadIdleTime to: 5
[junit4:junit4]   2> 6183 T1203 oashc.HttpShardHandlerFactory.getParameter Setting sizeOfQueue to: -1
[junit4:junit4]   2> 6184 T1203 oashc.HttpShardHandlerFactory.getParameter Setting fairnessPolicy to: false
[junit4:junit4]   2> 6185 T1203 oascsi.HttpClientUtil.createClient Creating new http client, config:maxConnectionsPerHost=20&maxConnections=10000&socketTimeout=0&connTimeout=0&retry=false
[junit4:junit4]   2> 6192 T1203 oascc.ZkStateReader.createClusterStateWatchersAndUpdate Updating cluster state from ZooKeeper... 
[junit4:junit4]   2> 6196 T1203 oasc.CoreContainer.create Creating SolrCore 'collection1' using instanceDir: /mnt/ssd/jenkins/workspace/Lucene-Solr-4.x-Linux/solr/build/solr-core/test/J1/./solrtest-jetty3-1348028175170/collection1
[junit4:junit4]   2> 6196 T1203 oasc.ZkController.createCollectionZkNode Check for collection zkNode:collection1
[junit4:junit4]   2> 6197 T1203 oasc.ZkController.createCollectionZkNode Collection zkNode exists
[junit4:junit4]   2> 6197 T1203 oasc.ZkController.readConfigName Load collection config from:/collections/collection1
[junit4:junit4]   2> 6198 T1203 oasc.SolrResourceLoader.<init> new SolrResourceLoader for directory: '/mnt/ssd/jenkins/workspace/Lucene-Solr-4.x-Linux/solr/build/solr-core/test/J1/./solrtest-jetty3-1348028175170/collection1/'
[junit4:junit4]   2> 6199 T1203 oasc.SolrResourceLoader.replaceClassLoader Adding 'file:/mnt/ssd/jenkins/workspace/Lucene-Solr-4.x-Linux/solr/build/solr-core/test/J1/solrtest-jetty3-1348028175170/collection1/lib/README' to classloader
[junit4:junit4]   2> 6199 T1203 oasc.SolrResourceLoader.replaceClassLoader Adding 'file:/mnt/ssd/jenkins/workspace/Lucene-Solr-4.x-Linux/solr/build/solr-core/test/J1/solrtest-jetty3-1348028175170/collection1/lib/classes/' to classloader
[junit4:junit4]   2> 6226 T1203 oasc.SolrConfig.<init> Using Lucene MatchVersion: LUCENE_40
[junit4:junit4]   2> 6268 T1203 oasc.SolrConfig.<init> Loaded SolrConfig: solrconfig.xml
[junit4:junit4]   2> 6269 T1203 oass.IndexSchema.readSchema Reading Solr Schema
[junit4:junit4]   2> 6274 T1203 oass.IndexSchema.readSchema Schema name=test
[junit4:junit4]   2> 6559 T1224 oascc.ZkStateReader.updateClusterState Updating cloud state from ZooKeeper... 
[junit4:junit4]   2> 6563 T1249 oascc.ZkStateReader$2.process A cluster state change has occurred - updating...
[junit4:junit4]   2> 6563 T1223 oascc.ZkStateReader$2.process A cluster state change has occurred - updating...
[junit4:junit4]   2> 6563 T1237 oascc.ZkStateReader$2.process A cluster state change has occurred - updating...
[junit4:junit4]   2> 6563 T1261 oascc.ZkStateReader$2.process A cluster state change has occurred - updating...
[junit4:junit4]   2> 6634 T1203 oass.OpenExchangeRatesOrgProvider.init Initialized with rates=open-exchange-rates.json, refreshInterval=1440.
[junit4:junit4]   2> 6639 T1203 oass.IndexSchema.readSchema default search field in schema is text
[junit4:junit4]   2> 6642 T1203 oass.IndexSchema.readSchema unique key field: id
[junit4:junit4]   2> 6649 T1203 oass.FileExchangeRateProvider.reload Reloading exchange rates from file currency.xml
[junit4:junit4]   2> 6654 T1203 oass.FileExchangeRateProvider.reload Reloading exchange rates from file currency.xml
[junit4:junit4]   2> 6658 T1203 oass.OpenExchangeRatesOrgProvider.reload Reloading exchange rates from open-exchange-rates.json
[junit4:junit4]   2> 6659 T1203 oass.OpenExchangeRatesOrgProvider.reload Reloading exchange rates from open-exchange-rates.json
[junit4:junit4]   2> 6660 T1203 oasc.SolrCore.<init> [collection1] Opening new SolrCore at /mnt/ssd/jenkins/workspace/Lucene-Solr-4.x-Linux/solr/build/solr-core/test/J1/./solrtest-jetty3-1348028175170/collection1/, dataDir=./org.apache.solr.cloud.BasicDistributedZkTest-1348028169091/jetty3/
[junit4:junit4]   2> 6660 T1203 oasc.JmxMonitoredMap.<init> JMX monitoring is enabled. Adding Solr mbeans to JMX Server: com.sun.jmx.mbeanserver.JmxMBeanServer@600f5654
[junit4:junit4]   2> 6661 T1203 oasc.SolrCore.getNewIndexDir WARNING New index directory detected: old=null new=./org.apache.solr.cloud.BasicDistributedZkTest-1348028169091/jetty3/index/
[junit4:junit4]   2> 6662 T1203 oasc.SolrCore.initIndex WARNING [collection1] Solr index directory './org.apache.solr.cloud.BasicDistributedZkTest-1348028169091/jetty3/index' doesn't exist. Creating new index...
[junit4:junit4]   2> 6662 T1203 oasc.CachingDirectoryFactory.get return new directory for /mnt/ssd/jenkins/workspace/Lucene-Solr-4.x-Linux/solr/build/solr-core/test/J1/./org.apache.solr.cloud.BasicDistributedZkTest-1348028169091/jetty3/index forceNew:false
[junit4:junit4]   2> 6665 T1203 oasc.SolrDeletionPolicy.onCommit SolrDeletionPolicy.onCommit: commits:num=1
[junit4:junit4]   2> 		commit{dir=NRTCachingDirectory(org.apache.lucene.store.MMapDirectory@/mnt/ssd/jenkins/workspace/Lucene-Solr-4.x-Linux/solr/build/solr-core/test/J1/org.apache.solr.cloud.BasicDistributedZkTest-1348028169091/jetty3/index lockFactory=org.apache.lucene.store.NativeFSLockFactory@c5bc5c6b; maxCacheMB=48.0 maxMergeSizeMB=4.0),segFN=segments_1,generation=1,filenames=[segments_1]
[junit4:junit4]   2> 6666 T1203 oasc.SolrDeletionPolicy.updateCommits newest commit = 1
[junit4:junit4]   2> 6667 T1203 oasc.SolrCore.initWriters created xml: solr.XMLResponseWriter
[junit4:junit4]   2> 6668 T1203 oasup.UpdateRequestProcessorChain.init inserting DistributedUpdateProcessorFactory into updateRequestProcessorChain "dedupe"
[junit4:junit4]   2> 6669 T1203 oasup.UpdateRequestProcessorChain.init inserting DistributedUpdateProcessorFactory into updateRequestProcessorChain "dedupe-allfields"
[junit4:junit4]   2> 6669 T1203 oasup.UpdateRequestProcessorChain.init inserting DistributedUpdateProcessorFactory into updateRequestProcessorChain "stored_sig"
[junit4:junit4]   2> 6670 T1203 oasup.UpdateRequestProcessorChain.init inserting DistributedUpdateProcessorFactory into updateRequestProcessorChain "uniq-fields"
[junit4:junit4]   2> 6670 T1203 oasup.UpdateRequestProcessorChain.init inserting DistributedUpdateProcessorFactory into updateRequestProcessorChain "distrib-dup-test-chain-implicit"
[junit4:junit4]   2> 6671 T1203 oasc.RequestHandlers.initHandlersFromConfig adding lazy requestHandler: solr.ReplicationHandler
[junit4:junit4]   2> 6671 T1203 oasc.RequestHandlers.initHandlersFromConfig created /replication: solr.ReplicationHandler
[junit4:junit4]   2> 6672 T1203 oasc.RequestHandlers.initHandlersFromConfig created standard: solr.StandardRequestHandler
[junit4:junit4]   2> 6673 T1203 oasc.RequestHandlers.initHandlersFromConfig created /get: solr.RealTimeGetHandler
[junit4:junit4]   2> 6673 T1203 oasc.RequestHandlers.initHandlersFromConfig created dismax: solr.SearchHandler
[junit4:junit4]   2> 6674 T1203 oasc.RequestHandlers.initHandlersFromConfig created mock: org.apache.solr.core.MockQuerySenderListenerReqHandler
[junit4:junit4]   2> 6674 T1203 oasc.RequestHandlers.initHandlersFromConfig created /admin/: org.apache.solr.handler.admin.AdminHandlers
[junit4:junit4]   2> 6675 T1203 oasc.RequestHandlers.initHandlersFromConfig created defaults: solr.StandardRequestHandler
[junit4:junit4]   2> 6676 T1203 oasc.RequestHandlers.initHandlersFromConfig adding lazy requestHandler: solr.StandardRequestHandler
[junit4:junit4]   2> 6676 T1203 oasc.RequestHandlers.initHandlersFromConfig created lazy: solr.StandardRequestHandler
[junit4:junit4]   2> 6677 T1203 oasc.RequestHandlers.initHandlersFromConfig created /update: solr.UpdateRequestHandler
[junit4:junit4]   2> 6677 T1203 oasc.RequestHandlers.initHandlersFromConfig created /terms: org.apache.solr.handler.component.SearchHandler
[junit4:junit4]   2> 6678 T1203 oasc.RequestHandlers.initHandlersFromConfig created spellCheckCompRH: org.apache.solr.handler.component.SearchHandler
[junit4:junit4]   2> 6679 T1203 oasc.RequestHandlers.initHandlersFromConfig created spellCheckCompRH_Direct: org.apache.solr.handler.component.SearchHandler
[junit4:junit4]   2> 6679 T1203 oasc.RequestHandlers.initHandlersFromConfig created spellCheckWithWordbreak: org.apache.solr.handler.component.SearchHandler
[junit4:junit4]   2> 6680 T1203 oasc.RequestHandlers.initHandlersFromConfig created spellCheckWithWordbreak_Direct: org.apache.solr.handler.component.SearchHandler
[junit4:junit4]   2> 6680 T1203 oasc.RequestHandlers.initHandlersFromConfig created spellCheckCompRH1: org.apache.solr.handler.component.SearchHandler
[junit4:junit4]   2> 6681 T1203 oasc.RequestHandlers.initHandlersFromConfig created tvrh: org.apache.solr.handler.component.SearchHandler
[junit4:junit4]   2> 6682 T1203 oasc.RequestHandlers.initHandlersFromConfig created /mlt: solr.MoreLikeThisHandler
[junit4:junit4]   2> 6682 T1203 oasc.RequestHandlers.initHandlersFromConfig created /debug/dump: solr.DumpRequestHandler
[junit4:junit4]   2> 6683 T1203 oashl.XMLLoader.init xsltCacheLifetimeSeconds=60
[junit4:junit4]   2> 6685 T1203 oasc.SolrCore.initDeprecatedSupport WARNING solrconfig.xml uses deprecated <admin/gettableFiles>, Please update your config to use the ShowFileRequestHandler.
[junit4:junit4]   2> 6686 T1203 oasc.SolrCore.initDeprecatedSupport WARNING adding ShowFileRequestHandler with hidden files: [OLD_SYNONYMS.TXT, PROTWORDS.TXT, STOPWORDS.TXT, OPEN-EXCHANGE-RATES.JSON, CURRENCY.XML, SCHEMA.XML, SYNONYMS.TXT, MAPPING-ISOLATIN1ACCENT.TXT]
[junit4:junit4]   2> 6688 T1203 oass.SolrIndexSearcher.<init> Opening Searcher@abc10c72 main
[junit4:junit4]   2> 6689 T1203 oasu.CommitTracker.<init> Hard AutoCommit: disabled
[junit4:junit4]   2> 6690 T1203 oasu.CommitTracker.<init> Soft AutoCommit: disabled
[junit4:junit4]   2> 6690 T1203 oashc.SpellCheckComponent.inform Initializing spell checkers
[junit4:junit4]   2> 6694 T1203 oass.DirectSolrSpellChecker.init init: {name=direct,classname=DirectSolrSpellChecker,field=lowerfilt,minQueryLength=3}
[junit4:junit4]   2> 6716 T1262 oasc.SolrCore.registerSearcher [collection1] Registered new searcher Searcher@abc10c72 main{StandardDirectoryReader(segments_1:1)}
[junit4:junit4]   2> 7066 T1224 oascc.ZkStateReader.updateClusterState Updating cloud state from ZooKeeper... 
[junit4:junit4]   2> 7068 T1249 oascc.ZkStateReader$2.process A cluster state change has occurred - updating...
[junit4:junit4]   2> 7068 T1261 oascc.ZkStateReader$2.process A cluster state change has occurred - updating...
[junit4:junit4]   2> 7068 T1237 oascc.ZkStateReader$2.process A cluster state change has occurred - updating...
[junit4:junit4]   2> 7068 T1223 oascc.ZkStateReader$2.process A cluster state change has occurred - updating...
[junit4:junit4]   2> 7222 T1203 oasc.CoreContainer.register registering core: collection1
[junit4:junit4]   2> 7223 T1203 oasc.ZkController.register Register shard - core:collection1 address:http://127.0.0.1:44410/solr shardId:shard1
[junit4:junit4]   2> 7225 T1203 oasc.ZkController.register We are http://127.0.0.1:44410/solr/collection1/ and leader is http://127.0.0.1:49013/solr/collection1/
[junit4:junit4]   2> 7226 T1203 oasc.ZkController.register No LogReplay needed for core=collection1 baseURL=http://127.0.0.1:44410/solr
[junit4:junit4]   2> 7227 T1203 oasc.ZkController.checkRecovery Core needs to recover:collection1
[junit4:junit4]   2> 7228 T1203 oasu.DefaultSolrCoreState.doRecovery Running recovery - first canceling any ongoing recovery
[junit4:junit4]   2> ASYNC  NEW_CORE C52 name=collection1 org.apache.solr.core.SolrCore@d66c9435 url=http://127.0.0.1:44410/solr/collection1 node=127.0.0.1:44410_solr
[junit4:junit4]   2> 7229 T1263 C52 P44410 oasc.RecoveryStrategy.run Starting recovery process.  core=collection1 recoveringAfterStartup=true
[junit4:junit4]   2> 7229 T1263 C52 P44410 oasc.RecoveryStrategy.doRecovery ###### startupVersions=[]
[junit4:junit4]   2> 7229 T1203 oascc.ZkStateReader.updateClusterState Updating cloud state from ZooKeeper... 
[junit4:junit4]   2> 7230 T1263 C52 P44410 oasc.RecoveryStrategy.doRecovery Attempting to PeerSync from http://127.0.0.1:49013/solr/collection1/ core=collection1 - recoveringAfterStartup=true
[junit4:junit4]   2> 7230 T1263 C52 P44410 oasu.PeerSync.sync PeerSync: core=collection1 url=http://127.0.0.1:44410/solr START replicas=[http://127.0.0.1:49013/solr/collection1/] nUpdates=100
[junit4:junit4]   2> 7230 T1263 C52 P44410 oasu.PeerSync.sync WARNING no frame of reference to tell of we've missed updates
[junit4:junit4]   2> 7230 T1203 oass.SolrDispatchFilter.init user.dir=/mnt/ssd/jenkins/workspace/Lucene-Solr-4.x-Linux/solr/build/solr-core/test/J1
[junit4:junit4]   2> 7230 T1263 C52 P44410 oasc.RecoveryStrategy.doRecovery PeerSync Recovery was not successful - trying replication. core=collection1
[junit4:junit4]   2> 7231 T1263 C52 P44410 oasc.RecoveryStrategy.doRecovery Starting Replication Recovery. core=collection1
[junit4:junit4]   2> 7231 T1203 oass.SolrDispatchFilter.init SolrDispatchFilter.init() done
[junit4:junit4]   2> 7231 T1263 C52 P44410 oascsi.HttpClientUtil.createClient Creating new http client, config:maxConnections=128&maxConnectionsPerHost=32&followRedirects=false
[junit4:junit4]   2> 7232 T1203 oascsi.HttpClientUtil.createClient Creating new http client, config:maxConnections=128&maxConnectionsPerHost=32&followRedirects=false
[junit4:junit4]   2> ASYNC  NEW_CORE C53 name=collection1 org.apache.solr.core.SolrCore@9db4e6f1 url=http://127.0.0.1:49013/solr/collection1 node=127.0.0.1:49013_solr
[junit4:junit4]   2> 7234 T1229 C53 P49013 REQ /get {version=2&getVersions=100&qt=/get&wt=javabin&distrib=false} status=0 QTime=0 
[junit4:junit4]   2> 7237 T1203 oaz.ZooKeeper.<init> Initiating client connection, connectString=127.0.0.1:51375/solr sessionTimeout=10000 watcher=org.apache.solr.common.cloud.ConnectionManager@8f7269b
[junit4:junit4]   2> 7238 T1265 oaz.ClientCnxn$SendThread.startConnect Opening socket connection to server /127.0.0.1:51375
[junit4:junit4]   2> 7238 T1203 oascc.ConnectionManager.waitForConnected Waiting for client to connect to ZooKeeper
[junit4:junit4]   2> 7239 T1265 oaz.ClientCnxn$SendThread.primeConnection Socket connection established to localhost.localdomain/127.0.0.1:51375, initiating session
[junit4:junit4]   2> 7239 T1205 oazs.NIOServerCnxn$Factory.run Accepted socket connection from /127.0.0.1:33823
[junit4:junit4]   2> 7239 T1205 oazs.NIOServerCnxn.readConnectRequest Client attempting to establish new session at /127.0.0.1:33823
[junit4:junit4]   2> 7240 T1207 oazs.NIOServerCnxn.finishSessionInit Established session 0x139dcbd7b860006 with negotiated timeout 10000 for client /127.0.0.1:33823
[junit4:junit4]   2> 7240 T1265 oaz.ClientCnxn$SendThread.readConnectResult Session establishment complete on server localhost.localdomain/127.0.0.1:51375, sessionid = 0x139dcbd7b860006, negotiated timeout = 10000
[junit4:junit4]   2> 7240 T1266 oascc.ConnectionManager.process Watcher org.apache.solr.common.cloud.ConnectionManager@8f7269b name:ZooKeeperConnection Watcher:127.0.0.1:51375/solr got event WatchedEvent state:SyncConnected type:None path:null path:null type:None
[junit4:junit4]   2> 7241 T1203 oascc.ConnectionManager.waitForConnected Client is connected to ZooKeeper
[junit4:junit4]   2> 7242 T1203 oascc.ZkStateReader.createClusterStateWatchersAndUpdate Updating cluster state from ZooKeeper... 
[junit4:junit4]   2> 7243 T1203 oasc.ChaosMonkey.monkeyLog monkey: init - expire sessions:true cause connection loss:true
[junit4:junit4]   2> 7243 T1203 oascsi.HttpClientUtil.createClient Creating new http client, config:
[junit4:junit4]   2> 7249 T1203 oascc.ZkStateReader.updateClusterState Updating cloud state from ZooKeeper... 
[junit4:junit4]   2> 7250 T1203 oasc.AbstractDistribZkTestBase.waitForRecoveriesToFinish Wait for recoveries to finish - collection: collection1 failOnTimeout:true timeout (sec):1800
[junit4:junit4]   2> 7251 T1203 oascc.ZkStateReader.updateClusterState Updating cloud state from ZooKeeper... 
[junit4:junit4]   2> 7570 T1224 oascc.ZkStateReader.updateClusterState Updating cloud state from ZooKeeper... 
[junit4:junit4]   2> 7572 T1237 oascc.ZkStateReader$2.process A cluster state change has occurred - updating...
[junit4:junit4]   2> 7572 T1223 oascc.ZkStateReader$2.process A cluster state change has occurred - updating...
[junit4:junit4]   2> 7572 T1261 oascc.ZkStateReader$2.process A cluster state change has occurred - updating...
[junit4:junit4]   2> 7572 T1249 oascc.ZkStateReader$2.process A cluster state change has occurred - updating...
[junit4:junit4]   2> 7573 T1266 oascc.ZkStateReader$2.process A cluster state change has occurred - updating...
[junit4:junit4]   2> 8252 T1203 oascc.ZkStateReader.updateClusterState Updating cloud state from ZooKeeper... 
[junit4:junit4]   2> 9253 T1203 oascc.ZkStateReader.updateClusterState Updating cloud state from ZooKeeper... 
[junit4:junit4]   2>  C52_STATE=coll:collection1 core:collection1 props:{base_url=http://127.0.0.1:44410/solr, state=recovering, node_name=127.0.0.1:44410_solr, roles=null, collection=collection1, shard=shard1, core=collection1}
[junit4:junit4]   2> 10236 T1263 C52 P44410 oasc.RecoveryStrategy.doRecovery Begin buffering updates. core=collection1
[junit4:junit4]   2> 10236 T1263 C52 P44410 oasu.UpdateLog.bufferUpdates Starting to buffer updates. FSUpdateLog{state=ACTIVE, tlog=null}
[junit4:junit4]   2> 10236 T1263 C52 P44410 oasc.RecoveryStrategy.replicate Attempting to replicate from http://127.0.0.1:49013/solr/collection1/. core=collection1
[junit4:junit4]   2> 10237 T1263 C52 P44410 oascsi.HttpClientUtil.createClient Creating new http client, config:maxConnections=128&maxConnectionsPerHost=32&followRedirects=false
[junit4:junit4]   2> 10240 T1231 C53 P49013 oasu.DirectUpdateHandler2.commit start commit{flags=0,_version_=0,optimize=false,openSearcher=true,waitSearcher=true,expungeDeletes=false,softCommit=false}
[junit4:junit4]   2> 10242 T1231 C53 P49013 oasc.SolrDeletionPolicy.onInit SolrDeletionPolicy.onInit: commits:num=1
[junit4:junit4]   2> 		commit{dir=NRTCachingDirectory(org.apache.lucene.store.MMapDirectory@/mnt/ssd/jenkins/workspace/Lucene-Solr-4.x-Linux/solr/build/solr-core/test/J1/org.apache.solr.cloud.BasicDistributedZkTest-1348028169091/jetty1/index lockFactory=org.apache.lucene.store.NativeFSLockFactory@7dfabfde; maxCacheMB=48.0 maxMergeSizeMB=4.0),segFN=segments_1,generation=1,filenames=[segments_1]
[junit4:junit4]   2> 10243 T1231 C53 P49013 oasc.SolrDeletionPolicy.updateCommits newest commit = 1
[junit4:junit4]   2> 10244 T1231 C53 P49013 oass.SolrIndexSearcher.<init> Opening Searcher@876661af main
[junit4:junit4]   2> 10245 T1231 C53 P49013 oasu.DirectUpdateHandler2.commit end_commit_flush
[junit4:junit4]   2> 10246 T1238 oasc.SolrCore.registerSearcher [collection1] Registered new searcher Searcher@876661af main{StandardDirectoryReader(segments_1:1)}
[junit4:junit4]   2> 10246 T1231 C53 P49013 /update {softCommit=false&commit_end_point=true&commit=true&version=2&waitSearcher=true&wt=javabin} {commit=} 0 6
[junit4:junit4]   2> 10247 T1263 C52 P44410 oash.ReplicationHandler.inform Commits will be reserved for  10000
[junit4:junit4]   2> 10247 T1263 C52 P44410 oash.SnapPuller.<init>  No value set for 'pollInterval'. Timer Task not started.
[junit4:junit4]   2> 10249 T1232 C53 P49013 oash.ReplicationHandler.inform Commits will be reserved for  10000
[junit4:junit4]   2> 10249 T1232 C53 P49013 REQ /replication {version=2&command=indexversion&qt=/replication&wt=javabin} status=0 QTime=1 
[junit4:junit4]   2> 10251 T1263 C52 P44410 oasc.SolrDeletionPolicy.onInit SolrDeletionPolicy.onInit: commits:num=1
[junit4:junit4]   2> 		commit{dir=NRTCachingDirectory(org.apache.lucene.store.MMapDirectory@/mnt/ssd/jenkins/workspace/Lucene-Solr-4.x-Linux/solr/build/solr-core/test/J1/org.apache.solr.cloud.BasicDistributedZkTest-1348028169091/jetty3/index lockFactory=org.apache.lucene.store.NativeFSLockFactory@c5bc5c6b; maxCacheMB=48.0 maxMergeSizeMB=4.0),segFN=segments_1,generation=1,filenames=[segments_1]
[junit4:junit4]   2> 10251 T1263 C52 P44410 oasc.SolrDeletionPolicy.updateCommits newest commit = 1
[junit4:junit4]   2> 10251 T1263 C52 P44410 oasu.DirectUpdateHandler2.commit start commit{flags=0,_version_=0,optimize=false,openSearcher=true,waitSearcher=true,expungeDeletes=false,softCommit=false}
[junit4:junit4]   2> 10255 T1203 oascc.ZkStateReader.updateClusterState Updating cloud state from ZooKeeper... 
[junit4:junit4]   2> 10261 T1263 C52 P44410 oasc.SolrDeletionPolicy.onCommit SolrDeletionPolicy.onCommit: commits:num=2
[junit4:junit4]   2> 		commit{dir=NRTCachingDirectory(org.apache.lucene.store.MMapDirectory@/mnt/ssd/jenkins/workspace/Lucene-Solr-4.x-Linux/solr/build/solr-core/test/J1/org.apache.solr.cloud.BasicDistributedZkTest-1348028169091/jetty3/index lockFactory=org.apache.lucene.store.NativeFSLockFactory@c5bc5c6b; maxCacheMB=48.0 maxMergeSizeMB=4.0),segFN=segments_1,generation=1,filenames=[segments_1]
[junit4:junit4]   2> 		commit{dir=NRTCachingDirectory(org.apache.lucene.store.MMapDirectory@/mnt/ssd/jenkins/workspace/Lucene-Solr-4.x-Linux/solr/build/solr-core/test/J1/org.apache.solr.cloud.BasicDistributedZkTest-1348028169091/jetty3/index lockFactory=org.apache.lucene.store.NativeFSLockFactory@c5bc5c6b; maxCacheMB=48.0 maxMergeSizeMB=4.0),segFN=segments_2,generation=2,filenames=[segments_2]
[junit4:junit4]   2> 10262 T1263 C52 P44410 oasc.SolrDeletionPolicy.updateCommits newest commit = 2
[junit4:junit4]   2> 10263 T1263 C52 P44410 oass.SolrIndexSearcher.<init> Opening Searcher@241e51f0 main
[junit4:junit4]   2> 10263 T1263 C52 P44410 oasu.DirectUpdateHandler2.commit end_commit_flush
[junit4:junit4]   2> 10264 T1262 oasc.SolrCore.registerSearcher [collection1] Registered new searcher Searcher@241e51f0 main{StandardDirectoryReader(segments_2:2)}
[junit4:junit4]   2> 10265 T1263 C52 P44410 oasc.RecoveryStrategy.replay No replay needed. core=collection1
[junit4:junit4]   2> 10265 T1263 C52 P44410 oasc.RecoveryStrategy.doRecovery Replication Recovery was successful - registering as Active. core=collection1
[junit4:junit4]   2> 10267 T1263 C52 P44410 oasc.RecoveryStrategy.doRecovery Finished recovery process. core=collection1
[junit4:junit4]   2> 10579 T1224 oascc.ZkStateReader.updateClusterState Updating cloud state from ZooKeeper... 
[junit4:junit4]   2> 10583 T1237 oascc.ZkStateReader$2.process A cluster state change has occurred - updating...
[junit4:junit4]   2> 10583 T1261 oascc.ZkStateReader$2.process A cluster state change has occurred - updating...
[junit4:junit4]   2> 10583 T1249 oascc.ZkStateReader$2.process A cluster state change has occurred - updating...
[junit4:junit4]   2> 10583 T1266 oascc.ZkStateReader$2.process A cluster state change has occurred - updating...
[junit4:junit4]   2> 10583 T1223 oascc.ZkStateReader$2.process A cluster state change has occurred - updating...
[junit4:junit4]   2> 11256 T1203 oascc.ZkStateReader.updateClusterState Updating cloud state from ZooKeeper... 
[junit4:junit4]   2> ASYNC  NEW_CORE C54 name=collection1 org.apache.solr.core.SolrCore@db68e82b url=http://127.0.0.1:44082/solr/collection1 node=127.0.0.1:44082_solr
[junit4:junit4]   2> 11264 T1215 C54 P44082 oasc.SolrDeletionPolicy.onInit SolrDeletionPolicy.onInit: commits:num=1
[junit4:junit4]   2> 		commit{dir=NRTCachingDirectory(org.apache.lucene.store.MMapDirectory@/mnt/ssd/jenkins/workspace/Lucene-Solr-4.x-Linux/solr/build/solr-core/test/J1/org.apache.solr.cloud.BasicDistributedZkTest-1348028169091/control/data/index lockFactory=org.apache.lucene.store.NativeFSLockFactory@7dc2280c; maxCacheMB=48.0 maxMergeSizeMB=4.0),segFN=segments_1,generation=1,filenames=[segments_1]
[junit4:junit4]   2> 11264 T1215 C54 P44082 oasc.SolrDeletionPolicy.updateCommits newest commit = 1
[junit4:junit4]   2> 11266 T1215 C54 P44082 oass.SolrIndexSearcher.<init> Opening Searcher@4eda65bd realtime
[junit4:junit4]   2> 11267 T1215 C54 P44082 /update {version=2&wt=javabin} {deleteByQuery=*:* (-1413509997236584448)} 0 7
[junit4:junit4]   2> 11267 T1203 oaz.ZooKeeper.<init> Initiating client connection, connectString=127.0.0.1:51375/solr sessionTimeout=10000 watcher=org.apache.solr.common.cloud.ConnectionManager@aed107c0
[junit4:junit4]   2> 11269 T1267 oaz.ClientCnxn$SendThread.startConnect Opening socket connection to server /127.0.0.1:51375
[junit4:junit4]   2> 11269 T1203 oascc.ConnectionManager.waitForConnected Waiting for client to connect to ZooKeeper
[junit4:junit4]   2> 11269 T1267 oaz.ClientCnxn$SendThread.primeConnection Socket connection established to localhost.localdomain/127.0.0.1:51375, initiating session
[junit4:junit4]   2> 11269 T1205 oazs.NIOServerCnxn$Factory.run Accepted socket connection from /127.0.0.1:33832
[junit4:junit4]   2> 11270 T1205 oazs.NIOServerCnxn.readConnectRequest Client attempting to establish new session at /127.0.0.1:33832
[junit4:junit4]   2> 11271 T1207 oazs.NIOServerCnxn.finishSessionInit Established session 0x139dcbd7b860007 with negotiated timeout 10000 for client /127.0.0.1:33832
[junit4:junit4]   2> 11271 T1267 oaz.ClientCnxn$SendThread.readConnectResult Session establishment complete on server localhost.localdomain/127.0.0.1:51375, sessionid = 0x139dcbd7b860007, negotiated timeout = 10000
[junit4:junit4]   2> 11271 T1268 oascc.ConnectionManager.process Watcher org.apache.solr.common.cloud.ConnectionManager@aed107c0 name:ZooKeeperConnection Watcher:127.0.0.1:51375/solr got event WatchedEvent state:SyncConnected type:None path:null path:null type:None
[junit4:junit4]   2> 11271 T1203 oascc.ConnectionManager.waitForConnected Client is connected to ZooKeeper
[junit4:junit4]   2> 11272 T1203 oascc.ZkStateReader.createClusterStateWatchersAndUpdate Updating cluster state from ZooKeeper... 
[junit4:junit4]   2> 11276 T1233 C53 P49013 oass.SolrIndexSearcher.<init> Opening Searcher@ca65498c realtime
[junit4:junit4]   2>  C52_STATE=coll:collection1 core:collection1 props:{base_url=http://127.0.0.1:44410/solr, state=active, node_name=127.0.0.1:44410_solr, roles=null, collection=collection1, shard=shard1, core=collection1}
[junit4:junit4]   2> 11280 T1253 C52 P44410 oass.SolrIndexSearcher.<init> Opening Searcher@177d8595 realtime
[junit4:junit4]   2> 11281 T1253 C52 P44410 REQ /update {update.distrib=FROMLEADER&_version_=-1413509997251264512&version=2&wt=javabin&update.from=http://127.0.0.1:49013/solr/collection1/} status=0 QTime=2 
[junit4:junit4]   2> ASYNC  NEW_CORE C55 name=collection1 org.apache.solr.core.SolrCore@2b4ec367 url=http://127.0.0.1:36531/solr/collection1 node=127.0.0.1:36531_solr
[junit4:junit4]   2> 11281 T1241 C55 P36531 oasc.SolrDeletionPolicy.onInit SolrDeletionPolicy.onInit: commits:num=1
[junit4:junit4]   2> 		commit{dir=NRTCachingDirectory(org.apache.lucene.store.MMapDirectory@/mnt/ssd/jenkins/workspace/Lucene-Solr-4.x-Linux/solr/build/solr-core/test/J1/org.apache.solr.cloud.BasicDistributedZkTest-1348028169091/jetty2/index lockFactory=org.apache.lucene.store.NativeFSLockFactory@1dee680; maxCacheMB=48.0 maxMergeSizeMB=4.0),segFN=segments_1,generation=1,filenames=[segments_1]
[junit4:junit4]   2> 11282 T1241 C55 P36531 oasc.SolrDeletionPolicy.updateCommits newest commit = 1
[junit4:junit4]   2> 11283 T1241 C55 P36531 oass.SolrIndexSearcher.<init> Opening Searcher@d7f2e17b realtime
[junit4:junit4]   2> 11283 T1241 C55 P36531 REQ /update {update.distrib=TOLEADER&version=2&wt=javabin} status=0 QTime=3 
[junit4:junit4]   2> 11284 T1233 C53 P49013 /update {version=2&wt=javabin} {deleteByQuery=*:* (-1413509997251264512)} 0 9
[junit4:junit4]   2> 11288 T1215 C54 P44082 /update {version=2&wt=javabin} {add=[1 (1413509997262798848)]} 0 2
[junit4:junit4]   2> 11295 T1253 C52 P44410 REQ /update {update.distrib=FROMLEADER&distrib.from=http://127.0.0.1:49013/solr/collection1/&version=2&wt=javabin} status=0 QTime=1 
[junit4:junit4]   2> 11296 T1234 C53 P49013 REQ /update {update.distrib=TOLEADER&distrib.from=http://127.0.0.1:36531/solr/collection1/&version=2&wt=javabin} status=0 QTime=5 
[junit4:junit4]   2> 11296 T1242 C55 P36531 /update {version=2&wt=javabin} {add=[1]} 0 7
[junit4:junit4]   2> 11300 T1215 C54 P44082 /update {version=2&wt=javabin} {add=[2 (1413509997276430336)]} 0 1
[junit4:junit4]   2> 11306 T1241 C55 P36531 REQ /update {update.distrib=TOLEADER&distrib.from=http://127.0.0.1:49013/solr/collection1/&version=2&wt=javabin} status=0 QTime=2 
[junit4:junit4]   2> 11306 T1233 C53 P49013 /update {version=2&wt=javabin} {add=[2]} 0 4
[junit4:junit4]   2> 11309 T1215 C54 P44082 /update {version=2&wt=javabin} {add=[3 (1413509997285867520)]} 0 1
[junit4:junit4]   2> 11312 T1242 C55 P36531 /update {version=2&wt=javabin} {add=[3 (1413509997289013248)]} 0 1
[junit4:junit4]   2> 11315 T1215 C54 P44082 /update {version=2&wt=javabin} {add=[4 (1413509997292158976)]} 0 1
[junit4:junit4]   2> 11320 T1253 C52 P44410 REQ /update {update.distrib=FROMLEADER&distrib.from=http://127.0.0.1:49013/solr/collection1/&version=2&wt=javabin} status=0 QTime=1 
[junit4:junit4]   2> 11320 T1233 C53 P49013 /update {version=2&wt=javabin} {add=[4 (1413509997295304704)]} 0 3
[junit4:junit4]   2> 11323 T1215 C54 P44082 /update {version=2&wt=javabin} {add=[5 (1413509997300547584)]} 0 1
[junit4:junit4]   2> 11328 T1241 C55 P36531 REQ /update {update.distrib=TOLEADER&distrib.from=http://127.0.0.1:49013/solr/collection1/&version=2&wt=javabin} status=0 QTime=1 
[junit4:junit4]   2> 11328 T1233 C53 P49013 /update {version=2&wt=javabin} {add=[5]} 0 3
[junit4:junit4]   2> 11331 T1215 C54 P44082 /update {version=2&wt=javabin} {add=[6 (1413509997308936192)]} 0 1
[junit4:junit4]   2> 11336 T1241 C55 P36531 REQ /update {update.distrib=TOLEADER&distrib.from=http://127.0.0.1:49013/solr/collection1/&version=2&wt=javabin} status=0 QTime=1 
[junit4:junit4]   2> 11336 T1233 C53 P49013 /update {version=2&wt=javabin} {add=[6]} 0 3
[junit4:junit4]   2> 11339 T1215 C54 P44082 /update {version=2&wt=javabin} {add=[7 (1413509997317324800)]} 0 1
[junit4:junit4]   2> 11344 T1241 C55 P36531 REQ /update {update.distrib=TOLEADER&distrib.from=http://127.0.0.1:49013/solr/collection1/&version=2&wt=javabin} status=0 QTime=1 
[junit4:junit4]   2> 11344 T1233 C53 P49013 /update {version=2&wt=javabin} {add=[7]} 0 3
[junit4:junit4]   2> 11347 T1215 C54 P44082 /update {version=2&wt=javabin} {add=[8 (1413509997325713408)]} 0 1
[junit4:junit4]   2> 11352 T1253 C52 P44410 REQ /update {update.distrib=FROMLEADER&distrib.from=http://127.0.0.1:49013/solr/collection1/&version=2&wt=javabin} status=0 QTime=0 
[junit4:junit4]   2> 11353 T1233 C53 P49013 /update {version=2&wt=javabin} {add=[8 (1413509997329907712)]} 0 4
[junit4:junit4]   2> 11356 T1215 C54 P44082 /update {version=2&wt=javabin} {add=[9 (1413509997335150592)]} 0 1
[junit4:junit4]   2> 11361 T1241 C55 P36531 REQ /update {update.distrib=TOLEADER&distrib.from=http://127.0.0.1:49013/solr/collection1/&version=2&wt=javabin} status=0 QTime=1 
[junit4:junit4]   2> 11361 T1233 C53 P49013 /update {version=2&wt=javabin} {add=[9]} 0 3
[junit4:junit4]   2> 11374 T1215 C54 P44082 /update {version=2&wt=javabin} {add=[10 (1413509997343539200)]} 0 11
[junit4:junit4]   2> 11380 T1253 C52 P44410 REQ /update {update.distrib=FROMLEADER&distrib.from=http://127.0.0.1:49013/solr/collection1/&version=2&wt=javabin} status=0 QTime=1 
[junit4:junit4]   2> 11380 T1233 C53 P49013 /update {version=2&wt=javabin} {add=[10 (1413509997357170688)]} 0 4
[junit4:junit4]   2> 11384 T1215 C54 P44082 /update {version=2&wt=javabin} {add=[11 (1413509997363462144)]} 0 2
[junit4:junit4]   2> 11400 T1253 C52 P44410 REQ /update {update.distrib=FROMLEADER&distrib.from=http://127.0.0.1:49013/solr/collection1/&version=2&wt=javabin} status=0 QTime=1 
[junit4:junit4]   2> 11401 T1233 C53 P49013 /update {version=2&wt=javabin} {add=[11 (1413509997367656448)]} 0 15
[junit4:junit4]   2> 11404 T1215 C54 P44082 /update {version=2&wt=javabin} {add=[12 (1413509997385482240)]} 0 1
[junit4:junit4]   2> 11409 T1253 C52 P44410 REQ /update {update.distrib=FROMLEADER&distrib.from=http://127.0.0.1:49013/solr/collection1/&version=2&wt=javabin} status=0 QTime=1 
[junit4:junit4]   2> 11410 T1233 C53 P49013 /update {version=2&wt=javabin} {add=[12 (1413509997388627968)]} 0 4
[junit4:junit4]   2> 11413 T1215 C54 P44082 /update {version=2&wt=javabin} {add=[13 (1413509997394919424)]} 0 1
[junit4:junit4]   2> 11419 T1253 C52 P44410 REQ /update {update.distrib=FROMLEADER&distrib.from=http://127.0.0.1:49013/solr/collection1/&version=2&wt=javabin} status=0 QTime=1 
[junit4:junit4]   2> 11419 T1234 C53 P49013 REQ /update {update.distrib=TOLEADER&distrib.from=http://127.0.0.1:36531/solr/collection1/&version=2&wt=javabin} status=0 QTime=3 
[junit4:junit4]   2> 11420 T1242 C55 P36531 /update {version=2&wt=javabin} {add=[13]} 0 6
[junit4:junit4]   2> 11422 T1215 C54 P44082 /update {version=2&wt=javabin} {add=[14 (1413509997405405184)]} 0 0
[junit4:junit4]   2> 11428 T1253 C52 P44410 REQ /update {update.distrib=FROMLEADER&distrib.from=http://127.0.0.1:49013/solr/collection1/&version=2&wt=javabin} status=0 QTime=1 
[junit4:junit4]   2> 11429 T1234 C53 P49013 REQ /update {update.distrib=TOLEADER&distrib.from=http://127.0.0.1:36531/solr/collection1/&version=2&wt=javabin} status=0 QTime=3 
[junit4:junit4]   2> 11429 T1242 C55 P36531 /update {version=2&wt=javabin} {add=[14]} 0 5
[junit4:junit4]   2> 11432 T1215 C54 P44082 /update {version=2&wt=javabin} {add=[15 (1413509997414842368)]} 0 1
[junit4:junit4]   2> 11436 T1253 C52 P44410 REQ /update {update.distrib=FROMLEADER&distrib.from=http://127.0.0.1:49013/solr/collection1/&version=2&wt=javabin} status=0 QTime=0 
[junit4:junit4]   2> 11437 T1233 C53 P49013 /update {version=2&wt=javabin} {add=[15 (1413509997416939520)]} 0 4
[junit4:junit4]   2> 11440 T1215 C54 P44082 /update {version=2&wt=javabin} {add=[16 (1413509997423230976)]} 0 1
[junit4:junit4]   2> 11464 T1253 C52 P44410 REQ /update {update.distrib=FROMLEADER&distrib.from=http://127.0.0.1:49013/solr/collection1/&version=2&wt=javabin} status=0 QTime=9 
[junit4:junit4]   2> 11464 T1234 C53 P49013 REQ /update {update.distrib=TOLEADER&distrib.from=http://127.0.0.1:36531/solr/collection1/&version=2&wt=javabin} status=0 QTime=21 
[junit4:junit4]   2> 11465 T1242 C55 P36531 /update {version=2&wt=javabin} {add=[16]} 0 24
[junit4:junit4]   2> 11469 T1215 C54 P44082 /update {version=2&wt=javabin} {add=[17 (1413509997452591104)]} 0 2
[junit4:junit4]   2> 11473 T1242 C55 P36531 /update {version=2&wt=javabin} {add=[17 (1413509997456785408)]} 0 2
[junit4:junit4]   2> 11476 T1215 C54 P44082 /update {version=2&wt=javabin} {add=[100 (1413509997460979712)]} 0 1
[junit4:junit4]   2> 11481 T1253 C52 P44410 REQ /update {update.distrib=FROMLEADER&distrib.from=http://127.0.0.1:49013/solr/collection1/&version=2&wt=javabin} status=0 QTime=1 
[junit4:junit4]   2> 11482 T1233 C53 P49013 /update {version=2&wt=javabin} {add=[100 (1413509997464125440)]} 0 5
[junit4:junit4]   2> 11485 T1215 C54 P44082 /update {version=2&wt=javabin} {add=[101 (1413509997470416896)]} 0 1
[junit4:junit4]   2> 11491 T1253 C52 P44410 REQ /update {update.distrib=FROMLEADER&distrib.from=http://127.0.0.1:49013/solr/collection1/&version=2&wt=javabin} status=0 QTime=1 
[junit4:junit4]   2> 11491 T1234 C53 P49013 REQ /update {update.distrib=TOLEADER&distrib.from=http://127.0.0.1:36531/solr/collection1/&version=2&wt=javabin} status=0 QTime=3 
[junit4:junit4]   2> 11491 T1242 C55 P36531 /update {version=2&wt=javabin} {add=[101]} 0 4
[junit4:junit4]   2> 11506 T1215 C54 P44082 /update {version=2&wt=javabin} {add=[102 (1413509997479854080)]} 0 13
[junit4:junit4]   2> 11511 T1253 C52 P44410 REQ /update {update.distrib=FROMLEADER&distrib.from=http://127.0.0.1:49013/solr/collection1/&version=2&wt=javabin} status=0 QTime=0 
[junit4:junit4]   2> 11511 T1233 C53 P49013 /update {version=2&wt=javabin} {add=[102 (1413509997495582720)]} 0 3
[junit4:junit4]   2> 11514 T1215 C54 P44082 /update {version=2&wt=javabin} {add=[103 (1413509997500825600)]} 0 1
[junit4:junit4]   2> 11518 T1241 C55 P36531 REQ /update {update.distrib=TOLEADER&distrib.from=http://127.0.0.1:49013/solr/collection1/&version=2&wt=javabin} status=0 QTime=0 
[junit4:junit4]   2> 11519 T1233 C53 P49013 /update {version=2&wt=javabin} {add=[103]} 0 3
[junit4:junit4]   2> 11521 T1215 C54 P44082 /update {version=2&wt=javabin} {add=[104 (1413509997509214208)]} 0 0
[junit4:junit4]   2> 11525 T1241 C55 P36531 REQ /update {update.distrib=TOLEADER&distrib.from=http://127.0.0.1:49013/solr/collection1/&version=2&wt=javabin} status=0 QTime=0 
[junit4:junit4]   2> 11526 T1233 C53 P49013 /update {version=2&wt=javabin} {add=[104]} 0 3
[junit4:junit4]   2> 11528 T1215 C54 P44082 /update {version=2&wt=javabin} {add=[105 (1413509997516554240)]} 0 0
[junit4:junit4]   2> 11539 T1242 C55 P36531 /update {version=2&wt=javabin} {add=[105 (1413509997518651392)]} 0 9
[junit4:junit4]   2> 11542 T1215 C54 P44082 /update {version=2&wt=javabin} {add=[106 (1413509997530185728)]} 0 1
[junit4:junit4]   2> 11546 T1241 C55 P36531 REQ /update {update.distrib=TOLEADER&distrib.from=http://127.0.0.1:49013/solr/collection1/&version=2&wt=javabin} status=0 QTime=1 
[junit4:junit4]   2> 11547 T1233 C53 P49013 /update {version=2&wt=javabin} {add=[106]} 0 3
[junit4:junit4]   2> 11549 T1215 C54 P44082 /update {version=2&wt=javabin} {add=[107 (1413509997537525760)]} 0 1
[junit4:junit4]   2> 11555 T1253 C52 P44410 REQ /update {update.distrib=FROMLEADER&distrib.from=http://127.0.0.1:49013/solr/collection1/&version=2&wt=javabin} status=0 QTime=1 
[junit4:junit4]   2> 11555 T1234 C53 P49013 REQ /update {update.distrib=TOLEADER&distrib.from=http://127.0.0.1:36531/solr/collection1/&version=2&wt=javabin} status=0 QTime=3 
[junit4:junit4]   2> 11556 T1242 C55 P36531 /update {version=2&wt=javabin} {add=[107]} 0 5
[junit4:junit4]   2> 11558 T1215 C54 P44082 /update {version=2&wt=javabin} {add=[108 (1413509997548011520)]} 0 0
[junit4:junit4]   2> 11564 T1253 C52 P44410 REQ /update {update.distrib=FROMLEADER&distrib.from=http://127.0.0.1:49013/solr/collection1/&version=2&wt=javabin} status=0 QTime=1 
[junit4:junit4]   2> 11564 T1234 C53 P49013 REQ /update {update.distrib=TOLEADER&distrib.from=http://127.0.0.1:36531/solr/collection1/&version=2&wt=javabin} status=0 QTime=3 
[junit4:junit4]   2> 11565 T1242 C55 P36531 /update {version=2&wt=javabin} {add=[108]} 0 5
[junit4:junit4]   2> 11567 T1215 C54 P44082 /update {version=2&wt=javabin} {add=[109 (1413509997557448704)]} 0 0
[junit4:junit4]   2> 11573 T1253 C52 P44410 REQ /update {update.distrib=FROMLEADER&distrib.from=http://127.0.0.1:49013/solr/collection1/&version=2&wt=javabin} status=0 QTime=0 
[junit4:junit4]   2> 11574 T1234 C53 P49013 REQ /update {update.distrib=TOLEADER&distrib.from=http://127.0.0.1:36531/solr/collection1/&version=2&wt=javabin} status=0 QTime=3 
[junit4:junit4]   2> 11574 T1242 C55 P36531 /update {version=2&wt=javabin} {add=[109]} 0 5
[junit4:junit4]   2> 11577 T1215 C54 P44082 /update {version=2&wt=javabin} {add=[110 (1413509997566885888)]} 0 1
[junit4:junit4]   2> 11582 T1253 C52 P44410 REQ /update {update.distrib=FROMLEADER&distrib.from=http://127.0.0.1:49013/solr/collection1/&version=2&wt=javabin} status=0 QTime=0 
[junit4:junit4]   2> 11583 T1234 C53 P49013 REQ /update {update.distrib=TOLEADER&distrib.from=http://127.0.0.1:36531/solr/collection1/&version=2&wt=javabin} status=0 QTime=3 
[junit4:junit4]   2> 11584 T1242 C55 P36531 /update {version=2&wt=javabin} {add=[110]} 0 6
[junit4:junit4]   2> 11586 T1215 C54 P44082 /update {version=2&wt=javabin} {add=[111 (1413509997576323072)]} 0 1
[junit4:junit4]   2> 11592 T1253 C52 P44410 REQ /update {update.distrib=FROMLEADER&distrib.from=http://127.0.0.1:49013/solr/collection1/&version=2&wt=javabin} status=0 QTime=1 
[junit4:junit4]   2> 11592 T1234 C53 P49013 REQ /update {update.distrib=TOLEADER&distrib.from=http://127.0.0.1:36531/solr/collection1/&version=2&wt=javabin} status=0 QTime=3 
[junit4:junit4]   2> 11593 T1242 C55 P36531 /update {version=2&wt=javabin} {add=[111]} 0 5
[junit4:junit4]   2> 11602 T1215 C54 P44082 /update {version=2&wt=javabin} {add=[112 (1413509997585760256)]} 0 8
[junit4:junit4]   2> 11605 T1242 C55 P36531 /update {version=2&wt=javabin} {add=[112 (1413509997596246016)]} 0 1
[junit4:junit4]   2> 11608 T1215 C54 P44082 /update {version=2&wt=javabin} {add=[113 (1413509997599391744)]} 0 1
[junit4:junit4]   2> 11612 T1253 C52 P44410 REQ /update {update.distrib=FROMLEADER&distrib.from=http://127.0.0.1:49013/solr/collection1/&version=2&wt=javabin} status=0 QTime=1 
[junit4:junit4]   2> 11612 T1233 C53 P49013 /update {version=2&wt=javabin} {add=[113 (1413509997601488896)]} 0 3
[junit4:junit4]   2> 11615 T1215 C54 P44082 /update {version=2&wt=javabin} {add=[114 (1413509997606731776)]} 0 1
[junit4:junit4]   2> 11636 T1253 C52 P44410 REQ /update {update.distrib=FROMLEADER&distrib.from=http://127.0.0.1:49013/solr/collection1/&version=2&wt=javabin} status=0 QTime=7 
[junit4:junit4]   2> 11636 T1234 C53 P49013 REQ /update {update.distrib=TOLEADER&distrib.from=http://127.0.0.1:36531/solr/collection1/&version=2&wt=javabin} status=0 QTime=18 
[junit4:junit4]   2> 11637 T1242 C55 P36531 /update {version=2&wt=javabin} {add=[114]} 0 20
[junit4:junit4]   2> 11639 T1215 C54 P44082 /update {version=2&wt=javabin} {add=[115 (1413509997632946176)]} 0 0
[junit4:junit4]   2> 11642 T1242 C55 P36531 /update {version=2&wt=javabin} {add=[115 (1413509997635043328)]} 0 1
[junit4:junit4]   2> 11644 T1215 C54 P44082 /update {version=2&wt=javabin} {add=[116 (1413509997638189056)]} 0 0
[junit4:junit4]   2> 11647 T1242 C55 P36531 /update {version=2&wt=javabin} {add=[116 (1413509997640286208)]} 0 1
[junit4:junit4]   2> 11649 T1215 C54 P44082 /update {version=2&wt=javabin} {add=[117 (1413509997642383360)]} 0 1
[junit4:junit4]   2> 11652 T1242 C55 P36531 /update {version=2&wt=javabin} {add=[117 (1413509997645529088)]} 0 1
[junit4:junit4]   2> 11654 T1215 C54 P44082 /update {version=2&wt=javabin} {add=[118 (1413509997648674816)]} 0 0
[junit4:junit4]   2> 11661 T1253 C52 P44410 REQ /update {update.distrib=FROMLEADER&distrib.from=http://127.0.0.1:49013/solr/collection1/&version=2&wt=javabin} status=0 QTime=1 
[junit4:junit4]   2> 11662 T1234 C53 P49013 REQ /update {update.distrib=TOLEADER&distrib.from=http://127.0.0.1:36531/solr/collection1/&version=2&wt=javabin} status=0 QTime=4 
[junit4:junit4]   2> 11662 T1242 C55 P36531 /update {version=2&wt=javabin} {add=[118]} 0 6
[junit4:junit4]   2> 11665 T1215 C54 P44082 /update {version=2&wt=javabin} {add=[119 (1413509997659160576)]} 0 1
[junit4:junit4]   2> 11667 T1242 C55 P36531 /update {version=2&wt=javabin} {add=[119 (1413509997662306304)]} 0 0
[junit4:junit4]   2> 11670 T1215 C54 P44082 /update {version=2&wt=javabin} {add=[120 (1413509997664403456)]} 0 1
[junit4:junit4]   2> 11672 T1242 C55 P36531 /update {version=2&wt=javabin} {add=[120 (1413509997667549184)]} 0 0
[junit4:junit4]   2> 11675 T1215 C54 P44082 /update {version=2&wt=javabin} {add=[121 (1413509997669646336)]} 0 1
[junit4:junit4]   2> 11678 T1242 C55 P36531 /update {version=2&wt=javabin} {add=[121 (1413509997672792064)]} 0 1
[junit4:junit4]   2> 11689 T1215 C54 P44082 /update {version=2&wt=javabin} {add=[122 (1413509997675937792)]} 0 10
[junit4:junit4]   2> 11694 T1253 C52 P44410 REQ /update {update.distrib=FROMLEADER&distrib.from=http://127.0.0.1:49013/solr/collection1/&version=2&wt=javabin} status=0 QTime=1 
[junit4:junit4]   2> 11694 T1233 C53 P49013 /update {version=2&wt=javabin} {add=[122 (1413509997687472128)]} 0 3
[junit4:junit4]   2> 11698 T1215 C54 P44082 /update {version=2&wt=javabin} {add=[123 (1413509997692715008)]} 0 2
[junit4:junit4]   2> 11702 T1253 C52 P44410 REQ /update {update.distrib=FROMLEADER&distrib.from=http://127.0.0.1:49013/solr/collection1/&version=2&wt=javabin} status=0 QTime=1 
[junit4:junit4]   2> 11702 T1233 C53 P49013 /update {version=2&wt=javabin} {add=[123 (1413509997695860736)]} 0 3
[junit4:junit4]   2> 11705 T1215 C54 P44082 /update {version=2&wt=javabin} {add=[124 (1413509997701103616)]} 0 1
[junit4:junit4]   2> 11710 T1253 C52 P44410 REQ /update {update.distrib=FROMLEADER&distrib.from=http://127.0.0.1:49013/solr/collection1/&version=2&wt=javabin} status=0 QTime=0 
[junit4:junit4]   2> 11711 T1234 C53 P49013 REQ /update {update.distrib=TOLEADER&distrib.from=http://127.0.0.1:36531/solr/collection1/&version=2&wt=javabin} status=0 QTime=3 
[junit4:junit4]   2> 11711 T1242 C55 P36531 /update {version=2&wt=javabin} {add=[124]} 0 4
[junit4:junit4]   2> 11714 T1215 C54 P44082 /update {version=2&wt=javabin} {add=[125 (1413509997710540800)]} 0 1
[junit4:junit4]   2> 11718 T1253 C52 P44410 REQ /update {update.distrib=FROMLEADER&distrib.from=http://127.0.0.1:49013/solr/collection1/&version=2&wt=javabin} status=0 QTime=0 
[junit4:junit4]   2> 11719 T1233 C53 P49013 /update {version=2&wt=javabin} {add=[125 (1413509997713686528)]} 0 3
[junit4:junit4]   2> 11721 T1215 C54 P44082 /update {version=2&wt=javabin} {add=[126 (1413509997718929408)]} 0 0
[junit4:junit4]   2> 11724 T1242 C55 P36531 /update {version=2&wt=javabin} {add=[126 (1413509997721026560)]} 0 1
[junit4:junit4]   2> 11726 T1215 C54 P44082 /update {version=2&wt=javabin} {add=[127 (1413509997724172288)]} 0 0
[junit4:junit4]   2> 11737 T1241 C55 P36531 REQ /update {update.distrib=TOLEADER&distrib.from=http://127.0.0.1:49013/solr/collection1/&version=2&wt=javabin} status=0 QTime=7 
[junit4:junit4]   2> 11737 T1233 C53 P49013 /update {version=2&wt=javabin} {add=[127]} 0 9
[junit4:junit4]   2> 11740 T1215 C54 P44082 /update {version=2&wt=javabin} {add=[128 (1413509997737803776)]} 0 1
[junit4:junit4]   2> 11745 T1241 C55 P36531 REQ /update {update.distrib=TOLEADER&distrib.from=http://127.0.0.1:49013/solr/collection1/&version=2&wt=javabin} status=0 QTime=2 
[junit4:junit4]   2> 11745 T1233 C53 P49013 /update {version=2&wt=javabin} {add=[128]} 0 3
[junit4:junit4]   2> 11748 T1215 C54 P44082 /update {version=2&wt=javabin} {add=[129 (1413509997746192384)]} 0 1
[junit4:junit4]   2> 11752 T1253 C52 P44410 REQ /update {update.distrib=FROMLEADER&distrib.from=http://127.0.0.1:49013/solr/collection1/&version=2&wt=javabin} status=0 QTime=1 
[junit4:junit4]   2> 11753 T1233 C53 P49013 /update {version=2&wt=javabin} {add=[129 (1413509997749338112)]} 0 3
[junit4:junit4]   2> 11755 T1215 C54 P44082 /update {version=2&wt=javabin} {add=[130 (1413509997754580992)]} 0 0
[junit4:junit4]   2> 11758 T1242 C55 P36531 /update {version=2&wt=javabin} {add=[130 (1413509997756678144)]} 0 1
[junit4:junit4]   2> 11760 T1215 C54 P44082 /update {version=2&wt=javabin} {add=[131 (1413509997759823872)]} 0 0
[junit4:junit4]   2> 11763 T1242 C55 P36531 /update {version=2&wt=javabin} {add=[131 (1413509997761921024)]} 0 1
[junit4:junit4]   2> 11775 T1215 C54 P44082 /update {version=2&wt=javabin} {add=[132 (1413509997765066752)]} 0 10
[junit4:junit4]   2> 11779 T1253 C52 P44410 REQ /update {update.distrib=FROMLEADER&distrib.from=http://127.0.0.1:49013/solr/collection1/&version=2&wt=javabin} status=0 QTime=1 
[junit4:junit4]   2> 11780 T1233 C53 P49013 /update {version=2&wt=javabin} {add=[132 (1413509997777649664)]} 0 4
[junit4:junit4]   2> 11782 T1215 C54 P44082 /update {version=2&wt=javabin} {add=[133 (1413509997781843968)]} 0 1
[junit4:junit4]   2> 11787 T1253 C52 P44410 REQ /update {update.distrib=FROMLEADER&distrib.from=http://127.0.0.1:49013/solr/collection1/&version=2&wt=javabin} status=0 QTime=1 
[junit4:junit4]   2> 11788 T1233 C53 P49013 /update {version=2&wt=javabin} {add=[133 (1413509997784989696)]} 0 4
[junit4:junit4]   2> 11790 T1215 C54 P44082 /update {version=2&wt=javabin} {add=[134 (1413509997791281152)]} 0 1
[junit4:junit4]   2> 11794 T1241 C55 P36531 REQ /update {update.distrib=TOLEADER&distrib.from=http://127.0.0.1:49013/solr/collection1/&version=2&wt=javabin} status=0 QTime=1 
[junit4:junit4]   2> 11795 T1233 C53 P49013 /update {version=2&wt=javabin} {add=[134]} 0 3
[junit4:junit4]   2> 11797 T1215 C54 P44082 /update {version=2&wt=javabin} {add=[135 (1413509997798621184)]} 0 0
[junit4:junit4]   2> 11802 T1253 C52 P44410 REQ /update {update.distrib=FROMLEADER&distrib.from=http://127.0.0.1:49013/solr/collection1/&version=2&wt=javabin} status=0 QTime=1 
[junit4:junit4]   2> 11802 T1233 C53 P49013 /update {version=2&wt=javabin} {add=[135 (1413509997800718336)]} 0 3
[junit4:junit4]   2> 11805 T1215 C54 P44082 /update {version=2&wt=javabin} {add=[136 (1413509997805961216)]} 0 1
[junit4:junit4]   2> 11809 T1241 C55 P36531 REQ /update {update.distrib=TOLEADER&distrib.from=http://127.0.0.1:49013/solr/collection1/&version=2&wt=javabin} status=0 QTime=1 
[junit4:junit4]   2> 11809 T1233 C53 P49013 /update {version=2&wt=javabin} {add=[136]} 0 2
[junit4:junit4]   2> 11812 T1215 C54 P44082 /update {version=2&wt=javabin} {add=[137 (1413509997813301248)]} 0 1
[junit4:junit4]   2> 11815 T1242 C55 P36531 /update {version=2&wt=javabin} {add=[137 (1413509997816446976)]} 0 1
[junit4:junit4]   2> 11817 T1215 C54 P44082 /update {version=2&wt=javabin} {add=[138 (1413509997819592704)]} 0 0
[junit4:junit4]   2> 11836 T1253 C52 P44410 REQ /update {update.distrib=FROMLEADER&distrib.from=http://127.0.0.1:49013/solr/collection1/&version=2&wt=javabin} status=0 QTime=7 
[junit4:junit4]   2> 11837 T1234 C53 P49013 REQ /update {update.distrib=TOLEADER&distrib.from=http://127.0.0.1:36531/solr/collection1/&version=2&wt=javabin} status=0 QTime=17 
[junit4:junit4]   2> 11837 T1242 C55 P36531 /update {version=2&wt=javabin} {add=[138]} 0 18
[junit4:junit4]   2> 11840 T1215 C54 P44082 /update {version=2&wt=javabin} {add=[139 (1413509997842661376)]} 0 1
[junit4:junit4]   2> 11844 T1241 C55 P36531 REQ /update {update.distrib=TOLEADER&distrib.from=http://127.0.0.1:49013/solr/collection1/&version=2&wt=javabin} status=0 QTime=1 
[junit4:junit4]   2> 11844 T1233 C53 P49013 /update {version=2&wt=javabin} {add=[139]} 0 2
[junit4:junit4]   2> 11847 T1215 C54 P44082 /update {version=2&wt=javabin} {add=[140 (1413509997850001408)]} 0 1
[junit4:junit4]   2> 11849 T1242 C55 P36531 /update {version=2&wt=javabin} {add=[140 (1413509997853147136)]} 0 1
[junit4:junit4]   2> 11851 T1215 C54 P44082 /update {version=2&wt=javabin} {add=[141 (1413509997855244288)]} 0 0
[junit4:junit4]   2> 11854 T1242 C55 P36531 /update {version=2&wt=javabin} {add=[141 (1413509997857341440)]} 0 1
[junit4:junit4]   2> 11863 T1215 C54 P44082 /update {version=2&wt=javabin} {add=[142 (1413509997860487168)]} 0 7
[junit4:junit4]   2> 11875 T1241 C55 P36531 REQ /update {update.distrib=TOLEADER&distrib.from=http://127.0.0.1:49013/solr/collection1/&version=2&wt=javabin} status=0 QTime=8 
[junit4:junit4]   2> 11876 T1233 C53 P49013 /update {version=2&wt=javabin} {add=[142]} 0 11
[junit4:junit4]   2> 11879 T1215 C54 P44082 /update {version=2&wt=javabin} {add=[143 (1413509997883555840)]} 0 1
[junit4:junit4]   2> 11883 T1241 C55 P36531 REQ /update {update.distrib=TOLEADER&distrib.from=http://127.0.0.1:49013/solr/collection1/&version=2&wt=javabin} status=0 QTime=1 
[junit4:junit4]   2> 11884 T1233 C53 P49013 /update {version=2&wt=javabin} {add=[143]} 0 3
[junit4:junit4]   2> 11886 T1215 C54 P44082 /update {version=2&wt=javabin} {add=[144 (1413509997891944448)]} 0 0
[junit4:junit4]   2> 11890 T1241 C55 P36531 REQ /update {update.distrib=TOLEADER&distrib.from=http://127.0.0.1:49013/solr/collection1/&version=2&wt=javabin} status=0 QTime=1 
[junit4:junit4]   2> 11891 T1233 C53 P49013 /update {version=2&wt=javabin} {add=[144]} 0 2
[junit4:junit4]   2> 11893 T1215 C54 P44082 /update {version=2&wt=javabin} {add=[145 (1413509997898235904)]} 0 1
[junit4:junit4]   2> 11897 T1241 C55 P36531 REQ /update {update.distrib=TOLEADER&distrib.from=http://127.0.0.1:49013/solr/collection1/&version=2&wt=javabin} status=0 QTime=1 
[junit4:junit4]   2> 11897 T1233 C53 P49013 /update {version=2&wt=javabin} {add=[145]} 0 2
[junit4:junit4]   2> 11900 T1215 C54 P44082 /update {version=2&wt=javabin} {add=[146 (1413509997905575936)]} 0 1
[junit4:junit4]   2> 11906 T1253 C52 P44410 REQ /update {update.distrib=FROMLEADER&distrib.from=http://127.0.0.1:49013/solr/collection1/&version=2&wt=javabin} status=0 QTime=1 
[junit4:junit4]   2> 11907 T1234 C53 P49013 REQ /update {update.distrib=TOLEADER&distrib.from=http://127.0.0.1:36531/solr/collection1/&version=2&wt=javabin} status=0 QTime=4 
[junit4:junit4]   2> 11907 T1242 C55 P36531 /update {version=2&wt=javabin} {add=[146]} 0 6
[junit4:junit4]   2> 11910 T1215 C54 P44082 /update {version=2&wt=javabin} {add=[147 (1413509997917110272)]} 0 0
[junit4:junit4]   2> 11913 T1242 C55 P36531 /update {version=2&wt=javabin} {add=[147 (1413509997920256000)]} 0 1
[junit4:junit4]   2> 11916 T1215 C54 P44082 /update {version=2&wt=javabin} {add=[148 (1413509997923401728)]} 0 0
[junit4:junit4]   2> 11923 T1253 C52 P44410 REQ /update {update.distrib=FROMLEADER&distrib.from=http://127.0.0.1:49013/solr/collection1/&version=2&wt=javabin} status=0 QTime=1 
[junit4:junit4]   2> 11924 T1234 C53 P49013 REQ /update {update.distrib=TOLEADER&distrib.from=http://127.0.0.1:36531/solr/collection1/&version=2&wt=javabin} status=0 QTime=4 
[junit4:junit4]   2> 11925 T1242 C55 P36531 /update {version=2&wt=javabin} {add=[148]} 0 7
[junit4:junit4]   2> 11928 T1215 C54 P44082 /update {version=2&wt=javabin} {add=[149 (1413509997934936064)]} 0 1
[junit4:junit4]   2> 11932 T1242 C55 P36531 /update {version=2&wt=javabin} {add=[149 (1413509997939130368)]} 0 1
[junit4:junit4]   2> 11933 T1215 C54 P44082 oasu.DirectUpdateHandler2.commit start commit{flags=0,_version_=0,optimize=false,openSearcher=true,waitSearcher=true,expungeDeletes=false,softCommit=false}
[junit4:junit4]   2> 12092 T1215 C54 P44082 oasc.SolrDeletionPolicy.onCommit SolrDeletionPolicy.onCommit: commits:num=2
[junit4:junit4]   2> 		commit{dir=NRTCachingDirectory(org.apache.lucene.store.MMapDirectory@/mnt/ssd/jenkins/workspace/Lucene-Solr-4.x-Linux/solr/build/solr-core/test/J1/org.apache.solr.cloud.BasicDistributedZkTest-1348028169091/control/data/index lockFactory=org.apache.lucene.store.NativeFSLockFactory@7dc2280c; maxCacheMB=48.0 maxMergeSizeMB=4.0),segFN=segments_1,generation=1,filenames=[segments_1]
[junit4:junit4]   2> 		commit{dir=NRTCachingDirectory(org.apache.lucene.store.MMapDirectory@/mnt/ssd/jenkins/workspace/Lucene-Solr-4.x-Linux/solr/build/solr-core/test/J1/org.apache.solr.cloud.BasicDistributedZkTest-1348028169091/control/data/index lockFactory=org.apache.lucene.store.NativeFSLockFactory@7dc2280c; maxCacheMB=48.0 maxMergeSizeMB=4.0),segFN=segments_2,generation=2,filenames=[_0_NestedPulsing_0.tim, _5_Direct_0.tim, _2_NestedPulsing_0.tim, _0_NestedPulsing_0.tip, _5_Direct_0.tip, _4_NestedPulsing_0.tim, _0_Direct_0.prx, _2_NestedPulsing_0.tip, _6_NestedPulsing_0.tim, _1.si, _4_NestedPulsing_0.tip, _6_NestedPulsing_0.tip, _1_NestedPulsing_0.frq, _3_NestedPulsing_0.frq, _5_NestedPulsing_0.frq, _1_Direct_0.frq, _0_MockFixedIntBlock_0.pyl, _1_MockFixedIntBlock_0.pyl, _2_MockFixedIntBlock_0.pyl, _3_MockFixedIntBlock_0.pyl, _4_MockFixedIntBlock_0.pyl, _5_MockFixedIntBlock_0.pyl, _6_MockFixedIntBlock_0.pyl, _0_NestedPulsing_0.prx, _0_MockFixedIntBlock_0.tib, _5_Direct_0.prx, _1_MockFixedIntBlock_0.tib, _2_MockFixedIntBlock_0.tib, _2_NestedPulsing_0.prx, _3_MockFixedIntBlock_0.tib, _4_NestedPulsing_0.prx, _4_MockFixedIntBlock_0.tib, _5_MockFixedIntBlock_0.tib, _4.si, _6_NestedPulsing_0.prx, _6_MockFixedIntBlock_0.tib, _2_Direct_0.tim, _0_MockFixedIntBlock_0.tii, _1_MockFixedIntBlock_0.tii, _2_Direct_0.tip, _2_MockFixedIntBlock_0.tii, _3_MockFixedIntBlock_0.tii, _4_MockFixedIntBlock_0.tii, _5_MockFixedIntBlock_0.tii, _6_MockFixedIntBlock_0.tii, _6_Direct_0.frq, _1.fdt, _3.fdt, _5.fdt, _1.fdx, _3.fdx, _5.fdx, _0_Pulsing40_0.frq, _1_Pulsing40_0.frq, _2_Direct_0.prx, _2_Pulsing40_0.frq, _3_Pulsing40_0.frq, _4_Pulsing40_0.frq, _5_Pulsing40_0.frq, _6_Pulsing40_0.frq, segments_2, _3_Direct_0.frq, _1.fnm, _3.fnm, _5.fnm, _4_Direct_0.tim, _4_Direct_0.tip, _2.si, _0_Direct_0.frq, _4_Direct_0.prx, _1_NestedPulsing_0.tim, _5.si, _0_nrm.cfe, _3_NestedPulsing_0.tim, _1_NestedPulsing_0.tip, _1_nrm.cfe, _5_NestedPulsing_0.tim, _1_Direct_0.tim, _2_nrm.cfe, _3_nrm.cfe, _3_NestedPulsing_0.tip, _4_nrm.cfe, _5_NestedPulsing_0.tip, _5_nrm.cfe, _1_Direct_0.tip, _6_nrm.cfe, _0_NestedPulsing_0.frq, _5_Direct_0.frq, _2_NestedPulsing_0.frq, _4_NestedPulsing_0.frq, _0_nrm.cfs, _1_nrm.cfs, _6_NestedPulsing_0.frq, _2_nrm.cfs, _3_nrm.cfs, _4_nrm.cfs, _5_nrm.cfs, _6_nrm.cfs, _1_NestedPulsing_0.prx, _6_Direct_0.tim, _3_NestedPulsing_0.prx, _6_Direct_0.tip, _5_NestedPulsing_0.prx, _1_Direct_0.prx, _0.si, _0_MockFixedIntBlock_0.skp, _1_MockFixedIntBlock_0.skp, _2_MockFixedIntBlock_0.skp, _3_MockFixedIntBlock_0.skp, _4_MockFixedIntBlock_0.skp, _0.fdt, _5_MockFixedIntBlock_0.skp, _6_MockFixedIntBlock_0.skp, _2.fdt, _4.fdt, _0.fdx, _2_Direct_0.frq, _6.fdt, _0_Pulsing40_0.tim, _2.fdx, _1_Pulsing40_0.tim, _4.fdx, _2_Pulsing40_0.tim, _0_MockFixedIntBlock_0.frq, _0_Pulsing40_0.tip, _3_Pulsing40_0.tim, _6.fdx, _4_Pulsing40_0.tim, _1_MockFixedIntBlock_0.frq, _1_Pulsing40_0.tip, _5_Pulsing40_0.tim, _2_Pulsing40_0.tip, _2_MockFixedIntBlock_0.frq, _6_Pulsing40_0.tim, _3_Pulsing40_0.tip, _3_MockFixedIntBlock_0.frq, _4_MockFixedIntBlock_0.frq, _4_Pulsing40_0.tip, _5_MockFixedIntBlock_0.frq, _5_Pulsing40_0.tip, _6_MockFixedIntBlock_0.frq, _6_Pulsing40_0.tip, _6_Direct_0.prx, _3_Direct_0.tim, _3.si, _3_Direct_0.tip, _0_MockFixedIntBlock_0.doc, _1_MockFixedIntBlock_0.doc, _2_MockFixedIntBlock_0.doc, _3_MockFixedIntBlock_0.doc, _4_MockFixedIntBlock_0.doc, _5_MockFixedIntBlock_0.doc, _6_MockFixedIntBlock_0.doc, _0_Pulsing40_0.prx, _1_Pulsing40_0.prx, _2_Pulsing40_0.prx, _3_Pulsing40_0.prx, _4_Pulsing40_0.prx, _5_Pulsing40_0.prx, _6_Pulsing40_0.prx, _0.fnm, _2.fnm, _4.fnm, _6.si, _3_Direct_0.prx, _6.fnm, _0_MockFixedIntBlock_0.pos, _1_MockFixedIntBlock_0.pos, _0_Direct_0.tim, _2_MockFixedIntBlock_0.pos, _3_MockFixedIntBlock_0.pos, _4_MockFixedIntBlock_0.pos, _0_Direct_0.tip, _5_MockFixedIntBlock_0.pos, _6_MockFixedIntBlock_0.pos, _4_Direct_0.frq]
[junit4:junit4]   2> 12093 T1215 C54 P44082 oasc.SolrDeletionPolicy.updateCommits newest commit = 2
[junit4:junit4]   2> 12097 T1215 C54 P44082 oass.SolrIndexSearcher.<init> Opening Searcher@1e65f581 main
[junit4:junit4]   2> 12098 T1215 C54 P44082 oasu.DirectUpdateHandler2.commit end_commit_flush
[junit4:junit4]   2> 12118 T1226 oasc.SolrCore.registerSearcher [collection1] Registered new searcher Searcher@1e65f581 main{StandardDirectoryReader(segments_2:15:nrt _0(4.0.0.2):C10 _1(4.0.0.2):C10 _2(4.0.0.2):C10 _3(4.0.0.2):C10 _4(4.0.0.2):C10 _5(4.0.0.2):C10 _6(4.0.0.2):C7)}
[junit4:junit4]   2> 12119 T1215 C54 P44082 /update {version=2&softCommit=false&waitSearcher=true&wt=javabin&commit=true} {commit=} 0 186
[junit4:junit4]   2> 12122 T1233 C53 P49013 oasu.DirectUpdateHandler2.commit start commit{flags=0,_version_=0,optimize=false,openSearcher=true,waitSearcher=true,expungeDeletes=false,softCommit=false}
[junit4:junit4]   2> 12272 T1233 C53 P49013 oasc.SolrDeletionPolicy.onCommit SolrDeletionPolicy.onCommit: commits:num=2
[junit4:junit4]   2> 		commit{dir=NRTCachingDirectory(org.apache.lucene.store.MMapDirectory@/mnt/ssd/jenkins/workspace/Lucene-Solr-4.x-Linux/solr/build/solr-core/test/J1/org.apache.solr.cloud.BasicDistributedZkTest-1348028169091/jetty1/index lockFactory=org.apache.lucene.store.NativeFSLockFactory@7dfabfde; maxCacheMB=48.0 maxMergeSizeMB=4.0),segFN=segments_1,generation=1,filenames=[segments_1]
[junit4:junit4]   2> 		commit{dir=NRTCachingDirectory(org.apache.lucene.store.MMapDirectory@/mnt/ssd/jenkins/workspace/Lucene-Solr-4.x-Linux/solr/build/solr-core/test/J1/org.apache.solr.cloud.BasicDistributedZkTest-1348028169091/jetty1/index lockFactory=org.apache.lucene.store.NativeFSLockFactory@7dfabfde; maxCacheMB=48.0 maxMergeSizeMB=4.0),segFN=segments_2,generation=2,filenames=[_0_NestedPulsing_0.tim, _2_NestedPulsing_0.tim, _0_NestedPulsing_0.tip, _0_Direct_0.prx, _2_NestedPulsing_0.tip, _1.si, _1_NestedPulsing_0.frq, _3_NestedPulsing_0.frq, _1_Direct_0.frq, _0_MockFixedIntBlock_0.pyl, _1_MockFixedIntBlock_0.pyl, _2_MockFixedIntBlock_0.pyl, _3_MockFixedIntBlock_0.pyl, _0_NestedPulsing_0.prx, _0_MockFixedIntBlock_0.tib, _1_MockFixedIntBlock_0.tib, _2_MockFixedIntBlock_0.tib, _2_NestedPulsing_0.prx, _3_MockFixedIntBlock_0.tib, _2_Direct_0.tim, _0_MockFixedIntBlock_0.tii, _1_MockFixedIntBlock_0.tii, _2_Direct_0.tip, _2_MockFixedIntBlock_0.tii, _3_MockFixedIntBlock_0.tii, _1.fdt, _3.fdt, _1.fdx, _3.fdx, _0_Pulsing40_0.frq, _1_Pulsing40_0.frq, _2_Direct_0.prx, _2_Pulsing40_0.frq, _3_Pulsing40_0.frq, segments_2, _3_Direct_0.frq, _1.fnm, _3.fnm, _2.si, _0_Direct_0.frq, _1_NestedPulsing_0.tim, _0_nrm.cfe, _3_NestedPulsing_0.tim, _1_NestedPulsing_0.tip, _1_nrm.cfe, _1_Direct_0.tim, _2_nrm.cfe, _3_nrm.cfe, _3_NestedPulsing_0.tip, _1_Direct_0.tip, _0_NestedPulsing_0.frq, _2_NestedPulsing_0.frq, _0_nrm.cfs, _1_nrm.cfs, _2_nrm.cfs, _3_nrm.cfs, _1_NestedPulsing_0.prx, _3_NestedPulsing_0.prx, _1_Direct_0.prx, _0.si, _0_MockFixedIntBlock_0.skp, _1_MockFixedIntBlock_0.skp, _2_MockFixedIntBlock_0.skp, _3_MockFixedIntBlock_0.skp, _0.fdt, _2.fdt, _0.fdx, _2_Direct_0.frq, _0_Pulsing40_0.tim, _2.fdx, _1_Pulsing40_0.tim, _2_Pulsing40_0.tim, _0_MockFixedIntBlock_0.frq, _0_Pulsing40_0.tip, _3_Pulsing40_0.tim, _1_MockFixedIntBlock_0.frq, _1_Pulsing40_0.tip, _2_Pulsing40_0.tip, _2_MockFixedIntBlock_0.frq, _3_Pulsing40_0.tip, _3_MockFixedIntBlock_0.frq, _3_Direct_0.tim, _3.si, _3_Direct_0.tip, _0_MockFixedIntBlock_0.doc, _1_MockFixedIntBlock_0.doc, _2_MockFixedIntBlock_0.doc, _3_MockFixedIntBlock_0.doc, _0_Pulsing40_0.prx, _1_Pulsing40_0.prx, _2_Pulsing40_0.prx, _3_Pulsing40_0.prx, _0.fnm, _2.fnm, _3_Direct_0.prx, _0_MockFixedIntBlock_0.pos, _1_MockFixedIntBlock_0.pos, _0_Direct_0.tim, _2_MockFixedIntBlock_0.pos, _3_MockFixedIntBlock_0.pos, _0_Direct_0.tip]
[junit4:junit4]   2> 12273 T1233 C53 P49013 oasc.SolrDeletionPolicy.updateCommits newest commit = 2
[junit4:junit4]   2> 12278 T1233 C53 P49013 oass.SolrIndexSearcher.<init> Opening Searcher@68fbed6e main
[junit4:junit4]   2> 12288 T1233 C53 P49013 oasu.DirectUpdateHandler2.commit end_commit_flush
[junit4:junit4]   2> 12288 T1238 oasc.SolrCore.registerSearcher [collection1] Registered new searcher Searcher@68fbed6e main{StandardDirectoryReader(segments_2:9:nrt _0(4.0.0.2):C10 _1(4.0.0.2):C10 _2(4.0.0.2):C10 _3(4.0.0.2):C2)}
[junit4:junit4]   2> 12291 T1233 C53 P49013 oasu.SolrCmdDistributor.distribCommit Distrib commit to:[StdNode: http://127.0.0.1:44410/solr/collection1/, StdNode: http://127.0.0.1:36531/solr/collection1/]
[junit4:junit4]   2> 12294 T1253 C52 P44410 oasu.DirectUpdateHandler2.commit start commit{flags=0,_version_=0,optimize=false,openSearcher=true,waitSearcher=true,expungeDeletes=false,softCommit=false}
[junit4:junit4]   2> 12295 T1241 C55 P36531 oasu.DirectUpdateHandler2.commit start commit{flags=0,_version_=0,optimize=false,openSearcher=true,waitSearcher=true,expungeDeletes=false,softCommit=false}
[junit4:junit4]   2> 12454 T1253 C52 P44410 oasc.SolrDeletionPolicy.onCommit SolrDeletionPolicy.onCommit: commits:num=2
[junit4:junit4]   2> 		commit{dir=NRTCachingDirectory(org.apache.lucene.store.MMapDirectory@/mnt/ssd/jenkins/workspace/Lucene-Solr-4.x-Linux/solr/build/solr-core/test/J1/org.apache.solr.cloud.BasicDistributedZkTest-1348028169091/jetty3/index lockFactory=org.apache.lucene.store.NativeFSLockFactory@c5bc5c6b; maxCacheMB=48.0 maxMergeSizeMB=4.0),segFN=segments_2,generation=2,filenames=[segments_2]
[junit4:junit4]   2> 		commit{dir=NRTCachingDirectory(org.apache.lucene.store.MMapDirectory@/mnt/ssd/jenkins/workspace/Lucene-Solr-4.x-Linux/solr/build/solr-core/test/J1/org.apache.solr.cloud.BasicDistributedZkTest-1348028169091/jetty3/index lockFactory=org.apache.lucene.store.NativeFSLockFactory@c5bc5c6b; maxCacheMB=48.0 maxMergeSizeMB=4.0),segFN=segments_3,generation=3,filenames=[_0_NestedPulsing_0.tim, _2_NestedPulsing_0.tim, _0_NestedPulsing_0.tip, _0_Direct_0.prx, _2_NestedPulsing_0.tip, _1.si, _1_NestedPulsing_0.frq, _3_NestedPulsing_0.frq, _1_Direct_0.frq, _0_MockFixedIntBlock_0.pyl, _1_MockFixedIntBlock_0.pyl, _2_MockFixedIntBlock_0.pyl, _3_MockFixedIntBlock_0.pyl, _0_NestedPulsing_0.prx, _0_MockFixedIntBlock_0.tib, _1_MockFixedIntBlock_0.tib, _2_MockFixedIntBlock_0.tib, _2_NestedPulsing_0.prx, _3_MockFixedIntBlock_0.tib, _2_Direct_0.tim, _0_MockFixedIntBlock_0.tii, _1_MockFixedIntBlock_0.tii, _2_Direct_0.tip, _2_MockFixedIntBlock_0.tii, _3_MockFixedIntBlock_0.tii, _1.fdt, _3.fdt, _1.fdx, _3.fdx, _0_Pulsing40_0.frq, _1_Pulsing40_0.frq, _2_Direct_0.prx, _2_Pulsing40_0.frq, _3_Pulsing40_0.frq, segments_3, _3_Direct_0.frq, _1.fnm, _3.fnm, _2.si, _0_Direct_0.frq, _1_NestedPulsing_0.tim, _0_nrm.cfe, _3_NestedPulsing_0.tim, _1_NestedPulsing_0.tip, _1_nrm.cfe, _1_Direct_0.tim, _2_nrm.cfe, _3_nrm.cfe, _3_NestedPulsing_0.tip, _1_Direct_0.tip, _0_NestedPulsing_0.frq, _2_NestedPulsing_0.frq, _0_nrm.cfs, _1_nrm.cfs, _2_nrm.cfs, _3_nrm.cfs, _1_NestedPulsing_0.prx, _3_NestedPulsing_0.prx, _1_Direct_0.prx, _0.si, _0_MockFixedIntBlock_0.skp, _1_MockFixedIntBlock_0.skp, _2_MockFixedIntBlock_0.skp, _3_MockFixedIntBlock_0.skp, _0.fdt, _2.fdt, _0.fdx, _2_Direct_0.frq, _0_Pulsing40_0.tim, _2.fdx, _1_Pulsing40_0.tim, _2_Pulsing40_0.tim, _0_MockFixedIntBlock_0.frq, _0_Pulsing40_0.tip, _3_Pulsing40_0.tim, _1_MockFixedIntBlock_0.frq, _1_Pulsing40_0.tip, _2_Pulsing40_0.tip, _2_MockFixedIntBlock_0.frq, _3_Pulsing40_0.tip, _3_MockFixedIntBlock_0.frq, _3_Direct_0.tim, _3.si, _3_Direct_0.tip, _0_MockFixedIntBlock_0.doc, _1_MockFixedIntBlock_0.doc, _2_MockFixedIntBlock_0.doc, _3_MockFixedIntBlock_0.doc, _0_Pulsing40_0.prx, _1_Pulsing40_0.prx, _2_Pulsing40_0.prx, _3_Pulsing40_0.prx, _0.fnm, _2.fnm, _3_Direct_0.prx, _0_MockFixedIntBlock_0.pos, _1_MockFixedIntBlock_0.pos, _0_Direct_0.tim, _2_MockFixedIntBlock_0.pos, _3_MockFixedIntBlock_0.pos, _0_Direct_0.tip]
[junit4:junit4]   2> 12455 T1253 C52 P44410 oasc.SolrDeletionPolicy.updateCommits newest commit = 3
[junit4:junit4]   2> 12460 T1253 C52 P44410 oass.SolrIndexSearcher.<init> Opening Searcher@96466b9b main
[junit4:junit4]   2> 12465 T1262 oasc.SolrCore.registerSearcher [collection1] Registered new searcher Searcher@96466b9b main{StandardDirectoryReader(segments_3:10:nrt _0(4.0.0.2):C10 _1(4.0.0.2):C10 _2(4.0.0.2):C10 _3(4.0.0.2):C2)}
[junit4:junit4]   2> 12465 T1253 C52 P44410 oasu.DirectUpdateHandler2.commit end_commit_flush
[junit4:junit4]   2> 12466 T1253 C52 P44410 /update {softCommit=false&commit_end_point=true&expungeDeletes=false&commit=true&version=2&waitSearcher=true&wt=javabin} {commit=} 0 172
[junit4:junit4]   2> 12472 T1241 C55 P36531 oasc.SolrDeletionPolicy.onCommit SolrDeletionPolicy.onCommit: commits:num=2
[junit4:junit4]   2> 		commit{dir=NRTCachingDirectory(org.apache.lucene.store.MMapDirectory@/mnt/ssd/jenkins/workspace/Lucene-Solr-4.x-Linux/solr/build/solr-core/test/J1/org.apache.solr.cloud.BasicDistributedZkTest-1348028169091/jetty2/index lockFactory=org.apache.lucene.store.NativeFSLockFactory@1dee680; maxCacheMB=48.0 maxMergeSizeMB=4.0),segFN=segments_1,generation=1,filenames=[segments_1]
[junit4:junit4]   2> 		commit{dir=NRTCachingDirectory(org.apache.lucene.store.MMapDirectory@/mnt/ssd/jenkins/workspace/Lucene-Solr-4.x-Linux/solr/build/solr-core/test/J1/org.apache.solr.cloud.BasicDistributedZkTest-1348028169091/jetty2/index lockFactory=org.apache.lucene.store.NativeFSLockFactory@1dee680; maxCacheMB=48.0 maxMergeSizeMB=4.0),segFN=segments_2,generation=2,filenames=[_0_NestedPulsing_0.tim, _2_NestedPulsing_0.tim, _0_NestedPulsing_0.tip, _0_Direct_0.prx, _2_NestedPulsing_0.tip, _1.si, _1_NestedPulsing_0.frq, _3_NestedPulsing_0.frq, _1_Direct_0.frq, _0_MockFixedIntBlock_0.pyl, _1_MockFixedIntBlock_0.pyl, _2_MockFixedIntBlock_0.pyl, _3_MockFixedIntBlock_0.pyl, _0_NestedPulsing_0.prx, _0_MockFixedIntBlock_0.tib, _1_MockFixedIntBlock_0.tib, _2_MockFixedIntBlock_0.tib, _2_NestedPulsing_0.prx, _3_MockFixedIntBlock_0.tib, _2_Direct_0.tim, _0_MockFixedIntBlock_0.tii, _1_MockFixedIntBlock_0.tii, _2_Direct_0.tip, _2_MockFixedIntBlock_0.tii, _3_MockFixedIntBlock_0.tii, _1.fdt, _3.fdt, _1.fdx, _3.fdx, _0_Pulsing40_0.frq, _1_Pulsing40_0.frq, _2_Direct_0.prx, _2_Pulsing40_0.frq, _3_Pulsing40_0.frq, segments_2, _3_Direct_0.frq, _1.fnm, _3.fnm, _2.si, _0_Direct_0.frq, _1_NestedPulsing_0.tim, _0_nrm.cfe, _3_NestedPulsing_0.tim, _1_NestedPulsing_0.tip, _1_nrm.cfe, _1_Direct_0.tim, _2_nrm.cfe, _3_nrm.cfe, _3_NestedPulsing_0.tip, _1_Direct_0.tip, _0_NestedPulsing_0.frq, _2_NestedPulsing_0.frq, _0_nrm.cfs, _1_nrm.cfs, _2_nrm.cfs, _3_nrm.cfs, _1_NestedPulsing_0.prx, _3_NestedPulsing_0.prx, _1_Direct_0.prx, _0.si, _0_MockFixedIntBlock_0.skp, _1_MockFixedIntBlock_0.skp, _2_MockFixedIntBlock_0.skp, _3_MockFixedIntBlock_0.skp, _0.fdt, _2.fdt, _0.fdx, _2_Direct_0.frq, _0_Pulsing40_0.tim, _2.fdx, _1_Pulsing40_0.tim, _2_Pulsing40_0.tim, _0_MockFixedIntBlock_0.frq, _0_Pulsing40_0.tip, _3_Pulsing40_0.tim, _1_MockFixedIntBlock_0.frq, _1_Pulsing40_0.tip, _2_Pulsing40_0.tip, _2_MockFixedIntBlock_0.frq, _3_Pulsing40_0.tip, _3_MockFixedIntBlock_0.frq, _3_Direct_0.tim, _3.si, _3_Direct_0.tip, _0_MockFixedIntBlock_0.doc, _1_MockFixedIntBlock_0.doc, _2_MockFixedIntBlock_0.doc, _3_MockFixedIntBlock_0.doc, _0_Pulsing40_0.prx, _1_Pulsing40_0.prx, _2_Pulsing40_0.prx, _3_Pulsing40_0.prx, _0.fnm, _2.fnm, _3_Direct_0.prx, _0_MockFixedIntBlock_0.pos, _1_MockFixedIntBlock_0.pos, _0_Direct_0.tim, _2_MockFixedIntBlock_0.pos, _3_MockFixedIntBlock_0.pos, _0_Direct_0.tip]
[junit4:junit4]   2> 12473 T1241 C55 P36531 oasc.SolrDeletionPolicy.updateCommits newest commit = 2
[junit4:junit4]   2> 12478 T1241 C55 P36531 oass.SolrIndexSearcher.<init> Opening Searcher@7c225ca3 main
[junit4:junit4]   2> 12479 T1241 C55 P36531 oasu.DirectUpdateHandler2.commit end_commit_flush
[junit4:junit4]   2> 12481 T1250 oasc.SolrCore.registerSearcher [collection1] Registered new searcher Searcher@7c225ca3 main{StandardDirectoryReader(segments_2:9:nrt _0(4.0.0.2):C10 _1(4.0.0.2):C10 _2(4.0.0.2):C10 _3(4.0.0.2):C5)}
[junit4:junit4]   2> 12482 T1241 C55 P36531 /update {softCommit=false&commit_end_point=true&expungeDeletes=false&commit=true&version=2&waitSearcher=true&wt=javabin} {commit=} 0 187
[junit4:junit4]   2> 12483 T1233 C53 P49013 /update {version=2&softCommit=false&waitSearcher=true&wt=javabin&commit=true} {commit=} 0 362
[junit4:junit4]   2> 12486 T1215 C54 P44082 REQ /select {version=2&q=*:*&wt=javabin&distrib=false&sort=n_ti1+desc} hits=67 status=0 QTime=1 
[junit4:junit4]   2> 12487 T1215 C54 P44082 oasr.BinaryResponseWriter$Resolver.getDoc WARNING Error reading a field from document : SolrDocument{id=109} java.lang.NullPointerException
[junit4:junit4]   2> 	at org.apache.solr.util.NumberUtils.SortableStr2int(NumberUtils.java:162)
[junit4:junit4]   2> 	at org.apache.solr.schema.SortableIntField.toObject(SortableIntField.java:96)
[junit4:junit4]   2> 	at org.apache.solr.schema.SortableIntField.toObject(SortableIntField.java:55)
[junit4:junit4]   2> 	at org.apache.solr.response.BinaryResponseWriter$Resolver.getValue(BinaryResponseWriter.java:218)
[junit4:junit4]   2> 	at org.apache.solr.response.BinaryResponseWriter$Resolver.getDoc(BinaryResponseWriter.java:181)
[junit4:junit4]   2> 	at org.apache.solr.response.BinaryResponseWriter$Resolver.writeResultsBody(BinaryResponseWriter.java:142)
[junit4:junit4]   2> 	at org.apache.solr.response.BinaryResponseWriter$Resolver.writeResults(BinaryResponseWriter.java:168)
[junit4:junit4]   2> 	at org.apache.solr.response.BinaryResponseWriter$Resolver.resolve(BinaryResponseWriter.java:81)
[junit4:junit4]   2> 	at org.apache.solr.common.util.JavaBinCodec.writeVal(JavaBinCodec.java:154)
[junit4:junit4]   2> 	at org.apache.solr.common.util.JavaBinCodec.writeNamedList(JavaBinCodec.java:144)
[junit4:junit4]   2> 	at org.apache.solr.common.util.JavaBinCodec.writeKnownType(JavaBinCodec.java:234)
[junit4:junit4]   2> 	at org.apache.solr.common.util.JavaBinCodec.writeVal(JavaBinCodec.java:149)
[junit4:junit4]   2> 	at org.apache.solr.common.util.JavaBinCodec.marshal(JavaBinCodec.java:92)
[junit4:junit4]   2> 	at org.apache.solr.response.BinaryResponseWriter.write(BinaryResponseWriter.java:49)
[junit4:junit4]   2> 	at org.apache.solr.servlet.SolrDispatchFilter.writeResponse(SolrDispatchFilter.java:404)
[junit4:junit4]   2> 	at org.apache.solr.servlet.SolrDispatchFilter.doFilter(SolrDispatchFilter.java:289)
[junit4:junit4]   2> 	at org.eclipse.jetty.servlet.ServletHandler$CachedChain.doFilter(ServletHandler.java:1337)
[junit4:junit4]   2> 	at org.eclipse.jetty.servlet.ServletHandler.doHandle(ServletHandler.java:484)
[junit4:junit4]   2> 	at org.eclipse.jetty.server.session.SessionHandler.doHandle(SessionHandler.java:231)
[junit4:junit4]   2> 	at org.eclipse.jetty.server.handler.ScopedHandler.handle(ScopedHandler.java:119)
[junit4:junit4]   2> 	at org.eclipse.jetty.server.handler.GzipHandler.handle(GzipHandler.java:267)
[junit4:junit4]   2> 	at org.eclipse.jetty.server.handler.ContextHandler.doHandle(ContextHandler.java:1067)
[junit4:junit4]   2> 	at org.eclipse.jetty.servlet.ServletHandler.doScope(ServletHandler.java:413)
[junit4:junit4]   2> 	at org.eclipse.jetty.server.session.SessionHandler.doScope(SessionHandler.java:192)
[junit4:junit4]   2> 	at org.eclipse.jetty.server.handler.ContextHandler.doScope(ContextHandler.java:999)
[junit4:junit4]   2> 	at org.eclipse.jetty.server.handler.ScopedHandler.handle(ScopedHandler.java:117)
[junit4:junit4]   2> 	at org.eclipse.jetty.server.handler.HandlerWrapper.handle(HandlerWrapper.java:111)
[junit4:junit4]   2> 	at org.eclipse.jetty.server.Server.handle(Server.java:351)
[junit4:junit4]   2> 	at org.eclipse.jetty.server.AbstractHttpConnection.handleRequest(AbstractHttpConnection.java:454)
[junit4:junit4]   2> 	at org.eclipse.jetty.server.AbstractHttpConnection.headerComplete(AbstractHttpConnection.java:890)
[junit4:junit4]   2> 	at org.eclipse.jetty.server.AbstractHttpConnection$RequestHandler.headerComplete(AbstractHttpConnection.java:944)
[junit4:junit4]   2> 	at org.eclipse.jetty.http.HttpParser.parseNext(HttpParser.java:634)
[junit4:junit4]   2> 	at org.eclipse.jetty.http.HttpParser.parseAvailable(HttpParser.java:230)
[junit4:junit4]   2> 	at org.eclipse.jetty.server.BlockingHttpConnection.handle(BlockingHttpConnection.java:66)
[junit4:junit4]   2> 	at org.eclipse.jetty.server.bio.SocketConnector$ConnectorEndPoint.run(SocketConnector.java:254)
[junit4:junit4]   2> 	at org.eclipse.jetty.util.thread.QueuedThreadPool.runJob(QueuedThreadPool.java:599)
[junit4:junit4]   2> 	at org.eclipse.jetty.util.thread.QueuedThreadPool$3.run(QueuedThreadPool.java:534)
[junit4:junit4]   2> 	at java.lang.Thread.run(Thread.java:777)
[junit4:junit4]   2> 
[junit4:junit4]   2> 12488 T1215 C54 P44082 oasr.BinaryResponseWriter$Resolver.getDoc WARNING Error reading a field from document : SolrDocument{id=10} java.lang.NullPointerException
[junit4:junit4]   2> 	at org.apache.solr.util.NumberUtils.SortableStr2int(NumberUtils.java:162)
[junit4:junit4]   2> 	at org.apache.solr.schema.SortableIntField.toObject(SortableIntField.java:96)
[junit4:junit4]   2> 	at org.apache.solr.schema.SortableIntField.toObject(SortableIntField.java:55)
[junit4:junit4]   2> 	at org.apache.solr.response.BinaryResponseWriter$Resolver.getValue(BinaryResponseWriter.java:218)
[junit4:junit4]   2> 	at org.apache.solr.response.BinaryResponseWriter$Resolver.getDoc(BinaryResponseWriter.java:181)
[junit4:junit4]   2> 	at org.apache.solr.response.BinaryResponseWriter$Resolver.writeResultsBody(BinaryResponseWriter.java:142)
[junit4:junit4]   2> 	at org.apache.solr.response.BinaryResponseWriter$Resolver.writeResults(BinaryResponseWriter.java:168)
[junit4:junit4]   2> 	at org.apache.solr.response.BinaryResponseWriter$Resolver.resolve(BinaryResponseWriter.java:81)
[junit4:junit4]   2> 	at org.apache.solr.common.util.JavaBinCodec.writeVal(JavaBinCodec.java:154)
[junit4:junit4]   2> 	at org.apache.solr.common.util.JavaBinCodec.writeNamedList(JavaBinCodec.java:144)
[junit4:junit4]   2> 	at org.apache.solr.common.util.JavaBinCodec.writeKnownType(JavaBinCodec.java:234)
[junit4:junit4]   2> 	at org.apache.solr.common.util.JavaBinCodec.writeVal(JavaBinCodec.java:149)
[junit4:junit4]   2> 	at org.apache.solr.common.util.JavaBinCodec.marshal(JavaBinCodec.java:92)
[junit4:junit4]   2> 	at org.apache.solr.response.BinaryResponseWriter.write(BinaryResponseWriter.java:49)
[junit4:junit4]   2> 	at org.apache.solr.servlet.SolrDispatchFilter.writeResponse(SolrDispatchFilter.java:404)
[junit4:junit4]   2> 	at org.apache.solr.servlet.SolrDispatchFilter.doFilter(SolrDispatchFilter.java:289)
[junit4:junit4]   2> 	at org.eclipse.jetty.servlet.ServletHandler$CachedChain.doFilter(ServletHandler.java:1337)
[junit4:junit4]   2> 	at org.eclipse.jetty.servlet.ServletHandler.doHandle(ServletHandler.java:484)
[junit4:junit4]   2> 	at org.eclipse.jetty.server.session.SessionHandler.doHandle(SessionHandler.java:231)
[junit4:junit4]   2> 	at org.eclipse.jetty.server.handler.ScopedHandler.handle(ScopedHandler.java:119)
[junit4:junit4]   2> 	at org.eclipse.jetty.server.handler.GzipHandler.handle(GzipHandler.java:267)
[junit4:junit4]   2> 	at org.eclipse.jetty.server.handler.ContextHandler.doHandle(ContextHandler.java:1067)
[junit4:junit4]   2> 	at org.eclipse.jetty.servlet.ServletHandler.doScope(ServletHandler.java:413)
[junit4:junit4]   2> 	at org.eclipse.jetty.server.session.SessionHandler.doScope(SessionHandler.java:192)
[junit4:junit4]   2> 	at org.eclipse.jetty.server.handler.ContextHandler.doScope(ContextHandler.java:999)
[junit4:junit4]   2> 	at org.eclipse.jetty.server.handler.ScopedHandler.handle(ScopedHandler.java:117)
[junit4:junit4]   2> 	at org.eclipse.jetty.server.handler.HandlerWrapper.handle(HandlerWrapper.java:111)
[junit4:junit4]   2> 	at org.eclipse.jetty.server.Server.handle(Server.java:351)
[junit4:junit4]   2> 	at org.eclipse.jetty.server.AbstractHttpConnection.handleRequest(AbstractHttpConnection.java:454)
[junit4:junit4]   2> 	at org.eclipse.jetty.server.AbstractHttpConnection.headerComplete(AbstractHttpConnection.java:890)
[junit4:junit4]   2> 	at org.eclipse.jetty.server.AbstractHttpConnection$RequestHandler.headerComplete(AbstractHttpConnection.java:944)
[junit4:junit4]   2> 	at org.eclipse.jetty.http.HttpParser.parseNext(HttpParser.java:634)
[junit4:junit4]   2> 	at org.eclipse.jetty.http.HttpParser.parseAvailable(HttpParser.java:230)
[junit4:junit4]   2> 	at org.eclipse.jetty.server.BlockingHttpConnection.handle(BlockingHttpConnection.java:66)
[junit4:junit4]   2> 	at org.eclipse.jetty.server.bio.SocketConnector$ConnectorEndPoint.run(SocketConnector.java:254)
[junit4:junit4]   2> 	at org.eclipse.jetty.util.thread.QueuedThreadPool.runJob(QueuedThreadPool.java:599)
[junit4:junit4]   2> 	at org.eclipse.jetty.util.thread.QueuedThreadPool$3.run(QueuedThreadPool.java:534)
[junit4:junit4]   2> 	at java.lang.Thread.run(Thread.java:777)
[junit4:junit4]   2> 
[junit4:junit4]   2> 12489 T1215 C54 P44082 oasr.BinaryResponseWriter$Resolver.getDoc WARNING Error reading a field from document : SolrDocument{id=8} java.lang.NullPointerException
[junit4:junit4]   2> 	at org.apache.solr.util.NumberUtils.SortableStr2int(NumberUtils.java:162)
[junit4:junit4]   2> 	at org.apache.solr.schema.SortableIntField.toObject(SortableIntField.java:96)
[junit4:junit4]   2> 	at org.apache.solr.schema.SortableIntField.toObject(SortableIntField.java:55)
[junit4:junit4]   2> 	at org.apache.solr.response.BinaryResponseWriter$Resolver.getValue(BinaryResponseWriter.java:218)
[junit4:junit4]   2> 	at org.apache.solr.response.BinaryResponseWriter$Resolver.getDoc(BinaryResponseWriter.java:181)
[junit4:junit4]   2> 	at org.apache.solr.response.BinaryResponseWriter$Resolver.writeResultsBody(BinaryResponseWriter.java:142)
[junit4:junit4]   2> 	at org.apache.solr.response.BinaryResponseWriter$Resolver.writeResults(BinaryResponseWriter.java:168)
[junit4:junit4]   2> 	at org.apache.solr.response.BinaryResponseWriter$Resolver.resolve(BinaryResponseWriter.java:81)
[junit4:junit4]   2> 	at org.apache.solr.common.util.JavaBinCodec.writeVal(JavaBinCodec.java:154)
[junit4:junit4]   2> 	at org.apache.solr.common.util.JavaBinCodec.writeNamedList(JavaBinCodec.java:144)
[junit4:junit4]   2> 	at org.apache.solr.common.util.JavaBinCodec.writeKnownType(JavaBinCodec.java:234)
[junit4:junit4]   2> 	at org.apache.solr.common.util.JavaBinCodec.writeVal(JavaBinCodec.java:149)
[junit4:junit4]   2> 	at org.apache.solr.common.util.JavaBinCodec.marshal(JavaBinCodec.java:92)
[junit4:junit4]   2> 	at org.apache.solr.response.BinaryResponseWriter.write(BinaryResponseWriter.java:49)
[junit4:junit4]   2> 	at org.apache.solr.servlet.SolrDispatchFilter.writeResponse(SolrDispatchFilter.java:404)
[junit4:junit4]   2> 	at org.apache.solr.servlet.SolrDispatchFilter.doFilter(SolrDispatchFilter.java:289)
[junit4:junit4]   2> 	at org.eclipse.jetty.servlet.ServletHandler$CachedChain.doFilter(ServletHandler.java:1337)
[junit4:junit4]   2> 	at org.eclipse.jetty.servlet.ServletHandler.doHandle(ServletHandler.java:484)
[junit4:junit4]   2> 	at org.eclipse.jetty.server.session.SessionHandler.doHandle(SessionHandler.java:231)
[junit4:junit4]   2> 	at org.eclipse.jetty.server.handler.ScopedHandler.handle(ScopedHandler.java:119)
[junit4:junit4]   2> 	at org.eclipse.jetty.server.handler.GzipHandler.handle(GzipHandler.java:267)
[junit4:junit4]   2> 	at org.eclipse.jetty.server.handler.ContextHandler.doHandle(ContextHandler.java:1067)
[junit4:junit4]   2> 	at org.eclipse.jetty.servlet.ServletHandler.doScope(ServletHandler.java:413)
[junit4:junit4]   2> 	at org.eclipse.jetty.server.session.SessionHandler.doScope(SessionHandler.java:192)
[junit4:junit4]   2> 	at org.eclipse.jetty.server.handler.ContextHandler.doScope(ContextHandler.java:999)
[junit4:junit4]   2> 	at org.eclipse.jetty.server.handler.ScopedHandler.handle(ScopedHandler.java:117)
[junit4:junit4]   2> 	at org.eclipse.jetty.server.handler.HandlerWrapper.handle(HandlerWrapper.java:111)
[junit4:junit4]   2> 	at org.eclipse.jetty.server.Server.handle(Server.java:351)
[junit4:junit4]   2> 	at org.eclipse.jetty.server.AbstractHttpConnection.handleRequest(AbstractHttpConnection.java:454)
[junit4:junit4]   2> 	at org.eclipse.jetty.server.AbstractHttpConnection.headerComplete(AbstractHttpConnection.java:890)
[junit4:junit4]   2> 	at org.eclipse.jetty.server.AbstractHttpConnection$RequestHandler.headerComplete(AbstractHttpConnection.java:944)
[junit4:junit4]   2> 	at org.eclipse.jetty.http.HttpParser.parseNext(HttpParser.java:634)
[junit4:junit4]   2> 	at org.eclipse.jetty.http.HttpParser.parseAvailable(HttpParser.java:230)
[junit4:junit4]   2> 	at org.eclipse.jetty.server.BlockingHttpConnection.handle(BlockingHttpConnection.java:66)
[junit4:junit4]   2> 	at org.eclipse.jetty.server.bio.SocketConnector$ConnectorEndPoint.run(SocketConnector.java:254)
[junit4:junit4]   2> 	at org.eclipse.jetty.util.thread.QueuedThreadPool.runJob(QueuedThreadPool.java:599)
[junit4:junit4]   2> 	at org.eclipse.jetty.util.thread.QueuedThreadPool$3.run(QueuedThreadPool.java:534)
[junit4:junit4]   2> 	at java.lang.Thread.run(Thread.java:777)
[junit4:junit4]   2> 
[junit4:junit4]   2> 12492 T1215 C54 P44082 oasr.BinaryResponseWriter$Resolver.getDoc WARNING Error reading a field from document : SolrDocument{id

[...truncated too long message...]

losing IndexWriter
[junit4:junit4]   2> 1289 T1833 oasu.DefaultSolrCoreState.decref Closing SolrCoreState - canceling any ongoing recovery
[junit4:junit4]   2> 1324 T1833 oejsh.ContextHandler.doStop stopped o.e.j.s.ServletContextHandler{/solr,null}
[junit4:junit4]   2> 1377 T1833 oas.SolrTestCaseJ4.tearDown ###Ending testDistribSearch
[junit4:junit4]   2> NOTE: reproduce with: ant test  -Dtestcase=DistributedQueryElevationComponentTest -Dtests.method=testDistribSearch -Dtests.seed=1663CC94E0BF23A5 -Dtests.multiplier=3 -Dtests.slow=true -Dtests.locale=es_ES -Dtests.timezone=America/Miquelon -Dtests.file.encoding=UTF-8
[junit4:junit4] ERROR   1.38s J0 | DistributedQueryElevationComponentTest.testDistribSearch <<<
[junit4:junit4]    > Throwable #1: org.apache.solr.common.SolrException: Server at http://127.0.0.1:41792/solr returned non ok status:500, message:Server Error
[junit4:junit4]    > 	at __randomizedtesting.SeedInfo.seed([1663CC94E0BF23A5:9785428C97E04399]:0)
[junit4:junit4]    > 	at org.apache.solr.client.solrj.impl.HttpSolrServer.request(HttpSolrServer.java:373)
[junit4:junit4]    > 	at org.apache.solr.client.solrj.impl.HttpSolrServer.request(HttpSolrServer.java:182)
[junit4:junit4]    > 	at org.apache.solr.client.solrj.request.QueryRequest.process(QueryRequest.java:90)
[junit4:junit4]    > 	at org.apache.solr.client.solrj.SolrServer.query(SolrServer.java:324)
[junit4:junit4]    > 	at org.apache.solr.BaseDistributedSearchTestCase.queryServer(BaseDistributedSearchTestCase.java:371)
[junit4:junit4]    > 	at org.apache.solr.BaseDistributedSearchTestCase.query(BaseDistributedSearchTestCase.java:394)
[junit4:junit4]    > 	at org.apache.solr.BaseDistributedSearchTestCase.query(BaseDistributedSearchTestCase.java:376)
[junit4:junit4]    > 	at org.apache.solr.handler.component.DistributedQueryElevationComponentTest.doTest(DistributedQueryElevationComponentTest.java:83)
[junit4:junit4]    > 	at org.apache.solr.BaseDistributedSearchTestCase.testDistribSearch(BaseDistributedSearchTestCase.java:695)
[junit4:junit4]    > 	at sun.reflect.NativeMethodAccessorImpl.invoke0(Native Method)
[junit4:junit4]    > 	at sun.reflect.NativeMethodAccessorImpl.invoke(NativeMethodAccessorImpl.java:88)
[junit4:junit4]    > 	at sun.reflect.DelegatingMethodAccessorImpl.invoke(DelegatingMethodAccessorImpl.java:55)
[junit4:junit4]    > 	at java.lang.reflect.Method.invoke(Method.java:613)
[junit4:junit4]    > 	at com.carrotsearch.randomizedtesting.RandomizedRunner.invoke(RandomizedRunner.java:1559)
[junit4:junit4]    > 	at com.carrotsearch.randomizedtesting.RandomizedRunner.access$600(RandomizedRunner.java:79)
[junit4:junit4]    > 	at com.carrotsearch.randomizedtesting.RandomizedRunner$6.evaluate(RandomizedRunner.java:737)
[junit4:junit4]    > 	at com.carrotsearch.randomizedtesting.RandomizedRunner$7.evaluate(RandomizedRunner.java:773)
[junit4:junit4]    > 	at com.carrotsearch.randomizedtesting.RandomizedRunner$8.evaluate(RandomizedRunner.java:787)
[junit4:junit4]    > 	at com.carrotsearch.randomizedtesting.rules.SystemPropertiesRestoreRule$1.evaluate(SystemPropertiesRestoreRule.java:53)
[junit4:junit4]    > 	at org.apache.lucene.util.TestRuleSetupTeardownChained$1.evaluate(TestRuleSetupTeardownChained.java:50)
[junit4:junit4]    > 	at org.apache.lucene.util.TestRuleFieldCacheSanity$1.evaluate(TestRuleFieldCacheSanity.java:51)
[junit4:junit4]    > 	at org.apache.lucene.util.AbstractBeforeAfterRule$1.evaluate(AbstractBeforeAfterRule.java:45)
[junit4:junit4]    > 	at com.carrotsearch.randomizedtesting.rules.SystemPropertiesInvariantRule$1.evaluate(SystemPropertiesInvariantRule.java:55)
[junit4:junit4]    > 	at org.apache.lucene.util.TestRuleThreadAndTestName$1.evaluate(TestRuleThreadAndTestName.java:48)
[junit4:junit4]    > 	at org.apache.lucene.util.TestRuleIgnoreAfterMaxFailures$1.evaluate(TestRuleIgnoreAfterMaxFailures.java:70)
[junit4:junit4]    > 	at org.apache.lucene.util.TestRuleMarkFailure$1.evaluate(TestRuleMarkFailure.java:48)
[junit4:junit4]    > 	at com.carrotsearch.randomizedtesting.rules.StatementAdapter.evaluate(StatementAdapter.java:36)
[junit4:junit4]    > 	at com.carrotsearch.randomizedtesting.ThreadLeakControl$StatementRunner.run(ThreadLeakControl.java:358)
[junit4:junit4]    > 	at com.carrotsearch.randomizedtesting.ThreadLeakControl.forkTimeoutingTask(ThreadLeakControl.java:782)
[junit4:junit4]    > 	at com.carrotsearch.randomizedtesting.ThreadLeakControl$3.evaluate(ThreadLeakControl.java:442)
[junit4:junit4]    > 	at com.carrotsearch.randomizedtesting.RandomizedRunner.runSingleTest(RandomizedRunner.java:746)
[junit4:junit4]    > 	at com.carrotsearch.randomizedtesting.RandomizedRunner$3.evaluate(RandomizedRunner.java:648)
[junit4:junit4]    > 	at com.carrotsearch.randomizedtesting.RandomizedRunner$4.evaluate(RandomizedRunner.java:682)
[junit4:junit4]    > 	at com.carrotsearch.randomizedtesting.RandomizedRunner$5.evaluate(RandomizedRunner.java:693)
[junit4:junit4]    > 	at com.carrotsearch.randomizedtesting.rules.StatementAdapter.evaluate(StatementAdapter.java:36)
[junit4:junit4]    > 	at com.carrotsearch.randomizedtesting.rules.SystemPropertiesRestoreRule$1.evaluate(SystemPropertiesRestoreRule.java:53)
[junit4:junit4]    > 	at org.apache.lucene.util.AbstractBeforeAfterRule$1.evaluate(AbstractBeforeAfterRule.java:45)
[junit4:junit4]    > 	at org.apache.lucene.util.TestRuleStoreClassName$1.evaluate(TestRuleStoreClassName.java:42)
[junit4:junit4]    > 	at com.carrotsearch.randomizedtesting.rules.SystemPropertiesInvariantRule$1.evaluate(SystemPropertiesInvariantRule.java:55)
[junit4:junit4]    > 	at com.carrotsearch.randomizedtesting.rules.NoShadowingOrOverridesOnMethodsRule$1.evaluate(NoShadowingOrOverridesOnMethodsRule.java:39)
[junit4:junit4]    > 	at com.carrotsearch.randomizedtesting.rules.NoShadowingOrOverridesOnMethodsRule$1.evaluate(NoShadowingOrOverridesOnMethodsRule.java:39)
[junit4:junit4]    > 	at com.carrotsearch.randomizedtesting.rules.StatementAdapter.evaluate(StatementAdapter.java:36)
[junit4:junit4]    > 	at org.apache.lucene.util.TestRuleAssertionsRequired$1.evaluate(TestRuleAssertionsRequired.java:43)
[junit4:junit4]    > 	at org.apache.lucene.util.TestRuleMarkFailure$1.evaluate(TestRuleMarkFailure.java:48)
[junit4:junit4]    > 	at org.apache.lucene.util.TestRuleIgnoreAfterMaxFailures$1.evaluate(TestRuleIgnoreAfterMaxFailures.java:70)
[junit4:junit4]    > 	at org.apache.lucene.util.TestRuleIgnoreTestSuites$1.evaluate(TestRuleIgnoreTestSuites.java:55)
[junit4:junit4]    > 	at com.carrotsearch.randomizedtesting.rules.StatementAdapter.evaluate(StatementAdapter.java:36)
[junit4:junit4]    > 	at com.carrotsearch.randomizedtesting.ThreadLeakControl$StatementRunner.run(ThreadLeakControl.java:358)
[junit4:junit4]    > 	at java.lang.Thread.run(Thread.java:777)
[junit4:junit4]   2> 1383 T1833 oas.SolrTestCaseJ4.deleteCore ###deleteCore
[junit4:junit4]   2> NOTE: test params are: codec=Asserting, sim=DefaultSimilarity, locale=es_ES, timezone=America/Miquelon
[junit4:junit4]   2> NOTE: Linux 3.2.0-30-generic amd64/IBM Corporation 1.7.0 (64-bit)/cpus=8,threads=1,free=136973456,total=184287232
[junit4:junit4]   2> NOTE: All tests run in this JVM: [UpdateRequestProcessorFactoryTest, DateFieldTest, TestQuerySenderNoQuery, PathHierarchyTokenizerFactoryTest, SpellCheckComponentTest, TestBinaryResponseWriter, SolrCmdDistributorTest, TestLFUCache, FileBasedSpellCheckerTest, TestElisionMultitermQuery, PluginInfoTest, SystemInfoHandlerTest, TestStressRecovery, DistanceFunctionTest, DistributedSpellCheckComponentTest, HighlighterConfigTest, DefaultValueUpdateProcessorTest, TestFastLRUCache, SOLR749Test, TestLuceneMatchVersion, SampleTest, DistributedTermsComponentTest, CacheHeaderTest, TestSystemIdResolver, SortByFunctionTest, SuggesterFSTTest, TestSolrJ, TermsComponentTest, TestRandomFaceting, TestIBSimilarityFactory, TestFaceting, TestIndexSearcher, TestSearchPerf, SpellCheckCollatorTest, TestFastOutputStream, TestPerFieldSimilarity, DirectSolrConnectionTest, SearchHandlerTest, TestJmxMonitoredMap, WordBreakSolrSpellCheckerTest, NoCacheHeaderTest, TestConfig, TestNumberUtils, TestPHPSerializedResponseWriter, CoreAdminHandlerTest, TestSuggestSpellingConverter, JsonLoaderTest, SuggesterWFSTTest, StatelessScriptUpdateProcessorFactoryTest, TestLMDirichletSimilarityFactory, AlternateDirectoryTest, JSONWriterTest, SyncSliceTest, TestCharFilters, UniqFieldsUpdateProcessorFactoryTest, RecoveryZkTest, LeaderElectionIntegrationTest, ZkControllerTest, TestDistributedGrouping, SoftAutoCommitTest, ZkSolrClientTest, TestJoin, ConvertedLegacyTest, PeerSyncTest, QueryElevationComponentTest, SignatureUpdateProcessorFactoryTest, TestFunctionQuery, SolrRequestParserTest, TestRemoteStreaming, QueryEqualityTest, TestWordDelimiterFilterFactory, PolyFieldTest, SpatialFilterTest, TestCSVResponseWriter, MoreLikeThisHandlerTest, DistributedQueryElevationComponentTest]
[junit4:junit4] Completed on J0 in 1.41s, 1 test, 1 error <<< FAILURES!

[...truncated 229 lines...]
BUILD FAILED
/mnt/ssd/jenkins/workspace/Lucene-Solr-4.x-Linux/build.xml:32: The following error occurred while executing this line:
/mnt/ssd/jenkins/workspace/Lucene-Solr-4.x-Linux/solr/build.xml:146: The following error occurred while executing this line:
/mnt/ssd/jenkins/workspace/Lucene-Solr-4.x-Linux/lucene/module-build.xml:63: The following error occurred while executing this line:
/mnt/ssd/jenkins/workspace/Lucene-Solr-4.x-Linux/lucene/common-build.xml:1136: The following error occurred while executing this line:
/mnt/ssd/jenkins/workspace/Lucene-Solr-4.x-Linux/lucene/common-build.xml:810: There were test failures: 230 suites, 951 tests, 5 errors, 1 failure, 7 ignored (2 assumptions)

Total time: 21 minutes 42 seconds
Build step 'Invoke Ant' marked build as failure
Recording test results
Description set: Java: 64bit/ibm-j9-jdk7 -Xjit:exclude={org/apache/lucene/util/fst/FST.pack(IIF)Lorg/apache/lucene/util/fst/FST;}
Email was triggered for: Failure
Sending email for trigger: Failure



Mime
View raw message