lucene-dev mailing list archives

Site index · List index
Message view « Date » · « Thread »
Top « Date » · « Thread »
From Apache Jenkins Server <jenk...@builds.apache.org>
Subject [JENKINS] Lucene-Solr-Tests-4.x-Java6 - Build # 650 - Failure
Date Sun, 16 Sep 2012 04:55:04 GMT
Build: https://builds.apache.org/job/Lucene-Solr-Tests-4.x-Java6/650/

1 tests failed.
REGRESSION:  org.apache.solr.cloud.BasicDistributedZk2Test.testDistribSearch

Error Message:
Shard still reported as live in zk

Stack Trace:
java.lang.AssertionError: Shard still reported as live in zk
	at __randomizedtesting.SeedInfo.seed([754708E72AD15D35:F4A186FF5D8E3D09]:0)
	at org.junit.Assert.fail(Assert.java:93)
	at org.apache.solr.cloud.AbstractFullDistribZkTestBase.waitToSeeNotLive(AbstractFullDistribZkTestBase.java:1220)
	at org.apache.solr.cloud.BasicDistributedZk2Test.brindDownShardIndexSomeDocsAndRecover(BasicDistributedZk2Test.java:190)
	at org.apache.solr.cloud.BasicDistributedZk2Test.doTest(BasicDistributedZk2Test.java:83)
	at org.apache.solr.BaseDistributedSearchTestCase.testDistribSearch(BaseDistributedSearchTestCase.java:695)
	at sun.reflect.NativeMethodAccessorImpl.invoke0(Native Method)
	at sun.reflect.NativeMethodAccessorImpl.invoke(NativeMethodAccessorImpl.java:57)
	at sun.reflect.DelegatingMethodAccessorImpl.invoke(DelegatingMethodAccessorImpl.java:43)
	at java.lang.reflect.Method.invoke(Method.java:616)
	at com.carrotsearch.randomizedtesting.RandomizedRunner.invoke(RandomizedRunner.java:1559)
	at com.carrotsearch.randomizedtesting.RandomizedRunner.access$600(RandomizedRunner.java:79)
	at com.carrotsearch.randomizedtesting.RandomizedRunner$6.evaluate(RandomizedRunner.java:737)
	at com.carrotsearch.randomizedtesting.RandomizedRunner$7.evaluate(RandomizedRunner.java:773)
	at com.carrotsearch.randomizedtesting.RandomizedRunner$8.evaluate(RandomizedRunner.java:787)
	at com.carrotsearch.randomizedtesting.rules.SystemPropertiesRestoreRule$1.evaluate(SystemPropertiesRestoreRule.java:53)
	at org.apache.lucene.util.TestRuleSetupTeardownChained$1.evaluate(TestRuleSetupTeardownChained.java:50)
	at org.apache.lucene.util.TestRuleFieldCacheSanity$1.evaluate(TestRuleFieldCacheSanity.java:51)
	at org.apache.lucene.util.AbstractBeforeAfterRule$1.evaluate(AbstractBeforeAfterRule.java:45)
	at com.carrotsearch.randomizedtesting.rules.SystemPropertiesInvariantRule$1.evaluate(SystemPropertiesInvariantRule.java:55)
	at org.apache.lucene.util.TestRuleThreadAndTestName$1.evaluate(TestRuleThreadAndTestName.java:48)
	at org.apache.lucene.util.TestRuleIgnoreAfterMaxFailures$1.evaluate(TestRuleIgnoreAfterMaxFailures.java:70)
	at org.apache.lucene.util.TestRuleMarkFailure$1.evaluate(TestRuleMarkFailure.java:48)
	at com.carrotsearch.randomizedtesting.rules.StatementAdapter.evaluate(StatementAdapter.java:36)
	at com.carrotsearch.randomizedtesting.ThreadLeakControl$StatementRunner.run(ThreadLeakControl.java:358)
	at com.carrotsearch.randomizedtesting.ThreadLeakControl.forkTimeoutingTask(ThreadLeakControl.java:782)
	at com.carrotsearch.randomizedtesting.ThreadLeakControl$3.evaluate(ThreadLeakControl.java:442)
	at com.carrotsearch.randomizedtesting.RandomizedRunner.runSingleTest(RandomizedRunner.java:746)
	at com.carrotsearch.randomizedtesting.RandomizedRunner$3.evaluate(RandomizedRunner.java:648)
	at com.carrotsearch.randomizedtesting.RandomizedRunner$4.evaluate(RandomizedRunner.java:682)
	at com.carrotsearch.randomizedtesting.RandomizedRunner$5.evaluate(RandomizedRunner.java:693)
	at com.carrotsearch.randomizedtesting.rules.StatementAdapter.evaluate(StatementAdapter.java:36)
	at com.carrotsearch.randomizedtesting.rules.SystemPropertiesRestoreRule$1.evaluate(SystemPropertiesRestoreRule.java:53)
	at org.apache.lucene.util.AbstractBeforeAfterRule$1.evaluate(AbstractBeforeAfterRule.java:45)
	at org.apache.lucene.util.TestRuleStoreClassName$1.evaluate(TestRuleStoreClassName.java:42)
	at com.carrotsearch.randomizedtesting.rules.SystemPropertiesInvariantRule$1.evaluate(SystemPropertiesInvariantRule.java:55)
	at com.carrotsearch.randomizedtesting.rules.NoShadowingOrOverridesOnMethodsRule$1.evaluate(NoShadowingOrOverridesOnMethodsRule.java:39)
	at com.carrotsearch.randomizedtesting.rules.NoShadowingOrOverridesOnMethodsRule$1.evaluate(NoShadowingOrOverridesOnMethodsRule.java:39)
	at com.carrotsearch.randomizedtesting.rules.StatementAdapter.evaluate(StatementAdapter.java:36)
	at org.apache.lucene.util.TestRuleAssertionsRequired$1.evaluate(TestRuleAssertionsRequired.java:43)
	at org.apache.lucene.util.TestRuleMarkFailure$1.evaluate(TestRuleMarkFailure.java:48)
	at org.apache.lucene.util.TestRuleIgnoreAfterMaxFailures$1.evaluate(TestRuleIgnoreAfterMaxFailures.java:70)
	at org.apache.lucene.util.TestRuleIgnoreTestSuites$1.evaluate(TestRuleIgnoreTestSuites.java:55)
	at com.carrotsearch.randomizedtesting.rules.StatementAdapter.evaluate(StatementAdapter.java:36)
	at com.carrotsearch.randomizedtesting.ThreadLeakControl$StatementRunner.run(ThreadLeakControl.java:358)
	at java.lang.Thread.run(Thread.java:679)




Build Log:
[...truncated 7571 lines...]
[junit4:junit4] Suite: org.apache.solr.cloud.BasicDistributedZk2Test
[junit4:junit4]   2> 2 T2338 oas.SolrTestCaseJ4.setUp ###Starting testDistribSearch
[junit4:junit4]   2> Creating dataDir: /usr/home/hudson/hudson-slave/workspace/Lucene-Solr-Tests-4.x-Java6/solr/build/solr-core/test/J1/./solrtest-BasicDistributedZk2Test-1347770990037
[junit4:junit4]   2> 3 T2338 oasc.ZkTestServer.run STARTING ZK TEST SERVER
[junit4:junit4]   2> 7 T2339 oazs.ZooKeeperServer.setTickTime tickTime set to 1000
[junit4:junit4]   2> 8 T2339 oazs.NIOServerCnxn$Factory.<init> binding to port 0.0.0.0/0.0.0.0:0
[junit4:junit4]   2> 8 T2339 oazsp.FileTxnSnapLog.save Snapshotting: 0
[junit4:junit4]   2> 105 T2338 oasc.ZkTestServer.run start zk server on port:33505
[junit4:junit4]   2> 105 T2338 oaz.ZooKeeper.<init> Initiating client connection, connectString=127.0.0.1:33505 sessionTimeout=10000 watcher=org.apache.solr.common.cloud.ConnectionManager@3851f5ce
[junit4:junit4]   2> 106 T2344 oaz.ClientCnxn$SendThread.startConnect Opening socket connection to server /127.0.0.1:33505
[junit4:junit4]   2> 106 T2338 oascc.ConnectionManager.waitForConnected Waiting for client to connect to ZooKeeper
[junit4:junit4]   2> 107 T2344 oaz.ClientCnxn$SendThread.primeConnection Socket connection established to localhost/127.0.0.1:33505, initiating session
[junit4:junit4]   2> 107 T2340 oazs.NIOServerCnxn$Factory.run Accepted socket connection from /140.211.11.196:33506
[junit4:junit4]   2> 107 T2340 oazs.NIOServerCnxn.readConnectRequest Client attempting to establish new session at /140.211.11.196:33506
[junit4:junit4]   2> 107 T2342 oazsp.FileTxnLog.append Creating new log file: log.1
[junit4:junit4]   2> 111 T2342 oazs.NIOServerCnxn.finishSessionInit Established session 0x139cd693ddb0000 with negotiated timeout 10000 for client /140.211.11.196:33506
[junit4:junit4]   2> 111 T2344 oaz.ClientCnxn$SendThread.readConnectResult Session establishment complete on server localhost/127.0.0.1:33505, sessionid = 0x139cd693ddb0000, negotiated timeout = 10000
[junit4:junit4]   2> 111 T2345 oascc.ConnectionManager.process Watcher org.apache.solr.common.cloud.ConnectionManager@3851f5ce name:ZooKeeperConnection Watcher:127.0.0.1:33505 got event WatchedEvent state:SyncConnected type:None path:null path:null type:None
[junit4:junit4]   2> 111 T2338 oascc.ConnectionManager.waitForConnected Client is connected to ZooKeeper
[junit4:junit4]   2> 111 T2338 oascc.SolrZkClient.makePath makePath: /solr
[junit4:junit4]   2> 114 T2343 oazs.PrepRequestProcessor.pRequest Processed session termination for sessionid: 0x139cd693ddb0000
[junit4:junit4]   2> 134 T2345 oaz.ClientCnxn$EventThread.run EventThread shut down
[junit4:junit4]   2> 134 T2338 oaz.ZooKeeper.close Session: 0x139cd693ddb0000 closed
[junit4:junit4]   2> 135 T2340 oazs.NIOServerCnxn.closeSock Closed socket connection for client /140.211.11.196:33506 which had sessionid 0x139cd693ddb0000
[junit4:junit4]   2> 135 T2338 oaz.ZooKeeper.<init> Initiating client connection, connectString=127.0.0.1:33505/solr sessionTimeout=10000 watcher=org.apache.solr.common.cloud.ConnectionManager@7e245d1
[junit4:junit4]   2> 135 T2346 oaz.ClientCnxn$SendThread.startConnect Opening socket connection to server /127.0.0.1:33505
[junit4:junit4]   2> 135 T2338 oascc.ConnectionManager.waitForConnected Waiting for client to connect to ZooKeeper
[junit4:junit4]   2> 136 T2346 oaz.ClientCnxn$SendThread.primeConnection Socket connection established to localhost/127.0.0.1:33505, initiating session
[junit4:junit4]   2> 136 T2340 oazs.NIOServerCnxn$Factory.run Accepted socket connection from /140.211.11.196:33507
[junit4:junit4]   2> 137 T2340 oazs.NIOServerCnxn.readConnectRequest Client attempting to establish new session at /140.211.11.196:33507
[junit4:junit4]   2> 138 T2342 oazs.NIOServerCnxn.finishSessionInit Established session 0x139cd693ddb0001 with negotiated timeout 10000 for client /140.211.11.196:33507
[junit4:junit4]   2> 138 T2346 oaz.ClientCnxn$SendThread.readConnectResult Session establishment complete on server localhost/127.0.0.1:33505, sessionid = 0x139cd693ddb0001, negotiated timeout = 10000
[junit4:junit4]   2> 138 T2347 oascc.ConnectionManager.process Watcher org.apache.solr.common.cloud.ConnectionManager@7e245d1 name:ZooKeeperConnection Watcher:127.0.0.1:33505/solr got event WatchedEvent state:SyncConnected type:None path:null path:null type:None
[junit4:junit4]   2> 139 T2338 oascc.ConnectionManager.waitForConnected Client is connected to ZooKeeper
[junit4:junit4]   2> 139 T2338 oascc.SolrZkClient.makePath makePath: /collections/collection1
[junit4:junit4]   2> 147 T2338 oascc.SolrZkClient.makePath makePath: /collections/collection1/shards
[junit4:junit4]   2> 153 T2338 oascc.SolrZkClient.makePath makePath: /collections/control_collection
[junit4:junit4]   2> 156 T2338 oascc.SolrZkClient.makePath makePath: /collections/control_collection/shards
[junit4:junit4]   2> 159 T2338 oasc.AbstractZkTestCase.putConfig put /usr/home/hudson/hudson-slave/workspace/Lucene-Solr-Tests-4.x-Java6/solr/build/solr-core/test-files/solr/collection1/conf/solrconfig.xml to /configs/conf1/solrconfig.xml
[junit4:junit4]   2> 160 T2338 oascc.SolrZkClient.makePath makePath: /configs/conf1/solrconfig.xml
[junit4:junit4]   2> 170 T2338 oasc.AbstractZkTestCase.putConfig put /usr/home/hudson/hudson-slave/workspace/Lucene-Solr-Tests-4.x-Java6/solr/build/solr-core/test-files/solr/collection1/conf/schema.xml to /configs/conf1/schema.xml
[junit4:junit4]   2> 171 T2338 oascc.SolrZkClient.makePath makePath: /configs/conf1/schema.xml
[junit4:junit4]   2> 274 T2338 oasc.AbstractZkTestCase.putConfig put /usr/home/hudson/hudson-slave/workspace/Lucene-Solr-Tests-4.x-Java6/solr/build/solr-core/test-files/solr/collection1/conf/solrconfig.xml to /configs/conf1/solrconfig.xml
[junit4:junit4]   2> 275 T2338 oascc.SolrZkClient.makePath makePath: /configs/conf1/solrconfig.xml
[junit4:junit4]   2> 278 T2338 oasc.AbstractZkTestCase.putConfig put /usr/home/hudson/hudson-slave/workspace/Lucene-Solr-Tests-4.x-Java6/solr/build/solr-core/test-files/solr/collection1/conf/stopwords.txt to /configs/conf1/stopwords.txt
[junit4:junit4]   2> 279 T2338 oascc.SolrZkClient.makePath makePath: /configs/conf1/stopwords.txt
[junit4:junit4]   2> 282 T2338 oasc.AbstractZkTestCase.putConfig put /usr/home/hudson/hudson-slave/workspace/Lucene-Solr-Tests-4.x-Java6/solr/build/solr-core/test-files/solr/collection1/conf/protwords.txt to /configs/conf1/protwords.txt
[junit4:junit4]   2> 282 T2338 oascc.SolrZkClient.makePath makePath: /configs/conf1/protwords.txt
[junit4:junit4]   2> 285 T2338 oasc.AbstractZkTestCase.putConfig put /usr/home/hudson/hudson-slave/workspace/Lucene-Solr-Tests-4.x-Java6/solr/build/solr-core/test-files/solr/collection1/conf/currency.xml to /configs/conf1/currency.xml
[junit4:junit4]   2> 286 T2338 oascc.SolrZkClient.makePath makePath: /configs/conf1/currency.xml
[junit4:junit4]   2> 295 T2338 oasc.AbstractZkTestCase.putConfig put /usr/home/hudson/hudson-slave/workspace/Lucene-Solr-Tests-4.x-Java6/solr/build/solr-core/test-files/solr/collection1/conf/open-exchange-rates.json to /configs/conf1/open-exchange-rates.json
[junit4:junit4]   2> 296 T2338 oascc.SolrZkClient.makePath makePath: /configs/conf1/open-exchange-rates.json
[junit4:junit4]   2> 298 T2338 oasc.AbstractZkTestCase.putConfig put /usr/home/hudson/hudson-slave/workspace/Lucene-Solr-Tests-4.x-Java6/solr/build/solr-core/test-files/solr/collection1/conf/mapping-ISOLatin1Accent.txt to /configs/conf1/mapping-ISOLatin1Accent.txt
[junit4:junit4]   2> 299 T2338 oascc.SolrZkClient.makePath makePath: /configs/conf1/mapping-ISOLatin1Accent.txt
[junit4:junit4]   2> 306 T2338 oasc.AbstractZkTestCase.putConfig put /usr/home/hudson/hudson-slave/workspace/Lucene-Solr-Tests-4.x-Java6/solr/build/solr-core/test-files/solr/collection1/conf/old_synonyms.txt to /configs/conf1/old_synonyms.txt
[junit4:junit4]   2> 306 T2338 oascc.SolrZkClient.makePath makePath: /configs/conf1/old_synonyms.txt
[junit4:junit4]   2> 309 T2338 oasc.AbstractZkTestCase.putConfig put /usr/home/hudson/hudson-slave/workspace/Lucene-Solr-Tests-4.x-Java6/solr/build/solr-core/test-files/solr/collection1/conf/synonyms.txt to /configs/conf1/synonyms.txt
[junit4:junit4]   2> 309 T2338 oascc.SolrZkClient.makePath makePath: /configs/conf1/synonyms.txt
[junit4:junit4]   2> 311 T2343 oazs.PrepRequestProcessor.pRequest Processed session termination for sessionid: 0x139cd693ddb0001
[junit4:junit4]   2> 318 T2347 oaz.ClientCnxn$EventThread.run EventThread shut down
[junit4:junit4]   2> 318 T2338 oaz.ZooKeeper.close Session: 0x139cd693ddb0001 closed
[junit4:junit4]   2> 318 T2340 oazs.NIOServerCnxn.closeSock Closed socket connection for client /140.211.11.196:33507 which had sessionid 0x139cd693ddb0001
[junit4:junit4]   2> 321 T2338 oejs.Server.doStart jetty-8.1.2.v20120308
[junit4:junit4]   2> 326 T2338 oejs.AbstractConnector.doStart Started SocketConnector@0.0.0.0:33514
[junit4:junit4]   2> 326 T2338 oasc.SolrResourceLoader.locateSolrHome JNDI not configured for solr (NoInitialContextEx)
[junit4:junit4]   2> 327 T2338 oasc.SolrResourceLoader.locateSolrHome using system property solr.solr.home: /usr/home/hudson/hudson-slave/workspace/Lucene-Solr-Tests-4.x-Java6/solr/build/solr-core/test-files/solr
[junit4:junit4]   2> 327 T2338 oasc.SolrResourceLoader.<init> new SolrResourceLoader for deduced Solr Home: '/usr/home/hudson/hudson-slave/workspace/Lucene-Solr-Tests-4.x-Java6/solr/build/solr-core/test-files/solr/'
[junit4:junit4]   2> 371 T2338 oass.SolrDispatchFilter.init SolrDispatchFilter.init()
[junit4:junit4]   2> 372 T2338 oasc.SolrResourceLoader.locateSolrHome JNDI not configured for solr (NoInitialContextEx)
[junit4:junit4]   2> 372 T2338 oasc.SolrResourceLoader.locateSolrHome using system property solr.solr.home: /usr/home/hudson/hudson-slave/workspace/Lucene-Solr-Tests-4.x-Java6/solr/build/solr-core/test-files/solr
[junit4:junit4]   2> 373 T2338 oasc.CoreContainer$Initializer.initialize looking for solr.xml: /usr/home/hudson/hudson-slave/workspace/Lucene-Solr-Tests-4.x-Java6/solr/build/solr-core/test-files/solr/solr.xml
[junit4:junit4]   2> 373 T2338 oasc.CoreContainer.<init> New CoreContainer 440640637
[junit4:junit4]   2> 374 T2338 oasc.CoreContainer.load Loading CoreContainer using Solr Home: '/usr/home/hudson/hudson-slave/workspace/Lucene-Solr-Tests-4.x-Java6/solr/build/solr-core/test-files/solr/'
[junit4:junit4]   2> 374 T2338 oasc.SolrResourceLoader.<init> new SolrResourceLoader for directory: '/usr/home/hudson/hudson-slave/workspace/Lucene-Solr-Tests-4.x-Java6/solr/build/solr-core/test-files/solr/'
[junit4:junit4]   2> 403 T2338 oasc.CoreContainer.load Registering Log Listener
[junit4:junit4]   2> 420 T2338 oasc.CoreContainer.initZooKeeper Zookeeper client=127.0.0.1:33505/solr
[junit4:junit4]   2> 420 T2338 oaz.ZooKeeper.<init> Initiating client connection, connectString=127.0.0.1:33505/solr sessionTimeout=5000 watcher=org.apache.solr.common.cloud.ConnectionManager@60e4956b
[junit4:junit4]   2> 421 T2357 oaz.ClientCnxn$SendThread.startConnect Opening socket connection to server /127.0.0.1:33505
[junit4:junit4]   2> 421 T2338 oascc.ConnectionManager.waitForConnected Waiting for client to connect to ZooKeeper
[junit4:junit4]   2> 422 T2357 oaz.ClientCnxn$SendThread.primeConnection Socket connection established to localhost/127.0.0.1:33505, initiating session
[junit4:junit4]   2> 422 T2340 oazs.NIOServerCnxn$Factory.run Accepted socket connection from /140.211.11.196:33515
[junit4:junit4]   2> 423 T2340 oazs.NIOServerCnxn.readConnectRequest Client attempting to establish new session at /140.211.11.196:33515
[junit4:junit4]   2> 449 T2342 oazs.NIOServerCnxn.finishSessionInit Established session 0x139cd693ddb0002 with negotiated timeout 5000 for client /140.211.11.196:33515
[junit4:junit4]   2> 449 T2357 oaz.ClientCnxn$SendThread.readConnectResult Session establishment complete on server localhost/127.0.0.1:33505, sessionid = 0x139cd693ddb0002, negotiated timeout = 5000
[junit4:junit4]   2> 449 T2358 oascc.ConnectionManager.process Watcher org.apache.solr.common.cloud.ConnectionManager@60e4956b name:ZooKeeperConnection Watcher:127.0.0.1:33505/solr got event WatchedEvent state:SyncConnected type:None path:null path:null type:None
[junit4:junit4]   2> 450 T2338 oascc.ConnectionManager.waitForConnected Client is connected to ZooKeeper
[junit4:junit4]   2> 451 T2343 oazs.PrepRequestProcessor.pRequest Got user-level KeeperException when processing sessionid:0x139cd693ddb0002 type:create cxid:0x2 zxid:0xfffffffffffffffe txntype:unknown reqpath:n/a Error Path:/solr/overseer Error:KeeperErrorCode = NodeExists for /solr/overseer
[junit4:junit4]   2> 453 T2338 oascc.SolrZkClient.makePath makePath: /live_nodes
[junit4:junit4]   2> 461 T2338 oasc.ZkController.createEphemeralLiveNode Register node as live in ZooKeeper:/live_nodes/127.0.0.1:33514_solr
[junit4:junit4]   2> 462 T2343 oazs.PrepRequestProcessor.pRequest Got user-level KeeperException when processing sessionid:0x139cd693ddb0002 type:delete cxid:0x7 zxid:0xfffffffffffffffe txntype:unknown reqpath:n/a Error Path:/solr/live_nodes/127.0.0.1:33514_solr Error:KeeperErrorCode = NoNode for /solr/live_nodes/127.0.0.1:33514_solr
[junit4:junit4]   2> 463 T2338 oascc.SolrZkClient.makePath makePath: /live_nodes/127.0.0.1:33514_solr
[junit4:junit4]   2> 465 T2338 oashc.HttpShardHandlerFactory.getParameter Setting socketTimeout to: 0
[junit4:junit4]   2> 466 T2338 oashc.HttpShardHandlerFactory.getParameter Setting urlScheme to: http://
[junit4:junit4]   2> 466 T2338 oashc.HttpShardHandlerFactory.getParameter Setting connTimeout to: 0
[junit4:junit4]   2> 466 T2338 oashc.HttpShardHandlerFactory.getParameter Setting maxConnectionsPerHost to: 20
[junit4:junit4]   2> 467 T2338 oashc.HttpShardHandlerFactory.getParameter Setting corePoolSize to: 0
[junit4:junit4]   2> 467 T2338 oashc.HttpShardHandlerFactory.getParameter Setting maximumPoolSize to: 2147483647
[junit4:junit4]   2> 468 T2338 oashc.HttpShardHandlerFactory.getParameter Setting maxThreadIdleTime to: 5
[junit4:junit4]   2> 468 T2338 oashc.HttpShardHandlerFactory.getParameter Setting sizeOfQueue to: -1
[junit4:junit4]   2> 469 T2338 oashc.HttpShardHandlerFactory.getParameter Setting fairnessPolicy to: false
[junit4:junit4]   2> 469 T2338 oascsi.HttpClientUtil.createClient Creating new http client, config:maxConnectionsPerHost=20&maxConnections=10000&socketTimeout=0&connTimeout=0&retry=false
[junit4:junit4]   2> 484 T2338 oascc.SolrZkClient.makePath makePath: /overseer_elect/election
[junit4:junit4]   2> 496 T2343 oazs.PrepRequestProcessor.pRequest Got user-level KeeperException when processing sessionid:0x139cd693ddb0002 type:delete cxid:0x15 zxid:0xfffffffffffffffe txntype:unknown reqpath:n/a Error Path:/solr/overseer_elect/leader Error:KeeperErrorCode = NoNode for /solr/overseer_elect/leader
[junit4:junit4]   2> 497 T2338 oascc.SolrZkClient.makePath makePath: /overseer_elect/leader
[junit4:junit4]   2> 504 T2338 oasc.Overseer.start Overseer (id=88327519603458050-127.0.0.1:33514_solr-n_0000000000) starting
[junit4:junit4]   2> 505 T2343 oazs.PrepRequestProcessor.pRequest Got user-level KeeperException when processing sessionid:0x139cd693ddb0002 type:create cxid:0x1a zxid:0xfffffffffffffffe txntype:unknown reqpath:n/a Error Path:/solr/overseer Error:KeeperErrorCode = NodeExists for /solr/overseer
[junit4:junit4]   2> 506 T2343 oazs.PrepRequestProcessor.pRequest Got user-level KeeperException when processing sessionid:0x139cd693ddb0002 type:create cxid:0x1b zxid:0xfffffffffffffffe txntype:unknown reqpath:n/a Error Path:/solr/overseer Error:KeeperErrorCode = NodeExists for /solr/overseer
[junit4:junit4]   2> 507 T2343 oazs.PrepRequestProcessor.pRequest Got user-level KeeperException when processing sessionid:0x139cd693ddb0002 type:create cxid:0x1c zxid:0xfffffffffffffffe txntype:unknown reqpath:n/a Error Path:/solr/overseer Error:KeeperErrorCode = NodeExists for /solr/overseer
[junit4:junit4]   2> 516 T2343 oazs.PrepRequestProcessor.pRequest Got user-level KeeperException when processing sessionid:0x139cd693ddb0002 type:create cxid:0x1d zxid:0xfffffffffffffffe txntype:unknown reqpath:n/a Error Path:/solr/overseer Error:KeeperErrorCode = NodeExists for /solr/overseer
[junit4:junit4]   2> 517 T2360 oasc.OverseerCollectionProcessor.run Process current queue of collection creations
[junit4:junit4]   2> 518 T2338 oascc.SolrZkClient.makePath makePath: /clusterstate.json
[junit4:junit4]   2> 524 T2338 oascc.ZkStateReader.createClusterStateWatchersAndUpdate Updating cluster state from ZooKeeper... 
[junit4:junit4]   2> 526 T2359 oasc.Overseer$ClusterStateUpdater.run Starting to work on the main queue
[junit4:junit4]   2> 530 T2338 oasc.CoreContainer.create Creating SolrCore 'collection1' using instanceDir: /usr/home/hudson/hudson-slave/workspace/Lucene-Solr-Tests-4.x-Java6/solr/build/solr-core/test-files/solr/collection1
[junit4:junit4]   2> 531 T2338 oasc.ZkController.createCollectionZkNode Check for collection zkNode:control_collection
[junit4:junit4]   2> 531 T2338 oasc.ZkController.createCollectionZkNode Collection zkNode exists
[junit4:junit4]   2> 532 T2338 oasc.ZkController.readConfigName Load collection config from:/collections/control_collection
[junit4:junit4]   2> 533 T2338 oasc.SolrResourceLoader.<init> new SolrResourceLoader for directory: '/usr/home/hudson/hudson-slave/workspace/Lucene-Solr-Tests-4.x-Java6/solr/build/solr-core/test-files/solr/collection1/'
[junit4:junit4]   2> 534 T2338 oasc.SolrResourceLoader.replaceClassLoader Adding 'file:/usr/home/hudson/hudson-slave/workspace/Lucene-Solr-Tests-4.x-Java6/solr/build/solr-core/test-files/solr/collection1/lib/README' to classloader
[junit4:junit4]   2> 535 T2338 oasc.SolrResourceLoader.replaceClassLoader Adding 'file:/usr/home/hudson/hudson-slave/workspace/Lucene-Solr-Tests-4.x-Java6/solr/build/solr-core/test-files/solr/collection1/lib/classes/' to classloader
[junit4:junit4]   2> 583 T2338 oasc.SolrConfig.<init> Using Lucene MatchVersion: LUCENE_40
[junit4:junit4]   2> 657 T2338 oasc.SolrConfig.<init> Loaded SolrConfig: solrconfig.xml
[junit4:junit4]   2> 758 T2338 oass.IndexSchema.readSchema Reading Solr Schema
[junit4:junit4]   2> 766 T2338 oass.IndexSchema.readSchema Schema name=test
[junit4:junit4]   2> 1358 T2338 oass.OpenExchangeRatesOrgProvider.init Initialized with rates=open-exchange-rates.json, refreshInterval=1440.
[junit4:junit4]   2> 1367 T2338 oass.IndexSchema.readSchema default search field in schema is text
[junit4:junit4]   2> 1371 T2338 oass.IndexSchema.readSchema unique key field: id
[junit4:junit4]   2> 1378 T2338 oass.FileExchangeRateProvider.reload Reloading exchange rates from file currency.xml
[junit4:junit4]   2> 1382 T2338 oass.FileExchangeRateProvider.reload Reloading exchange rates from file currency.xml
[junit4:junit4]   2> 1385 T2338 oass.OpenExchangeRatesOrgProvider.reload Reloading exchange rates from open-exchange-rates.json
[junit4:junit4]   2> 1386 T2338 oass.OpenExchangeRatesOrgProvider.reload Reloading exchange rates from open-exchange-rates.json
[junit4:junit4]   2> 1387 T2338 oasc.SolrCore.<init> [collection1] Opening new SolrCore at /usr/home/hudson/hudson-slave/workspace/Lucene-Solr-Tests-4.x-Java6/solr/build/solr-core/test-files/solr/collection1/, dataDir=./org.apache.solr.cloud.BasicDistributedZk2Test-1347770990037/control/data/
[junit4:junit4]   2> 1387 T2338 oasc.JmxMonitoredMap.<init> JMX monitoring is enabled. Adding Solr mbeans to JMX Server: com.sun.jmx.mbeanserver.JmxMBeanServer@65dcc2a3
[junit4:junit4]   2> 1388 T2338 oasc.SolrCore.getNewIndexDir WARNING New index directory detected: old=null new=./org.apache.solr.cloud.BasicDistributedZk2Test-1347770990037/control/data/index/
[junit4:junit4]   2> 1389 T2338 oasc.SolrCore.initIndex WARNING [collection1] Solr index directory './org.apache.solr.cloud.BasicDistributedZk2Test-1347770990037/control/data/index' doesn't exist. Creating new index...
[junit4:junit4]   2> 1390 T2338 oasc.CachingDirectoryFactory.get return new directory for /usr/home/hudson/hudson-slave/workspace/Lucene-Solr-Tests-4.x-Java6/solr/build/solr-core/test/J1/./org.apache.solr.cloud.BasicDistributedZk2Test-1347770990037/control/data/index forceNew:false
[junit4:junit4]   2> 1403 T2338 oasc.SolrDeletionPolicy.onCommit SolrDeletionPolicy.onCommit: commits:num=1
[junit4:junit4]   2> 		commit{dir=NRTCachingDirectory(org.apache.lucene.store.NIOFSDirectory@/usr/home/hudson/hudson-slave/workspace/Lucene-Solr-Tests-4.x-Java6/solr/build/solr-core/test/J1/org.apache.solr.cloud.BasicDistributedZk2Test-1347770990037/control/data/index lockFactory=org.apache.lucene.store.NativeFSLockFactory@1f586234; maxCacheMB=48.0 maxMergeSizeMB=4.0),segFN=segments_1,generation=1,filenames=[segments_1]
[junit4:junit4]   2> 1403 T2338 oasc.SolrDeletionPolicy.updateCommits newest commit = 1
[junit4:junit4]   2> 1404 T2338 oasc.SolrCore.initWriters created xml: solr.XMLResponseWriter
[junit4:junit4]   2> 1405 T2338 oasup.UpdateRequestProcessorChain.init inserting DistributedUpdateProcessorFactory into updateRequestProcessorChain "dedupe"
[junit4:junit4]   2> 1406 T2338 oasup.UpdateRequestProcessorChain.init inserting DistributedUpdateProcessorFactory into updateRequestProcessorChain "dedupe-allfields"
[junit4:junit4]   2> 1406 T2338 oasup.UpdateRequestProcessorChain.init inserting DistributedUpdateProcessorFactory into updateRequestProcessorChain "stored_sig"
[junit4:junit4]   2> 1406 T2338 oasup.UpdateRequestProcessorChain.init inserting DistributedUpdateProcessorFactory into updateRequestProcessorChain "uniq-fields"
[junit4:junit4]   2> 1407 T2338 oasup.UpdateRequestProcessorChain.init inserting DistributedUpdateProcessorFactory into updateRequestProcessorChain "distrib-dup-test-chain-implicit"
[junit4:junit4]   2> 1407 T2338 oasc.RequestHandlers.initHandlersFromConfig adding lazy requestHandler: solr.ReplicationHandler
[junit4:junit4]   2> 1408 T2338 oasc.RequestHandlers.initHandlersFromConfig created /replication: solr.ReplicationHandler
[junit4:junit4]   2> 1408 T2338 oasc.RequestHandlers.initHandlersFromConfig created standard: solr.StandardRequestHandler
[junit4:junit4]   2> 1409 T2338 oasc.RequestHandlers.initHandlersFromConfig created /get: solr.RealTimeGetHandler
[junit4:junit4]   2> 1409 T2338 oasc.RequestHandlers.initHandlersFromConfig created dismax: solr.SearchHandler
[junit4:junit4]   2> 1409 T2338 oasc.RequestHandlers.initHandlersFromConfig created mock: org.apache.solr.core.MockQuerySenderListenerReqHandler
[junit4:junit4]   2> 1410 T2338 oasc.RequestHandlers.initHandlersFromConfig created /admin/: org.apache.solr.handler.admin.AdminHandlers
[junit4:junit4]   2> 1410 T2338 oasc.RequestHandlers.initHandlersFromConfig created defaults: solr.StandardRequestHandler
[junit4:junit4]   2> 1411 T2338 oasc.RequestHandlers.initHandlersFromConfig adding lazy requestHandler: solr.StandardRequestHandler
[junit4:junit4]   2> 1411 T2338 oasc.RequestHandlers.initHandlersFromConfig created lazy: solr.StandardRequestHandler
[junit4:junit4]   2> 1412 T2338 oasc.RequestHandlers.initHandlersFromConfig created /update: solr.UpdateRequestHandler
[junit4:junit4]   2> 1412 T2338 oasc.RequestHandlers.initHandlersFromConfig created /terms: org.apache.solr.handler.component.SearchHandler
[junit4:junit4]   2> 1413 T2338 oasc.RequestHandlers.initHandlersFromConfig created spellCheckCompRH: org.apache.solr.handler.component.SearchHandler
[junit4:junit4]   2> 1413 T2338 oasc.RequestHandlers.initHandlersFromConfig created spellCheckCompRH_Direct: org.apache.solr.handler.component.SearchHandler
[junit4:junit4]   2> 1413 T2338 oasc.RequestHandlers.initHandlersFromConfig created spellCheckWithWordbreak: org.apache.solr.handler.component.SearchHandler
[junit4:junit4]   2> 1414 T2338 oasc.RequestHandlers.initHandlersFromConfig created spellCheckWithWordbreak_Direct: org.apache.solr.handler.component.SearchHandler
[junit4:junit4]   2> 1414 T2338 oasc.RequestHandlers.initHandlersFromConfig created spellCheckCompRH1: org.apache.solr.handler.component.SearchHandler
[junit4:junit4]   2> 1415 T2338 oasc.RequestHandlers.initHandlersFromConfig created tvrh: org.apache.solr.handler.component.SearchHandler
[junit4:junit4]   2> 1415 T2338 oasc.RequestHandlers.initHandlersFromConfig created /mlt: solr.MoreLikeThisHandler
[junit4:junit4]   2> 1416 T2338 oasc.RequestHandlers.initHandlersFromConfig created /debug/dump: solr.DumpRequestHandler
[junit4:junit4]   2> 1418 T2338 oashl.XMLLoader.init xsltCacheLifetimeSeconds=60
[junit4:junit4]   2> 1422 T2338 oasc.SolrCore.initDeprecatedSupport WARNING solrconfig.xml uses deprecated <admin/gettableFiles>, Please update your config to use the ShowFileRequestHandler.
[junit4:junit4]   2> 1423 T2338 oasc.SolrCore.initDeprecatedSupport WARNING adding ShowFileRequestHandler with hidden files: [SCHEMA.XML, OLD_SYNONYMS.TXT, STOPWORDS.TXT, PROTWORDS.TXT, OPEN-EXCHANGE-RATES.JSON, SYNONYMS.TXT, CURRENCY.XML, MAPPING-ISOLATIN1ACCENT.TXT]
[junit4:junit4]   2> 1426 T2338 oass.SolrIndexSearcher.<init> Opening Searcher@181654ee main
[junit4:junit4]   2> 1427 T2338 oasu.CommitTracker.<init> Hard AutoCommit: disabled
[junit4:junit4]   2> 1428 T2338 oasu.CommitTracker.<init> Soft AutoCommit: disabled
[junit4:junit4]   2> 1428 T2338 oashc.SpellCheckComponent.inform Initializing spell checkers
[junit4:junit4]   2> 1448 T2338 oass.DirectSolrSpellChecker.init init: {name=direct,classname=DirectSolrSpellChecker,field=lowerfilt,minQueryLength=3}
[junit4:junit4]   2> 1513 T2361 oasc.SolrCore.registerSearcher [collection1] Registered new searcher Searcher@181654ee main{StandardDirectoryReader(segments_1:1)}
[junit4:junit4]   2> 1516 T2343 oazs.PrepRequestProcessor.pRequest Got user-level KeeperException when processing sessionid:0x139cd693ddb0002 type:create cxid:0x53 zxid:0xfffffffffffffffe txntype:unknown reqpath:n/a Error Path:/solr/overseer/queue Error:KeeperErrorCode = NoNode for /solr/overseer/queue
[junit4:junit4]   2> 1528 T2338 oasc.CoreContainer.register registering core: collection1
[junit4:junit4]   2> 1528 T2338 oasc.ZkController.register Register shard - core:collection1 address:http://127.0.0.1:33514/solr shardId:control_shard
[junit4:junit4]   2> 1529 T2338 oascc.SolrZkClient.makePath makePath: /collections/control_collection/leader_elect/control_shard/election
[junit4:junit4]   2> 1531 T2359 oascc.ZkStateReader.updateClusterState Updating cloud state from ZooKeeper... 
[junit4:junit4]   2> 1532 T2343 oazs.PrepRequestProcessor.pRequest Got user-level KeeperException when processing sessionid:0x139cd693ddb0002 type:create cxid:0x64 zxid:0xfffffffffffffffe txntype:unknown reqpath:n/a Error Path:/solr/overseer/queue-work Error:KeeperErrorCode = NoNode for /solr/overseer/queue-work
[junit4:junit4]   2> 1534 T2343 oazs.PrepRequestProcessor.pRequest Got user-level KeeperException when processing sessionid:0x139cd693ddb0002 type:delete cxid:0x6b zxid:0xfffffffffffffffe txntype:unknown reqpath:n/a Error Path:/solr/collections/control_collection/leaders Error:KeeperErrorCode = NoNode for /solr/collections/control_collection/leaders
[junit4:junit4]   2> 1535 T2338 oasc.ShardLeaderElectionContext.runLeaderProcess Running the leader process.
[junit4:junit4]   2> 1535 T2343 oazs.PrepRequestProcessor.pRequest Got user-level KeeperException when processing sessionid:0x139cd693ddb0002 type:create cxid:0x6f zxid:0xfffffffffffffffe txntype:unknown reqpath:n/a Error Path:/solr/overseer Error:KeeperErrorCode = NodeExists for /solr/overseer
[junit4:junit4]   2> 1536 T2358 oascc.ZkStateReader$2.process A cluster state change has occurred - updating...
[junit4:junit4]   2> 2037 T2338 oasc.ShardLeaderElectionContext.waitForReplicasToComeUp Enough replicas found to continue.
[junit4:junit4]   2> 2038 T2338 oasc.ShardLeaderElectionContext.runLeaderProcess I may be the new leader - try and sync
[junit4:junit4]   2> 2038 T2338 oasc.SyncStrategy.sync Sync replicas to http://127.0.0.1:33514/solr/collection1/
[junit4:junit4]   2> 2038 T2338 oasc.SyncStrategy.syncReplicas Sync Success - now sync replicas to me
[junit4:junit4]   2> 2039 T2338 oasc.SyncStrategy.syncToMe http://127.0.0.1:33514/solr/collection1/ has no replicas
[junit4:junit4]   2> 2039 T2338 oasc.ShardLeaderElectionContext.runLeaderProcess I am the new leader: http://127.0.0.1:33514/solr/collection1/
[junit4:junit4]   2> 2039 T2338 oascc.SolrZkClient.makePath makePath: /collections/control_collection/leaders/control_shard
[junit4:junit4]   2> 2040 T2359 oascc.ZkStateReader.updateClusterState Updating cloud state from ZooKeeper... 
[junit4:junit4]   2> 2114 T2343 oazs.PrepRequestProcessor.pRequest Got user-level KeeperException when processing sessionid:0x139cd693ddb0002 type:create cxid:0x87 zxid:0xfffffffffffffffe txntype:unknown reqpath:n/a Error Path:/solr/overseer Error:KeeperErrorCode = NodeExists for /solr/overseer
[junit4:junit4]   2> 2135 T2358 oascc.ZkStateReader$2.process A cluster state change has occurred - updating...
[junit4:junit4]   2> 2648 T2359 oascc.ZkStateReader.updateClusterState Updating cloud state from ZooKeeper... 
[junit4:junit4]   2> 2661 T2358 oascc.ZkStateReader$2.process A cluster state change has occurred - updating...
[junit4:junit4]   2> 2696 T2338 oasc.ZkController.register We are http://127.0.0.1:33514/solr/collection1/ and leader is http://127.0.0.1:33514/solr/collection1/
[junit4:junit4]   2> 2696 T2338 oasc.ZkController.register No LogReplay needed for core=collection1 baseURL=http://127.0.0.1:33514/solr
[junit4:junit4]   2> 2697 T2338 oasc.ZkController.checkRecovery I am the leader, no recovery necessary
[junit4:junit4]   2> 2699 T2338 oascc.ZkStateReader.updateClusterState Updating cloud state from ZooKeeper... 
[junit4:junit4]   2> 2700 T2338 oass.SolrDispatchFilter.init user.dir=/usr/home/hudson/hudson-slave/workspace/Lucene-Solr-Tests-4.x-Java6/solr/build/solr-core/test/J1
[junit4:junit4]   2> 2700 T2338 oass.SolrDispatchFilter.init SolrDispatchFilter.init() done
[junit4:junit4]   2> 2701 T2338 oascsi.HttpClientUtil.createClient Creating new http client, config:maxConnections=128&maxConnectionsPerHost=32&followRedirects=false
[junit4:junit4]   2> 3165 T2359 oascc.ZkStateReader.updateClusterState Updating cloud state from ZooKeeper... 
[junit4:junit4]   2> 3165 T2338 oejs.Server.doStart jetty-8.1.2.v20120308
[junit4:junit4]   2> 3168 T2338 oejs.AbstractConnector.doStart Started SocketConnector@0.0.0.0:33521
[junit4:junit4]   2> 3168 T2338 oasc.SolrResourceLoader.locateSolrHome JNDI not configured for solr (NoInitialContextEx)
[junit4:junit4]   2> 3169 T2338 oasc.SolrResourceLoader.locateSolrHome using system property solr.solr.home: /usr/home/hudson/hudson-slave/workspace/Lucene-Solr-Tests-4.x-Java6/solr/build/solr-core/test/J1/./solrtest-jetty1-1347770992749
[junit4:junit4]   2> 3169 T2338 oasc.SolrResourceLoader.<init> new SolrResourceLoader for deduced Solr Home: '/usr/home/hudson/hudson-slave/workspace/Lucene-Solr-Tests-4.x-Java6/solr/build/solr-core/test/J1/./solrtest-jetty1-1347770992749/'
[junit4:junit4]   2> 3179 T2358 oascc.ZkStateReader$2.process A cluster state change has occurred - updating...
[junit4:junit4]   2> 3204 T2338 oass.SolrDispatchFilter.init SolrDispatchFilter.init()
[junit4:junit4]   2> 3204 T2338 oasc.SolrResourceLoader.locateSolrHome JNDI not configured for solr (NoInitialContextEx)
[junit4:junit4]   2> 3205 T2338 oasc.SolrResourceLoader.locateSolrHome using system property solr.solr.home: /usr/home/hudson/hudson-slave/workspace/Lucene-Solr-Tests-4.x-Java6/solr/build/solr-core/test/J1/./solrtest-jetty1-1347770992749
[junit4:junit4]   2> 3205 T2338 oasc.CoreContainer$Initializer.initialize looking for solr.xml: /usr/home/hudson/hudson-slave/workspace/Lucene-Solr-Tests-4.x-Java6/solr/build/solr-core/test/J1/./solrtest-jetty1-1347770992749/solr.xml
[junit4:junit4]   2> 3206 T2338 oasc.CoreContainer.<init> New CoreContainer 32873022
[junit4:junit4]   2> 3206 T2338 oasc.CoreContainer.load Loading CoreContainer using Solr Home: '/usr/home/hudson/hudson-slave/workspace/Lucene-Solr-Tests-4.x-Java6/solr/build/solr-core/test/J1/./solrtest-jetty1-1347770992749/'
[junit4:junit4]   2> 3207 T2338 oasc.SolrResourceLoader.<init> new SolrResourceLoader for directory: '/usr/home/hudson/hudson-slave/workspace/Lucene-Solr-Tests-4.x-Java6/solr/build/solr-core/test/J1/./solrtest-jetty1-1347770992749/'
[junit4:junit4]   2> 3232 T2338 oasc.CoreContainer.load Registering Log Listener
[junit4:junit4]   2> 3247 T2338 oasc.CoreContainer.initZooKeeper Zookeeper client=127.0.0.1:33505/solr
[junit4:junit4]   2> 3248 T2338 oaz.ZooKeeper.<init> Initiating client connection, connectString=127.0.0.1:33505/solr sessionTimeout=5000 watcher=org.apache.solr.common.cloud.ConnectionManager@4d3e3b2a
[junit4:junit4]   2> 3249 T2371 oaz.ClientCnxn$SendThread.startConnect Opening socket connection to server /127.0.0.1:33505
[junit4:junit4]   2> 3249 T2338 oascc.ConnectionManager.waitForConnected Waiting for client to connect to ZooKeeper
[junit4:junit4]   2> 3249 T2371 oaz.ClientCnxn$SendThread.primeConnection Socket connection established to localhost/127.0.0.1:33505, initiating session
[junit4:junit4]   2> 3250 T2340 oazs.NIOServerCnxn$Factory.run Accepted socket connection from /140.211.11.196:33523
[junit4:junit4]   2> 3250 T2340 oazs.NIOServerCnxn.readConnectRequest Client attempting to establish new session at /140.211.11.196:33523
[junit4:junit4]   2> 3258 T2342 oazs.NIOServerCnxn.finishSessionInit Established session 0x139cd693ddb0003 with negotiated timeout 5000 for client /140.211.11.196:33523
[junit4:junit4]   2> 3258 T2371 oaz.ClientCnxn$SendThread.readConnectResult Session establishment complete on server localhost/127.0.0.1:33505, sessionid = 0x139cd693ddb0003, negotiated timeout = 5000
[junit4:junit4]   2> 3258 T2372 oascc.ConnectionManager.process Watcher org.apache.solr.common.cloud.ConnectionManager@4d3e3b2a name:ZooKeeperConnection Watcher:127.0.0.1:33505/solr got event WatchedEvent state:SyncConnected type:None path:null path:null type:None
[junit4:junit4]   2> 3258 T2338 oascc.ConnectionManager.waitForConnected Client is connected to ZooKeeper
[junit4:junit4]   2> 3259 T2343 oazs.PrepRequestProcessor.pRequest Got user-level KeeperException when processing sessionid:0x139cd693ddb0003 type:create cxid:0x1 zxid:0xfffffffffffffffe txntype:unknown reqpath:n/a Error Path:/solr/overseer Error:KeeperErrorCode = NodeExists for /solr/overseer
[junit4:junit4]   2> 3260 T2343 oazs.PrepRequestProcessor.pRequest Got user-level KeeperException when processing sessionid:0x139cd693ddb0003 type:create cxid:0x2 zxid:0xfffffffffffffffe txntype:unknown reqpath:n/a Error Path:/solr/overseer Error:KeeperErrorCode = NodeExists for /solr/overseer
[junit4:junit4]   2> 3262 T2338 oasc.ZkController.createEphemeralLiveNode Register node as live in ZooKeeper:/live_nodes/127.0.0.1:33521_solr
[junit4:junit4]   2> 3262 T2343 oazs.PrepRequestProcessor.pRequest Got user-level KeeperException when processing sessionid:0x139cd693ddb0003 type:delete cxid:0x4 zxid:0xfffffffffffffffe txntype:unknown reqpath:n/a Error Path:/solr/live_nodes/127.0.0.1:33521_solr Error:KeeperErrorCode = NoNode for /solr/live_nodes/127.0.0.1:33521_solr
[junit4:junit4]   2> 3271 T2338 oascc.SolrZkClient.makePath makePath: /live_nodes/127.0.0.1:33521_solr
[junit4:junit4]   2> 3273 T2358 oascc.ZkStateReader$3.process Updating live nodes
[junit4:junit4]   2> 3273 T2338 oashc.HttpShardHandlerFactory.getParameter Setting socketTimeout to: 0
[junit4:junit4]   2> 3274 T2338 oashc.HttpShardHandlerFactory.getParameter Setting urlScheme to: http://
[junit4:junit4]   2> 3274 T2338 oashc.HttpShardHandlerFactory.getParameter Setting connTimeout to: 0
[junit4:junit4]   2> 3275 T2338 oashc.HttpShardHandlerFactory.getParameter Setting maxConnectionsPerHost to: 20
[junit4:junit4]   2> 3275 T2338 oashc.HttpShardHandlerFactory.getParameter Setting corePoolSize to: 0
[junit4:junit4]   2> 3276 T2338 oashc.HttpShardHandlerFactory.getParameter Setting maximumPoolSize to: 2147483647
[junit4:junit4]   2> 3276 T2338 oashc.HttpShardHandlerFactory.getParameter Setting maxThreadIdleTime to: 5
[junit4:junit4]   2> 3276 T2338 oashc.HttpShardHandlerFactory.getParameter Setting sizeOfQueue to: -1
[junit4:junit4]   2> 3277 T2338 oashc.HttpShardHandlerFactory.getParameter Setting fairnessPolicy to: false
[junit4:junit4]   2> 3277 T2338 oascsi.HttpClientUtil.createClient Creating new http client, config:maxConnectionsPerHost=20&maxConnections=10000&socketTimeout=0&connTimeout=0&retry=false
[junit4:junit4]   2> 3295 T2338 oascc.ZkStateReader.createClusterStateWatchersAndUpdate Updating cluster state from ZooKeeper... 
[junit4:junit4]   2> 3301 T2338 oasc.CoreContainer.create Creating SolrCore 'collection1' using instanceDir: /usr/home/hudson/hudson-slave/workspace/Lucene-Solr-Tests-4.x-Java6/solr/build/solr-core/test/J1/./solrtest-jetty1-1347770992749/collection1
[junit4:junit4]   2> 3301 T2338 oasc.ZkController.createCollectionZkNode Check for collection zkNode:collection1
[junit4:junit4]   2> 3302 T2338 oasc.ZkController.createCollectionZkNode Collection zkNode exists
[junit4:junit4]   2> 3303 T2338 oasc.ZkController.readConfigName Load collection config from:/collections/collection1
[junit4:junit4]   2> 3304 T2338 oasc.SolrResourceLoader.<init> new SolrResourceLoader for directory: '/usr/home/hudson/hudson-slave/workspace/Lucene-Solr-Tests-4.x-Java6/solr/build/solr-core/test/J1/./solrtest-jetty1-1347770992749/collection1/'
[junit4:junit4]   2> 3305 T2338 oasc.SolrResourceLoader.replaceClassLoader Adding 'file:/usr/home/hudson/hudson-slave/workspace/Lucene-Solr-Tests-4.x-Java6/solr/build/solr-core/test/J1/solrtest-jetty1-1347770992749/collection1/lib/README' to classloader
[junit4:junit4]   2> 3306 T2338 oasc.SolrResourceLoader.replaceClassLoader Adding 'file:/usr/home/hudson/hudson-slave/workspace/Lucene-Solr-Tests-4.x-Java6/solr/build/solr-core/test/J1/solrtest-jetty1-1347770992749/collection1/lib/classes/' to classloader
[junit4:junit4]   2> 3358 T2338 oasc.SolrConfig.<init> Using Lucene MatchVersion: LUCENE_40
[junit4:junit4]   2> 3435 T2338 oasc.SolrConfig.<init> Loaded SolrConfig: solrconfig.xml
[junit4:junit4]   2> 3536 T2338 oass.IndexSchema.readSchema Reading Solr Schema
[junit4:junit4]   2> 3543 T2338 oass.IndexSchema.readSchema Schema name=test
[junit4:junit4]   2> 4201 T2338 oass.OpenExchangeRatesOrgProvider.init Initialized with rates=open-exchange-rates.json, refreshInterval=1440.
[junit4:junit4]   2> 4213 T2338 oass.IndexSchema.readSchema default search field in schema is text
[junit4:junit4]   2> 4218 T2338 oass.IndexSchema.readSchema unique key field: id
[junit4:junit4]   2> 4228 T2338 oass.FileExchangeRateProvider.reload Reloading exchange rates from file currency.xml
[junit4:junit4]   2> 4234 T2338 oass.FileExchangeRateProvider.reload Reloading exchange rates from file currency.xml
[junit4:junit4]   2> 4238 T2338 oass.OpenExchangeRatesOrgProvider.reload Reloading exchange rates from open-exchange-rates.json
[junit4:junit4]   2> 4239 T2338 oass.OpenExchangeRatesOrgProvider.reload Reloading exchange rates from open-exchange-rates.json
[junit4:junit4]   2> 4240 T2338 oasc.SolrCore.<init> [collection1] Opening new SolrCore at /usr/home/hudson/hudson-slave/workspace/Lucene-Solr-Tests-4.x-Java6/solr/build/solr-core/test/J1/./solrtest-jetty1-1347770992749/collection1/, dataDir=./org.apache.solr.cloud.BasicDistributedZk2Test-1347770990037/jetty1/
[junit4:junit4]   2> 4241 T2338 oasc.JmxMonitoredMap.<init> JMX monitoring is enabled. Adding Solr mbeans to JMX Server: com.sun.jmx.mbeanserver.JmxMBeanServer@65dcc2a3
[junit4:junit4]   2> 4242 T2338 oasc.SolrCore.getNewIndexDir WARNING New index directory detected: old=null new=./org.apache.solr.cloud.BasicDistributedZk2Test-1347770990037/jetty1/index/
[junit4:junit4]   2> 4243 T2338 oasc.SolrCore.initIndex WARNING [collection1] Solr index directory './org.apache.solr.cloud.BasicDistributedZk2Test-1347770990037/jetty1/index' doesn't exist. Creating new index...
[junit4:junit4]   2> 4244 T2338 oasc.CachingDirectoryFactory.get return new directory for /usr/home/hudson/hudson-slave/workspace/Lucene-Solr-Tests-4.x-Java6/solr/build/solr-core/test/J1/./org.apache.solr.cloud.BasicDistributedZk2Test-1347770990037/jetty1/index forceNew:false
[junit4:junit4]   2> 4263 T2338 oasc.SolrDeletionPolicy.onCommit SolrDeletionPolicy.onCommit: commits:num=1
[junit4:junit4]   2> 		commit{dir=NRTCachingDirectory(org.apache.lucene.store.NIOFSDirectory@/usr/home/hudson/hudson-slave/workspace/Lucene-Solr-Tests-4.x-Java6/solr/build/solr-core/test/J1/org.apache.solr.cloud.BasicDistributedZk2Test-1347770990037/jetty1/index lockFactory=org.apache.lucene.store.NativeFSLockFactory@2069a59d; maxCacheMB=48.0 maxMergeSizeMB=4.0),segFN=segments_1,generation=1,filenames=[segments_1]
[junit4:junit4]   2> 4264 T2338 oasc.SolrDeletionPolicy.updateCommits newest commit = 1
[junit4:junit4]   2> 4265 T2338 oasc.SolrCore.initWriters created xml: solr.XMLResponseWriter
[junit4:junit4]   2> 4267 T2338 oasup.UpdateRequestProcessorChain.init inserting DistributedUpdateProcessorFactory into updateRequestProcessorChain "dedupe"
[junit4:junit4]   2> 4268 T2338 oasup.UpdateRequestProcessorChain.init inserting DistributedUpdateProcessorFactory into updateRequestProcessorChain "dedupe-allfields"
[junit4:junit4]   2> 4269 T2338 oasup.UpdateRequestProcessorChain.init inserting DistributedUpdateProcessorFactory into updateRequestProcessorChain "stored_sig"
[junit4:junit4]   2> 4269 T2338 oasup.UpdateRequestProcessorChain.init inserting DistributedUpdateProcessorFactory into updateRequestProcessorChain "uniq-fields"
[junit4:junit4]   2> 4270 T2338 oasup.UpdateRequestProcessorChain.init inserting DistributedUpdateProcessorFactory into updateRequestProcessorChain "distrib-dup-test-chain-implicit"
[junit4:junit4]   2> 4270 T2338 oasc.RequestHandlers.initHandlersFromConfig adding lazy requestHandler: solr.ReplicationHandler
[junit4:junit4]   2> 4271 T2338 oasc.RequestHandlers.initHandlersFromConfig created /replication: solr.ReplicationHandler
[junit4:junit4]   2> 4272 T2338 oasc.RequestHandlers.initHandlersFromConfig created standard: solr.StandardRequestHandler
[junit4:junit4]   2> 4273 T2338 oasc.RequestHandlers.initHandlersFromConfig created /get: solr.RealTimeGetHandler
[junit4:junit4]   2> 4273 T2338 oasc.RequestHandlers.initHandlersFromConfig created dismax: solr.SearchHandler
[junit4:junit4]   2> 4274 T2338 oasc.RequestHandlers.initHandlersFromConfig created mock: org.apache.solr.core.MockQuerySenderListenerReqHandler
[junit4:junit4]   2> 4275 T2338 oasc.RequestHandlers.initHandlersFromConfig created /admin/: org.apache.solr.handler.admin.AdminHandlers
[junit4:junit4]   2> 4275 T2338 oasc.RequestHandlers.initHandlersFromConfig created defaults: solr.StandardRequestHandler
[junit4:junit4]   2> 4276 T2338 oasc.RequestHandlers.initHandlersFromConfig adding lazy requestHandler: solr.StandardRequestHandler
[junit4:junit4]   2> 4276 T2338 oasc.RequestHandlers.initHandlersFromConfig created lazy: solr.StandardRequestHandler
[junit4:junit4]   2> 4277 T2338 oasc.RequestHandlers.initHandlersFromConfig created /update: solr.UpdateRequestHandler
[junit4:junit4]   2> 4278 T2338 oasc.RequestHandlers.initHandlersFromConfig created /terms: org.apache.solr.handler.component.SearchHandler
[junit4:junit4]   2> 4279 T2338 oasc.RequestHandlers.initHandlersFromConfig created spellCheckCompRH: org.apache.solr.handler.component.SearchHandler
[junit4:junit4]   2> 4279 T2338 oasc.RequestHandlers.initHandlersFromConfig created spellCheckCompRH_Direct: org.apache.solr.handler.component.SearchHandler
[junit4:junit4]   2> 4280 T2338 oasc.RequestHandlers.initHandlersFromConfig created spellCheckWithWordbreak: org.apache.solr.handler.component.SearchHandler
[junit4:junit4]   2> 4281 T2338 oasc.RequestHandlers.initHandlersFromConfig created spellCheckWithWordbreak_Direct: org.apache.solr.handler.component.SearchHandler
[junit4:junit4]   2> 4281 T2338 oasc.RequestHandlers.initHandlersFromConfig created spellCheckCompRH1: org.apache.solr.handler.component.SearchHandler
[junit4:junit4]   2> 4282 T2338 oasc.RequestHandlers.initHandlersFromConfig created tvrh: org.apache.solr.handler.component.SearchHandler
[junit4:junit4]   2> 4283 T2338 oasc.RequestHandlers.initHandlersFromConfig created /mlt: solr.MoreLikeThisHandler
[junit4:junit4]   2> 4283 T2338 oasc.RequestHandlers.initHandlersFromConfig created /debug/dump: solr.DumpRequestHandler
[junit4:junit4]   2> 4288 T2338 oashl.XMLLoader.init xsltCacheLifetimeSeconds=60
[junit4:junit4]   2> 4293 T2338 oasc.SolrCore.initDeprecatedSupport WARNING solrconfig.xml uses deprecated <admin/gettableFiles>, Please update your config to use the ShowFileRequestHandler.
[junit4:junit4]   2> 4295 T2338 oasc.SolrCore.initDeprecatedSupport WARNING adding ShowFileRequestHandler with hidden files: [SCHEMA.XML, OLD_SYNONYMS.TXT, STOPWORDS.TXT, PROTWORDS.TXT, OPEN-EXCHANGE-RATES.JSON, SYNONYMS.TXT, CURRENCY.XML, MAPPING-ISOLATIN1ACCENT.TXT]
[junit4:junit4]   2> 4299 T2338 oass.SolrIndexSearcher.<init> Opening Searcher@1edcea0c main
[junit4:junit4]   2> 4300 T2338 oasu.CommitTracker.<init> Hard AutoCommit: disabled
[junit4:junit4]   2> 4300 T2338 oasu.CommitTracker.<init> Soft AutoCommit: disabled
[junit4:junit4]   2> 4301 T2338 oashc.SpellCheckComponent.inform Initializing spell checkers
[junit4:junit4]   2> 4315 T2338 oass.DirectSolrSpellChecker.init init: {name=direct,classname=DirectSolrSpellChecker,field=lowerfilt,minQueryLength=3}
[junit4:junit4]   2> 4380 T2373 oasc.SolrCore.registerSearcher [collection1] Registered new searcher Searcher@1edcea0c main{StandardDirectoryReader(segments_1:1)}
[junit4:junit4]   2> 4693 T2359 oascc.ZkStateReader.updateClusterState Updating cloud state from ZooKeeper... 
[junit4:junit4]   2> 4703 T2358 oascc.ZkStateReader$2.process A cluster state change has occurred - updating...
[junit4:junit4]   2> 4703 T2372 oascc.ZkStateReader$2.process A cluster state change has occurred - updating...
[junit4:junit4]   2> 4887 T2338 oasc.CoreContainer.register registering core: collection1
[junit4:junit4]   2> 4887 T2338 oasc.ZkController.register Register shard - core:collection1 address:http://127.0.0.1:33521/solr shardId:shard1
[junit4:junit4]   2> 4888 T2338 oascc.SolrZkClient.makePath makePath: /collections/collection1/leader_elect/shard1/election
[junit4:junit4]   2> 4902 T2343 oazs.PrepRequestProcessor.pRequest Got user-level KeeperException when processing sessionid:0x139cd693ddb0003 type:delete cxid:0x42 zxid:0xfffffffffffffffe txntype:unknown reqpath:n/a Error Path:/solr/collections/collection1/leaders Error:KeeperErrorCode = NoNode for /solr/collections/collection1/leaders
[junit4:junit4]   2> 4903 T2338 oasc.ShardLeaderElectionContext.runLeaderProcess Running the leader process.
[junit4:junit4]   2> 4904 T2343 oazs.PrepRequestProcessor.pRequest Got user-level KeeperException when processing sessionid:0x139cd693ddb0003 type:create cxid:0x43 zxid:0xfffffffffffffffe txntype:unknown reqpath:n/a Error Path:/solr/overseer Error:KeeperErrorCode = NodeExists for /solr/overseer
[junit4:junit4]   2> 4914 T2338 oasc.ShardLeaderElectionContext.waitForReplicasToComeUp Enough replicas found to continue.
[junit4:junit4]   2> 4914 T2338 oasc.ShardLeaderElectionContext.runLeaderProcess I may be the new leader - try and sync
[junit4:junit4]   2> 4915 T2338 oasc.SyncStrategy.sync Sync replicas to http://127.0.0.1:33521/solr/collection1/
[junit4:junit4]   2> 4915 T2338 oasc.SyncStrategy.syncReplicas Sync Success - now sync replicas to me
[junit4:junit4]   2> 4916 T2338 oasc.SyncStrategy.syncToMe http://127.0.0.1:33521/solr/collection1/ has no replicas
[junit4:junit4]   2> 4916 T2338 oasc.ShardLeaderElectionContext.runLeaderProcess I am the new leader: http://127.0.0.1:33521/solr/collection1/
[junit4:junit4]   2> 4916 T2338 oascc.SolrZkClient.makePath makePath: /collections/collection1/leaders/shard1
[junit4:junit4]   2> 4920 T2343 oazs.PrepRequestProcessor.pRequest Got user-level KeeperException when processing sessionid:0x139cd693ddb0003 type:create cxid:0x4d zxid:0xfffffffffffffffe txntype:unknown reqpath:n/a Error Path:/solr/overseer Error:KeeperErrorCode = NodeExists for /solr/overseer
[junit4:junit4]   2> 5206 T2359 oascc.ZkStateReader.updateClusterState Updating cloud state from ZooKeeper... 
[junit4:junit4]   2> 5211 T2372 oascc.ZkStateReader$2.process A cluster state change has occurred - updating...
[junit4:junit4]   2> 5211 T2358 oascc.ZkStateReader$2.process A cluster state change has occurred - updating...
[junit4:junit4]   2> 5227 T2338 oasc.ZkController.register We are http://127.0.0.1:33521/solr/collection1/ and leader is http://127.0.0.1:33521/solr/collection1/
[junit4:junit4]   2> 5227 T2338 oasc.ZkController.register No LogReplay needed for core=collection1 baseURL=http://127.0.0.1:33521/solr
[junit4:junit4]   2> 5228 T2338 oasc.ZkController.checkRecovery I am the leader, no recovery necessary
[junit4:junit4]   2> 5229 T2338 oascc.ZkStateReader.updateClusterState Updating cloud state from ZooKeeper... 
[junit4:junit4]   2> 5230 T2338 oass.SolrDispatchFilter.init user.dir=/usr/home/hudson/hudson-slave/workspace/Lucene-Solr-Tests-4.x-Java6/solr/build/solr-core/test/J1
[junit4:junit4]   2> 5230 T2338 oass.SolrDispatchFilter.init SolrDispatchFilter.init() done
[junit4:junit4]   2> 5231 T2338 oascsi.HttpClientUtil.createClient Creating new http client, config:maxConnections=128&maxConnectionsPerHost=32&followRedirects=false
[junit4:junit4]   2> 5715 T2359 oascc.ZkStateReader.updateClusterState Updating cloud state from ZooKeeper... 
[junit4:junit4]   2> 5737 T2372 oascc.ZkStateReader$2.process A cluster state change has occurred - updating...
[junit4:junit4]   2> 5737 T2358 oascc.ZkStateReader$2.process A cluster state change has occurred - updating...
[junit4:junit4]   2> 5783 T2338 oejs.Server.doStart jetty-8.1.2.v20120308
[junit4:junit4]   2> 5786 T2338 oejs.AbstractConnector.doStart Started SocketConnector@0.0.0.0:33525
[junit4:junit4]   2> 5787 T2338 oasc.SolrResourceLoader.locateSolrHome JNDI not configured for solr (NoInitialContextEx)
[junit4:junit4]   2> 5787 T2338 oasc.SolrResourceLoader.locateSolrHome using system property solr.solr.home: /usr/home/hudson/hudson-slave/workspace/Lucene-Solr-Tests-4.x-Java6/solr/build/solr-core/test/J1/./solrtest-jetty2-1347770995278
[junit4:junit4]   2> 5788 T2338 oasc.SolrResourceLoader.<init> new SolrResourceLoader for deduced Solr Home: '/usr/home/hudson/hudson-slave/workspace/Lucene-Solr-Tests-4.x-Java6/solr/build/solr-core/test/J1/./solrtest-jetty2-1347770995278/'
[junit4:junit4]   2> 5823 T2338 oass.SolrDispatchFilter.init SolrDispatchFilter.init()
[junit4:junit4]   2> 5823 T2338 oasc.SolrResourceLoader.locateSolrHome JNDI not configured for solr (NoInitialContextEx)
[junit4:junit4]   2> 5824 T2338 oasc.SolrResourceLoader.locateSolrHome using system property solr.solr.home: /usr/home/hudson/hudson-slave/workspace/Lucene-Solr-Tests-4.x-Java6/solr/build/solr-core/test/J1/./solrtest-jetty2-1347770995278
[junit4:junit4]   2> 5824 T2338 oasc.CoreContainer$Initializer.initialize looking for solr.xml: /usr/home/hudson/hudson-slave/workspace/Lucene-Solr-Tests-4.x-Java6/solr/build/solr-core/test/J1/./solrtest-jetty2-1347770995278/solr.xml
[junit4:junit4]   2> 5824 T2338 oasc.CoreContainer.<init> New CoreContainer 1930536602
[junit4:junit4]   2> 5825 T2338 oasc.CoreContainer.load Loading CoreContainer using Solr Home: '/usr/home/hudson/hudson-slave/workspace/Lucene-Solr-Tests-4.x-Java6/solr/build/solr-core/test/J1/./solrtest-jetty2-1347770995278/'
[junit4:junit4]   2> 5825 T2338 oasc.SolrResourceLoader.<init> new SolrResourceLoader for directory: '/usr/home/hudson/hudson-slave/workspace/Lucene-Solr-Tests-4.x-Java6/solr/build/solr-core/test/J1/./solrtest-jetty2-1347770995278/'
[junit4:junit4]   2> 5843 T2338 oasc.CoreContainer.load Registering Log Listener
[junit4:junit4]   2> 5854 T2338 oasc.CoreContainer.initZooKeeper Zookeeper client=127.0.0.1:33505/solr
[junit4:junit4]   2> 5855 T2338 oaz.ZooKeeper.<init> Initiating client connection, connectString=127.0.0.1:33505/solr sessionTimeout=5000 watcher=org.apache.solr.common.cloud.ConnectionManager@473b864c
[junit4:junit4]   2> 5855 T2383 oaz.ClientCnxn$SendThread.startConnect Opening socket connection to server /127.0.0.1:33505
[junit4:junit4]   2> 5856 T2338 oascc.ConnectionManager.waitForConnected Waiting for client to connect to ZooKeeper
[junit4:junit4]   2> 5856 T2383 oaz.ClientCnxn$SendThread.primeConnection Socket connection established to localhost/127.0.0.1:33505, initiating session
[junit4:junit4]   2> 5856 T2340 oazs.NIOServerCnxn$Factory.run Accepted socket connection from /140.211.11.196:33526
[junit4:junit4]   2> 5856 T2340 oazs.NIOServerCnxn.readConnectRequest Client attempting to establish new session at /140.211.11.196:33526
[junit4:junit4]   2> 5858 T2342 oazs.NIOServerCnxn.finishSessionInit Established session 0x139cd693ddb0004 with negotiated timeout 5000 for client /140.211.11.196:33526
[junit4:junit4]   2> 5858 T2383 oaz.ClientCnxn$SendThread.readConnectResult Session establishment complete on server localhost/127.0.0.1:33505, sessionid = 0x139cd693ddb0004, negotiated timeout = 5000
[junit4:junit4]   2> 5858 T2384 oascc.ConnectionManager.process Watcher org.apache.solr.common.cloud.ConnectionManager@473b864c name:ZooKeeperConnection Watcher:127.0.0.1:33505/solr got event WatchedEvent state:SyncConnected type:None path:null path:null type:None
[junit4:junit4]   2> 5858 T2338 oascc.ConnectionManager.waitForConnected Client is connected to ZooKeeper
[junit4:junit4]   2> 5859 T2343 oazs.PrepRequestProcessor.pRequest Got user-level KeeperException when processing sessionid:0x139cd693ddb0004 type:create cxid:0x1 zxid:0xfffffffffffffffe txntype:unknown reqpath:n/a Error Path:/solr/overseer Error:KeeperErrorCode = NodeExists for /solr/overseer
[junit4:junit4]   2> 5860 T2343 oazs.PrepRequestProcessor.pRequest Got user-level KeeperException when processing sessionid:0x139cd693ddb0004 type:create cxid:0x2 zxid:0xfffffffffffffffe txntype:unknown reqpath:n/a Error Path:/solr/overseer Error:KeeperErrorCode = NodeExists for /solr/overseer
[junit4:junit4]   2> 5870 T2338 oasc.ZkController.createEphemeralLiveNode Register node as live in ZooKeeper:/live_nodes/127.0.0.1:33525_solr
[junit4:junit4]   2> 5871 T2343 oazs.PrepRequestProcessor.pRequest Got user-level KeeperException when processing sessionid:0x139cd693ddb0004 type:delete cxid:0x4 zxid:0xfffffffffffffffe txntype:unknown reqpath:n/a Error Path:/solr/live_nodes/127.0.0.1:33525_solr Error:KeeperErrorCode = NoNode for /solr/live_nodes/127.0.0.1:33525_solr
[junit4:junit4]   2> 5872 T2338 oascc.SolrZkClient.makePath makePath: /live_nodes/127.0.0.1:33525_solr
[junit4:junit4]   2> 5873 T2358 oascc.ZkStateReader$3.process Updating live nodes
[junit4:junit4]   2> 5873 T2372 oascc.ZkStateReader$3.process Updating live nodes
[junit4:junit4]   2> 5874 T2338 oashc.HttpShardHandlerFactory.getParameter Setting socketTimeout to: 0
[junit4:junit4]   2> 5875 T2338 oashc.HttpShardHandlerFactory.getParameter Setting urlScheme to: http://
[junit4:junit4]   2> 5875 T2338 oashc.HttpShardHandlerFactory.getParameter Setting connTimeout to: 0
[junit4:junit4]   2> 5875 T2338 oashc.HttpShardHandlerFactory.getParameter Setting maxConnectionsPerHost to: 20
[junit4:junit4]   2> 5876 T2338 oashc.HttpShardHandlerFactory.getParameter Setting corePoolSize to: 0
[junit4:junit4]   2> 5876 T2338 oashc.HttpShardHandlerFactory.getParameter Setting maximumPoolSize to: 2147483647
[junit4:junit4]   2> 5876 T2338 oashc.HttpShardHandlerFactory.getParameter Setting maxThreadIdleTime to: 5
[junit4:junit4]   2> 5877 T2338 oashc.HttpShardHandlerFactory.getParameter Setting sizeOfQueue to: -1
[junit4:junit4]   2> 5877 T2338 oashc.HttpShardHandlerFactory.getParameter Setting fairnessPolicy to: false
[junit4:junit4]   2> 5877 T2338 oascsi.HttpClientUtil.createClient Creating new http client, config:maxConnectionsPerHost=20&maxConnections=10000&socketTimeout=0&connTimeout=0&retry=false
[junit4:junit4]   2> 5888 T2338 oascc.ZkStateReader.createClusterStateWatchersAndUpdate Updating cluster state from ZooKeeper... 
[junit4:junit4]   2> 5892 T2338 oasc.CoreContainer.create Creating SolrCore 'collection1' using instanceDir: /usr/home/hudson/hudson-slave/workspace/Lucene-Solr-Tests-4.x-Java6/solr/build/solr-core/test/J1/./solrtest-jetty2-1347770995278/collection1
[junit4:junit4]   2> 5893 T2338 oasc.ZkController.createCollectionZkNode Check for collection zkNode:collection1
[junit4:junit4]   2> 5893 T2338 oasc.ZkController.createCollectionZkNode Collection zkNode exists
[junit4:junit4]   2> 5893 T2338 oasc.ZkController.readConfigName Load collection config from:/collections/collection1
[junit4:junit4]   2> 5894 T2338 oasc.SolrResourceLoader.<init> new SolrResourceLoader for directory: '/usr/home/hudson/hudson-slave/workspace/Lucene-Solr-Tests-4.x-Java6/solr/build/solr-core/test/J1/./solrtest-jetty2-1347770995278/collection1/'
[junit4:junit4]   2> 5895 T2338 oasc.SolrResourceLoader.replaceClassLoader Adding 'file:/usr/home/hudson/hudson-slave/workspace/Lucene-Solr-Tests-4.x-Java6/solr/build/solr-core/test/J1/solrtest-jetty2-1347770995278/collection1/lib/README' to classloader
[junit4:junit4]   2> 5896 T2338 oasc.SolrResourceLoader.replaceClassLoader Adding 'file:/usr/home/hudson/hudson-slave/workspace/Lucene-Solr-Tests-4.x-Java6/solr/build/solr-core/test/J1/solrtest-jetty2-1347770995278/collection1/lib/classes/' to classloader
[junit4:junit4]   2> 5931 T2338 oasc.SolrConfig.<init> Using Lucene MatchVersion: LUCENE_40
[junit4:junit4]   2> 5978 T2338 oasc.SolrConfig.<init> Loaded SolrConfig: solrconfig.xml
[junit4:junit4]   2> 6079 T2338 oass.IndexSchema.readSchema Reading Solr Schema
[junit4:junit4]   2> 6083 T2338 oass.IndexSchema.readSchema Schema name=test
[junit4:junit4]   2> 6492 T2338 oass.OpenExchangeRatesOrgProvider.init Initialized with rates=open-exchange-rates.json, refreshInterval=1440.
[junit4:junit4]   2> 6500 T2338 oass.IndexSchema.readSchema default search field in schema is text
[junit4:junit4]   2> 6503 T2338 oass.IndexSchema.readSchema unique key field: id
[junit4:junit4]   2> 6511 T2338 oass.FileExchangeRateProvider.reload Reloading exchange rates from file currency.xml
[junit4:junit4]   2> 6515 T2338 oass.FileExchangeRateProvider.reload Reloading exchange rates from file currency.xml
[junit4:junit4]   2> 6518 T2338 oass.OpenExchangeRatesOrgProvider.reload Reloading exchange rates from open-exchange-rates.json
[junit4:junit4]   2> 6518 T2338 oass.OpenExchangeRatesOrgProvider.reload Reloading exchange rates from open-exchange-rates.json
[junit4:junit4]   2> 6519 T2338 oasc.SolrCore.<init> [collection1] Opening new SolrCore at /usr/home/hudson/hudson-slave/workspace/Lucene-Solr-Tests-4.x-Java6/solr/build/solr-core/test/J1/./solrtest-jetty2-1347770995278/collection1/, dataDir=./org.apache.solr.cloud.BasicDistributedZk2Test-1347770990037/jetty2/
[junit4:junit4]   2> 6519 T2338 oasc.JmxMonitoredMap.<init> JMX monitoring is enabled. Adding Solr mbeans to JMX Server: com.sun.jmx.mbeanserver.JmxMBeanServer@65dcc2a3
[junit4:junit4]   2> 6520 T2338 oasc.SolrCore.getNewIndexDir WARNING New index directory detected: old=null new=./org.apache.solr.cloud.BasicDistributedZk2Test-1347770990037/jetty2/index/
[junit4:junit4]   2> 6521 T2338 oasc.SolrCore.initIndex WARNING [collection1] Solr index directory './org.apache.solr.cloud.BasicDistributedZk2Test-1347770990037/jetty2/index' doesn't exist. Creating new index...
[junit4:junit4]   2> 6522 T2338 oasc.CachingDirectoryFactory.get return new directory for /usr/home/hudson/hudson-slave/workspace/Lucene-Solr-Tests-4.x-Java6/solr/build/solr-core/test/J1/./org.apache.solr.cloud.BasicDistributedZk2Test-1347770990037/jetty2/index forceNew:false
[junit4:junit4]   2> 6527 T2338 oasc.SolrDeletionPolicy.onCommit SolrDeletionPolicy.onCommit: commits:num=1
[junit4:junit4]   2> 		commit{dir=NRTCachingDirectory(org.apache.lucene.store.NIOFSDirectory@/usr/home/hudson/hudson-slave/workspace/Lucene-Solr-Tests-4.x-Java6/solr/build/solr-core/test/J1/org.apache.solr.cloud.BasicDistributedZk2Test-1347770990037/jetty2/index lockFactory=org.apache.lucene.store.NativeFSLockFactory@730694a8; maxCacheMB=48.0 maxMergeSizeMB=4.0),segFN=segments_1,generation=1,filenames=[segments_1]
[junit4:junit4]   2> 6528 T2338 oasc.SolrDeletionPolicy.updateCommits newest commit = 1
[junit4:junit4]   2> 6528 T2338 oasc.SolrCore.initWriters created xml: solr.XMLResponseWriter
[junit4:junit4]   2> 6530 T2338 oasup.UpdateRequestProcessorChain.init inserting DistributedUpdateProcessorFactory into updateRequestProcessorChain "dedupe"
[junit4:junit4]   2> 6531 T2338 oasup.UpdateRequestProcessorChain.init inserting DistributedUpdateProcessorFactory into updateRequestProcessorChain "dedupe-allfields"
[junit4:junit4]   2> 6531 T2338 oasup.UpdateRequestProcessorChain.init inserting DistributedUpdateProcessorFactory into updateRequestProcessorChain "stored_sig"
[junit4:junit4]   2> 6531 T2338 oasup.UpdateRequestProcessorChain.init inserting DistributedUpdateProcessorFactory into updateRequestProcessorChain "uniq-fields"
[junit4:junit4]   2> 6532 T2338 oasup.UpdateRequestProcessorChain.init inserting DistributedUpdateProcessorFactory into updateRequestProcessorChain "distrib-dup-test-chain-implicit"
[junit4:junit4]   2> 6532 T2338 oasc.RequestHandlers.initHandlersFromConfig adding lazy requestHandler: solr.ReplicationHandler
[junit4:junit4]   2> 6533 T2338 oasc.RequestHandlers.initHandlersFromConfig created /replication: solr.ReplicationHandler
[junit4:junit4]   2> 6533 T2338 oasc.RequestHandlers.initHandlersFromConfig created standard: solr.StandardRequestHandler
[junit4:junit4]   2> 6534 T2338 oasc.RequestHandlers.initHandlersFromConfig created /get: solr.RealTimeGetHandler
[junit4:junit4]   2> 6534 T2338 oasc.RequestHandlers.initHandlersFromConfig created dismax: solr.SearchHandler
[junit4:junit4]   2> 6535 T2338 oasc.RequestHandlers.initHandlersFromConfig created mock: org.apache.solr.core.MockQuerySenderListenerReqHandler
[junit4:junit4]   2> 6535 T2338 oasc.RequestHandlers.initHandlersFromConfig created /admin/: org.apache.solr.handler.admin.AdminHandlers
[junit4:junit4]   2> 6535 T2338 oasc.RequestHandlers.initHandlersFromConfig created defaults: solr.StandardRequestHandler
[junit4:junit4]   2> 6536 T2338 oasc.RequestHandlers.initHandlersFromConfig adding lazy requestHandler: solr.StandardRequestHandler
[junit4:junit4]   2> 6536 T2338 oasc.RequestHandlers.initHandlersFromConfig created lazy: solr.StandardRequestHandler
[junit4:junit4]   2> 6537 T2338 oasc.RequestHandlers.initHandlersFromConfig created /update: solr.UpdateRequestHandler
[junit4:junit4]   2> 6537 T2338 oasc.RequestHandlers.initHandlersFromConfig created /terms: org.apache.solr.handler.component.SearchHandler
[junit4:junit4]   2> 6538 T2338 oasc.RequestHandlers.initHandlersFromConfig created spellCheckCompRH: org.apache.solr.handler.component.SearchHandler
[junit4:junit4]   2> 6538 T2338 oasc.RequestHandlers.initHandlersFromConfig created spellCheckCompRH_Direct: org.apache.solr.handler.component.SearchHandler
[junit4:junit4]   2> 6538 T2338 oasc.RequestHandlers.initHandlersFromConfig created spellCheckWithWordbreak: org.apache.solr.handler.component.SearchHandler
[junit4:junit4]   2> 6539 T2338 oasc.RequestHandlers.initHandlersFromConfig created spellCheckWithWordbreak_Direct: org.apache.solr.handler.component.SearchHandler
[junit4:junit4]   2> 6539 T2338 oasc.RequestHandlers.initHandlersFromConfig created spellCheckCompRH1: org.apache.solr.handler.component.SearchHandler
[junit4:junit4]   2> 6540 T2338 oasc.RequestHandlers.initHandlersFromConfig created tvrh: org.apache.solr.handler.component.SearchHandler
[junit4:junit4]   2> 6540 T2338 oasc.RequestHandlers.initHandlersFromConfig created /mlt: solr.MoreLikeThisHandler
[junit4:junit4]   2> 6541 T2338 oasc.RequestHandlers.initHandlersFromConfig created /debug/dump: solr.DumpRequestHandler
[junit4:junit4]   2> 6544 T2338 oashl.XMLLoader.init xsltCacheLifetimeSeconds=60
[junit4:junit4]   2> 6547 T2338 oasc.SolrCore.initDeprecatedSupport WARNING solrconfig.xml uses deprecated <admin/gettableFiles>, Please update your config to use the ShowFileRequestHandler.
[junit4:junit4]   2> 6548 T2338 oasc.SolrCore.initDeprecatedSupport WARNING adding ShowFileRequestHandler with hidden files: [SCHEMA.XML, OLD_SYNONYMS.TXT, STOPWORDS.TXT, PROTWORDS.TXT, OPEN-EXCHANGE-RATES.JSON, SYNONYMS.TXT, CURRENCY.XML, MAPPING-ISOLATIN1ACCENT.TXT]
[junit4:junit4]   2> 6551 T2338 oass.SolrIndexSearcher.<init> Opening Searcher@449e4ba6 main
[junit4:junit4]   2> 6553 T2338 oasu.CommitTracker.<init> Hard AutoCommit: disabled
[junit4:junit4]   2> 6553 T2338 oasu.CommitTracker.<init> Soft AutoCommit: disabled
[junit4:junit4]   2> 6554 T2338 oashc.SpellCheckComponent.inform Initializing spell checkers
[junit4:junit4]   2> 6560 T2338 oass.DirectSolrSpellChecker.init init: {name=direct,classname=DirectSolrSpellChecker,field=lowerfilt,minQueryLength=3}
[junit4:junit4]   2> 6606 T2385 oasc.SolrCore.registerSearcher [collection1] Registered new searcher Searcher@449e4ba6 main{StandardDirectoryReader(segments_1:1)}
[junit4:junit4]   2> 6740 T2359 oascc.ZkStateReader.updateClusterState Updating cloud state from ZooKeeper... 
[junit4:junit4]   2> 6754 T2358 oascc.ZkStateReader$2.process A cluster state change has occurred - updating...
[junit4:junit4]   2> 6754 T2372 oascc.ZkStateReader$2.process A cluster state change has occurred - updating...
[junit4:junit4]   2> 6754 T2384 oascc.ZkStateReader$2.process A cluster state change has occurred - updating...
[junit4:junit4]   2> 7113 T2338 oasc.CoreContainer.register registering core: collection1
[junit4:junit4]   2> 7113 T2338 oasc.ZkController.register Register shard - core:collection1 address:http://127.0.0.1:33525/solr shardId:shard2
[junit4:junit4]   2> 7114 T2338 oascc.SolrZkClient.makePath makePath: /collections/collection1/leader_elect/shard2/election
[junit4:junit4]   2> 7128 T2343 oazs.PrepRequestProcessor.pRequest Got user-level KeeperException when processing sessionid:0x139cd693ddb0004 type:delete cxid:0x41 zxid:0xfffffffffffffffe txntype:unknown reqpath:n/a Error Path:/solr/collections/collection1/leaders/shard2 Error:KeeperErrorCode = NoNode for /solr/collections/collection1/leaders/shard2
[junit4:junit4]   2> 7129 T2338 oasc.ShardLeaderElectionContext.runLeaderProcess Running the leader process.
[junit4:junit4]   2> 7130 T2343 oazs.PrepRequestProcessor.pRequest Got user-level KeeperException when processing sessionid:0x139cd693ddb0004 type:create cxid:0x42 zxid:0xfffffffffffffffe txntype:unknown reqpath:n/a Error Path:/solr/overseer Error:KeeperErrorCode = NodeExists for /solr/overseer
[junit4:junit4]   2> 7131 T2338 oasc.ShardLeaderElectionContext.waitForReplicasToComeUp Enough replicas found to continue.
[junit4:junit4]   2> 7132 T2338 oasc.ShardLeaderElectionContext.runLeaderProcess I may be the new leader - try and sync
[junit4:junit4]   2> 7132 T2338 oasc.SyncStrategy.sync Sync replicas to http://127.0.0.1:33525/solr/collection1/
[junit4:junit4]   2> 7133 T2338 oasc.SyncStrategy.syncReplicas Sync Success - now sync replicas to me
[junit4:junit4]   2> 7133 T2338 oasc.SyncStrategy.syncToMe http://127.0.0.1:33525/solr/collection1/ has no replicas
[junit4:junit4]   2> 7134 T2338 oasc.ShardLeaderElectionContext.runLeaderProcess I am the new leader: http://127.0.0.1:33525/solr/collection1/
[junit4:junit4]   2> 7134 T2338 oascc.SolrZkClient.makePath makePath: /collections/collection1/leaders/shard2
[junit4:junit4]   2> 7136 T2343 oazs.PrepRequestProcessor.pRequest Got user-level KeeperException when processing sessionid:0x139cd693ddb0004 type:create cxid:0x4b zxid:0xfffffffffffffffe txntype:unknown reqpath:n/a Error Path:/solr/overseer Error:KeeperErrorCode = NodeExists for /solr/overseer
[junit4:junit4]   2> 7257 T2359 oascc.ZkStateReader.updateClusterState Updating cloud state from ZooKeeper... 
[junit4:junit4]   2> 7286 T2384 oascc.ZkStateReader$2.process A cluster state change has occurred - updating...
[junit4:junit4]   2> 7286 T2372 oascc.ZkStateReader$2.process A cluster state change has occurred - updating...
[junit4:junit4]   2> 7286 T2358 oascc.ZkStateReader$2.process A cluster state change has occurred - updating...
[junit4:junit4]   2> 7291 T2338 oasc.ZkController.register We are http://127.0.0.1:33525/solr/collection1/ and leader is http://127.0.0.1:33525/solr/collection1/
[junit4:junit4]   2> 7291 T2338 oasc.ZkController.register No LogReplay needed for core=collection1 baseURL=http://127.0.0.1:33525/solr
[junit4:junit4]   2> 7292 T2338 oasc.ZkController.checkRecovery I am the leader, no recovery necessary
[junit4:junit4]   2> 7304 T2338 oascc.ZkStateReader.updateClusterState Updating cloud state from ZooKeeper... 
[junit4:junit4]   2> 7305 T2338 oass.SolrDispatchFilter.init user.dir=/usr/home/hudson/hudson-slave/workspace/Lucene-Solr-Tests-4.x-Java6/solr/build/solr-core/test/J1
[junit4:junit4]   2> 7305 T2338 oass.SolrDispatchFilter.init SolrDispatchFilter.init() done
[junit4:junit4]   2> 7306 T2338 oascsi.HttpClientUtil.createClient Creating new http client, config:maxConnections=128&maxConnectionsPerHost=32&followRedirects=false
[junit4:junit4]   2> 7807 T2359 oascc.ZkStateReader.updateClusterState Updating cloud state from ZooKeeper... 
[junit4:junit4]   2> 7808 T2338 oejs.Server.doStart jetty-8.1.2.v20120308
[junit4:junit4]   2> 7813 T2338 oejs.AbstractConnector.doStart Started SocketConnector@0.0.0.0:33531
[junit4:junit4]   2> 7813 T2338 oasc.SolrResourceLoader.locateSolrHome JNDI not configured for solr (NoInitialContextEx)
[junit4:junit4]   2> 7814 T2338 oasc.SolrResourceLoader.locateSolrHome using system property solr.solr.home: /usr/home/hudson/hudson-slave/workspace/Lucene-Solr-Tests-4.x-Java6/solr/build/solr-core/test/J1/./solrtest-jetty3-1347770997354
[junit4:junit4]   2> 7814 T2338 oasc.SolrResourceLoader.<init> new SolrResourceLoader for deduced Solr Home: '/usr/home/hudson/hudson-slave/workspace/Lucene-Solr-Tests-4.x-Java6/solr/build/solr-core/test/J1/./solrtest-jetty3-1347770997354/'
[junit4:junit4]   2> 7821 T2358 oascc.ZkStateReader$2.process A cluster state change has occurred - updating...
[junit4:junit4]   2> 7821 T2384 oascc.ZkStateReader$2.process A cluster state change has occurred - updating...
[junit4:junit4]   2> 7821 T2372 oascc.ZkStateReader$2.process A cluster state change has occurred - updating...
[junit4:junit4]   2> 7852 T2338 oass.SolrDispatchFilter.init SolrDispatchFilter.init()
[junit4:junit4]   2> 7853 T2338 oasc.SolrResourceLoader.locateSolrHome JNDI not configured for solr (NoInitialContextEx)
[junit4:junit4]   2> 7853 T2338 oasc.SolrResourceLoader.locateSolrHome using system property solr.solr.home: /usr/home/hudson/hudson-slave/workspace/Lucene-Solr-Tests-4.x-Java6/solr/build/solr-core/test/J1/./solrtest-jetty3-1347770997354
[junit4:junit4]   2> 7854 T2338 oasc.CoreContainer$Initializer.initialize looking for solr.xml: /usr/home/hudson/hudson-slave/workspace/Lucene-Solr-Tests-4.x-Java6/solr/build/solr-core/test/J1/./solrtest-jetty3-1347770997354/solr.xml
[junit4:junit4]   2> 7854 T2338 oasc.CoreContainer.<init> New CoreContainer 1553550819
[junit4:junit4]   2> 7855 T2338 oasc.CoreContainer.load Loading CoreContainer using Solr Home: '/usr/home/hudson/hudson-slave/workspace/Lucene-Solr-Tests-4.x-Java6/solr/build/solr-core/test/J1/./solrtest-jetty3-1347770997354/'
[junit4:junit4]   2> 7855 T2338 oasc.SolrResourceLoader.<init> new SolrResourceLoader for directory: '/usr/home/hudson/hudson-slave/workspace/Lucene-Solr-Tests-4.x-Java6/solr/build/solr-core/test/J1/./solrtest-jetty3-1347770997354/'
[junit4:junit4]   2> 7879 T2338 oasc.CoreContainer.load Registering Log Listener
[junit4:junit4]   2> 7893 T2338 oasc.CoreContainer.initZooKeeper Zookeeper client=127.0.0.1:33505/solr
[junit4:junit4]   2> 7893 T2338 oaz.ZooKeeper.<init> Initiating client connection, connectString=127.0.0.1:33505/solr sessionTimeout=5000 watcher=org.apache.solr.common.cloud.ConnectionManager@3fe7e561
[junit4:junit4]   2> 7894 T2395 oaz.ClientCnxn$SendThread.startConnect Opening socket connection to server /127.0.0.1:33505
[junit4:junit4]   2> 7894 T2338 oascc.ConnectionManager.waitForConnected Waiting for client to connect to ZooKeeper
[junit4:junit4]   2> 7895 T2395 oaz.ClientCnxn$SendThread.primeConnection Socket connection established to localhost/127.0.0.1:33505, initiating session
[junit4:junit4]   2> 7895 T2340 oazs.NIOServerCnxn$Factory.run Accepted socket connection from /140.211.11.196:33532
[junit4:junit4]   2> 7896 T2340 oazs.NIOServerCnxn.readConnectRequest Client attempting to establish new session at /140.211.11.196:33532
[junit4:junit4]   2> 7897 T2342 oazs.NIOServerCnxn.finishSessionInit Established session 0x139cd693ddb0005 with negotiated timeout 5000 for client /140.211.11.196:33532
[junit4:junit4]   2> 7897 T2395 oaz.ClientCnxn$SendThread.readConnectResult Session establishment complete on server localhost/127.0.0.1:33505, sessionid = 0x139cd693ddb0005, negotiated timeout = 5000
[junit4:junit4]   2> 7897 T2396 oascc.ConnectionManager.process Watcher org.apache.solr.common.cloud.ConnectionManager@3fe7e561 name:ZooKeeperConnection Watcher:127.0.0.1:33505/solr got event WatchedEvent state:SyncConnected type:None path:null path:null type:None
[junit4:junit4]   2> 7897 T2338 oascc.ConnectionManager.waitForConnected Client is connected to ZooKeeper
[junit4:junit4]   2> 7898 T2343 oazs.PrepRequestProcessor.pRequest Got user-level KeeperException when processing sessionid:0x139cd693ddb0005 type:create cxid:0x1 zxid:0xfffffffffffffffe txntype:unknown reqpath:n/a Error Path:/solr/overseer Error:KeeperErrorCode = NodeExists for /solr/overseer
[junit4:junit4]   2> 7899 T2343 oazs.PrepRequestProcessor.pRequest Got user-level KeeperException when processing sessionid:0x139cd693ddb0005 type:create cxid:0x2 zxid:0xfffffffffffffffe txntype:unknown reqpath:n/a Error Path:/solr/overseer Error:KeeperErrorCode = NodeExists for /solr/overseer
[junit4:junit4]   2> 7900 T2338 oasc.ZkController.createEphemeralLiveNode Register node as live in ZooKeeper:/live_nodes/127.0.0.1:33531_solr
[junit4:junit4]   2> 7901 T2343 oazs.PrepRequestProcessor.pRequest Got user-level KeeperException when processing sessionid:0x139cd693ddb0005 type:delete cxid:0x4 zxid:0xfffffffffffffffe txntype:unknown reqpath:n/a Error Path:/solr/live_nodes/127.0.0.1:33531_solr Error:KeeperErrorCode = NoNode for /solr/live_nodes/127.0.0.1:33531_solr
[junit4:junit4]   2> 7911 T2338 oascc.SolrZkClient.makePath makePath: /live_nodes/127.0.0.1:33531_solr
[junit4:junit4]   2> 7913 T2372 oascc.ZkStateReader$3.process Updating live nodes
[junit4:junit4]   2> 7913 T2358 oascc.ZkStateReader$3.process Updating live nodes
[junit4:junit4]   2> 7913 T2384 oascc.ZkStateReader$3.process Updating live nodes
[junit4:junit4]   2> 7913 T2338 oashc.HttpShardHandlerFactory.getParameter Setting socketTimeout to: 0
[junit4:junit4]   2> 7914 T2338 oashc.HttpShardHandlerFactory.getParameter Setting urlScheme to: http://
[junit4:junit4]   2> 7914 T2338 oashc.HttpShardHandlerFactory.getParameter Setting connTimeout to: 0
[junit4:junit4]   2> 7915 T2338 oashc.HttpShardHandlerFactory.getParameter Setting maxConnectionsPerHost to: 20
[junit4:junit4]   2> 7915 T2338 oashc.HttpShardHandlerFactory.getParameter Setting corePoolSize to: 0
[junit4:junit4]   2> 7915 T2338 oashc.HttpShardHandlerFactory.getParameter Setting maximumPoolSize to: 2147483647
[junit4:junit4]   2> 7916 T2338 oashc.HttpShardHandlerFactory.getParameter Setting maxThreadIdleTime to: 5
[junit4:junit4]   2> 7916 T2338 oashc.HttpShardHandlerFactory.getParameter Setting sizeOfQueue to: -1
[junit4:junit4]   2> 7917 T2338 oashc.HttpShardHandlerFactory.getParameter Setting fairnessPolicy to: false
[junit4:junit4]   2> 7917 T2338 oascsi.HttpClientUtil.createClient Creating new http client, config:maxConnectionsPerHost=20&maxConnections=10000&socketTimeout=0&connTimeout=0&retry=false
[junit4:junit4]   2> 7931 T2338 oascc.ZkStateReader.createClusterStateWatchersAndUpdate Updating cluster state from ZooKeeper... 
[junit4:junit4]   2> 7936 T2338 oasc.CoreContainer.create Creating SolrCore 'collection1' using instanceDir: /usr/home/hudson/hudson-slave/workspace/Lucene-Solr-Tests-4.x-Java6/solr/build/solr-core/test/J1/./solrtest-jetty3-1347770997354/collection1
[junit4:junit4]   2> 7937 T2338 oasc.ZkController.createCollectionZkNode Check for collection zkNode:collection1
[junit4:junit4]   2> 7937 T2338 oasc.ZkController.createCollectionZkNode Collection zkNode exists
[junit4:junit4]   2> 7938 T2338 oasc.ZkController.readConfigName Load collection config from:/collections/collection1
[junit4:junit4]   2> 7939 T2338 oasc.SolrResourceLoader.<init> new SolrResourceLoader for directory: '/usr/home/hudson/hudson-slave/workspace/Lucene-Solr-Tests-4.x-Java6/solr/build/solr-core/test/J1/./solrtest-jetty3-1347770997354/collection1/'
[junit4:junit4]   2> 7940 T2338 oasc.SolrResourceLoader.replaceClassLoader Adding 'file:/usr/home/hudson/hudson-slave/workspace/Lucene-Solr-Tests-4.x-Java6/solr/build/solr-core/test/J1/solrtest-jetty3-1347770997354/collection1/lib/README' to classloader
[junit4:junit4]   2> 7941 T2338 oasc.SolrResourceLoader.replaceClassLoader Adding 'file:/usr/home/hudson/hudson-slave/workspace/Lucene-Solr-Tests-4.x-Java6/solr/build/solr-core/test/J1/solrtest-jetty3-1347770997354/collection1/lib/classes/' to classloader
[junit4:junit4]   2> 7986 T2338 oasc.SolrConfig.<init> Using Lucene MatchVersion: LUCENE_40
[junit4:junit4]   2> 8049 T2338 oasc.SolrConfig.<init> Loaded SolrConfig: solrconfig.xml
[junit4:junit4]   2> 8150 T2338 oass.IndexSchema.readSchema Reading Solr Schema
[junit4:junit4]   2> 8156 T2338 oass.IndexSchema.readSchema Schema name=test
[junit4:junit4]   2> 8746 T2338 oass.OpenExchangeRatesOrgProvider.init Initialized with rates=open-exchange-rates.json, refreshInterval=1440.
[junit4:junit4]   2> 8758 T2338 oass.IndexSchema.readSchema default search field in schema is text
[junit4:junit4]   2> 8763 T2338 oass.IndexSchema.readSchema unique key field: id
[junit4:junit4]   2> 8773 T2338 oass.FileExchangeRateProvider.reload Reloading exchange rates from file currency.xml
[junit4:junit4]   2> 8778 T2338 oass.FileExchangeRateProvider.reload Reloading exchange rates from file currency.xml
[junit4:junit4]   2> 8782 T2338 oass.OpenExchangeRatesOrgProvider.reload Reloading exchange rates from open-exchange-rates.json
[junit4:junit4]   2> 8784 T2338 oass.OpenExchangeRatesOrgProvider.reload Reloading exchange rates from open-exchange-rates.json
[junit4:junit4]   2> 8785 T2338 oasc.SolrCore.<init> [collection1] Opening new SolrCore at /usr/home/hudson/hudson-slave/workspace/Lucene-Solr-Tests-4.x-Java6/solr/build/solr-core/test/J1/./solrtest-jetty3-1347770997354/collection1/, dataDir=./org.apache.solr.cloud.BasicDistributedZk2Test-1347770990037/jetty3/
[junit4:junit4]   2> 8785 T2338 oasc.JmxMonitoredMap.<init> JMX monitoring is enabled. Adding Solr mbeans to JMX Server: com.sun.jmx.mbeanserver.JmxMBeanServer@65dcc2a3
[junit4:junit4]   2> 8786 T2338 oasc.SolrCore.getNewIndexDir WARNING New index directory detected: old=null new=./org.apache.solr.cloud.BasicDistributedZk2Test-1347770990037/jetty3/index/
[junit4:junit4]   2> 8787 T2338 oasc.SolrCore.initIndex WARNING [collection1] Solr index directory './org.apache.solr.cloud.BasicDistributedZk2Test-1347770990037/jetty3/index' doesn't exist. Creating new index...
[junit4:junit4]   2> 8788 T2338 oasc.CachingDirectoryFactory.get return new directory for /usr/home/hudson/hudson-slave/workspace/Lucene-Solr-Tests-4.x-Java6/solr/build/solr-core/test/J1/./org.apache.solr.cloud.BasicDistributedZk2Test-1347770990037/jetty3/index forceNew:false
[junit4:junit4]   2> 8804 T2338 oasc.SolrDeletionPolicy.onCommit SolrDeletionPolicy.onCommit: commits:num=1
[junit4:junit4]   2> 		commit{dir=NRTCachingDirectory(org.apache.lucene.store.NIOFSDirectory@/usr/home/hudson/hudson-slave/workspace/Lucene-Solr-Tests-4.x-Java6/solr/build/solr-core/test/J1/org.apache.solr.cloud.BasicDistributedZk2Test-1347770990037/jetty3/index lockFactory=org.apache.lucene.store.NativeFSLockFactory@126d805f; maxCacheMB=48.0 maxMergeSizeMB=4.0),segFN=segments_1,generation=1,filenames=[segments_1]
[junit4:junit4]   2> 8805 T2338 oasc.SolrDeletionPolicy.updateCommits newest commit = 1
[junit4:junit4]   2> 8806 T2338 oasc.SolrCore.initWriters created xml: solr.XMLResponseWriter
[junit4:junit4]   2> 8808 T2338 oasup.UpdateRequestProcessorChain.init inserting DistributedUpdateProcessorFactory into updateRequestProcessorChain "dedupe"
[junit4:junit4]   2> 8809 T2338 oasup.UpdateRequestProcessorChain.init inserting DistributedUpdateProcessorFactory into updateRequestProcessorChain "dedupe-allfields"
[junit4:junit4]   2> 8809 T2338 oasup.UpdateRequestProcessorChain.init inserting DistributedUpdateProcessorFactory into updateRequestProcessorChain "stored_sig"
[junit4:junit4]   2> 8810 T2338 oasup.UpdateRequestProcessorChain.init inserting DistributedUpdateProcessorFactory into updateRequestProcessorChain "uniq-fields"
[junit4:junit4]   2> 8811 T2338 oasup.UpdateRequestProcessorChain.init inserting DistributedUpdateProcessorFactory into updateRequestProcessorChain "distrib-dup-test-chain-implicit"
[junit4:junit4]   2> 8811 T2338 oasc.RequestHandlers.initHandlersFromConfig adding lazy requestHandler: solr.ReplicationHandler
[junit4:junit4]   2> 8812 T2338 oasc.RequestHandlers.initHandlersFromConfig created /replication: solr.ReplicationHandler
[junit4:junit4]   2> 8812 T2338 oasc.RequestHandlers.initHandlersFromConfig created standard: solr.StandardRequestHandler
[junit4:junit4]   2> 8813 T2338 oasc.RequestHandlers.initHandlersFromConfig created /get: solr.RealTimeGetHandler
[junit4:junit4]   2> 8814 T2338 oasc.RequestHandlers.initHandlersFromConfig created dismax: solr.SearchHandler
[junit4:junit4]   2> 8814 T2338 oasc.RequestHandlers.initHandlersFromConfig created mock: org.apache.solr.core.MockQuerySenderListenerReqHandler
[junit4:junit4]   2> 8815 T2338 oasc.RequestHandlers.initHandlersFromConfig created /admin/: org.apache.solr.handler.admin.AdminHandlers
[junit4:junit4]   2> 8816 T2338 oasc.RequestHandlers.initHandlersFromConfig created defaults: solr.StandardRequestHandler
[junit4:junit4]   2> 8816 T2338 oasc.RequestHandlers.initHandlersFromConfig adding lazy requestHandler: solr.StandardRequestHandler
[junit4:junit4]   2> 8817 T2338 oasc.RequestHandlers.initHandlersFromConfig created lazy: solr.StandardRequestHandler
[junit4:junit4]   2> 8817 T2338 oasc.RequestHandlers.initHandlersFromConfig created /update: solr.UpdateRequestHandler
[junit4:junit4]   2> 8818 T2338 oasc.RequestHandlers.initHandlersFromConfig created /terms: org.apache.solr.handler.component.SearchHandler
[junit4:junit4]   2> 8818 T2338 oasc.RequestHandlers.initHandlersFromConfig created spellCheckCompRH: org.apache.solr.handler.component.SearchHandler
[junit4:junit4]   2> 8819 T2338 oasc.RequestHandlers.initHandlersFromConfig created spellCheckCompRH_Direct: org.apache.solr.handler.component.SearchHandler
[junit4:junit4]   2> 8820 T2338 oasc.RequestHandlers.initHandlersFromConfig created spellCheckWithWordbreak: org.apache.solr.handler.component.SearchHandler
[junit4:junit4]   2> 8820 T2338 oasc.RequestHandlers.initHandlersFromConfig created spellCheckWithWordbreak_Direct: org.apache.solr.handler.component.SearchHandler
[junit4:junit4]   2> 8821 T2338 oasc.RequestHandlers.initHandlersFromConfig created spellCheckCompRH1: org.apache.solr.handler.component.SearchHandler
[junit4:junit4]   2> 8822 T2338 oasc.RequestHandlers.initHandlersFromConfig created tvrh: org.apache.solr.handler.component.SearchHandler
[junit4:junit4]   2> 8822 T2338 oasc.RequestHandlers.initHandlersFromConfig created /mlt: solr.MoreLikeThisHandler
[junit4:junit4]   2> 8823 T2338 oasc.RequestHandlers.initHandlersFromConfig created /debug/dump: solr.DumpRequestHandler
[junit4:junit4]   2> 8827 T2338 oashl.XMLLoader.init xsltCacheLifetimeSeconds=60
[junit4:junit4]   2> 8831 T2338 oasc.SolrCore.initDeprecatedSupport WARNING solrconfig.xml uses deprecated <admin/gettableFiles>, Please update your config to use the ShowFileRequestHandler.
[junit4:junit4]   2> 8832 T2338 oasc.SolrCore.initDeprecatedSupport WARNING adding ShowFileRequestHandler with hidden files: [SCHEMA.XML, OLD_SYNONYMS.TXT, STOPWORDS.TXT, PROTWORDS.TXT, OPEN-EXCHANGE-RATES.JSON, SYNONYMS.TXT, CURRENCY.XML, MAPPING-ISOLATIN1ACCENT.TXT]
[junit4:junit4]   2> 8836 T2338 oass.SolrIndexSearcher.<init> Opening Searcher@13e46cbf main
[junit4:junit4]   2> 8837 T2338 oasu.CommitTracker.<init> Hard AutoCommit: disabled
[junit4:junit4]   2> 8837 T2338 oasu.CommitTracker.<init> Soft AutoCommit: disabled
[junit4:junit4]   2> 8838 T2338 oashc.SpellCheckComponent.inform Initializing spell checkers
[junit4:junit4]   2> 8849 T2338 oass.DirectSolrSpellChecker.init init: {name=direct,classname=DirectSolrSpellChecker,field=lowerfilt,minQueryLength=3}
[junit4:junit4]   2> 8905 T2397 oasc.SolrCore.registerSearcher [collection1] Registered new searcher Searcher@13e46cbf main{StandardDirectoryReader(segments_1:1)}
[junit4:junit4]   2> 9329 T2359 oascc.ZkStateReader.updateClusterState Updating cloud state from ZooKeeper... 
[junit4:junit4]   2> 9347 T2372 oascc.ZkStateReader$2.process A cluster state change has occurred - updating...
[junit4:junit4]   2> 9347 T2384 oascc.ZkStateReader$2.process A cluster state change has occurred - updating...
[junit4:junit4]   2> 9347 T2358 oascc.ZkStateReader$2.process A cluster state change has occurred - updating...
[junit4:junit4]   2> 9347 T2396 oascc.ZkStateReader$2.process A cluster state change has occurred - updating...
[junit4:junit4]   2> 9411 T2338 oasc.CoreContainer.register registering core: collection1
[junit4:junit4]   2> 9411 T2338 oasc.ZkController.register Register shard - core:collection1 address:http://127.0.0.1:33531/solr shardId:shard1
[junit4:junit4]   2> 9414 T2338 oasc.ZkController.register We are http://127.0.0.1:33531/solr/collection1/ and leader is http://127.0.0.1:33521/solr/collection1/
[junit4:junit4]   2> 9414 T2338 oasc.ZkController.register No LogReplay needed for core=collection1 baseURL=http://127.0.0.1:33531/solr
[junit4:junit4]   2> 9415 T2338 oasc.ZkController.checkRecovery Core needs to recover:collection1
[junit4:junit4]   2> 9415 T2338 oasu.DefaultSolrCoreState.doRecovery Running recovery - first canceling any ongoing recovery
[junit4:junit4]   2> ASYNC  NEW_CORE C138 name=collection1 org.apache.solr.core.SolrCore@232347eb url=http://127.0.0.1:33531/solr/collection1 node=127.0.0.1:33531_solr
[junit4:junit4]   2> 9416 T2398 C138 P33531 oasc.RecoveryStrategy.run Starting recovery process.  core=collection1 recoveringAfterStartup=true
[junit4:junit4]   2> 9417 T2398 C138 P33531 oasc.RecoveryStrategy.doRecovery ###### startupVersions=[]
[junit4:junit4]   2> 9417 T2338 oascc.ZkStateReader.updateClusterState Updating cloud state from ZooKeeper... 
[junit4:junit4]   2> 9418 T2398 C138 P33531 oasc.RecoveryStrategy.doRecovery Attempting to PeerSync from http://127.0.0.1:33521/solr/collection1/ core=collection1 - recoveringAfterStartup=true
[junit4:junit4]   2> 9418 T2398 C138 P33531 oasu.PeerSync.sync PeerSync: core=collection1 url=http://127.0.0.1:33531/solr START replicas=[http://127.0.0.1:33521/solr/collection1/] nUpdates=100
[junit4:junit4]   2> 9418 T2338 oass.SolrDispatchFilter.init user.dir=/usr/home/hudson/hudson-slave/workspace/Lucene-Solr-Tests-4.x-Java6/solr/build/solr-core/test/J1
[junit4:junit4]   2> 9418 T2398 C138 P33531 oasu.PeerSync.sync WARNING no frame of reference to tell of we've missed updates
[junit4:junit4]   2> 9418 T2338 oass.SolrDispatchFilter.init SolrDispatchFilter.init() done
[junit4:junit4]   2> 9419 T2398 C138 P33531 oasc.RecoveryStrategy.doRecovery PeerSync Recovery was not successful - trying replication. core=collection1
[junit4:junit4]   2> 9419 T2398 C138 P33531 oasc.RecoveryStrategy.doRecovery Starting Replication Recovery. core=collection1
[junit4:junit4]   2> 9419 T2338 oascsi.HttpClientUtil.createClient Creating new http client, config:maxConnections=128&maxConnectionsPerHost=32&followRedirects=false
[junit4:junit4]   2> 9419 T2398 C138 P33531 oascsi.HttpClientUtil.createClient Creating new http client, config:maxConnections=128&maxConnectionsPerHost=32&followRedirects=false
[junit4:junit4]   2> ASYNC  NEW_CORE C139 name=collection1 org.apache.solr.core.SolrCore@638491d3 url=http://127.0.0.1:33521/solr/collection1 node=127.0.0.1:33521_solr
[junit4:junit4]   2> 9427 T2364 C139 P33521 REQ /get {distrib=false&qt=/get&wt=javabin&version=2&getVersions=100} status=0 QTime=0 
[junit4:junit4]   2> 9850 T2359 oascc.ZkStateReader.updateClusterState Updating cloud state from ZooKeeper... 
[junit4:junit4]   2> 9854 T2338 oejs.Server.doStart jetty-8.1.2.v20120308
[junit4:junit4]   2> 9857 T2338 oejs.AbstractConnector.doStart Started SocketConnector@0.0.0.0:33537
[junit4:junit4]   2> 9857 T2338 oasc.SolrResourceLoader.locateSolrHome JNDI not configured for solr (NoInitialContextEx)
[junit4:junit4]   2> 9858 T2338 oasc.SolrResourceLoader.locateSolrHome using system property solr.solr.home: /usr/home/hudson/hudson-slave/workspace/Lucene-Solr-Tests-4.x-Java6/solr/build/solr-core/test/J1/./solrtest-jetty4-1347770999469
[junit4:junit4]   2> 9858 T2338 oasc.SolrResourceLoader.<init> new SolrResourceLoader for deduced Solr Home: '/usr/home/hudson/hudson-slave/workspace/Lucene-Solr-Tests-4.x-Java6/solr/build/solr-core/test/J1/./solrtest-jetty4-1347770999469/'
[junit4:junit4]   2> 9859 T2372 oascc.ZkStateReader$2.process A cluster state change has occurred - updating...
[junit4:junit4]   2> 9859 T2396 oascc.ZkStateReader$2.process A cluster state change has occurred - updating...
[junit4:junit4]   2> 9859 T2358 oascc.ZkStateReader$2.process A cluster state change has occurred - updating...
[junit4:junit4]   2> 9859 T2384 oascc.ZkStateReader$2.process A cluster state change has occurred - updating...
[junit4:junit4]   2> 9894 T2338 oass.SolrDispatchFilter.init SolrDispatchFilter.init()
[junit4:junit4]   2> 9894 T2338 oasc.SolrResourceLoader.locateSolrHome JNDI not configured for solr (NoInitialContextEx)
[junit4:junit4]   2> 9895 T2338 oasc.SolrResourceLoader.locateSolrHome using system property solr.solr.home: /usr/home/hudson/hudson-slave/workspace/Lucene-Solr-Tests-4.x-Java6/solr/build/solr-core/test/J1/./solrtest-jetty4-1347770999469
[junit4:junit4]   2> 9895 T2338 oasc.CoreContainer$Initializer.initialize looking for solr.xml: /usr/home/hudson/hudson-slave/workspace/Lucene-Solr-Tests-4.x-Java6/solr/build/solr-core/test/J1/./solrtest-jetty4-1347770999469/solr.xml
[junit4:junit4]   2> 9896 T2338 oasc.CoreContainer.<init> New CoreContainer 1978492520
[junit4:junit4]   2> 9896 T2338 oasc.CoreContainer.load Loading CoreContainer using Solr Home: '/usr/home/hudson/hudson-slave/workspace/Lucene-Solr-Tests-4.x-Java6/solr/build/solr-core/test/J1/./solrtest-jetty4-1347770999469/'
[junit4:junit4]   2> 9897 T2338 oasc.SolrResourceLoader.<init> new SolrResourceLoader for directory: '/usr/home/hudson/hudson-slave/workspace/Lucene-Solr-Tests-4.x-Java6/solr/build/solr-core/test/J1/./solrtest-jetty4-1347770999469/'
[junit4:junit4]   2> 9921 T2338 oasc.CoreContainer.load Registering Log Listener
[junit4:junit4]   2> 9936 T2338 oasc.CoreContainer.initZooKeeper Zookeeper client=127.0.0.1:33505/solr
[junit4:junit4]   2> 9937 T2338 oaz.ZooKeeper.<init> Initiating client connection, connectString=127.0.0.1:33505/solr sessionTimeout=5000 watcher=org.apache.solr.common.cloud.ConnectionManager@782403e9
[junit4:junit4]   2> 9938 T2409 oaz.ClientCnxn$SendThread.startConnect Opening socket connection to server /127.0.0.1:33505
[junit4:junit4]   2> 9938 T2338 oascc.ConnectionManager.waitForConnected Waiting for client to connect to ZooKeeper
[junit4:junit4]   2> 9939 T2409 oaz.ClientCnxn$SendThread.primeConnection Socket connection established to localhost/127.0.0.1:33505, initiating session
[junit4:junit4]   2> 9939 T2340 oazs.NIOServerCnxn$Factory.run Accepted socket connection from /140.211.11.196:33538
[junit4:junit4]   2> 9939 T2340 oazs.NIOServerCnxn.readConnectRequest Client attempting to establish new session at /140.211.11.196:33538
[junit4:junit4]   2> 9942 T2342 oazs.NIOServerCnxn.finishSessionInit Established session 0x139cd693ddb0006 with negotiated timeout 5000 for client /140.211.11.196:33538
[junit4:junit4]   2> 9942 T2409 oaz.ClientCnxn$SendThread.readConnectResult Session establishment complete on server localhost/127.0.0.1:33505, sessionid = 0x139cd693ddb0006, negotiated timeout = 5000
[junit4:junit4]   2> 9942 T2410 oascc.ConnectionManager.process Watcher org.apache.solr.common.cloud.ConnectionManager@782403e9 name:ZooKeeperConnection Watcher:127.0.0.1:33505/solr got event WatchedEvent state:SyncConnected type:None path:null path:null type:None
[junit4:junit4]   2> 9943 T2338 oascc.ConnectionManager.waitForConnected Client is connected to ZooKeeper
[junit4:junit4]   2> 9943 T2343 oazs.PrepRequestProcessor.pRequest Got user-level KeeperException when processing sessionid:0x139cd693ddb0006 type:create cxid:0x1 zxid:0xfffffffffffffffe txntype:unknown reqpath:n/a Error Path:/solr/overseer Error:KeeperErrorCode = NodeExists for /solr/overseer
[junit4:junit4]   2> 9945 T2343 oazs.PrepRequestProcessor.pRequest Got user-level KeeperException when processing sessionid:0x139cd693ddb0006 type:create cxid:0x2 zxid:0xfffffffffffffffe txntype:unknown reqpath:n/a Error Path:/solr/overseer Error:KeeperErrorCode = NodeExists for /solr/overseer
[junit4:junit4]   2> 9952 T2338 oasc.ZkController.createEphemeralLiveNode Register node as live in ZooKeeper:/live_nodes/127.0.0.1:33537_solr
[junit4:junit4]   2> 9953 T2343 oazs.PrepRequestProcessor.pRequest Got user-level KeeperException when processing sessionid:0x139cd693ddb0006 type:delete cxid:0x4 zxid:0xfffffffffffffffe txntype:unknown reqpath:n/a Error Path:/solr/live_nodes/127.0.0.1:33537_solr Error:KeeperErrorCode = NoNode for /solr/live_nodes/127.0.0.1:33537_solr
[junit4:junit4]   2> 9954 T2338 oascc.SolrZkClient.makePath makePath: /live_nodes/127.0.0.1:33537_solr
[junit4:junit4]   2> 9956 T2372 oascc.ZkStateReader$3.process Updating live nodes
[junit4:junit4]   2> 9956 T2384 oascc.ZkStateReader$3.process Updating live nodes
[junit4:junit4]   2> 9956 T2396 oascc.ZkStateReader$3.process Updating live nodes
[junit4:junit4]   2> 9956 T2358 oascc.ZkStateReader$3.process Updating live nodes
[junit4:junit4]   2> 9956 T2338 oashc.HttpShardHandlerFactory.getParameter Setting socketTimeout to: 0
[junit4:junit4]   2> 9957 T2338 oashc.HttpShardHandlerFactory.getParameter Setting urlScheme to: http://
[junit4:junit4]   2> 9957 T2338 oashc.HttpShardHandlerFactory.getParameter Setting connTimeout to: 0
[junit4:junit4]   2> 9958 T2338 oashc.HttpShardHandlerFactory.getParameter Setting maxConnectionsPerHost to: 20
[junit4:junit4]   2> 9958 T2338 oashc.HttpShardHandlerFactory.getParameter Setting corePoolSize to: 0
[junit4:junit4]   2> 9959 T2338 oashc.HttpShardHandlerFactory.getParameter Setting maximumPoolSize to: 2147483647
[junit4:junit4]   2> 9959 T2338 oashc.HttpShardHandlerFactory.getParameter Setting maxThreadIdleTime to: 5
[junit4:junit4]   2> 9960 T2338 oashc.HttpShardHandlerFactory.getParameter Setting sizeOfQueue to: -1
[junit4:junit4]   2> 9960 T2338 oashc.HttpShardHandlerFactory.getParameter Setting fairnessPolicy to: false
[junit4:junit4]   2> 9961 T2338 oascsi.HttpClientUtil.createClient Creating new http client, config:maxConnectionsPerHost=20&maxConnections=10000&socketTimeout=0&connTimeout=0&retry=false
[junit4:junit4]   2> 9978 T2338 oascc.ZkStateReader.createClusterStateWatchersAndUpdate Updating cluster state from ZooKeeper... 
[junit4:junit4]   2> 9987 T2338 oasc.CoreContainer.create Creating SolrCore 'collection1' using instanceDir: /usr/home/hudson/hudson-slave/workspace/Lucene-Solr-Tests-4.x-Java6/solr/build/solr-core/test/J1/./solrtest-jetty4-1347770999469/collection1
[junit4:junit4]   2> 9988 T2338 oasc.ZkController.createCollectionZkNode Check for collection zkNode:collection1
[junit4:junit4]   2> 9989 T2338 oasc.ZkController.createCollectionZkNode Collection zkNode exists
[junit4:junit4]   2> 9989 T2338 oasc.ZkController.readConfigName Load collection config from:/collections/collection1
[junit4:junit4]   2> 9991 T2338 oasc.SolrResourceLoader.<init> new SolrResourceLoader for directory: '/usr/home/hudson/hudson-slave/workspace/Lucene-Solr-Tests-4.x-Java6/solr/build/solr-core/test/J1/./solrtest-jetty4-1347770999469/collection1/'
[junit4:junit4]   2> 9993 T2338 oasc.SolrResourceLoader.replaceClassLoader Adding 'file:/usr/home/hudson/hudson-slave/workspace/Lucene-Solr-Tests-4.x-Java6/solr/build/solr-core/test/J1/solrtest-jetty4-1347770999469/collection1/lib/classes/' to classloader
[junit4:junit4]   2> 9994 T2338 oasc.SolrResourceLoader.replaceClassLoader Adding 'file:/usr/home/hudson/hudson-slave/workspace/Lucene-Solr-Tests-4.x-Java6/solr/build/solr-core/test/J1/solrtest-jetty4-1347770999469/collection1/lib/README' to classloader
[junit4:junit4]   2> 10056 T2338 oasc.SolrConfig.<init> Using Lucene MatchVersion: LUCENE_40
[junit4:junit4]   2> 10125 T2338 oasc.SolrConfig.<init> Loaded SolrConfig: solrconfig.xml
[junit4:junit4]   2> 10226 T2338 oass.IndexSchema.readSchema Reading Solr Schema
[junit4:junit4]   2> 10232 T2338 oass.IndexSchema.readSchema Schema name=test
[junit4:junit4]   2> 10841 T2338 oass.OpenExchangeRatesOrgProvider.init Initialized with rates=open-exchange-rates.json, refreshInterval=1440.
[junit4:junit4]   2> 10849 T2338 oass.IndexSchema.readSchema default search field in schema is text
[junit4:junit4]   2> 10852 T2338 oass.IndexSchema.readSchema unique key field: id
[junit4:junit4]   2> 10860 T2338 oass.FileExchangeRateProvider.reload Reloading exchange rates from file currency.xml
[junit4:junit4]   2> 10863 T2338 oass.FileExchangeRateProvider.reload Reloading exchange rates from file currency.xml
[junit4:junit4]   2> 10867 T2338 oass.OpenExchangeRatesOrgProvider.reload Reloading exchange rates from open-exchange-rates.json
[junit4:junit4]   2> 10867 T2338 oass.OpenExchangeRatesOrgProvider.reload Reloading exchange rates from open-exchange-rates.json
[junit4:junit4]   2> 10868 T2338 oasc.SolrCore.<init> [collection1] Opening new SolrCore at /usr/home/hudson/hudson-slave/workspace/Lucene-Solr-Tests-4.x-Java6/solr/build/solr-core/test/J1/./solrtest-jetty4-1347770999469/collection1/, dataDir=./org.apache.solr.cloud.BasicDistributedZk2Test-1347770990037/jetty4/
[junit4:junit4]   2> 10868 T2338 oasc.JmxMonitoredMap.<init> JMX monitoring is enabled. Adding Solr mbeans to JMX Server: com.sun.jmx.mbeanserver.JmxMBeanServer@65dcc2a3
[junit4:junit4]   2> 10869 T2338 oasc.SolrCore.getNewIndexDir WARNING New index directory detected: old=null new=./org.apache.solr.cloud.BasicDistributedZk2Test-1347770990037/jetty4/index/
[junit4:junit4]   2> 10870 T2338 oasc.SolrCore.initIndex WARNING [collection1] Solr index directory './org.apache.solr.cloud.BasicDistributedZk2Test-1347770990037/jetty4/index' doesn't exist. Creating new index...
[junit4:junit4]   2> 10871 T2338 oasc.CachingDirectoryFactory.get return new directory for /usr/home/hudson/hudson-slave/workspace/Lucene-Solr-Tests-4.x-Java6/solr/build/solr-core/test/J1/./org.apache.solr.cloud.BasicDistributedZk2Test-1347770990037/jetty4/index forceNew:false
[junit4:junit4]   2> 10879 T2338 oasc.SolrDeletionPolicy.onCommit SolrDeletionPolicy.onCommit: commits:num=1
[junit4:junit4]   2> 		commit{dir=NRTCachingDirectory(org.apache.lucene.store.NIOFSDirectory@/usr/home/hudson/hudson-slave/workspace/Lucene-Solr-Tests-4.x-Java6/solr/build/solr-core/test/J1/org.apache.solr.cloud.BasicDistributedZk2Test-1347770990037/jetty4/index lockFactory=org.apache.lucene.store.NativeFSLockFactory@34ff4d94; maxCacheMB=48.0 maxMergeSizeMB=4.0),segFN=segments_1,generation=1,filenames=[segments_1]
[junit4:junit4]   2> 10879 T2338 oasc.SolrDeletionPolicy.updateCommits newest commit = 1
[junit4:junit4]   2> 10880 T2338 oasc.SolrCore.initWriters created xml: solr.XMLResponseWriter
[junit4:junit4]   2> 10882 T2338 oasup.UpdateRequestProcessorChain.init inserting DistributedUpdateProcessorFactory into updateRequestProcessorChain "dedupe"
[junit4:junit4]   2> 10882 T2338 oasup.UpdateRequestProcessorChain.init inserting DistributedUpdateProcessorFactory into updateRequestProcessorChain "dedupe-allfields"
[junit4:junit4]   2> 10883 T2338 oasup.UpdateRequestProcessorChain.init inserting DistributedUpdateProcessorFactory into updateRequestProcessorChain "stored_sig"
[junit4:junit4]   2> 10883 T2338 oasup.UpdateRequestProcessorChain.init inserting DistributedUpdateProcessorFactory into updateRequestProcessorChain "uniq-fields"
[junit4:junit4]   2> 10884 T2338 oasup.UpdateRequestProcessorChain.init inserting DistributedUpdateProcessorFactory into updateRequestProcessorChain "distrib-dup-test-chain-implicit"
[junit4:junit4]   2> 10884 T2338 oasc.RequestHandlers.initHandlersFromConfig adding lazy requestHandler: solr.ReplicationHandler
[junit4:junit4]   2> 10884 T2338 oasc.RequestHandlers.initHandlersFromConfig created /replication: solr.ReplicationHandler
[junit4:junit4]   2> 10885 T2338 oasc.RequestHandlers.initHandlersFromConfig created standard: solr.StandardRequestHandler
[junit4:junit4]   2> 10885 T2338 oasc.RequestHandlers.initHandlersFromConfig created /get: solr.RealTimeGetHandler
[junit4:junit4]   2> 10886 T2338 oasc.RequestHandlers.initHandlersFromConfig created dismax: solr.SearchHandler
[junit4:junit4]   2> 10886 T2338 oasc.RequestHandlers.initHandlersFromConfig created mock: org.apache.solr.core.MockQuerySenderListenerReqHandler
[junit4:junit4]   2> 10887 T2338 oasc.RequestHandlers.initHandlersFromConfig created /admin/: org.apache.solr.handler.admin.AdminHandlers
[junit4:junit4]   2> 10887 T2338 oasc.RequestHandlers.initHandlersFromConfig created defaults: solr.StandardRequestHandler
[junit4:junit4]   2> 10888 T2338 oasc.RequestHandlers.initHandlersFromConfig adding lazy requestHandler: solr.StandardRequestHandler
[junit4:junit4]   2> 10888 T2338 oasc.RequestHandlers.initHandlersFromConfig created lazy: solr.StandardRequestHandler
[junit4:junit4]   2> 10888 T2338 oasc.RequestHandlers.initHandlersFromConfig created /update: solr.UpdateRequestHandler
[junit4:junit4]   2> 10889 T2338 oasc.RequestHandlers.initHandlersFromConfig created /terms: org.apache.solr.handler.component.SearchHandler
[junit4:junit4]   2> 10889 T2338 oasc.RequestHandlers.initHandlersFromConfig created spellCheckCompRH: org.apache.solr.handler.component.SearchHandler
[junit4:junit4]   2> 10890 T2338 oasc.RequestHandlers.initHandlersFromConfig created spellCheckCompRH_Direct: org.apache.solr.handler.component.SearchHandler
[junit4:junit4]   2> 10890 T2338 oasc.RequestHandlers.initHandlersFromConfig created spellCheckWithWordbreak: org.apache.solr.handler.component.SearchHandler
[junit4:junit4]   2> 10891 T2338 oasc.RequestHandlers.initHandlersFromConfig created spellCheckWithWordbreak_Direct: org.apache.solr.handler.component.SearchHandler
[junit4:junit4]   2> 10891 T2338 oasc.RequestHandlers.initHandlersFromConfig created spellCheckCompRH1: org.apache.solr.handler.component.SearchHandler
[junit4:junit4]   2> 10892 T2338 oasc.RequestHandlers.initHandlersFromConfig created tvrh: org.apache.solr.handler.component.SearchHandler
[junit4:junit4]   2> 10892 T2338 oasc.RequestHandlers.initHandlersFromConfig created /mlt: solr.MoreLikeThisHandler
[junit4:junit4]   2> 10893 T2338 oasc.RequestHandlers.initHandlersFromConfig created /debug/dump: solr.DumpRequestHandler
[junit4:junit4]   2> 10895 T2338 oashl.XMLLoader.init xsltCacheLifetimeSeconds=60
[junit4:junit4]   2> 10898 T2338 oasc.SolrCore.initDeprecatedSupport WARNING solrconfig.xml uses deprecated <admin/gettableFiles>, Please update your config to use the ShowFileRequestHandler.
[junit4:junit4]   2> 10899 T2338 oasc.SolrCore.initDeprecatedSupport WARNING adding ShowFileRequestHandler with hidden files: [SCHEMA.XML, OLD_SYNONYMS.TXT, STOPWORDS.TXT, PROTWORDS.TXT, OPEN-EXCHANGE-RATES.JSON, SYNONYMS.TXT, CURRENCY.XML, MAPPING-ISOLATIN1ACCENT.TXT]
[junit4:junit4]   2> 10902 T2338 oass.SolrIndexSearcher.<init> Opening Searcher@6b4b6371 main
[junit4:junit4]   2> 10903 T2338 oasu.CommitTracker.<init> Hard AutoCommit: disabled
[junit4:junit4]   2> 10903 T2338 oasu.CommitTracker.<init> Soft AutoCommit: disabled
[junit4:junit4]   2> 10904 T2338 oashc.SpellCheckComponent.inform Initializing spell checkers
[junit4:junit4]   2> 10909 T2338 oass.DirectSolrSpellChecker.init init: {name=direct,classname=DirectSolrSpellChecker,field=lowerfilt,minQueryLength=3}
[junit4:junit4]   2> 10957 T2411 oasc.SolrCore.registerSearcher [collection1] Registered new searcher Searcher@6b4b6371 main{StandardDirectoryReader(segments_1:1)}
[junit4:junit4]   2> 11365 T2359 oascc.ZkStateReader.updateClusterState Updating cloud state from ZooKeeper... 
[junit4:junit4]   2> 11377 T2384 oascc.ZkStateReader$2.process A cluster state change has occurred - updating...
[junit4:junit4]   2> 11377 T2372 oascc.ZkStateReader$2.process A cluster state change has occurred - updating...
[junit4:junit4]   2> 11377 T2358 oascc.ZkStateReader$2.process A cluster state change has occurred - updating...
[junit4:junit4]   2> 11377 T2396 oascc.ZkStateReader$2.process A cluster state change has occurred - updating...
[junit4:junit4]   2> 11377 T2410 oascc.ZkStateReader$2.process A cluster state change has occurred - updating...
[junit4:junit4]   2> 11463 T2338 oasc.CoreContainer.register registering core: collection1
[junit4:junit4]   2> 11463 T2338 oasc.ZkController.register Register shard - core:collection1 address:http://127.0.0.1:33537/solr shardId:shard2
[junit4:junit4]   2> 11466 T2338 oasc.ZkController.register We are http://127.0.0.1:33537/solr/collection1/ and leader is http://127.0.0.1:33525/solr/collection1/
[junit4:junit4]   2> 11466 T2338 oasc.ZkController.register No LogReplay needed for core=collection1 baseURL=http://127.0.0.1:33537/solr
[junit4:junit4]   2> 11466 T2338 oasc.ZkController.checkRecovery Core needs to recover:collection1
[junit4:junit4]   2> 11467 T2338 oasu.DefaultSolrCoreState.doRecovery Running recovery - first canceling any ongoing recovery
[junit4:junit4]   2> ASYNC  NEW_CORE C140 name=collection1 org.apache.solr.core.SolrCore@261105fb url=http://127.0.0.1:33537/solr/collection1 node=127.0.0.1:33537_solr
[junit4:junit4]   2> 11468 T2412 C140 P33537 oasc.RecoveryStrategy.run Starting recovery process.  core=collection1 recoveringAfterStartup=true
[junit4:junit4]   2> 11468 T2338 oascc.ZkStateReader.updateClusterState Updating cloud state from ZooKeeper... 
[junit4:junit4]   2> 11469 T2412 C140 P33537 oasc.RecoveryStrategy.doRecovery ###### startupVersions=[]
[junit4:junit4]   2> 11469 T2338 oass.SolrDispatchFilter.init user.dir=/usr/home/hudson/hudson-slave/workspace/Lucene-Solr-Tests-4.x-Java6/solr/build/solr-core/test/J1
[junit4:junit4]   2> 11469 T2338 oass.SolrDispatchFilter.init SolrDispatchFilter.init() done
[junit4:junit4]   2> 11470 T2338 oascsi.HttpClientUtil.createClient Creating new http client, config:maxConnections=128&maxConnectionsPerHost=32&followRedirects=false
[junit4:junit4]   2> 11478 T2412 C140 P33537 oasc.RecoveryStrategy.doRecovery Attempting to PeerSync from http://127.0.0.1:33525/solr/collection1/ core=collection1 - recoveringAfterStartup=true
[junit4:junit4]   2> 11478 T2412 C140 P33537 oasu.PeerSync.sync PeerSync: core=collection1 url=http://127.0.0.1:33537/solr START replicas=[http://127.0.0.1:33525/solr/collection1/] nUpdates=100
[junit4:junit4]   2> 11478 T2412 C140 P33537 oasu.PeerSync.sync WARNING no frame of reference to tell of we've missed updates
[junit4:junit4]   2> 11479 T2412 C140 P33537 oasc.RecoveryStrategy.doRecovery PeerSync Recovery was not successful - trying replication. core=collection1
[junit4:junit4]   2> 11479 T2412 C140 P33537 oasc.RecoveryStrategy.doRecovery Starting Replication Recovery. core=collection1
[junit4:junit4]   2> 11479 T2412 C140 P33537 oascsi.HttpClientUtil.createClient Creating new http client, config:maxConnections=128&maxConnectionsPerHost=32&followRedirects=false
[junit4:junit4]   2> 11480 T2338 oaz.ZooKeeper.<init> Initiating client connection, connectString=127.0.0.1:33505/solr sessionTimeout=10000 watcher=org.apache.solr.common.cloud.ConnectionManager@3b397534
[junit4:junit4]   2> 11481 T2414 oaz.ClientCnxn$SendThread.startConnect Opening socket connection to server /127.0.0.1:33505
[junit4:junit4]   2> 11481 T2338 oascc.ConnectionManager.waitForConnected Waiting for client to connect to ZooKeeper
[junit4:junit4]   2> 11482 T2414 oaz.ClientCnxn$SendThread.primeConnection Socket connection established to localhost/127.0.0.1:33505, initiating session
[junit4:junit4]   2> 11482 T2340 oazs.NIOServerCnxn$Factory.run Accepted socket connection from /140.211.11.196:33543
[junit4:junit4]   2> 11482 T2340 oazs.NIOServerCnxn.readConnectRequest Client attempting to establish new session at /140.211.11.196:33543
[junit4:junit4]   2> 11483 T2414 oaz.ClientCnxn$SendThread.readConnectResult Session establishment complete on server localhost/127.0.0.1:33505, sessionid = 0x139cd693ddb0007, negotiated timeout = 10000
[junit4:junit4]   2> 11483 T2342 oazs.NIOServerCnxn.finishSessionInit Established session 0x139cd693ddb0007 with negotiated timeout 10000 for client /140.211.11.196:33543
[junit4:junit4]   2> 11484 T2415 oascc.ConnectionManager.process Watcher org.apache.solr.common.cloud.ConnectionManager@3b397534 name:ZooKeeperConnection Watcher:127.0.0.1:33505/solr got event WatchedEvent state:SyncConnected type:None path:null path:null type:None
[junit4:junit4]   2> 11484 T2338 oascc.ConnectionManager.waitForConnected Client is connected to ZooKeeper
[junit4:junit4]   2> 11485 T2338 oascc.ZkStateReader.createClusterStateWatchersAndUpdate Updating cluster state from ZooKeeper... 
[junit4:junit4]   2> 11486 T2338 oasc.ChaosMonkey.monkeyLog monkey: init - expire sessions:true cause connection loss:true
[junit4:junit4]   2> 11486 T2338 oascsi.HttpClientUtil.createClient Creating new http client, config:
[junit4:junit4]   2> ASYNC  NEW_CORE C141 name=collection1 org.apache.solr.core.SolrCore@23c9ee9c url=http://127.0.0.1:33525/solr/collection1 node=127.0.0.1:33525_solr
[junit4:junit4]   2> 11489 T2376 C141 P33525 REQ /get {distrib=false&qt=/get&wt=javabin&version=2&getVersions=100} status=0 QTime=1 
[junit4:junit4]   2> 11495 T2338 oascc.ZkStateReader.updateClusterState Updating cloud state from ZooKeeper... 
[junit4:junit4]   2> ASYNC  NEW_CORE C142 name=collection1 org.apache.solr.core.SolrCore@3b4a8af7 url=http://127.0.0.1:33514/solr/collection1 node=127.0.0.1:33514_solr
[junit4:junit4]   2> 11506 T2350 C142 P33514 oasc.SolrDeletionPolicy.onInit SolrDeletionPolicy.onInit: commits:num=1
[junit4:junit4]   2> 		commit{dir=NRTCachingDirectory(org.apache.lucene.store.NIOFSDirectory@/usr/home/hudson/hudson-slave/workspace/Lucene-Solr-Tests-4.x-Java6/solr/build/solr-core/test/J1/org.apache.solr.cloud.BasicDistributedZk2Test-1347770990037/control/data/index lockFactory=org.apache.lucene.store.NativeFSLockFactory@1f586234; maxCacheMB=48.0 maxMergeSizeMB=4.0),segFN=segments_1,generation=1,filenames=[segments_1]
[junit4:junit4]   2> 11506 T2350 C142 P33514 oasc.SolrDeletionPolicy.updateCommits newest commit = 1
[junit4:junit4]   2> 11510 T2350 C142 P33514 /update {wt=javabin&version=2} {add=[1 (1413240325706612736)]} 0 9
[junit4:junit4]   2> 11510 T2338 oaz.ZooKeeper.<init> Initiating client connection, connectString=127.0.0.1:33505/solr sessionTimeout=10000 watcher=org.apache.solr.common.cloud.ConnectionManager@3abd4c13
[junit4:junit4]   2> 11511 T2416 oaz.ClientCnxn$SendThread.startConnect Opening socket connection to server /127.0.0.1:33505
[junit4:junit4]   2> 11511 T2338 oascc.ConnectionManager.waitForConnected Waiting for client to connect to ZooKeeper
[junit4:junit4]   2> 11512 T2416 oaz.ClientCnxn$SendThread.primeConnection Socket connection established to localhost/127.0.0.1:33505, initiating session
[junit4:junit4]   2> 11512 T2340 oazs.NIOServerCnxn$Factory.run Accepted socket connection from /140.211.11.196:33547
[junit4:junit4]   2> 11512 T2340 oazs.NIOServerCnxn.readConnectRequest Client attempting to establish new session at /140.211.11.196:33547
[junit4:junit4]   2> 11514 T2342 oazs.NIOServerCnxn.finishSessionInit Established session 0x139cd693ddb0008 with negotiated timeout 10000 for client /140.211.11.196:33547
[junit4:junit4]   2> 11514 T2416 oaz.ClientCnxn$SendThread.readConnectResult Session establishment complete on server localhost/127.0.0.1:33505, sessionid = 0x139cd693ddb0008, negotiated timeout = 10000
[junit4:junit4]   2> 11515 T2417 oascc.ConnectionManager.process Watcher org.apache.solr.common.cloud.ConnectionManager@3abd4c13 name:ZooKeeperConnection Watcher:127.0.0.1:33505/solr got event WatchedEvent state:SyncConnected type:None path:null path:null type:None
[junit4:junit4]   2> 11515 T2338 oascc.ConnectionManager.waitForConnected Client is connected to ZooKeeper
[junit4:junit4]   2> 11516 T2338 oascc.ZkStateReader.createClusterStateWatchersAndUpdate Updating cluster state from ZooKeeper... 
[junit4:junit4]   2> 11523 T2366 C139 P33521 oasc.SolrDeletionPolicy.onInit SolrDeletionPolicy.onInit: commits:num=1
[junit4:junit4]   2> 		commit{dir=NRTCachingDirectory(org.apache.lucene.store.NIOFSDirectory@/usr/home/hudson/hudson-slave/workspace/Lucene-Solr-Tests-4.x-Java6/solr/build/solr-core/test/J1/org.apache.solr.cloud.BasicDistributedZk2Test-1347770990037/jetty1/index lockFactory=org.apache.lucene.store.NativeFSLockFactory@2069a59d; maxCacheMB=48.0 maxMergeSizeMB=4.0),segFN=segments_1,generation=1,filenames=[segments_1]
[junit4:junit4]   2> 11523 T2366 C139 P33521 oasc.SolrDeletionPolicy.updateCommits newest commit = 1
[junit4:junit4]   2>  C138_STATE=coll:collection1 core:collection1 props:{shard=shard1, roles=null, state=recovering, core=collection1, collection=collection1, node_name=127.0.0.1:33531_solr, base_url=http://127.0.0.1:33531/solr}
[junit4:junit4]   2> 11537 T2388 C138 P33531 oasc.SolrDeletionPolicy.onInit SolrDeletionPolicy.onInit: commits:num=1
[junit4:junit4]   2> 		commit{dir=NRTCachingDirectory(org.apache.lucene.store.NIOFSDirectory@/usr/home/hudson/hudson-slave/workspace/Lucene-Solr-Tests-4.x-Java6/solr/build/solr-core/test/J1/org.apache.solr.cloud.BasicDistributedZk2Test-1347770990037/jetty3/index lockFactory=org.apache.lucene.store.NativeFSLockFactory@126d805f; maxCacheMB=48.0 maxMergeSizeMB=4.0),segFN=segments_1,generation=1,filenames=[segments_1]
[junit4:junit4]   2> 11538 T2388 C138 P33531 oasc.SolrDeletionPolicy.updateCommits newest commit = 1
[junit4:junit4]   2> 11541 T2388 C138 P33531 REQ /update {update.distrib=FROMLEADER&distrib.from=http://127.0.0.1:33521/solr/collection1/&wt=javabin&version=2} status=0 QTime=7 
[junit4:junit4]   2> 11541 T2366 C139 P33521 REQ /update {distrib.from=http://127.0.0.1:33525/solr/collection1/&update.distrib=TOLEADER&wt=javabin&version=2} status=0 QTime=22 
[junit4:junit4]   2> 11542 T2378 C141 P33525 /update {wt=javabin&version=2} {add=[1]} 0 24
[junit4:junit4]   2> 11542 T2338 oasc.AbstractDistribZkTestBase.waitForRecoveriesToFinish Wait for recoveries to finish - collection: collection1 failOnTimeout:true timeout (sec):1800
[junit4:junit4]   2> 11543 T2338 oascc.ZkStateReader.updateClusterState Updating cloud state from ZooKeeper... 
[junit4:junit4]   2> 11880 T2359 oascc.ZkStateReader.updateClusterState Updating cloud state from ZooKeeper... 
[junit4:junit4]   2> 11893 T2415 oascc.ZkStateReader$2.process A cluster state change has occurred - updating...
[junit4:junit4]   2> 11893 T2396 oascc.ZkStateReader$2.process A cluster state change has occurred - updating...
[junit4:junit4]   2> 11893 T2410 oascc.ZkStateReader$2.process A cluster state change has occurred - updating...
[junit4:junit4]   2> 11893 T2417 oascc.ZkStateReader$2.process A cluster state change has occurred - updating...
[junit4:junit4]   2> 11893 T2358 oascc.ZkStateReader$2.process A cluster state change has occurred - updating...
[junit4:junit4]   2> 11893 T2384 oascc.ZkStateReader$2.process A cluster state change has occurred - updating...
[junit4:junit4]   2> 11893 T2372 oascc.ZkStateReader$2.process A cluster state change has occurred - updating...
[junit4:junit4]   2> 12438 T2398 C138 P33531 oasc.RecoveryStrategy.doRecovery Begin buffering updates. core=collection1
[junit4:junit4]   2> 12438 T2398 C138 P33531 oasu.UpdateLog.bufferUpdates Starting to buffer updates. FSUpdateLog{state=ACTIVE, tlog=tlog{file=./org.apache.solr.cloud.BasicDistributedZk2Test-1347770990037/jetty3/tlog/tlog.0000000000000000000 refcount=1}}
[junit4:junit4]   2> 12438 T2398 C138 P33531 oasc.RecoveryStrategy.replicate Attempting to replicate from http://127.0.0.1:33521/solr/collection1/. core=collection1
[junit4:junit4]   2> 12438 T2398 C138 P33531 oascsi.HttpClientUtil.createClient Creating new http client, config:maxConnections=128&maxConnectionsPerHost=32&followRedirects=false
[junit4:junit4]   2> 12456 T2367 C139 P33521 oasu.DirectUpdateHandler2.commit start commit{flags=0,_version_=0,optimize=false,openSearcher=true,waitSearcher=true,expungeDeletes=false,softCommit=false}
[junit4:junit4]   2> 12545 T2338 oascc.ZkStateReader.updateClusterState Updating cloud state from ZooKeeper... 
[junit4:junit4]   2> 12610 T2367 C139 P33521 oasc.SolrDeletionPolicy.onCommit SolrDeletionPolicy.onCommit: commits:num=2
[junit4:junit4]   2> 		commit{dir=NRTCachingDirectory(org.apache.lucene.store.NIOFSDirectory@/usr/home/hudson/hudson-slave/workspace/Lucene-Solr-Tests-4.x-Java6/solr/build/solr-core/test/J1/org.apache.solr.cloud.BasicDistributedZk2Test-1347770990037/jetty1/index lockFactory=org.apache.lucene.store.NativeFSLockFactory@2069a59d; maxCacheMB=48.0 maxMergeSizeMB=4.0),segFN=segments_1,generation=1,filenames=[segments_1]
[junit4:junit4]   2> 		commit{dir=NRTCachingDirectory(org.apache.lucene.store.NIOFSDirectory@/usr/home/hudson/hudson-slave/workspace/Lucene-Solr-Tests-4.x-Java6/solr/build/solr-core/test/J1/org.apache.solr.cloud.BasicDistributedZk2Test-1347770990037/jetty1/index lockFactory=org.apache.lucene.store.NativeFSLockFactory@2069a59d; maxCacheMB=48.0 maxMergeSizeMB=4.0),segFN=segments_2,generation=2,filenames=[_0_Asserting_0.tim, _0_Block_0.tip, _0_Block_0.pos, _0_Asserting_0.tip, _0_Block_0.tim, _0_Asserting_0.prx, _0.si, _0.fnm, _0_Block_0.doc, _0_nrm.cfs, _0_Direct_0.frq, _0_MockRandom_0.skp, _0_MockRandom_0.frq, _0_MockRandom_0.sd, _0_Asserting_0.frq, _0_MockRandom_0.tip, _0_MockRandom_0.doc, _0_MockRandom_0.pos, _0_nrm.cfe, segments_2, _0.fdx, _0_Direct_0.tip, _0_Direct_0.prx, _0_MockRandom_0.pyl, _0_Direct_0.tim, _0_MockRandom_0.tim, _0.fdt]
[junit4:junit4]   2> 12611 T2367 C139 P33521 oasc.SolrDeletionPolicy.updateCommits newest commit = 2
[junit4:junit4]   2> 12627 T2367 C139 P33521 oass.SolrIndexSearcher.<init> Opening Searcher@9897d9e main
[junit4:junit4]   2> 12627 T2367 C139 P33521 oasu.DirectUpdateHandler2.commit end_commit_flush
[junit4:junit4]   2> 12629 T2373 oasc.SolrCore.registerSearcher [collection1] Registered new searcher Searcher@9897d9e main{StandardDirectoryReader(segments_2:3 _0(4.0.0.2):C1)}
[junit4:junit4]   2> 12629 T2367 C139 P33521 /update {waitSearcher=true&commit=true&commit_end_point=true&wt=javabin&softCommit=false&version=2} {commit=} 0 173
[junit4:junit4]   2> 12630 T2398 C138 P33531 oash.ReplicationHandler.inform Commits will be reserved for  10000
[junit4:junit4]   2> 12631 T2398 C138 P33531 oash.SnapPuller.<init>  No value set for 'pollInterval'. Timer Task not started.
[junit4:junit4]   2> 12633 T2368 C139 P33521 oash.ReplicationHandler.inform Commits will be reserved for  10000
[junit4:junit4]   2> 12633 T2368 C139 P33521 REQ /replication {command=indexversion&wt=javabin&qt=/replication&version=2} status=0 QTime=1 
[junit4:junit4]   2> 12634 T2398 C138 P33531 oash.SnapPuller.fetchLatestIndex Master's generation: 2
[junit4:junit4]   2> 12634 T2398 C138 P33531 oash.SnapPuller.fetchLatestIndex Slave's generation: 1
[junit4:junit4]   2> 12634 T2398 C138 P33531 oash.SnapPuller.fetchLatestIndex Starting replication process
[junit4:junit4]   2> 12639 T2368 C139 P33521 REQ /replication {command=filelist&generation=2&wt=javabin&qt=/replication&version=2} status=0 QTime=3 
[junit4:junit4]   2> 12640 T2398 C138 P33531 oash.SnapPuller.fetchLatestIndex Number of files in latest index in master: 27
[junit4:junit4]   2> 12647 T2398 C138 P33531 oash.SnapPuller.fetchLatestIndex Starting download to ./org.apache.solr.cloud.BasicDistributedZk2Test-1347770990037/jetty3/index.20120916125002674 fullCopy=true
[junit4:junit4]   2> 12650 T2368 C139 P33521 REQ /replication {file=_0_Asserting_0.tim&command=filecontent&checksum=true&generation=2&qt=/replication&wt=filestream} status=0 QTime=0 
[junit4:junit4]   2> 12655 T2368 C139 P33521 REQ /replication {file=_0_Block_0.pos&command=filecontent&checksum=true&generation=2&qt=/replication&wt=filestream} status=0 QTime=0 
[junit4:junit4]   2> 12659 T2368 C139 P33521 REQ /replication {file=_0_Block_0.tip&command=filecontent&checksum=true&generation=2&qt=/replication&wt=filestream} status=0 QTime=0 
[junit4:junit4]   2> 12663 T2368 C139 P33521 REQ /replication {file=_0_Asserting_0.tip&command=filecontent&checksum=true&generation=2&qt=/replication&wt=filestream} status=0 QTime=0 
[junit4:junit4]   2> 12667 T2368 C139 P33521 REQ /replication {file=_0_Block_0.tim&command=filecontent&checksum=true&generation=2&qt=/replication&wt=filestream} status=0 QTime=0 
[junit4:junit4]   2> 12671 T2368 C139 P33521 REQ /replication {file=_0_Asserting_0.prx&command=filecontent&checksum=true&generation=2&qt=/replication&wt=filestream} status=0 QTime=0 
[junit4:junit4]   2> 12681 T2368 C139 P33521 REQ /replication {file=_0.si&command=filecontent&checksum=true&generation=2&qt=/replication&wt=filestream} status=0 QTime=0 
[junit4:junit4]   2> 12685 T2368 C139 P33521 REQ /replication {file=_0_Block_0.doc&command=filecontent&checksum=true&generation=2&qt=/replication&wt=filestream} status=0 QTime=0 
[junit4:junit4]   2> 12689 T2368 C139 P33521 REQ /replication {file=_0.fnm&command=filecontent&checksum=true&generation=2&qt=/replication&wt=filestream} status=0 QTime=0 
[junit4:junit4]   2> 12693 T2368 C139 P33521 REQ /replication {file=_0_nrm.cfs&command=filecontent&checksum=true&generation=2&qt=/replication&wt=filestream} status=0 QTime=0 
[junit4:junit4]   2> 12697 T2368 C139 P33521 REQ /replication {file=_0_Direct_0.frq&command=filecontent&checksum=true&generation=2&qt=/replication&wt=filestream} status=0 QTime=0 
[junit4:junit4]   2> 12701 T2368 C139 P33521 REQ /replication {file=_0_MockRandom_0.skp&command=filecontent&checksum=true&generation=2&qt=/replication&wt=filestream} status=0 QTime=0 
[junit4:junit4]   2> 12702 T2398 C138 P33531 oash.SnapPuller$FileFetcher.fetchPackets WARNING No content recieved for file: {name=_0_MockRandom_0.skp, lastmodified=1347771002000, size=0}
[junit4:junit4]   2> 12705 T2368 C139 P33521 REQ /replication {file=_0_MockRandom_0.tip&command=filecontent&checksum=true&generation=2&qt=/replication&wt=filestream} status=0 QTime=0 
[junit4:junit4]   2> 12709 T2368 C139 P33521 REQ /replication {file=_0_Asserting_0.frq&command=filecontent&checksum=true&generation=2&qt=/replication&wt=filestream} status=0 QTime=0 
[junit4:junit4]   2> 12713 T2368 C139 P33521 REQ /replication {file=_0_MockRandom_0.sd&command=filecontent&checksum=true&generation=2&qt=/replication&wt=filestream} status=0 QTime=0 
[junit4:junit4]   2> 12717 T2368 C139 P33521 REQ /replication {file=_0_MockRandom_0.frq&command=filecontent&checksum=true&generation=2&qt=/replication&wt=filestream} status=0 QTime=0 
[junit4:junit4]   2> 12721 T2368 C139 P33521 REQ /replication {file=_0_MockRandom_0.doc&command=filecontent&checksum=true&generation=2&qt=/replication&wt=filestream} status=0 QTime=0 
[junit4:junit4]   2> 12725 T2368 C139 P33521 REQ /replication {file=_0_nrm.cfe&command=filecontent&checksum=true&generation=2&qt=/replication&wt=filestream} status=0 QTime=0 
[junit4:junit4]   2> 12729 T2368 C139 P33521 REQ /replication {file=_0_MockRandom_0.pos&command=filecontent&checksum=true&generation=2&qt=/replication&wt=filestream} status=0 QTime=0 
[junit4:junit4]   2> 12733 T2368 C139 P33521 REQ /replication {file=segments_2&command=filecontent&checksum=true&generation=2&qt=/replication&wt=filestream} status=0 QTime=0 
[junit4:junit4]   2> 12737 T2368 C139 P33521 REQ /replication {file=_0_Direct_0.tip&command=filecontent&checksum=true&generation=2&qt=/replication&wt=filestream} status=0 QTime=0 
[junit4:junit4]   2> 12741 T2368 C139 P33521 REQ /replication {file=_0.fdx&command=filecontent&checksum=true&generation=2&qt=/replication&wt=filestream} status=0 QTime=0 
[junit4:junit4]   2> 12745 T2368 C139 P33521 REQ /replication {file=_0_Direct_0.prx&command=filecontent&checksum=true&generation=2&qt=/replication&wt=filestream} status=0 QTime=0 
[junit4:junit4]   2> 12749 T2368 C139 P33521 REQ /replication {file=_0_MockRandom_0.pyl&command=filecontent&checksum=true&generation=2&qt=/replication&wt=filestream} status=0 QTime=0 
[junit4:junit4]   2> 12750 T2398 C138 P33531 oash.SnapPuller$FileFetcher.fetchPackets WARNING No content recieved for file: {name=_0_MockRandom_0.pyl, lastmodified=1347771002000, size=0}
[junit4:junit4]   2> 12753 T2368 C139 P33521 REQ /replication {file=_0_MockRandom_0.tim&command=filecontent&checksum=true&generation=2&qt=/replication&wt=filestream} status=0 QTime=0 
[junit4:junit4]   2> 12757 T2368 C139 P33521 REQ /replication {file=_0_Direct_0.tim&command=filecontent&checksum=true&generation=2&qt=/replication&wt=filestream} status=0 QTime=0 
[junit4:junit4]   2> 12761 T2368 C139 P33521 REQ /replication {file=_0.fdt&command=filecontent&checksum=true&generation=2&qt=/replication&wt=filestream} status=0 QTime=0 
[junit4:junit4]   2> 12763 T2398 C138 P33531 oash.SnapPuller.fetchLatestIndex Total time taken for download : 0 secs
[junit4:junit4]   2> 12763 T2398 C138 P33531 oash.SnapPuller.modifyIndexProps New index installed. Updating index properties... index=index.20120916125002674
[junit4:junit4]   2> 12765 T2398 C138 P33531 oasu.DefaultSolrCoreState.newIndexWriter Creating new IndexWriter...
[junit4:junit4]   2> 12765 T2398 C138 P33531 oasu.DefaultSolrCoreState.newIndexWriter Waiting until IndexWriter is unused... core=collection1
[junit4:junit4]   2> 12765 T2398 C138 P33531 oasu.DefaultSolrCoreState.newIndexWriter Rollback old IndexWriter... core=collection1
[junit4:junit4]   2> 12770 T2398 C138 P33531 oasc.SolrCore.getNewIndexDir WARNING New index directory detected: old=./org.apache.solr.cloud.BasicDistributedZk2Test-1347770990037/jetty3/index/ new=./org.apache.solr.cloud.BasicDistributedZk2Test-1347770990037/jetty3/index.20120916125002674
[junit4:junit4]   2> 12771 T2398 C138 P33531 oasc.CachingDirectoryFactory.get return new directory for /usr/home/hudson/hudson-slave/workspace/Lucene-Solr-Tests-4.x-Java6/solr/build/solr-core/test/J1/./org.apache.solr.cloud.BasicDistributedZk2Test-1347770990037/jetty3/index.20120916125002674 forceNew:true
[junit4:junit4]   2> 12782 T2398 C138 P33531 oasc.SolrDeletionPolicy.onInit SolrDeletionPolicy.onInit: commits:num=1
[junit4:junit4]   2> 		commit{dir=NRTCachingDirectory(org.apache.lucene.store.NIOFSDirectory@/usr/home/hudson/hudson-slave/workspace/Lucene-Solr-Tests-4.x-Java6/solr/build/solr-core/test/J1/org.apache.solr.cloud.BasicDistributedZk2Test-1347770990037/jetty3/index.20120916125002674 lockFactory=org.apache.lucene.store.NativeFSLockFactory@1893e502; maxCacheMB=48.0 maxMergeSizeMB=4.0),segFN=segments_2,generation=2,filenames=[_0_Asserting_0.tim, _0_Block_0.pos, _0_Block_0.tip, _0_Asserting_0.tip, _0_Block_0.tim, _0_Asserting_0.prx, _0.si, _0_Block_0.doc, _0.fnm, _0_nrm.cfs, _0_Direct_0.frq, _0_MockRandom_0.skp, _0_MockRandom_0.frq, _0_MockRandom_0.sd, _0_Asserting_0.frq, _0_MockRandom_0.tip, _0_MockRandom_0.doc, _0_MockRandom_0.pos, _0_nrm.cfe, segments_2, _0.fdx, _0_Direct_0.tip, _0_Direct_0.prx, _0_MockRandom_0.pyl, _0_Direct_0.tim, _0_MockRandom_0.tim, _0.fdt]
[junit4:junit4]   2> 12783 T2398 C138 P33531 oasc.SolrDeletionPolicy.updateCommits newest commit = 2
[junit4:junit4]   2> 12783 T2398 C138 P33531 oasu.DefaultSolrCoreState.newIndexWriter New IndexWriter is ready to be used.
[junit4:junit4]   2> 12787 T2398 C138 P33531 oass.SolrIndexSearcher.<init> Opening Searcher@60af7190 main
[junit4:junit4]   2> 12789 T2397 oasc.SolrCore.registerSearcher [collection1] Registered new searcher Searcher@60af7190 main{StandardDirectoryReader(segments_2:3:nrt _0(4.0.0.2):C1)}
[junit4:junit4]   2> 12789 T2397 oasc.CachingDirectoryFactory.close Closing directory:/usr/home/hudson/hudson-slave/workspace/Lucene-Solr-Tests-4.x-Java6/solr/build/solr-core/test/J1/./org.apache.solr.cloud.BasicDistributedZk2Test-1347770990037/jetty3/index
[junit4:junit4]   2> 12790 T2397 oash.SnapPuller$2.onClose removing old index directory ./org.apache.solr.cloud.BasicDistributedZk2Test-1347770990037/jetty3/index
[junit4:junit4]   2> 12792 T2398 C138 P33531 oasu.DirectUpdateHandler2.commit start commit{flags=0,_version_=0,optimize=false,openSearcher=false,waitSearcher=false,expungeDeletes=false,softCommit=false}
[junit4:junit4]   2> 12793 T2398 C138 P33531 oasu.DirectUpdateHandler2.commit end_commit_flush
[junit4:junit4]   2> 12793 T2398 C138 P33531 oasc.RecoveryStrategy.replay Replaying buffered documents. core=collection1
[junit4:junit4]   2> 12793 T2421 C138 P33531 oasu.UpdateLog$LogReplayer.doReplay WARNING Starting log replay tlog{file=./org.apache.solr.cloud.BasicDistributedZk2Test-1347770990037/jetty3/tlog/tlog.0000000000000000000 refcount=2} active=true starting pos=430
[junit4:junit4]   2> 12793 T2421 C138 P33531 oasu.DirectUpdateHandler2.commit start commit{flags=2,_version_=0,optimize=false,openSearcher=true,waitSearcher=true,expungeDeletes=false,softCommit=false}
[junit4:junit4]   2> 12795 T2421 C138 P33531 oass.SolrIndexSearcher.<init> Opening Searcher@1621d93 main
[junit4:junit4]   2> 12795 T2421 C138 P33531 oasu.DirectUpdateHandler2.commit end_commit_flush
[junit4:junit4]   2> 12797 T2397 oasc.SolrCore.registerSearcher [collection1] Registered new searcher Searcher@1621d93 main{StandardDirectoryReader(segments_2:3:nrt _0(4.0.0.2):C1)}
[junit4:junit4]   2> 12797 T2421 C138 P33531 oasu.UpdateLog$LogReplayer.run WARNING Log replay finished. recoveryInfo=RecoveryInfo{adds=0 deletes=0 deleteByQuery=0 errors=0 positionOfStart=430}
[junit4:junit4]   2> 12797 T2398 C138 P33531 oasc.RecoveryStrategy.doRecovery Replication Recovery was successful - registering as Active. core=collection1
[junit4:junit4]   2> 12799 T2398 C138 P33531 oasc.RecoveryStrategy.doRecovery Finished recovery process. core=collection1
[junit4:junit4]   2> 12899 T2359 oascc.ZkStateReader.updateClusterState Updating cloud state from ZooKeeper... 
[junit4:junit4]   2> 12916 T2372 oascc.ZkStateReader$2.process A cluster state change has occurred - updating...
[junit4:junit4]   2> 12916 T2396 oascc.ZkStateReader$2.process A cluster state change has occurred - updating...
[junit4:junit4]   2> 12916 T2410 oascc.ZkStateReader$2.process A cluster state change has occurred - updating...
[junit4:junit4]   2> 12916 T2358 oascc.ZkStateReader$2.process A cluster state change has occurred - updating...
[junit4:junit4]   2> 12916 T2415 oascc.ZkStateReader$2.process A cluster state change has occurred - updating...
[junit4:junit4]   2> 12916 T2417 oascc.ZkStateReader$2.process A cluster state change has occurred - updating...
[junit4:junit4]   2> 12917 T2384 oascc.ZkStateReader$2.process A cluster state change has occurred - updating...
[junit4:junit4]   2> 13547 T2338 oascc.ZkStateReader.updateClusterState Updating cloud state from ZooKeeper... 
[junit4:junit4]   2>  C140_STATE=coll:collection1 core:collection1 props:{shard=shard2, roles=null, state=recovering, core=collection1, collection=collection1, node_name=127.0.0.1:33537_solr, base_url=http://127.0.0.1:33537/solr}
[junit4:junit4]   2> 14493 T2412 C140 P33537 oasc.RecoveryStrategy.doRecovery Begin buffering updates. core=collection1
[junit4:junit4]   2> 14493 T2412 C140 P33537 oasu.UpdateLog.bufferUpdates Starting to buffer updates. FSUpdateLog{state=ACTIVE, tlog=null}
[junit4:junit4]   2> 14493 T2412 C140 P33537 oasc.RecoveryStrategy.replicate Attempting to replicate from http://127.0.0.1:33525/solr/collection1/. core=collection1
[junit4:junit4]   2> 14493 T2412 C140 P33537 oascsi.HttpClientUtil.createClient Creating new http client, config:maxConnections=128&maxConnectionsPerHost=32&followRedirects=false
[junit4:junit4]   2> 14507 T2379 C141 P33525 oasu.DirectUpdateHandler2.commit start commit{flags=0,_version_=0,optimize=false,openSearcher=true,waitSearcher=true,expungeDeletes=false,softCommit=false}
[junit4:junit4]   2> 14513 T2379 C141 P33525 oasc.SolrDeletionPolicy.onInit SolrDeletionPolicy.onInit: commits:num=1
[junit4:junit4]   2> 		commit{dir=NRTCachingDirectory(org.apache.lucene.store.NIOFSDirectory@/usr/home/hudson/hudson-slave/workspace/Lucene-Solr-Tests-4.x-Java6/solr/build/solr-core/test/J1/org.apache.solr.cloud.BasicDistributedZk2Test-1347770990037/jetty2/index lockFactory=org.apache.lucene.store.NativeFSLockFactory@730694a8; maxCacheMB=48.0 maxMergeSizeMB=4.0),segFN=segments_1,generation=1,filenames=[segments_1]
[junit4:junit4]   2> 14513 T2379 C141 P33525 oasc.SolrDeletionPolicy.updateCommits newest commit = 1
[junit4:junit4]   2> 14515 T2379 C141 P33525 oass.SolrIndexSearcher.<init> Opening Searcher@29d2e85d main
[junit4:junit4]   2> 14515 T2379 C141 P33525 oasu.DirectUpdateHandler2.commit end_commit_flush
[junit4:junit4]   2> 14517 T2385 oasc.SolrCore.registerSearcher [collection1] Registered new searcher Searcher@29d2e85d main{StandardDirectoryReader(segments_1:1)}
[junit4:junit4]   2> 14517 T2379 C141 P33525 /update {waitSearcher=true&commit=true&commit_end_point=true&wt=javabin&softCommit=false&version=2} {commit=} 0 10
[junit4:junit4]   2> 14518 T2412 C140 P33537 oash.ReplicationHandler.inform Commits will be reserved for  10000
[junit4:junit4]   2> 14518 T2412 C140 P33537 oash.SnapPuller.<init>  No value set for 'pollInterval'. Timer Task not started.
[junit4:junit4]   2> 14520 T2380 C141 P33525 oash.ReplicationHandler.inform Commits will be reserved for  10000
[junit4:junit4]   2> 14520 T2380 C141 P33525 REQ /replication {command=indexversion&wt=javabin&qt=/replication&version=2} status=0 QTime=1 
[junit4:junit4]   2> 14524 T2412 C140 P33537 oasc.SolrDeletionPolicy.onInit SolrDeletionPolicy.onInit: commits:num=1
[junit4:junit4]   2> 		commit{dir=NRTCachingDirectory(org.apache.lucene.store.NIOFSDirectory@/usr/home/hudson/hudson-slave/workspace/Lucene-Solr-Tests-4.x-Java6/solr/build/solr-core/test/J1/org.apache.solr.cloud.BasicDistributedZk2Test-1347770990037/jetty4/index lockFactory=org.apache.lucene.store.NativeFSLockFactory@34ff4d94; maxCacheMB=48.0 maxMergeSizeMB=4.0),segFN=segments_1,generation=1,filenames=[segments_1]
[junit4:junit4]   2> 14525 T2412 C140 P33537 oasc.SolrDeletionPolicy.updateCommits newest commit = 1
[junit4:junit4]   2> 14525 T2412 C140 P33537 oasu.DirectUpdateHandler2.commit start commit{flags=0,_version_=0,optimize=false,openSearcher=true,waitSearcher=true,expungeDeletes=false,softCommit=false}
[junit4:junit4]   2> 14529 T2412 C140 P33537 oasc.SolrDeletionPolicy.onCommit SolrDeletionPolicy.onCommit: commits:num=2
[junit4:junit4]   2> 		commit{dir=NRTCachingDirectory(org.apache.lucene.store.NIOFSDirectory@/usr/home/hudson/hudson-slave/workspace/Lucene-Solr-Tests-4.x-Java6/solr/build/solr-core/test/J1/org.apache.solr.cloud.BasicDistributedZk2Test-1347770990037/jetty4/index lockFactory=org.apache.lucene.store.NativeFSLockFactory@34ff4d94; maxCacheMB=48.0 maxMergeSizeMB=4.0),segFN=segments_1,generation=1,filenames=[segments_1]
[junit4:junit4]   2> 		commit{dir=NRTCachingDirectory(org.apache.lucene.store.NIOFSDirectory@/usr/home/hudson/hudson-slave/workspace/Lucene-Solr-Tests-4.x-Java6/solr/build/solr-core/test/J1/org.apache.solr.cloud.BasicDistributedZk2Test-1347770990037/jetty4/index lockFactory=org.apache.lucene.store.NativeFSLockFactory@34ff4d94; maxCacheMB=48.0 maxMergeSizeMB=4.0),segFN=segments_2,generation=2,filenames=[segments_2]
[junit4:junit4]   2> 14529 T2412 C140 P33537 oasc.SolrDeletionPolicy.updateCommits newest commit = 2
[junit4:junit4]   2> 14532 T2412 C140 P33537 oass.SolrIndexSearcher.<init> Opening Searcher@6dfb1adb main
[junit4:junit4]   2> 14532 T2412 C140 P33537 oasu.DirectUpdateHandler2.commit end_commit_flush
[junit4:junit4]   2> 14534 T2411 oasc.SolrCore.registerSearcher [collection1] Registered new searcher Searcher@6dfb1adb main{StandardDirectoryReader(segments_2:2)}
[junit4:junit4]   2> 14534 T2412 C140 P33537 oasc.RecoveryStrategy.replay No replay needed. core=collection1
[junit4:junit4]   2> 14535 T2412 C140 P33537 oasc.RecoveryStrategy.doRecovery Replication Recovery was successful - registering as Active. core=collection1
[junit4:junit4]   2> 14541 T2412 C140 P33537 oasc.RecoveryStrategy.doRecovery Finished recovery process. core=collection1
[junit4:junit4]   2> 14549 T2338 oascc.ZkStateReader.updateClusterState Updating cloud state from ZooKeeper... 
[junit4:junit4]   2> 14924 T2359 oascc.ZkStateReader.updateClusterState Updating cloud state from ZooKeeper... 
[junit4:junit4]   2> 14941 T2358 oascc.ZkStateReader$2.process A cluster state change has occurred - updating...
[junit4:junit4]   2> 14941 T2372 oascc.ZkStateReader$2.process A cluster state change has occurred - updating...
[junit4:junit4]   2> 14941 T2384 oascc.ZkStateReader$2.process A cluster state change has occurred - updating...
[junit4:junit4]   2> 14941 T2410 oascc.ZkStateReader$2.process A cluster state change has occurred - updating...
[junit4:junit4]   2> 14941 T2396 oascc.ZkStateReader$2.process A cluster state change has occurred - updating...
[junit4:junit4]   2> 14941 T2415 oascc.ZkStateReader$2.process A cluster state change has occurred - updating...
[junit4:junit4]   2> 14941 T2417 oascc.ZkStateReader$2.process A cluster state change has occurred - updating...
[junit4:junit4]   2> 15551 T2338 oascc.ZkStateReader.updateClusterState Updating cloud state from ZooKeeper... 
[junit4:junit4]   2> 15554 T2350 C142 P33514 oasu.DirectUpdateHandler2.commit start commit{flags=0,_version_=0,optimize=false,openSearcher=true,waitSearcher=true,expungeDeletes=false,softCommit=false}
[junit4:junit4]   2> 15700 T2350 C142 P33514 oasc.SolrDeletionPolicy.onCommit SolrDeletionPolicy.onCommit: commits:num=2
[junit4:junit4]   2> 		commit{dir=NRTCachingDirectory(org.apache.lucene.store.NIOFSDirectory@/usr/home/hudson/hudson-slave/workspace/Lucene-Solr-Tests-4.x-Java6/solr/build/solr-core/test/J1/org.apache.solr.cloud.BasicDistributedZk2Test-1347770990037/control/data/index lockFactory=org.apache.lucene.store.NativeFSLockFactory@1f586234; maxCacheMB=48.0 maxMergeSizeMB=4.0),segFN=segments_1,generation=1,filenames=[segments_1]
[junit4:junit4]   2> 		commit{dir=NRTCachingDirectory(org.apache.lucene.store.NIOFSDirectory@/usr/home/hudson/hudson-slave/workspace/Lucene-Solr-Tests-4.x-Java6/solr/build/solr-core/test/J1/org.apache.solr.cloud.BasicDistributedZk2Test-1347770990037/control/data/index lockFactory=org.apache.lucene.store.NativeFSLockFactory@1f586234; maxCacheMB=48.0 maxMergeSizeMB=4.0),segFN=segments_2,generation=2,filenames=[_0_Asserting_0.tim, _0_Block_0.tip, _0_Block_0.pos, _0_Asserting_0.tip, _0_Block_0.tim, _0_Asserting_0.prx, _0.si, _0.fnm, _0_Block_0.doc, _0_nrm.cfs, _0_Direct_0.frq, _0_MockRandom_0.skp, _0_MockRandom_0.frq, _0_MockRandom_0.sd, _0_Asserting_0.frq, _0_MockRandom_0.tip, _0_MockRandom_0.doc, _0_MockRandom_0.pos, _0_nrm.cfe, segments_2, _0.fdx, _0_Direct_0.tip, _0_Direct_0.prx, _0_MockRandom_0.pyl, _0_Direct_0.tim, _0_MockRandom_0.tim, _0.fdt]
[junit4:junit4]   2> 15700 T2350 C142 P33514 oasc.SolrDeletionPolicy.updateCommits newest commit = 2
[junit4:junit4]   2> 15720 T2350 C142 P33514 oass.SolrIndexSearcher.<init> Opening Searcher@174010ef main
[junit4:junit4]   2> 15720 T2350 C142 P33514 oasu.DirectUpdateHandler2.commit end_commit_flush
[junit4:junit4]   2> 15722 T2361 oasc.SolrCore.registerSearcher [collection1] Registered new searcher Searcher@174010ef main{StandardDirectoryReader(segments_2:3 _0(4.0.0.2):C1)}
[junit4:junit4]   2> 15722 T2350 C142 P33514 /update {waitSearcher=true&wt=javabin&commit=true&softCommit=false&version=2} {commit=} 0 168
[junit4:junit4]   2> 15724 T2369 C139 P33521 oasu.DirectUpdateHandler2.commit start commit{flags=0,_version_=0,optimize=false,openSearcher=true,waitSearcher=true,expungeDeletes=false,softCommit=false}
[junit4:junit4]   2> 15737 T2369 C139 P33521 oass.SolrIndexSearcher.<init> Opening Searcher@45888723 main
[junit4:junit4]   2> 15737 T2369 C139 P33521 oasu.DirectUpdateHandler2.commit end_commit_flush
[junit4:junit4]   2> 15738 T2373 oasc.SolrCore.registerSearcher [collection1] Registered new searcher Searcher@45888723 main{StandardDirectoryReader(segments_2:3 _0(4.0.0.2):C1)}
[junit4:junit4]   2> 15739 T2369 C139 P33521 oasu.SolrCmdDistributor.distribCommit Distrib commit to:[StdNode: http://127.0.0.1:33531/solr/collection1/, StdNode: http://127.0.0.1:33525/solr/collection1/, StdNode: http://127.0.0.1:33537/solr/collection1/]
[junit4:junit4]   2> 15741 T2381 C141 P33525 oasu.DirectUpdateHandler2.commit start commit{flags=0,_version_=0,optimize=false,openSearcher=true,waitSearcher=true,expungeDeletes=false,softCommit=false}
[junit4:junit4]   2>  C138_STATE=coll:collection1 core:collection1 props:{shard=shard1, roles=null, state=active, core=collection1, collection=collection1, node_name=127.0.0.1:33531_solr, base_url=http://127.0.0.1:33531/solr}
[junit4:junit4]   2> 15741 T2388 C138 P33531 oasu.DirectUpdateHandler2.commit start commit{flags=0,_version_=0,optimize=false,openSearcher=true,waitSearcher=true,expungeDeletes=false,softCommit=false}
[junit4:junit4]   2> 15745 T2388 C138 P33531 oass.SolrIndexSearcher.<init> Opening Searcher@3e9c66de main
[junit4:junit4]   2> 15745 T2388 C138 P33531 oasu.DirectUpdateHandler2.commit end_commit_flush
[junit4:junit4]   2> 15746 T2381 C141 P33525 oass.SolrIndexSearcher.<init> Opening Searcher@465b7a2a main
[junit4:junit4]   2> 15746 T2381 C141 P33525 oasu.DirectUpdateHandler2.commit end_commit_flush
[junit4:junit4]   2> 15747 T2397 oasc.SolrCore.registerSearcher [collection1] Registered new searcher Searcher@3e9c66de main{StandardDirectoryReader(segments_2:3:nrt _0(4.0.0.2):C1)}
[junit4:junit4]   2> 15747 T2388 C138 P33531 /update {waitSearcher=true&commit=true&wt=javabin&commit_end_point=true&expungeDeletes=false&softCommit=false&version=2} {commit=} 0 6
[junit4:junit4]   2> 15748 T2385 oasc.SolrCore.registerSearcher [collection1] Registered new searcher Searcher@465b7a2a main{StandardDirectoryReader(segments_1:1)}
[junit4:junit4]   2> 15748 T2381 C141 P33525 /update {waitSearcher=true&commit=true&wt=javabin&commit_end_point=true&expungeDeletes=false&softCommit=false&version=2} {commit=} 0 7
[junit4:junit4]   2>  C140_STATE=coll:collection1 core:collection1 props:{shard=shard2, roles=null, state=active, core=collection1, collection=collection1, node_name=127.0.0.1:33537_solr, base_url=http://127.0.0.1:33537/solr}
[junit4:junit4]   2> 15751 T2402 C140 P33537 oasu.DirectUpdateHandler2.commit start commit{flags=0,_version_=0,optimize=false,openSearcher=true,waitSearcher=true,expungeDeletes=false,softCommit=false}
[junit4:junit4]   2> 15755 T2402 C140 P33537 oass.SolrIndexSearcher.<init> Opening Searcher@19640ae7 main
[junit4:junit4]   2> 15755 T2402 C140 P33537 oasu.DirectUpdateHandler2.commit end_commit_flush
[junit4:junit4]   2> 15756 T2411 oasc.SolrCore.registerSearcher [collection1] Registered new searcher Searcher@19640ae7 main{StandardDirectoryReader(segments_2:2)}
[junit4:junit4]   2> 15757 T2402 C140 P33537 /update {waitSearcher=true&commit=true&wt=javabin&commit_end_point=true&expungeDeletes=false&softCommit=false&version=2} {commit=} 0 6
[junit4:junit4]   2> 15757 T2369 C139 P33521 /update {waitSearcher=true&wt=javabin&commit=true&softCommit=false&version=2} {commit=} 0 33
[junit4:junit4]   2> 15763 T2351 C142 P33514 REQ /select {fl=id,score&shard.url=127.0.0.1:33514/solr/collection1/&NOW=1347771005794&start=0&q=*:*&distrib=false&isShard=true&wt=javabin&fsv=true&rows=10&version=2} hits=1 status=0 QTime=0 
[junit4:junit4]   2> 15766 T2351 C142 P33514 REQ /select {shard.url=127.0.0.1:33514/solr/collection1/&NOW=1347771005794&q=*:*&ids=1&distrib=false&isShard=true&wt=javabin&version=2} status=0 QTime=0 
[junit4:junit4]   2> 15767 T2350 C142 P33514 REQ /select {wt=javabin&q=*:*&version=2} hits=1 status=0 QTime=7 
[junit4:junit4]   2> 15768 T2338 oaz.ZooKeeper.<init> Initiating client connection, connectString=127.0.0.1:33505/solr sessionTimeout=10000 watcher=org.apache.solr.common.cloud.ConnectionManager@27fa6ea6
[junit4:junit4]   2> 15769 T2425 oaz.ClientCnxn$SendThread.startConnect Opening socket connection to server /127.0.0.1:33505
[junit4:junit4]   2> 15769 T2338 oascc.ConnectionManager.waitForConnected Waiting for client to connect to ZooKeeper
[junit4:junit4]   2> 15770 T2425 oaz.ClientCnxn$SendThread.primeConnection Socket connection established to localhost/127.0.0.1:33505, initiating session
[junit4:junit4]   2> 15770 T2340 oazs.NIOServerCnxn$Factory.run Accepted socket connection from /140.211.11.196:33574
[junit4:junit4]   2> 15770 T2340 oazs.NIOServerCnxn.readConnectRequest Client attempting to establish new session at /140.211.11.196:33574
[junit4:junit4]   2> 15772 T2342 oazs.NIOServerCnxn.finishSessionInit Established session 0x139cd693ddb0009 with negotiated timeout 10000 for client /140.211.11.196:33574
[junit4:junit4]   2> 15772 T2425 oaz.ClientCnxn$SendThread.readConnectResult Session establishment complete on server localhost/127.0.0.1:33505, sessionid = 0x139cd693ddb0009, negotiated timeout = 10000
[junit4:junit4]   2> 15773 T2426 oascc.ConnectionManager.process Watcher org.apache.solr.common.cloud.ConnectionManager@27fa6ea6 name:ZooKeeperConnection Watcher:127.0.0.1:33505/solr got event WatchedEvent state:SyncConnected type:None path:null path:null type:None
[junit4:junit4]   2> 15773 T2338 oascc.ConnectionManager.waitForConnected Client is connected to ZooKeeper
[junit4:junit4]   2> 15774 T2338 oascc.ZkStateReader.createClusterStateWatchersAndUpdate Updating cluster state from ZooKeeper... 
[junit4:junit4]   2> 15775 T2343 oazs.PrepRequestProcessor.pRequest Processed session termination for sessionid: 0x139cd693ddb0009
[junit4:junit4]   2> 15781 T2426 oaz.ClientCnxn$EventThread.run EventThread shut down
[junit4:junit4]   2> 15781 T2338 oaz.ZooKeeper.close Session: 0x139cd693ddb0009 closed
[junit4:junit4]   2> 15781 T2340 oazs.NIOServerCnxn.closeSock Closed socket connection for client /140.211.11.196:33574 which had sessionid 0x139cd693ddb0009
[junit4:junit4]   2> 15782 T2370 C139 P33521 REQ /select {distrib=false&wt=javabin&q=*:*&version=2} hits=1 status=0 QTime=0 
[junit4:junit4]   2> 15784 T2382 C141 P33525 REQ /select {distrib=false&wt=javabin&q=*:*&version=2} hits=0 status=0 QTime=0 
[junit4:junit4]   2> 15789 T2389 C138 P33531 REQ /select {fl=id,score&shard.url=127.0.0.1:33521/solr/collection1/|127.0.0.1:33531/solr/collection1/&NOW=1347771005821&start=0&q=*:*&distrib=false&isShard=true&wt=javabin&fsv=true&rows=10&version=2} hits=1 status=0 QTime=0 
[junit4:junit4]   2> 15790 T2377 C141 P33525 REQ /select {fl=id,score&shard.url=127.0.0.1:33525/solr/collection1/|127.0.0.1:33537/solr/collection1/&NOW=1347771005821&start=0&q=*:*&distrib=false&isShard=true&wt=javabin&fsv=true&rows=10&version=2} hits=0 status=0 QTime=1 
[junit4:junit4]   2> 15792 T2389 C138 P33531 REQ /select {shard.url=127.0.0.1:33521/solr/collection1/|127.0.0.1:33531/solr/collection1/&NOW=1347771005821&q=*:*&ids=1&distrib=false&isShard=true&wt=javabin&version=2} status=0 QTime=0 
[junit4:junit4]   2> 15793 T2378 C141 P33525 REQ /select {wt=javabin&q=*:*&version=2} hits=1 status=0 QTime=6 
[junit4:junit4]   2> 15800 T2350 C142 P33514 /update {wt=javabin&version=2} {add=[2 (1413240330209198080)]} 0 4
[junit4:junit4]   2> 15878 T2402 C140 P33537 REQ /update {update.distrib=FROMLEADER&distrib.from=http://127.0.0.1:33525/solr/collection1/&wt=javabin&version=2} status=0 QTime=68 
[junit4:junit4]   2> 15879 T2381 C141 P33525 REQ /update {distrib.from=http://127.0.0.1:33521/solr/collection1/&update.distrib=TOLEADER&wt=javabin&version=2} status=0 QTime=75 
[junit4:junit4]   2> 15880 T2369 C139 P33521 /update {wt=javabin&version=2} {add=[2]} 0 78
[junit4:junit4]   2> 15885 T2350 C142 P33514 /update {wt=javabin&version=2} {add=[3 (1413240330300424192)]} 0 2
[junit4:junit4]   2> 15894 T2402 C140 P33537 REQ /update {update.distrib=FROMLEADER&distrib.from=http://127.0.0.1:33525/solr/collection1/&wt=javabin&version=2} status=0 QTime=1 
[junit4:junit4]   2> 15895 T2381 C141 P33525 REQ /update {distrib.from=http://127.0.0.1:33521/solr/collection1/&update.distrib=TOLEADER&wt=javabin&version=2} status=0 QTime=6 
[junit4:junit4]   2> 15896 T2369 C139 P33521 /update {wt=javabin&version=2} {add=[3]} 0 9
[junit4:junit4]   2> 15899 T2350 C142 P33514 /update {wt=javabin&version=2} {add=[4 (1413240330316152832)]} 0 1
[junit4:junit4]   2> 15912 T2388 C138 P33531 REQ /update {update.distrib=FROMLEADER&distrib.from=http://127.0.0.1:33521/solr/collection1/&wt=javabin&version=2} status=0 QTime=3 
[junit4:junit4]   2> 15913 T2366 C139 P33521 REQ /update {distrib.from=http://127.0.0.1:33525/solr/collection1/&update.distrib=TOLEADER&wt=javabin&version=2} status=0 QTime=9 
[junit4:junit4]   2> 15913 T2378 C141 P33525 /update {wt=javabin&version=2} {add=[4]} 0 11
[junit4:junit4]   2> 15917 T2350 C142 P33514 /update {wt=javabin&version=2} {add=[5 (1413240330335027200)]} 0 1
[junit4:junit4]   2> 15925 T2402 C140 P33537 REQ /update {distrib.from=http://127.0.0.1:33525/solr/collection1/&update.distrib=FROMLEADER&wt=javabin&version=2} status=0 QTime=1 
[junit4:junit4]   2> 15926 T2378 C141 P33525 /update {wt=javabin&version=2} {add=[5 (1413240330339221504)]} 0 6
[junit4:junit4]   2> 15930 T2350 C142 P33514 /update {wt=javabin&version=2} {add=[6 (1413240330348658688)]} 0 1
[junit4:junit4]   2> 15939 T2402 C140 P33537 REQ /update {update.distrib=FROMLEADER&distrib.from=http://127.0.0.1:33525/solr/collection1/&wt=javabin&version=2} status=0 QTime=1 
[junit4:junit4]   2> 15939 T2381 C141 P33525 REQ /update {distrib.from=http://127.0.0.1:33521/solr/collection1/&update.distrib=TOLEADER&wt=javabin&version=2} status=0 QTime=4 
[junit4:junit4]   2> 15940 T2369 C139 P33521 /update {wt=javabin&version=2} {add=[6]} 0 7
[junit4:junit4]   2> 15943 T2350 C142 P33514 /update {wt=javabin&version=2} {add=[7 (1413240330362290176)]} 0 1
[junit4:junit4]   2> 15950 T2402 C140 P33537 REQ /update {distrib.from=http://127.0.0.1:33525/solr/collection1/&update.distrib=FROMLEADER&wt=javabin&version=2} status=0 QTime=1 
[junit4:junit4]   2> 15951 T2378 C141 P33525 /update {wt=javabin&version=2} {add=[7 (1413240330366484480)]} 0 5
[junit4:junit4]   2> 15954 T2350 C142 P33514 /update {wt=javabin&version=2} {add=[8 (1413240330373824512)]} 0 1
[junit4:junit4]   2> 15963 T2388 C138 P33531 REQ /update {update.distrib=FROMLEADER&distrib.from=http://127.0.0.1:33521/solr/collection1/&wt=javabin&version=2} status=0 QTime=1 
[junit4:junit4]   2> 15963 T2366 C139 P33521 REQ /update {distrib.from=http://127.0.0.1:33525/solr/collection1/&update.distrib=TOLEADER&wt=javabin&version=2} status=0 QTime=4 
[junit4:junit4]   2> 15964 T2378 C141 P33525 /update {wt=javabin&version=2} {add=[8]} 0 7
[junit4:junit4]   2> 15967 T2350 C142 P33514 /update {wt=javabin&version=2} {add=[9 (1413240330387456000)]} 0 1
[junit4:junit4]   2> 15976 T2402 C140 P33537 REQ /update {update.distrib=FROMLEADER&distrib.from=http://127.0.0.1:33525/solr/collection1/&wt=javabin&version=2} status=0 QTime=1 
[junit4:junit4]   2> 15976 T2381 C141 P33525 REQ /update {distrib.from=http://127.0.0.1:33521/solr/collection1/&update.distrib=TOLEADER&wt=javabin&version=2} status=0 QTime=4 
[junit4:junit4]   2> 15977 T2369 C139 P33521 /update {wt=javabin&version=2} {add=[9]} 0 7
[junit4:junit4]   2> 15981 T2350 C142 P33514 /update {wt=javabin&version=2} {add=[10 (1413240330401087488)]} 0 2
[junit4:junit4]   2> 15987 T2388 C138 P33531 REQ /update {distrib.from=http://127.0.0.1:33521/solr/collection1/&update.distrib=FROMLEADER&wt=javabin&version=2} status=0 QTime=1 
[junit4:junit4]   2> 15987 T2369 C139 P33521 /update {wt=javabin&version=2} {add=[10 (1413240330405281792)]} 0 4
[junit4:junit4]   2> 16007 T2350 C142 P33514 /update {wt=javabin&version=2} {add=[11 (1413240330412621824)]} 0 17
[junit4:junit4]   2> 16018 T2388 C138 P33531 REQ /update {distrib.from=http://127.0.0.1:33521/solr/collection1/&update.distrib=FROMLEADER&wt=javabin&version=2} status=0 QTime=1 
[junit4:junit4]   2> 16018 T2369 C139 P33521 /update {wt=javabin&version=2} {add=[11 (1413240330433593344)]} 0 8
[junit4:junit4]   2> 16024 T2350 C142 P33514 /update {wt=javabin&version=2} {add=[12 (1413240330445127680)]} 0 3
[junit4:junit4]   2> 16032 T2388 C138 P33531 REQ /update {update.distrib=FROMLEADER&distrib.from=http://127.0.0.1:33521/solr/collection1/&wt=javabin&version=2} status=0 QTime=1 
[junit4:junit4]   2> 16032 T2366 C139 P33521 REQ /update {distrib.from=http://127.0.0.1:33525/solr/collection1/&update.distrib=TOLEADER&wt=javabin&version=2} status=0 QTime=4 
[junit4:junit4]   2> 16033 T2378 C141 P33525 /update {wt=javabin&version=2} {add=[12]} 0 7
[junit4:junit4]   2> 16036 T2350 C142 P33514 /update {wt=javabin&version=2} {add=[13 (1413240330459807744)]} 0 1
[junit4:junit4]   2> 16045 T2388 C138 P33531 REQ /update {update.distrib=FROMLEADER&distrib.from=http://127.0.0.1:33521/solr/collection1/&wt=javabin&version=2} status=0 QTime=1 
[junit4:junit4]   2> 16045 T2366 C139 P33521 REQ /update {distrib.from=http://127.0.0.1:33525/solr/collection1/&update.distrib=TOLEADER&wt=javabin&version=2} status=0 QTime=4 
[junit4:junit4]   2> 16046 T2378 C141 P33525 /update {wt=javabin&version=2} {add=[13]} 0 7
[junit4:junit4]   2> 16050 T2350 C142 P33514 /update {wt=javabin&version=2} {add=[14 (1413240330473439232)]} 0 2
[junit4:junit4]   2> 16058 T2388 C138 P33531 REQ /update {update.distrib=FROMLEADER&distrib.from=http://127.0.0.1:33521/solr/collection1/&wt=javabin&version=2} status=0 QTime=1 
[junit4:junit4]   2> 16058 T2366 C139 P33521 REQ /update {distrib.from=http://127.0.0.1:33525/solr/collection1/&update.distrib=TOLEADER&wt=javabin&version=2} status=0 QTime=4 
[junit4:junit4]   2> 16059 T2378 C141 P33525 /update {wt=javabin&version=2} {add=[14]} 0 7
[junit4:junit4]   2> 16062 T2350 C142 P33514 /update {wt=javabin&version=2} {add=[15 (1413240330487070720)]} 0 1
[junit4:junit4]   2> 16071 T2388 C138 P33531 REQ /update {update.distrib=FROMLEADER&distrib.from=http://127.0.0.1:33521/solr/collection1/&wt=javabin&version=2} status=0 QTime=1 
[junit4:junit4]   2> 16071 T2366 C139 P33521 REQ /update {distrib.from=http://127.0.0.1:33525/solr/collection1/&update.distrib=TOLEADER&wt=javabin&version=2} status=0 QTime=4 
[junit4:junit4]   2> 16071 T2378 C141 P33525 /update {wt=javabin&version=2} {add=[15]} 0 6
[junit4:junit4]   2> 16075 T2350 C142 P33514 /update {wt=javabin&version=2} {add=[16 (1413240330500702208)]} 0 1
[junit4:junit4]   2> 16081 T2388 C138 P33531 REQ /update {distrib.from=http://127.0.0.1:33521/solr/collection1/&update.distrib=FROMLEADER&wt=javabin&version=2} status=0 QTime=1 
[junit4:junit4]   2> 16081 T2369 C139 P33521 /update {wt=javabin&version=2} {add=[16 (1413240330503847936)]} 0 4
[junit4:junit4]   2> 16086 T2350 C142 P33514 /update {wt=javabin&version=2} {add=[17 (1413240330511187968)]} 0 2
[junit4:junit4]   2> 16098 T2402 C140 P33537 REQ /update {update.distrib=FROMLEADER&distrib.from=http://127.0.0.1:33525/solr/collection1/&wt=javabin&version=2} status=0 QTime=2 
[junit4:junit4]   2> 16099 T2381 C141 P33525 REQ /update {distrib.from=http://127.0.0.1:33521/solr/collection1/&update.distrib=TOLEADER&wt=javabin&version=2} status=0 QTime=7 
[junit4:junit4]   2> 16099 T2369 C139 P33521 /update {wt=javabin&version=2} {add=[17]} 0 10
[junit4:junit4]   2> 16103 T2350 C142 P33514 /update {wt=javabin&version=2} {add=[100 (1413240330530062336)]} 0 1
[junit4:junit4]   2> 16130 T2388 C138 P33531 REQ /update {update.distrib=FROMLEADER&distrib.from=http://127.0.0.1:33521/solr/collection1/&wt=javabin&version=2} status=0 QTime=9 
[junit4:junit4]   2> 16131 T2366 C139 P33521 REQ /update {distrib.from=http://127.0.0.1:33525/solr/collection1/&update.distrib=TOLEADER&wt=javabin&version=2} status=0 QTime=23 
[junit4:junit4]   2> 16131 T2378 C141 P33525 /update {wt=javabin&version=2} {add=[100]} 0 26
[junit4:junit4]   2> 16135 T2350 C142 P33514 /update {wt=javabin&version=2} {add=[101 (1413240330563616768)]} 0 1
[junit4:junit4]   2> 16143 T2388 C138 P33531 REQ /update {distrib.from=http://127.0.0.1:33521/solr/collection1/&update.distrib=FROMLEADER&wt=javabin&version=2} status=0 QTime=2 
[junit4:junit4]   2> 16143 T2369 C139 P33521 /update {wt=javabin&version=2} {add=[101 (1413240330566762496)]} 0 6
[junit4:junit4]   2> 16146 T2350 C142 P33514 /update {wt=javabin&version=2} {add=[102 (1413240330575151104)]} 0 1
[junit4:junit4]   2> 16155 T2388 C138 P33531 REQ /update {update.distrib=FROMLEADER&distrib.from=http://127.0.0.1:33521/solr/collection1/&wt=javabin&version=2} status=0 QTime=1 
[junit4:junit4]   2> 16155 T2366 C139 P33521 REQ /update {distrib.from=http://127.0.0.1:33525/solr/collection1/&update.distrib=TOLEADER&wt=javabin&version=2} status=0 QTime=4 
[junit4:junit4]   2> 16155 T2378 C141 P33525 /update {wt=javabin&version=2} {add=[102]} 0 7
[junit4:junit4]   2> 16169 T2350 C142 P33514 /update {wt=javabin&version=2} {add=[103 (1413240330588782592)]} 0 11
[junit4:junit4]   2> 16176 T2402 C140 P33537 REQ /update {distrib.from=http://127.0.0.1:33525/solr/collection1/&update.distrib=FROMLEADER&wt=javabin&version=2} status=0 QTime=1 
[junit4:junit4]   2> 16176 T2378 C141 P33525 /update {wt=javabin&version=2} {add=[103 (1413240330602414080)]} 0 5
[junit4:junit4]   2> 16181 T2350 C142 P33514 /update {wt=javabin&version=2} {add=[104 (1413240330610802688)]} 0 1
[junit4:junit4]   2> 16188 T2402 C140 P33537 REQ /update {distrib.from=http://127.0.0.1:33525/solr/collection1/&update.distrib=FROMLEADER&wt=javabin&version=2} status=0 QTime=1 
[junit4:junit4]   2> 16188 T2378 C141 P33525 /update {wt=javabin&version=2} {add=[104 (1413240330614996992)]} 0 5
[junit4:junit4]   2> 16192 T2350 C142 P33514 /update {wt=javabin&version=2} {add=[105 (1413240330623385600)]} 0 1
[junit4:junit4]   2> 16216 T2402 C140 P33537 REQ /update {update.distrib=FROMLEADER&distrib.from=http://127.0.0.1:33525/solr/collection1/&wt=javabin&version=2} status=0 QTime=9 
[junit4:junit4]   2> 16217 T2381 C141 P33525 REQ /update {distrib.from=http://127.0.0.1:33521/solr/collection1/&update.distrib=TOLEADER&wt=javabin&version=2} status=0 QTime=21 
[junit4:junit4]   2> 16217 T2369 C139 P33521 /update {wt=javabin&version=2} {add=[105]} 0 23
[junit4:junit4]   2> 16221 T2350 C142 P33514 /update {wt=javabin&version=2} {add=[106 (1413240330653794304)]} 0 1
[junit4:junit4]   2> 16230 T2402 C140 P33537 REQ /update {update.distrib=FROMLEADER&distrib.from=http://127.0.0.1:33525/solr/collection1/&wt=javabin&version=2} status=0 QTime=1 
[junit4:junit4]   2> 16231 T2381 C141 P33525 REQ /update {distrib.from=http://127.0.0.1:33521/solr/collection1/&update.distrib=TOLEADER&wt=javabin&version=2} status=0 QTime=6 
[junit4:junit4]   2> 16231 T2369 C139 P33521 /update {wt=javabin&version=2} {add=[106]} 0 8
[junit4:junit4]   2> 16235 T2350 C142 P33514 /update {wt=javabin&version=2} {add=[107 (1413240330668474368)]} 0 1
[junit4:junit4]   2> 16241 T2388 C138 P33531 REQ /update {distrib.from=http://127.0.0.1:33521/solr/collection1/&update.distrib=FROMLEADER&wt=javabin&version=2} status=0 QTime=1 
[junit4:junit4]   2> 16241 T2369 C139 P33521 /update {wt=javabin&version=2} {add=[107 (1413240330671620096)]} 0 4
[junit4:junit4]   2> 16245 T2350 C142 P33514 /update {wt=javabin&version=2} {add=[108 (1413240330678960128)]} 0 1
[junit4:junit4]   2> 16254 T2388 C138 P33531 REQ /update {update.distrib=FROMLEADER&distrib.from=http://127.0.0.1:33521/solr/collection1/&wt=javabin&version=2} status=0 QTime=1 
[junit4:junit4]   2> 16255 T2366 C139 P33521 REQ /update {distrib.from=http://127.0.0.1:33525/solr/collection1/&update.distrib=TOLEADER&wt=javabin&version=2} status=0 QTime=5 
[junit4:junit4]   2> 16255 T2378 C141 P33525 /update {wt=javabin&version=2} {add=[108]} 0 7
[junit4:junit4]   2> 16259 T2350 C142 P33514 /update {wt=javabin&version=2} {add=[109 (1413240330693640192)]} 0 1
[junit4:junit4]   2> 16265 T2388 C138 P33531 REQ /update {distrib.from=http://127.0.0.1:33521/solr/collection1/&update.distrib=FROMLEADER&wt=javabin&version=2} status=0 QTime=1 
[junit4:junit4]   2> 16265 T2369 C139 P33521 /update {wt=javabin&version=2} {add=[109 (1413240330696785920)]} 0 4
[junit4:junit4]   2> 16268 T2350 C142 P33514 /update {wt=javabin&version=2} {add=[110 (1413240330703077376)]} 0 1
[junit4:junit4]   2> 16275 T2388 C138 P33531 REQ /update {distrib.from=http://127.0.0.1:33521/solr/collection1/&update.distrib=FROMLEADER&wt=javabin&version=2} status=0 QTime=1 
[junit4:junit4]   2> 16275 T2369 C139 P33521 /update {wt=javabin&version=2} {add=[110 (1413240330707271680)]} 0 4
[junit4:junit4]   2> 16278 T2350 C142 P33514 /update {wt=javabin&version=2} {add=[111 (1413240330713563136)]} 0 1
[junit4:junit4]   2> 16284 T2388 C138 P33531 REQ /update {distrib.from=http://127.0.0.1:33521/solr/collection1/&update.distrib=FROMLEADER&wt=javabin&version=2} status=0 QTime=1 
[junit4:junit4]   2> 16284 T2369 C139 P33521 /update {wt=javabin&version=2} {add=[111 (1413240330716708864)]} 0 4
[junit4:junit4]   2> 16287 T2350 C142 P33514 /update {wt=javabin&version=2} {add=[112 (1413240330723000320)]} 0 1
[junit4:junit4]   2> 16295 T2402 C140 P33537 REQ /update {update.distrib=FROMLEADER&distrib.from=http://127.0.0.1:33525/solr/collection1/&wt=javabin&version=2} status=0 QTime=1 
[junit4:junit4]   2> 16295 T2381 C141 P33525 REQ /update {distrib.from=http://127.0.0.1:33521/solr/collection1/&update.distrib=TOLEADER&wt=javabin&version=2} status=0 QTime=4 
[junit4:junit4]   2> 16296 T2369 C139 P33521 /update {wt=javabin&version=2} {add=[112]} 0 7
[junit4:junit4]   2> 16308 T2350 C142 P33514 /update {wt=javabin&version=2} {add=[113 (1413240330735583232)]} 0 10
[junit4:junit4]   2> 16314 T2388 C138 P33531 REQ /update {distrib.from=http://127.0.0.1:33521/solr/collection1/&update.distrib=FROMLEADER&wt=javabin&version=2} status=0 QTime=1 
[junit4:junit4]   2> 16314 T2369 C139 P33521 /update {wt=javabin&version=2} {add=[113 (1413240330748166144)]} 0 4
[junit4:junit4]   2> 16318 T2350 C142 P33514 /update {wt=javabin&version=2} {add=[114 (1413240330755506176)]} 0 1
[junit4:junit4]   2> 16328 T2388 C138 P33531 REQ /update {update.distrib=FROMLEADER&distrib.from=http://127.0.0.1:33521/solr/collection1/&wt=javabin&version=2} status=0 QTime=1 
[junit4:junit4]   2> 16328 T2366 C139 P33521 REQ /update {distrib.from=http://127.0.0.1:33525/solr/collection1/&update.distrib=TOLEADER&wt=javabin&version=2} status=0 QTime=4 
[junit4:junit4]   2> 16328 T2378 C141 P33525 /update {wt=javabin&version=2} {add=[114]} 0 7
[junit4:junit4]   2> 16332 T2350 C142 P33514 /update {wt=javabin&version=2} {add=[115 (1413240330770186240)]} 0 1
[junit4:junit4]   2> 16339 T2402 C140 P33537 REQ /update {distrib.from=http://127.0.0.1:33525/solr/collection1/&update.distrib=FROMLEADER&wt=javabin&version=2} status=0 QTime=1 
[junit4:junit4]   2> 16339 T2378 C141 P33525 /update {wt=javabin&version=2} {add=[115 (1413240330773331968)]} 0 5
[junit4:junit4]   2> 16343 T2350 C142 P33514 /update {wt=javabin&version=2} {add=[116 (1413240330781720576)]} 0 1
[junit4:junit4]   2> 16351 T2402 C140 P33537 REQ /update {update.distrib=FROMLEADER&distrib.from=http://127.0.0.1:33525/solr/collection1/&wt=javabin&version=2} status=0 QTime=1 
[junit4:junit4]   2> 16351 T2381 C141 P33525 REQ /update {distrib.from=http://127.0.0.1:33521/solr/collection1/&update.distrib=TOLEADER&wt=javabin&version=2} status=0 QTime=4 
[junit4:junit4]   2> 16351 T2369 C139 P33521 /update {wt=javabin&version=2} {add=[116]} 0 6
[junit4:junit4]   2> 16355 T2350 C142 P33514 /update {wt=javabin&version=2} {add=[117 (1413240330794303488)]} 0 1
[junit4:junit4]   2> 16363 T2402 C140 P33537 REQ /update {update.distrib=FROMLEADER&distrib.from=http://127.0.0.1:33525/solr/collection1/&wt=javabin&version=2} status=0 QTime=1 
[junit4:junit4]   2> 16363 T2381 C141 P33525 REQ /update {distrib.from=http://127.0.0.1:33521/solr/collection1/&update.distrib=TOLEADER&wt=javabin&version=2} status=0 QTime=4 
[junit4:junit4]   2> 16363 T2369 C139 P33521 /update {wt=javabin&version=2} {add=[117]} 0 6
[junit4:junit4]   2> 16367 T2350 C142 P33514 /update {wt=javabin&version=2} {add=[118 (1413240330806886400)]} 0 1
[junit4:junit4]   2> 16388 T2388 C138 P33531 REQ /update {distrib.from=http://127.0.0.1:33521/solr/collection1/&update.distrib=FROMLEADER&wt=javabin&version=2} status=0 QTime=8 
[junit4:junit4]   2> 16389 T2369 C139 P33521 /update {wt=javabin&version=2} {add=[118 (1413240330810032128)]} 0 20
[junit4:junit4]   2> 16393 T2350 C142 P33514 /update {wt=javabin&version=2} {add=[119 (1413240330834149376)]} 0 1
[junit4:junit4]   2> 16401 T2402 C140 P33537 REQ /update {update.distrib=FROMLEADER&distrib.from=http://127.0.0.1:33525/solr/collection1/&wt=javabin&version=2} status=0 QTime=1 
[junit4:junit4]   2> 16401 T2381 C141 P33525 REQ /update {distrib.from=http://127.0.0.1:33521/solr/collection1/&update.distrib=TOLEADER&wt=javabin&version=2} status=0 QTime=4 
[junit4:junit4]   2> 16401 T2369 C139 P33521 /update {wt=javabin&version=2} {add=[119]} 0 6
[junit4:junit4]   2> 16405 T2350 C142 P33514 /update {wt=javabin&version=2} {add=[120 (1413240330846732288)]} 0 1
[junit4:junit4]   2> 16413 T2402 C140 P33537 REQ /update {update.distrib=FROMLEADER&distrib.from=http://127.0.0.1:33525/solr/collection1/&wt=javabin&version=2} status=0 QTime=1 
[junit4:junit4]   2> 16413 T2381 C141 P33525 REQ /update {distrib.from=http://127.0.0.1:33521/solr/collection1/&update.distrib=TOLEADER&wt=javabin&version=2} status=0 QTime=4 
[junit4:junit4]   2> 16414 T2369 C139 P33521 /update {wt=javabin&version=2} {add=[120]} 0 7
[junit4:junit4]   2> 16417 T2350 C142 P33514 /update {wt=javabin&version=2} {add=[121 (1413240330859315200)]} 0 1
[junit4:junit4]   2> 16424 T2402 C140 P33537 REQ /update {distrib.from=http://127.0.0.1:33525/solr/collection1/&update.distrib=FROMLEADER&wt=javabin&version=2} status=0 QTime=1 
[junit4:junit4]   2> 16424 T2378 C141 P33525 /update {wt=javabin&version=2} {add=[121 (1413240330862460928)]} 0 5
[junit4:junit4]   2> 16428 T2350 C142 P33514 /update {wt=javabin&version=2} {add=[122 (1413240330870849536)]} 0 1
[junit4:junit4]   2> 16435 T2388 C138 P33531 REQ /update {distrib.from=http://127.0.0.1:33521/solr/collection1/&update.distrib=FROMLEADER&wt=javabin&version=2} status=0 QTime=2 
[junit4:junit4]   2> 16435 T2369 C139 P33521 /update {wt=javabin&version=2} {add=[122 (1413240330873995264)]} 0 5
[junit4:junit4]   2> 16445 T2350 C142 P33514 /update {wt=javabin&version=2} {add=[123 (1413240330881335296)]} 0 8
[junit4:junit4]   2> 16452 T2388 C138 P33531 REQ /update {distrib.from=http://127.0.0.1:33521/solr/collection1/&update.distrib=FROMLEADER&wt=javabin&version=2} status=0 QTime=1 
[junit4:junit4]   2> 16452 T2369 C139 P33521 /update {wt=javabin&version=2} {add=[123 (1413240330892869632)]} 0 4
[junit4:junit4]   2> 16457 T2350 C142 P33514 /update {wt=javabin&version=2} {add=[124 (1413240330900209664)]} 0 2
[junit4:junit4]   2> 16463 T2388 C138 P33531 REQ /update {distrib.from=http://127.0.0.1:33521/solr/collection1/&update.distrib=FROMLEADER&wt=javabin&version=2} status=0 QTime=1 
[junit4:junit4]   2> 16463 T2369 C139 P33521 /update {wt=javabin&version=2} {add=[124 (1413240330904403968)]} 0 4
[junit4:junit4]   2> 16467 T2350 C142 P33514 /update {wt=javabin&version=2} {add=[125 (1413240330911744000)]} 0 1
[junit4:junit4]   2> 16473 T2388 C138 P33531 REQ /update {distrib.from=http://127.0.0.1:33521/solr/collection1/&update.distrib=FROMLEADER&wt=javabin&version=2} status=0 QTime=1 
[junit4:junit4]   2> 16473 T2369 C139 P33521 /update {wt=javabin&version=2} {add=[125 (1413240330914889728)]} 0 4
[junit4:junit4]   2> 16476 T2350 C142 P33514 /update {wt=javabin&version=2} {add=[126 (1413240330921181184)]} 0 1
[junit4:junit4]   2> 16484 T2402 C140 P33537 REQ /update {update.distrib=FROMLEADER&distrib.from=http://127.0.0.1:33525/solr/collection1/&wt=javabin&version=2} status=0 QTime=1 
[junit4:junit4]   2> 16485 T2381 C141 P33525 REQ /update {distrib.from=http://127.0.0.1:33521/solr/collection1/&update.distrib=TOLEADER&wt=javabin&version=2} status=0 QTime=5 
[junit4:junit4]   2> 16486 T2369 C139 P33521 /update {wt=javabin&version=2} {add=[126]} 0 8
[junit4:junit4]   2> 16490 T2350 C142 P33514 /update {wt=javabin&version=2} {add=[127 (1413240330934812672)]} 0 2
[junit4:junit4]   2> 16514 T2402 C140 P33537 REQ /update {update.distrib=FROMLEADER&distrib.from=http://127.0.0.1:33525/solr/collection1/&wt=javabin&version=2} status=0 QTime=9 
[junit4:junit4]   2> 16515 T2381 C141 P33525 REQ /update {distrib.from=http://127.0.0.1:33521/solr/collection1/&update.distrib=TOLEADER&wt=javabin&version=2} status=0 QTime=21 
[junit4:junit4]   2> 16515 T2369 C139 P33521 /update {wt=javabin&version=2} {add=[127]} 0 23
[junit4:junit4]   2> 16519 T2350 C142 P33514 /update {wt=javabin&version=2} {add=[128 (1413240330966269952)]} 0 1
[junit4:junit4]   2> 16541 T2402 C140 P33537 REQ /update {distrib.from=http://127.0.0.1:33525/solr/collection1/&update.distrib=FROMLEADER&wt=javabin&version=2} status=0 QTime=1 
[junit4:junit4]   2> 16541 T2378 C141 P33525 /update {wt=javabin&version=2} {add=[128 (1413240330969415680)]} 0 20
[junit4:junit4]   2> 16545 T2350 C142 P33514 /update {wt=javabin&version=2} {add=[129 (1413240330993532928)]} 0 1
[junit4:junit4]   2> 16553 T2388 C138 P33531 REQ /update {update.distrib=FROMLEADER&distrib.from=http://127.0.0.1:33521/solr/collection1/&wt=javabin&version=2} status=0 QTime=1 
[junit4:junit4]   2> 16553 T2366 C139 P33521 REQ /update {distrib.from=http://127.0.0.1:33525/solr/collection1/&update.distrib=TOLEADER&wt=javabin&version=2} status=0 QTime=4 
[junit4:junit4]   2> 16553 T2378 C141 P33525 /update {wt=javabin&version=2} {add=[129]} 0 6
[junit4:junit4]   2> 16557 T2350 C142 P33514 /update {wt=javabin&version=2} {add=[130 (1413240331006115840)]} 0 1
[junit4:junit4]   2> 16564 T2402 C140 P33537 REQ /update {distrib.from=http://127.0.0.1:33525/solr/collection1/&update.distrib=FROMLEADER&wt=javabin&version=2} status=0 QTime=1 
[junit4:junit4]   2> 16564 T2378 C141 P33525 /update {wt=javabin&version=2} {add=[130 (1413240331009261568)]} 0 5
[junit4:junit4]   2> 16568 T2350 C142 P33514 /update {wt=javabin&version=2} {add=[131 (1413240331017650176)]} 0 1
[junit4:junit4]   2> 16576 T2402 C140 P33537 REQ /update {update.distrib=FROMLEADER&distrib.from=http://127.0.0.1:33525/solr/collection1/&wt=javabin&version=2} status=0 QTime=1 
[junit4:junit4]   2> 16576 T2381 C141 P33525 REQ /update {distrib.from=http://127.0.0.1:33521/solr/collection1/&update.distrib=TOLEADER&wt=javabin&version=2} status=0 QTime=4 
[junit4:junit4]   2> 16576 T2369 C139 P33521 /update {wt=javabin&version=2} {add=[131]} 0 6
[junit4:junit4]   2> 16580 T2350 C142 P33514 /update {wt=javabin&version=2} {add=[132 (1413240331030233088)]} 0 1
[junit4:junit4]   2> 16586 T2388 C138 P33531 REQ /update {distrib.from=http://127.0.0.1:33521/solr/collection1/&update.distrib=FROMLEADER&wt=javabin&version=2} status=0 QTime=1 
[junit4:junit4]   2> 16586 T2369 C139 P33521 /update {wt=javabin&version=2} {add=[132 (1413240331033378816)]} 0 4
[junit4:junit4]   2> 16599 T2350 C142 P33514 /update {wt=javabin&version=2} {add=[133 (1413240331040718848)]} 0 10
[junit4:junit4]   2> 16605 T2388 C138 P33531 REQ /update {distrib.from=http://127.0.0.1:33521/solr/collection1/&update.distrib=FROMLEADER&wt=javabin&version=2} status=0 QTime=1 
[junit4:junit4]   2> 16605 T2369 C139 P33521 /update {wt=javabin&version=2} {add=[133 (1413240331053301760)]} 0 4
[junit4:junit4]   2> 16608 T2350 C142 P33514 /update {wt=javabin&version=2} {add=[134 (1413240331059593216)]} 0 1
[junit4:junit4]   2> 16615 T2402 C140 P33537 REQ /update {distrib.from=http://127.0.0.1:33525/solr/collection1/&update.distrib=FROMLEADER&wt=javabin&version=2} status=0 QTime=1 
[junit4:junit4]   2> 16615 T2378 C141 P33525 /update {wt=javabin&version=2} {add=[134 (1413240331063787520)]} 0 4
[junit4:junit4]   2> 16618 T2350 C142 P33514 /update {wt=javabin&version=2} {add=[135 (1413240331070078976)]} 0 1
[junit4:junit4]   2> 16624 T2388 C138 P33531 REQ /update {distrib.from=http://127.0.0.1:33521/solr/collection1/&update.distrib=FROMLEADER&wt=javabin&version=2} status=0 QTime=1 
[junit4:junit4]   2> 16624 T2369 C139 P33521 /update {wt=javabin&version=2} {add=[135 (1413240331073224704)]} 0 4
[junit4:junit4]   2> 16627 T2350 C142 P33514 /update {wt=javabin&version=2} {add=[136 (1413240331079516160)]} 0 1
[junit4:junit4]   2> 16634 T2402 C140 P33537 REQ /update {distrib.from=http://127.0.0.1:33525/solr/collection1/&update.distrib=FROMLEADER&wt=javabin&version=2} status=0 QTime=1 
[junit4:junit4]   2> 16634 T2378 C141 P33525 /update {wt=javabin&version=2} {add=[136 (1413240331083710464)]} 0 4
[junit4:junit4]   2> 16637 T2350 C142 P33514 /update {wt=javabin&version=2} {add=[137 (1413240331090001920)]} 0 1
[junit4:junit4]   2> 16643 T2402 C140 P33537 REQ /update {distrib.from=http://127.0.0.1:33525/solr/collection1/&update.distrib=FROMLEADER&wt=javabin&version=2} status=0 QTime=1 
[junit4:junit4]   2> 16643 T2378 C141 P33525 /update {wt=javabin&version=2} {add=[137 (1413240331093147648)]} 0 4
[junit4:junit4]   2> 16646 T2350 C142 P33514 /update {wt=javabin&version=2} {add=[138 (1413240331099439104)]} 0 1
[junit4:junit4]   2> 16654 T2388 C138 P33531 REQ /update {update.distrib=FROMLEADER&distrib.from=http://127.0.0.1:33521/solr/collection1/&wt=javabin&version=2} status=0 QTime=1 
[junit4:junit4]   2> 16654 T2366 C139 P33521 REQ /update {distrib.from=http://127.0.0.1:33525/solr/collection1/&update.distrib=TOLEADER&wt=javabin&version=2} status=0 QTime=4 
[junit4:junit4]   2> 16654 T2378 C141 P33525 /update {wt=javabin&version=2} {add=[138]} 0 6
[junit4:junit4]   2> 16658 T2350 C142 P33514 /update {wt=javabin&version=2} {add=[139 (1413240331112022016)]} 0 1
[junit4:junit4]   2> 16666 T2402 C140 P33537 REQ /update {update.distrib=FROMLEADER&distrib.from=http://127.0.0.1:33525/solr/collection1/&wt=javabin&version=2} status=0 QTime=1 
[junit4:junit4]   2> 16666 T2381 C141 P33525 REQ /update {distrib.from=http://127.0.0.1:33521/solr/collection1/&update.distrib=TOLEADER&wt=javabin&version=2} status=0 QTime=4 
[junit4:junit4]   2> 16667 T2369 C139 P33521 /update {wt=javabin&version=2} {add=[139]} 0 7
[junit4:junit4]   2> 16670 T2350 C142 P33514 /update {wt=javabin&version=2} {add=[140 (1413240331124604928)]} 0 1
[junit4:junit4]   2> 16676 T2402 C140 P33537 REQ /update {distrib.from=http://127.0.0.1:33525/solr/collection1/&update.distrib=FROMLEADER&wt=javabin&version=2} status=0 QTime=1 
[junit4:junit4]   2> 16676 T2378 C141 P33525 /update {wt=javabin&version=2} {add=[140 (1413240331127750656)]} 0 4
[junit4:junit4]   2> 16679 T2350 C142 P33514 /update {wt=javabin&version=2} {add=[141 (1413240331134042112)]} 0 1
[junit4:junit4]   2> 16685 T2402 C140 P33537 REQ /update {distrib.from=http://127.0.0.1:33525/solr/collection1/&update.distrib=FROMLEADER&wt=javabin&version=2} status=0 QTime=1 
[junit4:junit4]   2> 16685 T2378 C141 P33525 /update {wt=javabin&version=2} {add=[141 (1413240331137187840)]} 0 4
[junit4:junit4]   2> 16688 T2350 C142 P33514 /update {wt=javabin&version=2} {add=[142 (1413240331143479296)]} 0 1
[junit4:junit4]   2> 16710 T2402 C140 P33537 REQ /update {distrib.from=http://127.0.0.1:33525/solr/collection1/&update.distrib=FROMLEADER&wt=javabin&version=2} status=0 QTime=9 
[junit4:junit4]   2> 16711 T2378 C141 P33525 /update {wt=javabin&version=2} {add=[142 (1413240331146625024)]} 0 21
[junit4:junit4]   2> 16723 T2350 C142 P33514 /update {wt=javabin&version=2} {add=[143 (1413240331170742272)]} 0 10
[junit4:junit4]   2> 16730 T2402 C140 P33537 REQ /update {distrib.from=http://127.0.0.1:33525/solr/collection1/&update.distrib=FROMLEADER&wt=javabin&version=2} status=0 QTime=1 
[junit4:junit4]   2> 16731 T2378 C141 P33525 /update {wt=javabin&version=2} {add=[143 (1413240331183325184)]} 0 6
[junit4:junit4]   2> 16735 T2350 C142 P33514 /update {wt=javabin&version=2} {add=[144 (1413240331191713792)]} 0 2
[junit4:junit4]   2> 16743 T2402 C140 P33537 REQ /update {update.distrib=FROMLEADER&distrib.from=http://127.0.0.1:33525/solr/collection1/&wt=javabin&version=2} status=0 QTime=1 
[junit4:junit4]   2> 16743 T2381 C141 P33525 REQ /update {distrib.from=http://127.0.0.1:33521/solr/collection1/&update.distrib=TOLEADER&wt=javabin&version=2} status=0 QTime=4 
[junit4:junit4]   2> 16743 T2369 C139 P33521 /update {wt=javabin&version=2} {add=[144]} 0 6
[junit4:junit4]   2> 16747 T2350 C142 P33514 /update {wt=javabin&version=2} {add=[145 (1413240331205345280)]} 0 1
[junit4:junit4]   2> 16755 T2402 C140 P33537 REQ /update {update.distrib=FROMLEADER&distrib.from=http://127.0.0.1:33525/solr/collection1/&wt=javabin&version=2} status=0 QTime=1 
[junit4:junit4]   2> 16755 T2381 C141 P33525 REQ /update {distrib.from=http://127.0.0.1:33521/solr/collection1/&update.distrib=TOLEADER&wt=javabin&version=2} status=0 QTime=4 
[junit4:junit4]   2> 16755 T2369 C139 P33521 /update {wt=javabin&version=2} {add=[145]} 0 6
[junit4:junit4]   2> 16759 T2350 C142 P33514 /update {wt=javabin&version=2} {add=[146 (1413240331217928192)]} 0 1
[junit4:junit4]   2> 16783 T2388 C138 P33531 REQ /update {update.distrib=FROMLEADER&distrib.from=http://127.0.0.1:33521/solr/collection1/&wt=javabin&version=2} status=0 QTime=8 
[junit4:junit4]   2> 16783 T2366 C139 P33521 REQ /update {distrib.from=http://127.0.0.1:33525/solr/collection1/&update.distrib=TOLEADER&wt=javabin&version=2} status=0 QTime=20 
[junit4:junit4]   2> 16784 T2378 C141 P33525 /update {wt=javabin&version=2} {add=[146]} 0 23
[junit4:junit4]   2> 16788 T2350 C142 P33514 /update {wt=javabin&version=2} {add=[147 (1413240331248336896)]} 0 1
[junit4:junit4]   2> 16796 T2402 C140 P33537 REQ /update {update.distrib=FROMLEADER&distrib.from=http://127.0.0.1:33525/solr/collection1/&wt=javabin&version=2} status=0 QTime=1 
[junit4:junit4]   2> 16796 T2381 C141 P33525 REQ /update {distrib.from=http://127.0.0.1:33521/solr/collection1/&update.distrib=TOLEADER&wt=javabin&version=2} status=0 QTime=4 
[junit4:junit4]   2> 16796 T2369 C139 P33521 /update {wt=javabin&version=2} {add=[147]} 0 6
[junit4:junit4]   2> 16800 T2350 C142 P33514 /update {wt=javabin&version=2} {add=[148 (1413240331260919808)]} 0 1
[junit4:junit4]   2> 16806 T2388 C138 P33531 REQ /update {distrib.from=http://127.0.0.1:33521/solr/collection1/&update.distrib=FROMLEADER&wt=javabin&version=2} status=0 QTime=1 
[junit4:junit4]   2> 16807 T2369 C139 P33521 /update {wt=javabin&version=2} {add=[148 (1413240331264065536)]} 0 5
[junit4:junit4]   2> 16810 T2350 C142 P33514 /update {wt=javabin&version=2} {add=[149 (1413240331271405568)]} 0 1
[junit4:junit4]   2> 16818 T2402 C140 P33537 REQ /update {update.distrib=FROMLEADER&distrib.from=http://127.0.0.1:33525/solr/collection1/&wt=javabin&version=2} status=0 QTime=1 
[junit4:junit4]   2> 16819 T2381 C141 P33525 REQ /update {distrib.from=http://127.0.0.1:33521/solr/collection1/&update.distrib=TOLEADER&wt=javabin&version=2} status=0 QTime=5 
[junit4:junit4]   2> 16820 T2369 C139 P33521 /update {wt=javabin&version=2} {add=[149]} 0 8
[junit4:junit4]   2> 16821 T2338 oasc.AbstractDistribZkTestBase.waitForRecoveriesToFinish Wait for recoveries to finish - collection: collection1 failOnTimeout:true timeout (sec):1800
[junit4:junit4]   2> 16822 T2338 oascc.ZkStateReader.updateClusterState Updating cloud state from ZooKeeper... 
[junit4:junit4]   2> 16825 T2350 C142 P33514 oasu.DirectUpdateHandler2.commit start commit{flags=0,_version_=0,optimize=false,openSearcher=true,waitSearcher=true,expungeDeletes=false,softCommit=false}
[junit4:junit4]   2> 17178 T2350 C142 P33514 oasc.SolrDeletionPolicy.onCommit SolrDeletionPolicy.onCommit: commits:num=2
[junit4:junit4]   2> 		commit{dir=NRTCachingDirectory(org.apache.lucene.store.NIOFSDirectory@/usr/home/hudson/hudson-slave/workspace/Lucene-Solr-Tests-4.x-Java6/solr/build/solr-core/test/J1/org.apache.solr.cloud.BasicDistributedZk2Test-1347770990037/control/data/index lockFactory=org.apache.lucene.store.NativeFSLockFactory@1f586234; maxCacheMB=48.0 maxMergeSizeMB=4.0),segFN=segments_2,generation=2,filenames=[_0_Asserting_0.tim, _0_Block_0.tip, _0_Block_0.pos, _0_Asserting_0.tip, _0_Block_0.tim, _0_Asserting_0.prx, _0.si, _0.fnm, _0_Block_0.doc, _0_nrm.cfs, _0_Direct_0.frq, _0_MockRandom_0.skp, _0_MockRandom_0.frq, _0_MockRandom_0.sd, _0_Asserting_0.frq, _0_MockRandom_0.tip, _0_MockRandom_0.doc, _0_MockRandom_0.pos, _0_nrm.cfe, segments_2, _0.fdx, _0_Direct_0.tip, _0_Direct_0.prx, _0_MockRandom_0.pyl, _0_Direct_0.tim, _0_MockRandom_0.tim, _0.fdt]
[junit4:junit4]   2> 		commit{dir=NRTCachingDirectory(org.apache.lucene.store.NIOFSDirectory@/usr/home/hudson/hudson-slave/workspace/Lucene-Solr-Tests-4.x-Java6/solr/build/solr-core/test/J1/org.apache.solr.cloud.BasicDistributedZk2Test-1347770990037/control/data/index lockFactory=org.apache.lucene.store.NativeFSLockFactory@1f586234; maxCacheMB=48.0 maxMergeSizeMB=4.0),segFN=segments_3,generation=3,filenames=[_5_nrm.cfe, _6_Asserting_0.frq, _6_Direct_0.tip, _6_Direct_0.tim, _3.fdt, _1_MockRandom_0.pos, _1_Asserting_0.tim, _7.fnm, _6_Block_0.pos, _1_Asserting_0.tip, _3_MockRandom_0.skp, _5_MockRandom_0.pyl, _1_Block_0.pos, _5_Direct_0.prx, _1_MockRandom_0.sd, _7_MockRandom_0.skp, _1.fdx, _0_MockRandom_0.frq, _7_MockRandom_0.doc, _1.fdt, _5_nrm.cfs, _4_MockRandom_0.sd, _7_MockRandom_0.sd, _1_MockRandom_0.doc, _6.fdt, _2.si, _2_Block_0.tim, _2_Block_0.tip, _6.fdx, _5_Block_0.tim, _6_MockRandom_0.tiv, _7_Asserting_0.frq, _2_nrm.cfe, _6_MockRandom_0.tib, _7_MockRandom_0.pyl, _6_MockRandom_0.pyl, _6_MockRandom_0.doc, _2_nrm.cfs, _2_MockRandom_0.prx, _4_Block_0.tip, _1_Direct_0.prx, _2.fnm, _3.fdx, _2_MockRandom_0.sd, _1.si, _0_Direct_0.tip, _0_Direct_0.prx, _0_Direct_0.tim, _3_MockRandom_0.pos, _1_Direct_0.frq, _3_nrm.cfe, _0_Block_0.tip, _0_Block_0.tim, _4_nrm.cfe, _7_Block_0.tim, _7_Block_0.tip, _4.fdx, _7_MockRandom_0.frq, _4_Direct_0.frq, _3_Asserting_0.prx, _5_MockRandom_0.sd, _7_Direct_0.tim, _4_MockRandom_0.tip, _2_Asserting_0.prx, _1_Direct_0.tim, _1_Block_0.doc, _7_Direct_0.tip, _1_Direct_0.tip, _4_MockRandom_0.tim, _3_Direct_0.tip, _0_Direct_0.frq, _5.si, _3_nrm.cfs, _6_MockRandom_0.sd, _3_MockRandom_0.tip, _0_MockRandom_0.doc, _3_MockRandom_0.tim, _4_nrm.cfs, _1_MockRandom_0.frq, _3_Direct_0.tim, _5_Block_0.tip, _5_Asserting_0.prx, _5_MockRandom_0.frq, _7_Block_0.doc, _5_MockRandom_0.tib, _5_MockRandom_0.tii, _6_Asserting_0.tim, _6_Asserting_0.tip, _6_nrm.cfs, _7_nrm.cfs, _2_Asserting_0.frq, _5_Asserting_0.frq, _5_Block_0.pos, _1_nrm.cfs, _5.fnm, _0_Block_0.doc, _7_nrm.cfe, _7_Asserting_0.prx, _6_nrm.cfe, _4.fdt, _4.si, _3_MockRandom_0.sd, _1_nrm.cfe, _3_Asserting_0.frq, _2_Direct_0.prx, _0_MockRandom_0.tip, _1_MockRandom_0.pyl, _6_Block_0.tip, _2_MockRandom_0.frq, _2_Direct_0.frq, _6_Block_0.tim, _0_MockRandom_0.pyl, _0_MockRandom_0.tim, _2_Direct_0.tip, _2_Block_0.pos, _2_Direct_0.tim, _7.si, _4_Asserting_0.frq, _5_MockRandom_0.pos, _1_Block_0.tip, _6_MockRandom_0.skp, _1_Block_0.tim, _2.fdt, _7.fdx, _2.fdx, _7.fdt, _0_MockRandom_0.skp, _1_MockRandom_0.tii, _3_Block_0.pos, _3_Block_0.doc, _2_Asserting_0.tim, _0_Asserting_0.frq, _2_Asserting_0.tip, _1_MockRandom_0.tib, _4_MockRandom_0.prx, _7_Block_0.pos, _3.si, _0_Asserting_0.tim, _5_Direct_0.tim, _0_Asserting_0.tip, _3_MockRandom_0.frq, _4_Asserting_0.tip, _3.fnm, _2_MockRandom_0.tiv, _7_MockRandom_0.pos, _4_Asserting_0.prx, _4_Asserting_0.tim, _2_MockRandom_0.tib, _5_MockRandom_0.doc, _5_Direct_0.tip, _5_Block_0.doc, _4_Block_0.pos, _3_Block_0.tip, _6_Asserting_0.prx, _1_Asserting_0.frq, _5_MockRandom_0.skp, _6_Direct_0.prx, _1_Asserting_0.prx, _3_MockRandom_0.pyl, _6.fnm, _6.si, _6_MockRandom_0.frq, _3_Direct_0.frq, _5.fdt, _4.fnm, _1.fnm, _7_MockRandom_0.tip, _0_Asserting_0.prx, _3_Block_0.tim, _7_MockRandom_0.tim, _3_Direct_0.prx, _7_Asserting_0.tip, _7_Asserting_0.tim, _0.fnm, _4_Block_0.tim, _4_Direct_0.tim, _5_Asserting_0.tim, _6_Block_0.doc, _5_Direct_0.frq, _4_Direct_0.prx, _7_Direct_0.frq, _0_MockRandom_

[...truncated too long message...]

:174)
[junit4:junit4]   2> 	at org.apache.solr.core.JmxMonitoredMap.clear(JmxMonitoredMap.java:116)
[junit4:junit4]   2> 	at org.apache.solr.core.SolrCore.close(SolrCore.java:864)
[junit4:junit4]   2> 	at org.apache.solr.cloud.ShardLeaderElectionContext.runLeaderProcess(ElectionContext.java:213)
[junit4:junit4]   2> 	at org.apache.solr.cloud.LeaderElector.runIamLeaderProcess(LeaderElector.java:158)
[junit4:junit4]   2> 	at org.apache.solr.cloud.LeaderElector.checkIfIamLeader(LeaderElector.java:102)
[junit4:junit4]   2> 	at org.apache.solr.cloud.LeaderElector.access$000(LeaderElector.java:56)
[junit4:junit4]   2> 	at org.apache.solr.cloud.LeaderElector$1.process(LeaderElector.java:131)
[junit4:junit4]   2> 	at org.apache.zookeeper.ClientCnxn$EventThread.processEvent(ClientCnxn.java:526)
[junit4:junit4]   2> 	at org.apache.zookeeper.ClientCnxn$EventThread.run(ClientCnxn.java:502)
[junit4:junit4]   2> 
[junit4:junit4]   2> 306982 T2410 oasc.JmxMonitoredMap$SolrDynamicMBean.getMBeanInfo WARNING Could not getStatistics on info bean Lazy[solr.ReplicationHandler] java.lang.IllegalArgumentException: /usr/home/hudson/hudson-slave/workspace/Lucene-Solr-Tests-4.x-Java6/solr/build/solr-core/test/J1/org.apache.solr.cloud.BasicDistributedZk2Test-1347770990037/jetty4/index does not exist
[junit4:junit4]   2> 	at org.apache.commons.io.FileUtils.sizeOfDirectory(FileUtils.java:2074)
[junit4:junit4]   2> 	at org.apache.solr.handler.ReplicationHandler.getIndexSize(ReplicationHandler.java:477)
[junit4:junit4]   2> 	at org.apache.solr.handler.ReplicationHandler.getStatistics(ReplicationHandler.java:525)
[junit4:junit4]   2> 	at org.apache.solr.core.RequestHandlers$LazyRequestHandlerWrapper.getStatistics(RequestHandlers.java:310)
[junit4:junit4]   2> 	at org.apache.solr.core.JmxMonitoredMap$SolrDynamicMBean.getMBeanInfo(JmxMonitoredMap.java:231)
[junit4:junit4]   2> 	at com.sun.jmx.interceptor.DefaultMBeanServerInterceptor.getClassName(DefaultMBeanServerInterceptor.java:1824)
[junit4:junit4]   2> 	at com.sun.jmx.interceptor.DefaultMBeanServerInterceptor.safeGetClassName(DefaultMBeanServerInterceptor.java:1661)
[junit4:junit4]   2> 	at com.sun.jmx.interceptor.DefaultMBeanServerInterceptor.checkMBeanPermission(DefaultMBeanServerInterceptor.java:1833)
[junit4:junit4]   2> 	at com.sun.jmx.interceptor.DefaultMBeanServerInterceptor.exclusiveUnregisterMBean(DefaultMBeanServerInterceptor.java:436)
[junit4:junit4]   2> 	at com.sun.jmx.interceptor.DefaultMBeanServerInterceptor.unregisterMBean(DefaultMBeanServerInterceptor.java:421)
[junit4:junit4]   2> 	at com.sun.jmx.mbeanserver.JmxMBeanServer.unregisterMBean(JmxMBeanServer.java:540)
[junit4:junit4]   2> 	at org.apache.solr.core.JmxMonitoredMap.unregister(JmxMonitoredMap.java:175)
[junit4:junit4]   2> 	at org.apache.solr.core.JmxMonitoredMap.clear(JmxMonitoredMap.java:116)
[junit4:junit4]   2> 	at org.apache.solr.core.SolrCore.close(SolrCore.java:864)
[junit4:junit4]   2> 	at org.apache.solr.cloud.ShardLeaderElectionContext.runLeaderProcess(ElectionContext.java:213)
[junit4:junit4]   2> 	at org.apache.solr.cloud.LeaderElector.runIamLeaderProcess(LeaderElector.java:158)
[junit4:junit4]   2> 	at org.apache.solr.cloud.LeaderElector.checkIfIamLeader(LeaderElector.java:102)
[junit4:junit4]   2> 	at org.apache.solr.cloud.LeaderElector.access$000(LeaderElector.java:56)
[junit4:junit4]   2> 	at org.apache.solr.cloud.LeaderElector$1.process(LeaderElector.java:131)
[junit4:junit4]   2> 	at org.apache.zookeeper.ClientCnxn$EventThread.processEvent(ClientCnxn.java:526)
[junit4:junit4]   2> 	at org.apache.zookeeper.ClientCnxn$EventThread.run(ClientCnxn.java:502)
[junit4:junit4]   2> 
[junit4:junit4]   2> 306986 T2410 oasc.SolrCore.closeSearcher [collection1] Closing main searcher on request.
[junit4:junit4]   2> 306990 T2410 oasu.DirectUpdateHandler2.close closing DirectUpdateHandler2{commits=5,autocommits=0,soft autocommits=0,optimizes=0,rollbacks=0,expungeDeletes=0,docsPending=0,adds=0,deletesById=0,deletesByQuery=0,errors=0,cumulative_adds=35,cumulative_deletesById=0,cumulative_deletesByQuery=0,cumulative_errors=0}
[junit4:junit4]   2> 306990 T2410 oasu.DefaultSolrCoreState.decref SolrCoreState ref count has reached 0 - closing IndexWriter
[junit4:junit4]   2> 306992 T2410 oasu.DefaultSolrCoreState.decref Closing SolrCoreState - canceling any ongoing recovery
[junit4:junit4]   2> 306992 T2410 oascc.ZkStateReader$3.process Updating live nodes
[junit4:junit4]   2> 306992 T2410 oascc.ZkStateReader$3.process WARNING ZooKeeper watch triggered, but Solr cannot talk to ZK
[junit4:junit4]   2> 306993 T2410 oascc.ZkStateReader$2.process A cluster state change has occurred - updating...
[junit4:junit4]   2> 306993 T2410 oascc.ZkStateReader$2.process WARNING ZooKeeper watch triggered, but Solr cannot talk to ZK
[junit4:junit4]   2> 306993 T2410 oascc.ConnectionManager.process Watcher org.apache.solr.common.cloud.ConnectionManager@782403e9 name:ZooKeeperConnection Watcher:127.0.0.1:33505/solr got event WatchedEvent state:Disconnected type:None path:null path:null type:None
[junit4:junit4]   2> 306993 T2410 oascc.ConnectionManager.process Client->ZooKeeper status change trigger but we are already closed
[junit4:junit4]   2> 306993 T2410 oaz.ClientCnxn$EventThread.run EventThread shut down
[junit4:junit4]   2> NOTE: test params are: codec=Lucene40: {n_f1=PostingsFormat(name=MockRandom), foo_b=Block(blocksize=128), foo_d=PostingsFormat(name=Direct), foo_f=Block(blocksize=128), n_tl1=PostingsFormat(name=MockRandom), n_d1=PostingsFormat(name=Asserting), rnd_b=PostingsFormat(name=Direct), intDefault=PostingsFormat(name=Asserting), n_td1=PostingsFormat(name=MockRandom), id=PostingsFormat(name=Direct), timestamp=PostingsFormat(name=Asserting), range_facet_sl=Block(blocksize=128), range_facet_si=PostingsFormat(name=MockRandom), oddField_s=Block(blocksize=128), multiDefault=PostingsFormat(name=MockRandom), n_tf1=PostingsFormat(name=Asserting), n_dt1=PostingsFormat(name=MockRandom), n_ti1=PostingsFormat(name=Direct), range_facet_l=PostingsFormat(name=Asserting), text=Block(blocksize=128), _version_=PostingsFormat(name=Asserting), SubjectTerms_mfacet=PostingsFormat(name=Asserting), a_t=PostingsFormat(name=Asserting), n_tdt1=PostingsFormat(name=Asserting), other_tl1=PostingsFormat(name=Asserting), n_l1=PostingsFormat(name=Asserting), a_si=PostingsFormat(name=MockRandom)}, sim=RandomSimilarityProvider(queryNorm=true,coord=yes): {}, locale=ms_MY, timezone=Asia/Ulan_Bator
[junit4:junit4]   2> NOTE: FreeBSD 9.0-RELEASE amd64/Sun Microsystems Inc. 1.6.0_32 (64-bit)/cpus=16,threads=2,free=115056944,total=252706816
[junit4:junit4]   2> NOTE: All tests run in this JVM: [SyncSliceTest, ReturnFieldsTest, IndexSchemaRuntimeFieldTest, TestBM25SimilarityFactory, TestSort, StandardRequestHandlerTest, XsltUpdateRequestHandlerTest, TestFastWriter, BasicZkTest, PeerSyncTest, TestDFRSimilarityFactory, FileUtilsTest, QueryParsingTest, TestSolrCoreProperties, TestValueSourceCache, TestRecovery, TestFoldingMultitermQuery, TestPropInject, PrimUtilsTest, TestDistributedGrouping, LukeRequestHandlerTest, TestSurroundQueryParser, TestCSVResponseWriter, SolrInfoMBeanTest, ScriptEngineTest, TestArbitraryIndexDir, IndexSchemaTest, TestTrie, SolrIndexConfigTest, TestDocumentBuilder, PrimitiveFieldTypeTest, DistributedQueryElevationComponentTest, OpenExchangeRatesOrgProviderTest, TestCodecSupport, ShowFileRequestHandlerTest, SuggesterTest, OverseerTest, SoftAutoCommitTest, TestLRUCache, TestBinaryField, ZkSolrClientTest, TestStressRecovery, TestUpdate, ConvertedLegacyTest, XmlUpdateRequestHandlerTest, URLClassifyProcessorTest, TestRemoteStreaming, QueryEqualityTest, HighlighterTest, TestQueryUtils, PolyFieldTest, StatelessScriptUpdateProcessorFactoryTest, TestWriterPerf, TestCSVLoader, TestMergePolicyConfig, ZkNodePropsTest, TestJmxIntegration, RecoveryZkTest, SpellCheckComponentTest, FullSolrCloudDistribCmdsTest, TestReplicationHandler, LeaderElectionTest, TestRealTimeGet, ZkControllerTest, TestDistributedSearch, TestGroupingSearch, QueryElevationComponentTest, BasicFunctionalityTest, SignatureUpdateProcessorFactoryTest, SampleTest, TestFunctionQuery, DocumentBuilderTest, CurrencyFieldTest, TermsComponentTest, PingRequestHandlerTest, JsonLoaderTest, DirectUpdateHandlerOptimizeTest, TestReversedWildcardFilterFactory, SearchHandlerTest, TestOmitPositions, SuggesterTSTTest, UpdateParamsTest, TestSearchPerf, BadIndexSchemaTest, SolrCoreCheckLockOnStartupTest, TestLuceneMatchVersion, UpdateRequestProcessorFactoryTest, FieldMutatingUpdateProcessorTest, TestPropInjectDefaults, TestDocSet, TestLFUCache, TestCollationField, OutputWriterTest, MultiTermTest, EchoParamsTest, TestPhraseSuggestions, TestPluginEnable, TestIBSimilarityFactory, TestFastLRUCache, TestSystemIdResolver, SpellingQueryConverterTest, TestBadConfig, PathHierarchyTokenizerFactoryTest, TestCharFilters, TestCollationKeyRangeQueries, BasicDistributedZk2Test]
[junit4:junit4] Completed on J1 in 307.47s, 1 test, 1 failure <<< FAILURES!

[...truncated 5 lines...]
BUILD FAILED
/usr/home/hudson/hudson-slave/workspace/Lucene-Solr-Tests-4.x-Java6/build.xml:32: The following error occurred while executing this line:
/usr/home/hudson/hudson-slave/workspace/Lucene-Solr-Tests-4.x-Java6/solr/build.xml:146: The following error occurred while executing this line:
/usr/home/hudson/hudson-slave/workspace/Lucene-Solr-Tests-4.x-Java6/lucene/module-build.xml:63: The following error occurred while executing this line:
/usr/home/hudson/hudson-slave/workspace/Lucene-Solr-Tests-4.x-Java6/lucene/common-build.xml:1133: The following error occurred while executing this line:
/usr/home/hudson/hudson-slave/workspace/Lucene-Solr-Tests-4.x-Java6/lucene/common-build.xml:810: There were test failures: 229 suites, 927 tests, 1 failure, 6 ignored (1 assumption)

Total time: 32 minutes 18 seconds
Build step 'Invoke Ant' marked build as failure
Recording test results
Email was triggered for: Failure
Sending email for trigger: Failure



Mime
View raw message