lucene-dev mailing list archives

Site index · List index
Message view « Date » · « Thread »
Top « Date » · « Thread »
From Apache Jenkins Server <jenk...@builds.apache.org>
Subject [JENKINS] Lucene-Solr-Tests-trunk-java7 - Build # 3226 - Failure
Date Wed, 19 Sep 2012 03:10:04 GMT
Build: https://builds.apache.org/job/Lucene-Solr-Tests-trunk-java7/3226/

2 tests failed.
REGRESSION:  org.apache.solr.cloud.BasicDistributedZk2Test.testDistribSearch

Error Message:
Shard still reported as live in zk

Stack Trace:
java.lang.AssertionError: Shard still reported as live in zk
	at __randomizedtesting.SeedInfo.seed([F5F4448AEC64ED86:7412CA929B3B8DBA]:0)
	at org.junit.Assert.fail(Assert.java:93)
	at org.apache.solr.cloud.AbstractFullDistribZkTestBase.waitToSeeNotLive(AbstractFullDistribZkTestBase.java:1220)
	at org.apache.solr.cloud.BasicDistributedZk2Test.brindDownShardIndexSomeDocsAndRecover(BasicDistributedZk2Test.java:190)
	at org.apache.solr.cloud.BasicDistributedZk2Test.doTest(BasicDistributedZk2Test.java:83)
	at org.apache.solr.BaseDistributedSearchTestCase.testDistribSearch(BaseDistributedSearchTestCase.java:695)
	at sun.reflect.NativeMethodAccessorImpl.invoke0(Native Method)
	at sun.reflect.NativeMethodAccessorImpl.invoke(NativeMethodAccessorImpl.java:57)
	at sun.reflect.DelegatingMethodAccessorImpl.invoke(DelegatingMethodAccessorImpl.java:43)
	at java.lang.reflect.Method.invoke(Method.java:601)
	at com.carrotsearch.randomizedtesting.RandomizedRunner.invoke(RandomizedRunner.java:1559)
	at com.carrotsearch.randomizedtesting.RandomizedRunner.access$600(RandomizedRunner.java:79)
	at com.carrotsearch.randomizedtesting.RandomizedRunner$6.evaluate(RandomizedRunner.java:737)
	at com.carrotsearch.randomizedtesting.RandomizedRunner$7.evaluate(RandomizedRunner.java:773)
	at com.carrotsearch.randomizedtesting.RandomizedRunner$8.evaluate(RandomizedRunner.java:787)
	at com.carrotsearch.randomizedtesting.rules.SystemPropertiesRestoreRule$1.evaluate(SystemPropertiesRestoreRule.java:53)
	at org.apache.lucene.util.TestRuleSetupTeardownChained$1.evaluate(TestRuleSetupTeardownChained.java:50)
	at org.apache.lucene.util.TestRuleFieldCacheSanity$1.evaluate(TestRuleFieldCacheSanity.java:51)
	at org.apache.lucene.util.AbstractBeforeAfterRule$1.evaluate(AbstractBeforeAfterRule.java:45)
	at com.carrotsearch.randomizedtesting.rules.SystemPropertiesInvariantRule$1.evaluate(SystemPropertiesInvariantRule.java:55)
	at org.apache.lucene.util.TestRuleThreadAndTestName$1.evaluate(TestRuleThreadAndTestName.java:48)
	at org.apache.lucene.util.TestRuleIgnoreAfterMaxFailures$1.evaluate(TestRuleIgnoreAfterMaxFailures.java:70)
	at org.apache.lucene.util.TestRuleMarkFailure$1.evaluate(TestRuleMarkFailure.java:48)
	at com.carrotsearch.randomizedtesting.rules.StatementAdapter.evaluate(StatementAdapter.java:36)
	at com.carrotsearch.randomizedtesting.ThreadLeakControl$StatementRunner.run(ThreadLeakControl.java:358)
	at com.carrotsearch.randomizedtesting.ThreadLeakControl.forkTimeoutingTask(ThreadLeakControl.java:782)
	at com.carrotsearch.randomizedtesting.ThreadLeakControl$3.evaluate(ThreadLeakControl.java:442)
	at com.carrotsearch.randomizedtesting.RandomizedRunner.runSingleTest(RandomizedRunner.java:746)
	at com.carrotsearch.randomizedtesting.RandomizedRunner$3.evaluate(RandomizedRunner.java:648)
	at com.carrotsearch.randomizedtesting.RandomizedRunner$4.evaluate(RandomizedRunner.java:682)
	at com.carrotsearch.randomizedtesting.RandomizedRunner$5.evaluate(RandomizedRunner.java:693)
	at com.carrotsearch.randomizedtesting.rules.StatementAdapter.evaluate(StatementAdapter.java:36)
	at com.carrotsearch.randomizedtesting.rules.SystemPropertiesRestoreRule$1.evaluate(SystemPropertiesRestoreRule.java:53)
	at org.apache.lucene.util.AbstractBeforeAfterRule$1.evaluate(AbstractBeforeAfterRule.java:45)
	at org.apache.lucene.util.TestRuleStoreClassName$1.evaluate(TestRuleStoreClassName.java:42)
	at com.carrotsearch.randomizedtesting.rules.SystemPropertiesInvariantRule$1.evaluate(SystemPropertiesInvariantRule.java:55)
	at com.carrotsearch.randomizedtesting.rules.NoShadowingOrOverridesOnMethodsRule$1.evaluate(NoShadowingOrOverridesOnMethodsRule.java:39)
	at com.carrotsearch.randomizedtesting.rules.NoShadowingOrOverridesOnMethodsRule$1.evaluate(NoShadowingOrOverridesOnMethodsRule.java:39)
	at com.carrotsearch.randomizedtesting.rules.StatementAdapter.evaluate(StatementAdapter.java:36)
	at org.apache.lucene.util.TestRuleAssertionsRequired$1.evaluate(TestRuleAssertionsRequired.java:43)
	at org.apache.lucene.util.TestRuleMarkFailure$1.evaluate(TestRuleMarkFailure.java:48)
	at org.apache.lucene.util.TestRuleIgnoreAfterMaxFailures$1.evaluate(TestRuleIgnoreAfterMaxFailures.java:70)
	at org.apache.lucene.util.TestRuleIgnoreTestSuites$1.evaluate(TestRuleIgnoreTestSuites.java:55)
	at com.carrotsearch.randomizedtesting.rules.StatementAdapter.evaluate(StatementAdapter.java:36)
	at com.carrotsearch.randomizedtesting.ThreadLeakControl$StatementRunner.run(ThreadLeakControl.java:358)
	at java.lang.Thread.run(Thread.java:722)


REGRESSION:  org.apache.solr.cloud.SyncSliceTest.testDistribSearch

Error Message:
No live SolrServers available to handle this request

Stack Trace:
org.apache.solr.client.solrj.SolrServerException: No live SolrServers available to handle this request
	at __randomizedtesting.SeedInfo.seed([F5F4448AEC64ED86:7412CA929B3B8DBA]:0)
	at org.apache.solr.client.solrj.impl.LBHttpSolrServer.request(LBHttpSolrServer.java:323)
	at org.apache.solr.client.solrj.impl.CloudSolrServer.request(CloudSolrServer.java:257)
	at org.apache.solr.client.solrj.request.QueryRequest.process(QueryRequest.java:90)
	at org.apache.solr.client.solrj.SolrServer.query(SolrServer.java:324)
	at org.apache.solr.cloud.AbstractFullDistribZkTestBase.checkShardConsistency(AbstractFullDistribZkTestBase.java:909)
	at org.apache.solr.cloud.SyncSliceTest.doTest(SyncSliceTest.java:226)
	at org.apache.solr.BaseDistributedSearchTestCase.testDistribSearch(BaseDistributedSearchTestCase.java:695)
	at sun.reflect.NativeMethodAccessorImpl.invoke0(Native Method)
	at sun.reflect.NativeMethodAccessorImpl.invoke(NativeMethodAccessorImpl.java:57)
	at sun.reflect.DelegatingMethodAccessorImpl.invoke(DelegatingMethodAccessorImpl.java:43)
	at java.lang.reflect.Method.invoke(Method.java:601)
	at com.carrotsearch.randomizedtesting.RandomizedRunner.invoke(RandomizedRunner.java:1559)
	at com.carrotsearch.randomizedtesting.RandomizedRunner.access$600(RandomizedRunner.java:79)
	at com.carrotsearch.randomizedtesting.RandomizedRunner$6.evaluate(RandomizedRunner.java:737)
	at com.carrotsearch.randomizedtesting.RandomizedRunner$7.evaluate(RandomizedRunner.java:773)
	at com.carrotsearch.randomizedtesting.RandomizedRunner$8.evaluate(RandomizedRunner.java:787)
	at com.carrotsearch.randomizedtesting.rules.SystemPropertiesRestoreRule$1.evaluate(SystemPropertiesRestoreRule.java:53)
	at org.apache.lucene.util.TestRuleSetupTeardownChained$1.evaluate(TestRuleSetupTeardownChained.java:50)
	at org.apache.lucene.util.TestRuleFieldCacheSanity$1.evaluate(TestRuleFieldCacheSanity.java:51)
	at org.apache.lucene.util.AbstractBeforeAfterRule$1.evaluate(AbstractBeforeAfterRule.java:45)
	at com.carrotsearch.randomizedtesting.rules.SystemPropertiesInvariantRule$1.evaluate(SystemPropertiesInvariantRule.java:55)
	at org.apache.lucene.util.TestRuleThreadAndTestName$1.evaluate(TestRuleThreadAndTestName.java:48)
	at org.apache.lucene.util.TestRuleIgnoreAfterMaxFailures$1.evaluate(TestRuleIgnoreAfterMaxFailures.java:70)
	at org.apache.lucene.util.TestRuleMarkFailure$1.evaluate(TestRuleMarkFailure.java:48)
	at com.carrotsearch.randomizedtesting.rules.StatementAdapter.evaluate(StatementAdapter.java:36)
	at com.carrotsearch.randomizedtesting.ThreadLeakControl$StatementRunner.run(ThreadLeakControl.java:358)
	at com.carrotsearch.randomizedtesting.ThreadLeakControl.forkTimeoutingTask(ThreadLeakControl.java:782)
	at com.carrotsearch.randomizedtesting.ThreadLeakControl$3.evaluate(ThreadLeakControl.java:442)
	at com.carrotsearch.randomizedtesting.RandomizedRunner.runSingleTest(RandomizedRunner.java:746)
	at com.carrotsearch.randomizedtesting.RandomizedRunner$3.evaluate(RandomizedRunner.java:648)
	at com.carrotsearch.randomizedtesting.RandomizedRunner$4.evaluate(RandomizedRunner.java:682)
	at com.carrotsearch.randomizedtesting.RandomizedRunner$5.evaluate(RandomizedRunner.java:693)
	at com.carrotsearch.randomizedtesting.rules.StatementAdapter.evaluate(StatementAdapter.java:36)
	at com.carrotsearch.randomizedtesting.rules.SystemPropertiesRestoreRule$1.evaluate(SystemPropertiesRestoreRule.java:53)
	at org.apache.lucene.util.AbstractBeforeAfterRule$1.evaluate(AbstractBeforeAfterRule.java:45)
	at org.apache.lucene.util.TestRuleStoreClassName$1.evaluate(TestRuleStoreClassName.java:42)
	at com.carrotsearch.randomizedtesting.rules.SystemPropertiesInvariantRule$1.evaluate(SystemPropertiesInvariantRule.java:55)
	at com.carrotsearch.randomizedtesting.rules.NoShadowingOrOverridesOnMethodsRule$1.evaluate(NoShadowingOrOverridesOnMethodsRule.java:39)
	at com.carrotsearch.randomizedtesting.rules.NoShadowingOrOverridesOnMethodsRule$1.evaluate(NoShadowingOrOverridesOnMethodsRule.java:39)
	at com.carrotsearch.randomizedtesting.rules.StatementAdapter.evaluate(StatementAdapter.java:36)
	at org.apache.lucene.util.TestRuleAssertionsRequired$1.evaluate(TestRuleAssertionsRequired.java:43)
	at org.apache.lucene.util.TestRuleMarkFailure$1.evaluate(TestRuleMarkFailure.java:48)
	at org.apache.lucene.util.TestRuleIgnoreAfterMaxFailures$1.evaluate(TestRuleIgnoreAfterMaxFailures.java:70)
	at org.apache.lucene.util.TestRuleIgnoreTestSuites$1.evaluate(TestRuleIgnoreTestSuites.java:55)
	at com.carrotsearch.randomizedtesting.rules.StatementAdapter.evaluate(StatementAdapter.java:36)
	at com.carrotsearch.randomizedtesting.ThreadLeakControl$StatementRunner.run(ThreadLeakControl.java:358)
	at java.lang.Thread.run(Thread.java:722)




Build Log:
[...truncated 7884 lines...]
[junit4:junit4] Suite: org.apache.solr.cloud.BasicDistributedZk2Test
[junit4:junit4]   2> 5 T315 oas.SolrTestCaseJ4.setUp ###Starting testDistribSearch
[junit4:junit4]   2> Creating dataDir: /usr/home/hudson/hudson-slave/workspace/Lucene-Solr-Tests-trunk-java7/solr/build/solr-core/test/J1/./solrtest-BasicDistributedZk2Test-1348023180448
[junit4:junit4]   2> 7 T315 oasc.ZkTestServer.run STARTING ZK TEST SERVER
[junit4:junit4]   2> 10 T316 oazs.ZooKeeperServer.setTickTime tickTime set to 1000
[junit4:junit4]   2> 10 T316 oazs.NIOServerCnxn$Factory.<init> binding to port 0.0.0.0/0.0.0.0:0
[junit4:junit4]   2> 11 T316 oazsp.FileTxnSnapLog.save Snapshotting: 0
[junit4:junit4]   2> 108 T315 oasc.ZkTestServer.run start zk server on port:12233
[junit4:junit4]   2> 108 T315 oaz.ZooKeeper.<init> Initiating client connection, connectString=127.0.0.1:12233 sessionTimeout=10000 watcher=org.apache.solr.common.cloud.ConnectionManager@30a48f13
[junit4:junit4]   2> 109 T321 oaz.ClientCnxn$SendThread.startConnect Opening socket connection to server /127.0.0.1:12233
[junit4:junit4]   2> 109 T315 oascc.ConnectionManager.waitForConnected Waiting for client to connect to ZooKeeper
[junit4:junit4]   2> 110 T321 oaz.ClientCnxn$SendThread.primeConnection Socket connection established to localhost/127.0.0.1:12233, initiating session
[junit4:junit4]   2> 111 T317 oazs.NIOServerCnxn$Factory.run Accepted socket connection from /140.211.11.196:12234
[junit4:junit4]   2> 111 T317 oazs.NIOServerCnxn.readConnectRequest Client attempting to establish new session at /140.211.11.196:12234
[junit4:junit4]   2> 111 T319 oazsp.FileTxnLog.append Creating new log file: log.1
[junit4:junit4]   2> 114 T319 oazs.NIOServerCnxn.finishSessionInit Established session 0x139dc715ca60000 with negotiated timeout 10000 for client /140.211.11.196:12234
[junit4:junit4]   2> 114 T321 oaz.ClientCnxn$SendThread.readConnectResult Session establishment complete on server localhost/127.0.0.1:12233, sessionid = 0x139dc715ca60000, negotiated timeout = 10000
[junit4:junit4]   2> 115 T322 oascc.ConnectionManager.process Watcher org.apache.solr.common.cloud.ConnectionManager@30a48f13 name:ZooKeeperConnection Watcher:127.0.0.1:12233 got event WatchedEvent state:SyncConnected type:None path:null path:null type:None
[junit4:junit4]   2> 115 T315 oascc.ConnectionManager.waitForConnected Client is connected to ZooKeeper
[junit4:junit4]   2> 115 T315 oascc.SolrZkClient.makePath makePath: /solr
[junit4:junit4]   2> 118 T320 oazs.PrepRequestProcessor.pRequest Processed session termination for sessionid: 0x139dc715ca60000
[junit4:junit4]   2> 126 T322 oaz.ClientCnxn$EventThread.run EventThread shut down
[junit4:junit4]   2> 126 T315 oaz.ZooKeeper.close Session: 0x139dc715ca60000 closed
[junit4:junit4]   2> 126 T317 oazs.NIOServerCnxn.closeSock Closed socket connection for client /140.211.11.196:12234 which had sessionid 0x139dc715ca60000
[junit4:junit4]   2> 127 T315 oaz.ZooKeeper.<init> Initiating client connection, connectString=127.0.0.1:12233/solr sessionTimeout=10000 watcher=org.apache.solr.common.cloud.ConnectionManager@3088d5f2
[junit4:junit4]   2> 127 T323 oaz.ClientCnxn$SendThread.startConnect Opening socket connection to server /127.0.0.1:12233
[junit4:junit4]   2> 127 T315 oascc.ConnectionManager.waitForConnected Waiting for client to connect to ZooKeeper
[junit4:junit4]   2> 128 T323 oaz.ClientCnxn$SendThread.primeConnection Socket connection established to localhost/127.0.0.1:12233, initiating session
[junit4:junit4]   2> 128 T317 oazs.NIOServerCnxn$Factory.run Accepted socket connection from /140.211.11.196:12235
[junit4:junit4]   2> 129 T317 oazs.NIOServerCnxn.readConnectRequest Client attempting to establish new session at /140.211.11.196:12235
[junit4:junit4]   2> 130 T319 oazs.NIOServerCnxn.finishSessionInit Established session 0x139dc715ca60001 with negotiated timeout 10000 for client /140.211.11.196:12235
[junit4:junit4]   2> 130 T323 oaz.ClientCnxn$SendThread.readConnectResult Session establishment complete on server localhost/127.0.0.1:12233, sessionid = 0x139dc715ca60001, negotiated timeout = 10000
[junit4:junit4]   2> 130 T324 oascc.ConnectionManager.process Watcher org.apache.solr.common.cloud.ConnectionManager@3088d5f2 name:ZooKeeperConnection Watcher:127.0.0.1:12233/solr got event WatchedEvent state:SyncConnected type:None path:null path:null type:None
[junit4:junit4]   2> 131 T315 oascc.ConnectionManager.waitForConnected Client is connected to ZooKeeper
[junit4:junit4]   2> 131 T315 oascc.SolrZkClient.makePath makePath: /collections/collection1
[junit4:junit4]   2> 141 T315 oascc.SolrZkClient.makePath makePath: /collections/collection1/shards
[junit4:junit4]   2> 144 T315 oascc.SolrZkClient.makePath makePath: /collections/control_collection
[junit4:junit4]   2> 147 T315 oascc.SolrZkClient.makePath makePath: /collections/control_collection/shards
[junit4:junit4]   2> 155 T315 oasc.AbstractZkTestCase.putConfig put /usr/home/hudson/hudson-slave/workspace/Lucene-Solr-Tests-trunk-java7/solr/build/solr-core/test-files/solr/collection1/conf/solrconfig.xml to /configs/conf1/solrconfig.xml
[junit4:junit4]   2> 156 T315 oascc.SolrZkClient.makePath makePath: /configs/conf1/solrconfig.xml
[junit4:junit4]   2> 170 T315 oasc.AbstractZkTestCase.putConfig put /usr/home/hudson/hudson-slave/workspace/Lucene-Solr-Tests-trunk-java7/solr/build/solr-core/test-files/solr/collection1/conf/schema.xml to /configs/conf1/schema.xml
[junit4:junit4]   2> 171 T315 oascc.SolrZkClient.makePath makePath: /configs/conf1/schema.xml
[junit4:junit4]   2> 276 T315 oasc.AbstractZkTestCase.putConfig put /usr/home/hudson/hudson-slave/workspace/Lucene-Solr-Tests-trunk-java7/solr/build/solr-core/test-files/solr/collection1/conf/solrconfig.xml to /configs/conf1/solrconfig.xml
[junit4:junit4]   2> 277 T315 oascc.SolrZkClient.makePath makePath: /configs/conf1/solrconfig.xml
[junit4:junit4]   2> 280 T315 oasc.AbstractZkTestCase.putConfig put /usr/home/hudson/hudson-slave/workspace/Lucene-Solr-Tests-trunk-java7/solr/build/solr-core/test-files/solr/collection1/conf/stopwords.txt to /configs/conf1/stopwords.txt
[junit4:junit4]   2> 281 T315 oascc.SolrZkClient.makePath makePath: /configs/conf1/stopwords.txt
[junit4:junit4]   2> 284 T315 oasc.AbstractZkTestCase.putConfig put /usr/home/hudson/hudson-slave/workspace/Lucene-Solr-Tests-trunk-java7/solr/build/solr-core/test-files/solr/collection1/conf/protwords.txt to /configs/conf1/protwords.txt
[junit4:junit4]   2> 285 T315 oascc.SolrZkClient.makePath makePath: /configs/conf1/protwords.txt
[junit4:junit4]   2> 289 T315 oasc.AbstractZkTestCase.putConfig put /usr/home/hudson/hudson-slave/workspace/Lucene-Solr-Tests-trunk-java7/solr/build/solr-core/test-files/solr/collection1/conf/currency.xml to /configs/conf1/currency.xml
[junit4:junit4]   2> 290 T315 oascc.SolrZkClient.makePath makePath: /configs/conf1/currency.xml
[junit4:junit4]   2> 294 T315 oasc.AbstractZkTestCase.putConfig put /usr/home/hudson/hudson-slave/workspace/Lucene-Solr-Tests-trunk-java7/solr/build/solr-core/test-files/solr/collection1/conf/open-exchange-rates.json to /configs/conf1/open-exchange-rates.json
[junit4:junit4]   2> 295 T315 oascc.SolrZkClient.makePath makePath: /configs/conf1/open-exchange-rates.json
[junit4:junit4]   2> 298 T315 oasc.AbstractZkTestCase.putConfig put /usr/home/hudson/hudson-slave/workspace/Lucene-Solr-Tests-trunk-java7/solr/build/solr-core/test-files/solr/collection1/conf/mapping-ISOLatin1Accent.txt to /configs/conf1/mapping-ISOLatin1Accent.txt
[junit4:junit4]   2> 299 T315 oascc.SolrZkClient.makePath makePath: /configs/conf1/mapping-ISOLatin1Accent.txt
[junit4:junit4]   2> 306 T315 oasc.AbstractZkTestCase.putConfig put /usr/home/hudson/hudson-slave/workspace/Lucene-Solr-Tests-trunk-java7/solr/build/solr-core/test-files/solr/collection1/conf/old_synonyms.txt to /configs/conf1/old_synonyms.txt
[junit4:junit4]   2> 307 T315 oascc.SolrZkClient.makePath makePath: /configs/conf1/old_synonyms.txt
[junit4:junit4]   2> 310 T315 oasc.AbstractZkTestCase.putConfig put /usr/home/hudson/hudson-slave/workspace/Lucene-Solr-Tests-trunk-java7/solr/build/solr-core/test-files/solr/collection1/conf/synonyms.txt to /configs/conf1/synonyms.txt
[junit4:junit4]   2> 311 T315 oascc.SolrZkClient.makePath makePath: /configs/conf1/synonyms.txt
[junit4:junit4]   2> 315 T320 oazs.PrepRequestProcessor.pRequest Processed session termination for sessionid: 0x139dc715ca60001
[junit4:junit4]   2> 316 T324 oaz.ClientCnxn$EventThread.run EventThread shut down
[junit4:junit4]   2> 316 T315 oaz.ZooKeeper.close Session: 0x139dc715ca60001 closed
[junit4:junit4]   2> 316 T317 oazs.NIOServerCnxn.closeSock Closed socket connection for client /140.211.11.196:12235 which had sessionid 0x139dc715ca60001
[junit4:junit4]   2> 318 T315 oejs.Server.doStart jetty-8.1.2.v20120308
[junit4:junit4]   2> 322 T315 oejs.AbstractConnector.doStart Started SocketConnector@0.0.0.0:12237
[junit4:junit4]   2> 323 T315 oasc.SolrResourceLoader.locateSolrHome JNDI not configured for solr (NoInitialContextEx)
[junit4:junit4]   2> 323 T315 oasc.SolrResourceLoader.locateSolrHome using system property solr.solr.home: /usr/home/hudson/hudson-slave/workspace/Lucene-Solr-Tests-trunk-java7/solr/build/solr-core/test-files/solr
[junit4:junit4]   2> 324 T315 oasc.SolrResourceLoader.<init> new SolrResourceLoader for deduced Solr Home: '/usr/home/hudson/hudson-slave/workspace/Lucene-Solr-Tests-trunk-java7/solr/build/solr-core/test-files/solr/'
[junit4:junit4]   2> 345 T315 oass.SolrDispatchFilter.init SolrDispatchFilter.init()
[junit4:junit4]   2> 346 T315 oasc.SolrResourceLoader.locateSolrHome JNDI not configured for solr (NoInitialContextEx)
[junit4:junit4]   2> 347 T315 oasc.SolrResourceLoader.locateSolrHome using system property solr.solr.home: /usr/home/hudson/hudson-slave/workspace/Lucene-Solr-Tests-trunk-java7/solr/build/solr-core/test-files/solr
[junit4:junit4]   2> 347 T315 oasc.CoreContainer$Initializer.initialize looking for solr.xml: /usr/home/hudson/hudson-slave/workspace/Lucene-Solr-Tests-trunk-java7/solr/build/solr-core/test-files/solr/solr.xml
[junit4:junit4]   2> 347 T315 oasc.CoreContainer.<init> New CoreContainer 697006769
[junit4:junit4]   2> 348 T315 oasc.CoreContainer.load Loading CoreContainer using Solr Home: '/usr/home/hudson/hudson-slave/workspace/Lucene-Solr-Tests-trunk-java7/solr/build/solr-core/test-files/solr/'
[junit4:junit4]   2> 348 T315 oasc.SolrResourceLoader.<init> new SolrResourceLoader for directory: '/usr/home/hudson/hudson-slave/workspace/Lucene-Solr-Tests-trunk-java7/solr/build/solr-core/test-files/solr/'
[junit4:junit4]   2> 388 T315 oasc.CoreContainer.load Registering Log Listener
[junit4:junit4]   2> 401 T315 oasc.CoreContainer.initZooKeeper Zookeeper client=127.0.0.1:12233/solr
[junit4:junit4]   2> 402 T315 oaz.ZooKeeper.<init> Initiating client connection, connectString=127.0.0.1:12233/solr sessionTimeout=5000 watcher=org.apache.solr.common.cloud.ConnectionManager@7d59c45a
[junit4:junit4]   2> 403 T334 oaz.ClientCnxn$SendThread.startConnect Opening socket connection to server /127.0.0.1:12233
[junit4:junit4]   2> 403 T315 oascc.ConnectionManager.waitForConnected Waiting for client to connect to ZooKeeper
[junit4:junit4]   2> 404 T334 oaz.ClientCnxn$SendThread.primeConnection Socket connection established to localhost/127.0.0.1:12233, initiating session
[junit4:junit4]   2> 404 T317 oazs.NIOServerCnxn$Factory.run Accepted socket connection from /140.211.11.196:12238
[junit4:junit4]   2> 405 T317 oazs.NIOServerCnxn.readConnectRequest Client attempting to establish new session at /140.211.11.196:12238
[junit4:junit4]   2> 407 T319 oazs.NIOServerCnxn.finishSessionInit Established session 0x139dc715ca60002 with negotiated timeout 5000 for client /140.211.11.196:12238
[junit4:junit4]   2> 407 T334 oaz.ClientCnxn$SendThread.readConnectResult Session establishment complete on server localhost/127.0.0.1:12233, sessionid = 0x139dc715ca60002, negotiated timeout = 5000
[junit4:junit4]   2> 408 T335 oascc.ConnectionManager.process Watcher org.apache.solr.common.cloud.ConnectionManager@7d59c45a name:ZooKeeperConnection Watcher:127.0.0.1:12233/solr got event WatchedEvent state:SyncConnected type:None path:null path:null type:None
[junit4:junit4]   2> 408 T315 oascc.ConnectionManager.waitForConnected Client is connected to ZooKeeper
[junit4:junit4]   2> 411 T320 oazs.PrepRequestProcessor.pRequest Got user-level KeeperException when processing sessionid:0x139dc715ca60002 type:create cxid:0x2 zxid:0xfffffffffffffffe txntype:unknown reqpath:n/a Error Path:/solr/overseer Error:KeeperErrorCode = NodeExists for /solr/overseer
[junit4:junit4]   2> 412 T315 oascc.SolrZkClient.makePath makePath: /live_nodes
[junit4:junit4]   2> 421 T315 oasc.ZkController.createEphemeralLiveNode Register node as live in ZooKeeper:/live_nodes/127.0.0.1:12237_solr
[junit4:junit4]   2> 422 T320 oazs.PrepRequestProcessor.pRequest Got user-level KeeperException when processing sessionid:0x139dc715ca60002 type:delete cxid:0x7 zxid:0xfffffffffffffffe txntype:unknown reqpath:n/a Error Path:/solr/live_nodes/127.0.0.1:12237_solr Error:KeeperErrorCode = NoNode for /solr/live_nodes/127.0.0.1:12237_solr
[junit4:junit4]   2> 424 T315 oascc.SolrZkClient.makePath makePath: /live_nodes/127.0.0.1:12237_solr
[junit4:junit4]   2> 428 T315 oashc.HttpShardHandlerFactory.getParameter Setting socketTimeout to: 0
[junit4:junit4]   2> 428 T315 oashc.HttpShardHandlerFactory.getParameter Setting urlScheme to: http://
[junit4:junit4]   2> 429 T315 oashc.HttpShardHandlerFactory.getParameter Setting connTimeout to: 0
[junit4:junit4]   2> 429 T315 oashc.HttpShardHandlerFactory.getParameter Setting maxConnectionsPerHost to: 20
[junit4:junit4]   2> 429 T315 oashc.HttpShardHandlerFactory.getParameter Setting corePoolSize to: 0
[junit4:junit4]   2> 430 T315 oashc.HttpShardHandlerFactory.getParameter Setting maximumPoolSize to: 2147483647
[junit4:junit4]   2> 430 T315 oashc.HttpShardHandlerFactory.getParameter Setting maxThreadIdleTime to: 5
[junit4:junit4]   2> 431 T315 oashc.HttpShardHandlerFactory.getParameter Setting sizeOfQueue to: -1
[junit4:junit4]   2> 431 T315 oashc.HttpShardHandlerFactory.getParameter Setting fairnessPolicy to: false
[junit4:junit4]   2> 431 T315 oascsi.HttpClientUtil.createClient Creating new http client, config:maxConnectionsPerHost=20&maxConnections=10000&socketTimeout=0&connTimeout=0&retry=false
[junit4:junit4]   2> 444 T315 oascc.SolrZkClient.makePath makePath: /overseer_elect/election
[junit4:junit4]   2> 451 T320 oazs.PrepRequestProcessor.pRequest Got user-level KeeperException when processing sessionid:0x139dc715ca60002 type:delete cxid:0x15 zxid:0xfffffffffffffffe txntype:unknown reqpath:n/a Error Path:/solr/overseer_elect/leader Error:KeeperErrorCode = NoNode for /solr/overseer_elect/leader
[junit4:junit4]   2> 459 T315 oascc.SolrZkClient.makePath makePath: /overseer_elect/leader
[junit4:junit4]   2> 462 T315 oasc.Overseer.start Overseer (id=88344047154233346-127.0.0.1:12237_solr-n_0000000000) starting
[junit4:junit4]   2> 463 T320 oazs.PrepRequestProcessor.pRequest Got user-level KeeperException when processing sessionid:0x139dc715ca60002 type:create cxid:0x1a zxid:0xfffffffffffffffe txntype:unknown reqpath:n/a Error Path:/solr/overseer Error:KeeperErrorCode = NodeExists for /solr/overseer
[junit4:junit4]   2> 464 T320 oazs.PrepRequestProcessor.pRequest Got user-level KeeperException when processing sessionid:0x139dc715ca60002 type:create cxid:0x1b zxid:0xfffffffffffffffe txntype:unknown reqpath:n/a Error Path:/solr/overseer Error:KeeperErrorCode = NodeExists for /solr/overseer
[junit4:junit4]   2> 466 T320 oazs.PrepRequestProcessor.pRequest Got user-level KeeperException when processing sessionid:0x139dc715ca60002 type:create cxid:0x1c zxid:0xfffffffffffffffe txntype:unknown reqpath:n/a Error Path:/solr/overseer Error:KeeperErrorCode = NodeExists for /solr/overseer
[junit4:junit4]   2> 478 T320 oazs.PrepRequestProcessor.pRequest Got user-level KeeperException when processing sessionid:0x139dc715ca60002 type:create cxid:0x1d zxid:0xfffffffffffffffe txntype:unknown reqpath:n/a Error Path:/solr/overseer Error:KeeperErrorCode = NodeExists for /solr/overseer
[junit4:junit4]   2> 479 T337 oasc.OverseerCollectionProcessor.run Process current queue of collection creations
[junit4:junit4]   2> 480 T315 oascc.SolrZkClient.makePath makePath: /clusterstate.json
[junit4:junit4]   2> 483 T315 oascc.ZkStateReader.createClusterStateWatchersAndUpdate Updating cluster state from ZooKeeper... 
[junit4:junit4]   2> 485 T336 oasc.Overseer$ClusterStateUpdater.run Starting to work on the main queue
[junit4:junit4]   2> 489 T315 oasc.CoreContainer.create Creating SolrCore 'collection1' using instanceDir: /usr/home/hudson/hudson-slave/workspace/Lucene-Solr-Tests-trunk-java7/solr/build/solr-core/test-files/solr/collection1
[junit4:junit4]   2> 489 T315 oasc.ZkController.createCollectionZkNode Check for collection zkNode:control_collection
[junit4:junit4]   2> 490 T315 oasc.ZkController.createCollectionZkNode Collection zkNode exists
[junit4:junit4]   2> 491 T315 oasc.ZkController.readConfigName Load collection config from:/collections/control_collection
[junit4:junit4]   2> 492 T315 oasc.SolrResourceLoader.<init> new SolrResourceLoader for directory: '/usr/home/hudson/hudson-slave/workspace/Lucene-Solr-Tests-trunk-java7/solr/build/solr-core/test-files/solr/collection1/'
[junit4:junit4]   2> 493 T315 oasc.SolrResourceLoader.replaceClassLoader Adding 'file:/usr/home/hudson/hudson-slave/workspace/Lucene-Solr-Tests-trunk-java7/solr/build/solr-core/test-files/solr/collection1/lib/README' to classloader
[junit4:junit4]   2> 494 T315 oasc.SolrResourceLoader.replaceClassLoader Adding 'file:/usr/home/hudson/hudson-slave/workspace/Lucene-Solr-Tests-trunk-java7/solr/build/solr-core/test-files/solr/collection1/lib/classes/' to classloader
[junit4:junit4]   2> 532 T315 oasc.SolrConfig.<init> Using Lucene MatchVersion: LUCENE_50
[junit4:junit4]   2> 583 T315 oasc.SolrConfig.<init> Loaded SolrConfig: solrconfig.xml
[junit4:junit4]   2> 686 T315 oass.IndexSchema.readSchema Reading Solr Schema
[junit4:junit4]   2> 691 T315 oass.IndexSchema.readSchema Schema name=test
[junit4:junit4]   2> 1164 T315 oass.OpenExchangeRatesOrgProvider.init Initialized with rates=open-exchange-rates.json, refreshInterval=1440.
[junit4:junit4]   2> 1172 T315 oass.IndexSchema.readSchema default search field in schema is text
[junit4:junit4]   2> 1176 T315 oass.IndexSchema.readSchema unique key field: id
[junit4:junit4]   2> 1192 T315 oass.FileExchangeRateProvider.reload Reloading exchange rates from file currency.xml
[junit4:junit4]   2> 1197 T315 oass.FileExchangeRateProvider.reload Reloading exchange rates from file currency.xml
[junit4:junit4]   2> 1202 T315 oass.OpenExchangeRatesOrgProvider.reload Reloading exchange rates from open-exchange-rates.json
[junit4:junit4]   2> 1204 T315 oass.OpenExchangeRatesOrgProvider.reload Reloading exchange rates from open-exchange-rates.json
[junit4:junit4]   2> 1206 T315 oasc.SolrCore.<init> [collection1] Opening new SolrCore at /usr/home/hudson/hudson-slave/workspace/Lucene-Solr-Tests-trunk-java7/solr/build/solr-core/test-files/solr/collection1/, dataDir=./org.apache.solr.cloud.BasicDistributedZk2Test-1348023180448/control/data/
[junit4:junit4]   2> 1206 T315 oasc.JmxMonitoredMap.<init> JMX monitoring is enabled. Adding Solr mbeans to JMX Server: com.sun.jmx.mbeanserver.JmxMBeanServer@52740fae
[junit4:junit4]   2> 1231 T315 oasc.SolrCore.getNewIndexDir WARNING New index directory detected: old=null new=./org.apache.solr.cloud.BasicDistributedZk2Test-1348023180448/control/data/index/
[junit4:junit4]   2> 1232 T315 oasc.SolrCore.initIndex WARNING [collection1] Solr index directory './org.apache.solr.cloud.BasicDistributedZk2Test-1348023180448/control/data/index' doesn't exist. Creating new index...
[junit4:junit4]   2> 1233 T315 oasc.CachingDirectoryFactory.get return new directory for /usr/home/hudson/hudson-slave/workspace/Lucene-Solr-Tests-trunk-java7/solr/build/solr-core/test/J1/./org.apache.solr.cloud.BasicDistributedZk2Test-1348023180448/control/data/index forceNew:false
[junit4:junit4]   2> 1239 T315 oasc.SolrDeletionPolicy.onCommit SolrDeletionPolicy.onCommit: commits:num=1
[junit4:junit4]   2> 		commit{dir=NRTCachingDirectory(org.apache.lucene.store.NIOFSDirectory@/usr/home/hudson/hudson-slave/workspace/Lucene-Solr-Tests-trunk-java7/solr/build/solr-core/test/J1/org.apache.solr.cloud.BasicDistributedZk2Test-1348023180448/control/data/index lockFactory=org.apache.lucene.store.NativeFSLockFactory@194f0c82; maxCacheMB=48.0 maxMergeSizeMB=4.0),segFN=segments_1,generation=1,filenames=[segments_1]
[junit4:junit4]   2> 1240 T315 oasc.SolrDeletionPolicy.updateCommits newest commit = 1
[junit4:junit4]   2> 1241 T315 oasc.SolrCore.initWriters created xml: solr.XMLResponseWriter
[junit4:junit4]   2> 1243 T315 oasup.UpdateRequestProcessorChain.init inserting DistributedUpdateProcessorFactory into updateRequestProcessorChain "dedupe"
[junit4:junit4]   2> 1243 T315 oasup.UpdateRequestProcessorChain.init inserting DistributedUpdateProcessorFactory into updateRequestProcessorChain "dedupe-allfields"
[junit4:junit4]   2> 1244 T315 oasup.UpdateRequestProcessorChain.init inserting DistributedUpdateProcessorFactory into updateRequestProcessorChain "stored_sig"
[junit4:junit4]   2> 1244 T315 oasup.UpdateRequestProcessorChain.init inserting DistributedUpdateProcessorFactory into updateRequestProcessorChain "uniq-fields"
[junit4:junit4]   2> 1245 T315 oasup.UpdateRequestProcessorChain.init inserting DistributedUpdateProcessorFactory into updateRequestProcessorChain "distrib-dup-test-chain-implicit"
[junit4:junit4]   2> 1245 T315 oasc.RequestHandlers.initHandlersFromConfig adding lazy requestHandler: solr.ReplicationHandler
[junit4:junit4]   2> 1246 T315 oasc.RequestHandlers.initHandlersFromConfig created /replication: solr.ReplicationHandler
[junit4:junit4]   2> 1246 T315 oasc.RequestHandlers.initHandlersFromConfig created standard: solr.StandardRequestHandler
[junit4:junit4]   2> 1247 T315 oasc.RequestHandlers.initHandlersFromConfig created /get: solr.RealTimeGetHandler
[junit4:junit4]   2> 1248 T315 oasc.RequestHandlers.initHandlersFromConfig created dismax: solr.SearchHandler
[junit4:junit4]   2> 1248 T315 oasc.RequestHandlers.initHandlersFromConfig created mock: org.apache.solr.core.MockQuerySenderListenerReqHandler
[junit4:junit4]   2> 1249 T315 oasc.RequestHandlers.initHandlersFromConfig created /admin/: org.apache.solr.handler.admin.AdminHandlers
[junit4:junit4]   2> 1249 T315 oasc.RequestHandlers.initHandlersFromConfig created defaults: solr.StandardRequestHandler
[junit4:junit4]   2> 1249 T315 oasc.RequestHandlers.initHandlersFromConfig adding lazy requestHandler: solr.StandardRequestHandler
[junit4:junit4]   2> 1250 T315 oasc.RequestHandlers.initHandlersFromConfig created lazy: solr.StandardRequestHandler
[junit4:junit4]   2> 1250 T315 oasc.RequestHandlers.initHandlersFromConfig created /update: solr.UpdateRequestHandler
[junit4:junit4]   2> 1251 T315 oasc.RequestHandlers.initHandlersFromConfig created /terms: org.apache.solr.handler.component.SearchHandler
[junit4:junit4]   2> 1251 T315 oasc.RequestHandlers.initHandlersFromConfig created spellCheckCompRH: org.apache.solr.handler.component.SearchHandler
[junit4:junit4]   2> 1252 T315 oasc.RequestHandlers.initHandlersFromConfig created spellCheckCompRH_Direct: org.apache.solr.handler.component.SearchHandler
[junit4:junit4]   2> 1252 T315 oasc.RequestHandlers.initHandlersFromConfig created spellCheckWithWordbreak: org.apache.solr.handler.component.SearchHandler
[junit4:junit4]   2> 1253 T315 oasc.RequestHandlers.initHandlersFromConfig created spellCheckWithWordbreak_Direct: org.apache.solr.handler.component.SearchHandler
[junit4:junit4]   2> 1253 T315 oasc.RequestHandlers.initHandlersFromConfig created spellCheckCompRH1: org.apache.solr.handler.component.SearchHandler
[junit4:junit4]   2> 1254 T315 oasc.RequestHandlers.initHandlersFromConfig created tvrh: org.apache.solr.handler.component.SearchHandler
[junit4:junit4]   2> 1255 T315 oasc.RequestHandlers.initHandlersFromConfig created /mlt: solr.MoreLikeThisHandler
[junit4:junit4]   2> 1255 T315 oasc.RequestHandlers.initHandlersFromConfig created /debug/dump: solr.DumpRequestHandler
[junit4:junit4]   2> 1258 T315 oashl.XMLLoader.init xsltCacheLifetimeSeconds=60
[junit4:junit4]   2> 1262 T315 oasc.SolrCore.initDeprecatedSupport WARNING solrconfig.xml uses deprecated <admin/gettableFiles>, Please update your config to use the ShowFileRequestHandler.
[junit4:junit4]   2> 1263 T315 oasc.SolrCore.initDeprecatedSupport WARNING adding ShowFileRequestHandler with hidden files: [SCHEMA.XML, OLD_SYNONYMS.TXT, STOPWORDS.TXT, PROTWORDS.TXT, OPEN-EXCHANGE-RATES.JSON, SYNONYMS.TXT, CURRENCY.XML, MAPPING-ISOLATIN1ACCENT.TXT]
[junit4:junit4]   2> 1266 T315 oass.SolrIndexSearcher.<init> Opening Searcher@5cdcc3b8 main
[junit4:junit4]   2> 1268 T315 oasu.CommitTracker.<init> Hard AutoCommit: disabled
[junit4:junit4]   2> 1268 T315 oasu.CommitTracker.<init> Soft AutoCommit: disabled
[junit4:junit4]   2> 1269 T315 oashc.SpellCheckComponent.inform Initializing spell checkers
[junit4:junit4]   2> 1288 T315 oass.DirectSolrSpellChecker.init init: {name=direct,classname=DirectSolrSpellChecker,field=lowerfilt,minQueryLength=3}
[junit4:junit4]   2> 1339 T338 oasc.SolrCore.registerSearcher [collection1] Registered new searcher Searcher@5cdcc3b8 main{StandardDirectoryReader(segments_1:1)}
[junit4:junit4]   2> 1345 T320 oazs.PrepRequestProcessor.pRequest Got user-level KeeperException when processing sessionid:0x139dc715ca60002 type:create cxid:0x53 zxid:0xfffffffffffffffe txntype:unknown reqpath:n/a Error Path:/solr/overseer/queue Error:KeeperErrorCode = NoNode for /solr/overseer/queue
[junit4:junit4]   2> 1353 T315 oasc.CoreContainer.register registering core: collection1
[junit4:junit4]   2> 1354 T315 oasc.ZkController.register Register shard - core:collection1 address:http://127.0.0.1:12237/solr shardId:control_shard
[junit4:junit4]   2> 1355 T315 oascc.SolrZkClient.makePath makePath: /collections/control_collection/leader_elect/control_shard/election
[junit4:junit4]   2> 1373 T320 oazs.PrepRequestProcessor.pRequest Got user-level KeeperException when processing sessionid:0x139dc715ca60002 type:delete cxid:0x62 zxid:0xfffffffffffffffe txntype:unknown reqpath:n/a Error Path:/solr/collections/control_collection/leaders Error:KeeperErrorCode = NoNode for /solr/collections/control_collection/leaders
[junit4:junit4]   2> 1374 T315 oasc.ShardLeaderElectionContext.runLeaderProcess Running the leader process.
[junit4:junit4]   2> 1375 T320 oazs.PrepRequestProcessor.pRequest Got user-level KeeperException when processing sessionid:0x139dc715ca60002 type:create cxid:0x63 zxid:0xfffffffffffffffe txntype:unknown reqpath:n/a Error Path:/solr/overseer Error:KeeperErrorCode = NodeExists for /solr/overseer
[junit4:junit4]   2> 1491 T336 oascc.ZkStateReader.updateClusterState Updating cloud state from ZooKeeper... 
[junit4:junit4]   2> 1492 T320 oazs.PrepRequestProcessor.pRequest Got user-level KeeperException when processing sessionid:0x139dc715ca60002 type:create cxid:0x6a zxid:0xfffffffffffffffe txntype:unknown reqpath:n/a Error Path:/solr/overseer/queue-work Error:KeeperErrorCode = NoNode for /solr/overseer/queue-work
[junit4:junit4]   2> 1514 T335 oascc.ZkStateReader$2.process A cluster state change has occurred - updating...
[junit4:junit4]   2> 1878 T315 oasc.ShardLeaderElectionContext.waitForReplicasToComeUp Enough replicas found to continue.
[junit4:junit4]   2> 1879 T315 oasc.ShardLeaderElectionContext.runLeaderProcess I may be the new leader - try and sync
[junit4:junit4]   2> 1880 T315 oasc.SyncStrategy.sync Sync replicas to http://127.0.0.1:12237/solr/collection1/
[junit4:junit4]   2> 1880 T315 oasc.SyncStrategy.syncReplicas Sync Success - now sync replicas to me
[junit4:junit4]   2> 1881 T315 oasc.SyncStrategy.syncToMe http://127.0.0.1:12237/solr/collection1/ has no replicas
[junit4:junit4]   2> 1881 T315 oasc.ShardLeaderElectionContext.runLeaderProcess I am the new leader: http://127.0.0.1:12237/solr/collection1/
[junit4:junit4]   2> 1881 T315 oascc.SolrZkClient.makePath makePath: /collections/control_collection/leaders/control_shard
[junit4:junit4]   2> 1898 T320 oazs.PrepRequestProcessor.pRequest Got user-level KeeperException when processing sessionid:0x139dc715ca60002 type:create cxid:0x88 zxid:0xfffffffffffffffe txntype:unknown reqpath:n/a Error Path:/solr/overseer Error:KeeperErrorCode = NodeExists for /solr/overseer
[junit4:junit4]   2> 2021 T336 oascc.ZkStateReader.updateClusterState Updating cloud state from ZooKeeper... 
[junit4:junit4]   2> 2030 T335 oascc.ZkStateReader$2.process A cluster state change has occurred - updating...
[junit4:junit4]   2> 2055 T315 oasc.ZkController.register We are http://127.0.0.1:12237/solr/collection1/ and leader is http://127.0.0.1:12237/solr/collection1/
[junit4:junit4]   2> 2055 T315 oasc.ZkController.register No LogReplay needed for core=collection1 baseURL=http://127.0.0.1:12237/solr
[junit4:junit4]   2> 2056 T315 oasc.ZkController.checkRecovery I am the leader, no recovery necessary
[junit4:junit4]   2> 2058 T315 oascc.ZkStateReader.updateClusterState Updating cloud state from ZooKeeper... 
[junit4:junit4]   2> 2059 T315 oass.SolrDispatchFilter.init user.dir=/usr/home/hudson/hudson-slave/workspace/Lucene-Solr-Tests-trunk-java7/solr/build/solr-core/test/J1
[junit4:junit4]   2> 2059 T315 oass.SolrDispatchFilter.init SolrDispatchFilter.init() done
[junit4:junit4]   2> 2060 T315 oascsi.HttpClientUtil.createClient Creating new http client, config:maxConnections=128&maxConnectionsPerHost=32&followRedirects=false
[junit4:junit4]   2> 2183 T315 oejs.Server.doStart jetty-8.1.2.v20120308
[junit4:junit4]   2> 2186 T315 oejs.AbstractConnector.doStart Started SocketConnector@0.0.0.0:12242
[junit4:junit4]   2> 2186 T315 oasc.SolrResourceLoader.locateSolrHome JNDI not configured for solr (NoInitialContextEx)
[junit4:junit4]   2> 2186 T315 oasc.SolrResourceLoader.locateSolrHome using system property solr.solr.home: /usr/home/hudson/hudson-slave/workspace/Lucene-Solr-Tests-trunk-java7/solr/build/solr-core/test/J1/./solrtest-jetty1-1348023182513
[junit4:junit4]   2> 2187 T315 oasc.SolrResourceLoader.<init> new SolrResourceLoader for deduced Solr Home: '/usr/home/hudson/hudson-slave/workspace/Lucene-Solr-Tests-trunk-java7/solr/build/solr-core/test/J1/./solrtest-jetty1-1348023182513/'
[junit4:junit4]   2> 2217 T315 oass.SolrDispatchFilter.init SolrDispatchFilter.init()
[junit4:junit4]   2> 2218 T315 oasc.SolrResourceLoader.locateSolrHome JNDI not configured for solr (NoInitialContextEx)
[junit4:junit4]   2> 2218 T315 oasc.SolrResourceLoader.locateSolrHome using system property solr.solr.home: /usr/home/hudson/hudson-slave/workspace/Lucene-Solr-Tests-trunk-java7/solr/build/solr-core/test/J1/./solrtest-jetty1-1348023182513
[junit4:junit4]   2> 2219 T315 oasc.CoreContainer$Initializer.initialize looking for solr.xml: /usr/home/hudson/hudson-slave/workspace/Lucene-Solr-Tests-trunk-java7/solr/build/solr-core/test/J1/./solrtest-jetty1-1348023182513/solr.xml
[junit4:junit4]   2> 2219 T315 oasc.CoreContainer.<init> New CoreContainer 2005717089
[junit4:junit4]   2> 2220 T315 oasc.CoreContainer.load Loading CoreContainer using Solr Home: '/usr/home/hudson/hudson-slave/workspace/Lucene-Solr-Tests-trunk-java7/solr/build/solr-core/test/J1/./solrtest-jetty1-1348023182513/'
[junit4:junit4]   2> 2220 T315 oasc.SolrResourceLoader.<init> new SolrResourceLoader for directory: '/usr/home/hudson/hudson-slave/workspace/Lucene-Solr-Tests-trunk-java7/solr/build/solr-core/test/J1/./solrtest-jetty1-1348023182513/'
[junit4:junit4]   2> 2243 T315 oasc.CoreContainer.load Registering Log Listener
[junit4:junit4]   2> 2255 T315 oasc.CoreContainer.initZooKeeper Zookeeper client=127.0.0.1:12233/solr
[junit4:junit4]   2> 2256 T315 oaz.ZooKeeper.<init> Initiating client connection, connectString=127.0.0.1:12233/solr sessionTimeout=5000 watcher=org.apache.solr.common.cloud.ConnectionManager@68d30220
[junit4:junit4]   2> 2257 T348 oaz.ClientCnxn$SendThread.startConnect Opening socket connection to server /127.0.0.1:12233
[junit4:junit4]   2> 2257 T315 oascc.ConnectionManager.waitForConnected Waiting for client to connect to ZooKeeper
[junit4:junit4]   2> 2258 T348 oaz.ClientCnxn$SendThread.primeConnection Socket connection established to localhost/127.0.0.1:12233, initiating session
[junit4:junit4]   2> 2258 T317 oazs.NIOServerCnxn$Factory.run Accepted socket connection from /140.211.11.196:12243
[junit4:junit4]   2> 2258 T317 oazs.NIOServerCnxn.readConnectRequest Client attempting to establish new session at /140.211.11.196:12243
[junit4:junit4]   2> 2260 T319 oazs.NIOServerCnxn.finishSessionInit Established session 0x139dc715ca60003 with negotiated timeout 5000 for client /140.211.11.196:12243
[junit4:junit4]   2> 2260 T348 oaz.ClientCnxn$SendThread.readConnectResult Session establishment complete on server localhost/127.0.0.1:12233, sessionid = 0x139dc715ca60003, negotiated timeout = 5000
[junit4:junit4]   2> 2261 T349 oascc.ConnectionManager.process Watcher org.apache.solr.common.cloud.ConnectionManager@68d30220 name:ZooKeeperConnection Watcher:127.0.0.1:12233/solr got event WatchedEvent state:SyncConnected type:None path:null path:null type:None
[junit4:junit4]   2> 2261 T315 oascc.ConnectionManager.waitForConnected Client is connected to ZooKeeper
[junit4:junit4]   2> 2262 T320 oazs.PrepRequestProcessor.pRequest Got user-level KeeperException when processing sessionid:0x139dc715ca60003 type:create cxid:0x1 zxid:0xfffffffffffffffe txntype:unknown reqpath:n/a Error Path:/solr/overseer Error:KeeperErrorCode = NodeExists for /solr/overseer
[junit4:junit4]   2> 2263 T320 oazs.PrepRequestProcessor.pRequest Got user-level KeeperException when processing sessionid:0x139dc715ca60003 type:create cxid:0x2 zxid:0xfffffffffffffffe txntype:unknown reqpath:n/a Error Path:/solr/overseer Error:KeeperErrorCode = NodeExists for /solr/overseer
[junit4:junit4]   2> 2272 T315 oasc.ZkController.createEphemeralLiveNode Register node as live in ZooKeeper:/live_nodes/127.0.0.1:12242_solr
[junit4:junit4]   2> 2272 T320 oazs.PrepRequestProcessor.pRequest Got user-level KeeperException when processing sessionid:0x139dc715ca60003 type:delete cxid:0x4 zxid:0xfffffffffffffffe txntype:unknown reqpath:n/a Error Path:/solr/live_nodes/127.0.0.1:12242_solr Error:KeeperErrorCode = NoNode for /solr/live_nodes/127.0.0.1:12242_solr
[junit4:junit4]   2> 2274 T315 oascc.SolrZkClient.makePath makePath: /live_nodes/127.0.0.1:12242_solr
[junit4:junit4]   2> 2276 T335 oascc.ZkStateReader$3.process Updating live nodes
[junit4:junit4]   2> 2277 T315 oashc.HttpShardHandlerFactory.getParameter Setting socketTimeout to: 0
[junit4:junit4]   2> 2278 T315 oashc.HttpShardHandlerFactory.getParameter Setting urlScheme to: http://
[junit4:junit4]   2> 2278 T315 oashc.HttpShardHandlerFactory.getParameter Setting connTimeout to: 0
[junit4:junit4]   2> 2278 T315 oashc.HttpShardHandlerFactory.getParameter Setting maxConnectionsPerHost to: 20
[junit4:junit4]   2> 2279 T315 oashc.HttpShardHandlerFactory.getParameter Setting corePoolSize to: 0
[junit4:junit4]   2> 2279 T315 oashc.HttpShardHandlerFactory.getParameter Setting maximumPoolSize to: 2147483647
[junit4:junit4]   2> 2279 T315 oashc.HttpShardHandlerFactory.getParameter Setting maxThreadIdleTime to: 5
[junit4:junit4]   2> 2280 T315 oashc.HttpShardHandlerFactory.getParameter Setting sizeOfQueue to: -1
[junit4:junit4]   2> 2280 T315 oashc.HttpShardHandlerFactory.getParameter Setting fairnessPolicy to: false
[junit4:junit4]   2> 2281 T315 oascsi.HttpClientUtil.createClient Creating new http client, config:maxConnectionsPerHost=20&maxConnections=10000&socketTimeout=0&connTimeout=0&retry=false
[junit4:junit4]   2> 2299 T315 oascc.ZkStateReader.createClusterStateWatchersAndUpdate Updating cluster state from ZooKeeper... 
[junit4:junit4]   2> 2304 T315 oasc.CoreContainer.create Creating SolrCore 'collection1' using instanceDir: /usr/home/hudson/hudson-slave/workspace/Lucene-Solr-Tests-trunk-java7/solr/build/solr-core/test/J1/./solrtest-jetty1-1348023182513/collection1
[junit4:junit4]   2> 2304 T315 oasc.ZkController.createCollectionZkNode Check for collection zkNode:collection1
[junit4:junit4]   2> 2305 T315 oasc.ZkController.createCollectionZkNode Collection zkNode exists
[junit4:junit4]   2> 2306 T315 oasc.ZkController.readConfigName Load collection config from:/collections/collection1
[junit4:junit4]   2> 2307 T315 oasc.SolrResourceLoader.<init> new SolrResourceLoader for directory: '/usr/home/hudson/hudson-slave/workspace/Lucene-Solr-Tests-trunk-java7/solr/build/solr-core/test/J1/./solrtest-jetty1-1348023182513/collection1/'
[junit4:junit4]   2> 2308 T315 oasc.SolrResourceLoader.replaceClassLoader Adding 'file:/usr/home/hudson/hudson-slave/workspace/Lucene-Solr-Tests-trunk-java7/solr/build/solr-core/test/J1/solrtest-jetty1-1348023182513/collection1/lib/README' to classloader
[junit4:junit4]   2> 2309 T315 oasc.SolrResourceLoader.replaceClassLoader Adding 'file:/usr/home/hudson/hudson-slave/workspace/Lucene-Solr-Tests-trunk-java7/solr/build/solr-core/test/J1/solrtest-jetty1-1348023182513/collection1/lib/classes/' to classloader
[junit4:junit4]   2> 2346 T315 oasc.SolrConfig.<init> Using Lucene MatchVersion: LUCENE_50
[junit4:junit4]   2> 2415 T315 oasc.SolrConfig.<init> Loaded SolrConfig: solrconfig.xml
[junit4:junit4]   2> 2517 T315 oass.IndexSchema.readSchema Reading Solr Schema
[junit4:junit4]   2> 2522 T315 oass.IndexSchema.readSchema Schema name=test
[junit4:junit4]   2> 2542 T336 oascc.ZkStateReader.updateClusterState Updating cloud state from ZooKeeper... 
[junit4:junit4]   2> 2584 T349 oascc.ZkStateReader$2.process A cluster state change has occurred - updating...
[junit4:junit4]   2> 2584 T335 oascc.ZkStateReader$2.process A cluster state change has occurred - updating...
[junit4:junit4]   2> 3003 T315 oass.OpenExchangeRatesOrgProvider.init Initialized with rates=open-exchange-rates.json, refreshInterval=1440.
[junit4:junit4]   2> 3012 T315 oass.IndexSchema.readSchema default search field in schema is text
[junit4:junit4]   2> 3015 T315 oass.IndexSchema.readSchema unique key field: id
[junit4:junit4]   2> 3031 T315 oass.FileExchangeRateProvider.reload Reloading exchange rates from file currency.xml
[junit4:junit4]   2> 3036 T315 oass.FileExchangeRateProvider.reload Reloading exchange rates from file currency.xml
[junit4:junit4]   2> 3041 T315 oass.OpenExchangeRatesOrgProvider.reload Reloading exchange rates from open-exchange-rates.json
[junit4:junit4]   2> 3042 T315 oass.OpenExchangeRatesOrgProvider.reload Reloading exchange rates from open-exchange-rates.json
[junit4:junit4]   2> 3044 T315 oasc.SolrCore.<init> [collection1] Opening new SolrCore at /usr/home/hudson/hudson-slave/workspace/Lucene-Solr-Tests-trunk-java7/solr/build/solr-core/test/J1/./solrtest-jetty1-1348023182513/collection1/, dataDir=./org.apache.solr.cloud.BasicDistributedZk2Test-1348023180448/jetty1/
[junit4:junit4]   2> 3044 T315 oasc.JmxMonitoredMap.<init> JMX monitoring is enabled. Adding Solr mbeans to JMX Server: com.sun.jmx.mbeanserver.JmxMBeanServer@52740fae
[junit4:junit4]   2> 3046 T315 oasc.SolrCore.getNewIndexDir WARNING New index directory detected: old=null new=./org.apache.solr.cloud.BasicDistributedZk2Test-1348023180448/jetty1/index/
[junit4:junit4]   2> 3047 T315 oasc.SolrCore.initIndex WARNING [collection1] Solr index directory './org.apache.solr.cloud.BasicDistributedZk2Test-1348023180448/jetty1/index' doesn't exist. Creating new index...
[junit4:junit4]   2> 3047 T315 oasc.CachingDirectoryFactory.get return new directory for /usr/home/hudson/hudson-slave/workspace/Lucene-Solr-Tests-trunk-java7/solr/build/solr-core/test/J1/./org.apache.solr.cloud.BasicDistributedZk2Test-1348023180448/jetty1/index forceNew:false
[junit4:junit4]   2> 3057 T315 oasc.SolrDeletionPolicy.onCommit SolrDeletionPolicy.onCommit: commits:num=1
[junit4:junit4]   2> 		commit{dir=NRTCachingDirectory(org.apache.lucene.store.NIOFSDirectory@/usr/home/hudson/hudson-slave/workspace/Lucene-Solr-Tests-trunk-java7/solr/build/solr-core/test/J1/org.apache.solr.cloud.BasicDistributedZk2Test-1348023180448/jetty1/index lockFactory=org.apache.lucene.store.NativeFSLockFactory@41356519; maxCacheMB=48.0 maxMergeSizeMB=4.0),segFN=segments_1,generation=1,filenames=[segments_1]
[junit4:junit4]   2> 3058 T315 oasc.SolrDeletionPolicy.updateCommits newest commit = 1
[junit4:junit4]   2> 3059 T315 oasc.SolrCore.initWriters created xml: solr.XMLResponseWriter
[junit4:junit4]   2> 3062 T315 oasup.UpdateRequestProcessorChain.init inserting DistributedUpdateProcessorFactory into updateRequestProcessorChain "dedupe"
[junit4:junit4]   2> 3063 T315 oasup.UpdateRequestProcessorChain.init inserting DistributedUpdateProcessorFactory into updateRequestProcessorChain "dedupe-allfields"
[junit4:junit4]   2> 3064 T315 oasup.UpdateRequestProcessorChain.init inserting DistributedUpdateProcessorFactory into updateRequestProcessorChain "stored_sig"
[junit4:junit4]   2> 3064 T315 oasup.UpdateRequestProcessorChain.init inserting DistributedUpdateProcessorFactory into updateRequestProcessorChain "uniq-fields"
[junit4:junit4]   2> 3065 T315 oasup.UpdateRequestProcessorChain.init inserting DistributedUpdateProcessorFactory into updateRequestProcessorChain "distrib-dup-test-chain-implicit"
[junit4:junit4]   2> 3065 T315 oasc.RequestHandlers.initHandlersFromConfig adding lazy requestHandler: solr.ReplicationHandler
[junit4:junit4]   2> 3066 T315 oasc.RequestHandlers.initHandlersFromConfig created /replication: solr.ReplicationHandler
[junit4:junit4]   2> 3067 T315 oasc.RequestHandlers.initHandlersFromConfig created standard: solr.StandardRequestHandler
[junit4:junit4]   2> 3068 T315 oasc.RequestHandlers.initHandlersFromConfig created /get: solr.RealTimeGetHandler
[junit4:junit4]   2> 3069 T315 oasc.RequestHandlers.initHandlersFromConfig created dismax: solr.SearchHandler
[junit4:junit4]   2> 3069 T315 oasc.RequestHandlers.initHandlersFromConfig created mock: org.apache.solr.core.MockQuerySenderListenerReqHandler
[junit4:junit4]   2> 3070 T315 oasc.RequestHandlers.initHandlersFromConfig created /admin/: org.apache.solr.handler.admin.AdminHandlers
[junit4:junit4]   2> 3071 T315 oasc.RequestHandlers.initHandlersFromConfig created defaults: solr.StandardRequestHandler
[junit4:junit4]   2> 3071 T315 oasc.RequestHandlers.initHandlersFromConfig adding lazy requestHandler: solr.StandardRequestHandler
[junit4:junit4]   2> 3072 T315 oasc.RequestHandlers.initHandlersFromConfig created lazy: solr.StandardRequestHandler
[junit4:junit4]   2> 3073 T315 oasc.RequestHandlers.initHandlersFromConfig created /update: solr.UpdateRequestHandler
[junit4:junit4]   2> 3073 T315 oasc.RequestHandlers.initHandlersFromConfig created /terms: org.apache.solr.handler.component.SearchHandler
[junit4:junit4]   2> 3074 T315 oasc.RequestHandlers.initHandlersFromConfig created spellCheckCompRH: org.apache.solr.handler.component.SearchHandler
[junit4:junit4]   2> 3075 T315 oasc.RequestHandlers.initHandlersFromConfig created spellCheckCompRH_Direct: org.apache.solr.handler.component.SearchHandler
[junit4:junit4]   2> 3076 T315 oasc.RequestHandlers.initHandlersFromConfig created spellCheckWithWordbreak: org.apache.solr.handler.component.SearchHandler
[junit4:junit4]   2> 3076 T315 oasc.RequestHandlers.initHandlersFromConfig created spellCheckWithWordbreak_Direct: org.apache.solr.handler.component.SearchHandler
[junit4:junit4]   2> 3077 T315 oasc.RequestHandlers.initHandlersFromConfig created spellCheckCompRH1: org.apache.solr.handler.component.SearchHandler
[junit4:junit4]   2> 3078 T315 oasc.RequestHandlers.initHandlersFromConfig created tvrh: org.apache.solr.handler.component.SearchHandler
[junit4:junit4]   2> 3078 T315 oasc.RequestHandlers.initHandlersFromConfig created /mlt: solr.MoreLikeThisHandler
[junit4:junit4]   2> 3079 T315 oasc.RequestHandlers.initHandlersFromConfig created /debug/dump: solr.DumpRequestHandler
[junit4:junit4]   2> 3083 T315 oashl.XMLLoader.init xsltCacheLifetimeSeconds=60
[junit4:junit4]   2> 3088 T315 oasc.SolrCore.initDeprecatedSupport WARNING solrconfig.xml uses deprecated <admin/gettableFiles>, Please update your config to use the ShowFileRequestHandler.
[junit4:junit4]   2> 3090 T315 oasc.SolrCore.initDeprecatedSupport WARNING adding ShowFileRequestHandler with hidden files: [SCHEMA.XML, OLD_SYNONYMS.TXT, STOPWORDS.TXT, PROTWORDS.TXT, OPEN-EXCHANGE-RATES.JSON, SYNONYMS.TXT, CURRENCY.XML, MAPPING-ISOLATIN1ACCENT.TXT]
[junit4:junit4]   2> 3094 T315 oass.SolrIndexSearcher.<init> Opening Searcher@60dff1d9 main
[junit4:junit4]   2> 3096 T315 oasu.CommitTracker.<init> Hard AutoCommit: disabled
[junit4:junit4]   2> 3097 T315 oasu.CommitTracker.<init> Soft AutoCommit: disabled
[junit4:junit4]   2> 3097 T315 oashc.SpellCheckComponent.inform Initializing spell checkers
[junit4:junit4]   2> 3112 T315 oass.DirectSolrSpellChecker.init init: {name=direct,classname=DirectSolrSpellChecker,field=lowerfilt,minQueryLength=3}
[junit4:junit4]   2> 3164 T350 oasc.SolrCore.registerSearcher [collection1] Registered new searcher Searcher@60dff1d9 main{StandardDirectoryReader(segments_1:1)}
[junit4:junit4]   2> 3611 T336 oascc.ZkStateReader.updateClusterState Updating cloud state from ZooKeeper... 
[junit4:junit4]   2> 3631 T349 oascc.ZkStateReader$2.process A cluster state change has occurred - updating...
[junit4:junit4]   2> 3631 T335 oascc.ZkStateReader$2.process A cluster state change has occurred - updating...
[junit4:junit4]   2> 3672 T315 oasc.CoreContainer.register registering core: collection1
[junit4:junit4]   2> 3672 T315 oasc.ZkController.register Register shard - core:collection1 address:http://127.0.0.1:12242/solr shardId:shard1
[junit4:junit4]   2> 3673 T315 oascc.SolrZkClient.makePath makePath: /collections/collection1/leader_elect/shard1/election
[junit4:junit4]   2> 3691 T320 oazs.PrepRequestProcessor.pRequest Got user-level KeeperException when processing sessionid:0x139dc715ca60003 type:delete cxid:0x43 zxid:0xfffffffffffffffe txntype:unknown reqpath:n/a Error Path:/solr/collections/collection1/leaders Error:KeeperErrorCode = NoNode for /solr/collections/collection1/leaders
[junit4:junit4]   2> 3697 T315 oasc.ShardLeaderElectionContext.runLeaderProcess Running the leader process.
[junit4:junit4]   2> 3698 T320 oazs.PrepRequestProcessor.pRequest Got user-level KeeperException when processing sessionid:0x139dc715ca60003 type:create cxid:0x44 zxid:0xfffffffffffffffe txntype:unknown reqpath:n/a Error Path:/solr/overseer Error:KeeperErrorCode = NodeExists for /solr/overseer
[junit4:junit4]   2> 3710 T315 oasc.ShardLeaderElectionContext.waitForReplicasToComeUp Enough replicas found to continue.
[junit4:junit4]   2> 3711 T315 oasc.ShardLeaderElectionContext.runLeaderProcess I may be the new leader - try and sync
[junit4:junit4]   2> 3711 T315 oasc.SyncStrategy.sync Sync replicas to http://127.0.0.1:12242/solr/collection1/
[junit4:junit4]   2> 3712 T315 oasc.SyncStrategy.syncReplicas Sync Success - now sync replicas to me
[junit4:junit4]   2> 3712 T315 oasc.SyncStrategy.syncToMe http://127.0.0.1:12242/solr/collection1/ has no replicas
[junit4:junit4]   2> 3712 T315 oasc.ShardLeaderElectionContext.runLeaderProcess I am the new leader: http://127.0.0.1:12242/solr/collection1/
[junit4:junit4]   2> 3713 T315 oascc.SolrZkClient.makePath makePath: /collections/collection1/leaders/shard1
[junit4:junit4]   2> 3717 T320 oazs.PrepRequestProcessor.pRequest Got user-level KeeperException when processing sessionid:0x139dc715ca60003 type:create cxid:0x4e zxid:0xfffffffffffffffe txntype:unknown reqpath:n/a Error Path:/solr/overseer Error:KeeperErrorCode = NodeExists for /solr/overseer
[junit4:junit4]   2> 4137 T336 oascc.ZkStateReader.updateClusterState Updating cloud state from ZooKeeper... 
[junit4:junit4]   2> 4178 T335 oascc.ZkStateReader$2.process A cluster state change has occurred - updating...
[junit4:junit4]   2> 4178 T349 oascc.ZkStateReader$2.process A cluster state change has occurred - updating...
[junit4:junit4]   2> 4187 T315 oasc.ZkController.register We are http://127.0.0.1:12242/solr/collection1/ and leader is http://127.0.0.1:12242/solr/collection1/
[junit4:junit4]   2> 4187 T315 oasc.ZkController.register No LogReplay needed for core=collection1 baseURL=http://127.0.0.1:12242/solr
[junit4:junit4]   2> 4188 T315 oasc.ZkController.checkRecovery I am the leader, no recovery necessary
[junit4:junit4]   2> 4190 T315 oascc.ZkStateReader.updateClusterState Updating cloud state from ZooKeeper... 
[junit4:junit4]   2> 4191 T315 oass.SolrDispatchFilter.init user.dir=/usr/home/hudson/hudson-slave/workspace/Lucene-Solr-Tests-trunk-java7/solr/build/solr-core/test/J1
[junit4:junit4]   2> 4191 T315 oass.SolrDispatchFilter.init SolrDispatchFilter.init() done
[junit4:junit4]   2> 4192 T315 oascsi.HttpClientUtil.createClient Creating new http client, config:maxConnections=128&maxConnectionsPerHost=32&followRedirects=false
[junit4:junit4]   2> 4313 T315 oejs.Server.doStart jetty-8.1.2.v20120308
[junit4:junit4]   2> 4316 T315 oejs.AbstractConnector.doStart Started SocketConnector@0.0.0.0:12245
[junit4:junit4]   2> 4317 T315 oasc.SolrResourceLoader.locateSolrHome JNDI not configured for solr (NoInitialContextEx)
[junit4:junit4]   2> 4317 T315 oasc.SolrResourceLoader.locateSolrHome using system property solr.solr.home: /usr/home/hudson/hudson-slave/workspace/Lucene-Solr-Tests-trunk-java7/solr/build/solr-core/test/J1/./solrtest-jetty2-1348023184645
[junit4:junit4]   2> 4317 T315 oasc.SolrResourceLoader.<init> new SolrResourceLoader for deduced Solr Home: '/usr/home/hudson/hudson-slave/workspace/Lucene-Solr-Tests-trunk-java7/solr/build/solr-core/test/J1/./solrtest-jetty2-1348023184645/'
[junit4:junit4]   2> 4347 T315 oass.SolrDispatchFilter.init SolrDispatchFilter.init()
[junit4:junit4]   2> 4347 T315 oasc.SolrResourceLoader.locateSolrHome JNDI not configured for solr (NoInitialContextEx)
[junit4:junit4]   2> 4348 T315 oasc.SolrResourceLoader.locateSolrHome using system property solr.solr.home: /usr/home/hudson/hudson-slave/workspace/Lucene-Solr-Tests-trunk-java7/solr/build/solr-core/test/J1/./solrtest-jetty2-1348023184645
[junit4:junit4]   2> 4348 T315 oasc.CoreContainer$Initializer.initialize looking for solr.xml: /usr/home/hudson/hudson-slave/workspace/Lucene-Solr-Tests-trunk-java7/solr/build/solr-core/test/J1/./solrtest-jetty2-1348023184645/solr.xml
[junit4:junit4]   2> 4348 T315 oasc.CoreContainer.<init> New CoreContainer 504933115
[junit4:junit4]   2> 4349 T315 oasc.CoreContainer.load Loading CoreContainer using Solr Home: '/usr/home/hudson/hudson-slave/workspace/Lucene-Solr-Tests-trunk-java7/solr/build/solr-core/test/J1/./solrtest-jetty2-1348023184645/'
[junit4:junit4]   2> 4349 T315 oasc.SolrResourceLoader.<init> new SolrResourceLoader for directory: '/usr/home/hudson/hudson-slave/workspace/Lucene-Solr-Tests-trunk-java7/solr/build/solr-core/test/J1/./solrtest-jetty2-1348023184645/'
[junit4:junit4]   2> 4375 T315 oasc.CoreContainer.load Registering Log Listener
[junit4:junit4]   2> 4395 T315 oasc.CoreContainer.initZooKeeper Zookeeper client=127.0.0.1:12233/solr
[junit4:junit4]   2> 4396 T315 oaz.ZooKeeper.<init> Initiating client connection, connectString=127.0.0.1:12233/solr sessionTimeout=5000 watcher=org.apache.solr.common.cloud.ConnectionManager@3d0c29a1
[junit4:junit4]   2> 4396 T360 oaz.ClientCnxn$SendThread.startConnect Opening socket connection to server /127.0.0.1:12233
[junit4:junit4]   2> 4396 T315 oascc.ConnectionManager.waitForConnected Waiting for client to connect to ZooKeeper
[junit4:junit4]   2> 4397 T360 oaz.ClientCnxn$SendThread.primeConnection Socket connection established to localhost/127.0.0.1:12233, initiating session
[junit4:junit4]   2> 4398 T317 oazs.NIOServerCnxn$Factory.run Accepted socket connection from /140.211.11.196:12246
[junit4:junit4]   2> 4398 T317 oazs.NIOServerCnxn.readConnectRequest Client attempting to establish new session at /140.211.11.196:12246
[junit4:junit4]   2> 4400 T319 oazs.NIOServerCnxn.finishSessionInit Established session 0x139dc715ca60004 with negotiated timeout 5000 for client /140.211.11.196:12246
[junit4:junit4]   2> 4400 T360 oaz.ClientCnxn$SendThread.readConnectResult Session establishment complete on server localhost/127.0.0.1:12233, sessionid = 0x139dc715ca60004, negotiated timeout = 5000
[junit4:junit4]   2> 4400 T361 oascc.ConnectionManager.process Watcher org.apache.solr.common.cloud.ConnectionManager@3d0c29a1 name:ZooKeeperConnection Watcher:127.0.0.1:12233/solr got event WatchedEvent state:SyncConnected type:None path:null path:null type:None
[junit4:junit4]   2> 4401 T315 oascc.ConnectionManager.waitForConnected Client is connected to ZooKeeper
[junit4:junit4]   2> 4401 T320 oazs.PrepRequestProcessor.pRequest Got user-level KeeperException when processing sessionid:0x139dc715ca60004 type:create cxid:0x1 zxid:0xfffffffffffffffe txntype:unknown reqpath:n/a Error Path:/solr/overseer Error:KeeperErrorCode = NodeExists for /solr/overseer
[junit4:junit4]   2> 4414 T320 oazs.PrepRequestProcessor.pRequest Got user-level KeeperException when processing sessionid:0x139dc715ca60004 type:create cxid:0x2 zxid:0xfffffffffffffffe txntype:unknown reqpath:n/a Error Path:/solr/overseer Error:KeeperErrorCode = NodeExists for /solr/overseer
[junit4:junit4]   2> 4416 T315 oasc.ZkController.createEphemeralLiveNode Register node as live in ZooKeeper:/live_nodes/127.0.0.1:12245_solr
[junit4:junit4]   2> 4417 T320 oazs.PrepRequestProcessor.pRequest Got user-level KeeperException when processing sessionid:0x139dc715ca60004 type:delete cxid:0x4 zxid:0xfffffffffffffffe txntype:unknown reqpath:n/a Error Path:/solr/live_nodes/127.0.0.1:12245_solr Error:KeeperErrorCode = NoNode for /solr/live_nodes/127.0.0.1:12245_solr
[junit4:junit4]   2> 4418 T315 oascc.SolrZkClient.makePath makePath: /live_nodes/127.0.0.1:12245_solr
[junit4:junit4]   2> 4424 T349 oascc.ZkStateReader$3.process Updating live nodes
[junit4:junit4]   2> 4425 T335 oascc.ZkStateReader$3.process Updating live nodes
[junit4:junit4]   2> 4426 T315 oashc.HttpShardHandlerFactory.getParameter Setting socketTimeout to: 0
[junit4:junit4]   2> 4426 T315 oashc.HttpShardHandlerFactory.getParameter Setting urlScheme to: http://
[junit4:junit4]   2> 4426 T315 oashc.HttpShardHandlerFactory.getParameter Setting connTimeout to: 0
[junit4:junit4]   2> 4427 T315 oashc.HttpShardHandlerFactory.getParameter Setting maxConnectionsPerHost to: 20
[junit4:junit4]   2> 4427 T315 oashc.HttpShardHandlerFactory.getParameter Setting corePoolSize to: 0
[junit4:junit4]   2> 4427 T315 oashc.HttpShardHandlerFactory.getParameter Setting maximumPoolSize to: 2147483647
[junit4:junit4]   2> 4428 T315 oashc.HttpShardHandlerFactory.getParameter Setting maxThreadIdleTime to: 5
[junit4:junit4]   2> 4428 T315 oashc.HttpShardHandlerFactory.getParameter Setting sizeOfQueue to: -1
[junit4:junit4]   2> 4429 T315 oashc.HttpShardHandlerFactory.getParameter Setting fairnessPolicy to: false
[junit4:junit4]   2> 4429 T315 oascsi.HttpClientUtil.createClient Creating new http client, config:maxConnectionsPerHost=20&maxConnections=10000&socketTimeout=0&connTimeout=0&retry=false
[junit4:junit4]   2> 4442 T315 oascc.ZkStateReader.createClusterStateWatchersAndUpdate Updating cluster state from ZooKeeper... 
[junit4:junit4]   2> 4448 T315 oasc.CoreContainer.create Creating SolrCore 'collection1' using instanceDir: /usr/home/hudson/hudson-slave/workspace/Lucene-Solr-Tests-trunk-java7/solr/build/solr-core/test/J1/./solrtest-jetty2-1348023184645/collection1
[junit4:junit4]   2> 4448 T315 oasc.ZkController.createCollectionZkNode Check for collection zkNode:collection1
[junit4:junit4]   2> 4449 T315 oasc.ZkController.createCollectionZkNode Collection zkNode exists
[junit4:junit4]   2> 4449 T315 oasc.ZkController.readConfigName Load collection config from:/collections/collection1
[junit4:junit4]   2> 4451 T315 oasc.SolrResourceLoader.<init> new SolrResourceLoader for directory: '/usr/home/hudson/hudson-slave/workspace/Lucene-Solr-Tests-trunk-java7/solr/build/solr-core/test/J1/./solrtest-jetty2-1348023184645/collection1/'
[junit4:junit4]   2> 4452 T315 oasc.SolrResourceLoader.replaceClassLoader Adding 'file:/usr/home/hudson/hudson-slave/workspace/Lucene-Solr-Tests-trunk-java7/solr/build/solr-core/test/J1/solrtest-jetty2-1348023184645/collection1/lib/README' to classloader
[junit4:junit4]   2> 4452 T315 oasc.SolrResourceLoader.replaceClassLoader Adding 'file:/usr/home/hudson/hudson-slave/workspace/Lucene-Solr-Tests-trunk-java7/solr/build/solr-core/test/J1/solrtest-jetty2-1348023184645/collection1/lib/classes/' to classloader
[junit4:junit4]   2> 4489 T315 oasc.SolrConfig.<init> Using Lucene MatchVersion: LUCENE_50
[junit4:junit4]   2> 4542 T315 oasc.SolrConfig.<init> Loaded SolrConfig: solrconfig.xml
[junit4:junit4]   2> 4644 T315 oass.IndexSchema.readSchema Reading Solr Schema
[junit4:junit4]   2> 4649 T315 oass.IndexSchema.readSchema Schema name=test
[junit4:junit4]   2> 4694 T336 oascc.ZkStateReader.updateClusterState Updating cloud state from ZooKeeper... 
[junit4:junit4]   2> 4711 T361 oascc.ZkStateReader$2.process A cluster state change has occurred - updating...
[junit4:junit4]   2> 4711 T349 oascc.ZkStateReader$2.process A cluster state change has occurred - updating...
[junit4:junit4]   2> 4711 T335 oascc.ZkStateReader$2.process A cluster state change has occurred - updating...
[junit4:junit4]   2> 5135 T315 oass.OpenExchangeRatesOrgProvider.init Initialized with rates=open-exchange-rates.json, refreshInterval=1440.
[junit4:junit4]   2> 5144 T315 oass.IndexSchema.readSchema default search field in schema is text
[junit4:junit4]   2> 5147 T315 oass.IndexSchema.readSchema unique key field: id
[junit4:junit4]   2> 5162 T315 oass.FileExchangeRateProvider.reload Reloading exchange rates from file currency.xml
[junit4:junit4]   2> 5166 T315 oass.FileExchangeRateProvider.reload Reloading exchange rates from file currency.xml
[junit4:junit4]   2> 5170 T315 oass.OpenExchangeRatesOrgProvider.reload Reloading exchange rates from open-exchange-rates.json
[junit4:junit4]   2> 5172 T315 oass.OpenExchangeRatesOrgProvider.reload Reloading exchange rates from open-exchange-rates.json
[junit4:junit4]   2> 5173 T315 oasc.SolrCore.<init> [collection1] Opening new SolrCore at /usr/home/hudson/hudson-slave/workspace/Lucene-Solr-Tests-trunk-java7/solr/build/solr-core/test/J1/./solrtest-jetty2-1348023184645/collection1/, dataDir=./org.apache.solr.cloud.BasicDistributedZk2Test-1348023180448/jetty2/
[junit4:junit4]   2> 5174 T315 oasc.JmxMonitoredMap.<init> JMX monitoring is enabled. Adding Solr mbeans to JMX Server: com.sun.jmx.mbeanserver.JmxMBeanServer@52740fae
[junit4:junit4]   2> 5175 T315 oasc.SolrCore.getNewIndexDir WARNING New index directory detected: old=null new=./org.apache.solr.cloud.BasicDistributedZk2Test-1348023180448/jetty2/index/
[junit4:junit4]   2> 5176 T315 oasc.SolrCore.initIndex WARNING [collection1] Solr index directory './org.apache.solr.cloud.BasicDistributedZk2Test-1348023180448/jetty2/index' doesn't exist. Creating new index...
[junit4:junit4]   2> 5176 T315 oasc.CachingDirectoryFactory.get return new directory for /usr/home/hudson/hudson-slave/workspace/Lucene-Solr-Tests-trunk-java7/solr/build/solr-core/test/J1/./org.apache.solr.cloud.BasicDistributedZk2Test-1348023180448/jetty2/index forceNew:false
[junit4:junit4]   2> 5182 T315 oasc.SolrDeletionPolicy.onCommit SolrDeletionPolicy.onCommit: commits:num=1
[junit4:junit4]   2> 		commit{dir=NRTCachingDirectory(org.apache.lucene.store.NIOFSDirectory@/usr/home/hudson/hudson-slave/workspace/Lucene-Solr-Tests-trunk-java7/solr/build/solr-core/test/J1/org.apache.solr.cloud.BasicDistributedZk2Test-1348023180448/jetty2/index lockFactory=org.apache.lucene.store.NativeFSLockFactory@6c4be3c7; maxCacheMB=48.0 maxMergeSizeMB=4.0),segFN=segments_1,generation=1,filenames=[segments_1]
[junit4:junit4]   2> 5182 T315 oasc.SolrDeletionPolicy.updateCommits newest commit = 1
[junit4:junit4]   2> 5183 T315 oasc.SolrCore.initWriters created xml: solr.XMLResponseWriter
[junit4:junit4]   2> 5185 T315 oasup.UpdateRequestProcessorChain.init inserting DistributedUpdateProcessorFactory into updateRequestProcessorChain "dedupe"
[junit4:junit4]   2> 5186 T315 oasup.UpdateRequestProcessorChain.init inserting DistributedUpdateProcessorFactory into updateRequestProcessorChain "dedupe-allfields"
[junit4:junit4]   2> 5186 T315 oasup.UpdateRequestProcessorChain.init inserting DistributedUpdateProcessorFactory into updateRequestProcessorChain "stored_sig"
[junit4:junit4]   2> 5187 T315 oasup.UpdateRequestProcessorChain.init inserting DistributedUpdateProcessorFactory into updateRequestProcessorChain "uniq-fields"
[junit4:junit4]   2> 5188 T315 oasup.UpdateRequestProcessorChain.init inserting DistributedUpdateProcessorFactory into updateRequestProcessorChain "distrib-dup-test-chain-implicit"
[junit4:junit4]   2> 5188 T315 oasc.RequestHandlers.initHandlersFromConfig adding lazy requestHandler: solr.ReplicationHandler
[junit4:junit4]   2> 5188 T315 oasc.RequestHandlers.initHandlersFromConfig created /replication: solr.ReplicationHandler
[junit4:junit4]   2> 5189 T315 oasc.RequestHandlers.initHandlersFromConfig created standard: solr.StandardRequestHandler
[junit4:junit4]   2> 5190 T315 oasc.RequestHandlers.initHandlersFromConfig created /get: solr.RealTimeGetHandler
[junit4:junit4]   2> 5190 T315 oasc.RequestHandlers.initHandlersFromConfig created dismax: solr.SearchHandler
[junit4:junit4]   2> 5191 T315 oasc.RequestHandlers.initHandlersFromConfig created mock: org.apache.solr.core.MockQuerySenderListenerReqHandler
[junit4:junit4]   2> 5191 T315 oasc.RequestHandlers.initHandlersFromConfig created /admin/: org.apache.solr.handler.admin.AdminHandlers
[junit4:junit4]   2> 5192 T315 oasc.RequestHandlers.initHandlersFromConfig created defaults: solr.StandardRequestHandler
[junit4:junit4]   2> 5192 T315 oasc.RequestHandlers.initHandlersFromConfig adding lazy requestHandler: solr.StandardRequestHandler
[junit4:junit4]   2> 5193 T315 oasc.RequestHandlers.initHandlersFromConfig created lazy: solr.StandardRequestHandler
[junit4:junit4]   2> 5193 T315 oasc.RequestHandlers.initHandlersFromConfig created /update: solr.UpdateRequestHandler
[junit4:junit4]   2> 5194 T315 oasc.RequestHandlers.initHandlersFromConfig created /terms: org.apache.solr.handler.component.SearchHandler
[junit4:junit4]   2> 5195 T315 oasc.RequestHandlers.initHandlersFromConfig created spellCheckCompRH: org.apache.solr.handler.component.SearchHandler
[junit4:junit4]   2> 5195 T315 oasc.RequestHandlers.initHandlersFromConfig created spellCheckCompRH_Direct: org.apache.solr.handler.component.SearchHandler
[junit4:junit4]   2> 5196 T315 oasc.RequestHandlers.initHandlersFromConfig created spellCheckWithWordbreak: org.apache.solr.handler.component.SearchHandler
[junit4:junit4]   2> 5196 T315 oasc.RequestHandlers.initHandlersFromConfig created spellCheckWithWordbreak_Direct: org.apache.solr.handler.component.SearchHandler
[junit4:junit4]   2> 5197 T315 oasc.RequestHandlers.initHandlersFromConfig created spellCheckCompRH1: org.apache.solr.handler.component.SearchHandler
[junit4:junit4]   2> 5198 T315 oasc.RequestHandlers.initHandlersFromConfig created tvrh: org.apache.solr.handler.component.SearchHandler
[junit4:junit4]   2> 5198 T315 oasc.RequestHandlers.initHandlersFromConfig created /mlt: solr.MoreLikeThisHandler
[junit4:junit4]   2> 5199 T315 oasc.RequestHandlers.initHandlersFromConfig created /debug/dump: solr.DumpRequestHandler
[junit4:junit4]   2> 5202 T315 oashl.XMLLoader.init xsltCacheLifetimeSeconds=60
[junit4:junit4]   2> 5205 T315 oasc.SolrCore.initDeprecatedSupport WARNING solrconfig.xml uses deprecated <admin/gettableFiles>, Please update your config to use the ShowFileRequestHandler.
[junit4:junit4]   2> 5206 T315 oasc.SolrCore.initDeprecatedSupport WARNING adding ShowFileRequestHandler with hidden files: [SCHEMA.XML, OLD_SYNONYMS.TXT, STOPWORDS.TXT, PROTWORDS.TXT, OPEN-EXCHANGE-RATES.JSON, SYNONYMS.TXT, CURRENCY.XML, MAPPING-ISOLATIN1ACCENT.TXT]
[junit4:junit4]   2> 5209 T315 oass.SolrIndexSearcher.<init> Opening Searcher@1e10cb60 main
[junit4:junit4]   2> 5210 T315 oasu.CommitTracker.<init> Hard AutoCommit: disabled
[junit4:junit4]   2> 5211 T315 oasu.CommitTracker.<init> Soft AutoCommit: disabled
[junit4:junit4]   2> 5211 T315 oashc.SpellCheckComponent.inform Initializing spell checkers
[junit4:junit4]   2> 5217 T315 oass.DirectSolrSpellChecker.init init: {name=direct,classname=DirectSolrSpellChecker,field=lowerfilt,minQueryLength=3}
[junit4:junit4]   2> 5269 T362 oasc.SolrCore.registerSearcher [collection1] Registered new searcher Searcher@1e10cb60 main{StandardDirectoryReader(segments_1:1)}
[junit4:junit4]   2> 5720 T336 oascc.ZkStateReader.updateClusterState Updating cloud state from ZooKeeper... 
[junit4:junit4]   2> 5734 T361 oascc.ZkStateReader$2.process A cluster state change has occurred - updating...
[junit4:junit4]   2> 5734 T349 oascc.ZkStateReader$2.process A cluster state change has occurred - updating...
[junit4:junit4]   2> 5734 T335 oascc.ZkStateReader$2.process A cluster state change has occurred - updating...
[junit4:junit4]   2> 5776 T315 oasc.CoreContainer.register registering core: collection1
[junit4:junit4]   2> 5776 T315 oasc.ZkController.register Register shard - core:collection1 address:http://127.0.0.1:12245/solr shardId:shard2
[junit4:junit4]   2> 5777 T315 oascc.SolrZkClient.makePath makePath: /collections/collection1/leader_elect/shard2/election
[junit4:junit4]   2> 5794 T320 oazs.PrepRequestProcessor.pRequest Got user-level KeeperException when processing sessionid:0x139dc715ca60004 type:delete cxid:0x42 zxid:0xfffffffffffffffe txntype:unknown reqpath:n/a Error Path:/solr/collections/collection1/leaders/shard2 Error:KeeperErrorCode = NoNode for /solr/collections/collection1/leaders/shard2
[junit4:junit4]   2> 5795 T315 oasc.ShardLeaderElectionContext.runLeaderProcess Running the leader process.
[junit4:junit4]   2> 5796 T320 oazs.PrepRequestProcessor.pRequest Got user-level KeeperException when processing sessionid:0x139dc715ca60004 type:create cxid:0x43 zxid:0xfffffffffffffffe txntype:unknown reqpath:n/a Error Path:/solr/overseer Error:KeeperErrorCode = NodeExists for /solr/overseer
[junit4:junit4]   2> 5798 T315 oasc.ShardLeaderElectionContext.waitForReplicasToComeUp Enough replicas found to continue.
[junit4:junit4]   2> 5798 T315 oasc.ShardLeaderElectionContext.runLeaderProcess I may be the new leader - try and sync
[junit4:junit4]   2> 5799 T315 oasc.SyncStrategy.sync Sync replicas to http://127.0.0.1:12245/solr/collection1/
[junit4:junit4]   2> 5799 T315 oasc.SyncStrategy.syncReplicas Sync Success - now sync replicas to me
[junit4:junit4]   2> 5799 T315 oasc.SyncStrategy.syncToMe http://127.0.0.1:12245/solr/collection1/ has no replicas
[junit4:junit4]   2> 5800 T315 oasc.ShardLeaderElectionContext.runLeaderProcess I am the new leader: http://127.0.0.1:12245/solr/collection1/
[junit4:junit4]   2> 5800 T315 oascc.SolrZkClient.makePath makePath: /collections/collection1/leaders/shard2
[junit4:junit4]   2> 5804 T320 oazs.PrepRequestProcessor.pRequest Got user-level KeeperException when processing sessionid:0x139dc715ca60004 type:create cxid:0x4c zxid:0xfffffffffffffffe txntype:unknown reqpath:n/a Error Path:/solr/overseer Error:KeeperErrorCode = NodeExists for /solr/overseer
[junit4:junit4]   2> 6240 T336 oascc.ZkStateReader.updateClusterState Updating cloud state from ZooKeeper... 
[junit4:junit4]   2> 6257 T349 oascc.ZkStateReader$2.process A cluster state change has occurred - updating...
[junit4:junit4]   2> 6257 T361 oascc.ZkStateReader$2.process A cluster state change has occurred - updating...
[junit4:junit4]   2> 6257 T335 oascc.ZkStateReader$2.process A cluster state change has occurred - updating...
[junit4:junit4]   2> 6265 T315 oasc.ZkController.register We are http://127.0.0.1:12245/solr/collection1/ and leader is http://127.0.0.1:12245/solr/collection1/
[junit4:junit4]   2> 6265 T315 oasc.ZkController.register No LogReplay needed for core=collection1 baseURL=http://127.0.0.1:12245/solr
[junit4:junit4]   2> 6266 T315 oasc.ZkController.checkRecovery I am the leader, no recovery necessary
[junit4:junit4]   2> 6268 T315 oascc.ZkStateReader.updateClusterState Updating cloud state from ZooKeeper... 
[junit4:junit4]   2> 6269 T315 oass.SolrDispatchFilter.init user.dir=/usr/home/hudson/hudson-slave/workspace/Lucene-Solr-Tests-trunk-java7/solr/build/solr-core/test/J1
[junit4:junit4]   2> 6269 T315 oass.SolrDispatchFilter.init SolrDispatchFilter.init() done
[junit4:junit4]   2> 6270 T315 oascsi.HttpClientUtil.createClient Creating new http client, config:maxConnections=128&maxConnectionsPerHost=32&followRedirects=false
[junit4:junit4]   2> 6389 T315 oejs.Server.doStart jetty-8.1.2.v20120308
[junit4:junit4]   2> 6392 T315 oejs.AbstractConnector.doStart Started SocketConnector@0.0.0.0:12247
[junit4:junit4]   2> 6393 T315 oasc.SolrResourceLoader.locateSolrHome JNDI not configured for solr (NoInitialContextEx)
[junit4:junit4]   2> 6393 T315 oasc.SolrResourceLoader.locateSolrHome using system property solr.solr.home: /usr/home/hudson/hudson-slave/workspace/Lucene-Solr-Tests-trunk-java7/solr/build/solr-core/test/J1/./solrtest-jetty3-1348023186722
[junit4:junit4]   2> 6393 T315 oasc.SolrResourceLoader.<init> new SolrResourceLoader for deduced Solr Home: '/usr/home/hudson/hudson-slave/workspace/Lucene-Solr-Tests-trunk-java7/solr/build/solr-core/test/J1/./solrtest-jetty3-1348023186722/'
[junit4:junit4]   2> 6428 T315 oass.SolrDispatchFilter.init SolrDispatchFilter.init()
[junit4:junit4]   2> 6429 T315 oasc.SolrResourceLoader.locateSolrHome JNDI not configured for solr (NoInitialContextEx)
[junit4:junit4]   2> 6429 T315 oasc.SolrResourceLoader.locateSolrHome using system property solr.solr.home: /usr/home/hudson/hudson-slave/workspace/Lucene-Solr-Tests-trunk-java7/solr/build/solr-core/test/J1/./solrtest-jetty3-1348023186722
[junit4:junit4]   2> 6429 T315 oasc.CoreContainer$Initializer.initialize looking for solr.xml: /usr/home/hudson/hudson-slave/workspace/Lucene-Solr-Tests-trunk-java7/solr/build/solr-core/test/J1/./solrtest-jetty3-1348023186722/solr.xml
[junit4:junit4]   2> 6430 T315 oasc.CoreContainer.<init> New CoreContainer 1404761028
[junit4:junit4]   2> 6430 T315 oasc.CoreContainer.load Loading CoreContainer using Solr Home: '/usr/home/hudson/hudson-slave/workspace/Lucene-Solr-Tests-trunk-java7/solr/build/solr-core/test/J1/./solrtest-jetty3-1348023186722/'
[junit4:junit4]   2> 6430 T315 oasc.SolrResourceLoader.<init> new SolrResourceLoader for directory: '/usr/home/hudson/hudson-slave/workspace/Lucene-Solr-Tests-trunk-java7/solr/build/solr-core/test/J1/./solrtest-jetty3-1348023186722/'
[junit4:junit4]   2> 6455 T315 oasc.CoreContainer.load Registering Log Listener
[junit4:junit4]   2> 6466 T315 oasc.CoreContainer.initZooKeeper Zookeeper client=127.0.0.1:12233/solr
[junit4:junit4]   2> 6467 T315 oaz.ZooKeeper.<init> Initiating client connection, connectString=127.0.0.1:12233/solr sessionTimeout=5000 watcher=org.apache.solr.common.cloud.ConnectionManager@f86d088
[junit4:junit4]   2> 6468 T372 oaz.ClientCnxn$SendThread.startConnect Opening socket connection to server /127.0.0.1:12233
[junit4:junit4]   2> 6468 T315 oascc.ConnectionManager.waitForConnected Waiting for client to connect to ZooKeeper
[junit4:junit4]   2> 6469 T372 oaz.ClientCnxn$SendThread.primeConnection Socket connection established to localhost/127.0.0.1:12233, initiating session
[junit4:junit4]   2> 6469 T317 oazs.NIOServerCnxn$Factory.run Accepted socket connection from /140.211.11.196:12248
[junit4:junit4]   2> 6470 T317 oazs.NIOServerCnxn.readConnectRequest Client attempting to establish new session at /140.211.11.196:12248
[junit4:junit4]   2> 6472 T319 oazs.NIOServerCnxn.finishSessionInit Established session 0x139dc715ca60005 with negotiated timeout 5000 for client /140.211.11.196:12248
[junit4:junit4]   2> 6472 T372 oaz.ClientCnxn$SendThread.readConnectResult Session establishment complete on server localhost/127.0.0.1:12233, sessionid = 0x139dc715ca60005, negotiated timeout = 5000
[junit4:junit4]   2> 6472 T373 oascc.ConnectionManager.process Watcher org.apache.solr.common.cloud.ConnectionManager@f86d088 name:ZooKeeperConnection Watcher:127.0.0.1:12233/solr got event WatchedEvent state:SyncConnected type:None path:null path:null type:None
[junit4:junit4]   2> 6473 T315 oascc.ConnectionManager.waitForConnected Client is connected to ZooKeeper
[junit4:junit4]   2> 6474 T320 oazs.PrepRequestProcessor.pRequest Got user-level KeeperException when processing sessionid:0x139dc715ca60005 type:create cxid:0x1 zxid:0xfffffffffffffffe txntype:unknown reqpath:n/a Error Path:/solr/overseer Error:KeeperErrorCode = NodeExists for /solr/overseer
[junit4:junit4]   2> 6487 T320 oazs.PrepRequestProcessor.pRequest Got user-level KeeperException when processing sessionid:0x139dc715ca60005 type:create cxid:0x2 zxid:0xfffffffffffffffe txntype:unknown reqpath:n/a Error Path:/solr/overseer Error:KeeperErrorCode = NodeExists for /solr/overseer
[junit4:junit4]   2> 6489 T315 oasc.ZkController.createEphemeralLiveNode Register node as live in ZooKeeper:/live_nodes/127.0.0.1:12247_solr
[junit4:junit4]   2> 6490 T320 oazs.PrepRequestProcessor.pRequest Got user-level KeeperException when processing sessionid:0x139dc715ca60005 type:delete cxid:0x4 zxid:0xfffffffffffffffe txntype:unknown reqpath:n/a Error Path:/solr/live_nodes/127.0.0.1:12247_solr Error:KeeperErrorCode = NoNode for /solr/live_nodes/127.0.0.1:12247_solr
[junit4:junit4]   2> 6495 T315 oascc.SolrZkClient.makePath makePath: /live_nodes/127.0.0.1:12247_solr
[junit4:junit4]   2> 6497 T349 oascc.ZkStateReader$3.process Updating live nodes
[junit4:junit4]   2> 6497 T335 oascc.ZkStateReader$3.process Updating live nodes
[junit4:junit4]   2> 6497 T361 oascc.ZkStateReader$3.process Updating live nodes
[junit4:junit4]   2> 6498 T315 oashc.HttpShardHandlerFactory.getParameter Setting socketTimeout to: 0
[junit4:junit4]   2> 6499 T315 oashc.HttpShardHandlerFactory.getParameter Setting urlScheme to: http://
[junit4:junit4]   2> 6500 T315 oashc.HttpShardHandlerFactory.getParameter Setting connTimeout to: 0
[junit4:junit4]   2> 6500 T315 oashc.HttpShardHandlerFactory.getParameter Setting maxConnectionsPerHost to: 20
[junit4:junit4]   2> 6501 T315 oashc.HttpShardHandlerFactory.getParameter Setting corePoolSize to: 0
[junit4:junit4]   2> 6501 T315 oashc.HttpShardHandlerFactory.getParameter Setting maximumPoolSize to: 2147483647
[junit4:junit4]   2> 6502 T315 oashc.HttpShardHandlerFactory.getParameter Setting maxThreadIdleTime to: 5
[junit4:junit4]   2> 6502 T315 oashc.HttpShardHandlerFactory.getParameter Setting sizeOfQueue to: -1
[junit4:junit4]   2> 6503 T315 oashc.HttpShardHandlerFactory.getParameter Setting fairnessPolicy to: false
[junit4:junit4]   2> 6503 T315 oascsi.HttpClientUtil.createClient Creating new http client, config:maxConnectionsPerHost=20&maxConnections=10000&socketTimeout=0&connTimeout=0&retry=false
[junit4:junit4]   2> 6523 T315 oascc.ZkStateReader.createClusterStateWatchersAndUpdate Updating cluster state from ZooKeeper... 
[junit4:junit4]   2> 6532 T315 oasc.CoreContainer.create Creating SolrCore 'collection1' using instanceDir: /usr/home/hudson/hudson-slave/workspace/Lucene-Solr-Tests-trunk-java7/solr/build/solr-core/test/J1/./solrtest-jetty3-1348023186722/collection1
[junit4:junit4]   2> 6533 T315 oasc.ZkController.createCollectionZkNode Check for collection zkNode:collection1
[junit4:junit4]   2> 6534 T315 oasc.ZkController.createCollectionZkNode Collection zkNode exists
[junit4:junit4]   2> 6534 T315 oasc.ZkController.readConfigName Load collection config from:/collections/collection1
[junit4:junit4]   2> 6536 T315 oasc.SolrResourceLoader.<init> new SolrResourceLoader for directory: '/usr/home/hudson/hudson-slave/workspace/Lucene-Solr-Tests-trunk-java7/solr/build/solr-core/test/J1/./solrtest-jetty3-1348023186722/collection1/'
[junit4:junit4]   2> 6537 T315 oasc.SolrResourceLoader.replaceClassLoader Adding 'file:/usr/home/hudson/hudson-slave/workspace/Lucene-Solr-Tests-trunk-java7/solr/build/solr-core/test/J1/solrtest-jetty3-1348023186722/collection1/lib/README' to classloader
[junit4:junit4]   2> 6538 T315 oasc.SolrResourceLoader.replaceClassLoader Adding 'file:/usr/home/hudson/hudson-slave/workspace/Lucene-Solr-Tests-trunk-java7/solr/build/solr-core/test/J1/solrtest-jetty3-1348023186722/collection1/lib/classes/' to classloader
[junit4:junit4]   2> 6611 T315 oasc.SolrConfig.<init> Using Lucene MatchVersion: LUCENE_50
[junit4:junit4]   2> 6671 T315 oasc.SolrConfig.<init> Loaded SolrConfig: solrconfig.xml
[junit4:junit4]   2> 6773 T315 oass.IndexSchema.readSchema Reading Solr Schema
[junit4:junit4]   2> 6777 T336 oascc.ZkStateReader.updateClusterState Updating cloud state from ZooKeeper... 
[junit4:junit4]   2> 6778 T315 oass.IndexSchema.readSchema Schema name=test
[junit4:junit4]   2> 6791 T373 oascc.ZkStateReader$2.process A cluster state change has occurred - updating...
[junit4:junit4]   2> 6791 T335 oascc.ZkStateReader$2.process A cluster state change has occurred - updating...
[junit4:junit4]   2> 6791 T361 oascc.ZkStateReader$2.process A cluster state change has occurred - updating...
[junit4:junit4]   2> 6791 T349 oascc.ZkStateReader$2.process A cluster state change has occurred - updating...
[junit4:junit4]   2> 7233 T315 oass.OpenExchangeRatesOrgProvider.init Initialized with rates=open-exchange-rates.json, refreshInterval=1440.
[junit4:junit4]   2> 7251 T315 oass.IndexSchema.readSchema default search field in schema is text
[junit4:junit4]   2> 7255 T315 oass.IndexSchema.readSchema unique key field: id
[junit4:junit4]   2> 7269 T315 oass.FileExchangeRateProvider.reload Reloading exchange rates from file currency.xml
[junit4:junit4]   2> 7273 T315 oass.FileExchangeRateProvider.reload Reloading exchange rates from file currency.xml
[junit4:junit4]   2> 7277 T315 oass.OpenExchangeRatesOrgProvider.reload Reloading exchange rates from open-exchange-rates.json
[junit4:junit4]   2> 7278 T315 oass.OpenExchangeRatesOrgProvider.reload Reloading exchange rates from open-exchange-rates.json
[junit4:junit4]   2> 7280 T315 oasc.SolrCore.<init> [collection1] Opening new SolrCore at /usr/home/hudson/hudson-slave/workspace/Lucene-Solr-Tests-trunk-java7/solr/build/solr-core/test/J1/./solrtest-jetty3-1348023186722/collection1/, dataDir=./org.apache.solr.cloud.BasicDistributedZk2Test-1348023180448/jetty3/
[junit4:junit4]   2> 7280 T315 oasc.JmxMonitoredMap.<init> JMX monitoring is enabled. Adding Solr mbeans to JMX Server: com.sun.jmx.mbeanserver.JmxMBeanServer@52740fae
[junit4:junit4]   2> 7281 T315 oasc.SolrCore.getNewIndexDir WARNING New index directory detected: old=null new=./org.apache.solr.cloud.BasicDistributedZk2Test-1348023180448/jetty3/index/
[junit4:junit4]   2> 7282 T315 oasc.SolrCore.initIndex WARNING [collection1] Solr index directory './org.apache.solr.cloud.BasicDistributedZk2Test-1348023180448/jetty3/index' doesn't exist. Creating new index...
[junit4:junit4]   2> 7283 T315 oasc.CachingDirectoryFactory.get return new directory for /usr/home/hudson/hudson-slave/workspace/Lucene-Solr-Tests-trunk-java7/solr/build/solr-core/test/J1/./org.apache.solr.cloud.BasicDistributedZk2Test-1348023180448/jetty3/index forceNew:false
[junit4:junit4]   2> 7288 T315 oasc.SolrDeletionPolicy.onCommit SolrDeletionPolicy.onCommit: commits:num=1
[junit4:junit4]   2> 		commit{dir=NRTCachingDirectory(org.apache.lucene.store.NIOFSDirectory@/usr/home/hudson/hudson-slave/workspace/Lucene-Solr-Tests-trunk-java7/solr/build/solr-core/test/J1/org.apache.solr.cloud.BasicDistributedZk2Test-1348023180448/jetty3/index lockFactory=org.apache.lucene.store.NativeFSLockFactory@2409d07; maxCacheMB=48.0 maxMergeSizeMB=4.0),segFN=segments_1,generation=1,filenames=[segments_1]
[junit4:junit4]   2> 7288 T315 oasc.SolrDeletionPolicy.updateCommits newest commit = 1
[junit4:junit4]   2> 7289 T315 oasc.SolrCore.initWriters created xml: solr.XMLResponseWriter
[junit4:junit4]   2> 7291 T315 oasup.UpdateRequestProcessorChain.init inserting DistributedUpdateProcessorFactory into updateRequestProcessorChain "dedupe"
[junit4:junit4]   2> 7292 T315 oasup.UpdateRequestProcessorChain.init inserting DistributedUpdateProcessorFactory into updateRequestProcessorChain "dedupe-allfields"
[junit4:junit4]   2> 7292 T315 oasup.UpdateRequestProcessorChain.init inserting DistributedUpdateProcessorFactory into updateRequestProcessorChain "stored_sig"
[junit4:junit4]   2> 7293 T315 oasup.UpdateRequestProcessorChain.init inserting DistributedUpdateProcessorFactory into updateRequestProcessorChain "uniq-fields"
[junit4:junit4]   2> 7293 T315 oasup.UpdateRequestProcessorChain.init inserting DistributedUpdateProcessorFactory into updateRequestProcessorChain "distrib-dup-test-chain-implicit"
[junit4:junit4]   2> 7294 T315 oasc.RequestHandlers.initHandlersFromConfig adding lazy requestHandler: solr.ReplicationHandler
[junit4:junit4]   2> 7294 T315 oasc.RequestHandlers.initHandlersFromConfig created /replication: solr.ReplicationHandler
[junit4:junit4]   2> 7295 T315 oasc.RequestHandlers.initHandlersFromConfig created standard: solr.StandardRequestHandler
[junit4:junit4]   2> 7295 T315 oasc.RequestHandlers.initHandlersFromConfig created /get: solr.RealTimeGetHandler
[junit4:junit4]   2> 7296 T315 oasc.RequestHandlers.initHandlersFromConfig created dismax: solr.SearchHandler
[junit4:junit4]   2> 7296 T315 oasc.RequestHandlers.initHandlersFromConfig created mock: org.apache.solr.core.MockQuerySenderListenerReqHandler
[junit4:junit4]   2> 7297 T315 oasc.RequestHandlers.initHandlersFromConfig created /admin/: org.apache.solr.handler.admin.AdminHandlers
[junit4:junit4]   2> 7298 T315 oasc.RequestHandlers.initHandlersFromConfig created defaults: solr.StandardRequestHandler
[junit4:junit4]   2> 7298 T315 oasc.RequestHandlers.initHandlersFromConfig adding lazy requestHandler: solr.StandardRequestHandler
[junit4:junit4]   2> 7298 T315 oasc.RequestHandlers.initHandlersFromConfig created lazy: solr.StandardRequestHandler
[junit4:junit4]   2> 7299 T315 oasc.RequestHandlers.initHandlersFromConfig created /update: solr.UpdateRequestHandler
[junit4:junit4]   2> 7300 T315 oasc.RequestHandlers.initHandlersFromConfig created /terms: org.apache.solr.handler.component.SearchHandler
[junit4:junit4]   2> 7300 T315 oasc.RequestHandlers.initHandlersFromConfig created spellCheckCompRH: org.apache.solr.handler.component.SearchHandler
[junit4:junit4]   2> 7301 T315 oasc.RequestHandlers.initHandlersFromConfig created spellCheckCompRH_Direct: org.apache.solr.handler.component.SearchHandler
[junit4:junit4]   2> 7301 T315 oasc.RequestHandlers.initHandlersFromConfig created spellCheckWithWordbreak: org.apache.solr.handler.component.SearchHandler
[junit4:junit4]   2> 7302 T315 oasc.RequestHandlers.initHandlersFromConfig created spellCheckWithWordbreak_Direct: org.apache.solr.handler.component.SearchHandler
[junit4:junit4]   2> 7303 T315 oasc.RequestHandlers.initHandlersFromConfig created spellCheckCompRH1: org.apache.solr.handler.component.SearchHandler
[junit4:junit4]   2> 7303 T315 oasc.RequestHandlers.initHandlersFromConfig created tvrh: org.apache.solr.handler.component.SearchHandler
[junit4:junit4]   2> 7304 T315 oasc.RequestHandlers.initHandlersFromConfig created /mlt: solr.MoreLikeThisHandler
[junit4:junit4]   2> 7304 T315 oasc.RequestHandlers.initHandlersFromConfig created /debug/dump: solr.DumpRequestHandler
[junit4:junit4]   2> 7307 T315 oashl.XMLLoader.init xsltCacheLifetimeSeconds=60
[junit4:junit4]   2> 7311 T315 oasc.SolrCore.initDeprecatedSupport WARNING solrconfig.xml uses deprecated <admin/gettableFiles>, Please update your config to use the ShowFileRequestHandler.
[junit4:junit4]   2> 7312 T315 oasc.SolrCore.initDeprecatedSupport WARNING adding ShowFileRequestHandler with hidden files: [SCHEMA.XML, OLD_SYNONYMS.TXT, STOPWORDS.TXT, PROTWORDS.TXT, OPEN-EXCHANGE-RATES.JSON, SYNONYMS.TXT, CURRENCY.XML, MAPPING-ISOLATIN1ACCENT.TXT]
[junit4:junit4]   2> 7315 T315 oass.SolrIndexSearcher.<init> Opening Searcher@29b4e740 main
[junit4:junit4]   2> 7316 T315 oasu.CommitTracker.<init> Hard AutoCommit: disabled
[junit4:junit4]   2> 7316 T315 oasu.CommitTracker.<init> Soft AutoCommit: disabled
[junit4:junit4]   2> 7317 T315 oashc.SpellCheckComponent.inform Initializing spell checkers
[junit4:junit4]   2> 7324 T315 oass.DirectSolrSpellChecker.init init: {name=direct,classname=DirectSolrSpellChecker,field=lowerfilt,minQueryLength=3}
[junit4:junit4]   2> 7383 T374 oasc.SolrCore.registerSearcher [collection1] Registered new searcher Searcher@29b4e740 main{StandardDirectoryReader(segments_1:1)}
[junit4:junit4]   2> 7799 T336 oascc.ZkStateReader.updateClusterState Updating cloud state from ZooKeeper... 
[junit4:junit4]   2> 7818 T361 oascc.ZkStateReader$2.process A cluster state change has occurred - updating...
[junit4:junit4]   2> 7818 T335 oascc.ZkStateReader$2.process A cluster state change has occurred - updating...
[junit4:junit4]   2> 7818 T373 oascc.ZkStateReader$2.process A cluster state change has occurred - updating...
[junit4:junit4]   2> 7818 T349 oascc.ZkStateReader$2.process A cluster state change has occurred - updating...
[junit4:junit4]   2> 7923 T315 oasc.CoreContainer.register registering core: collection1
[junit4:junit4]   2> 7923 T315 oasc.ZkController.register Register shard - core:collection1 address:http://127.0.0.1:12247/solr shardId:shard1
[junit4:junit4]   2> 7931 T315 oasc.ZkController.register We are http://127.0.0.1:12247/solr/collection1/ and leader is http://127.0.0.1:12242/solr/collection1/
[junit4:junit4]   2> 7932 T315 oasc.ZkController.register No LogReplay needed for core=collection1 baseURL=http://127.0.0.1:12247/solr
[junit4:junit4]   2> 7932 T315 oasc.ZkController.checkRecovery Core needs to recover:collection1
[junit4:junit4]   2> 7933 T315 oasu.DefaultSolrCoreState.doRecovery Running recovery - first canceling any ongoing recovery
[junit4:junit4]   2> ASYNC  NEW_CORE C42 name=collection1 org.apache.solr.core.SolrCore@54b48ee1 url=http://127.0.0.1:12247/solr/collection1 node=127.0.0.1:12247_solr
[junit4:junit4]   2> 7940 T375 C42 P12247 oasc.RecoveryStrategy.run Starting recovery process.  core=collection1 recoveringAfterStartup=true
[junit4:junit4]   2> 7941 T315 oascc.ZkStateReader.updateClusterState Updating cloud state from ZooKeeper... 
[junit4:junit4]   2> 7942 T375 C42 P12247 oasc.RecoveryStrategy.doRecovery ###### startupVersions=[]
[junit4:junit4]   2> 7942 T315 oass.SolrDispatchFilter.init user.dir=/usr/home/hudson/hudson-slave/workspace/Lucene-Solr-Tests-trunk-java7/solr/build/solr-core/test/J1
[junit4:junit4]   2> 7943 T315 oass.SolrDispatchFilter.init SolrDispatchFilter.init() done
[junit4:junit4]   2> 7944 T375 C42 P12247 oasc.RecoveryStrategy.doRecovery Attempting to PeerSync from http://127.0.0.1:12242/solr/collection1/ core=collection1 - recoveringAfterStartup=true
[junit4:junit4]   2> 7944 T315 oascsi.HttpClientUtil.createClient Creating new http client, config:maxConnections=128&maxConnectionsPerHost=32&followRedirects=false
[junit4:junit4]   2> 7953 T375 C42 P12247 oascsi.HttpClientUtil.createClient Creating new http client, config:maxConnectionsPerHost=20&maxConnections=10000&connTimeout=30000&socketTimeout=30000&retry=false
[junit4:junit4]   2> 7977 T375 C42 P12247 oasu.PeerSync.sync PeerSync: core=collection1 url=http://127.0.0.1:12247/solr START replicas=[http://127.0.0.1:12242/solr/collection1/] nUpdates=100
[junit4:junit4]   2> 7978 T375 C42 P12247 oasu.PeerSync.sync WARNING no frame of reference to tell of we've missed updates
[junit4:junit4]   2> 7978 T375 C42 P12247 oasc.RecoveryStrategy.doRecovery PeerSync Recovery was not successful - trying replication. core=collection1
[junit4:junit4]   2> 7979 T375 C42 P12247 oasc.RecoveryStrategy.doRecovery Starting Replication Recovery. core=collection1
[junit4:junit4]   2> 7979 T375 C42 P12247 oascsi.HttpClientUtil.createClient Creating new http client, config:maxConnections=128&maxConnectionsPerHost=32&followRedirects=false
[junit4:junit4]   2> ASYNC  NEW_CORE C43 name=collection1 org.apache.solr.core.SolrCore@776c8a77 url=http://127.0.0.1:12242/solr/collection1 node=127.0.0.1:12242_solr
[junit4:junit4]   2> 7991 T341 C43 P12242 REQ /get {distrib=false&qt=/get&wt=javabin&version=2&getVersions=100} status=0 QTime=0 
[junit4:junit4]   2> 8122 T315 oejs.Server.doStart jetty-8.1.2.v20120308
[junit4:junit4]   2> 8125 T315 oejs.AbstractConnector.doStart Started SocketConnector@0.0.0.0:12251
[junit4:junit4]   2> 8126 T315 oasc.SolrResourceLoader.locateSolrHome JNDI not configured for solr (NoInitialContextEx)
[junit4:junit4]   2> 8126 T315 oasc.SolrResourceLoader.locateSolrHome using system property solr.solr.home: /usr/home/hudson/hudson-slave/workspace/Lucene-Solr-Tests-trunk-java7/solr/build/solr-core/test/J1/./solrtest-jetty4-1348023188403
[junit4:junit4]   2> 8127 T315 oasc.SolrResourceLoader.<init> new SolrResourceLoader for deduced Solr Home: '/usr/home/hudson/hudson-slave/workspace/Lucene-Solr-Tests-trunk-java7/solr/build/solr-core/test/J1/./solrtest-jetty4-1348023188403/'
[junit4:junit4]   2> 8171 T315 oass.SolrDispatchFilter.init SolrDispatchFilter.init()
[junit4:junit4]   2> 8172 T315 oasc.SolrResourceLoader.locateSolrHome JNDI not configured for solr (NoInitialContextEx)
[junit4:junit4]   2> 8172 T315 oasc.SolrResourceLoader.locateSolrHome using system property solr.solr.home: /usr/home/hudson/hudson-slave/workspace/Lucene-Solr-Tests-trunk-java7/solr/build/solr-core/test/J1/./solrtest-jetty4-1348023188403
[junit4:junit4]   2> 8173 T315 oasc.CoreContainer$Initializer.initialize looking for solr.xml: /usr/home/hudson/hudson-slave/workspace/Lucene-Solr-Tests-trunk-java7/solr/build/solr-core/test/J1/./solrtest-jetty4-1348023188403/solr.xml
[junit4:junit4]   2> 8173 T315 oasc.CoreContainer.<init> New CoreContainer 444531048
[junit4:junit4]   2> 8174 T315 oasc.CoreContainer.load Loading CoreContainer using Solr Home: '/usr/home/hudson/hudson-slave/workspace/Lucene-Solr-Tests-trunk-java7/solr/build/solr-core/test/J1/./solrtest-jetty4-1348023188403/'
[junit4:junit4]   2> 8175 T315 oasc.SolrResourceLoader.<init> new SolrResourceLoader for directory: '/usr/home/hudson/hudson-slave/workspace/Lucene-Solr-Tests-trunk-java7/solr/build/solr-core/test/J1/./solrtest-jetty4-1348023188403/'
[junit4:junit4]   2> 8211 T315 oasc.CoreContainer.load Registering Log Listener
[junit4:junit4]   2> 8227 T315 oasc.CoreContainer.initZooKeeper Zookeeper client=127.0.0.1:12233/solr
[junit4:junit4]   2> 8228 T315 oaz.ZooKeeper.<init> Initiating client connection, connectString=127.0.0.1:12233/solr sessionTimeout=5000 watcher=org.apache.solr.common.cloud.ConnectionManager@8d7b16e
[junit4:junit4]   2> 8230 T386 oaz.ClientCnxn$SendThread.startConnect Opening socket connection to server /127.0.0.1:12233
[junit4:junit4]   2> 8230 T315 oascc.ConnectionManager.waitForConnected Waiting for client to connect to ZooKeeper
[junit4:junit4]   2> 8231 T386 oaz.ClientCnxn$SendThread.primeConnection Socket connection established to localhost/127.0.0.1:12233, initiating session
[junit4:junit4]   2> 8231 T317 oazs.NIOServerCnxn$Factory.run Accepted socket connection from /140.211.11.196:12252
[junit4:junit4]   2> 8231 T317 oazs.NIOServerCnxn.readConnectRequest Client attempting to establish new session at /140.211.11.196:12252
[junit4:junit4]   2> 8234 T319 oazs.NIOServerCnxn.finishSessionInit Established session 0x139dc715ca60006 with negotiated timeout 5000 for client /140.211.11.196:12252
[junit4:junit4]   2> 8235 T386 oaz.ClientCnxn$SendThread.readConnectResult Session establishment complete on server localhost/127.0.0.1:12233, sessionid = 0x139dc715ca60006, negotiated timeout = 5000
[junit4:junit4]   2> 8235 T387 oascc.ConnectionManager.process Watcher org.apache.solr.common.cloud.ConnectionManager@8d7b16e name:ZooKeeperConnection Watcher:127.0.0.1:12233/solr got event WatchedEvent state:SyncConnected type:None path:null path:null type:None
[junit4:junit4]   2> 8235 T315 oascc.ConnectionManager.waitForConnected Client is connected to ZooKeeper
[junit4:junit4]   2> 8236 T320 oazs.PrepRequestProcessor.pRequest Got user-level KeeperException when processing sessionid:0x139dc715ca60006 type:create cxid:0x1 zxid:0xfffffffffffffffe txntype:unknown reqpath:n/a Error Path:/solr/overseer Error:KeeperErrorCode = NodeExists for /solr/overseer
[junit4:junit4]   2> 8250 T320 oazs.PrepRequestProcessor.pRequest Got user-level KeeperException when processing sessionid:0x139dc715ca60006 type:create cxid:0x2 zxid:0xfffffffffffffffe txntype:unknown reqpath:n/a Error Path:/solr/overseer Error:KeeperErrorCode = NodeExists for /solr/overseer
[junit4:junit4]   2> 8252 T315 oasc.ZkController.createEphemeralLiveNode Register node as live in ZooKeeper:/live_nodes/127.0.0.1:12251_solr
[junit4:junit4]   2> 8253 T320 oazs.PrepRequestProcessor.pRequest Got user-level KeeperException when processing sessionid:0x139dc715ca60006 type:delete cxid:0x4 zxid:0xfffffffffffffffe txntype:unknown reqpath:n/a Error Path:/solr/live_nodes/127.0.0.1:12251_solr Error:KeeperErrorCode = NoNode for /solr/live_nodes/127.0.0.1:12251_solr
[junit4:junit4]   2> 8254 T315 oascc.SolrZkClient.makePath makePath: /live_nodes/127.0.0.1:12251_solr
[junit4:junit4]   2> 8262 T373 oascc.ZkStateReader$3.process Updating live nodes
[junit4:junit4]   2> 8262 T349 oascc.ZkStateReader$3.process Updating live nodes
[junit4:junit4]   2> 8262 T361 oascc.ZkStateReader$3.process Updating live nodes
[junit4:junit4]   2> 8262 T335 oascc.ZkStateReader$3.process Updating live nodes
[junit4:junit4]   2> 8263 T315 oashc.HttpShardHandlerFactory.getParameter Setting socketTimeout to: 0
[junit4:junit4]   2> 8264 T315 oashc.HttpShardHandlerFactory.getParameter Setting urlScheme to: http://
[junit4:junit4]   2> 8264 T315 oashc.HttpShardHandlerFactory.getParameter Setting connTimeout to: 0
[junit4:junit4]   2> 8265 T315 oashc.HttpShardHandlerFactory.getParameter Setting maxConnectionsPerHost to: 20
[junit4:junit4]   2> 8265 T315 oashc.HttpShardHandlerFactory.getParameter Setting corePoolSize to: 0
[junit4:junit4]   2> 8266 T315 oashc.HttpShardHandlerFactory.getParameter Setting maximumPoolSize to: 2147483647
[junit4:junit4]   2> 8266 T315 oashc.HttpShardHandlerFactory.getParameter Setting maxThreadIdleTime to: 5
[junit4:junit4]   2> 8267 T315 oashc.HttpShardHandlerFactory.getParameter Setting sizeOfQueue to: -1
[junit4:junit4]   2> 8267 T315 oashc.HttpShardHandlerFactory.getParameter Setting fairnessPolicy to: false
[junit4:junit4]   2> 8268 T315 oascsi.HttpClientUtil.createClient Creating new http client, config:maxConnectionsPerHost=20&maxConnections=10000&socketTimeout=0&connTimeout=0&retry=false
[junit4:junit4]   2> 8290 T315 oascc.ZkStateReader.createClusterStateWatchersAndUpdate Updating cluster state from ZooKeeper... 
[junit4:junit4]   2> 8298 T315 oasc.CoreContainer.create Creating SolrCore 'collection1' using instanceDir: /usr/home/hudson/hudson-slave/workspace/Lucene-Solr-Tests-trunk-java7/solr/build/solr-core/test/J1/./solrtest-jetty4-1348023188403/collection1
[junit4:junit4]   2> 8299 T315 oasc.ZkController.createCollectionZkNode Check for collection zkNode:collection1
[junit4:junit4]   2> 8300 T315 oasc.ZkController.createCollectionZkNode Collection zkNode exists
[junit4:junit4]   2> 8301 T315 oasc.ZkController.readConfigName Load collection config from:/collections/collection1
[junit4:junit4]   2> 8303 T315 oasc.SolrResourceLoader.<init> new SolrResourceLoader for directory: '/usr/home/hudson/hudson-slave/workspace/Lucene-Solr-Tests-trunk-java7/solr/build/solr-core/test/J1/./solrtest-jetty4-1348023188403/collection1/'
[junit4:junit4]   2> 8304 T315 oasc.SolrResourceLoader.replaceClassLoader Adding 'file:/usr/home/hudson/hudson-slave/workspace/Lucene-Solr-Tests-trunk-java7/solr/build/solr-core/test/J1/solrtest-jetty4-1348023188403/collection1/lib/classes/' to classloader
[junit4:junit4]   2> 8305 T315 oasc.SolrResourceLoader.replaceClassLoader Adding 'file:/usr/home/hudson/hudson-slave/workspace/Lucene-Solr-Tests-trunk-java7/solr/build/solr-core/test/J1/solrtest-jetty4-1348023188403/collection1/lib/README' to classloader
[junit4:junit4]   2> 8324 T336 oascc.ZkStateReader.updateClusterState Updating cloud state from ZooKeeper... 
[junit4:junit4]   2> 8337 T387 oascc.ZkStateReader$2.process A cluster state change has occurred - updating...
[junit4:junit4]   2> 8337 T335 oascc.ZkStateReader$2.process A cluster state change has occurred - updating...
[junit4:junit4]   2> 8338 T361 oascc.ZkStateReader$2.process A cluster state change has occurred - updating...
[junit4:junit4]   2> 8338 T373 oascc.ZkStateReader$2.process A cluster state change has occurred - updating...
[junit4:junit4]   2> 8337 T349 oascc.ZkStateReader$2.process A cluster state change has occurred - updating...
[junit4:junit4]   2> 8360 T315 oasc.SolrConfig.<init> Using Lucene MatchVersion: LUCENE_50
[junit4:junit4]   2> 8433 T315 oasc.SolrConfig.<init> Loaded SolrConfig: solrconfig.xml
[junit4:junit4]   2> 8534 T315 oass.IndexSchema.readSchema Reading Solr Schema
[junit4:junit4]   2> 8541 T315 oass.IndexSchema.readSchema Schema name=test
[junit4:junit4]   2> 9024 T315 oass.OpenExchangeRatesOrgProvider.init Initialized with rates=open-exchange-rates.json, refreshInterval=1440.
[junit4:junit4]   2> 9032 T315 oass.IndexSchema.readSchema default search field in schema is text
[junit4:junit4]   2> 9036 T315 oass.IndexSchema.readSchema unique key field: id
[junit4:junit4]   2> 9052 T315 oass.FileExchangeRateProvider.reload Reloading exchange rates from file currency.xml
[junit4:junit4]   2> 9056 T315 oass.FileExchangeRateProvider.reload Reloading exchange rates from file currency.xml
[junit4:junit4]   2> 9062 T315 oass.OpenExchangeRatesOrgProvider.reload Reloading exchange rates from open-exchange-rates.json
[junit4:junit4]   2> 9064 T315 oass.OpenExchangeRatesOrgProvider.reload Reloading exchange rates from open-exchange-rates.json
[junit4:junit4]   2> 9066 T315 oasc.SolrCore.<init> [collection1] Opening new SolrCore at /usr/home/hudson/hudson-slave/workspace/Lucene-Solr-Tests-trunk-java7/solr/build/solr-core/test/J1/./solrtest-jetty4-1348023188403/collection1/, dataDir=./org.apache.solr.cloud.BasicDistributedZk2Test-1348023180448/jetty4/
[junit4:junit4]   2> 9066 T315 oasc.JmxMonitoredMap.<init> JMX monitoring is enabled. Adding Solr mbeans to JMX Server: com.sun.jmx.mbeanserver.JmxMBeanServer@52740fae
[junit4:junit4]   2> 9068 T315 oasc.SolrCore.getNewIndexDir WARNING New index directory detected: old=null new=./org.apache.solr.cloud.BasicDistributedZk2Test-1348023180448/jetty4/index/
[junit4:junit4]   2> 9068 T315 oasc.SolrCore.initIndex WARNING [collection1] Solr index directory './org.apache.solr.cloud.BasicDistributedZk2Test-1348023180448/jetty4/index' doesn't exist. Creating new index...
[junit4:junit4]   2> 9069 T315 oasc.CachingDirectoryFactory.get return new directory for /usr/home/hudson/hudson-slave/workspace/Lucene-Solr-Tests-trunk-java7/solr/build/solr-core/test/J1/./org.apache.solr.cloud.BasicDistributedZk2Test-1348023180448/jetty4/index forceNew:false
[junit4:junit4]   2> 9105 T315 oasc.SolrDeletionPolicy.onCommit SolrDeletionPolicy.onCommit: commits:num=1
[junit4:junit4]   2> 		commit{dir=NRTCachingDirectory(org.apache.lucene.store.NIOFSDirectory@/usr/home/hudson/hudson-slave/workspace/Lucene-Solr-Tests-trunk-java7/solr/build/solr-core/test/J1/org.apache.solr.cloud.BasicDistributedZk2Test-1348023180448/jetty4/index lockFactory=org.apache.lucene.store.NativeFSLockFactory@ab9c1aa; maxCacheMB=48.0 maxMergeSizeMB=4.0),segFN=segments_1,generation=1,filenames=[segments_1]
[junit4:junit4]   2> 9106 T315 oasc.SolrDeletionPolicy.updateCommits newest commit = 1
[junit4:junit4]   2> 9107 T315 oasc.SolrCore.initWriters created xml: solr.XMLResponseWriter
[junit4:junit4]   2> 9109 T315 oasup.UpdateRequestProcessorChain.init inserting DistributedUpdateProcessorFactory into updateRequestProcessorChain "dedupe"
[junit4:junit4]   2> 9110 T315 oasup.UpdateRequestProcessorChain.init inserting DistributedUpdateProcessorFactory into updateRequestProcessorChain "dedupe-allfields"
[junit4:junit4]   2> 9110 T315 oasup.UpdateRequestProcessorChain.init inserting DistributedUpdateProcessorFactory into updateRequestProcessorChain "stored_sig"
[junit4:junit4]   2> 9110 T315 oasup.UpdateRequestProcessorChain.init inserting DistributedUpdateProcessorFactory into updateRequestProcessorChain "uniq-fields"
[junit4:junit4]   2> 9111 T315 oasup.UpdateRequestProcessorChain.init inserting DistributedUpdateProcessorFactory into updateRequestProcessorChain "distrib-dup-test-chain-implicit"
[junit4:junit4]   2> 9112 T315 oasc.RequestHandlers.initHandlersFromConfig adding lazy requestHandler: solr.ReplicationHandler
[junit4:junit4]   2> 9112 T315 oasc.RequestHandlers.initHandlersFromConfig created /replication: solr.ReplicationHandler
[junit4:junit4]   2> 9113 T315 oasc.RequestHandlers.initHandlersFromConfig created standard: solr.StandardRequestHandler
[junit4:junit4]   2> 9113 T315 oasc.RequestHandlers.initHandlersFromConfig created /get: solr.RealTimeGetHandler
[junit4:junit4]   2> 9114 T315 oasc.RequestHandlers.initHandlersFromConfig created dismax: solr.SearchHandler
[junit4:junit4]   2> 9115 T315 oasc.RequestHandlers.initHandlersFromConfig created mock: org.apache.solr.core.MockQuerySenderListenerReqHandler
[junit4:junit4]   2> 9115 T315 oasc.RequestHandlers.initHandlersFromConfig created /admin/: org.apache.solr.handler.admin.AdminHandlers
[junit4:junit4]   2> 9116 T315 oasc.RequestHandlers.initHandlersFromConfig created defaults: solr.StandardRequestHandler
[junit4:junit4]   2> 9116 T315 oasc.RequestHandlers.initHandlersFromConfig adding lazy requestHandler: solr.StandardRequestHandler
[junit4:junit4]   2> 9117 T315 oasc.RequestHandlers.initHandlersFromConfig created lazy: solr.StandardRequestHandler
[junit4:junit4]   2> 9117 T315 oasc.RequestHandlers.initHandlersFromConfig created /update: solr.UpdateRequestHandler
[junit4:junit4]   2> 9118 T315 oasc.RequestHandlers.initHandlersFromConfig created /terms: org.apache.solr.handler.component.SearchHandler
[junit4:junit4]   2> 9118 T315 oasc.RequestHandlers.initHandlersFromConfig created spellCheckCompRH: org.apache.solr.handler.component.SearchHandler
[junit4:junit4]   2> 9119 T315 oasc.RequestHandlers.initHandlersFromConfig created spellCheckCompRH_Direct: org.apache.solr.handler.component.SearchHandler
[junit4:junit4]   2> 9120 T315 oasc.RequestHandlers.initHandlersFromConfig created spellCheckWithWordbreak: org.apache.solr.handler.component.SearchHandler
[junit4:junit4]   2> 9120 T315 oasc.RequestHandlers.initHandlersFromConfig created spellCheckWithWordbreak_Direct: org.apache.solr.handler.component.SearchHandler
[junit4:junit4]   2> 9121 T315 oasc.RequestHandlers.initHandlersFromConfig created spellCheckCompRH1: org.apache.solr.handler.component.SearchHandler
[junit4:junit4]   2> 9121 T315 oasc.RequestHandlers.initHandlersFromConfig created tvrh: org.apache.solr.handler.component.SearchHandler
[junit4:junit4]   2> 9122 T315 oasc.RequestHandlers.initHandlersFromConfig created /mlt: solr.MoreLikeThisHandler
[junit4:junit4]   2> 9123 T315 oasc.RequestHandlers.initHandlersFromConfig created /debug/dump: solr.DumpRequestHandler
[junit4:junit4]   2> 9126 T315 oashl.XMLLoader.init xsltCacheLifetimeSeconds=60
[junit4:junit4]   2> 9130 T315 oasc.SolrCore.initDeprecatedSupport WARNING solrconfig.xml uses deprecated <admin/gettableFiles>, Please update your config to use the ShowFileRequestHandler.
[junit4:junit4]   2> 9132 T315 oasc.SolrCore.initDeprecatedSupport WARNING adding ShowFileRequestHandler with hidden files: [SCHEMA.XML, OLD_SYNONYMS.TXT, STOPWORDS.TXT, PROTWORDS.TXT, OPEN-EXCHANGE-RATES.JSON, SYNONYMS.TXT, CURRENCY.XML, MAPPING-ISOLATIN1ACCENT.TXT]
[junit4:junit4]   2> 9135 T315 oass.SolrIndexSearcher.<init> Opening Searcher@84ae522 main
[junit4:junit4]   2> 9137 T315 oasu.CommitTracker.<init> Hard AutoCommit: disabled
[junit4:junit4]   2> 9137 T315 oasu.CommitTracker.<init> Soft AutoCommit: disabled
[junit4:junit4]   2> 9138 T315 oashc.SpellCheckComponent.inform Initializing spell checkers
[junit4:junit4]   2> 9144 T315 oass.DirectSolrSpellChecker.init init: {name=direct,classname=DirectSolrSpellChecker,field=lowerfilt,minQueryLength=3}
[junit4:junit4]   2> 9197 T388 oasc.SolrCore.registerSearcher [collection1] Registered new searcher Searcher@84ae522 main{StandardDirectoryReader(segments_1:1)}
[junit4:junit4]   2> 9347 T336 oascc.ZkStateReader.updateClusterState Updating cloud state from ZooKeeper... 
[junit4:junit4]   2> 9361 T349 oascc.ZkStateReader$2.process A cluster state change has occurred - updating...
[junit4:junit4]   2> 9361 T361 oascc.ZkStateReader$2.process A cluster state change has occurred - updating...
[junit4:junit4]   2> 9361 T373 oascc.ZkStateReader$2.process A cluster state change has occurred - updating...
[junit4:junit4]   2> 9361 T335 oascc.ZkStateReader$2.process A cluster state change has occurred - updating...
[junit4:junit4]   2> 9361 T387 oascc.ZkStateReader$2.process A cluster state change has occurred - updating...
[junit4:junit4]   2> 9703 T315 oasc.CoreContainer.register registering core: collection1
[junit4:junit4]   2> 9704 T315 oasc.ZkController.register Register shard - core:collection1 address:http://127.0.0.1:12251/solr shardId:shard2
[junit4:junit4]   2> 9712 T315 oasc.ZkController.register We are http://127.0.0.1:12251/solr/collection1/ and leader is http://127.0.0.1:12245/solr/collection1/
[junit4:junit4]   2> 9713 T315 oasc.ZkController.register No LogReplay needed for core=collection1 baseURL=http://127.0.0.1:12251/solr
[junit4:junit4]   2> 9714 T315 oasc.ZkController.checkRecovery Core needs to recover:collection1
[junit4:junit4]   2> 9714 T315 oasu.DefaultSolrCoreState.doRecovery Running recovery - first canceling any ongoing recovery
[junit4:junit4]   2> ASYNC  NEW_CORE C44 name=collection1 org.apache.solr.core.SolrCore@5cdbf201 url=http://127.0.0.1:12251/solr/collection1 node=127.0.0.1:12251_solr
[junit4:junit4]   2> 9716 T389 C44 P12251 oasc.RecoveryStrategy.run Starting recovery process.  core=collection1 recoveringAfterStartup=true
[junit4:junit4]   2> 9716 T389 C44 P12251 oasc.RecoveryStrategy.doRecovery ###### startupVersions=[]
[junit4:junit4]   2> 9716 T315 oascc.ZkStateReader.updateClusterState Updating cloud state from ZooKeeper... 
[junit4:junit4]   2> 9718 T389 C44 P12251 oasc.RecoveryStrategy.doRecovery Attempting to PeerSync from http://127.0.0.1:12245/solr/collection1/ core=collection1 - recoveringAfterStartup=true
[junit4:junit4]   2> 9718 T389 C44 P12251 oasu.PeerSync.sync PeerSync: core=collection1 url=http://127.0.0.1:12251/solr START replicas=[http://127.0.0.1:12245/solr/collection1/] nUpdates=100
[junit4:junit4]   2> 9718 T315 oass.SolrDispatchFilter.init user.dir=/usr/home/hudson/hudson-slave/workspace/Lucene-Solr-Tests-trunk-java7/solr/build/solr-core/test/J1
[junit4:junit4]   2> 9719 T389 C44 P12251 oasu.PeerSync.sync WARNING no frame of reference to tell of we've missed updates
[junit4:junit4]   2> 9719 T315 oass.SolrDispatchFilter.init SolrDispatchFilter.init() done
[junit4:junit4]   2> 9720 T389 C44 P12251 oasc.RecoveryStrategy.doRecovery PeerSync Recovery was not successful - trying replication. core=collection1
[junit4:junit4]   2> 9969 T389 C44 P12251 oasc.RecoveryStrategy.doRecovery Starting Replication Recovery. core=collection1
[junit4:junit4]   2> 9969 T315 oascsi.HttpClientUtil.createClient Creating new http client, config:maxConnections=128&maxConnectionsPerHost=32&followRedirects=false
[junit4:junit4]   2> 9970 T389 C44 P12251 oascsi.HttpClientUtil.createClient Creating new http client, config:maxConnections=128&maxConnectionsPerHost=32&followRedirects=false
[junit4:junit4]   2> 9972 T336 oascc.ZkStateReader.updateClusterState Updating cloud state from ZooKeeper... 
[junit4:junit4]   2> ASYNC  NEW_CORE C45 name=collection1 org.apache.solr.core.SolrCore@2765e34f url=http://127.0.0.1:12245/solr/collection1 node=127.0.0.1:12245_solr
[junit4:junit4]   2> 9986 T353 C45 P12245 REQ /get {distrib=false&qt=/get&wt=javabin&version=2&getVersions=100} status=0 QTime=0 
[junit4:junit4]   2> 9988 T335 oascc.ZkStateReader$2.process A cluster state change has occurred - updating...
[junit4:junit4]   2> 9988 T361 oascc.ZkStateReader$2.process A cluster state change has occurred - updating...
[junit4:junit4]   2> 9988 T387 oascc.ZkStateReader$2.process A cluster state change has occurred - updating...
[junit4:junit4]   2> 9988 T373 oascc.ZkStateReader$2.process A cluster state change has occurred - updating...
[junit4:junit4]   2> 9988 T349 oascc.ZkStateReader$2.process A cluster state change has occurred - updating...
[junit4:junit4]   2> 10012 T315 oaz.ZooKeeper.<init> Initiating client connection, connectString=127.0.0.1:12233/solr sessionTimeout=10000 watcher=org.apache.solr.common.cloud.ConnectionManager@4b659b3a
[junit4:junit4]   2> 10013 T391 oaz.ClientCnxn$SendThread.startConnect Opening socket connection to server /127.0.0.1:12233
[junit4:junit4]   2> 10013 T315 oascc.ConnectionManager.waitForConnected Waiting for client to connect to ZooKeeper
[junit4:junit4]   2> 10014 T391 oaz.ClientCnxn$SendThread.primeConnection Socket connection established to localhost/127.0.0.1:12233, initiating session
[junit4:junit4]   2> 10014 T317 oazs.NIOServerCnxn$Factory.run Accepted socket connection from /140.211.11.196:12255
[junit4:junit4]   2> 10015 T317 oazs.NIOServerCnxn.readConnectRequest Client attempting to establish new session at /140.211.11.196:12255
[junit4:junit4]   2> 10017 T319 oazs.NIOServerCnxn.finishSessionInit Established session 0x139dc715ca60007 with negotiated timeout 10000 for client /140.211.11.196:12255
[junit4:junit4]   2> 10017 T391 oaz.ClientCnxn$SendThread.readConnectResult Session establishment complete on server localhost/127.0.0.1:12233, sessionid = 0x139dc715ca60007, negotiated timeout = 10000
[junit4:junit4]   2> 10017 T392 oascc.ConnectionManager.process Watcher org.apache.solr.common.cloud.ConnectionManager@4b659b3a name:ZooKeeperConnection Watcher:127.0.0.1:12233/solr got event WatchedEvent state:SyncConnected type:None path:null path:null type:None
[junit4:junit4]   2> 10017 T315 oascc.ConnectionManager.waitForConnected Client is connected to ZooKeeper
[junit4:junit4]   2> 10019 T315 oascc.ZkStateReader.createClusterStateWatchersAndUpdate Updating cluster state from ZooKeeper... 
[junit4:junit4]   2> 10023 T315 oasc.ChaosMonkey.monkeyLog monkey: init - expire sessions:true cause connection loss:true
[junit4:junit4]   2> 10024 T315 oascsi.HttpClientUtil.createClient Creating new http client, config:
[junit4:junit4]   2> 10038 T315 oascc.ZkStateReader.updateClusterState Updating cloud state from ZooKeeper... 
[junit4:junit4]   2> ASYNC  NEW_CORE C46 name=collection1 org.apache.solr.core.SolrCore@328d0078 url=http://127.0.0.1:12237/solr/collection1 node=127.0.0.1:12237_solr
[junit4:junit4]   2> 10056 T327 C46 P12237 oasc.SolrDeletionPolicy.onInit SolrDeletionPolicy.onInit: commits:num=1
[junit4:junit4]   2> 		commit{dir=NRTCachingDirectory(org.apache.lucene.store.NIOFSDirectory@/usr/home/hudson/hudson-slave/workspace/Lucene-Solr-Tests-trunk-java7/solr/build/solr-core/test/J1/org.apache.solr.cloud.BasicDistributedZk2Test-1348023180448/control/data/index lockFactory=org.apache.lucene.store.NativeFSLockFactory@194f0c82; maxCacheMB=48.0 maxMergeSizeMB=4.0),segFN=segments_1,generation=1,filenames=[segments_1]
[junit4:junit4]   2> 10057 T327 C46 P12237 oasc.SolrDeletionPolicy.updateCommits newest commit = 1
[junit4:junit4]   2> 10066 T327 C46 P12237 /update {wt=javabin&version=2} {add=[1 (1413504764994387968)]} 0 16
[junit4:junit4]   2> 10067 T315 oaz.ZooKeeper.<init> Initiating client connection, connectString=127.0.0.1:12233/solr sessionTimeout=10000 watcher=org.apache.solr.common.cloud.ConnectionManager@4de598de
[junit4:junit4]   2> 10069 T393 oaz.ClientCnxn$SendThread.startConnect Opening socket connection to server /127.0.0.1:12233
[junit4:junit4]   2> 10069 T315 oascc.ConnectionManager.waitForConnected Waiting for client to connect to ZooKeeper
[junit4:junit4]   2> 10070 T393 oaz.ClientCnxn$SendThread.primeConnection Socket connection established to localhost/127.0.0.1:12233, initiating session
[junit4:junit4]   2> 10070 T317 oazs.NIOServerCnxn$Factory.run Accepted socket connection from /140.211.11.196:12257
[junit4:junit4]   2> 10070 T317 oazs.NIOServerCnxn.readConnectRequest Client attempting to establish new session at /140.211.11.196:12257
[junit4:junit4]   2> 10072 T319 oazs.NIOServerCnxn.finishSessionInit Established session 0x139dc715ca60008 with negotiated timeout 10000 for client /140.211.11.196:12257
[junit4:junit4]   2> 10072 T393 oaz.ClientCnxn$SendThread.readConnectResult Session establishment complete on server localhost/127.0.0.1:12233, sessionid = 0x139dc715ca60008, negotiated timeout = 10000
[junit4:junit4]   2> 10073 T394 oascc.ConnectionManager.process Watcher org.apache.solr.common.cloud.ConnectionManager@4de598de name:ZooKeeperConnection Watcher:127.0.0.1:12233/solr got event WatchedEvent state:SyncConnected type:None path:null path:null type:None
[junit4:junit4]   2> 10073 T315 oascc.ConnectionManager.waitForConnected Client is connected to ZooKeeper
[junit4:junit4]   2> 10074 T315 oascc.ZkStateReader.createClusterStateWatchersAndUpdate Updating cluster state from ZooKeeper... 
[junit4:junit4]   2> 10095 T343 C43 P12242 oasc.SolrDeletionPolicy.onInit SolrDeletionPolicy.onInit: commits:num=1
[junit4:junit4]   2> 		commit{dir=NRTCachingDirectory(org.apache.lucene.store.NIOFSDirectory@/usr/home/hudson/hudson-slave/workspace/Lucene-Solr-Tests-trunk-java7/solr/build/solr-core/test/J1/org.apache.solr.cloud.BasicDistributedZk2Test-1348023180448/jetty1/index lockFactory=org.apache.lucene.store.NativeFSLockFactory@41356519; maxCacheMB=48.0 maxMergeSizeMB=4.0),segFN=segments_1,generation=1,filenames=[segments_1]
[junit4:junit4]   2> 10096 T343 C43 P12242 oasc.SolrDeletionPolicy.updateCommits newest commit = 1
[junit4:junit4]   2>  C42_STATE=coll:collection1 core:collection1 props:{shard=shard1, roles=null, state=recovering, core=collection1, collection=collection1, node_name=127.0.0.1:12247_solr, base_url=http://127.0.0.1:12247/solr}
[junit4:junit4]   2> 10154 T365 C42 P12247 oasc.SolrDeletionPolicy.onInit SolrDeletionPolicy.onInit: commits:num=1
[junit4:junit4]   2> 		commit{dir=NRTCachingDirectory(org.apache.lucene.store.NIOFSDirectory@/usr/home/hudson/hudson-slave/workspace/Lucene-Solr-Tests-trunk-java7/solr/build/solr-core/test/J1/org.apache.solr.cloud.BasicDistributedZk2Test-1348023180448/jetty3/index lockFactory=org.apache.lucene.store.NativeFSLockFactory@2409d07; maxCacheMB=48.0 maxMergeSizeMB=4.0),segFN=segments_1,generation=1,filenames=[segments_1]
[junit4:junit4]   2> 10155 T365 C42 P12247 oasc.SolrDeletionPolicy.updateCommits newest commit = 1
[junit4:junit4]   2> 10163 T365 C42 P12247 REQ /update {distrib.from=http://127.0.0.1:12242/solr/collection1/&update.distrib=FROMLEADER&wt=javabin&version=2} status=0 QTime=14 
[junit4:junit4]   2> 10164 T343 C43 P12242 /update {wt=javabin&version=2} {add=[1 (1413504765035282432)]} 0 84
[junit4:junit4]   2> 10165 T315 oasc.AbstractDistribZkTestBase.waitForRecoveriesToFinish Wait for recoveries to finish - collection: collection1 failOnTimeout:true timeout (sec):1800
[junit4:junit4]   2> 10166 T315 oascc.ZkStateReader.updateClusterState Updating cloud state from ZooKeeper... 
[junit4:junit4]   2> 11004 T375 C42 P12247 oasc.RecoveryStrategy.doRecovery Begin buffering updates. core=collection1
[junit4:junit4]   2> 11004 T375 C42 P12247 oasu.UpdateLog.bufferUpdates Starting to buffer updates. FSUpdateLog{state=ACTIVE, tlog=tlog{file=./org.apache.solr.cloud.BasicDistributedZk2Test-1348023180448/jetty3/tlog/tlog.0000000000000000000 refcount=1}}
[junit4:junit4]   2> 11005 T375 C42 P12247 oasc.RecoveryStrategy.replicate Attempting to replicate from http://127.0.0.1:12242/solr/collection1/. core=collection1
[junit4:junit4]   2> 11005 T375 C42 P12247 oascsi.HttpClientUtil.createClient Creating new http client, config:maxConnections=128&maxConnectionsPerHost=32&followRedirects=false
[junit4:junit4]   2> 11022 T344 C43 P12242 oasu.DirectUpdateHandler2.commit start commit{flags=0,_version_=0,optimize=false,openSearcher=true,waitSearcher=true,expungeDeletes=false,softCommit=false}
[junit4:junit4]   2> 11159 T344 C43 P12242 oasc.SolrDeletionPolicy.onCommit SolrDeletionPolicy.onCommit: commits:num=2
[junit4:junit4]   2> 		commit{dir=NRTCachingDirectory(org.apache.lucene.store.NIOFSDirectory@/usr/home/hudson/hudson-slave/workspace/Lucene-Solr-Tests-trunk-java7/solr/build/solr-core/test/J1/org.apache.solr.cloud.BasicDistributedZk2Test-1348023180448/jetty1/index lockFactory=org.apache.lucene.store.NativeFSLockFactory@41356519; maxCacheMB=48.0 maxMergeSizeMB=4.0),segFN=segments_1,generation=1,filenames=[segments_1]
[junit4:junit4]   2> 		commit{dir=NRTCachingDirectory(org.apache.lucene.store.NIOFSDirectory@/usr/home/hudson/hudson-slave/workspace/Lucene-Solr-Tests-trunk-java7/solr/build/solr-core/test/J1/org.apache.solr.cloud.BasicDistributedZk2Test-1348023180448/jetty1/index lockFactory=org.apache.lucene.store.NativeFSLockFactory@41356519; maxCacheMB=48.0 maxMergeSizeMB=4.0),segFN=segments_2,generation=2,filenames=[_0_Block_0.tip, _0_Block_0.pos, _0_MockSep_0.pos, _0_Block_0.tim, _0_Pulsing40_0.prx, _0_Pulsing40_0.frq, _0_Lucene40WithOrds_0.tii, _0_Lucene40WithOrds_0.frq, _0_MockSep_0.skp, _0_Pulsing40_0.tip, _0_MockSep_0.doc, _0.si, _0_Lucene40WithOrds_0.tib, _0.fnm, _0_Pulsing40_0.tim, _0_Block_0.doc, _0_nrm.cfs, _0_MockSep_0.tib, _0_nrm.cfe, segments_2, _0_MockSep_0.frq, _0.fdx, _0_MockSep_0.tii, _0_Lucene40WithOrds_0.prx, _0_MockSep_0.pyl, _0.fdt]
[junit4:junit4]   2> 11160 T344 C43 P12242 oasc.SolrDeletionPolicy.updateCommits newest commit = 2
[junit4:junit4]   2> 11169 T315 oascc.ZkStateReader.updateClusterState Updating cloud state from ZooKeeper... 
[junit4:junit4]   2> 11174 T344 C43 P12242 oass.SolrIndexSearcher.<init> Opening Searcher@29c7baf8 main
[junit4:junit4]   2> 11175 T344 C43 P12242 oasu.DirectUpdateHandler2.commit end_commit_flush
[junit4:junit4]   2> 11177 T350 oasc.SolrCore.registerSearcher [collection1] Registered new searcher Searcher@29c7baf8 main{StandardDirectoryReader(segments_2:3 _0(5.0):C1)}
[junit4:junit4]   2> 11178 T344 C43 P12242 /update {waitSearcher=true&commit=true&commit_end_point=true&wt=javabin&softCommit=false&version=2} {commit=} 0 156
[junit4:junit4]   2> 11199 T375 C42 P12247 oash.ReplicationHandler.inform Commits will be reserved for  10000
[junit4:junit4]   2> 11200 T375 C42 P12247 oascsi.HttpClientUtil.createClient Creating new http client, config:connTimeout=5000&socketTimeout=20000&allowCompression=false&maxConnections=10000&maxConnectionsPerHost=10000
[junit4:junit4]   2> 11226 T375 C42 P12247 oash.SnapPuller.<init>  No value set for 'pollInterval'. Timer Task not started.
[junit4:junit4]   2> 11230 T345 C43 P12242 oash.ReplicationHandler.inform Commits will be reserved for  10000
[junit4:junit4]   2> 11230 T345 C43 P12242 REQ /replication {command=indexversion&wt=javabin&qt=/replication&version=2} status=0 QTime=1 
[junit4:junit4]   2> 11232 T375 C42 P12247 oash.SnapPuller.fetchLatestIndex Master's generation: 2
[junit4:junit4]   2> 11232 T375 C42 P12247 oash.SnapPuller.fetchLatestIndex Slave's generation: 1
[junit4:junit4]   2> 11232 T375 C42 P12247 oash.SnapPuller.fetchLatestIndex Starting replication process
[junit4:junit4]   2> 11238 T345 C43 P12242 REQ /replication {command=filelist&generation=2&wt=javabin&qt=/replication&version=2} status=0 QTime=3 
[junit4:junit4]   2> 11240 T375 C42 P12247 oash.SnapPuller.fetchLatestIndex Number of files in latest index in master: 26
[junit4:junit4]   2> 11245 T375 C42 P12247 oash.SnapPuller.fetchLatestIndex Starting download to ./org.apache.solr.cloud.BasicDistributedZk2Test-1348023180448/jetty3/index.20120918215311682 fullCopy=true
[junit4:junit4]   2> 11249 T345 C43 P12242 REQ /replication {file=_0_Block_0.pos&command=filecontent&checksum=true&generation=2&qt=/replication&wt=filestream} status=0 QTime=0 
[junit4:junit4]   2> 11265 T345 C43 P12242 REQ /replication {file=_0_Block_0.tip&command=filecontent&checksum=true&generation=2&qt=/replication&wt=filestream} status=0 QTime=0 
[junit4:junit4]   2> 11270 T345 C43 P12242 REQ /replication {file=_0_MockSep_0.pos&command=filecontent&checksum=true&generation=2&qt=/replication&wt=filestream} status=0 QTime=0 
[junit4:junit4]   2> 11274 T345 C43 P12242 REQ /replication {file=_0_Block_0.tim&command=filecontent&checksum=true&generation=2&qt=/replication&wt=filestream} status=0 QTime=0 
[junit4:junit4]   2> 11279 T345 C43 P12242 REQ /replication {file=_0_Pulsing40_0.prx&command=filecontent&checksum=true&generation=2&qt=/replication&wt=filestream} status=0 QTime=0 
[junit4:junit4]   2> 11284 T345 C43 P12242 REQ /replication {file=_0_Pulsing40_0.frq&command=filecontent&checksum=true&generation=2&qt=/replication&wt=filestream} status=0 QTime=0 
[junit4:junit4]   2> 11302 T345 C43 P12242 REQ /replication {file=_0_Lucene40WithOrds_0.tii&command=filecontent&checksum=true&generation=2&qt=/replication&wt=filestream} status=0 QTime=1 
[junit4:junit4]   2> 11307 T345 C43 P12242 REQ /replication {file=_0_Lucene40WithOrds_0.frq&command=filecontent&checksum=true&generation=2&qt=/replication&wt=filestream} status=0 QTime=0 
[junit4:junit4]   2> 11312 T345 C43 P12242 REQ /replication {file=_0_MockSep_0.skp&command=filecontent&checksum=true&generation=2&qt=/replication&wt=filestream} status=0 QTime=0 
[junit4:junit4]   2> 11314 T375 C42 P12247 oash.SnapPuller$FileFetcher.fetchPackets WARNING No content recieved for file: {name=_0_MockSep_0.skp, lastmodified=1348023191000, size=0}
[junit4:junit4]   2> 11326 T345 C43 P12242 REQ /replication {file=_0_Pulsing40_0.tip&command=filecontent&checksum=true&generation=2&qt=/replication&wt=filestream} status=0 QTime=1 
[junit4:junit4]   2> 11331 T345 C43 P12242 REQ /replication {file=_0.si&command=filecontent&checksum=true&generation=2&qt=/replication&wt=filestream} status=0 QTime=0 
[junit4:junit4]   2> 11348 T345 C43 P12242 REQ /replication {file=_0_MockSep_0.doc&command=filecontent&checksum=true&generation=2&qt=/replication&wt=filestream} status=0 QTime=1 
[junit4:junit4]   2> 11354 T345 C43 P12242 REQ /replication {file=_0_Lucene40WithOrds_0.tib&command=filecontent&checksum=true&generation=2&qt=/replication&wt=filestream} status=0 QTime=1 
[junit4:junit4]   2> 11360 T345 C43 P12242 REQ /replication {file=_0_Block_0.doc&command=filecontent&checksum=true&generation=2&qt=/replication&wt=filestream} status=0 QTime=0 
[junit4:junit4]   2> 11365 T345 C43 P12242 REQ /replication {file=_0_Pulsing40_0.tim&command=filecontent&checksum=true&generation=2&qt=/replication&wt=filestream} status=0 QTime=1 
[junit4:junit4]   2> 11370 T345 C43 P12242 REQ /replication {file=_0.fnm&command=filecontent&checksum=true&generation=2&qt=/replication&wt=filestream} status=0 QTime=0 
[junit4:junit4]   2> 11387 T345 C43 P12242 REQ /replication {file=_0_nrm.cfs&command=filecontent&checksum=true&generation=2&qt=/replication&wt=filestream} status=0 QTime=1 
[junit4:junit4]   2> 11393 T345 C43 P12242 REQ /replication {file=_0_MockSep_0.tib&command=filecontent&checksum=true&generation=2&qt=/replication&wt=filestream} status=0 QTime=0 
[junit4:junit4]   2> 11408 T345 C43 P12242 REQ /replication {file=_0_nrm.cfe&command=filecontent&checksum=true&generation=2&qt=/replication&wt=filestream} status=0 QTime=0 
[junit4:junit4]   2> 11414 T345 C43 P12242 REQ /replication {file=_0_MockSep_0.frq&command=filecontent&checksum=true&generation=2&qt=/replication&wt=filestream} status=0 QTime=1 
[junit4:junit4]   2> 11420 T345 C43 P12242 REQ /replication {file=segments_2&command=filecontent&checksum=true&generation=2&qt=/replication&wt=filestream} status=0 QTime=0 
[junit4:junit4]   2> 11424 T345 C43 P12242 REQ /replication {file=_0.fdx&command=filecontent&checksum=true&generation=2&qt=/replication&wt=filestream} status=0 QTime=0 
[junit4:junit4]   2> 11429 T345 C43 P12242 REQ /replication {file=_0_Lucene40WithOrds_0.prx&command=filecontent&checksum=true&generation=2&qt=/replication&wt=filestream} status=0 QTime=0 
[junit4:junit4]   2> 11446 T345 C43 P12242 REQ /replication {file=_0_MockSep_0.tii&command=filecontent&checksum=true&generation=2&qt=/replication&wt=filestream} status=0 QTime=0 
[junit4:junit4]   2> 11451 T345 C43 P12242 REQ /replication {file=_0_MockSep_0.pyl&command=filecontent&checksum=true&generation=2&qt=/replication&wt=filestream} status=0 QTime=0 
[junit4:junit4]   2> 11464 T375 C42 P12247 oash.SnapPuller$FileFetcher.fetchPackets WARNING No content recieved for file: {name=_0_MockSep_0.pyl, lastmodified=1348023191000, size=0}
[junit4:junit4]   2> 11468 T345 C43 P12242 REQ /replication {file=_0.fdt&command=filecontent&checksum=true&generation=2&qt=/replication&wt=filestream} status=0 QTime=0 
[junit4:junit4]   2> 11470 T375 C42 P12247 oash.SnapPuller.fetchLatestIndex Total time taken for download : 0 secs
[junit4:junit4]   2> 11471 T375 C42 P12247 oash.SnapPuller.modifyIndexProps New index installed. Updating index properties... index=index.20120918215311682
[junit4:junit4]   2> 11477 T375 C42 P12247 oasu.DefaultSolrCoreState.newIndexWriter Creating new IndexWriter...
[junit4:junit4]   2> 11478 T375 C42 P12247 oasu.DefaultSolrCoreState.newIndexWriter Waiting until IndexWriter is unused... core=collection1
[junit4:junit4]   2> 11478 T375 C42 P12247 oasu.DefaultSolrCoreState.newIndexWriter Rollback old IndexWriter... core=collection1
[junit4:junit4]   2> 11482 T375 C42 P12247 oasc.SolrCore.getNewIndexDir WARNING New index directory detected: old=./org.apache.solr.cloud.BasicDistributedZk2Test-1348023180448/jetty3/index/ new=./org.apache.solr.cloud.BasicDistributedZk2Test-1348023180448/jetty3/index.20120918215311682
[junit4:junit4]   2> 11483 T375 C42 P12247 oasc.CachingDirectoryFactory.get return new directory for /usr/home/hudson/hudson-slave/workspace/Lucene-Solr-Tests-trunk-java7/solr/build/solr-core/test/J1/./org.apache.solr.cloud.BasicDistributedZk2Test-1348023180448/jetty3/index.20120918215311682 forceNew:true
[junit4:junit4]   2> 11491 T375 C42 P12247 oasc.SolrDeletionPolicy.onInit SolrDeletionPolicy.onInit: commits:num=1
[junit4:junit4]   2> 		commit{dir=NRTCachingDirectory(org.apache.lucene.store.NIOFSDirectory@/usr/home/hudson/hudson-slave/workspace/Lucene-Solr-Tests-trunk-java7/solr/build/solr-core/test/J1/org.apache.solr.cloud.BasicDistributedZk2Test-1348023180448/jetty3/index.20120918215311682 lockFactory=org.apache.lucene.store.NativeFSLockFactory@d48a33e; maxCacheMB=48.0 maxMergeSizeMB=4.0),segFN=segments_2,generation=2,filenames=[_0_Block_0.tip, _0_Block_0.pos, _0_MockSep_0.pos, _0_Block_0.tim, _0_Pulsing40_0.prx, _0_Pulsing40_0.frq, _0_Lucene40WithOrds_0.tii, _0_Lucene40WithOrds_0.frq, _0_MockSep_0.skp, _0_Pulsing40_0.tip, _0_MockSep_0.doc, _0.si, _0_Lucene40WithOrds_0.tib, _0_Block_0.doc, _0_Pulsing40_0.tim, _0.fnm, _0_nrm.cfs, _0_MockSep_0.tib, _0_nrm.cfe, segments_2, _0_MockSep_0.frq, _0.fdx, _0_Lucene40WithOrds_0.prx, _0_MockSep_0.tii, _0_MockSep_0.pyl, _0.fdt]
[junit4:junit4]   2> 11492 T375 C42 P12247 oasc.SolrDeletionPolicy.updateCommits newest commit = 2
[junit4:junit4]   2> 11492 T375 C42 P12247 oasu.DefaultSolrCoreState.newIndexWriter New IndexWriter is ready to be used.
[junit4:junit4]   2> 11498 T375 C42 P12247 oass.SolrIndexSearcher.<init> Opening Searcher@6cf9ce8d main
[junit4:junit4]   2> 11508 T374 oasc.SolrCore.registerSearcher [collection1] Registered new searcher Searcher@6cf9ce8d main{StandardDirectoryReader(segments_2:3:nrt _0(5.0):C1)}
[junit4:junit4]   2> 11509 T374 oasc.CachingDirectoryFactory.close Closing directory:/usr/home/hudson/hudson-slave/workspace/Lucene-Solr-Tests-trunk-java7/solr/build/solr-core/test/J1/./org.apache.solr.cloud.BasicDistributedZk2Test-1348023180448/jetty3/index
[junit4:junit4]   2> 11509 T374 oash.SnapPuller$2.onClose removing old index directory ./org.apache.solr.cloud.BasicDistributedZk2Test-1348023180448/jetty3/index
[junit4:junit4]   2> 11512 T375 C42 P12247 oasu.DirectUpdateHandler2.commit start commit{flags=0,_version_=0,optimize=false,openSearcher=false,waitSearcher=false,expungeDeletes=false,softCommit=false}
[junit4:junit4]   2> 11513 T375 C42 P12247 oasu.DirectUpdateHandler2.commit end_commit_flush
[junit4:junit4]   2> 11513 T375 C42 P12247 oasc.RecoveryStrategy.replay Replaying buffered documents. core=collection1
[junit4:junit4]   2> 11514 T397 C42 P12247 oasu.UpdateLog$LogReplayer.doReplay WARNING Starting log replay tlog{file=./org.apache.solr.cloud.BasicDistributedZk2Test-1348023180448/jetty3/tlog/tlog.0000000000000000000 refcount=2} active=true starting pos=433
[junit4:junit4]   2> 11514 T397 C42 P12247 oasu.DirectUpdateHandler2.commit start commit{flags=2,_version_=0,optimize=false,openSearcher=true,waitSearcher=true,expungeDeletes=false,softCommit=false}
[junit4:junit4]   2> 11515 T397 C42 P12247 oass.SolrIndexSearcher.<init> Opening Searcher@54f4787e main
[junit4:junit4]   2> 11516 T397 C42 P12247 oasu.DirectUpdateHandler2.commit end_commit_flush
[junit4:junit4]   2> 11518 T374 oasc.SolrCore.registerSearcher [collection1] Registered new searcher Searcher@54f4787e main{StandardDirectoryReader(segments_2:3:nrt _0(5.0):C1)}
[junit4:junit4]   2> 11518 T397 C42 P12247 oasu.UpdateLog$LogReplayer.run WARNING Log replay finished. recoveryInfo=RecoveryInfo{adds=0 deletes=0 deleteByQuery=0 errors=0 positionOfStart=433}
[junit4:junit4]   2> 11519 T375 C42 P12247 oasc.RecoveryStrategy.doRecovery Replication Recovery was successful - registering as Active. core=collection1
[junit4:junit4]   2> 11520 T375 C42 P12247 oasc.RecoveryStrategy.doRecovery Finished recovery process. core=collection1
[junit4:junit4]   2>  C44_STATE=coll:collection1 core:collection1 props:{shard=shard2, roles=null, state=recovering, core=collection1, collection=collection1, node_name=127.0.0.1:12251_solr, base_url=http://127.0.0.1:12251/solr}
[junit4:junit4]   2> 12010 T389 C44 P12251 oasc.RecoveryStrategy.doRecovery Begin buffering updates. core=collection1
[junit4:junit4]   2> 12010 T389 C44 P12251 oasu.UpdateLog.bufferUpdates Starting to buffer updates. FSUpdateLog{state=ACTIVE, tlog=null}
[junit4:junit4]   2> 12011 T389 C44 P12251 oasc.RecoveryStrategy.replicate Attempting to replicate from http://127.0.0.1:12245/solr/collection1/. core=collection1
[junit4:junit4]   2> 12011 T389 C44 P12251 oascsi.HttpClientUtil.createClient Creating new http client, config:maxConnections=128&maxConnectionsPerHost=32&followRedirects=false
[junit4:junit4]   2> 12012 T336 oascc.ZkStateReader.updateClusterState Updating cloud state from ZooKeeper... 
[junit4:junit4]   2> 12059 T355 C45 P12245 oasu.DirectUpdateHandler2.commit start commit{flags=0,_version_=0,optimize=false,openSearcher=true,waitSearcher=true,expungeDeletes=false,softCommit=false}
[junit4:junit4]   2> 12064 T355 C45 P12245 oasc.SolrDeletionPolicy.onInit SolrDeletionPolicy.onInit: commits:num=1
[junit4:junit4]   2> 		commit{dir=NRTCachingDirectory(org.apache.lucene.store.NIOFSDirectory@/usr/home/hudson/hudson-slave/workspace/Lucene-Solr-Tests-trunk-java7/solr/build/solr-core/test/J1/org.apache.solr.cloud.BasicDistributedZk2Test-1348023180448/jetty2/index lockFactory=org.apache.lucene.store.NativeFSLockFactory@6c4be3c7; maxCacheMB=48.0 maxMergeSizeMB=4.0),segFN=segments_1,generation=1,filenames=[segments_1]
[junit4:junit4]   2> 12065 T355 C45 P12245 oasc.SolrDeletionPolicy.updateCommits newest commit = 1
[junit4:junit4]   2> 12066 T355 C45 P12245 oass.SolrIndexSearcher.<init> Opening Searcher@5e88fa9f main
[junit4:junit4]   2> 12067 T355 C45 P12245 oasu.DirectUpdateHandler2.commit end_commit_flush
[junit4:junit4]   2> 12069 T362 oasc.SolrCore.registerSearcher [collection1] Registered new searcher Searcher@5e88fa9f main{StandardDirectoryReader(segments_1:1)}
[junit4:junit4]   2> 12070 T355 C45 P12245 /update {waitSearcher=true&commit=true&commit_end_point=true&wt=javabin&softCommit=false&version=2} {commit=} 0 11
[junit4:junit4]   2> 12071 T389 C44 P12251 oash.ReplicationHandler.inform Commits will be reserved for  10000
[junit4:junit4]   2> 12072 T389 C44 P12251 oash.SnapPuller.<init>  No value set for 'pollInterval'. Timer Task not started.
[junit4:junit4]   2> 12074 T356 C45 P12245 oash.ReplicationHandler.inform Commits will be reserved for  10000
[junit4:junit4]   2> 12074 T356 C45 P12245 REQ /replication {command=indexversion&wt=javabin&qt=/replication&version=2} status=0 QTime=1 
[junit4:junit4]   2> 12078 T389 C44 P12251 oasc.SolrDeletionPolicy.onInit SolrDeletionPolicy.onInit: commits:num=1
[junit4:junit4]   2> 		commit{dir=NRTCachingDirectory(org.apache.lucene.store.NIOFSDirectory@/usr/home/hudson/hudson-slave/workspace/Lucene-Solr-Tests-trunk-java7/solr/build/solr-core/test/J1/org.apache.solr.cloud.BasicDistributedZk2Test-1348023180448/jetty4/index lockFactory=org.apache.lucene.store.NativeFSLockFactory@ab9c1aa; maxCacheMB=48.0 maxMergeSizeMB=4.0),segFN=segments_1,generation=1,filenames=[segments_1]
[junit4:junit4]   2> 12079 T389 C44 P12251 oasc.SolrDeletionPolicy.updateCommits newest commit = 1
[junit4:junit4]   2> 12080 T389 C44 P12251 oasu.DirectUpdateHandler2.commit start commit{flags=0,_version_=0,optimize=false,openSearcher=true,waitSearcher=true,expungeDeletes=false,softCommit=false}
[junit4:junit4]   2> 12087 T389 C44 P12251 oasc.SolrDeletionPolicy.onCommit SolrDeletionPolicy.onCommit: commits:num=2
[junit4:junit4]   2> 		commit{dir=NRTCachingDirectory(org.apache.lucene.store.NIOFSDirectory@/usr/home/hudson/hudson-slave/workspace/Lucene-Solr-Tests-trunk-java7/solr/build/solr-core/test/J1/org.apache.solr.cloud.BasicDistributedZk2Test-1348023180448/jetty4/index lockFactory=org.apache.lucene.store.NativeFSLockFactory@ab9c1aa; maxCacheMB=48.0 maxMergeSizeMB=4.0),segFN=segments_1,generation=1,filenames=[segments_1]
[junit4:junit4]   2> 		commit{dir=NRTCachingDirectory(org.apache.lucene.store.NIOFSDirectory@/usr/home/hudson/hudson-slave/workspace/Lucene-Solr-Tests-trunk-java7/solr/build/solr-core/test/J1/org.apache.solr.cloud.BasicDistributedZk2Test-1348023180448/jetty4/index lockFactory=org.apache.lucene.store.NativeFSLockFactory@ab9c1aa; maxCacheMB=48.0 maxMergeSizeMB=4.0),segFN=segments_2,generation=2,filenames=[segments_2]
[junit4:junit4]   2> 12087 T389 C44 P12251 oasc.SolrDeletionPolicy.updateCommits newest commit = 2
[junit4:junit4]   2> 12090 T389 C44 P12251 oass.SolrIndexSearcher.<init> Opening Searcher@4d969b9 main
[junit4:junit4]   2> 12090 T389 C44 P12251 oasu.DirectUpdateHandler2.commit end_commit_flush
[junit4:junit4]   2> 12092 T388 oasc.SolrCore.registerSearcher [collection1] Registered new searcher Searcher@4d969b9 main{StandardDirectoryReader(segments_2:2)}
[junit4:junit4]   2> 12093 T389 C44 P12251 oasc.RecoveryStrategy.replay No replay needed. core=collection1
[junit4:junit4]   2> 12093 T389 C44 P12251 oasc.RecoveryStrategy.doRecovery Replication Recovery was successful - registering as Active. core=collection1
[junit4:junit4]   2> 12099 T387 oascc.ZkStateReader$2.process A cluster state change has occurred - updating...
[junit4:junit4]   2> 12099 T335 oascc.ZkStateReader$2.process A cluster state change has occurred - updating...
[junit4:junit4]   2> 12099 T392 oascc.ZkStateReader$2.process A cluster state change has occurred - updating...
[junit4:junit4]   2> 12099 T373 oascc.ZkStateReader$2.process A cluster state change has occurred - updating...
[junit4:junit4]   2> 12099 T361 oascc.ZkStateReader$2.process A cluster state change has occurred - updating...
[junit4:junit4]   2> 12099 T349 oascc.ZkStateReader$2.process A cluster state change has occurred - updating...
[junit4:junit4]   2> 12099 T394 oascc.ZkStateReader$2.process A cluster state change has occurred - updating...
[junit4:junit4]   2> 12101 T389 C44 P12251 oasc.RecoveryStrategy.doRecovery Finished recovery process. core=collection1
[junit4:junit4]   2> 12172 T315 oascc.ZkStateReader.updateClusterState Updating cloud state from ZooKeeper... 
[junit4:junit4]   2> 12608 T336 oascc.ZkStateReader.updateClusterState Updating cloud state from ZooKeeper... 
[junit4:junit4]   2> 12648 T387 oascc.ZkStateReader$2.process A cluster state change has occurred - updating...
[junit4:junit4]   2> 12648 T349 oascc.ZkStateReader$2.process A cluster state change has occurred - updating...
[junit4:junit4]   2> 12648 T394 oascc.ZkStateReader$2.process A cluster state change has occurred - updating...
[junit4:junit4]   2> 12648 T361 oascc.ZkStateReader$2.process A cluster state change has occurred - updating...
[junit4:junit4]   2> 12648 T373 oascc.ZkStateReader$2.process A cluster state change has occurred - updating...
[junit4:junit4]   2> 12648 T392 oascc.ZkStateReader$2.process A cluster state change has occurred - updating...
[junit4:junit4]   2> 12648 T335 oascc.ZkStateReader$2.process A cluster state change has occurred - updating...
[junit4:junit4]   2> 13175 T315 oascc.ZkStateReader.updateClusterState Updating cloud state from ZooKeeper... 
[junit4:junit4]   2> 13180 T327 C46 P12237 oasu.DirectUpdateHandler2.commit start commit{flags=0,_version_=0,optimize=false,openSearcher=true,waitSearcher=true,expungeDeletes=false,softCommit=false}
[junit4:junit4]   2> 13310 T327 C46 P12237 oasc.SolrDeletionPolicy.onCommit SolrDeletionPolicy.onCommit: commits:num=2
[junit4:junit4]   2> 		commit{dir=NRTCachingDirectory(org.apache.lucene.store.NIOFSDirectory@/usr/home/hudson/hudson-slave/workspace/Lucene-Solr-Tests-trunk-java7/solr/build/solr-core/test/J1/org.apache.solr.cloud.BasicDistributedZk2Test-1348023180448/control/data/index lockFactory=org.apache.lucene.store.NativeFSLockFactory@194f0c82; maxCacheMB=48.0 maxMergeSizeMB=4.0),segFN=segments_1,generation=1,filenames=[segments_1]
[junit4:junit4]   2> 		commit{dir=NRTCachingDirectory(org.apache.lucene.store.NIOFSDirectory@/usr/home/hudson/hudson-slave/workspace/Lucene-Solr-Tests-trunk-java7/solr/build/solr-core/test/J1/org.apache.solr.cloud.BasicDistributedZk2Test-1348023180448/control/data/index lockFactory=org.apache.lucene.store.NativeFSLockFactory@194f0c82; maxCacheMB=48.0 maxMergeSizeMB=4.0),segFN=segments_2,generation=2,filenames=[_0_Block_0.tip, _0_Block_0.pos, _0_MockSep_0.pos, _0_Block_0.tim, _0_Pulsing40_0.prx, _0_Pulsing40_0.frq, _0_Lucene40WithOrds_0.tii, _0_Lucene40WithOrds_0.frq, _0_MockSep_0.skp, _0_Pulsing40_0.tip, _0_MockSep_0.doc, _0.si, _0_Lucene40WithOrds_0.tib, _0.fnm, _0_Pulsing40_0.tim, _0_Block_0.doc, _0_nrm.cfs, _0_MockSep_0.tib, _0_nrm.cfe, segments_2, _0_MockSep_0.frq, _0.fdx, _0_MockSep_0.tii, _0_Lucene40WithOrds_0.prx, _0_MockSep_0.pyl, _0.fdt]
[junit4:junit4]   2> 13311 T327 C46 P12237 oasc.SolrDeletionPolicy.updateCommits newest commit = 2
[junit4:junit4]   2> 13333 T327 C46 P12237 oass.SolrIndexSearcher.<init> Opening Searcher@6b8e68ca main
[junit4:junit4]   2> 13334 T327 C46 P12237 oasu.DirectUpdateHandler2.commit end_commit_flush
[junit4:junit4]   2> 13336 T338 oasc.SolrCore.registerSearcher [collection1] Registered new searcher Searcher@6b8e68ca main{StandardDirectoryReader(segments_2:3 _0(5.0):C1)}
[junit4:junit4]   2> 13337 T327 C46 P12237 /update {waitSearcher=true&wt=javabin&commit=true&softCommit=false&version=2} {commit=} 0 157
[junit4:junit4]   2> 13341 T343 C43 P12242 oasu.DirectUpdateHandler2.commit start commit{flags=0,_version_=0,optimize=false,openSearcher=true,waitSearcher=true,expungeDeletes=false,softCommit=false}
[junit4:junit4]   2> 13352 T343 C43 P12242 oass.SolrIndexSearcher.<init> Opening Searcher@5b310af6 main
[junit4:junit4]   2> 13353 T343 C43 P12242 oasu.DirectUpdateHandler2.commit end_commit_flush
[junit4:junit4]   2> 13355 T350 oasc.SolrCore.registerSearcher [collection1] Registered new searcher Searcher@5b310af6 main{StandardDirectoryReader(segments_2:3 _0(5.0):C1)}
[junit4:junit4]   2> 13356 T343 C43 P12242 oasu.SolrCmdDistributor.distribCommit Distrib commit to:[StdNode: http://127.0.0.1:12247/solr/collection1/, StdNode: http://127.0.0.1:12245/solr/collection1/, StdNode: http://127.0.0.1:12251/solr/collection1/]
[junit4:junit4]   2> 13359 T357 C45 P12245 oasu.DirectUpdateHandler2.commit start commit{flags=0,_version_=0,optimize=false,openSearcher=true,waitSearcher=true,expungeDeletes=false,softCommit=false}
[junit4:junit4]   2>  C42_STATE=coll:collection1 core:collection1 props:{shard=shard1, roles=null, state=active, core=collection1, collection=collection1, node_name=127.0.0.1:12247_solr, base_url=http://127.0.0.1:12247/solr}
[junit4:junit4]   2> 13360 T365 C42 P12247 oasu.DirectUpdateHandler2.commit start commit{flags=0,_version_=0,optimize=false,openSearcher=true,waitSearcher=true,expungeDeletes=false,softCommit=false}
[junit4:junit4]   2> 13362 T365 C42 P12247 oass.SolrIndexSearcher.<init> Opening Searcher@e4a13fd main
[junit4:junit4]   2> 13363 T365 C42 P12247 oasu.DirectUpdateHandler2.commit end_commit_flush
[junit4:junit4]   2> 13363 T357 C45 P12245 oass.SolrIndexSearcher.<init> Opening Searcher@43a3501a main
[junit4:junit4]   2> 13364 T357 C45 P12245 oasu.DirectUpdateHandler2.commit end_commit_flush
[junit4:junit4]   2> 13365 T374 oasc.SolrCore.registerSearcher [collection1] Registered new searcher Searcher@e4a13fd main{StandardDirectoryReader(segments_2:3:nrt _0(5.0):C1)}
[junit4:junit4]   2> 13365 T365 C42 P12247 /update {waitSearcher=true&commit=true&wt=javabin&commit_end_point=true&expungeDeletes=false&softCommit=false&version=2} {commit=} 0 5
[junit4:junit4]   2> 13366 T362 oasc.SolrCore.registerSearcher [collection1] Registered new searcher Searcher@43a3501a main{StandardDirectoryReader(segments_1:1)}
[junit4:junit4]   2> 13366 T357 C45 P12245 /update {waitSearcher=true&commit=true&wt=javabin&commit_end_point=true&expungeDeletes=false&softCommit=false&version=2} {commit=} 0 7
[junit4:junit4]   2>  C44_STATE=coll:collection1 core:collection1 props:{shard=shard2, roles=null, state=active, core=collection1, collection=collection1, node_name=127.0.0.1:12251_solr, base_url=http://127.0.0.1:12251/solr}
[junit4:junit4]   2> 13368 T379 C44 P12251 oasu.DirectUpdateHandler2.commit start commit{flags=0,_version_=0,optimize=false,openSearcher=true,waitSearcher=true,expungeDeletes=false,softCommit=false}
[junit4:junit4]   2> 13372 T379 C44 P12251 oass.SolrIndexSearcher.<init> Opening Searcher@57ea998d main
[junit4:junit4]   2> 13372 T379 C44 P12251 oasu.DirectUpdateHandler2.commit end_commit_flush
[junit4:junit4]   2> 13374 T388 oasc.SolrCore.registerSearcher [collection1] Registered new searcher Searcher@57ea998d main{StandardDirectoryReader(segments_2:2)}
[junit4:junit4]   2> 13375 T379 C44 P12251 /update {waitSearcher=true&commit=true&wt=javabin&commit_end_point=true&expungeDeletes=false&softCommit=false&version=2} {commit=} 0 7
[junit4:junit4]   2> 13375 T343 C43 P12242 /update {waitSearcher=true&wt=javabin&commit=true&softCommit=false&version=2} {commit=} 0 34
[junit4:junit4]   2> 13382 T328 C46 P12237 REQ /select {fl=id,score&shard.url=127.0.0.1:12237/solr/collection1/&NOW=1348023193820&start=0&q=*:*&distrib=false&isShard=true&wt=javabin&fsv=true&rows=10&version=2} hits=1 status=0 QTime=0 
[junit4:junit4]   2> 13387 T328 C46 P12237 REQ /select {shard.url=127.0.0.1:12237/solr/collection1/&NOW=1348023193820&q=*:*&ids=1&distrib=false&isShard=true&wt=javabin&version=2} status=0 QTime=1 
[junit4:junit4]   2> 13388 T327 C46 P12237 REQ /select {wt=javabin&q=*:*&version=2} hits=1 status=0 QTime=10 
[junit4:junit4]   2> 13389 T315 oaz.ZooKeeper.<init> Initiating client connection, connectString=127.0.0.1:12233/solr sessionTimeout=10000 watcher=org.apache.solr.common.cloud.ConnectionManager@8505eef
[junit4:junit4]   2> 13390 T401 oaz.ClientCnxn$SendThread.startConnect Opening socket connection to server /127.0.0.1:12233
[junit4:junit4]   2> 13390 T315 oascc.ConnectionManager.waitForConnected Waiting for client to connect to ZooKeeper
[junit4:junit4]   2> 13391 T401 oaz.ClientCnxn$SendThread.primeConnection Socket connection established to localhost/127.0.0.1:12233, initiating session
[junit4:junit4]   2> 13392 T317 oazs.NIOServerCnxn$Factory.run Accepted socket connection from /140.211.11.196:12273
[junit4:junit4]   2> 13392 T317 oazs.NIOServerCnxn.readConnectRequest Client attempting to establish new session at /140.211.11.196:12273
[junit4:junit4]   2> 13394 T319 oazs.NIOServerCnxn.finishSessionInit Established session 0x139dc715ca60009 with negotiated timeout 10000 for client /140.211.11.196:12273
[junit4:junit4]   2> 13395 T401 oaz.ClientCnxn$SendThread.readConnectResult Session establishment complete on server localhost/127.0.0.1:12233, sessionid = 0x139dc715ca60009, negotiated timeout = 10000
[junit4:junit4]   2> 13395 T402 oascc.ConnectionManager.process Watcher org.apache.solr.common.cloud.ConnectionManager@8505eef name:ZooKeeperConnection Watcher:127.0.0.1:12233/solr got event WatchedEvent state:SyncConnected type:None path:null path:null type:None
[junit4:junit4]   2> 13395 T315 oascc.ConnectionManager.waitForConnected Client is connected to ZooKeeper
[junit4:junit4]   2> 13397 T315 oascc.ZkStateReader.createClusterStateWatchersAndUpdate Updating cluster state from ZooKeeper... 
[junit4:junit4]   2> 13399 T320 oazs.PrepRequestProcessor.pRequest Processed session termination for sessionid: 0x139dc715ca60009
[junit4:junit4]   2> 13400 T402 oaz.ClientCnxn$EventThread.run EventThread shut down
[junit4:junit4]   2> 13400 T315 oaz.ZooKeeper.close Session: 0x139dc715ca60009 closed
[junit4:junit4]   2> 13400 T317 oazs.NIOServerCnxn.closeSock Closed socket connection for client /140.211.11.196:12273 which had sessionid 0x139dc715ca60009
[junit4:junit4]   2> 13403 T346 C43 P12242 REQ /select {distrib=false&wt=javabin&q=*:*&version=2} hits=1 status=0 QTime=0 
[junit4:junit4]   2> 13407 T358 C45 P12245 REQ /select {distrib=false&wt=javabin&q=*:*&version=2} hits=0 status=0 QTime=0 
[junit4:junit4]   2> 13413 T347 C43 P12242 REQ /select {fl=id,score&shard.url=127.0.0.1:12242/solr/collection1/|127.0.0.1:12247/solr/collection1/&NOW=1348023193852&start=0&q=*:*&distrib=false&isShard=true&wt=javabin&fsv=true&rows=10&version=2} hits=1 status=0 QTime=0 
[junit4:junit4]   2> 13414 T359 C45 P12245 REQ /select {fl=id,score&shard.url=127.0.0.1:12245/solr/collection1/|127.0.0.1:12251/solr/collection1/&NOW=1348023193852&start=0&q=*:*&distrib=false&isShard=true&wt=javabin&fsv=true&rows=10&version=2} hits=0 status=0 QTime=1 
[junit4:junit4]   2> 13418 T347 C43 P12242 REQ /select {shard.url=127.0.0.1:12242/solr/collection1/|127.0.0.1:12247/solr/collection1/&NOW=1348023193852&q=*:*&ids=1&distrib=false&isShard=true&wt=javabin&version=2} status=0 QTime=1 
[junit4:junit4]   2> 13419 T380 C44 P12251 REQ /select {wt=javabin&q=*:*&version=2} hits=1 status=0 QTime=9 
[junit4:junit4]   2> 13431 T327 C46 P12237 /update {wt=javabin&version=2} {add=[2 (1413504768531234816)]} 0 8
[junit4:junit4]   2> 13461 T379 C44 P12251 REQ /update {update.distrib=FROMLEADER&distrib.from=http://127.0.0.1:12245/solr/collection1/&wt=javabin&version=2} status=0 QTime=8 
[junit4:junit4]   2> 13462 T357 C45 P12245 REQ /update {distrib.from=http://127.0.0.1:12242/solr/collection1/&update.distrib=TOLEADER&wt=javabin&version=2} status=0 QTime=20 
[junit4:junit4]   2> 13463 T343 C43 P12242 /update {wt=javabin&version=2} {add=[2]} 0 29
[junit4:junit4]   2> 13471 T327 C46 P12237 /update {wt=javabin&version=2} {add=[3 (1413504768576323584)]} 0 5
[junit4:junit4]   2> 13488 T379 C44 P12251 REQ /update {distrib.from=http://127.0.0.1:12245/solr/collection1/&update.distrib=FROMLEADER&wt=javabin&version=2} status=0 QTime=5 
[junit4:junit4]   2> 13489 T354 C45 P12245 /update {wt=javabin&version=2} {add=[3 (1413504768585760768)]} 0 14
[junit4:junit4]   2> 13498 T327 C46 P12237 /update {wt=javabin&version=2} {add=[4 (1413504768603586560)]} 0 6
[junit4:junit4]   2> 13519 T365 C42 P12247 REQ /update {distrib.from=http://127.0.0.1:12242/solr/collection1/&update.distrib=FROMLEADER&wt=javabin&version=2} status=0 QTime=8 
[junit4:junit4]   2> 13520 T343 C43 P12242 /update {wt=javabin&version=2} {add=[4 (1413504768613023744)]} 0 19
[junit4:junit4]   2> 13529 T327 C46 P12237 /update {wt=javabin&version=2} {add=[5 (1413504768636092416)]} 0 6
[junit4:junit4]   2> 13551 T379 C44 P12251 REQ /update {distrib.from=http://127.0.0.1:12245/solr/collection1/&update.distrib=FROMLEADER&wt=javabin&version=2} status=0 QTime=8 
[junit4:junit4]   2> 13552 T354 C45 P12245 /update {wt=javabin&version=2} {add=[5 (1413504768645529600)]} 0 20
[junit4:junit4]   2> 13561 T327 C46 P12237 /update {wt=javabin&version=2} {add=[6 (1413504768670695424)]} 0 5
[junit4:junit4]   2> 13585 T379 C44 P12251 REQ /update {update.distrib=FROMLEADER&distrib.from=http://127.0.0.1:12245/solr/collection1/&wt=javabin&version=2} status=0 QTime=7 
[junit4:junit4]   2> 13587 T357 C45 P12245 REQ /update {distrib.from=http://127.0.0.1:12242/solr/collection1/&update.distrib=TOLEADER&wt=javabin&version=2} status=0 QTime=18 
[junit4:junit4]   2> 13588 T343 C43 P12242 /update {wt=javabin&version=2} {add=[6]} 0 23
[junit4:junit4]   2> 13597 T327 C46 P12237 /update {wt=javabin&version=2} {add=[7 (1413504768707395584)]} 0 6
[junit4:junit4]   2> 13620 T379 C44 P12251 REQ /update {update.distrib=FROMLEADER&distrib.from=http://127.0.0.1:12245/solr/collection1/&wt=javabin&version=2} status=0 QTime=7 
[junit4:junit4]   2> 13622 T357 C45 P12245 REQ /update {distrib.from=http://127.0.0.1:12242/solr/collection1/&update.distrib=TOLEADER&wt=javabin&version=2} status=0 QTime=18 
[junit4:junit4]   2> 13623 T343 C43 P12242 /update {wt=javabin&version=2} {add=[7]} 0 23
[junit4:junit4]   2> 13635 T327 C46 P12237 /update {wt=javabin&version=2} {add=[8 (1413504768746192896)]} 0 7
[junit4:junit4]   2> 13658 T365 C42 P12247 REQ /update {update.distrib=FROMLEADER&distrib.from=http://127.0.0.1:12242/solr/collection1/&wt=javabin&version=2} status=0 QTime=7 
[junit4:junit4]   2> 13659 T342 C43 P12242 REQ /update {distrib.from=http://127.0.0.1:12245/solr/collection1/&update.distrib=TOLEADER&wt=javabin&version=2} status=0 QTime=17 
[junit4:junit4]   2> 13660 T354 C45 P12245 /update {wt=javabin&version=2} {add=[8]} 0 21
[junit4:junit4]   2> 13672 T327 C46 P12237 /update {wt=javabin&version=2} {add=[9 (1413504768784990208)]} 0 7
[junit4:junit4]   2> 13699 T379 C44 P12251 REQ /update {update.distrib=FROMLEADER&distrib.from=http://127.0.0.1:12245/solr/collection1/&wt=javabin&version=2} status=0 QTime=7 
[junit4:junit4]   2> 13700 T357 C45 P12245 REQ /update {distrib.from=http://127.0.0.1:12242/solr/collection1/&update.distrib=TOLEADER&wt=javabin&version=2} status=0 QTime=18 
[junit4:junit4]   2> 13701 T343 C43 P12242 /update {wt=javabin&version=2} {add=[9]} 0 24
[junit4:junit4]   2> 13712 T327 C46 P12237 /update {wt=javabin&version=2} {add=[10 (1413504768827981824)]} 0 6
[junit4:junit4]   2> 13731 T365 C42 P12247 REQ /update {update.distrib=FROMLEADER&distrib.from=http://127.0.0.1:12242/solr/collection1/&wt=javabin&version=2} status=0 QTime=4 
[junit4:junit4]   2> 13732 T342 C43 P12242 REQ /update {distrib.from=http://127.0.0.1:12245/solr/collection1/&update.distrib=TOLEADER&wt=javabin&version=2} status=0 QTime=12 
[junit4:junit4]   2> 13733 T354 C45 P12245 /update {wt=javabin&version=2} {add=[10]} 0 17
[junit4:junit4]   2> 13769 T327 C46 P12237 /update {wt=javabin&version=2} {add=[11 (1413504768860487680)]} 0 31
[junit4:junit4]   2> 13786 T365 C42 P12247 REQ /update {distrib.from=http://127.0.0.1:12242/solr/collection1/&update.distrib=FROMLEADER&wt=javabin&version=2} status=0 QTime=5 
[junit4:junit4]   2> 13788 T343 C43 P12242 /update {wt=javabin&version=2} {add=[11 (1413504768898236416)]} 0 14
[junit4:junit4]   2> 13798 T327 C46 P12237 /update {wt=javabin&version=2} {add=[12 (1413504768917110784)]} 0 7
[junit4:junit4]   2> 13817 T365 C42 P12247 REQ /update {update.distrib=FROMLEADER&distrib.from=http://127.0.0.1:12242/solr/collection1/&wt=javabin&version=2} status=0 QTime=5 
[junit4:junit4]   2> 13818 T342 C43 P12242 REQ /update {distrib.from=http://127.0.0.1:12245/solr/collection1/&update.distrib=TOLEADER&wt=javabin&version=2} status=0 QTime=13 
[junit4:junit4]   2> 13818 T354 C45 P12245 /update {wt=javabin&version=2} {add=[12]} 0 17
[junit4:junit4]   2> 13827 T327 C46 P12237 /update {wt=javabin&version=2} {add=[13 (1413504768949616640)]} 0 5
[junit4:junit4]   2> 13842 T365 C42 P12247 REQ /update {distrib.from=http://127.0.0.1:12242/solr/collection1/&update.distrib=FROMLEADER&wt=javabin&version=2} status=0 QTime=5 
[junit4:junit4]   2> 13843 T343 C43 P12242 /update {wt=javabin&version=2} {add=[13 (1413504768958005248)]} 0 13
[junit4:junit4]   2> 13851 T327 C46 P12237 /update {wt=javabin&version=2} {add=[14 (1413504768975831040)]} 0 4
[junit4:junit4]   2> 13866 T365 C42 P12247 REQ /update {distrib.from=http://127.0.0.1:12242/solr/collection1/&update.distrib=FROMLEADER&wt=javabin&version=2} status=0 QTime=3 
[junit4:junit4]   2> 13868 T343 C43 P12242 /update {wt=javabin&version=2} {add=[14 (1413504768983171072)]} 0 14
[junit4:junit4]   2> 13876 T327 C46 P12237 /update {wt=javabin&version=2} {add=[15 (1413504769000996864)]} 0 4
[junit4:junit4]   2> 13894 T365 C42 P12247 REQ /update {update.distrib=FROMLEADER&distrib.from=http://127.0.0.1:12242/solr/collection1/&wt=javabin&version=2} status=0 QTime=4 
[junit4:junit4]   2> 13896 T342 C43 P12242 REQ /update {distrib.from=http://127.0.0.1:12245/solr/collection1/&update.distrib=TOLEADER&wt=javabin&version=2} status=0 QTime=13 
[junit4:junit4]   2> 13896 T354 C45 P12245 /update {wt=javabin&version=2} {add=[15]} 0 17
[junit4:junit4]   2> 13904 T327 C46 P12237 /update {wt=javabin&version=2} {add=[16 (1413504769031405568)]} 0 4
[junit4:junit4]   2> 13922 T365 C42 P12247 REQ /update {distrib.from=http://127.0.0.1:12242/solr/collection1/&update.distrib=FROMLEADER&wt=javabin&version=2} status=0 QTime=6 
[junit4:junit4]   2> 13923 T343 C43 P12242 /update {wt=javabin&version=2} {add=[16 (1413504769039794176)]} 0 15
[junit4:junit4]   2> 13940 T327 C46 P12237 /update {wt=javabin&version=2} {add=[17 (1413504769062862848)]} 0 13
[junit4:junit4]   2> 13975 T379 C44 P12251 REQ /update {distrib.from=http://127.0.0.1:12245/solr/collection1/&update.distrib=FROMLEADER&wt=javabin&version=2} status=0 QTime=13 
[junit4:junit4]   2> 13977 T354 C45 P12245 /update {wt=javabin&version=2} {add=[17 (1413504769080688640)]} 0 33
[junit4:junit4]   2> 13985 T327 C46 P12237 /update {wt=javabin&version=2} {add=[100 (1413504769116340224)]} 0 4
[junit4:junit4]   2> 14076 T365 C42 P12247 REQ /update {update.distrib=FROMLEADER&distrib.from=http://127.0.0.1:12242/solr/collection1/&wt=javabin&version=2} status=0 QTime=42 
[junit4:junit4]   2> 14078 T342 C43 P12242 REQ /update {distrib.from=http://127.0.0.1:12245/solr/collection1/&update.distrib=TOLEADER&wt=javabin&version=2} status=0 QTime=85 
[junit4:junit4]   2> 14095 T354 C45 P12245 /update {wt=javabin&version=2} {add=[100]} 0 105
[junit4:junit4]   2> 14105 T327 C46 P12237 /update {wt=javabin&version=2} {add=[101 (1413504769241120768)]} 0 5
[junit4:junit4]   2> 14124 T365 C42 P12247 REQ /update {distrib.from=http://127.0.0.1:12242/solr/collection1/&update.distrib=FROMLEADER&wt=javabin&version=2} status=0 QTime=5 
[junit4:junit4]   2> 14126 T343 C43 P12242 /update {wt=javabin&version=2} {add=[101 (1413504769250557952)]} 0 16
[junit4:junit4]   2> 14135 T327 C46 P12237 /update {wt=javabin&version=2} {add=[102 (1413504769271529472)]} 0 5
[junit4:junit4]   2> 14153 T365 C42 P12247 REQ /update {distrib.from=http://127.0.0.1:12242/solr/collection1/&update.distrib=FROMLEADER&wt=javabin&version=2} status=0 QTime=5 
[junit4:junit4]   2> 14155 T343 C43 P12242 /update {wt=javabin&version=2} {add=[102 (1413504769282015232)]} 0 15
[junit4:junit4]   2> 14191 T327 C46 P12237 /update {wt=javabin&version=2} {add=[103 (1413504769301938176)]} 0 32
[junit4:junit4]   2> 14207 T379 C44 P12251 REQ /update {distrib.from=http://127.0.0.1:12245/solr/collection1/&update.distrib=FROMLEADER&wt=javabin&version=2} status=0 QTime=5 
[junit4:junit4]   2> 14209 T354 C45 P12245 /update {wt=javabin&version=2} {add=[103 (1413504769339686912)]} 0 14
[junit4:junit4]   2> 14220 T327 C46 P12237 /update {wt=javabin&version=2} {add=[104 (1413504769360658432)]} 0 5
[junit4:junit4]   2> 14235 T379 C44 P12251 REQ /update {distrib.from=http://127.0.0.1:12245/solr/collection1/&update.distrib=FROMLEADER&wt=javabin&version=2} status=0 QTime=3 
[junit4:junit4]   2> 14236 T354 C45 P12245 /update {wt=javabin&version=2} {add=[104 (1413504769370095616)]} 0 12
[junit4:junit4]   2> 14244 T327 C46 P12237 /update {wt=javabin&version=2} {add=[105 (1413504769387921408)]} 0 4
[junit4:junit4]   2> 14346 T379 C44 P12251 REQ /update {update.distrib=FROMLEADER&distrib.from=http://127.0.0.1:12245/solr/collection1/&wt=javabin&version=2} status=0 QTime=46 
[junit4:junit4]   2> 14348 T357 C45 P12245 REQ /update {distrib.from=http://127.0.0.1:12242/solr/collection1/&update.distrib=TOLEADER&wt=javabin&version=2} status=0 QTime=96 
[junit4:junit4]   2> 14350 T343 C43 P12242 /update {wt=javabin&version=2} {add=[105]} 0 102
[junit4:junit4]   2> 14358 T327 C46 P12237 /update {wt=javabin&version=2} {add=[106 (1413504769507459072)]} 0 3
[junit4:junit4]   2> 14385 T379 C44 P12251 REQ /update {update.distrib=FROMLEADER&distrib.from=http://127.0.0.1:12245/solr/collection1/&wt=javabin&version=2} status=0 QTime=8 
[junit4:junit4]   2> 14386 T357 C45 P12245 REQ /update {distrib.from=http://127.0.0.1:12242/solr/collection1/&update.distrib=TOLEADER&wt=javabin&version=2} status=0 QTime=19 
[junit4:junit4]   2> 14388 T343 C43 P12242 /update {wt=javabin&version=2} {add=[106]} 0 25
[junit4:junit4]   2> 14396 T327 C46 P12237 /update {wt=javabin&version=2} {add=[107 (1413504769547304960)]} 0 3
[junit4:junit4]   2> 14415 T365 C42 P12247 REQ /update {update.distrib=FROMLEADER&distrib.from=http://127.0.0.1:12242/solr/collection1/&wt=javabin&version=2} status=0 QTime=4 
[junit4:junit4]   2> 14416 T342 C43 P12242 REQ /update {distrib.from=http://127.0.0.1:12245/solr/collection1/&update.distrib=TOLEADER&wt=javabin&version=2} status=0 QTime=12 
[junit4:junit4]   2> 14417 T354 C45 P12245 /update {wt=javabin&version=2} {add=[107]} 0 16
[junit4:junit4]   2> 14425 T327 C46 P12237 /update {wt=javabin&version=2} {add=[108 (1413504769577713664)]} 0 4
[junit4:junit4]   2> 14436 T365 C42 P12247 REQ /update {distrib.from=http://127.0.0.1:12242/solr/collection1/&update.distrib=FROMLEADER&wt=javabin&version=2} status=0 QTime=3 
[junit4:junit4]   2> 14437 T343 C43 P12242 /update {wt=javabin&version=2} {add=[108 (1413504769585053696)]} 0 9
[junit4:junit4]   2> 14443 T327 C46 P12237 /update {wt=javabin&version=2} {add=[109 (1413504769597636608)]} 0 3
[junit4:junit4]   2> 14454 T365 C42 P12247 REQ /update {distrib.from=http://127.0.0.1:12242/solr/collection1/&update.distrib=FROMLEADER&wt=javabin&version=2} status=0 QTime=3 
[junit4:junit4]   2> 14455 T343 C43 P12242 /update {wt=javabin&version=2} {add=[109 (1413504769603928064)]} 0 9
[junit4:junit4]   2> 14462 T327 C46 P12237 /update {wt=javabin&version=2} {add=[110 (1413504769617559552)]} 0 3
[junit4:junit4]   2> 14476 T365 C42 P12247 REQ /update {update.distrib=FROMLEADER&distrib.from=http://127.0.0.1:12242/solr/collection1/&wt=javabin&version=2} status=0 QTime=3 
[junit4:junit4]   2> 14477 T342 C43 P12242 REQ /update {distrib.from=http://127.0.0.1:12245/solr/collection1/&update.distrib=TOLEADER&wt=javabin&version=2} status=0 QTime=9 
[junit4:junit4]   2> 14477 T354 C45 P12245 /update {wt=javabin&version=2} {add=[110]} 0 12
[junit4:junit4]   2> 14483 T327 C46 P12237 /update {wt=javabin&version=2} {add=[111 (1413504769639579648)]} 0 3
[junit4:junit4]   2> 14494 T365 C42 P12247 REQ /update {distrib.from=http://127.0.0.1:12242/solr/collection1/&update.distrib=FROMLEADER&wt=javabin&version=2} status=0 QTime=3 
[junit4:junit4]   2> 14495 T343 C43 P12242 /update {wt=javabin&version=2} {add=[111 (1413504769645871104)]} 0 9
[junit4:junit4]   2> 14500 T327 C46 P12237 /update {wt=javabin&version=2} {add=[112 (1413504769658454016)]} 0 2
[junit4:junit4]   2> 14515 T379 C44 P12251 REQ /update {update.distrib=FROMLEADER&distrib.from=http://127.0.0.1:12245/solr/collection1/&wt=javabin&version=2} status=0 QTime=3 
[junit4:junit4]   2> 14516 T357 C45 P12245 REQ /update {distrib.from=http://127.0.0.1:12242/solr/collection1/&update.distrib=TOLEADER&wt=javabin&version=2} status=0 QTime=10 
[junit4:junit4]   2> 14517 T343 C43 P12242 /update {wt=javabin&version=2} {add=[112]} 0 14
[junit4:junit4]   2> 14534 T327 C46 P12237 /update {wt=javabin&version=2} {add=[113 (1413504769681522688)]} 0 14
[junit4:junit4]   2> 14589 T365 C42 P12247 REQ /update {update.distrib=FROMLEADER&distrib.from=http://127.0.0.1:12242/solr/collection1/&wt=javabin&version=2} status=0 QTime=3 
[junit4:junit4]   2> 14591 T342 C43 P12242 REQ /update {distrib.from=http://127.0.0.1:12245/solr/collection1/&update.distrib=TOLEADER&wt=javabin&version=2} status=0 QTime=12 
[junit4:junit4]   2> 14592 T354 C45 P12245 /update {wt=javabin&version=2} {add=[113]} 0 16
[junit4:junit4]   2> 14601 T327 C46 P12237 /update {wt=javabin&version=2} {add=[114 (1413504769760165888)]} 0 6
[junit4:junit4]   2> 14613 T365 C42 P12247 REQ /update {distrib.from=http://127.0.0.1:12242/solr/collection1/&update.distrib=FROMLEADER&wt=javabin&version=2} status=0 QTime=4 
[junit4:junit4]   2> 14614 T343 C43 P12242 /update {wt=javabin&version=2} {add=[114 (1413504769769603072)]} 0 10
[junit4:junit4]   2> 14621 T327 C46 P12237 /update {wt=javabin&version=2} {add=[115 (1413504769783234560)]} 0 4
[junit4:junit4]   2> 14634 T379 C44 P12251 REQ /update {update.distrib=FROMLEADER&distrib.from=http://127.0.0.1:12245/solr/collection1/&wt=javabin&version=2} status=0 QTime=3 
[junit4:junit4]   2> 14635 T357 C45 P12245 REQ /update {distrib.from=http://127.0.0.1:12242/solr/collection1/&update.distrib=TOLEADER&wt=javabin&version=2} status=0 QTime=8 
[junit4:junit4]   2> 14636 T343 C43 P12242 /update {wt=javabin&version=2} {add=[115]} 0 12
[junit4:junit4]   2> 14641 T327 C46 P12237 /update {wt=javabin&version=2} {add=[116 (1413504769806303232)]} 0 2
[junit4:junit4]   2> 14651 T379 C44 P12251 REQ /update {distrib.from=http://127.0.0.1:12245/solr/collection1/&update.distrib=FROMLEADER&wt=javabin&version=2} status=0 QTime=3 
[junit4:junit4]   2> 14652 T354 C45 P12245 /update {wt=javabin&version=2} {add=[116 (1413504769811546112)]} 0 8
[junit4:junit4]   2> 14657 T327 C46 P12237 /update {wt=javabin&version=2} {add=[117 (1413504769823080448)]} 0 2
[junit4:junit4]   2> 14670 T379 C44 P12251 REQ /update {update.distrib=FROMLEADER&distrib.from=http://127.0.0.1:12245/solr/collection1/&wt=javabin&version=2} status=0 QTime=3 
[junit4:junit4]   2> 14671 T357 C45 P12245 REQ /update {distrib.from=http://127.0.0.1:12242/solr/collection1/&update.distrib=TOLEADER&wt=javabin&version=2} status=0 QTime=8 
[junit4:junit4]   2> 14672 T343 C43 P12242 /update {wt=javabin&version=2} {add=[117]} 0 12
[junit4:junit4]   2> 14677 T327 C46 P12237 /update {wt=javabin&version=2} {add=[118 (1413504769844051968)]} 0 2
[junit4:junit4]   2> 14716 T365 C42 P12247 REQ /update {update.distrib=FROMLEADER&distrib.from=http://127.0.0.1:12242/solr/collection1/&wt=javabin&version=2} status=0 QTime=18 
[junit4:junit4]   2> 14717 T342 C43 P12242 REQ /update {distrib.from=http://127.0.0.1:12245/solr/collection1/&update.distrib=TOLEADER&wt=javabin&version=2} status=0 QTime=33 
[junit4:junit4]   2> 14718 T354 C45 P12245 /update {wt=javabin&version=2} {add=[118]} 0 37
[junit4:junit4]   2> 14723 T327 C46 P12237 /update {wt=javabin&version=2} {add=[119 (1413504769892286464)]} 0 2
[junit4:junit4]   2> 14761 T379 C44 P12251 REQ /update {update.distrib=FROMLEADER&distrib.from=http://127.0.0.1:12245/solr/collection1/&wt=javabin&version=2} status=0 QTime=2 
[junit4:junit4]   2> 14763 T357 C45 P12245 REQ /update {distrib.from=http://127.0.0.1:12242/solr/collection1/&update.distrib=TOLEADER&wt=javabin&version=2} status=0 QTime=32 
[junit4:junit4]   2> 14764 T343 C43 P12242 /update {wt=javabin&version=2} {add=[119]} 0 37
[junit4:junit4]   2> 14793 T327 C46 P12237 /update {wt=javabin&version=2} {add=[120 (1413504769940520960)]} 0 26
[junit4:junit4]   2> 14807 T379 C44 P12251 REQ /update {update.distrib=FROMLEADER&distrib.from=http://127.0.0.1:12245/solr/collection1/&wt=javabin&version=2} status=0 QTime=3 
[junit4:junit4]   2> 14808 T357 C45 P12245 REQ /update {distrib.from=http://127.0.0.1:12242/solr/collection1/&update.distrib=TOLEADER&wt=javabin&version=2} status=0 QTime=9 
[junit4:junit4]   2> 14808 T343 C43 P12242 /update {wt=javabin&version=2} {add=[120]} 0 12
[junit4:junit4]   2> 14813 T327 C46 P12237 /update {wt=javabin&version=2} {add=[121 (1413504769986658304)]} 0 2
[junit4:junit4]   2> 14825 T379 C44 P12251 REQ /update {update.distrib=FROMLEADER&distrib.from=http://127.0.0.1:12245/solr/collection1/&wt=javabin&version=2} status=0 QTime=2 
[junit4:junit4]   2> 14825 T357 C45 P12245 REQ /update {distrib.from=http://127.0.0.1:12242/solr/collection1/&update.distrib=TOLEADER&wt=javabin&version=2} status=0 QTime=6 
[junit4:junit4]   2> 14826 T343 C43 P12242 /update {wt=javabin&version=2} {add=[121]} 0 10
[junit4:junit4]   2> 14837 T327 C46 P12237 /update {wt=javabin&version=2} {add=[122 (1413504770010775552)]} 0 8
[junit4:junit4]   2> 14851 T365 C42 P12247 REQ /update {update.distrib=FROMLEADER&distrib.from=http://127.0.0.1:12242/solr/collection1/&wt=javabin&version=2} status=0 QTime=3 
[junit4:junit4]   2> 14852 T342 C43 P12242 REQ /update {distrib.from=http://127.0.0.1:12245/solr/collection1/&update.distrib=TOLEADER&wt=javabin&version=2} status=0 QTime=10 
[junit4:junit4]   2> 14853 T354 C45 P12245 /update {wt=javabin&version=2} {add=[122]} 0 14
[junit4:junit4]   2> 14869 T327 C46 P12237 /update {wt=javabin&version=2} {add=[123 (1413504770033844224)]} 0 13
[junit4:junit4]   2> 14881 T365 C42 P12247 REQ /update {distrib.from=http://127.0.0.1:12242/solr/collection1/&update.distrib=FROMLEADER&wt=javabin&version=2} status=0 QTime=3 
[junit4:junit4]   2> 14881 T343 C43 P12242 /update {wt=javabin&version=2} {add=[123 (1413504770050621440)]} 0 8
[junit4:junit4]   2> 14888 T327 C46 P12237 /update {wt=javabin&version=2} {add=[124 (1413504770064252928)]} 0 3
[junit4:junit4]   2> 14901 T365 C42 P12247 REQ /update {distrib.from=http://127.0.0.1:12242/solr/collection1/&update.distrib=FROMLEADER&wt=javabin&version=2} status=0 QTime=3 
[junit4:junit4]   2> 14901 T343 C43 P12242 /update {wt=javabin&version=2} {add=[124 (1413504770071592960)]} 0 9
[junit4:junit4]   2> 14907 T327 C46 P12237 /update {wt=javabin&version=2} {add=[125 (1413504770085224448)]} 0 2
[junit4:junit4]   2> 14919 T365 C42 P12247 REQ /update {update.distrib=FROMLEADER&distrib.from=http://127.0.0.1:12242/solr/collection1/&wt=javabin&version=2} status=0 QTime=2 
[junit4:junit4]   2> 14920 T342 C43 P12242 REQ /update {distrib.from=http://127.0.0.1:12245/solr/collection1/&update.distrib=TOLEADER&wt=javabin&version=2} status=0 QTime=7 
[junit4:junit4]   2> 14921 T354 C45 P12245 /update {wt=javabin&version=2} {add=[125]} 0 11
[junit4:junit4]   2> 14927 T327 C46 P12237 /update {wt=javabin&version=2} {add=[126 (1413504770105147392)]} 0 3
[junit4:junit4]   2> 14939 T379 C44 P12251 REQ /update {update.distrib=FROMLEADER&distrib.from=http://127.0.0.1:12245/solr/collection1/&wt=javabin&version=2} status=0 QTime=2 
[junit4:junit4]   2> 14940 T357 C45 P12245 REQ /update {distrib.from=http://127.0.0.1:12242/solr/collection1/&update.distrib=TOLEADER&wt=javabin&version=2} status=0 QTime=7 
[junit4:junit4]   2> 14941 T343 C43 P12242 /update {wt=javabin&version=2} {add=[126]} 0 11
[junit4:junit4]   2> 14946 T327 C46 P12237 /update {wt=javabin&version=2} {add=[127 (1413504770125070336)]} 0 2
[junit4:junit4]   2> 14977 T379 C44 P12251 REQ /update {update.distrib=FROMLEADER&distrib.from=http://127.0.0.1:12245/solr/collection1/&wt=javabin&version=2} status=0 QTime=11 
[junit4:junit4]   2> 14978 T357 C45 P12245 REQ /update {distrib.from=http://127.0.0.1:12242/solr/collection1/&update.distrib=TOLEADER&wt=javabin&version=2} status=0 QTime=26 
[junit4:junit4]   2> 14979 T343 C43 P12242 /update {wt=javabin&version=2} {add=[127]} 0 30
[junit4:junit4]   2> 14984 T327 C46 P12237 /update {wt=javabin&version=2} {add=[128 (1413504770165964800)]} 0 2
[junit4:junit4]   2> 14996 T379 C44 P12251 REQ /update {distrib.from=http://127.0.0.1:12245/solr/collection1/&update.distrib=FROMLEADER&wt=javabin&version=2} status=0 QTime=3 
[junit4:junit4]   2> 14997 T354 C45 P12245 /update {wt=javabin&version=2} {add=[128 (1413504770171207680)]} 0 10
[junit4:junit4]   2> 15002 T327 C46 P12237 /update {wt=javabin&version=2} {add=[129 (1413504770184839168)]} 0 2
[junit4:junit4]   2> 15016 T365 C42 P12247 REQ /update {update.distrib=FROMLEADER&distrib.from=http://127.0.0.1:12242/solr/collection1/&wt=javabin&version=2} status=0 QTime=2 
[junit4:junit4]   2> 15017 T342 C43 P12242 REQ /update {distrib.from=http://127.0.0.1:12245/solr/collection1/&update.distrib=TOLEADER&wt=javabin&version=2} status=0 QTime=8 
[junit4:junit4]   2> 15018 T354 C45 P12245 /update {wt=javabin&version=2} {add=[129]} 0 12
[junit4:junit4]   2> 15024 T327 C46 P12237 /update {wt=javabin&version=2} {add=[130 (1413504770206859264)]} 0 3
[junit4:junit4]   2> 15034 T379 C44 P12251 REQ /update {distrib.from=http://127.0.0.1:12245/solr/collection1/&update.distrib=FROMLEADER&wt=javabin&version=2} status=0 QTime=2 
[junit4:junit4]   2> 15035 T354 C45 P12245 /update {wt=javabin&version=2} {add=[130 (1413504770214199296)]} 0 7
[junit4:junit4]   2> 15040 T327 C46 P12237 /update {wt=javabin&version=2} {add=[131 (1413504770224685056)]} 0 2
[junit4:junit4]   2> 15049 T379 C44 P12251 REQ /update {distrib.from=http://127.0.0.1:12245/solr/collection1/&update.distrib=FROMLEADER&wt=javabin&version=2} status=0 QTime=2 
[junit4:junit4]   2> 15050 T354 C45 P12245 /update {wt=javabin&version=2} {add=[131 (1413504770228879360)]} 0 7
[junit4:junit4]   2> 15055 T327 C46 P12237 /update {wt=javabin&version=2} {add=[132 (1413504770239365120)]} 0 2
[junit4:junit4]   2> 15067 T365 C42 P12247 REQ /update {update.distrib=FROMLEADER&distrib.from=http://127.0.0.1:12242/solr/collection1/&wt=javabin&version=2} status=0 QTime=2 
[junit4:junit4]   2> 15067 T342 C43 P12242 REQ /update {distrib.from=http://127.0.0.1:12245/solr/collection1/&update.distrib=TOLEADER&wt=javabin&version=2} status=0 QTime=6 
[junit4:junit4]   2> 15068 T354 C45 P12245 /update {wt=javabin&version=2} {add=[132]} 0 10
[junit4:junit4]   2> 15087 T327 C46 P12237 /update {wt=javabin&version=2} {add=[133 (1413504770258239488)]} 0 16
[junit4:junit4]   2> 15100 T365 C42 P12247 REQ /update {update.distrib=FROMLEADER&distrib.from=http://127.0.0.1:12242/solr/collection1/&wt=javabin&version=2} status=0 QTime=2 
[junit4:junit4]   2> 15100 T342 C43 P12242 REQ /update {distrib.from=http://127.0.0.1:12245/solr/collection1/&update.distrib=TOLEADER&wt=javabin&version=2} status=0 QTime=7 
[junit4:junit4]   2> 15101 T354 C45 P12245 /update {wt=javabin&version=2} {add=[133]} 0 11
[junit4:junit4]   2> 15107 T327 C46 P12237 /update {wt=javabin&version=2} {add=[134 (1413504770292842496)]} 0 3
[junit4:junit4]   2> 15115 T379 C44 P12251 REQ /update {distrib.from=http://127.0.0.1:12245/solr/collection1/&update.distrib=FROMLEADER&wt=javabin&version=2} status=0 QTime=2 
[junit4:junit4]   2> 15116 T354 C45 P12245 /update {wt=javabin&version=2} {add=[134 (1413504770298085376)]} 0 6
[junit4:junit4]   2> 15119 T327 C46 P12237 /update {wt=javabin&version=2} {add=[135 (1413504770307522560)]} 0 1
[junit4:junit4]   2> 15128 T365 C42 P12247 REQ /update {distrib.from=http://127.0.0.1:12242/solr/collection1/&update.distrib=FROMLEADER&wt=javabin&version=2} status=0 QTime=2 
[junit4:junit4]   2> 15128 T343 C43 P12242 /update {wt=javabin&version=2} {add=[135 (1413504770311716864)]} 0 6
[junit4:junit4]   2> 15132 T327 C46 P12237 /update {wt=javabin&version=2} {add=[136 (1413504770321154048)]} 0 1
[junit4:junit4]   2> 15140 T379 C44 P12251 REQ /update {distrib.from=http://127.0.0.1:12245/solr/collection1/&update.distrib=FROMLEADER&wt=javabin&version=2} status=0 QTime=1 
[junit4:junit4]   2> 15141 T354 C45 P12245 /update {wt=javabin&version=2} {add=[136 (1413504770325348352)]} 0 6
[junit4:junit4]   2> 15145 T327 C46 P12237 /update {wt=javabin&version=2} {add=[137 (1413504770334785536)]} 0 1
[junit4:junit4]   2> 15157 T379 C44 P12251 REQ /update {update.distrib=FROMLEADER&distrib.from=http://127.0.0.1:12245/solr/collection1/&wt=javabin&version=2} status=0 QTime=2 
[junit4:junit4]   2> 15157 T357 C45 P12245 REQ /update {distrib.from=http://127.0.0.1:12242/solr/collection1/&update.distrib=TOLEADER&wt=javabin&version=2} status=0 QTime=6 
[junit4:junit4]   2> 15158 T343 C43 P12242 /update {wt=javabin&version=2} {add=[137]} 0 10
[junit4:junit4]   2> 15163 T327 C46 P12237 /update {wt=javabin&version=2} {add=[138 (1413504770352611328)]} 0 2
[junit4:junit4]   2> 15172 T365 C42 P12247 REQ /update {distrib.from=http://127.0.0.1:12242/solr/collection1/&update.distrib=FROMLEADER&wt=javabin&version=2} status=0 QTime=2 
[junit4:junit4]   2> 15172 T343 C43 P12242 /update {wt=javabin&version=2} {add=[138 (1413504770357854208)]} 0 7
[junit4:junit4]   2> 15176 T327 C46 P12237 /update {wt=javabin&version=2} {add=[139 (1413504770367291392)]} 0 1
[junit4:junit4]   2> 15184 T379 C44 P12251 REQ /update {distrib.from=http://127.0.0.1:12245/solr/collection1/&update.distrib=FROMLEADER&wt=javabin&version=2} status=0 QTime=1 
[junit4:junit4]   2> 15185 T354 C45 P12245 /update {wt=javabin&version=2} {add=[139 (1413504770371485696)]} 0 6
[junit4:junit4]   2> 15189 T327 C46 P12237 /update {wt=javabin&version=2} {add=[140 (1413504770380922880)]} 0 1
[junit4:junit4]   2> 15201 T379 C44 P12251 REQ /update {update.distrib=FROMLEADER&distrib.from=http://127.0.0.1:12245/solr/collection1/&wt=javabin&version=2} status=0 QTime=2 
[junit4:junit4]   2> 15202 T357 C45 P12245 REQ /update {distrib.from=http://127.0.0.1:12242/solr/collection1/&update.distrib=TOLEADER&wt=javabin&version=2} status=0 QTime=6 
[junit4:junit4]   2> 15202 T343 C43 P12242 /update {wt=javabin&version=2} {add=[140]} 0 10
[junit4:junit4]   2> 15207 T327 C46 P12237 /update {wt=javabin&version=2} {add=[141 (1413504770398748672)]} 0 2
[junit4:junit4]   2> 15219 T379 C44 P12251 REQ /update {update.distrib=FROMLEADER&distrib.from=http://127.0.0.1:12245/solr/collection1/&wt=javabin&version=2} status=0 QTime=2 
[junit4:junit4]   2> 15219 T357 C45 P12245 REQ /update {distrib.from=http://127.0.0.1:12242/solr/collection1/&update.distrib=TOLEADER&wt=javabin&version=2} status=0 QTime=7 
[junit4:junit4]   2> 15220 T343 C43 P12242 /update {wt=javabin&version=2} {add=[141]} 0 11
[junit4:junit4]   2> 15226 T327 C46 P12237 /update {wt=javabin&version=2} {add=[142 (1413504770418671616)]} 0 2
[junit4:junit4]   2> 15258 T379 C44 P12251 REQ /update {update.distrib=FROMLEADER&distrib.from=http://127.0.0.1:12245/solr/collection1/&wt=javabin&version=2} status=0 QTime=10 
[junit4:junit4]   2> 15259 T357 C45 P12245 REQ /update {distrib.from=http://127.0.0.1:12242/solr/collection1/&update.distrib=TOLEADER&wt=javabin&version=2} status=0 QTime=28 
[junit4:junit4]   2> 15260 T343 C43 P12242 /update {wt=javabin&version=2} {add=[142]} 0 32
[junit4:junit4]   2> 15275 T327 C46 P12237 /update {wt=javabin&version=2} {add=[143 (1413504770461663232)]} 0 11
[junit4:junit4]   2> 15286 T379 C44 P12251 REQ /update {distrib.from=http://127.0.0.1:12245/solr/collection1/&update.distrib=FROMLEADER&wt=javabin&version=2} status=0 QTime=3 
[junit4:junit4]   2> 15287 T354 C45 P12245 /update {wt=javabin&version=2} {add=[143 (1413504770475294720)]} 0 9
[junit4:junit4]   2> 15293 T327 C46 P12237 /update {wt=javabin&version=2} {add=[144 (1413504770487877632)]} 0 3
[junit4:junit4]   2> 15305 T379 C44 P12251 REQ /update {update.distrib=FROMLEADER&distrib.from=http://127.0.0.1:12245/solr/collection1/&wt=javabin&version=2} status=0 QTime=2 
[junit4:junit4]   2> 15305 T357 C45 P12245 REQ /update {distrib.from=http://127.0.0.1:12242/solr/collection1/&update.distrib=TOLEADER&wt=javabin&version=2} status=0 QTime=6 
[junit4:junit4]   2> 15306 T343 C43 P12242 /update {wt=javabin&version=2} {add=[144]} 0 10
[junit4:junit4]   2> 15312 T327 C46 P12237 /update {wt=javabin&version=2} {add=[145 (1413504770508849152)]} 0 2
[junit4:junit4]   2> 15321 T379 C44 P12251 REQ /update {distrib.from=http://127.0.0.1:12245/solr/collection1/&update.distrib=FROMLEADER&wt=javabin&version=2} status=0 QTime=2 
[junit4:junit4]   2> 15323 T354 C45 P12245 /update {wt=javabin&version=2} {add=[145 (1413504770514092032)]} 0 8
[junit4:junit4]   2> 15328 T327 C46 P12237 /update {wt=javabin&version=2} {add=[146 (1413504770526674944)]} 0 2
[junit4:junit4]   2> 15360 T365 C42 P12247 REQ /update {update.distrib=FROMLEADER&distrib.from=http://127.0.0.1:12242/solr/collection1/&wt=javabin&version=2} status=0 QTime=12 
[junit4:junit4]   2> 15361 T342 C43 P12242 REQ /update {distrib.from=http://127.0.0.1:12245/solr/collection1/&update.distrib=TOLEADER&wt=javabin&version=2} status=0 QTime=27 
[junit4:junit4]   2> 15362 T354 C45 P12245 /update {wt=javabin&version=2} {add=[146]} 0 31
[junit4:junit4]   2> 15367 T327 C46 P12237 /update {wt=javabin&version=2} {add=[147 (1413504770567569408)]} 0 2
[junit4:junit4]   2> 15379 T379 C44 P12251 REQ /update {update.distrib=FROMLEADER&distrib.from=http://127.0.0.1:12245/solr/collection1/&wt=javabin&version=2} status=0 QTime=2 
[junit4:junit4]   2> 15380 T357 C45 P12245 REQ /update {distrib.from=http://127.0.0.1:12242/solr/collection1/&update.distrib=TOLEADER&wt=javabin&version=2} status=0 QTime=7 
[junit4:junit4]   2> 15381 T343 C43 P12242 /update {wt=javabin&version=2} {add=[147]} 0 11
[junit4:junit4]   2> 15386 T327 C46 P12237 /update {wt=javabin&version=2} {add=[148 (1413504770587492352)]} 0 2
[junit4:junit4]   2> 15397 T365 C42 P12247 REQ /update {distrib.from=http://127.0.0.1:12242/solr/collection1/&update.distrib=FROMLEADER&wt=javabin&version=2} status=0 QTime=3 
[junit4:junit4]   2> 15397 T343 C43 P12242 /update {wt=javabin&version=2} {add=[148 (1413504770591686656)]} 0 8
[junit4:junit4]   2> 15401 T327 C46 P12237 /update {wt=javabin&version=2} {add=[149 (1413504770603220992)]} 0 1
[junit4:junit4]   2> 15409 T379 C44 P12251 REQ /update {distrib.from=http://127.0.0.1:12245/solr/collection1/&update.distrib=FROMLEADER&wt=javabin&version=2} status=0 QTime=1 
[junit4:junit4]   2> 15410 T354 C45 P12245 /update {wt=javabin&version=2} {add=[149 (1413504770608463872)]} 0 6
[junit4:junit4]   2> 15411 T315 oasc.AbstractDistribZkTestBase.waitForRecoveriesToFinish Wait for recoveries to finish - collection: collection1 failOnTimeout:true timeout (sec):1800
[junit4:junit4]   2> 15412 T315 oascc.ZkStateReader.updateClusterState Updating cloud state from ZooKeeper... 
[junit4:junit4]   2> 15415 T327 C46 P12237 oasu.DirectUpdateHandler2.commit start commit{flags=0,_version_=0,optimize=false,openSearcher=true,waitSearcher=true,expungeDeletes=false,softCommit=false}
[junit4:junit4]   2> 15863 T327 C46 P12237 oasc.SolrDeletionPolicy.onCommit SolrDeletionPolicy.onCommit: commits:num=2
[junit4:junit4]   2> 		commit{dir=NRTCachingDirectory(org.apache.lucene.store.NIOFSDirectory@/usr/home/hudson/hudson-slave/workspace/Lucene-Solr-Tests-trunk-java7/solr/build/solr-core/test/J1/org.apache.solr.cloud.BasicDistributedZk2Test-1348023180448/control/data/index lockFactory=org.apache.lucene.store.NativeFSLockFactory@194f0c82; maxCacheMB=48.0 maxMergeSizeMB=4.0),segFN=segments_2,generation=2,filenames=[_0_Block_0.tip, _0_Block_0.pos, _0_MockSep_0.pos, _0_Block_0.tim, _0_Pulsing40_0.prx, _0_Pulsing40_0.frq, _0_Lucene40WithOrds_0.tii, _0_Lucene

[...truncated too long message...]

]   2> 		at org.apache.zookeeper.KeeperException.create(KeeperException.java:118)
[junit4:junit4]   2> 		at org.apache.zookeeper.KeeperException.create(KeeperException.java:42)
[junit4:junit4]   2> 		at org.apache.zookeeper.ZooKeeper.getChildren(ZooKeeper.java:1249)
[junit4:junit4]   2> 		at org.apache.solr.common.cloud.SolrZkClient$6.execute(SolrZkClient.java:278)
[junit4:junit4]   2> 		at org.apache.solr.common.cloud.SolrZkClient$6.execute(SolrZkClient.java:275)
[junit4:junit4]   2> 		at org.apache.solr.common.cloud.ZkCmdExecutor.retryOperation(ZkCmdExecutor.java:67)
[junit4:junit4]   2> 		at org.apache.solr.common.cloud.SolrZkClient.getChildren(SolrZkClient.java:275)
[junit4:junit4]   2> 		at org.apache.solr.cloud.ShardLeaderElectionContext.waitForReplicasToComeUp(ElectionContext.java:275)
[junit4:junit4]   2> 		at org.apache.solr.cloud.ShardLeaderElectionContext.runLeaderProcess(ElectionContext.java:142)
[junit4:junit4]   2> 		at org.apache.solr.cloud.LeaderElector.runIamLeaderProcess(LeaderElector.java:158)
[junit4:junit4]   2> 		at org.apache.solr.cloud.LeaderElector.checkIfIamLeader(LeaderElector.java:102)
[junit4:junit4]   2> 		at org.apache.solr.cloud.LeaderElector.joinElection(LeaderElector.java:275)
[junit4:junit4]   2> 		at org.apache.solr.cloud.ShardLeaderElectionContext.rejoinLeaderElection(ElectionContext.java:326)
[junit4:junit4]   2> 		at org.apache.solr.cloud.ShardLeaderElectionContext.runLeaderProcess(ElectionContext.java:159)
[junit4:junit4]   2> 		at org.apache.solr.cloud.LeaderElector.runIamLeaderProcess(LeaderElector.java:158)
[junit4:junit4]   2> 		at org.apache.solr.cloud.LeaderElector.checkIfIamLeader(LeaderElector.java:102)
[junit4:junit4]   2> 		at org.apache.solr.cloud.LeaderElector.access$000(LeaderElector.java:56)
[junit4:junit4]   2> 		at org.apache.solr.cloud.LeaderElector$1.process(LeaderElector.java:131)
[junit4:junit4]   2> 		at org.apache.zookeeper.ClientCnxn$EventThread.processEvent(ClientCnxn.java:526)
[junit4:junit4]   2> 		at org.apache.zookeeper.ClientCnxn$EventThread.run(ClientCnxn.java:502)
[junit4:junit4]   2> 	
[junit4:junit4]   2> 182521 T2405 oasc.ShardLeaderElectionContext.waitForReplicasToComeUp Waiting until we see more replicas up: total=4 found=0 timeoutin=73137
[junit4:junit4]   2> 183022 T2405 oasc.SolrCore.close [collection1]  CLOSING SolrCore org.apache.solr.core.SolrCore@1083dd3c
[junit4:junit4]   2> 183024 T2405 oasc.SolrCore.closeSearcher [collection1] Closing main searcher on request.
[junit4:junit4]   2> 183024 T2405 oasu.DirectUpdateHandler2.close closing DirectUpdateHandler2{commits=7,autocommits=0,soft autocommits=0,optimizes=0,rollbacks=0,expungeDeletes=0,docsPending=0,adds=0,deletesById=0,deletesByQuery=0,errors=0,cumulative_adds=5,cumulative_deletesById=0,cumulative_deletesByQuery=1,cumulative_errors=0}
[junit4:junit4]   2> 183025 T2405 oasu.DefaultSolrCoreState.decref SolrCoreState ref count has reached 0 - closing IndexWriter
[junit4:junit4]   2> 183067 T2405 oasu.DefaultSolrCoreState.decref Closing SolrCoreState - canceling any ongoing recovery
[junit4:junit4]   2> 183068 T2405 oasc.LeaderElector$1.process WARNING  org.apache.zookeeper.KeeperException$SessionExpiredException: KeeperErrorCode = Session expired for /collections/collection1/leader_elect/shard1/election/88344101472370694-127.0.0.1:46589_solr_collection1-n_0000000016
[junit4:junit4]   2> 	at org.apache.zookeeper.KeeperException.create(KeeperException.java:118)
[junit4:junit4]   2> 	at org.apache.zookeeper.KeeperException.create(KeeperException.java:42)
[junit4:junit4]   2> 	at org.apache.zookeeper.ZooKeeper.delete(ZooKeeper.java:734)
[junit4:junit4]   2> 	at org.apache.solr.common.cloud.SolrZkClient$2.execute(SolrZkClient.java:178)
[junit4:junit4]   2> 	at org.apache.solr.common.cloud.SolrZkClient$2.execute(SolrZkClient.java:175)
[junit4:junit4]   2> 	at org.apache.solr.common.cloud.ZkCmdExecutor.retryOperation(ZkCmdExecutor.java:67)
[junit4:junit4]   2> 	at org.apache.solr.common.cloud.SolrZkClient.delete(SolrZkClient.java:175)
[junit4:junit4]   2> 	at org.apache.solr.cloud.ElectionContext.cancelElection(ElectionContext.java:60)
[junit4:junit4]   2> 	at org.apache.solr.cloud.ShardLeaderElectionContext.runLeaderProcess(ElectionContext.java:151)
[junit4:junit4]   2> 	at org.apache.solr.cloud.LeaderElector.runIamLeaderProcess(LeaderElector.java:158)
[junit4:junit4]   2> 	at org.apache.solr.cloud.LeaderElector.checkIfIamLeader(LeaderElector.java:102)
[junit4:junit4]   2> 	at org.apache.solr.cloud.LeaderElector.joinElection(LeaderElector.java:275)
[junit4:junit4]   2> 	at org.apache.solr.cloud.ShardLeaderElectionContext.rejoinLeaderElection(ElectionContext.java:326)
[junit4:junit4]   2> 	at org.apache.solr.cloud.ShardLeaderElectionContext.runLeaderProcess(ElectionContext.java:159)
[junit4:junit4]   2> 	at org.apache.solr.cloud.LeaderElector.runIamLeaderProcess(LeaderElector.java:158)
[junit4:junit4]   2> 	at org.apache.solr.cloud.LeaderElector.checkIfIamLeader(LeaderElector.java:102)
[junit4:junit4]   2> 	at org.apache.solr.cloud.LeaderElector.access$000(LeaderElector.java:56)
[junit4:junit4]   2> 	at org.apache.solr.cloud.LeaderElector$1.process(LeaderElector.java:131)
[junit4:junit4]   2> 	at org.apache.zookeeper.ClientCnxn$EventThread.processEvent(ClientCnxn.java:526)
[junit4:junit4]   2> 	at org.apache.zookeeper.ClientCnxn$EventThread.run(ClientCnxn.java:502)
[junit4:junit4]   2> 
[junit4:junit4]   2> 183069 T2405 oascc.ZkStateReader$2.process A cluster state change has occurred - updating...
[junit4:junit4]   2> 183069 T2405 oascc.ZkStateReader$2.process WARNING ZooKeeper watch triggered, but Solr cannot talk to ZK
[junit4:junit4]   2> 183069 T2405 oascc.ConnectionManager.process Watcher org.apache.solr.common.cloud.ConnectionManager@4e9f5e8a name:ZooKeeperConnection Watcher:127.0.0.1:12226/solr got event WatchedEvent state:Disconnected type:None path:null path:null type:None
[junit4:junit4]   2> 183069 T2405 oascc.ConnectionManager.process Client->ZooKeeper status change trigger but we are already closed
[junit4:junit4]   2> 183069 T2405 oaz.ClientCnxn$EventThread.run EventThread shut down
[junit4:junit4]   2> NOTE: test params are: codec=Asserting, sim=RandomSimilarityProvider(queryNorm=false,coord=crazy): {}, locale=mk_MK, timezone=Indian/Mayotte
[junit4:junit4]   2> NOTE: FreeBSD 9.0-RELEASE amd64/Oracle Corporation 1.7.0_06 (64-bit)/cpus=16,threads=1,free=256628768,total=417333248
[junit4:junit4]   2> NOTE: All tests run in this JVM: [MultiTermTest, TestUpdate, RequiredFieldsTest, TestDocumentBuilder, BasicZkTest, SolrInfoMBeanTest, DistributedQueryElevationComponentTest, DocumentAnalysisRequestHandlerTest, TestRecovery, TermVectorComponentDistributedTest, DocumentBuilderTest, TestSurroundQueryParser, SolrCoreTest, PingRequestHandlerTest, DebugComponentTest, StatelessScriptUpdateProcessorFactoryTest, FieldMutatingUpdateProcessorTest, DOMUtilTest, TestFoldingMultitermQuery, SignatureUpdateProcessorFactoryTest, TestCSVResponseWriter, TestMergePolicyConfig, TestReversedWildcardFilterFactory, OpenExchangeRatesOrgProviderTest, PrimUtilsTest, BasicDistributedZk2Test, StatsComponentTest, LukeRequestHandlerTest, TestCSVLoader, OutputWriterTest, SpellingQueryConverterTest, TimeZoneUtilsTest, BasicFunctionalityTest, TestQueryUtils, TestFunctionQuery, DirectSolrSpellCheckerTest, XsltUpdateRequestHandlerTest, ZkSolrClientTest, UUIDFieldTest, ShowFileRequestHandlerTest, StandardRequestHandlerTest, PrimitiveFieldTypeTest, TestDistributedGrouping, PathHierarchyTokenizerFactoryTest, QueryEqualityTest, TestRealTimeGet, TestValueSourceCache, BadIndexSchemaTest, TestReplicationHandler, TestPropInject, TestDFRSimilarityFactory, DisMaxRequestHandlerTest, XmlUpdateRequestHandlerTest, ConvertedLegacyTest, TestTrie, OverseerTest, RecoveryZkTest, SpellCheckComponentTest, LeaderElectionTest, DistributedSpellCheckComponentTest, TestDistributedSearch, WordBreakSolrSpellCheckerTest, IndexBasedSpellCheckerTest, DirectUpdateHandlerTest, TestMultiCoreConfBootstrap, TestSort, TestGroupingSearch, FileBasedSpellCheckerTest, PeerSyncTest, SortByFunctionTest, CoreAdminHandlerTest, DirectSolrConnectionTest, CacheHeaderTest, MoreLikeThisHandlerTest, IndexSchemaTest, QueryParsingTest, DistanceFunctionTest, TestPHPSerializedResponseWriter, TermVectorComponentTest, JsonLoaderTest, DirectUpdateHandlerOptimizeTest, TestSolrQueryParser, ReturnFieldsTest, SuggesterFSTTest, SuggesterTSTTest, SuggesterTest, TestSolrDeletionPolicy1, TestIndexingPerformance, NoCacheHeaderTest, TestSolrDeletionPolicy2, DefaultValueUpdateProcessorTest, TestLFUCache, TestCollationField, TestQuerySenderNoQuery, NumericFieldsTest, TestJmxMonitoredMap, TestConfig, TestPhraseSuggestions, TestPluginEnable, TestLMJelinekMercerSimilarityFactory, TestCodecSupport, ResourceLoaderTest, FileUtilsTest, TestSolrXMLSerializer, DateFieldTest, SystemInfoHandlerTest, TestCharFilters, SyncSliceTest]
[junit4:junit4] Completed on J1 in 183.94s, 1 test, 1 error <<< FAILURES!

[...truncated 5 lines...]
BUILD FAILED
/usr/home/hudson/hudson-slave/workspace/Lucene-Solr-Tests-trunk-java7/build.xml:32: The following error occurred while executing this line:
/usr/home/hudson/hudson-slave/workspace/Lucene-Solr-Tests-trunk-java7/solr/build.xml:146: The following error occurred while executing this line:
/usr/home/hudson/hudson-slave/workspace/Lucene-Solr-Tests-trunk-java7/lucene/module-build.xml:63: The following error occurred while executing this line:
/usr/home/hudson/hudson-slave/workspace/Lucene-Solr-Tests-trunk-java7/lucene/common-build.xml:1136: The following error occurred while executing this line:
/usr/home/hudson/hudson-slave/workspace/Lucene-Solr-Tests-trunk-java7/lucene/common-build.xml:810: There were test failures: 230 suites, 950 tests, 1 error, 1 failure, 7 ignored (2 assumptions)

Total time: 33 minutes 26 seconds
Build step 'Invoke Ant' marked build as failure
Recording test results
Email was triggered for: Failure
Sending email for trigger: Failure



Mime
View raw message