lucene-dev mailing list archives

Site index · List index
Message view « Date » · « Thread »
Top « Date » · « Thread »
From Robert Muir <rcm...@gmail.com>
Subject Re: [JENKINS] Lucene-Solr-trunk-Linux (32bit/ibm-j9-jdk7) - Build # 67 - Failure!
Date Wed, 01 Aug 2012 01:10:30 GMT
I tried to reproduce the whole test run with my IBM JRE (which is not
the java7 one Uwe has, but still):

java version "1.6.0"
Java(TM) SE Runtime Environment (build pxi3260sr10-20111208_01(SR10))
IBM J9 VM (build 2.4, JRE 1.6.0 IBM J9 2.4 Linux x86-32
jvmxi3260sr10-20111207_96808 (JIT enabled, AOT enabled)
J9VM - 20111207_096808
JIT  - r9_20111107_21307ifx1
GC   - 20110519_AA)
JCL  - 20111104_02

This just caused out of open file handles... I think mine has other issues :)

I cant reproduce the problems with any other JRE, it seems sketchy
this long is negative.

On Tue, Jul 31, 2012 at 7:24 PM, Policeman Jenkins Server
<jenkins@sd-datasolutions.de> wrote:
> Build: http://jenkins.sd-datasolutions.de/job/Lucene-Solr-trunk-Linux/67/
> Java: 32bit/ibm-j9-jdk7
>
> 7 tests failed.
> FAILED:  junit.framework.TestSuite.org.apache.lucene.search.TestFieldCache
>
> Error Message:
>
>
> Stack Trace:
> java.lang.AssertionError
>         at __randomizedtesting.SeedInfo.seed([D686D14F0587EBAE]:0)
>         at org.apache.lucene.util.packed.GrowableWriter.ensureCapacity(GrowableWriter.java:70)
>         at org.apache.lucene.util.packed.GrowableWriter.set(GrowableWriter.java:83)
>         at org.apache.lucene.util.fst.FST.pack(FST.java:1505)
>         at org.apache.lucene.codecs.memory.MemoryPostingsFormat$TermsWriter.finish(MemoryPostingsFormat.java:273)
>         at org.apache.lucene.index.FreqProxTermsWriterPerField.flush(FreqProxTermsWriterPerField.java:550)
>         at org.apache.lucene.index.FreqProxTermsWriter.flush(FreqProxTermsWriter.java:85)
>         at org.apache.lucene.index.TermsHash.flush(TermsHash.java:117)
>         at org.apache.lucene.index.DocInverter.flush(DocInverter.java:53)
>         at org.apache.lucene.index.DocFieldProcessor.flush(DocFieldProcessor.java:82)
>         at org.apache.lucene.index.DocumentsWriterPerThread.flush(DocumentsWriterPerThread.java:481)
>         at org.apache.lucene.index.DocumentsWriter.doFlush(DocumentsWriter.java:420)
>         at org.apache.lucene.index.DocumentsWriter.flushAllThreads(DocumentsWriter.java:552)
>         at org.apache.lucene.index.IndexWriter.prepareCommit(IndexWriter.java:2563)
>         at org.apache.lucene.index.IndexWriter.commitInternal(IndexWriter.java:2699)
>         at org.apache.lucene.index.IndexWriter.commit(IndexWriter.java:2679)
>         at org.apache.lucene.index.IndexWriter.commit(IndexWriter.java:2663)
>         at org.apache.lucene.index.RandomIndexWriter.maybeCommit(RandomIndexWriter.java:266)
>         at org.apache.lucene.index.RandomIndexWriter.addDocument(RandomIndexWriter.java:189)
>         at org.apache.lucene.index.RandomIndexWriter.addDocument(RandomIndexWriter.java:145)
>         at org.apache.lucene.search.TestFieldCache.beforeClass(TestFieldCache.java:100)
>         at sun.reflect.NativeMethodAccessorImpl.invoke0(Native Method)
>         at sun.reflect.NativeMethodAccessorImpl.invoke(NativeMethodAccessorImpl.java:88)
>         at sun.reflect.DelegatingMethodAccessorImpl.invoke(DelegatingMethodAccessorImpl.java:55)
>         at java.lang.reflect.Method.invoke(Method.java:613)
>         at com.carrotsearch.randomizedtesting.RandomizedRunner.invoke(RandomizedRunner.java:1995)
>         at com.carrotsearch.randomizedtesting.RandomizedRunner.access$1100(RandomizedRunner.java:132)
>         at com.carrotsearch.randomizedtesting.RandomizedRunner$4.evaluate(RandomizedRunner.java:731)
>         at com.carrotsearch.randomizedtesting.RandomizedRunner$5.evaluate(RandomizedRunner.java:747)
>         at org.apache.lucene.util.AbstractBeforeAfterRule$1.evaluate(AbstractBeforeAfterRule.java:45)
>         at org.apache.lucene.util.TestRuleReportUncaughtExceptions$1.evaluate(TestRuleReportUncaughtExceptions.java:68)
>         at org.apache.lucene.util.TestRuleStoreClassName$1.evaluate(TestRuleStoreClassName.java:38)
>         at com.carrotsearch.randomizedtesting.rules.SystemPropertiesInvariantRule$1.evaluate(SystemPropertiesInvariantRule.java:55)
>         at org.apache.lucene.util.TestRuleNoInstanceHooksOverrides$1.evaluate(TestRuleNoInstanceHooksOverrides.java:53)
>         at org.apache.lucene.util.TestRuleNoStaticHooksShadowing$1.evaluate(TestRuleNoStaticHooksShadowing.java:52)
>         at org.apache.lucene.util.TestRuleAssertionsRequired$1.evaluate(TestRuleAssertionsRequired.java:36)
>         at org.apache.lucene.util.TestRuleMarkFailure$1.evaluate(TestRuleMarkFailure.java:48)
>         at org.apache.lucene.util.TestRuleIgnoreAfterMaxFailures$1.evaluate(TestRuleIgnoreAfterMaxFailures.java:70)
>         at org.apache.lucene.util.TestRuleIgnoreTestSuites$1.evaluate(TestRuleIgnoreTestSuites.java:55)
>         at com.carrotsearch.randomizedtesting.RandomizedRunner.runSuite(RandomizedRunner.java:605)
>         at com.carrotsearch.randomizedtesting.RandomizedRunner.access$400(RandomizedRunner.java:132)
>         at com.carrotsearch.randomizedtesting.RandomizedRunner$2.run(RandomizedRunner.java:551)
>
>
> FAILED:  junit.framework.TestSuite.org.apache.lucene.search.TestFieldCache
>
> Error Message:
>
>
> Stack Trace:
> java.lang.NullPointerException
>         at __randomizedtesting.SeedInfo.seed([D686D14F0587EBAE]:0)
>         at org.apache.lucene.search.TestFieldCache.afterClass(TestFieldCache.java:109)
>         at sun.reflect.NativeMethodAccessorImpl.invoke0(Native Method)
>         at sun.reflect.NativeMethodAccessorImpl.invoke(NativeMethodAccessorImpl.java:88)
>         at sun.reflect.DelegatingMethodAccessorImpl.invoke(DelegatingMethodAccessorImpl.java:55)
>         at java.lang.reflect.Method.invoke(Method.java:613)
>         at com.carrotsearch.randomizedtesting.RandomizedRunner.invoke(RandomizedRunner.java:1995)
>         at com.carrotsearch.randomizedtesting.RandomizedRunner.access$1100(RandomizedRunner.java:132)
>         at com.carrotsearch.randomizedtesting.RandomizedRunner$5.evaluate(RandomizedRunner.java:754)
>         at org.apache.lucene.util.AbstractBeforeAfterRule$1.evaluate(AbstractBeforeAfterRule.java:45)
>         at org.apache.lucene.util.TestRuleReportUncaughtExceptions$1.evaluate(TestRuleReportUncaughtExceptions.java:68)
>         at org.apache.lucene.util.TestRuleStoreClassName$1.evaluate(TestRuleStoreClassName.java:38)
>         at com.carrotsearch.randomizedtesting.rules.SystemPropertiesInvariantRule$1.evaluate(SystemPropertiesInvariantRule.java:55)
>         at org.apache.lucene.util.TestRuleNoInstanceHooksOverrides$1.evaluate(TestRuleNoInstanceHooksOverrides.java:53)
>         at org.apache.lucene.util.TestRuleNoStaticHooksShadowing$1.evaluate(TestRuleNoStaticHooksShadowing.java:52)
>         at org.apache.lucene.util.TestRuleAssertionsRequired$1.evaluate(TestRuleAssertionsRequired.java:36)
>         at org.apache.lucene.util.TestRuleMarkFailure$1.evaluate(TestRuleMarkFailure.java:48)
>         at org.apache.lucene.util.TestRuleIgnoreAfterMaxFailures$1.evaluate(TestRuleIgnoreAfterMaxFailures.java:70)
>         at org.apache.lucene.util.TestRuleIgnoreTestSuites$1.evaluate(TestRuleIgnoreTestSuites.java:55)
>         at com.carrotsearch.randomizedtesting.RandomizedRunner.runSuite(RandomizedRunner.java:605)
>         at com.carrotsearch.randomizedtesting.RandomizedRunner.access$400(RandomizedRunner.java:132)
>         at com.carrotsearch.randomizedtesting.RandomizedRunner$2.run(RandomizedRunner.java:551)
>
>
> REGRESSION:  org.apache.lucene.index.TestIndexWriterDelete.testFlushPushedDeletesByCount
>
> Error Message:
>
>
> Stack Trace:
> java.lang.AssertionError
>         at __randomizedtesting.SeedInfo.seed([D686D14F0587EBAE:F4532A6A4A100B94]:0)
>         at org.apache.lucene.util.packed.GrowableWriter.ensureCapacity(GrowableWriter.java:70)
>         at org.apache.lucene.util.packed.GrowableWriter.set(GrowableWriter.java:83)
>         at org.apache.lucene.util.fst.FST.pack(FST.java:1505)
>         at org.apache.lucene.codecs.memory.MemoryPostingsFormat$TermsWriter.finish(MemoryPostingsFormat.java:273)
>         at org.apache.lucene.index.FreqProxTermsWriterPerField.flush(FreqProxTermsWriterPerField.java:550)
>         at org.apache.lucene.index.FreqProxTermsWriter.flush(FreqProxTermsWriter.java:85)
>         at org.apache.lucene.index.TermsHash.flush(TermsHash.java:117)
>         at org.apache.lucene.index.DocInverter.flush(DocInverter.java:53)
>         at org.apache.lucene.index.DocFieldProcessor.flush(DocFieldProcessor.java:82)
>         at org.apache.lucene.index.DocumentsWriterPerThread.flush(DocumentsWriterPerThread.java:481)
>         at org.apache.lucene.index.DocumentsWriter.doFlush(DocumentsWriter.java:420)
>         at org.apache.lucene.index.DocumentsWriter.postUpdate(DocumentsWriter.java:314)
>         at org.apache.lucene.index.DocumentsWriter.updateDocument(DocumentsWriter.java:387)
>         at org.apache.lucene.index.IndexWriter.updateDocument(IndexWriter.java:1356)
>         at org.apache.lucene.index.IndexWriter.updateDocument(IndexWriter.java:1328)
>         at org.apache.lucene.index.TestIndexWriterDelete.testFlushPushedDeletesByCount(TestIndexWriterDelete.java:1008)
>         at sun.reflect.NativeMethodAccessorImpl.invoke0(Native Method)
>         at sun.reflect.NativeMethodAccessorImpl.invoke(NativeMethodAccessorImpl.java:88)
>         at sun.reflect.DelegatingMethodAccessorImpl.invoke(DelegatingMethodAccessorImpl.java:55)
>         at java.lang.reflect.Method.invoke(Method.java:613)
>         at com.carrotsearch.randomizedtesting.RandomizedRunner.invoke(RandomizedRunner.java:1995)
>         at com.carrotsearch.randomizedtesting.RandomizedRunner.access$1100(RandomizedRunner.java:132)
>         at com.carrotsearch.randomizedtesting.RandomizedRunner$6.evaluate(RandomizedRunner.java:818)
>         at com.carrotsearch.randomizedtesting.RandomizedRunner$7.evaluate(RandomizedRunner.java:877)
>         at com.carrotsearch.randomizedtesting.RandomizedRunner$8.evaluate(RandomizedRunner.java:891)
>         at org.apache.lucene.util.TestRuleSetupTeardownChained$1.evaluate(TestRuleSetupTeardownChained.java:50)
>         at org.apache.lucene.util.TestRuleFieldCacheSanity$1.evaluate(TestRuleFieldCacheSanity.java:32)
>         at org.apache.lucene.util.AbstractBeforeAfterRule$1.evaluate(AbstractBeforeAfterRule.java:45)
>         at com.carrotsearch.randomizedtesting.rules.SystemPropertiesInvariantRule$1.evaluate(SystemPropertiesInvariantRule.java:55)
>         at org.apache.lucene.util.TestRuleReportUncaughtExceptions$1.evaluate(TestRuleReportUncaughtExceptions.java:68)
>         at org.apache.lucene.util.TestRuleThreadAndTestName$1.evaluate(TestRuleThreadAndTestName.java:48)
>         at org.apache.lucene.util.TestRuleIgnoreAfterMaxFailures$1.evaluate(TestRuleIgnoreAfterMaxFailures.java:70)
>         at org.apache.lucene.util.TestRuleMarkFailure$1.evaluate(TestRuleMarkFailure.java:48)
>         at com.carrotsearch.randomizedtesting.RandomizedRunner.runSingleTest(RandomizedRunner.java:825)
>         at com.carrotsearch.randomizedtesting.RandomizedRunner.access$700(RandomizedRunner.java:132)
>         at com.carrotsearch.randomizedtesting.RandomizedRunner$3$1.run(RandomizedRunner.java:671)
>         at com.carrotsearch.randomizedtesting.RandomizedRunner$3.evaluate(RandomizedRunner.java:697)
>         at com.carrotsearch.randomizedtesting.RandomizedRunner$4.evaluate(RandomizedRunner.java:736)
>         at com.carrotsearch.randomizedtesting.RandomizedRunner$5.evaluate(RandomizedRunner.java:747)
>         at org.apache.lucene.util.AbstractBeforeAfterRule$1.evaluate(AbstractBeforeAfterRule.java:45)
>         at org.apache.lucene.util.TestRuleReportUncaughtExceptions$1.evaluate(TestRuleReportUncaughtExceptions.java:68)
>         at org.apache.lucene.util.TestRuleStoreClassName$1.evaluate(TestRuleStoreClassName.java:38)
>         at com.carrotsearch.randomizedtesting.rules.SystemPropertiesInvariantRule$1.evaluate(SystemPropertiesInvariantRule.java:55)
>         at org.apache.lucene.util.TestRuleNoInstanceHooksOverrides$1.evaluate(TestRuleNoInstanceHooksOverrides.java:53)
>         at org.apache.lucene.util.TestRuleNoStaticHooksShadowing$1.evaluate(TestRuleNoStaticHooksShadowing.java:52)
>         at org.apache.lucene.util.TestRuleAssertionsRequired$1.evaluate(TestRuleAssertionsRequired.java:36)
>         at org.apache.lucene.util.TestRuleMarkFailure$1.evaluate(TestRuleMarkFailure.java:48)
>         at org.apache.lucene.util.TestRuleIgnoreAfterMaxFailures$1.evaluate(TestRuleIgnoreAfterMaxFailures.java:70)
>         at org.apache.lucene.util.TestRuleIgnoreTestSuites$1.evaluate(TestRuleIgnoreTestSuites.java:55)
>         at com.carrotsearch.randomizedtesting.RandomizedRunner.runSuite(RandomizedRunner.java:605)
>         at com.carrotsearch.randomizedtesting.RandomizedRunner.access$400(RandomizedRunner.java:132)
>         at com.carrotsearch.randomizedtesting.RandomizedRunner$2.run(RandomizedRunner.java:551)
>
>
> REGRESSION:  org.apache.lucene.index.TestIndexWriterDelete.testDeletesOnDiskFull
>
> Error Message:
>
>
> Stack Trace:
> java.lang.AssertionError
>         at __randomizedtesting.SeedInfo.seed([D686D14F0587EBAE:C63DE115830F7542]:0)
>         at org.apache.lucene.util.packed.GrowableWriter.ensureCapacity(GrowableWriter.java:70)
>         at org.apache.lucene.util.packed.GrowableWriter.set(GrowableWriter.java:83)
>         at org.apache.lucene.util.fst.FST.pack(FST.java:1505)
>         at org.apache.lucene.codecs.memory.MemoryPostingsFormat$TermsWriter.finish(MemoryPostingsFormat.java:273)
>         at org.apache.lucene.index.FreqProxTermsWriterPerField.flush(FreqProxTermsWriterPerField.java:550)
>         at org.apache.lucene.index.FreqProxTermsWriter.flush(FreqProxTermsWriter.java:85)
>         at org.apache.lucene.index.TermsHash.flush(TermsHash.java:117)
>         at org.apache.lucene.index.DocInverter.flush(DocInverter.java:53)
>         at org.apache.lucene.index.DocFieldProcessor.flush(DocFieldProcessor.java:82)
>         at org.apache.lucene.index.DocumentsWriterPerThread.flush(DocumentsWriterPerThread.java:481)
>         at org.apache.lucene.index.DocumentsWriter.doFlush(DocumentsWriter.java:420)
>         at org.apache.lucene.index.DocumentsWriter.flushAllThreads(DocumentsWriter.java:552)
>         at org.apache.lucene.index.IndexWriter.doFlush(IndexWriter.java:2791)
>         at org.apache.lucene.index.IndexWriter.flush(IndexWriter.java:2767)
>         at org.apache.lucene.index.IndexWriter.closeInternal(IndexWriter.java:890)
>         at org.apache.lucene.index.IndexWriter.close(IndexWriter.java:845)
>         at org.apache.lucene.index.IndexWriter.close(IndexWriter.java:807)
>         at org.apache.lucene.index.TestIndexWriterDelete.doTestOperationsOnDiskFull(TestIndexWriterDelete.java:439)
>         at org.apache.lucene.index.TestIndexWriterDelete.testDeletesOnDiskFull(TestIndexWriterDelete.java:411)
>         at sun.reflect.NativeMethodAccessorImpl.invoke0(Native Method)
>         at sun.reflect.NativeMethodAccessorImpl.invoke(NativeMethodAccessorImpl.java:88)
>         at sun.reflect.DelegatingMethodAccessorImpl.invoke(DelegatingMethodAccessorImpl.java:55)
>         at java.lang.reflect.Method.invoke(Method.java:613)
>         at com.carrotsearch.randomizedtesting.RandomizedRunner.invoke(RandomizedRunner.java:1995)
>         at com.carrotsearch.randomizedtesting.RandomizedRunner.access$1100(RandomizedRunner.java:132)
>         at com.carrotsearch.randomizedtesting.RandomizedRunner$6.evaluate(RandomizedRunner.java:818)
>         at com.carrotsearch.randomizedtesting.RandomizedRunner$7.evaluate(RandomizedRunner.java:877)
>         at com.carrotsearch.randomizedtesting.RandomizedRunner$8.evaluate(RandomizedRunner.java:891)
>         at org.apache.lucene.util.TestRuleSetupTeardownChained$1.evaluate(TestRuleSetupTeardownChained.java:50)
>         at org.apache.lucene.util.TestRuleFieldCacheSanity$1.evaluate(TestRuleFieldCacheSanity.java:32)
>         at org.apache.lucene.util.AbstractBeforeAfterRule$1.evaluate(AbstractBeforeAfterRule.java:45)
>         at com.carrotsearch.randomizedtesting.rules.SystemPropertiesInvariantRule$1.evaluate(SystemPropertiesInvariantRule.java:55)
>         at org.apache.lucene.util.TestRuleReportUncaughtExceptions$1.evaluate(TestRuleReportUncaughtExceptions.java:68)
>         at org.apache.lucene.util.TestRuleThreadAndTestName$1.evaluate(TestRuleThreadAndTestName.java:48)
>         at org.apache.lucene.util.TestRuleIgnoreAfterMaxFailures$1.evaluate(TestRuleIgnoreAfterMaxFailures.java:70)
>         at org.apache.lucene.util.TestRuleMarkFailure$1.evaluate(TestRuleMarkFailure.java:48)
>         at com.carrotsearch.randomizedtesting.RandomizedRunner.runSingleTest(RandomizedRunner.java:825)
>         at com.carrotsearch.randomizedtesting.RandomizedRunner.access$700(RandomizedRunner.java:132)
>         at com.carrotsearch.randomizedtesting.RandomizedRunner$3$1.run(RandomizedRunner.java:671)
>         at com.carrotsearch.randomizedtesting.RandomizedRunner$3.evaluate(RandomizedRunner.java:697)
>         at com.carrotsearch.randomizedtesting.RandomizedRunner$4.evaluate(RandomizedRunner.java:736)
>         at com.carrotsearch.randomizedtesting.RandomizedRunner$5.evaluate(RandomizedRunner.java:747)
>         at org.apache.lucene.util.AbstractBeforeAfterRule$1.evaluate(AbstractBeforeAfterRule.java:45)
>         at org.apache.lucene.util.TestRuleReportUncaughtExceptions$1.evaluate(TestRuleReportUncaughtExceptions.java:68)
>         at org.apache.lucene.util.TestRuleStoreClassName$1.evaluate(TestRuleStoreClassName.java:38)
>         at com.carrotsearch.randomizedtesting.rules.SystemPropertiesInvariantRule$1.evaluate(SystemPropertiesInvariantRule.java:55)
>         at org.apache.lucene.util.TestRuleNoInstanceHooksOverrides$1.evaluate(TestRuleNoInstanceHooksOverrides.java:53)
>         at org.apache.lucene.util.TestRuleNoStaticHooksShadowing$1.evaluate(TestRuleNoStaticHooksShadowing.java:52)
>         at org.apache.lucene.util.TestRuleAssertionsRequired$1.evaluate(TestRuleAssertionsRequired.java:36)
>         at org.apache.lucene.util.TestRuleMarkFailure$1.evaluate(TestRuleMarkFailure.java:48)
>         at org.apache.lucene.util.TestRuleIgnoreAfterMaxFailures$1.evaluate(TestRuleIgnoreAfterMaxFailures.java:70)
>         at org.apache.lucene.util.TestRuleIgnoreTestSuites$1.evaluate(TestRuleIgnoreTestSuites.java:55)
>         at com.carrotsearch.randomizedtesting.RandomizedRunner.runSuite(RandomizedRunner.java:605)
>         at com.carrotsearch.randomizedtesting.RandomizedRunner.access$400(RandomizedRunner.java:132)
>         at com.carrotsearch.randomizedtesting.RandomizedRunner$2.run(RandomizedRunner.java:551)
>
>
> REGRESSION:  org.apache.lucene.index.TestIndexWriterDelete.testFlushPushedDeletesByRAM
>
> Error Message:
>
>
> Stack Trace:
> java.lang.AssertionError
>         at __randomizedtesting.SeedInfo.seed([D686D14F0587EBAE:C271ABC8445B5D33]:0)
>         at org.apache.lucene.util.packed.GrowableWriter.ensureCapacity(GrowableWriter.java:70)
>         at org.apache.lucene.util.packed.GrowableWriter.set(GrowableWriter.java:83)
>         at org.apache.lucene.util.fst.FST.pack(FST.java:1505)
>         at org.apache.lucene.codecs.memory.MemoryPostingsFormat$TermsWriter.finish(MemoryPostingsFormat.java:273)
>         at org.apache.lucene.index.FreqProxTermsWriterPerField.flush(FreqProxTermsWriterPerField.java:550)
>         at org.apache.lucene.index.FreqProxTermsWriter.flush(FreqProxTermsWriter.java:85)
>         at org.apache.lucene.index.TermsHash.flush(TermsHash.java:117)
>         at org.apache.lucene.index.DocInverter.flush(DocInverter.java:53)
>         at org.apache.lucene.index.DocFieldProcessor.flush(DocFieldProcessor.java:82)
>         at org.apache.lucene.index.DocumentsWriterPerThread.flush(DocumentsWriterPerThread.java:481)
>         at org.apache.lucene.index.DocumentsWriter.doFlush(DocumentsWriter.java:420)
>         at org.apache.lucene.index.DocumentsWriter.postUpdate(DocumentsWriter.java:314)
>         at org.apache.lucene.index.DocumentsWriter.updateDocument(DocumentsWriter.java:387)
>         at org.apache.lucene.index.IndexWriter.updateDocument(IndexWriter.java:1356)
>         at org.apache.lucene.index.IndexWriter.updateDocument(IndexWriter.java:1328)
>         at org.apache.lucene.index.TestIndexWriterDelete.testFlushPushedDeletesByRAM(TestIndexWriterDelete.java:962)
>         at sun.reflect.NativeMethodAccessorImpl.invoke0(Native Method)
>         at sun.reflect.NativeMethodAccessorImpl.invoke(NativeMethodAccessorImpl.java:88)
>         at sun.reflect.DelegatingMethodAccessorImpl.invoke(DelegatingMethodAccessorImpl.java:55)
>         at java.lang.reflect.Method.invoke(Method.java:613)
>         at com.carrotsearch.randomizedtesting.RandomizedRunner.invoke(RandomizedRunner.java:1995)
>         at com.carrotsearch.randomizedtesting.RandomizedRunner.access$1100(RandomizedRunner.java:132)
>         at com.carrotsearch.randomizedtesting.RandomizedRunner$6.evaluate(RandomizedRunner.java:818)
>         at com.carrotsearch.randomizedtesting.RandomizedRunner$7.evaluate(RandomizedRunner.java:877)
>         at com.carrotsearch.randomizedtesting.RandomizedRunner$8.evaluate(RandomizedRunner.java:891)
>         at org.apache.lucene.util.TestRuleSetupTeardownChained$1.evaluate(TestRuleSetupTeardownChained.java:50)
>         at org.apache.lucene.util.TestRuleFieldCacheSanity$1.evaluate(TestRuleFieldCacheSanity.java:32)
>         at org.apache.lucene.util.AbstractBeforeAfterRule$1.evaluate(AbstractBeforeAfterRule.java:45)
>         at com.carrotsearch.randomizedtesting.rules.SystemPropertiesInvariantRule$1.evaluate(SystemPropertiesInvariantRule.java:55)
>         at org.apache.lucene.util.TestRuleReportUncaughtExceptions$1.evaluate(TestRuleReportUncaughtExceptions.java:68)
>         at org.apache.lucene.util.TestRuleThreadAndTestName$1.evaluate(TestRuleThreadAndTestName.java:48)
>         at org.apache.lucene.util.TestRuleIgnoreAfterMaxFailures$1.evaluate(TestRuleIgnoreAfterMaxFailures.java:70)
>         at org.apache.lucene.util.TestRuleMarkFailure$1.evaluate(TestRuleMarkFailure.java:48)
>         at com.carrotsearch.randomizedtesting.RandomizedRunner.runSingleTest(RandomizedRunner.java:825)
>         at com.carrotsearch.randomizedtesting.RandomizedRunner.access$700(RandomizedRunner.java:132)
>         at com.carrotsearch.randomizedtesting.RandomizedRunner$3$1.run(RandomizedRunner.java:671)
>         at com.carrotsearch.randomizedtesting.RandomizedRunner$3.evaluate(RandomizedRunner.java:697)
>         at com.carrotsearch.randomizedtesting.RandomizedRunner$4.evaluate(RandomizedRunner.java:736)
>         at com.carrotsearch.randomizedtesting.RandomizedRunner$5.evaluate(RandomizedRunner.java:747)
>         at org.apache.lucene.util.AbstractBeforeAfterRule$1.evaluate(AbstractBeforeAfterRule.java:45)
>         at org.apache.lucene.util.TestRuleReportUncaughtExceptions$1.evaluate(TestRuleReportUncaughtExceptions.java:68)
>         at org.apache.lucene.util.TestRuleStoreClassName$1.evaluate(TestRuleStoreClassName.java:38)
>         at com.carrotsearch.randomizedtesting.rules.SystemPropertiesInvariantRule$1.evaluate(SystemPropertiesInvariantRule.java:55)
>         at org.apache.lucene.util.TestRuleNoInstanceHooksOverrides$1.evaluate(TestRuleNoInstanceHooksOverrides.java:53)
>         at org.apache.lucene.util.TestRuleNoStaticHooksShadowing$1.evaluate(TestRuleNoStaticHooksShadowing.java:52)
>         at org.apache.lucene.util.TestRuleAssertionsRequired$1.evaluate(TestRuleAssertionsRequired.java:36)
>         at org.apache.lucene.util.TestRuleMarkFailure$1.evaluate(TestRuleMarkFailure.java:48)
>         at org.apache.lucene.util.TestRuleIgnoreAfterMaxFailures$1.evaluate(TestRuleIgnoreAfterMaxFailures.java:70)
>         at org.apache.lucene.util.TestRuleIgnoreTestSuites$1.evaluate(TestRuleIgnoreTestSuites.java:55)
>         at com.carrotsearch.randomizedtesting.RandomizedRunner.runSuite(RandomizedRunner.java:605)
>         at com.carrotsearch.randomizedtesting.RandomizedRunner.access$400(RandomizedRunner.java:132)
>         at com.carrotsearch.randomizedtesting.RandomizedRunner$2.run(RandomizedRunner.java:551)
>
>
> REGRESSION:  org.apache.lucene.index.TestIndexWriterDelete.testDeleteAllSlowly
>
> Error Message:
>
>
> Stack Trace:
> java.lang.AssertionError
>         at __randomizedtesting.SeedInfo.seed([D686D14F0587EBAE:258A81E77027BF56]:0)
>         at org.apache.lucene.util.packed.GrowableWriter.ensureCapacity(GrowableWriter.java:70)
>         at org.apache.lucene.util.packed.GrowableWriter.set(GrowableWriter.java:83)
>         at org.apache.lucene.util.fst.FST.pack(FST.java:1505)
>         at org.apache.lucene.codecs.memory.MemoryPostingsFormat$TermsWriter.finish(MemoryPostingsFormat.java:273)
>         at org.apache.lucene.codecs.TermsConsumer.merge(TermsConsumer.java:213)
>         at org.apache.lucene.codecs.FieldsConsumer.merge(FieldsConsumer.java:65)
>         at org.apache.lucene.index.SegmentMerger.mergeTerms(SegmentMerger.java:323)
>         at org.apache.lucene.index.SegmentMerger.merge(SegmentMerger.java:110)
>         at org.apache.lucene.index.IndexWriter.mergeMiddle(IndexWriter.java:3539)
>         at org.apache.lucene.index.IndexWriter.merge(IndexWriter.java:3154)
>         at org.apache.lucene.index.SerialMergeScheduler.merge(SerialMergeScheduler.java:36)
>         at org.apache.lucene.index.IndexWriter.maybeMerge(IndexWriter.java:1727)
>         at org.apache.lucene.index.IndexWriter.maybeMerge(IndexWriter.java:1721)
>         at org.apache.lucene.index.IndexWriter.updateDocument(IndexWriter.java:1367)
>         at org.apache.lucene.index.IndexWriter.addDocument(IndexWriter.java:1107)
>         at org.apache.lucene.index.RandomIndexWriter.addDocument(RandomIndexWriter.java:186)
>         at org.apache.lucene.index.RandomIndexWriter.addDocument(RandomIndexWriter.java:145)
>         at org.apache.lucene.index.TestIndexWriterDelete.testDeleteAllSlowly(TestIndexWriterDelete.java:873)
>         at sun.reflect.NativeMethodAccessorImpl.invoke0(Native Method)
>         at sun.reflect.NativeMethodAccessorImpl.invoke(NativeMethodAccessorImpl.java:88)
>         at sun.reflect.DelegatingMethodAccessorImpl.invoke(DelegatingMethodAccessorImpl.java:55)
>         at java.lang.reflect.Method.invoke(Method.java:613)
>         at com.carrotsearch.randomizedtesting.RandomizedRunner.invoke(RandomizedRunner.java:1995)
>         at com.carrotsearch.randomizedtesting.RandomizedRunner.access$1100(RandomizedRunner.java:132)
>         at com.carrotsearch.randomizedtesting.RandomizedRunner$6.evaluate(RandomizedRunner.java:818)
>         at com.carrotsearch.randomizedtesting.RandomizedRunner$7.evaluate(RandomizedRunner.java:877)
>         at com.carrotsearch.randomizedtesting.RandomizedRunner$8.evaluate(RandomizedRunner.java:891)
>         at org.apache.lucene.util.TestRuleSetupTeardownChained$1.evaluate(TestRuleSetupTeardownChained.java:50)
>         at org.apache.lucene.util.TestRuleFieldCacheSanity$1.evaluate(TestRuleFieldCacheSanity.java:32)
>         at org.apache.lucene.util.AbstractBeforeAfterRule$1.evaluate(AbstractBeforeAfterRule.java:45)
>         at com.carrotsearch.randomizedtesting.rules.SystemPropertiesInvariantRule$1.evaluate(SystemPropertiesInvariantRule.java:55)
>         at org.apache.lucene.util.TestRuleReportUncaughtExceptions$1.evaluate(TestRuleReportUncaughtExceptions.java:68)
>         at org.apache.lucene.util.TestRuleThreadAndTestName$1.evaluate(TestRuleThreadAndTestName.java:48)
>         at org.apache.lucene.util.TestRuleIgnoreAfterMaxFailures$1.evaluate(TestRuleIgnoreAfterMaxFailures.java:70)
>         at org.apache.lucene.util.TestRuleMarkFailure$1.evaluate(TestRuleMarkFailure.java:48)
>         at com.carrotsearch.randomizedtesting.RandomizedRunner.runSingleTest(RandomizedRunner.java:825)
>         at com.carrotsearch.randomizedtesting.RandomizedRunner.access$700(RandomizedRunner.java:132)
>         at com.carrotsearch.randomizedtesting.RandomizedRunner$3$1.run(RandomizedRunner.java:671)
>         at com.carrotsearch.randomizedtesting.RandomizedRunner$3.evaluate(RandomizedRunner.java:697)
>         at com.carrotsearch.randomizedtesting.RandomizedRunner$4.evaluate(RandomizedRunner.java:736)
>         at com.carrotsearch.randomizedtesting.RandomizedRunner$5.evaluate(RandomizedRunner.java:747)
>         at org.apache.lucene.util.AbstractBeforeAfterRule$1.evaluate(AbstractBeforeAfterRule.java:45)
>         at org.apache.lucene.util.TestRuleReportUncaughtExceptions$1.evaluate(TestRuleReportUncaughtExceptions.java:68)
>         at org.apache.lucene.util.TestRuleStoreClassName$1.evaluate(TestRuleStoreClassName.java:38)
>         at com.carrotsearch.randomizedtesting.rules.SystemPropertiesInvariantRule$1.evaluate(SystemPropertiesInvariantRule.java:55)
>         at org.apache.lucene.util.TestRuleNoInstanceHooksOverrides$1.evaluate(TestRuleNoInstanceHooksOverrides.java:53)
>         at org.apache.lucene.util.TestRuleNoStaticHooksShadowing$1.evaluate(TestRuleNoStaticHooksShadowing.java:52)
>         at org.apache.lucene.util.TestRuleAssertionsRequired$1.evaluate(TestRuleAssertionsRequired.java:36)
>         at org.apache.lucene.util.TestRuleMarkFailure$1.evaluate(TestRuleMarkFailure.java:48)
>         at org.apache.lucene.util.TestRuleIgnoreAfterMaxFailures$1.evaluate(TestRuleIgnoreAfterMaxFailures.java:70)
>         at org.apache.lucene.util.TestRuleIgnoreTestSuites$1.evaluate(TestRuleIgnoreTestSuites.java:55)
>         at com.carrotsearch.randomizedtesting.RandomizedRunner.runSuite(RandomizedRunner.java:605)
>         at com.carrotsearch.randomizedtesting.RandomizedRunner.access$400(RandomizedRunner.java:132)
>         at com.carrotsearch.randomizedtesting.RandomizedRunner$2.run(RandomizedRunner.java:551)
>
>
> REGRESSION:  org.apache.lucene.index.TestIndexWriterDelete.testUpdatesOnDiskFull
>
> Error Message:
>
>
> Stack Trace:
> java.lang.AssertionError
>         at __randomizedtesting.SeedInfo.seed([D686D14F0587EBAE:B260177CA18D4408]:0)
>         at org.apache.lucene.util.packed.GrowableWriter.ensureCapacity(GrowableWriter.java:70)
>         at org.apache.lucene.util.packed.GrowableWriter.set(GrowableWriter.java:83)
>         at org.apache.lucene.util.fst.FST.pack(FST.java:1505)
>         at org.apache.lucene.codecs.memory.MemoryPostingsFormat$TermsWriter.finish(MemoryPostingsFormat.java:273)
>         at org.apache.lucene.index.FreqProxTermsWriterPerField.flush(FreqProxTermsWriterPerField.java:550)
>         at org.apache.lucene.index.FreqProxTermsWriter.flush(FreqProxTermsWriter.java:85)
>         at org.apache.lucene.index.TermsHash.flush(TermsHash.java:117)
>         at org.apache.lucene.index.DocInverter.flush(DocInverter.java:53)
>         at org.apache.lucene.index.DocFieldProcessor.flush(DocFieldProcessor.java:82)
>         at org.apache.lucene.index.DocumentsWriterPerThread.flush(DocumentsWriterPerThread.java:481)
>         at org.apache.lucene.index.DocumentsWriter.doFlush(DocumentsWriter.java:420)
>         at org.apache.lucene.index.DocumentsWriter.flushAllThreads(DocumentsWriter.java:552)
>         at org.apache.lucene.index.IndexWriter.doFlush(IndexWriter.java:2791)
>         at org.apache.lucene.index.IndexWriter.flush(IndexWriter.java:2767)
>         at org.apache.lucene.index.IndexWriter.closeInternal(IndexWriter.java:890)
>         at org.apache.lucene.index.IndexWriter.close(IndexWriter.java:845)
>         at org.apache.lucene.index.IndexWriter.close(IndexWriter.java:807)
>         at org.apache.lucene.index.TestIndexWriterDelete.doTestOperationsOnDiskFull(TestIndexWriterDelete.java:439)
>         at org.apache.lucene.index.TestIndexWriterDelete.testUpdatesOnDiskFull(TestIndexWriterDelete.java:415)
>         at sun.reflect.NativeMethodAccessorImpl.invoke0(Native Method)
>         at sun.reflect.NativeMethodAccessorImpl.invoke(NativeMethodAccessorImpl.java:88)
>         at sun.reflect.DelegatingMethodAccessorImpl.invoke(DelegatingMethodAccessorImpl.java:55)
>         at java.lang.reflect.Method.invoke(Method.java:613)
>         at com.carrotsearch.randomizedtesting.RandomizedRunner.invoke(RandomizedRunner.java:1995)
>         at com.carrotsearch.randomizedtesting.RandomizedRunner.access$1100(RandomizedRunner.java:132)
>         at com.carrotsearch.randomizedtesting.RandomizedRunner$6.evaluate(RandomizedRunner.java:818)
>         at com.carrotsearch.randomizedtesting.RandomizedRunner$7.evaluate(RandomizedRunner.java:877)
>         at com.carrotsearch.randomizedtesting.RandomizedRunner$8.evaluate(RandomizedRunner.java:891)
>         at org.apache.lucene.util.TestRuleSetupTeardownChained$1.evaluate(TestRuleSetupTeardownChained.java:50)
>         at org.apache.lucene.util.TestRuleFieldCacheSanity$1.evaluate(TestRuleFieldCacheSanity.java:32)
>         at org.apache.lucene.util.AbstractBeforeAfterRule$1.evaluate(AbstractBeforeAfterRule.java:45)
>         at com.carrotsearch.randomizedtesting.rules.SystemPropertiesInvariantRule$1.evaluate(SystemPropertiesInvariantRule.java:55)
>         at org.apache.lucene.util.TestRuleReportUncaughtExceptions$1.evaluate(TestRuleReportUncaughtExceptions.java:68)
>         at org.apache.lucene.util.TestRuleThreadAndTestName$1.evaluate(TestRuleThreadAndTestName.java:48)
>         at org.apache.lucene.util.TestRuleIgnoreAfterMaxFailures$1.evaluate(TestRuleIgnoreAfterMaxFailures.java:70)
>         at org.apache.lucene.util.TestRuleMarkFailure$1.evaluate(TestRuleMarkFailure.java:48)
>         at com.carrotsearch.randomizedtesting.RandomizedRunner.runSingleTest(RandomizedRunner.java:825)
>         at com.carrotsearch.randomizedtesting.RandomizedRunner.access$700(RandomizedRunner.java:132)
>         at com.carrotsearch.randomizedtesting.RandomizedRunner$3$1.run(RandomizedRunner.java:671)
>         at com.carrotsearch.randomizedtesting.RandomizedRunner$3.evaluate(RandomizedRunner.java:697)
>         at com.carrotsearch.randomizedtesting.RandomizedRunner$4.evaluate(RandomizedRunner.java:736)
>         at com.carrotsearch.randomizedtesting.RandomizedRunner$5.evaluate(RandomizedRunner.java:747)
>         at org.apache.lucene.util.AbstractBeforeAfterRule$1.evaluate(AbstractBeforeAfterRule.java:45)
>         at org.apache.lucene.util.TestRuleReportUncaughtExceptions$1.evaluate(TestRuleReportUncaughtExceptions.java:68)
>         at org.apache.lucene.util.TestRuleStoreClassName$1.evaluate(TestRuleStoreClassName.java:38)
>         at com.carrotsearch.randomizedtesting.rules.SystemPropertiesInvariantRule$1.evaluate(SystemPropertiesInvariantRule.java:55)
>         at org.apache.lucene.util.TestRuleNoInstanceHooksOverrides$1.evaluate(TestRuleNoInstanceHooksOverrides.java:53)
>         at org.apache.lucene.util.TestRuleNoStaticHooksShadowing$1.evaluate(TestRuleNoStaticHooksShadowing.java:52)
>         at org.apache.lucene.util.TestRuleAssertionsRequired$1.evaluate(TestRuleAssertionsRequired.java:36)
>         at org.apache.lucene.util.TestRuleMarkFailure$1.evaluate(TestRuleMarkFailure.java:48)
>         at org.apache.lucene.util.TestRuleIgnoreAfterMaxFailures$1.evaluate(TestRuleIgnoreAfterMaxFailures.java:70)
>         at org.apache.lucene.util.TestRuleIgnoreTestSuites$1.evaluate(TestRuleIgnoreTestSuites.java:55)
>         at com.carrotsearch.randomizedtesting.RandomizedRunner.runSuite(RandomizedRunner.java:605)
>         at com.carrotsearch.randomizedtesting.RandomizedRunner.access$400(RandomizedRunner.java:132)
>         at com.carrotsearch.randomizedtesting.RandomizedRunner$2.run(RandomizedRunner.java:551)
>
>
>
>
> Build Log:
> [...truncated 777 lines...]
> [junit4:junit4] Suite: org.apache.lucene.index.TestIndexWriterDelete
> [junit4:junit4] FAILURE 0.03s J0 | TestIndexWriterDelete.testFlushPushedDeletesByCount
> [junit4:junit4]    > Throwable #1: java.lang.AssertionError
> [junit4:junit4]    >    at __randomizedtesting.SeedInfo.seed([D686D14F0587EBAE:F4532A6A4A100B94]:0)
> [junit4:junit4]    >    at org.apache.lucene.util.packed.GrowableWriter.ensureCapacity(GrowableWriter.java:70)
> [junit4:junit4]    >    at org.apache.lucene.util.packed.GrowableWriter.set(GrowableWriter.java:83)
> [junit4:junit4]    >    at org.apache.lucene.util.fst.FST.pack(FST.java:1505)
> [junit4:junit4]    >    at org.apache.lucene.codecs.memory.MemoryPostingsFormat$TermsWriter.finish(MemoryPostingsFormat.java:273)
> [junit4:junit4]    >    at org.apache.lucene.index.FreqProxTermsWriterPerField.flush(FreqProxTermsWriterPerField.java:550)
> [junit4:junit4]    >    at org.apache.lucene.index.FreqProxTermsWriter.flush(FreqProxTermsWriter.java:85)
> [junit4:junit4]    >    at org.apache.lucene.index.TermsHash.flush(TermsHash.java:117)
> [junit4:junit4]    >    at org.apache.lucene.index.DocInverter.flush(DocInverter.java:53)
> [junit4:junit4]    >    at org.apache.lucene.index.DocFieldProcessor.flush(DocFieldProcessor.java:82)
> [junit4:junit4]    >    at org.apache.lucene.index.DocumentsWriterPerThread.flush(DocumentsWriterPerThread.java:481)
> [junit4:junit4]    >    at org.apache.lucene.index.DocumentsWriter.doFlush(DocumentsWriter.java:420)
> [junit4:junit4]    >    at org.apache.lucene.index.DocumentsWriter.postUpdate(DocumentsWriter.java:314)
> [junit4:junit4]    >    at org.apache.lucene.index.DocumentsWriter.updateDocument(DocumentsWriter.java:387)
> [junit4:junit4]    >    at org.apache.lucene.index.IndexWriter.updateDocument(IndexWriter.java:1356)
> [junit4:junit4]    >    at org.apache.lucene.index.IndexWriter.updateDocument(IndexWriter.java:1328)
> [junit4:junit4]    >    at org.apache.lucene.index.TestIndexWriterDelete.testFlushPushedDeletesByCount(TestIndexWriterDelete.java:1008)
> [junit4:junit4]    >    at sun.reflect.NativeMethodAccessorImpl.invoke0(Native Method)
> [junit4:junit4]    >    at sun.reflect.NativeMethodAccessorImpl.invoke(NativeMethodAccessorImpl.java:88)
> [junit4:junit4]    >    at sun.reflect.DelegatingMethodAccessorImpl.invoke(DelegatingMethodAccessorImpl.java:55)
> [junit4:junit4]    >    at java.lang.reflect.Method.invoke(Method.java:613)
> [junit4:junit4]    >    at com.carrotsearch.randomizedtesting.RandomizedRunner.invoke(RandomizedRunner.java:1995)
> [junit4:junit4]    >    at com.carrotsearch.randomizedtesting.RandomizedRunner.access$1100(RandomizedRunner.java:132)
> [junit4:junit4]    >    at com.carrotsearch.randomizedtesting.RandomizedRunner$6.evaluate(RandomizedRunner.java:818)
> [junit4:junit4]    >    at com.carrotsearch.randomizedtesting.RandomizedRunner$7.evaluate(RandomizedRunner.java:877)
> [junit4:junit4]    >    at com.carrotsearch.randomizedtesting.RandomizedRunner$8.evaluate(RandomizedRunner.java:891)
> [junit4:junit4]    >    at org.apache.lucene.util.TestRuleSetupTeardownChained$1.evaluate(TestRuleSetupTeardownChained.java:50)
> [junit4:junit4]    >    at org.apache.lucene.util.TestRuleFieldCacheSanity$1.evaluate(TestRuleFieldCacheSanity.java:32)
> [junit4:junit4]    >    at org.apache.lucene.util.AbstractBeforeAfterRule$1.evaluate(AbstractBeforeAfterRule.java:45)
> [junit4:junit4]    >    at com.carrotsearch.randomizedtesting.rules.SystemPropertiesInvariantRule$1.evaluate(SystemPropertiesInvariantRule.java:55)
> [junit4:junit4]    >    at org.apache.lucene.util.TestRuleReportUncaughtExceptions$1.evaluate(TestRuleReportUncaughtExceptions.java:68)
> [junit4:junit4]    >    at org.apache.lucene.util.TestRuleThreadAndTestName$1.evaluate(TestRuleThreadAndTestName.java:48)
> [junit4:junit4]    >    at org.apache.lucene.util.TestRuleIgnoreAfterMaxFailures$1.evaluate(TestRuleIgnoreAfterMaxFailures.java:70)
> [junit4:junit4]    >    at org.apache.lucene.util.TestRuleMarkFailure$1.evaluate(TestRuleMarkFailure.java:48)
> [junit4:junit4]    >    at com.carrotsearch.randomizedtesting.RandomizedRunner.runSingleTest(RandomizedRunner.java:825)
> [junit4:junit4]    >    at com.carrotsearch.randomizedtesting.RandomizedRunner.access$700(RandomizedRunner.java:132)
> [junit4:junit4]    >    at com.carrotsearch.randomizedtesting.RandomizedRunner$3$1.run(RandomizedRunner.java:671)
> [junit4:junit4]    >    at com.carrotsearch.randomizedtesting.RandomizedRunner$3.evaluate(RandomizedRunner.java:697)
> [junit4:junit4]    >    at com.carrotsearch.randomizedtesting.RandomizedRunner$4.evaluate(RandomizedRunner.java:736)
> [junit4:junit4]    >    at com.carrotsearch.randomizedtesting.RandomizedRunner$5.evaluate(RandomizedRunner.java:747)
> [junit4:junit4]    >    at org.apache.lucene.util.AbstractBeforeAfterRule$1.evaluate(AbstractBeforeAfterRule.java:45)
> [junit4:junit4]    >    at org.apache.lucene.util.TestRuleReportUncaughtExceptions$1.evaluate(TestRuleReportUncaughtExceptions.java:68)
> [junit4:junit4]    >    at org.apache.lucene.util.TestRuleStoreClassName$1.evaluate(TestRuleStoreClassName.java:38)
> [junit4:junit4]    >    at com.carrotsearch.randomizedtesting.rules.SystemPropertiesInvariantRule$1.evaluate(SystemPropertiesInvariantRule.java:55)
> [junit4:junit4]    >    at org.apache.lucene.util.TestRuleNoInstanceHooksOverrides$1.evaluate(TestRuleNoInstanceHooksOverrides.java:53)
> [junit4:junit4]    >    at org.apache.lucene.util.TestRuleNoStaticHooksShadowing$1.evaluate(TestRuleNoStaticHooksShadowing.java:52)
> [junit4:junit4]    >    at org.apache.lucene.util.TestRuleAssertionsRequired$1.evaluate(TestRuleAssertionsRequired.java:36)
> [junit4:junit4]    >    at org.apache.lucene.util.TestRuleMarkFailure$1.evaluate(TestRuleMarkFailure.java:48)
> [junit4:junit4]    >    at org.apache.lucene.util.TestRuleIgnoreAfterMaxFailures$1.evaluate(TestRuleIgnoreAfterMaxFailures.java:70)
> [junit4:junit4]    >    at org.apache.lucene.util.TestRuleIgnoreTestSuites$1.evaluate(TestRuleIgnoreTestSuites.java:55)
> [junit4:junit4]    >    at com.carrotsearch.randomizedtesting.RandomizedRunner.runSuite(RandomizedRunner.java:605)
> [junit4:junit4]    >    at com.carrotsearch.randomizedtesting.RandomizedRunner.access$400(RandomizedRunner.java:132)
> [junit4:junit4]    >    at com.carrotsearch.randomizedtesting.RandomizedRunner$2.run(RandomizedRunner.java:551)
> [junit4:junit4]    >
> [junit4:junit4]   2> NOTE: reproduce with: ant test  -Dtestcase=TestIndexWriterDelete -Dtests.method=testFlushPushedDeletesByCount -Dtests.seed=D686D14F0587EBAE -Dtests.multiplier=3 -Dtests.slow=true -Dtests.locale=th_TH -Dtests.timezone=Australia/LHI -Dtests.file.encoding=UTF-8
> [junit4:junit4]   2>
> [junit4:junit4] FAILURE 0.01s J0 | TestIndexWriterDelete.testDeletesOnDiskFull
> [junit4:junit4]    > Throwable #1: java.lang.AssertionError
> [junit4:junit4]    >    at __randomizedtesting.SeedInfo.seed([D686D14F0587EBAE:C63DE115830F7542]:0)
> [junit4:junit4]    >    at org.apache.lucene.util.packed.GrowableWriter.ensureCapacity(GrowableWriter.java:70)
> [junit4:junit4]    >    at org.apache.lucene.util.packed.GrowableWriter.set(GrowableWriter.java:83)
> [junit4:junit4]    >    at org.apache.lucene.util.fst.FST.pack(FST.java:1505)
> [junit4:junit4]    >    at org.apache.lucene.codecs.memory.MemoryPostingsFormat$TermsWriter.finish(MemoryPostingsFormat.java:273)
> [junit4:junit4]    >    at org.apache.lucene.index.FreqProxTermsWriterPerField.flush(FreqProxTermsWriterPerField.java:550)
> [junit4:junit4]    >    at org.apache.lucene.index.FreqProxTermsWriter.flush(FreqProxTermsWriter.java:85)
> [junit4:junit4]    >    at org.apache.lucene.index.TermsHash.flush(TermsHash.java:117)
> [junit4:junit4]    >    at org.apache.lucene.index.DocInverter.flush(DocInverter.java:53)
> [junit4:junit4]    >    at org.apache.lucene.index.DocFieldProcessor.flush(DocFieldProcessor.java:82)
> [junit4:junit4]    >    at org.apache.lucene.index.DocumentsWriterPerThread.flush(DocumentsWriterPerThread.java:481)
> [junit4:junit4]    >    at org.apache.lucene.index.DocumentsWriter.doFlush(DocumentsWriter.java:420)
> [junit4:junit4]    >    at org.apache.lucene.index.DocumentsWriter.flushAllThreads(DocumentsWriter.java:552)
> [junit4:junit4]    >    at org.apache.lucene.index.IndexWriter.doFlush(IndexWriter.java:2791)
> [junit4:junit4]    >    at org.apache.lucene.index.IndexWriter.flush(IndexWriter.java:2767)
> [junit4:junit4]    >    at org.apache.lucene.index.IndexWriter.closeInternal(IndexWriter.java:890)
> [junit4:junit4]    >    at org.apache.lucene.index.IndexWriter.close(IndexWriter.java:845)
> [junit4:junit4]    >    at org.apache.lucene.index.IndexWriter.close(IndexWriter.java:807)
> [junit4:junit4]    >    at org.apache.lucene.index.TestIndexWriterDelete.doTestOperationsOnDiskFull(TestIndexWriterDelete.java:439)
> [junit4:junit4]    >    at org.apache.lucene.index.TestIndexWriterDelete.testDeletesOnDiskFull(TestIndexWriterDelete.java:411)
> [junit4:junit4]    >    at sun.reflect.NativeMethodAccessorImpl.invoke0(Native Method)
> [junit4:junit4]    >    at sun.reflect.NativeMethodAccessorImpl.invoke(NativeMethodAccessorImpl.java:88)
> [junit4:junit4]    >    at sun.reflect.DelegatingMethodAccessorImpl.invoke(DelegatingMethodAccessorImpl.java:55)
> [junit4:junit4]    >    at java.lang.reflect.Method.invoke(Method.java:613)
> [junit4:junit4]    >    at com.carrotsearch.randomizedtesting.RandomizedRunner.invoke(RandomizedRunner.java:1995)
> [junit4:junit4]    >    at com.carrotsearch.randomizedtesting.RandomizedRunner.access$1100(RandomizedRunner.java:132)
> [junit4:junit4]    >    at com.carrotsearch.randomizedtesting.RandomizedRunner$6.evaluate(RandomizedRunner.java:818)
> [junit4:junit4]    >    at com.carrotsearch.randomizedtesting.RandomizedRunner$7.evaluate(RandomizedRunner.java:877)
> [junit4:junit4]    >    at com.carrotsearch.randomizedtesting.RandomizedRunner$8.evaluate(RandomizedRunner.java:891)
> [junit4:junit4]    >    at org.apache.lucene.util.TestRuleSetupTeardownChained$1.evaluate(TestRuleSetupTeardownChained.java:50)
> [junit4:junit4]    >    at org.apache.lucene.util.TestRuleFieldCacheSanity$1.evaluate(TestRuleFieldCacheSanity.java:32)
> [junit4:junit4]    >    at org.apache.lucene.util.AbstractBeforeAfterRule$1.evaluate(AbstractBeforeAfterRule.java:45)
> [junit4:junit4]    >    at com.carrotsearch.randomizedtesting.rules.SystemPropertiesInvariantRule$1.evaluate(SystemPropertiesInvariantRule.java:55)
> [junit4:junit4]    >    at org.apache.lucene.util.TestRuleReportUncaughtExceptions$1.evaluate(TestRuleReportUncaughtExceptions.java:68)
> [junit4:junit4]    >    at org.apache.lucene.util.TestRuleThreadAndTestName$1.evaluate(TestRuleThreadAndTestName.java:48)
> [junit4:junit4]    >    at org.apache.lucene.util.TestRuleIgnoreAfterMaxFailures$1.evaluate(TestRuleIgnoreAfterMaxFailures.java:70)
> [junit4:junit4]    >    at org.apache.lucene.util.TestRuleMarkFailure$1.evaluate(TestRuleMarkFailure.java:48)
> [junit4:junit4]    >    at com.carrotsearch.randomizedtesting.RandomizedRunner.runSingleTest(RandomizedRunner.java:825)
> [junit4:junit4]    >    at com.carrotsearch.randomizedtesting.RandomizedRunner.access$700(RandomizedRunner.java:132)
> [junit4:junit4]    >    at com.carrotsearch.randomizedtesting.RandomizedRunner$3$1.run(RandomizedRunner.java:671)
> [junit4:junit4]    >    at com.carrotsearch.randomizedtesting.RandomizedRunner$3.evaluate(RandomizedRunner.java:697)
> [junit4:junit4]    >    at com.carrotsearch.randomizedtesting.RandomizedRunner$4.evaluate(RandomizedRunner.java:736)
> [junit4:junit4]    >    at com.carrotsearch.randomizedtesting.RandomizedRunner$5.evaluate(RandomizedRunner.java:747)
> [junit4:junit4]    >    at org.apache.lucene.util.AbstractBeforeAfterRule$1.evaluate(AbstractBeforeAfterRule.java:45)
> [junit4:junit4]    >    at org.apache.lucene.util.TestRuleReportUncaughtExceptions$1.evaluate(TestRuleReportUncaughtExceptions.java:68)
> [junit4:junit4]    >    at org.apache.lucene.util.TestRuleStoreClassName$1.evaluate(TestRuleStoreClassName.java:38)
> [junit4:junit4]    >    at com.carrotsearch.randomizedtesting.rules.SystemPropertiesInvariantRule$1.evaluate(SystemPropertiesInvariantRule.java:55)
> [junit4:junit4]    >    at org.apache.lucene.util.TestRuleNoInstanceHooksOverrides$1.evaluate(TestRuleNoInstanceHooksOverrides.java:53)
> [junit4:junit4]    >    at org.apache.lucene.util.TestRuleNoStaticHooksShadowing$1.evaluate(TestRuleNoStaticHooksShadowing.java:52)
> [junit4:junit4]    >    at org.apache.lucene.util.TestRuleAssertionsRequired$1.evaluate(TestRuleAssertionsRequired.java:36)
> [junit4:junit4]    >    at org.apache.lucene.util.TestRuleMarkFailure$1.evaluate(TestRuleMarkFailure.java:48)
> [junit4:junit4]    >    at org.apache.lucene.util.TestRuleIgnoreAfterMaxFailures$1.evaluate(TestRuleIgnoreAfterMaxFailures.java:70)
> [junit4:junit4]    >    at org.apache.lucene.util.TestRuleIgnoreTestSuites$1.evaluate(TestRuleIgnoreTestSuites.java:55)
> [junit4:junit4]    >    at com.carrotsearch.randomizedtesting.RandomizedRunner.runSuite(RandomizedRunner.java:605)
> [junit4:junit4]    >    at com.carrotsearch.randomizedtesting.RandomizedRunner.access$400(RandomizedRunner.java:132)
> [junit4:junit4]    >    at com.carrotsearch.randomizedtesting.RandomizedRunner$2.run(RandomizedRunner.java:551)
> [junit4:junit4]    >
> [junit4:junit4]   2> NOTE: reproduce with: ant test  -Dtestcase=TestIndexWriterDelete -Dtests.method=testDeletesOnDiskFull -Dtests.seed=D686D14F0587EBAE -Dtests.multiplier=3 -Dtests.slow=true -Dtests.locale=th_TH -Dtests.timezone=Australia/LHI -Dtests.file.encoding=UTF-8
> [junit4:junit4]   2>
> [junit4:junit4] FAILURE 0.01s J0 | TestIndexWriterDelete.testFlushPushedDeletesByRAM
> [junit4:junit4]    > Throwable #1: java.lang.AssertionError
> [junit4:junit4]    >    at __randomizedtesting.SeedInfo.seed([D686D14F0587EBAE:C271ABC8445B5D33]:0)
> [junit4:junit4]    >    at org.apache.lucene.util.packed.GrowableWriter.ensureCapacity(GrowableWriter.java:70)
> [junit4:junit4]    >    at org.apache.lucene.util.packed.GrowableWriter.set(GrowableWriter.java:83)
> [junit4:junit4]    >    at org.apache.lucene.util.fst.FST.pack(FST.java:1505)
> [junit4:junit4]    >    at org.apache.lucene.codecs.memory.MemoryPostingsFormat$TermsWriter.finish(MemoryPostingsFormat.java:273)
> [junit4:junit4]    >    at org.apache.lucene.index.FreqProxTermsWriterPerField.flush(FreqProxTermsWriterPerField.java:550)
> [junit4:junit4]    >    at org.apache.lucene.index.FreqProxTermsWriter.flush(FreqProxTermsWriter.java:85)
> [junit4:junit4]    >    at org.apache.lucene.index.TermsHash.flush(TermsHash.java:117)
> [junit4:junit4]    >    at org.apache.lucene.index.DocInverter.flush(DocInverter.java:53)
> [junit4:junit4]    >    at org.apache.lucene.index.DocFieldProcessor.flush(DocFieldProcessor.java:82)
> [junit4:junit4]    >    at org.apache.lucene.index.DocumentsWriterPerThread.flush(DocumentsWriterPerThread.java:481)
> [junit4:junit4]    >    at org.apache.lucene.index.DocumentsWriter.doFlush(DocumentsWriter.java:420)
> [junit4:junit4]    >    at org.apache.lucene.index.DocumentsWriter.postUpdate(DocumentsWriter.java:314)
> [junit4:junit4]    >    at org.apache.lucene.index.DocumentsWriter.updateDocument(DocumentsWriter.java:387)
> [junit4:junit4]    >    at org.apache.lucene.index.IndexWriter.updateDocument(IndexWriter.java:1356)
> [junit4:junit4]    >    at org.apache.lucene.index.IndexWriter.updateDocument(IndexWriter.java:1328)
> [junit4:junit4]    >    at org.apache.lucene.index.TestIndexWriterDelete.testFlushPushedDeletesByRAM(TestIndexWriterDelete.java:962)
> [junit4:junit4]    >    at sun.reflect.NativeMethodAccessorImpl.invoke0(Native Method)
> [junit4:junit4]    >    at sun.reflect.NativeMethodAccessorImpl.invoke(NativeMethodAccessorImpl.java:88)
> [junit4:junit4]    >    at sun.reflect.DelegatingMethodAccessorImpl.invoke(DelegatingMethodAccessorImpl.java:55)
> [junit4:junit4]    >    at java.lang.reflect.Method.invoke(Method.java:613)
> [junit4:junit4]    >    at com.carrotsearch.randomizedtesting.RandomizedRunner.invoke(RandomizedRunner.java:1995)
> [junit4:junit4]    >    at com.carrotsearch.randomizedtesting.RandomizedRunner.access$1100(RandomizedRunner.java:132)
> [junit4:junit4]    >    at com.carrotsearch.randomizedtesting.RandomizedRunner$6.evaluate(RandomizedRunner.java:818)
> [junit4:junit4]    >    at com.carrotsearch.randomizedtesting.RandomizedRunner$7.evaluate(RandomizedRunner.java:877)
> [junit4:junit4]    >    at com.carrotsearch.randomizedtesting.RandomizedRunner$8.evaluate(RandomizedRunner.java:891)
> [junit4:junit4]    >    at org.apache.lucene.util.TestRuleSetupTeardownChained$1.evaluate(TestRuleSetupTeardownChained.java:50)
> [junit4:junit4]    >    at org.apache.lucene.util.TestRuleFieldCacheSanity$1.evaluate(TestRuleFieldCacheSanity.java:32)
> [junit4:junit4]    >    at org.apache.lucene.util.AbstractBeforeAfterRule$1.evaluate(AbstractBeforeAfterRule.java:45)
> [junit4:junit4]    >    at com.carrotsearch.randomizedtesting.rules.SystemPropertiesInvariantRule$1.evaluate(SystemPropertiesInvariantRule.java:55)
> [junit4:junit4]    >    at org.apache.lucene.util.TestRuleReportUncaughtExceptions$1.evaluate(TestRuleReportUncaughtExceptions.java:68)
> [junit4:junit4]    >    at org.apache.lucene.util.TestRuleThreadAndTestName$1.evaluate(TestRuleThreadAndTestName.java:48)
> [junit4:junit4]    >    at org.apache.lucene.util.TestRuleIgnoreAfterMaxFailures$1.evaluate(TestRuleIgnoreAfterMaxFailures.java:70)
> [junit4:junit4]    >    at org.apache.lucene.util.TestRuleMarkFailure$1.evaluate(TestRuleMarkFailure.java:48)
> [junit4:junit4]    >    at com.carrotsearch.randomizedtesting.RandomizedRunner.runSingleTest(RandomizedRunner.java:825)
> [junit4:junit4]    >    at com.carrotsearch.randomizedtesting.RandomizedRunner.access$700(RandomizedRunner.java:132)
> [junit4:junit4]    >    at com.carrotsearch.randomizedtesting.RandomizedRunner$3$1.run(RandomizedRunner.java:671)
> [junit4:junit4]    >    at com.carrotsearch.randomizedtesting.RandomizedRunner$3.evaluate(RandomizedRunner.java:697)
> [junit4:junit4]    >    at com.carrotsearch.randomizedtesting.RandomizedRunner$4.evaluate(RandomizedRunner.java:736)
> [junit4:junit4]    >    at com.carrotsearch.randomizedtesting.RandomizedRunner$5.evaluate(RandomizedRunner.java:747)
> [junit4:junit4]    >    at org.apache.lucene.util.AbstractBeforeAfterRule$1.evaluate(AbstractBeforeAfterRule.java:45)
> [junit4:junit4]    >    at org.apache.lucene.util.TestRuleReportUncaughtExceptions$1.evaluate(TestRuleReportUncaughtExceptions.java:68)
> [junit4:junit4]    >    at org.apache.lucene.util.TestRuleStoreClassName$1.evaluate(TestRuleStoreClassName.java:38)
> [junit4:junit4]    >    at com.carrotsearch.randomizedtesting.rules.SystemPropertiesInvariantRule$1.evaluate(SystemPropertiesInvariantRule.java:55)
> [junit4:junit4]    >    at org.apache.lucene.util.TestRuleNoInstanceHooksOverrides$1.evaluate(TestRuleNoInstanceHooksOverrides.java:53)
> [junit4:junit4]    >    at org.apache.lucene.util.TestRuleNoStaticHooksShadowing$1.evaluate(TestRuleNoStaticHooksShadowing.java:52)
> [junit4:junit4]    >    at org.apache.lucene.util.TestRuleAssertionsRequired$1.evaluate(TestRuleAssertionsRequired.java:36)
> [junit4:junit4]    >    at org.apache.lucene.util.TestRuleMarkFailure$1.evaluate(TestRuleMarkFailure.java:48)
> [junit4:junit4]    >    at org.apache.lucene.util.TestRuleIgnoreAfterMaxFailures$1.evaluate(TestRuleIgnoreAfterMaxFailures.java:70)
> [junit4:junit4]    >    at org.apache.lucene.util.TestRuleIgnoreTestSuites$1.evaluate(TestRuleIgnoreTestSuites.java:55)
> [junit4:junit4]    >    at com.carrotsearch.randomizedtesting.RandomizedRunner.runSuite(RandomizedRunner.java:605)
> [junit4:junit4]    >    at com.carrotsearch.randomizedtesting.RandomizedRunner.access$400(RandomizedRunner.java:132)
> [junit4:junit4]    >    at com.carrotsearch.randomizedtesting.RandomizedRunner$2.run(RandomizedRunner.java:551)
> [junit4:junit4]    >
> [junit4:junit4]   2> NOTE: reproduce with: ant test  -Dtestcase=TestIndexWriterDelete -Dtests.method=testFlushPushedDeletesByRAM -Dtests.seed=D686D14F0587EBAE -Dtests.multiplier=3 -Dtests.slow=true -Dtests.locale=th_TH -Dtests.timezone=Australia/LHI -Dtests.file.encoding=UTF-8
> [junit4:junit4]   2>
> [junit4:junit4] FAILURE 0.06s J0 | TestIndexWriterDelete.testDeleteAllSlowly
> [junit4:junit4]    > Throwable #1: java.lang.AssertionError
> [junit4:junit4]    >    at __randomizedtesting.SeedInfo.seed([D686D14F0587EBAE:258A81E77027BF56]:0)
> [junit4:junit4]    >    at org.apache.lucene.util.packed.GrowableWriter.ensureCapacity(GrowableWriter.java:70)
> [junit4:junit4]    >    at org.apache.lucene.util.packed.GrowableWriter.set(GrowableWriter.java:83)
> [junit4:junit4]    >    at org.apache.lucene.util.fst.FST.pack(FST.java:1505)
> [junit4:junit4]    >    at org.apache.lucene.codecs.memory.MemoryPostingsFormat$TermsWriter.finish(MemoryPostingsFormat.java:273)
> [junit4:junit4]    >    at org.apache.lucene.codecs.TermsConsumer.merge(TermsConsumer.java:213)
> [junit4:junit4]    >    at org.apache.lucene.codecs.FieldsConsumer.merge(FieldsConsumer.java:65)
> [junit4:junit4]    >    at org.apache.lucene.index.SegmentMerger.mergeTerms(SegmentMerger.java:323)
> [junit4:junit4]    >    at org.apache.lucene.index.SegmentMerger.merge(SegmentMerger.java:110)
> [junit4:junit4]    >    at org.apache.lucene.index.IndexWriter.mergeMiddle(IndexWriter.java:3539)
> [junit4:junit4]    >    at org.apache.lucene.index.IndexWriter.merge(IndexWriter.java:3154)
> [junit4:junit4]    >    at org.apache.lucene.index.SerialMergeScheduler.merge(SerialMergeScheduler.java:36)
> [junit4:junit4]    >    at org.apache.lucene.index.IndexWriter.maybeMerge(IndexWriter.java:1727)
> [junit4:junit4]    >    at org.apache.lucene.index.IndexWriter.maybeMerge(IndexWriter.java:1721)
> [junit4:junit4]    >    at org.apache.lucene.index.IndexWriter.updateDocument(IndexWriter.java:1367)
> [junit4:junit4]    >    at org.apache.lucene.index.IndexWriter.addDocument(IndexWriter.java:1107)
> [junit4:junit4]    >    at org.apache.lucene.index.RandomIndexWriter.addDocument(RandomIndexWriter.java:186)
> [junit4:junit4]    >    at org.apache.lucene.index.RandomIndexWriter.addDocument(RandomIndexWriter.java:145)
> [junit4:junit4]    >    at org.apache.lucene.index.TestIndexWriterDelete.testDeleteAllSlowly(TestIndexWriterDelete.java:873)
> [junit4:junit4]    >    at sun.reflect.NativeMethodAccessorImpl.invoke0(Native Method)
> [junit4:junit4]    >    at sun.reflect.NativeMethodAccessorImpl.invoke(NativeMethodAccessorImpl.java:88)
> [junit4:junit4]    >    at sun.reflect.DelegatingMethodAccessorImpl.invoke(DelegatingMethodAccessorImpl.java:55)
> [junit4:junit4]    >    at java.lang.reflect.Method.invoke(Method.java:613)
> [junit4:junit4]    >    at com.carrotsearch.randomizedtesting.RandomizedRunner.invoke(RandomizedRunner.java:1995)
> [junit4:junit4]    >    at com.carrotsearch.randomizedtesting.RandomizedRunner.access$1100(RandomizedRunner.java:132)
> [junit4:junit4]    >    at com.carrotsearch.randomizedtesting.RandomizedRunner$6.evaluate(RandomizedRunner.java:818)
> [junit4:junit4]    >    at com.carrotsearch.randomizedtesting.RandomizedRunner$7.evaluate(RandomizedRunner.java:877)
> [junit4:junit4]    >    at com.carrotsearch.randomizedtesting.RandomizedRunner$8.evaluate(RandomizedRunner.java:891)
> [junit4:junit4]    >    at org.apache.lucene.util.TestRuleSetupTeardownChained$1.evaluate(TestRuleSetupTeardownChained.java:50)
> [junit4:junit4]    >    at org.apache.lucene.util.TestRuleFieldCacheSanity$1.evaluate(TestRuleFieldCacheSanity.java:32)
> [junit4:junit4]    >    at org.apache.lucene.util.AbstractBeforeAfterRule$1.evaluate(AbstractBeforeAfterRule.java:45)
> [junit4:junit4]    >    at com.carrotsearch.randomizedtesting.rules.SystemPropertiesInvariantRule$1.evaluate(SystemPropertiesInvariantRule.java:55)
> [junit4:junit4]    >    at org.apache.lucene.util.TestRuleReportUncaughtExceptions$1.evaluate(TestRuleReportUncaughtExceptions.java:68)
> [junit4:junit4]    >    at org.apache.lucene.util.TestRuleThreadAndTestName$1.evaluate(TestRuleThreadAndTestName.java:48)
> [junit4:junit4]    >    at org.apache.lucene.util.TestRuleIgnoreAfterMaxFailures$1.evaluate(TestRuleIgnoreAfterMaxFailures.java:70)
> [junit4:junit4]    >    at org.apache.lucene.util.TestRuleMarkFailure$1.evaluate(TestRuleMarkFailure.java:48)
> [junit4:junit4]    >    at com.carrotsearch.randomizedtesting.RandomizedRunner.runSingleTest(RandomizedRunner.java:825)
> [junit4:junit4]    >    at com.carrotsearch.randomizedtesting.RandomizedRunner.access$700(RandomizedRunner.java:132)
> [junit4:junit4]    >    at com.carrotsearch.randomizedtesting.RandomizedRunner$3$1.run(RandomizedRunner.java:671)
> [junit4:junit4]    >    at com.carrotsearch.randomizedtesting.RandomizedRunner$3.evaluate(RandomizedRunner.java:697)
> [junit4:junit4]    >    at com.carrotsearch.randomizedtesting.RandomizedRunner$4.evaluate(RandomizedRunner.java:736)
> [junit4:junit4]    >    at com.carrotsearch.randomizedtesting.RandomizedRunner$5.evaluate(RandomizedRunner.java:747)
> [junit4:junit4]    >    at org.apache.lucene.util.AbstractBeforeAfterRule$1.evaluate(AbstractBeforeAfterRule.java:45)
> [junit4:junit4]    >    at org.apache.lucene.util.TestRuleReportUncaughtExceptions$1.evaluate(TestRuleReportUncaughtExceptions.java:68)
> [junit4:junit4]    >    at org.apache.lucene.util.TestRuleStoreClassName$1.evaluate(TestRuleStoreClassName.java:38)
> [junit4:junit4]    >    at com.carrotsearch.randomizedtesting.rules.SystemPropertiesInvariantRule$1.evaluate(SystemPropertiesInvariantRule.java:55)
> [junit4:junit4]    >    at org.apache.lucene.util.TestRuleNoInstanceHooksOverrides$1.evaluate(TestRuleNoInstanceHooksOverrides.java:53)
> [junit4:junit4]    >    at org.apache.lucene.util.TestRuleNoStaticHooksShadowing$1.evaluate(TestRuleNoStaticHooksShadowing.java:52)
> [junit4:junit4]    >    at org.apache.lucene.util.TestRuleAssertionsRequired$1.evaluate(TestRuleAssertionsRequired.java:36)
> [junit4:junit4]    >    at org.apache.lucene.util.TestRuleMarkFailure$1.evaluate(TestRuleMarkFailure.java:48)
> [junit4:junit4]    >    at org.apache.lucene.util.TestRuleIgnoreAfterMaxFailures$1.evaluate(TestRuleIgnoreAfterMaxFailures.java:70)
> [junit4:junit4]    >    at org.apache.lucene.util.TestRuleIgnoreTestSuites$1.evaluate(TestRuleIgnoreTestSuites.java:55)
> [junit4:junit4]    >    at com.carrotsearch.randomizedtesting.RandomizedRunner.runSuite(RandomizedRunner.java:605)
> [junit4:junit4]    >    at com.carrotsearch.randomizedtesting.RandomizedRunner.access$400(RandomizedRunner.java:132)
> [junit4:junit4]    >    at com.carrotsearch.randomizedtesting.RandomizedRunner$2.run(RandomizedRunner.java:551)
> [junit4:junit4]    >
> [junit4:junit4]   2> NOTE: reproduce with: ant test  -Dtestcase=TestIndexWriterDelete -Dtests.method=testDeleteAllSlowly -Dtests.seed=D686D14F0587EBAE -Dtests.multiplier=3 -Dtests.slow=true -Dtests.locale=th_TH -Dtests.timezone=Australia/LHI -Dtests.file.encoding=UTF-8
> [junit4:junit4]   2>
> [junit4:junit4] IGNOR/A 0.01s J0 | TestIndexWriterDelete.testIndexingThenDeleting
> [junit4:junit4]    > Assumption #1: This test cannot run with SimpleText codec
> [junit4:junit4] FAILURE 0.02s J0 | TestIndexWriterDelete.testUpdatesOnDiskFull
> [junit4:junit4]    > Throwable #1: java.lang.AssertionError
> [junit4:junit4]    >    at __randomizedtesting.SeedInfo.seed([D686D14F0587EBAE:B260177CA18D4408]:0)
> [junit4:junit4]    >    at org.apache.lucene.util.packed.GrowableWriter.ensureCapacity(GrowableWriter.java:70)
> [junit4:junit4]    >    at org.apache.lucene.util.packed.GrowableWriter.set(GrowableWriter.java:83)
> [junit4:junit4]    >    at org.apache.lucene.util.fst.FST.pack(FST.java:1505)
> [junit4:junit4]    >    at org.apache.lucene.codecs.memory.MemoryPostingsFormat$TermsWriter.finish(MemoryPostingsFormat.java:273)
> [junit4:junit4]    >    at org.apache.lucene.index.FreqProxTermsWriterPerField.flush(FreqProxTermsWriterPerField.java:550)
> [junit4:junit4]    >    at org.apache.lucene.index.FreqProxTermsWriter.flush(FreqProxTermsWriter.java:85)
> [junit4:junit4]    >    at org.apache.lucene.index.TermsHash.flush(TermsHash.java:117)
> [junit4:junit4]    >    at org.apache.lucene.index.DocInverter.flush(DocInverter.java:53)
> [junit4:junit4]    >    at org.apache.lucene.index.DocFieldProcessor.flush(DocFieldProcessor.java:82)
> [junit4:junit4]    >    at org.apache.lucene.index.DocumentsWriterPerThread.flush(DocumentsWriterPerThread.java:481)
> [junit4:junit4]    >    at org.apache.lucene.index.DocumentsWriter.doFlush(DocumentsWriter.java:420)
> [junit4:junit4]    >    at org.apache.lucene.index.DocumentsWriter.flushAllThreads(DocumentsWriter.java:552)
> [junit4:junit4]    >    at org.apache.lucene.index.IndexWriter.doFlush(IndexWriter.java:2791)
> [junit4:junit4]    >    at org.apache.lucene.index.IndexWriter.flush(IndexWriter.java:2767)
> [junit4:junit4]    >    at org.apache.lucene.index.IndexWriter.closeInternal(IndexWriter.java:890)
> [junit4:junit4]    >    at org.apache.lucene.index.IndexWriter.close(IndexWriter.java:845)
> [junit4:junit4]    >    at org.apache.lucene.index.IndexWriter.close(IndexWriter.java:807)
> [junit4:junit4]    >    at org.apache.lucene.index.TestIndexWriterDelete.doTestOperationsOnDiskFull(TestIndexWriterDelete.java:439)
> [junit4:junit4]    >    at org.apache.lucene.index.TestIndexWriterDelete.testUpdatesOnDiskFull(TestIndexWriterDelete.java:415)
> [junit4:junit4]    >    at sun.reflect.NativeMethodAccessorImpl.invoke0(Native Method)
> [junit4:junit4]    >    at sun.reflect.NativeMethodAccessorImpl.invoke(NativeMethodAccessorImpl.java:88)
> [junit4:junit4]    >    at sun.reflect.DelegatingMethodAccessorImpl.invoke(DelegatingMethodAccessorImpl.java:55)
> [junit4:junit4]    >    at java.lang.reflect.Method.invoke(Method.java:613)
> [junit4:junit4]    >    at com.carrotsearch.randomizedtesting.RandomizedRunner.invoke(RandomizedRunner.java:1995)
> [junit4:junit4]    >    at com.carrotsearch.randomizedtesting.RandomizedRunner.access$1100(RandomizedRunner.java:132)
> [junit4:junit4]    >    at com.carrotsearch.randomizedtesting.RandomizedRunner$6.evaluate(RandomizedRunner.java:818)
> [junit4:junit4]    >    at com.carrotsearch.randomizedtesting.RandomizedRunner$7.evaluate(RandomizedRunner.java:877)
> [junit4:junit4]    >    at com.carrotsearch.randomizedtesting.RandomizedRunner$8.evaluate(RandomizedRunner.java:891)
> [junit4:junit4]    >    at org.apache.lucene.util.TestRuleSetupTeardownChained$1.evaluate(TestRuleSetupTeardownChained.java:50)
> [junit4:junit4]    >    at org.apache.lucene.util.TestRuleFieldCacheSanity$1.evaluate(TestRuleFieldCacheSanity.java:32)
> [junit4:junit4]    >    at org.apache.lucene.util.AbstractBeforeAfterRule$1.evaluate(AbstractBeforeAfterRule.java:45)
> [junit4:junit4]    >    at com.carrotsearch.randomizedtesting.rules.SystemPropertiesInvariantRule$1.evaluate(SystemPropertiesInvariantRule.java:55)
> [junit4:junit4]    >    at org.apache.lucene.util.TestRuleReportUncaughtExceptions$1.evaluate(TestRuleReportUncaughtExceptions.java:68)
> [junit4:junit4]    >    at org.apache.lucene.util.TestRuleThreadAndTestName$1.evaluate(TestRuleThreadAndTestName.java:48)
> [junit4:junit4]    >    at org.apache.lucene.util.TestRuleIgnoreAfterMaxFailures$1.evaluate(TestRuleIgnoreAfterMaxFailures.java:70)
> [junit4:junit4]    >    at org.apache.lucene.util.TestRuleMarkFailure$1.evaluate(TestRuleMarkFailure.java:48)
> [junit4:junit4]    >    at com.carrotsearch.randomizedtesting.RandomizedRunner.runSingleTest(RandomizedRunner.java:825)
> [junit4:junit4]    >    at com.carrotsearch.randomizedtesting.RandomizedRunner.access$700(RandomizedRunner.java:132)
> [junit4:junit4]    >    at com.carrotsearch.randomizedtesting.RandomizedRunner$3$1.run(RandomizedRunner.java:671)
> [junit4:junit4]    >    at com.carrotsearch.randomizedtesting.RandomizedRunner$3.evaluate(RandomizedRunner.java:697)
> [junit4:junit4]    >    at com.carrotsearch.randomizedtesting.RandomizedRunner$4.evaluate(RandomizedRunner.java:736)
> [junit4:junit4]    >    at com.carrotsearch.randomizedtesting.RandomizedRunner$5.evaluate(RandomizedRunner.java:747)
> [junit4:junit4]    >    at org.apache.lucene.util.AbstractBeforeAfterRule$1.evaluate(AbstractBeforeAfterRule.java:45)
> [junit4:junit4]    >    at org.apache.lucene.util.TestRuleReportUncaughtExceptions$1.evaluate(TestRuleReportUncaughtExceptions.java:68)
> [junit4:junit4]    >    at org.apache.lucene.util.TestRuleStoreClassName$1.evaluate(TestRuleStoreClassName.java:38)
> [junit4:junit4]    >    at com.carrotsearch.randomizedtesting.rules.SystemPropertiesInvariantRule$1.evaluate(SystemPropertiesInvariantRule.java:55)
> [junit4:junit4]    >    at org.apache.lucene.util.TestRuleNoInstanceHooksOverrides$1.evaluate(TestRuleNoInstanceHooksOverrides.java:53)
> [junit4:junit4]    >    at org.apache.lucene.util.TestRuleNoStaticHooksShadowing$1.evaluate(TestRuleNoStaticHooksShadowing.java:52)
> [junit4:junit4]    >    at org.apache.lucene.util.TestRuleAssertionsRequired$1.evaluate(TestRuleAssertionsRequired.java:36)
> [junit4:junit4]    >    at org.apache.lucene.util.TestRuleMarkFailure$1.evaluate(TestRuleMarkFailure.java:48)
> [junit4:junit4]    >    at org.apache.lucene.util.TestRuleIgnoreAfterMaxFailures$1.evaluate(TestRuleIgnoreAfterMaxFailures.java:70)
> [junit4:junit4]    >    at org.apache.lucene.util.TestRuleIgnoreTestSuites$1.evaluate(TestRuleIgnoreTestSuites.java:55)
> [junit4:junit4]    >    at com.carrotsearch.randomizedtesting.RandomizedRunner.runSuite(RandomizedRunner.java:605)
> [junit4:junit4]    >    at com.carrotsearch.randomizedtesting.RandomizedRunner.access$400(RandomizedRunner.java:132)
> [junit4:junit4]    >    at com.carrotsearch.randomizedtesting.RandomizedRunner$2.run(RandomizedRunner.java:551)
> [junit4:junit4]    >
> [junit4:junit4]   2> NOTE: reproduce with: ant test  -Dtestcase=TestIndexWriterDelete -Dtests.method=testUpdatesOnDiskFull -Dtests.seed=D686D14F0587EBAE -Dtests.multiplier=3 -Dtests.slow=true -Dtests.locale=th_TH -Dtests.timezone=Australia/LHI -Dtests.file.encoding=UTF-8
> [junit4:junit4]   2>
> [junit4:junit4] IGNOR/A 0.00s J0 | TestIndexWriterDelete.testApplyDeletesOnFlush
> [junit4:junit4]    > Assumption #1: 'nightly' test group is disabled (@Nightly)
> [junit4:junit4]    > (@AfterClass output)
> [junit4:junit4]   2> NOTE: test params are: codec=Lucene40: {value=Pulsing40(freqCutoff=18 minBlockSize=27 maxBlockSize=80), content=Pulsing40(freqCutoff=18 minBlockSize=27 maxBlockSize=80), contents=PostingsFormat(name=SimpleText), field=PostingsFormat(name=SimpleText), city=PostingsFormat(name=Memory doPackFST= true), id=PostingsFormat(name=Memory doPackFST= true)}, sim=DefaultSimilarity, locale=th_TH, timezone=Australia/LHI
> [junit4:junit4]   2> NOTE: Linux 3.2.0-27-generic x86/IBM Corporation 1.7.0 (32-bit)/cpus=8,threads=1,free=146896816,total=523239424
> [junit4:junit4]   2> NOTE: All tests run in this JVM: [TestGraphTokenizers, Test2BTerms, TestScorerPerf, TestFieldCacheRangeFilter, InBeforeClass, InAfterClass, InTestMethod, NonStringProperties, TestTopDocsCollector, TestFlex, TestSearcherManager, TestSpanExplanations, TestRegexpRandom, TestCustomSearcherSort, TestTermVectorsReader, TestConjunctions, TestMaxTermFrequency, TestAtomicUpdate, TestMultiTermConstantScore, TestParallelCompositeReader, TestSearchForDuplicates, TestSearchAfter, TestRandomStoredFields, TestRollingUpdates, TestCheckIndex, TestSpanFirstQuery, TestTimeLimitingCollector, TestSearch, TestDocValuesIndexing, TestIndexWriterOnJRECrash, ThrowInUncaught, TestSortedVIntList, TestOmitTf, TestLevenshteinAutomata, TestBufferedIndexInput, TestIndexWriterForceMerge, TestSpanExplanationsOfNonMatches, TestIndexWriterNRTIsCurrent, TestPayloadTermQuery, TestFileSwitchDirectory, TestLazyProxSkipping, TestSetOnce, TestPulsingReuse, Nested, TestSegmentReader, TestBooleanScorer, TestByteSlices, TestPrefixInBooleanQuery, TestParallelReaderEmptyIndex, TestDoubleBarrelLRUCache, NestedSetupChain, NestedTeardownChain, TestSloppyPhraseQuery2, TestShardSearching, TestReaderClosed, TestIndexFileDeleter, Test2BDocs, TestConstantScoreQuery, TestIndexWriterLockRelease, TestSpans, TestPayloadProcessorProvider, TestDemo, TestRollingCharBuffer, TestStressIndexing2, TestByteArrayDataInput, TestIndexWriterWithThreads, TestPositionIncrement, TestTermVectors, TestPagedBytes, TestFilterAtomicReader, TestFieldCacheRewriteMethod, TestMixedCodecs, TestSpansAdvanced2, TestIndexWriterCommit, TestIndexableField, TestSimpleExplanationsOfNonMatches, TestWeakIdentityMap, TestDocValues, TestPrefixQuery, TestExternalCodecs, TestDateSort, TestPackedInts, TestFSTs, TestBasics, TestDuelingCodecs, TestIndexWriterMerging, TestOpenBitSet, TestIndexWriterDelete]
> [junit4:junit4]   2>
> [junit4:junit4] Completed on J0 in 0.55s, 19 tests, 5 failures, 2 skipped <<< FAILURES!
>
> [...truncated 73 lines...]
> [junit4:junit4] Suite: org.apache.lucene.search.TestFieldCache
> [junit4:junit4]    > (@BeforeClass output)
> [junit4:junit4]   2> NOTE: test params are: codec=Lucene40: {sparse=PostingsFormat(name=Memory doPackFST= true), numInt=PostingsFormat(name=NestedPulsing)}, sim=DefaultSimilarity, locale=pl, timezone=Asia/Macau
> [junit4:junit4]   2> NOTE: Linux 3.2.0-27-generic x86/IBM Corporation 1.7.0 (32-bit)/cpus=8,threads=1,free=115749216,total=523239424
> [junit4:junit4]   2> NOTE: All tests run in this JVM: [TestGraphTokenizers, Test2BTerms, TestScorerPerf, TestFieldCacheRangeFilter, InBeforeClass, InAfterClass, InTestMethod, NonStringProperties, TestTopDocsCollector, TestFlex, TestSearcherManager, TestSpanExplanations, TestRegexpRandom, TestCustomSearcherSort, TestTermVectorsReader, TestConjunctions, TestMaxTermFrequency, TestAtomicUpdate, TestMultiTermConstantScore, TestParallelCompositeReader, TestSearchForDuplicates, TestSearchAfter, TestRandomStoredFields, TestRollingUpdates, TestCheckIndex, TestSpanFirstQuery, TestTimeLimitingCollector, TestSearch, TestDocValuesIndexing, TestIndexWriterOnJRECrash, ThrowInUncaught, TestSortedVIntList, TestOmitTf, TestLevenshteinAutomata, TestBufferedIndexInput, TestIndexWriterForceMerge, TestSpanExplanationsOfNonMatches, TestIndexWriterNRTIsCurrent, TestPayloadTermQuery, TestFileSwitchDirectory, TestLazyProxSkipping, TestSetOnce, TestPulsingReuse, Nested, TestSegmentReader, TestBooleanScorer, TestByteSlices, TestPrefixInBooleanQuery, TestParallelReaderEmptyIndex, TestDoubleBarrelLRUCache, NestedSetupChain, NestedTeardownChain, TestSloppyPhraseQuery2, TestShardSearching, TestReaderClosed, TestIndexFileDeleter, Test2BDocs, TestConstantScoreQuery, TestIndexWriterLockRelease, TestSpans, TestPayloadProcessorProvider, TestDemo, TestRollingCharBuffer, TestStressIndexing2, TestByteArrayDataInput, TestIndexWriterWithThreads, TestPositionIncrement, TestTermVectors, TestPagedBytes, TestFilterAtomicReader, TestFieldCacheRewriteMethod, TestMixedCodecs, TestSpansAdvanced2, TestIndexWriterCommit, TestIndexableField, TestSimpleExplanationsOfNonMatches, TestWeakIdentityMap, TestDocValues, TestPrefixQuery, TestExternalCodecs, TestDateSort, TestPackedInts, TestFSTs, TestBasics, TestDuelingCodecs, TestIndexWriterMerging, TestOpenBitSet, TestIndexWriterDelete, TestDirectoryReaderReopen, TestSearchWithThreads, TestCompoundFile, TestCustomNorms, TestStressIndexing, TestDocumentsWriterStallControl, TestComplexExplanations, TestNumericUtils, TestPerFieldPostingsFormat, TestFieldCache]
> [junit4:junit4]   2> NOTE: reproduce with: ant test  -Dtestcase=TestFieldCache -Dtests.seed=D686D14F0587EBAE -Dtests.multiplier=3 -Dtests.slow=true -Dtests.locale=pl -Dtests.timezone=Asia/Macau -Dtests.file.encoding=UTF-8
> [junit4:junit4]   2>
> [junit4:junit4] ERROR   0.00s J0 | TestFieldCache (suite)
> [junit4:junit4]    > Throwable #1: java.lang.AssertionError
> [junit4:junit4]    >    at __randomizedtesting.SeedInfo.seed([D686D14F0587EBAE]:0)
> [junit4:junit4]    >    at org.apache.lucene.util.packed.GrowableWriter.ensureCapacity(GrowableWriter.java:70)
> [junit4:junit4]    >    at org.apache.lucene.util.packed.GrowableWriter.set(GrowableWriter.java:83)
> [junit4:junit4]    >    at org.apache.lucene.util.fst.FST.pack(FST.java:1505)
> [junit4:junit4]    >    at org.apache.lucene.codecs.memory.MemoryPostingsFormat$TermsWriter.finish(MemoryPostingsFormat.java:273)
> [junit4:junit4]    >    at org.apache.lucene.index.FreqProxTermsWriterPerField.flush(FreqProxTermsWriterPerField.java:550)
> [junit4:junit4]    >    at org.apache.lucene.index.FreqProxTermsWriter.flush(FreqProxTermsWriter.java:85)
> [junit4:junit4]    >    at org.apache.lucene.index.TermsHash.flush(TermsHash.java:117)
> [junit4:junit4]    >    at org.apache.lucene.index.DocInverter.flush(DocInverter.java:53)
> [junit4:junit4]    >    at org.apache.lucene.index.DocFieldProcessor.flush(DocFieldProcessor.java:82)
> [junit4:junit4]    >    at org.apache.lucene.index.DocumentsWriterPerThread.flush(DocumentsWriterPerThread.java:481)
> [junit4:junit4]    >    at org.apache.lucene.index.DocumentsWriter.doFlush(DocumentsWriter.java:420)
> [junit4:junit4]    >    at org.apache.lucene.index.DocumentsWriter.flushAllThreads(DocumentsWriter.java:552)
> [junit4:junit4]    >    at org.apache.lucene.index.IndexWriter.prepareCommit(IndexWriter.java:2563)
> [junit4:junit4]    >    at org.apache.lucene.index.IndexWriter.commitInternal(IndexWriter.java:2699)
> [junit4:junit4]    >    at org.apache.lucene.index.IndexWriter.commit(IndexWriter.java:2679)
> [junit4:junit4]    >    at org.apache.lucene.index.IndexWriter.commit(IndexWriter.java:2663)
> [junit4:junit4]    >    at org.apache.lucene.index.RandomIndexWriter.maybeCommit(RandomIndexWriter.java:266)
> [junit4:junit4]    >    at org.apache.lucene.index.RandomIndexWriter.addDocument(RandomIndexWriter.java:189)
> [junit4:junit4]    >    at org.apache.lucene.index.RandomIndexWriter.addDocument(RandomIndexWriter.java:145)
> [junit4:junit4]    >    at org.apache.lucene.search.TestFieldCache.beforeClass(TestFieldCache.java:100)
> [junit4:junit4]    >    at sun.reflect.NativeMethodAccessorImpl.invoke0(Native Method)
> [junit4:junit4]    >    at sun.reflect.NativeMethodAccessorImpl.invoke(NativeMethodAccessorImpl.java:88)
> [junit4:junit4]    >    at sun.reflect.DelegatingMethodAccessorImpl.invoke(DelegatingMethodAccessorImpl.java:55)
> [junit4:junit4]    >    at java.lang.reflect.Method.invoke(Method.java:613)
> [junit4:junit4]    >    at com.carrotsearch.randomizedtesting.RandomizedRunner.invoke(RandomizedRunner.java:1995)
> [junit4:junit4]    >    at com.carrotsearch.randomizedtesting.RandomizedRunner.access$1100(RandomizedRunner.java:132)
> [junit4:junit4]    >    at com.carrotsearch.randomizedtesting.RandomizedRunner$4.evaluate(RandomizedRunner.java:731)
> [junit4:junit4]    >    at com.carrotsearch.randomizedtesting.RandomizedRunner$5.evaluate(RandomizedRunner.java:747)
> [junit4:junit4]    >    at org.apache.lucene.util.AbstractBeforeAfterRule$1.evaluate(AbstractBeforeAfterRule.java:45)
> [junit4:junit4]    >    at org.apache.lucene.util.TestRuleReportUncaughtExceptions$1.evaluate(TestRuleReportUncaughtExceptions.java:68)
> [junit4:junit4]    >    at org.apache.lucene.util.TestRuleStoreClassName$1.evaluate(TestRuleStoreClassName.java:38)
> [junit4:junit4]    >    at com.carrotsearch.randomizedtesting.rules.SystemPropertiesInvariantRule$1.evaluate(SystemPropertiesInvariantRule.java:55)
> [junit4:junit4]    >    at org.apache.lucene.util.TestRuleNoInstanceHooksOverrides$1.evaluate(TestRuleNoInstanceHooksOverrides.java:53)
> [junit4:junit4]    >    at org.apache.lucene.util.TestRuleNoStaticHooksShadowing$1.evaluate(TestRuleNoStaticHooksShadowing.java:52)
> [junit4:junit4]    >    at org.apache.lucene.util.TestRuleAssertionsRequired$1.evaluate(TestRuleAssertionsRequired.java:36)
> [junit4:junit4]    >    at org.apache.lucene.util.TestRuleMarkFailure$1.evaluate(TestRuleMarkFailure.java:48)
> [junit4:junit4]    >    at org.apache.lucene.util.TestRuleIgnoreAfterMaxFailures$1.evaluate(TestRuleIgnoreAfterMaxFailures.java:70)
> [junit4:junit4]    >    at org.apache.lucene.util.TestRuleIgnoreTestSuites$1.evaluate(TestRuleIgnoreTestSuites.java:55)
> [junit4:junit4]    >    at com.carrotsearch.randomizedtesting.RandomizedRunner.runSuite(RandomizedRunner.java:605)
> [junit4:junit4]    >    at com.carrotsearch.randomizedtesting.RandomizedRunner.access$400(RandomizedRunner.java:132)
> [junit4:junit4]    >    at com.carrotsearch.randomizedtesting.RandomizedRunner$2.run(RandomizedRunner.java:551)
> [junit4:junit4]    > Throwable #2: java.lang.NullPointerException
> [junit4:junit4]    >    at __randomizedtesting.SeedInfo.seed([D686D14F0587EBAE]:0)
> [junit4:junit4]    >    at org.apache.lucene.search.TestFieldCache.afterClass(TestFieldCache.java:109)
> [junit4:junit4]    >    at sun.reflect.NativeMethodAccessorImpl.invoke0(Native Method)
> [junit4:junit4]    >    at sun.reflect.NativeMethodAccessorImpl.invoke(NativeMethodAccessorImpl.java:88)
> [junit4:junit4]    >    at sun.reflect.DelegatingMethodAccessorImpl.invoke(DelegatingMethodAccessorImpl.java:55)
> [junit4:junit4]    >    at java.lang.reflect.Method.invoke(Method.java:613)
> [junit4:junit4]    >    at com.carrotsearch.randomizedtesting.RandomizedRunner.invoke(RandomizedRunner.java:1995)
> [junit4:junit4]    >    at com.carrotsearch.randomizedtesting.RandomizedRunner.access$1100(RandomizedRunner.java:132)
> [junit4:junit4]    >    at com.carrotsearch.randomizedtesting.RandomizedRunner$5.evaluate(RandomizedRunner.java:754)
> [junit4:junit4]    >    at org.apache.lucene.util.AbstractBeforeAfterRule$1.evaluate(AbstractBeforeAfterRule.java:45)
> [junit4:junit4]    >    at org.apache.lucene.util.TestRuleReportUncaughtExceptions$1.evaluate(TestRuleReportUncaughtExceptions.java:68)
> [junit4:junit4]    >    at org.apache.lucene.util.TestRuleStoreClassName$1.evaluate(TestRuleStoreClassName.java:38)
> [junit4:junit4]    >    at com.carrotsearch.randomizedtesting.rules.SystemPropertiesInvariantRule$1.evaluate(SystemPropertiesInvariantRule.java:55)
> [junit4:junit4]    >    at org.apache.lucene.util.TestRuleNoInstanceHooksOverrides$1.evaluate(TestRuleNoInstanceHooksOverrides.java:53)
> [junit4:junit4]    >    at org.apache.lucene.util.TestRuleNoStaticHooksShadowing$1.evaluate(TestRuleNoStaticHooksShadowing.java:52)
> [junit4:junit4]    >    at org.apache.lucene.util.TestRuleAssertionsRequired$1.evaluate(TestRuleAssertionsRequired.java:36)
> [junit4:junit4]    >    at org.apache.lucene.util.TestRuleMarkFailure$1.evaluate(TestRuleMarkFailure.java:48)
> [junit4:junit4]    >    at org.apache.lucene.util.TestRuleIgnoreAfterMaxFailures$1.evaluate(TestRuleIgnoreAfterMaxFailures.java:70)
> [junit4:junit4]    >    at org.apache.lucene.util.TestRuleIgnoreTestSuites$1.evaluate(TestRuleIgnoreTestSuites.java:55)
> [junit4:junit4]    >    at com.carrotsearch.randomizedtesting.RandomizedRunner.runSuite(RandomizedRunner.java:605)
> [junit4:junit4]    >    at com.carrotsearch.randomizedtesting.RandomizedRunner.access$400(RandomizedRunner.java:132)
> [junit4:junit4]    >    at com.carrotsearch.randomizedtesting.RandomizedRunner$2.run(RandomizedRunner.java:551)
> [junit4:junit4]    >
> [junit4:junit4] Completed on J0 in 0.08s, 0 tests, 1 failure, 1 error <<< FAILURES!
>
> [...truncated 326 lines...]
> BUILD FAILED
> /mnt/ssd/jenkins/workspace/Lucene-Solr-trunk-Linux/checkout/build.xml:29: The following error occurred while executing this line:
> /mnt/ssd/jenkins/workspace/Lucene-Solr-trunk-Linux/checkout/lucene/build.xml:50: The following error occurred while executing this line:
> /mnt/ssd/jenkins/workspace/Lucene-Solr-trunk-Linux/checkout/lucene/common-build.xml:1095: The following error occurred while executing this line:
> /mnt/ssd/jenkins/workspace/Lucene-Solr-trunk-Linux/checkout/lucene/common-build.xml:790: There were test failures: 305 suites, 1718 tests, 2 suite-level errors, 5 failures, 14 ignored (12 assumptions)
>
> Total time: 6 minutes 42 seconds
> Build step 'Execute shell' marked build as failure
> Archiving artifacts
> Recording test results
> Email was triggered for: Failure
> Sending email for trigger: Failure
>
>
>
>
> ---------------------------------------------------------------------
> To unsubscribe, e-mail: dev-unsubscribe@lucene.apache.org
> For additional commands, e-mail: dev-help@lucene.apache.org



-- 
lucidimagination.com

---------------------------------------------------------------------
To unsubscribe, e-mail: dev-unsubscribe@lucene.apache.org
For additional commands, e-mail: dev-help@lucene.apache.org


Mime
View raw message