lucene-dev mailing list archives

Site index · List index
Message view « Date » · « Thread »
Top « Date » · « Thread »
From Policeman Jenkins Server <jenk...@sd-datasolutions.de>
Subject [JENKINS] Lucene-Solr-trunk-Linux (32bit/ibm-j9-jdk6) - Build # 448 - Failure!
Date Tue, 14 Aug 2012 16:32:14 GMT
Build: http://jenkins.sd-datasolutions.de/job/Lucene-Solr-trunk-Linux/448/
Java: 32bit/ibm-j9-jdk6 

6 tests failed.
FAILED:  junit.framework.TestSuite.org.apache.lucene.search.TestNumericRangeQuery32

Error Message:


Stack Trace:
java.lang.AssertionError
	at __randomizedtesting.SeedInfo.seed([794ABB7D513645B4]:0)
	at org.apache.lucene.util.packed.GrowableWriter.ensureCapacity(GrowableWriter.java:70)
	at org.apache.lucene.util.packed.GrowableWriter.set(GrowableWriter.java:83)
	at org.apache.lucene.util.fst.FST.pack(FST.java:1505)
	at org.apache.lucene.codecs.memory.MemoryPostingsFormat$TermsWriter.finish(MemoryPostingsFormat.java:273)
	at org.apache.lucene.index.FreqProxTermsWriterPerField.flush(FreqProxTermsWriterPerField.java:550)
	at org.apache.lucene.index.FreqProxTermsWriter.flush(FreqProxTermsWriter.java:85)
	at org.apache.lucene.index.TermsHash.flush(TermsHash.java:117)
	at org.apache.lucene.index.DocInverter.flush(DocInverter.java:53)
	at org.apache.lucene.index.DocFieldProcessor.flush(DocFieldProcessor.java:82)
	at org.apache.lucene.index.DocumentsWriterPerThread.flush(DocumentsWriterPerThread.java:481)
	at org.apache.lucene.index.DocumentsWriter.doFlush(DocumentsWriter.java:419)
	at org.apache.lucene.index.DocumentsWriter.flushAllThreads(DocumentsWriter.java:551)
	at org.apache.lucene.index.IndexWriter.prepareCommit(IndexWriter.java:2613)
	at org.apache.lucene.index.IndexWriter.commitInternal(IndexWriter.java:2749)
	at org.apache.lucene.index.IndexWriter.commit(IndexWriter.java:2729)
	at org.apache.lucene.index.IndexWriter.commit(IndexWriter.java:2713)
	at org.apache.lucene.index.RandomIndexWriter.maybeCommit(RandomIndexWriter.java:266)
	at org.apache.lucene.index.RandomIndexWriter.addDocument(RandomIndexWriter.java:189)
	at org.apache.lucene.index.RandomIndexWriter.addDocument(RandomIndexWriter.java:145)
	at org.apache.lucene.search.TestNumericRangeQuery32.beforeClass(TestNumericRangeQuery32.java:120)
	at sun.reflect.NativeMethodAccessorImpl.invoke0(Native Method)
	at sun.reflect.NativeMethodAccessorImpl.invoke(NativeMethodAccessorImpl.java:48)
	at sun.reflect.DelegatingMethodAccessorImpl.invoke(DelegatingMethodAccessorImpl.java:25)
	at java.lang.reflect.Method.invoke(Method.java:600)
	at com.carrotsearch.randomizedtesting.RandomizedRunner.invoke(RandomizedRunner.java:1559)
	at com.carrotsearch.randomizedtesting.RandomizedRunner.access$600(RandomizedRunner.java:79)
	at com.carrotsearch.randomizedtesting.RandomizedRunner$4.evaluate(RandomizedRunner.java:677)
	at com.carrotsearch.randomizedtesting.RandomizedRunner$5.evaluate(RandomizedRunner.java:693)
	at org.apache.lucene.util.AbstractBeforeAfterRule$1.evaluate(AbstractBeforeAfterRule.java:45)
	at org.apache.lucene.util.TestRuleStoreClassName$1.evaluate(TestRuleStoreClassName.java:38)
	at com.carrotsearch.randomizedtesting.rules.SystemPropertiesInvariantRule$1.evaluate(SystemPropertiesInvariantRule.java:55)
	at com.carrotsearch.randomizedtesting.rules.NoShadowingOrOverridesOnMethodsRule$1.evaluate(NoShadowingOrOverridesOnMethodsRule.java:39)
	at com.carrotsearch.randomizedtesting.rules.NoShadowingOrOverridesOnMethodsRule$1.evaluate(NoShadowingOrOverridesOnMethodsRule.java:39)
	at org.apache.lucene.util.TestRuleAssertionsRequired$1.evaluate(TestRuleAssertionsRequired.java:40)
	at org.apache.lucene.util.TestRuleMarkFailure$1.evaluate(TestRuleMarkFailure.java:48)
	at org.apache.lucene.util.TestRuleIgnoreAfterMaxFailures$1.evaluate(TestRuleIgnoreAfterMaxFailures.java:70)
	at org.apache.lucene.util.TestRuleIgnoreTestSuites$1.evaluate(TestRuleIgnoreTestSuites.java:55)
	at com.carrotsearch.randomizedtesting.rules.StatementAdapter.evaluate(StatementAdapter.java:36)
	at com.carrotsearch.randomizedtesting.ThreadLeakControl$StatementRunner.run(ThreadLeakControl.java:345)
	at java.lang.Thread.run(Thread.java:736)


FAILED:  junit.framework.TestSuite.org.apache.lucene.search.TestNumericRangeQuery32

Error Message:


Stack Trace:
java.lang.NullPointerException
	at __randomizedtesting.SeedInfo.seed([794ABB7D513645B4]:0)
	at org.apache.lucene.search.TestNumericRangeQuery32.afterClass(TestNumericRangeQuery32.java:131)
	at sun.reflect.NativeMethodAccessorImpl.invoke0(Native Method)
	at sun.reflect.NativeMethodAccessorImpl.invoke(NativeMethodAccessorImpl.java:48)
	at sun.reflect.DelegatingMethodAccessorImpl.invoke(DelegatingMethodAccessorImpl.java:25)
	at java.lang.reflect.Method.invoke(Method.java:600)
	at com.carrotsearch.randomizedtesting.RandomizedRunner.invoke(RandomizedRunner.java:1559)
	at com.carrotsearch.randomizedtesting.RandomizedRunner.access$600(RandomizedRunner.java:79)
	at com.carrotsearch.randomizedtesting.RandomizedRunner$5.evaluate(RandomizedRunner.java:700)
	at org.apache.lucene.util.AbstractBeforeAfterRule$1.evaluate(AbstractBeforeAfterRule.java:45)
	at org.apache.lucene.util.TestRuleStoreClassName$1.evaluate(TestRuleStoreClassName.java:38)
	at com.carrotsearch.randomizedtesting.rules.SystemPropertiesInvariantRule$1.evaluate(SystemPropertiesInvariantRule.java:55)
	at com.carrotsearch.randomizedtesting.rules.NoShadowingOrOverridesOnMethodsRule$1.evaluate(NoShadowingOrOverridesOnMethodsRule.java:39)
	at com.carrotsearch.randomizedtesting.rules.NoShadowingOrOverridesOnMethodsRule$1.evaluate(NoShadowingOrOverridesOnMethodsRule.java:39)
	at org.apache.lucene.util.TestRuleAssertionsRequired$1.evaluate(TestRuleAssertionsRequired.java:40)
	at org.apache.lucene.util.TestRuleMarkFailure$1.evaluate(TestRuleMarkFailure.java:48)
	at org.apache.lucene.util.TestRuleIgnoreAfterMaxFailures$1.evaluate(TestRuleIgnoreAfterMaxFailures.java:70)
	at org.apache.lucene.util.TestRuleIgnoreTestSuites$1.evaluate(TestRuleIgnoreTestSuites.java:55)
	at com.carrotsearch.randomizedtesting.rules.StatementAdapter.evaluate(StatementAdapter.java:36)
	at com.carrotsearch.randomizedtesting.ThreadLeakControl$StatementRunner.run(ThreadLeakControl.java:345)
	at java.lang.Thread.run(Thread.java:736)


REGRESSION:  org.apache.lucene.index.TestDirectoryReaderReopen.testReopen

Error Message:


Stack Trace:
java.lang.AssertionError
	at __randomizedtesting.SeedInfo.seed([794ABB7D513645B4:55026A6B220ACA97]:0)
	at org.apache.lucene.util.packed.GrowableWriter.ensureCapacity(GrowableWriter.java:70)
	at org.apache.lucene.util.packed.GrowableWriter.set(GrowableWriter.java:83)
	at org.apache.lucene.util.fst.FST.pack(FST.java:1505)
	at org.apache.lucene.codecs.memory.MemoryPostingsFormat$TermsWriter.finish(MemoryPostingsFormat.java:273)
	at org.apache.lucene.codecs.TermsConsumer.merge(TermsConsumer.java:199)
	at org.apache.lucene.codecs.FieldsConsumer.merge(FieldsConsumer.java:61)
	at org.apache.lucene.index.SegmentMerger.mergeTerms(SegmentMerger.java:315)
	at org.apache.lucene.index.SegmentMerger.merge(SegmentMerger.java:108)
	at org.apache.lucene.index.IndexWriter.mergeMiddle(IndexWriter.java:3589)
	at org.apache.lucene.index.IndexWriter.merge(IndexWriter.java:3204)
	at org.apache.lucene.index.SerialMergeScheduler.merge(SerialMergeScheduler.java:36)
	at org.apache.lucene.index.IndexWriter.maybeMerge(IndexWriter.java:1803)
	at org.apache.lucene.index.IndexWriter.maybeMerge(IndexWriter.java:1797)
	at org.apache.lucene.index.IndexWriter.updateDocument(IndexWriter.java:1443)
	at org.apache.lucene.index.IndexWriter.addDocument(IndexWriter.java:1111)
	at org.apache.lucene.index.IndexWriter.addDocument(IndexWriter.java:1092)
	at org.apache.lucene.index.TestDirectoryReaderReopen.createIndex(TestDirectoryReaderReopen.java:438)
	at org.apache.lucene.index.TestDirectoryReaderReopen.testReopen(TestDirectoryReaderReopen.java:49)
	at sun.reflect.NativeMethodAccessorImpl.invoke0(Native Method)
	at sun.reflect.NativeMethodAccessorImpl.invoke(NativeMethodAccessorImpl.java:48)
	at sun.reflect.DelegatingMethodAccessorImpl.invoke(DelegatingMethodAccessorImpl.java:25)
	at java.lang.reflect.Method.invoke(Method.java:600)
	at com.carrotsearch.randomizedtesting.RandomizedRunner.invoke(RandomizedRunner.java:1559)
	at com.carrotsearch.randomizedtesting.RandomizedRunner.access$600(RandomizedRunner.java:79)
	at com.carrotsearch.randomizedtesting.RandomizedRunner$6.evaluate(RandomizedRunner.java:737)
	at com.carrotsearch.randomizedtesting.RandomizedRunner$7.evaluate(RandomizedRunner.java:773)
	at com.carrotsearch.randomizedtesting.RandomizedRunner$8.evaluate(RandomizedRunner.java:787)
	at org.apache.lucene.util.TestRuleSetupTeardownChained$1.evaluate(TestRuleSetupTeardownChained.java:50)
	at org.apache.lucene.util.TestRuleFieldCacheSanity$1.evaluate(TestRuleFieldCacheSanity.java:32)
	at org.apache.lucene.util.AbstractBeforeAfterRule$1.evaluate(AbstractBeforeAfterRule.java:45)
	at com.carrotsearch.randomizedtesting.rules.SystemPropertiesInvariantRule$1.evaluate(SystemPropertiesInvariantRule.java:55)
	at org.apache.lucene.util.TestRuleThreadAndTestName$1.evaluate(TestRuleThreadAndTestName.java:48)
	at org.apache.lucene.util.TestRuleIgnoreAfterMaxFailures$1.evaluate(TestRuleIgnoreAfterMaxFailures.java:70)
	at org.apache.lucene.util.TestRuleMarkFailure$1.evaluate(TestRuleMarkFailure.java:48)
	at com.carrotsearch.randomizedtesting.rules.StatementAdapter.evaluate(StatementAdapter.java:36)
	at com.carrotsearch.randomizedtesting.ThreadLeakControl$StatementRunner.run(ThreadLeakControl.java:345)
	at com.carrotsearch.randomizedtesting.ThreadLeakControl.forkTimeoutingTask(ThreadLeakControl.java:769)
	at com.carrotsearch.randomizedtesting.ThreadLeakControl$3.evaluate(ThreadLeakControl.java:429)
	at com.carrotsearch.randomizedtesting.RandomizedRunner.runSingleTest(RandomizedRunner.java:746)
	at com.carrotsearch.randomizedtesting.RandomizedRunner$3.evaluate(RandomizedRunner.java:648)
	at com.carrotsearch.randomizedtesting.RandomizedRunner$4.evaluate(RandomizedRunner.java:682)
	at com.carrotsearch.randomizedtesting.RandomizedRunner$5.evaluate(RandomizedRunner.java:693)
	at org.apache.lucene.util.AbstractBeforeAfterRule$1.evaluate(AbstractBeforeAfterRule.java:45)
	at org.apache.lucene.util.TestRuleStoreClassName$1.evaluate(TestRuleStoreClassName.java:38)
	at com.carrotsearch.randomizedtesting.rules.SystemPropertiesInvariantRule$1.evaluate(SystemPropertiesInvariantRule.java:55)
	at com.carrotsearch.randomizedtesting.rules.NoShadowingOrOverridesOnMethodsRule$1.evaluate(NoShadowingOrOverridesOnMethodsRule.java:39)
	at com.carrotsearch.randomizedtesting.rules.NoShadowingOrOverridesOnMethodsRule$1.evaluate(NoShadowingOrOverridesOnMethodsRule.java:39)
	at org.apache.lucene.util.TestRuleAssertionsRequired$1.evaluate(TestRuleAssertionsRequired.java:40)
	at org.apache.lucene.util.TestRuleMarkFailure$1.evaluate(TestRuleMarkFailure.java:48)
	at org.apache.lucene.util.TestRuleIgnoreAfterMaxFailures$1.evaluate(TestRuleIgnoreAfterMaxFailures.java:70)
	at org.apache.lucene.util.TestRuleIgnoreTestSuites$1.evaluate(TestRuleIgnoreTestSuites.java:55)
	at com.carrotsearch.randomizedtesting.rules.StatementAdapter.evaluate(StatementAdapter.java:36)
	at com.carrotsearch.randomizedtesting.ThreadLeakControl$StatementRunner.run(ThreadLeakControl.java:345)
	at java.lang.Thread.run(Thread.java:736)


REGRESSION:  org.apache.lucene.index.TestDirectoryReaderReopen.testThreadSafety

Error Message:


Stack Trace:
java.lang.AssertionError
	at __randomizedtesting.SeedInfo.seed([794ABB7D513645B4:E300AF2582A9F742]:0)
	at org.apache.lucene.util.packed.GrowableWriter.ensureCapacity(GrowableWriter.java:70)
	at org.apache.lucene.util.packed.GrowableWriter.set(GrowableWriter.java:83)
	at org.apache.lucene.util.fst.FST.pack(FST.java:1505)
	at org.apache.lucene.codecs.memory.MemoryPostingsFormat$TermsWriter.finish(MemoryPostingsFormat.java:273)
	at org.apache.lucene.index.FreqProxTermsWriterPerField.flush(FreqProxTermsWriterPerField.java:550)
	at org.apache.lucene.index.FreqProxTermsWriter.flush(FreqProxTermsWriter.java:85)
	at org.apache.lucene.index.TermsHash.flush(TermsHash.java:117)
	at org.apache.lucene.index.DocInverter.flush(DocInverter.java:53)
	at org.apache.lucene.index.DocFieldProcessor.flush(DocFieldProcessor.java:82)
	at org.apache.lucene.index.DocumentsWriterPerThread.flush(DocumentsWriterPerThread.java:481)
	at org.apache.lucene.index.DocumentsWriter.doFlush(DocumentsWriter.java:419)
	at org.apache.lucene.index.DocumentsWriter.flushAllThreads(DocumentsWriter.java:551)
	at org.apache.lucene.index.IndexWriter.doFlush(IndexWriter.java:2841)
	at org.apache.lucene.index.IndexWriter.flush(IndexWriter.java:2817)
	at org.apache.lucene.index.IndexWriter.forceMerge(IndexWriter.java:1593)
	at org.apache.lucene.index.IndexWriter.forceMerge(IndexWriter.java:1569)
	at org.apache.lucene.index.TestDirectoryReaderReopen.testThreadSafety(TestDirectoryReaderReopen.java:206)
	at sun.reflect.NativeMethodAccessorImpl.invoke0(Native Method)
	at sun.reflect.NativeMethodAccessorImpl.invoke(NativeMethodAccessorImpl.java:48)
	at sun.reflect.DelegatingMethodAccessorImpl.invoke(DelegatingMethodAccessorImpl.java:25)
	at java.lang.reflect.Method.invoke(Method.java:600)
	at com.carrotsearch.randomizedtesting.RandomizedRunner.invoke(RandomizedRunner.java:1559)
	at com.carrotsearch.randomizedtesting.RandomizedRunner.access$600(RandomizedRunner.java:79)
	at com.carrotsearch.randomizedtesting.RandomizedRunner$6.evaluate(RandomizedRunner.java:737)
	at com.carrotsearch.randomizedtesting.RandomizedRunner$7.evaluate(RandomizedRunner.java:773)
	at com.carrotsearch.randomizedtesting.RandomizedRunner$8.evaluate(RandomizedRunner.java:787)
	at org.apache.lucene.util.TestRuleSetupTeardownChained$1.evaluate(TestRuleSetupTeardownChained.java:50)
	at org.apache.lucene.util.TestRuleFieldCacheSanity$1.evaluate(TestRuleFieldCacheSanity.java:32)
	at org.apache.lucene.util.AbstractBeforeAfterRule$1.evaluate(AbstractBeforeAfterRule.java:45)
	at com.carrotsearch.randomizedtesting.rules.SystemPropertiesInvariantRule$1.evaluate(SystemPropertiesInvariantRule.java:55)
	at org.apache.lucene.util.TestRuleThreadAndTestName$1.evaluate(TestRuleThreadAndTestName.java:48)
	at org.apache.lucene.util.TestRuleIgnoreAfterMaxFailures$1.evaluate(TestRuleIgnoreAfterMaxFailures.java:70)
	at org.apache.lucene.util.TestRuleMarkFailure$1.evaluate(TestRuleMarkFailure.java:48)
	at com.carrotsearch.randomizedtesting.rules.StatementAdapter.evaluate(StatementAdapter.java:36)
	at com.carrotsearch.randomizedtesting.ThreadLeakControl$StatementRunner.run(ThreadLeakControl.java:345)
	at com.carrotsearch.randomizedtesting.ThreadLeakControl.forkTimeoutingTask(ThreadLeakControl.java:769)
	at com.carrotsearch.randomizedtesting.ThreadLeakControl$3.evaluate(ThreadLeakControl.java:429)
	at com.carrotsearch.randomizedtesting.RandomizedRunner.runSingleTest(RandomizedRunner.java:746)
	at com.carrotsearch.randomizedtesting.RandomizedRunner$3.evaluate(RandomizedRunner.java:648)
	at com.carrotsearch.randomizedtesting.RandomizedRunner$4.evaluate(RandomizedRunner.java:682)
	at com.carrotsearch.randomizedtesting.RandomizedRunner$5.evaluate(RandomizedRunner.java:693)
	at org.apache.lucene.util.AbstractBeforeAfterRule$1.evaluate(AbstractBeforeAfterRule.java:45)
	at org.apache.lucene.util.TestRuleStoreClassName$1.evaluate(TestRuleStoreClassName.java:38)
	at com.carrotsearch.randomizedtesting.rules.SystemPropertiesInvariantRule$1.evaluate(SystemPropertiesInvariantRule.java:55)
	at com.carrotsearch.randomizedtesting.rules.NoShadowingOrOverridesOnMethodsRule$1.evaluate(NoShadowingOrOverridesOnMethodsRule.java:39)
	at com.carrotsearch.randomizedtesting.rules.NoShadowingOrOverridesOnMethodsRule$1.evaluate(NoShadowingOrOverridesOnMethodsRule.java:39)
	at org.apache.lucene.util.TestRuleAssertionsRequired$1.evaluate(TestRuleAssertionsRequired.java:40)
	at org.apache.lucene.util.TestRuleMarkFailure$1.evaluate(TestRuleMarkFailure.java:48)
	at org.apache.lucene.util.TestRuleIgnoreAfterMaxFailures$1.evaluate(TestRuleIgnoreAfterMaxFailures.java:70)
	at org.apache.lucene.util.TestRuleIgnoreTestSuites$1.evaluate(TestRuleIgnoreTestSuites.java:55)
	at com.carrotsearch.randomizedtesting.rules.StatementAdapter.evaluate(StatementAdapter.java:36)
	at com.carrotsearch.randomizedtesting.ThreadLeakControl$StatementRunner.run(ThreadLeakControl.java:345)
	at java.lang.Thread.run(Thread.java:736)


REGRESSION:  org.apache.lucene.index.TestPersistentSnapshotDeletionPolicy.testSnapshotDeletionPolicy

Error Message:
Captured an uncaught exception in thread: Thread[id=897, name=Thread-713, state=RUNNABLE, group=TGRP-TestPersistentSnapshotDeletionPolicy]

Stack Trace:
com.carrotsearch.randomizedtesting.UncaughtExceptionError: Captured an uncaught exception in thread: Thread[id=897, name=Thread-713, state=RUNNABLE, group=TGRP-TestPersistentSnapshotDeletionPolicy]
	at __randomizedtesting.SeedInfo.seed([794ABB7D513645B4:227848970B223BF7]:0)
Caused by: java.lang.AssertionError: addDocument failed
	at __randomizedtesting.SeedInfo.seed([794ABB7D513645B4]:0)
	at org.junit.Assert.fail(Assert.java:93)
	at org.apache.lucene.index.TestSnapshotDeletionPolicy$1.run(TestSnapshotDeletionPolicy.java:124)


REGRESSION:  org.apache.lucene.index.TestSegmentTermEnum.testTermEnum

Error Message:
MockDirectoryWrapper: cannot close: there are still open locks: [write.lock]

Stack Trace:
java.lang.RuntimeException: MockDirectoryWrapper: cannot close: there are still open locks: [write.lock]
	at org.apache.lucene.store.MockDirectoryWrapper.close(MockDirectoryWrapper.java:552)
	at org.apache.lucene.index.TestSegmentTermEnum.tearDown(TestSegmentTermEnum.java:45)
	at sun.reflect.GeneratedMethodAccessor10.invoke(Unknown Source)
	at sun.reflect.DelegatingMethodAccessorImpl.invoke(DelegatingMethodAccessorImpl.java:25)
	at java.lang.reflect.Method.invoke(Method.java:600)
	at com.carrotsearch.randomizedtesting.RandomizedRunner.invoke(RandomizedRunner.java:1559)
	at com.carrotsearch.randomizedtesting.RandomizedRunner.access$600(RandomizedRunner.java:79)
	at com.carrotsearch.randomizedtesting.RandomizedRunner$8.evaluate(RandomizedRunner.java:795)
	at org.apache.lucene.util.TestRuleSetupTeardownChained$1.evaluate(TestRuleSetupTeardownChained.java:50)
	at org.apache.lucene.util.TestRuleFieldCacheSanity$1.evaluate(TestRuleFieldCacheSanity.java:32)
	at org.apache.lucene.util.AbstractBeforeAfterRule$1.evaluate(AbstractBeforeAfterRule.java:45)
	at com.carrotsearch.randomizedtesting.rules.SystemPropertiesInvariantRule$1.evaluate(SystemPropertiesInvariantRule.java:55)
	at org.apache.lucene.util.TestRuleThreadAndTestName$1.evaluate(TestRuleThreadAndTestName.java:48)
	at org.apache.lucene.util.TestRuleIgnoreAfterMaxFailures$1.evaluate(TestRuleIgnoreAfterMaxFailures.java:70)
	at org.apache.lucene.util.TestRuleMarkFailure$1.evaluate(TestRuleMarkFailure.java:48)
	at com.carrotsearch.randomizedtesting.rules.StatementAdapter.evaluate(StatementAdapter.java:36)
	at com.carrotsearch.randomizedtesting.ThreadLeakControl$StatementRunner.run(ThreadLeakControl.java:345)
	at com.carrotsearch.randomizedtesting.ThreadLeakControl.forkTimeoutingTask(ThreadLeakControl.java:769)
	at com.carrotsearch.randomizedtesting.ThreadLeakControl$3.evaluate(ThreadLeakControl.java:429)
	at com.carrotsearch.randomizedtesting.RandomizedRunner.runSingleTest(RandomizedRunner.java:746)
	at com.carrotsearch.randomizedtesting.RandomizedRunner$3.evaluate(RandomizedRunner.java:648)
	at com.carrotsearch.randomizedtesting.RandomizedRunner$4.evaluate(RandomizedRunner.java:682)
	at com.carrotsearch.randomizedtesting.RandomizedRunner$5.evaluate(RandomizedRunner.java:693)
	at org.apache.lucene.util.AbstractBeforeAfterRule$1.evaluate(AbstractBeforeAfterRule.java:45)
	at org.apache.lucene.util.TestRuleStoreClassName$1.evaluate(TestRuleStoreClassName.java:38)
	at com.carrotsearch.randomizedtesting.rules.SystemPropertiesInvariantRule$1.evaluate(SystemPropertiesInvariantRule.java:55)
	at com.carrotsearch.randomizedtesting.rules.NoShadowingOrOverridesOnMethodsRule$1.evaluate(NoShadowingOrOverridesOnMethodsRule.java:39)
	at com.carrotsearch.randomizedtesting.rules.NoShadowingOrOverridesOnMethodsRule$1.evaluate(NoShadowingOrOverridesOnMethodsRule.java:39)
	at org.apache.lucene.util.TestRuleAssertionsRequired$1.evaluate(TestRuleAssertionsRequired.java:40)
	at org.apache.lucene.util.TestRuleMarkFailure$1.evaluate(TestRuleMarkFailure.java:48)
	at org.apache.lucene.util.TestRuleIgnoreAfterMaxFailures$1.evaluate(TestRuleIgnoreAfterMaxFailures.java:70)
	at org.apache.lucene.util.TestRuleIgnoreTestSuites$1.evaluate(TestRuleIgnoreTestSuites.java:55)
	at com.carrotsearch.randomizedtesting.rules.StatementAdapter.evaluate(StatementAdapter.java:36)
	at com.carrotsearch.randomizedtesting.ThreadLeakControl$StatementRunner.run(ThreadLeakControl.java:345)
	at java.lang.Thread.run(Thread.java:736)




Build Log:
[...truncated 696 lines...]
[junit4:junit4] Suite: org.apache.lucene.search.TestNumericRangeQuery32
[junit4:junit4]   2> NOTE: test params are: codec=Lucene40: {field2147483647=PostingsFormat(name=Direct), field2=PostingsFormat(name=Memory doPackFST= true), ascfield2=PostingsFormat(name=Memory doPackFST= false), field4=PostingsFormat(name=Direct), ascfield4=PostingsFormat(name=Lucene40WithOrds), field8=PostingsFormat(name=Direct), ascfield8=PostingsFormat(name=Lucene40WithOrds)}, sim=RandomSimilarityProvider(queryNorm=false,coord=yes): {}, locale=cs_CZ_EURO, timezone=Etc/GMT+1
[junit4:junit4]   2> NOTE: Linux 3.2.0-29-generic x86/IBM Corporation 1.6.0 (32-bit)/cpus=8,threads=1,free=7494480,total=52970496
[junit4:junit4]   2> NOTE: All tests run in this JVM: [TestRollingBuffer, TestDoc, TestDocValuesScoring, TestReaderClosed, TestIndexWriterOnJRECrash, Test10KPulsings, TestDocValuesTypeCompatibility, TestLookaheadTokenFilter, TestFSTs, TestSearchWithThreads, TestSpecialOperations, TestConsistentFieldNumbers, TestSubScorerFreqs, TestPerFieldPostingsFormat, TestSimilarityBase, TestVirtualMethod, TestBasics, TestParallelAtomicReader, TestForceMergeForever, TestNot, TestHugeRamFile, TestFuzzyQuery, TestCollectionUtil, TestDocBoost, TestRAMDirectory, TestFieldValueFilter, TestBoolean2, TestSizeBoundedForceMerge, TestNeverDelete, TestFieldsReader, TestSentinelIntSet, TestPulsingReuse, TestNRTReaderWithThreads, TestStressAdvance, TestBasicOperations, TestIndexWriterOnDiskFull, TestBitUtil, TestSegmentMerger, TestDuelingCodecs, TestSpansAdvanced2, TestParallelReaderEmptyIndex, TestRegexpRandom2, TestPayloads, TestStressIndexing, TestByteBlockPool, TestNewestSegment, TestIndexWriterMergePolicy, TestMultiPhraseQuery, TestCachingCollector, TestCrash, TestSpanMultiTermQueryWrapper, Before3, Before3, TestTermsEnum, TestNamedSPILoader, TestBooleanQuery, TestSpansAdvanced, TestConstantScoreQuery, TestTopScoreDocCollector, TestTermRangeQuery, TestAddIndexes, TestMinimize, TestCharFilter, TestIndexWriterUnicode, TestCopyBytes, TestSumDocFreq, TestCheckIndex, TestField, TestNGramPhraseQuery, TestDateTools, TestSimpleSearchEquivalence, TestMergeSchedulerExternal, TestLock, TestFieldCacheSanityChecker, TestSearchForDuplicates, TestComplexExplanationsOfNonMatches, TestFieldCacheTermsFilter, TestTopDocsMerge, TestGraphTokenizers, TestNumericRangeQuery32]
[junit4:junit4]   2> NOTE: reproduce with: ant test  -Dtestcase=TestNumericRangeQuery32 -Dtests.seed=794ABB7D513645B4 -Dtests.multiplier=3 -Dtests.slow=true -Dtests.locale=cs_CZ_EURO -Dtests.timezone=Etc/GMT+1 -Dtests.file.encoding=ISO-8859-1
[junit4:junit4] ERROR   0.00s J1 | TestNumericRangeQuery32 (suite) <<<
[junit4:junit4]    > Throwable #1: java.lang.AssertionError
[junit4:junit4]    > 	at __randomizedtesting.SeedInfo.seed([794ABB7D513645B4]:0)
[junit4:junit4]    > 	at org.apache.lucene.util.packed.GrowableWriter.ensureCapacity(GrowableWriter.java:70)
[junit4:junit4]    > 	at org.apache.lucene.util.packed.GrowableWriter.set(GrowableWriter.java:83)
[junit4:junit4]    > 	at org.apache.lucene.util.fst.FST.pack(FST.java:1505)
[junit4:junit4]    > 	at org.apache.lucene.codecs.memory.MemoryPostingsFormat$TermsWriter.finish(MemoryPostingsFormat.java:273)
[junit4:junit4]    > 	at org.apache.lucene.index.FreqProxTermsWriterPerField.flush(FreqProxTermsWriterPerField.java:550)
[junit4:junit4]    > 	at org.apache.lucene.index.FreqProxTermsWriter.flush(FreqProxTermsWriter.java:85)
[junit4:junit4]    > 	at org.apache.lucene.index.TermsHash.flush(TermsHash.java:117)
[junit4:junit4]    > 	at org.apache.lucene.index.DocInverter.flush(DocInverter.java:53)
[junit4:junit4]    > 	at org.apache.lucene.index.DocFieldProcessor.flush(DocFieldProcessor.java:82)
[junit4:junit4]    > 	at org.apache.lucene.index.DocumentsWriterPerThread.flush(DocumentsWriterPerThread.java:481)
[junit4:junit4]    > 	at org.apache.lucene.index.DocumentsWriter.doFlush(DocumentsWriter.java:419)
[junit4:junit4]    > 	at org.apache.lucene.index.DocumentsWriter.flushAllThreads(DocumentsWriter.java:551)
[junit4:junit4]    > 	at org.apache.lucene.index.IndexWriter.prepareCommit(IndexWriter.java:2613)
[junit4:junit4]    > 	at org.apache.lucene.index.IndexWriter.commitInternal(IndexWriter.java:2749)
[junit4:junit4]    > 	at org.apache.lucene.index.IndexWriter.commit(IndexWriter.java:2729)
[junit4:junit4]    > 	at org.apache.lucene.index.IndexWriter.commit(IndexWriter.java:2713)
[junit4:junit4]    > 	at org.apache.lucene.index.RandomIndexWriter.maybeCommit(RandomIndexWriter.java:266)
[junit4:junit4]    > 	at org.apache.lucene.index.RandomIndexWriter.addDocument(RandomIndexWriter.java:189)
[junit4:junit4]    > 	at org.apache.lucene.index.RandomIndexWriter.addDocument(RandomIndexWriter.java:145)
[junit4:junit4]    > 	at org.apache.lucene.search.TestNumericRangeQuery32.beforeClass(TestNumericRangeQuery32.java:120)
[junit4:junit4]    > 	at sun.reflect.NativeMethodAccessorImpl.invoke0(Native Method)
[junit4:junit4]    > 	at sun.reflect.NativeMethodAccessorImpl.invoke(NativeMethodAccessorImpl.java:48)
[junit4:junit4]    > 	at sun.reflect.DelegatingMethodAccessorImpl.invoke(DelegatingMethodAccessorImpl.java:25)
[junit4:junit4]    > 	at java.lang.reflect.Method.invoke(Method.java:600)
[junit4:junit4]    > 	at com.carrotsearch.randomizedtesting.RandomizedRunner.invoke(RandomizedRunner.java:1559)
[junit4:junit4]    > 	at com.carrotsearch.randomizedtesting.RandomizedRunner.access$600(RandomizedRunner.java:79)
[junit4:junit4]    > 	at com.carrotsearch.randomizedtesting.RandomizedRunner$4.evaluate(RandomizedRunner.java:677)
[junit4:junit4]    > 	at com.carrotsearch.randomizedtesting.RandomizedRunner$5.evaluate(RandomizedRunner.java:693)
[junit4:junit4]    > 	at org.apache.lucene.util.AbstractBeforeAfterRule$1.evaluate(AbstractBeforeAfterRule.java:45)
[junit4:junit4]    > 	at org.apache.lucene.util.TestRuleStoreClassName$1.evaluate(TestRuleStoreClassName.java:38)
[junit4:junit4]    > 	at com.carrotsearch.randomizedtesting.rules.SystemPropertiesInvariantRule$1.evaluate(SystemPropertiesInvariantRule.java:55)
[junit4:junit4]    > 	at com.carrotsearch.randomizedtesting.rules.NoShadowingOrOverridesOnMethodsRule$1.evaluate(NoShadowingOrOverridesOnMethodsRule.java:39)
[junit4:junit4]    > 	at com.carrotsearch.randomizedtesting.rules.NoShadowingOrOverridesOnMethodsRule$1.evaluate(NoShadowingOrOverridesOnMethodsRule.java:39)
[junit4:junit4]    > 	at org.apache.lucene.util.TestRuleAssertionsRequired$1.evaluate(TestRuleAssertionsRequired.java:40)
[junit4:junit4]    > 	at org.apache.lucene.util.TestRuleMarkFailure$1.evaluate(TestRuleMarkFailure.java:48)
[junit4:junit4]    > 	at org.apache.lucene.util.TestRuleIgnoreAfterMaxFailures$1.evaluate(TestRuleIgnoreAfterMaxFailures.java:70)
[junit4:junit4]    > 	at org.apache.lucene.util.TestRuleIgnoreTestSuites$1.evaluate(TestRuleIgnoreTestSuites.java:55)
[junit4:junit4]    > 	at com.carrotsearch.randomizedtesting.rules.StatementAdapter.evaluate(StatementAdapter.java:36)
[junit4:junit4]    > 	at com.carrotsearch.randomizedtesting.ThreadLeakControl$StatementRunner.run(ThreadLeakControl.java:345)
[junit4:junit4]    > 	at java.lang.Thread.run(Thread.java:736)
[junit4:junit4]    > Throwable #2: java.lang.NullPointerException
[junit4:junit4]    > 	at __randomizedtesting.SeedInfo.seed([794ABB7D513645B4]:0)
[junit4:junit4]    > 	at org.apache.lucene.search.TestNumericRangeQuery32.afterClass(TestNumericRangeQuery32.java:131)
[junit4:junit4]    > 	at sun.reflect.NativeMethodAccessorImpl.invoke0(Native Method)
[junit4:junit4]    > 	at sun.reflect.NativeMethodAccessorImpl.invoke(NativeMethodAccessorImpl.java:48)
[junit4:junit4]    > 	at sun.reflect.DelegatingMethodAccessorImpl.invoke(DelegatingMethodAccessorImpl.java:25)
[junit4:junit4]    > 	at java.lang.reflect.Method.invoke(Method.java:600)
[junit4:junit4]    > 	at com.carrotsearch.randomizedtesting.RandomizedRunner.invoke(RandomizedRunner.java:1559)
[junit4:junit4]    > 	at com.carrotsearch.randomizedtesting.RandomizedRunner.access$600(RandomizedRunner.java:79)
[junit4:junit4]    > 	at com.carrotsearch.randomizedtesting.RandomizedRunner$5.evaluate(RandomizedRunner.java:700)
[junit4:junit4]    > 	at org.apache.lucene.util.AbstractBeforeAfterRule$1.evaluate(AbstractBeforeAfterRule.java:45)
[junit4:junit4]    > 	at org.apache.lucene.util.TestRuleStoreClassName$1.evaluate(TestRuleStoreClassName.java:38)
[junit4:junit4]    > 	at com.carrotsearch.randomizedtesting.rules.SystemPropertiesInvariantRule$1.evaluate(SystemPropertiesInvariantRule.java:55)
[junit4:junit4]    > 	at com.carrotsearch.randomizedtesting.rules.NoShadowingOrOverridesOnMethodsRule$1.evaluate(NoShadowingOrOverridesOnMethodsRule.java:39)
[junit4:junit4]    > 	at com.carrotsearch.randomizedtesting.rules.NoShadowingOrOverridesOnMethodsRule$1.evaluate(NoShadowingOrOverridesOnMethodsRule.java:39)
[junit4:junit4]    > 	at org.apache.lucene.util.TestRuleAssertionsRequired$1.evaluate(TestRuleAssertionsRequired.java:40)
[junit4:junit4]    > 	at org.apache.lucene.util.TestRuleMarkFailure$1.evaluate(TestRuleMarkFailure.java:48)
[junit4:junit4]    > 	at org.apache.lucene.util.TestRuleIgnoreAfterMaxFailures$1.evaluate(TestRuleIgnoreAfterMaxFailures.java:70)
[junit4:junit4]    > 	at org.apache.lucene.util.TestRuleIgnoreTestSuites$1.evaluate(TestRuleIgnoreTestSuites.java:55)
[junit4:junit4]    > 	at com.carrotsearch.randomizedtesting.rules.StatementAdapter.evaluate(StatementAdapter.java:36)
[junit4:junit4]    > 	at com.carrotsearch.randomizedtesting.ThreadLeakControl$StatementRunner.run(ThreadLeakControl.java:345)
[junit4:junit4]    > 	at java.lang.Thread.run(Thread.java:736)
[junit4:junit4] Completed on J1 in 2.66s, 0 tests, 1 failure, 1 error <<< FAILURES!

[...truncated 13 lines...]
[junit4:junit4] Suite: org.apache.lucene.index.TestPersistentSnapshotDeletionPolicy
[junit4:junit4]   2> 2012.08.14. 21:30:48 com.carrotsearch.randomizedtesting.RandomizedRunner$QueueUncaughtExceptionsHandler uncaughtException
[junit4:junit4]   2> WARNING: Uncaught exception in thread: Thread[Thread-713,5,TGRP-TestPersistentSnapshotDeletionPolicy]
[junit4:junit4]   2> Throwable occurred: java.lang.AssertionError: addDocument failed
[junit4:junit4]   2> 	at __randomizedtesting.SeedInfo.seed([794ABB7D513645B4]:0)
[junit4:junit4]   2> 	at org.junit.Assert.fail(Assert.java:93)
[junit4:junit4]   2> 	at org.apache.lucene.index.TestSnapshotDeletionPolicy$1.run(TestSnapshotDeletionPolicy.java:124)
[junit4:junit4]   1> java.lang.AssertionError
[junit4:junit4]   1> 	at org.apache.lucene.util.packed.GrowableWriter.ensureCapacity(GrowableWriter.java:70)
[junit4:junit4]   1> 	at org.apache.lucene.util.packed.GrowableWriter.set(GrowableWriter.java:83)
[junit4:junit4]   1> 	at org.apache.lucene.util.fst.FST.pack(FST.java:1505)
[junit4:junit4]   1> 	at org.apache.lucene.codecs.memory.MemoryPostingsFormat$TermsWriter.finish(MemoryPostingsFormat.java:273)
[junit4:junit4]   1> 	at org.apache.lucene.codecs.TermsConsumer.merge(TermsConsumer.java:199)
[junit4:junit4]   1> 	at org.apache.lucene.codecs.FieldsConsumer.merge(FieldsConsumer.java:61)
[junit4:junit4]   1> 	at org.apache.lucene.index.SegmentMerger.mergeTerms(SegmentMerger.java:315)
[junit4:junit4]   1> 	at org.apache.lucene.index.SegmentMerger.merge(SegmentMerger.java:108)
[junit4:junit4]   1> 	at org.apache.lucene.index.IndexWriter.mergeMiddle(IndexWriter.java:3589)
[junit4:junit4]   1> 	at org.apache.lucene.index.IndexWriter.merge(IndexWriter.java:3204)
[junit4:junit4]   1> 	at org.apache.lucene.index.SerialMergeScheduler.merge(SerialMergeScheduler.java:36)
[junit4:junit4]   1> 	at org.apache.lucene.index.IndexWriter.maybeMerge(IndexWriter.java:1803)
[junit4:junit4]   1> 	at org.apache.lucene.index.IndexWriter.maybeMerge(IndexWriter.java:1797)
[junit4:junit4]   1> 	at org.apache.lucene.index.IndexWriter.updateDocument(IndexWriter.java:1443)
[junit4:junit4]   1> 	at org.apache.lucene.index.IndexWriter.addDocument(IndexWriter.java:1111)
[junit4:junit4]   1> 	at org.apache.lucene.index.IndexWriter.addDocument(IndexWriter.java:1092)
[junit4:junit4]   1> 	at org.apache.lucene.index.TestSnapshotDeletionPolicy$1.run(TestSnapshotDeletionPolicy.java:121)
[junit4:junit4]   2> NOTE: reproduce with: ant test  -Dtestcase=TestPersistentSnapshotDeletionPolicy -Dtests.method=testSnapshotDeletionPolicy -Dtests.seed=794ABB7D513645B4 -Dtests.multiplier=3 -Dtests.slow=true -Dtests.locale=hu_HU_EURO -Dtests.timezone=Asia/Baku -Dtests.file.encoding=ISO-8859-1
[junit4:junit4] ERROR   0.23s J1 | TestPersistentSnapshotDeletionPolicy.testSnapshotDeletionPolicy <<<
[junit4:junit4]    > Throwable #1: com.carrotsearch.randomizedtesting.UncaughtExceptionError: Captured an uncaught exception in thread: Thread[id=897, name=Thread-713, state=RUNNABLE, group=TGRP-TestPersistentSnapshotDeletionPolicy]
[junit4:junit4]    > 	at __randomizedtesting.SeedInfo.seed([794ABB7D513645B4:227848970B223BF7]:0)
[junit4:junit4]    > Caused by: java.lang.AssertionError: addDocument failed
[junit4:junit4]    > 	at __randomizedtesting.SeedInfo.seed([794ABB7D513645B4]:0)
[junit4:junit4]    > 	at org.junit.Assert.fail(Assert.java:93)
[junit4:junit4]    > 	at org.apache.lucene.index.TestSnapshotDeletionPolicy$1.run(TestSnapshotDeletionPolicy.java:124)
[junit4:junit4]   2> NOTE: test params are: codec=Lucene40: {content=PostingsFormat(name=Memory doPackFST= true)}, sim=RandomSimilarityProvider(queryNorm=true,coord=no): {content=DFR I(F)2}, locale=hu_HU_EURO, timezone=Asia/Baku
[junit4:junit4]   2> NOTE: Linux 3.2.0-29-generic x86/IBM Corporation 1.6.0 (32-bit)/cpus=8,threads=1,free=3729496,total=19456000
[junit4:junit4]   2> NOTE: All tests run in this JVM: [TestRollingBuffer, TestDoc, TestDocValuesScoring, TestReaderClosed, TestIndexWriterOnJRECrash, Test10KPulsings, TestDocValuesTypeCompatibility, TestLookaheadTokenFilter, TestFSTs, TestSearchWithThreads, TestSpecialOperations, TestConsistentFieldNumbers, TestSubScorerFreqs, TestPerFieldPostingsFormat, TestSimilarityBase, TestVirtualMethod, TestBasics, TestParallelAtomicReader, TestForceMergeForever, TestNot, TestHugeRamFile, TestFuzzyQuery, TestCollectionUtil, TestDocBoost, TestRAMDirectory, TestFieldValueFilter, TestBoolean2, TestSizeBoundedForceMerge, TestNeverDelete, TestFieldsReader, TestSentinelIntSet, TestPulsingReuse, TestNRTReaderWithThreads, TestStressAdvance, TestBasicOperations, TestIndexWriterOnDiskFull, TestBitUtil, TestSegmentMerger, TestDuelingCodecs, TestSpansAdvanced2, TestParallelReaderEmptyIndex, TestRegexpRandom2, TestPayloads, TestStressIndexing, TestByteBlockPool, TestNewestSegment, TestIndexWriterMergePolicy, TestMultiPhraseQuery, TestCachingCollector, TestCrash, TestSpanMultiTermQueryWrapper, Before3, Before3, TestTermsEnum, TestNamedSPILoader, TestBooleanQuery, TestSpansAdvanced, TestConstantScoreQuery, TestTopScoreDocCollector, TestTermRangeQuery, TestAddIndexes, TestMinimize, TestCharFilter, TestIndexWriterUnicode, TestCopyBytes, TestSumDocFreq, TestCheckIndex, TestField, TestNGramPhraseQuery, TestDateTools, TestSimpleSearchEquivalence, TestMergeSchedulerExternal, TestLock, TestFieldCacheSanityChecker, TestSearchForDuplicates, TestComplexExplanationsOfNonMatches, TestFieldCacheTermsFilter, TestTopDocsMerge, TestGraphTokenizers, TestNumericRangeQuery32, TestIndexWriterMerging, TestLucene40PostingsReader, TestSearchAfter, TestPersistentSnapshotDeletionPolicy]
[junit4:junit4] Completed on J1 in 1.36s, 14 tests, 1 error <<< FAILURES!

[...truncated 17 lines...]
[junit4:junit4] Suite: org.apache.lucene.index.TestDirectoryReaderReopen
[junit4:junit4]   2> NOTE: reproduce with: ant test  -Dtestcase=TestDirectoryReaderReopen -Dtests.method=testReopen -Dtests.seed=794ABB7D513645B4 -Dtests.multiplier=3 -Dtests.slow=true -Dtests.locale=ar_OM -Dtests.timezone=America/Sitka -Dtests.file.encoding=ISO-8859-1
[junit4:junit4] FAILURE 0.03s J1 | TestDirectoryReaderReopen.testReopen <<<
[junit4:junit4]    > Throwable #1: java.lang.AssertionError
[junit4:junit4]    > 	at __randomizedtesting.SeedInfo.seed([794ABB7D513645B4:55026A6B220ACA97]:0)
[junit4:junit4]    > 	at org.apache.lucene.util.packed.GrowableWriter.ensureCapacity(GrowableWriter.java:70)
[junit4:junit4]    > 	at org.apache.lucene.util.packed.GrowableWriter.set(GrowableWriter.java:83)
[junit4:junit4]    > 	at org.apache.lucene.util.fst.FST.pack(FST.java:1505)
[junit4:junit4]    > 	at org.apache.lucene.codecs.memory.MemoryPostingsFormat$TermsWriter.finish(MemoryPostingsFormat.java:273)
[junit4:junit4]    > 	at org.apache.lucene.codecs.TermsConsumer.merge(TermsConsumer.java:199)
[junit4:junit4]    > 	at org.apache.lucene.codecs.FieldsConsumer.merge(FieldsConsumer.java:61)
[junit4:junit4]    > 	at org.apache.lucene.index.SegmentMerger.mergeTerms(SegmentMerger.java:315)
[junit4:junit4]    > 	at org.apache.lucene.index.SegmentMerger.merge(SegmentMerger.java:108)
[junit4:junit4]    > 	at org.apache.lucene.index.IndexWriter.mergeMiddle(IndexWriter.java:3589)
[junit4:junit4]    > 	at org.apache.lucene.index.IndexWriter.merge(IndexWriter.java:3204)
[junit4:junit4]    > 	at org.apache.lucene.index.SerialMergeScheduler.merge(SerialMergeScheduler.java:36)
[junit4:junit4]    > 	at org.apache.lucene.index.IndexWriter.maybeMerge(IndexWriter.java:1803)
[junit4:junit4]    > 	at org.apache.lucene.index.IndexWriter.maybeMerge(IndexWriter.java:1797)
[junit4:junit4]    > 	at org.apache.lucene.index.IndexWriter.updateDocument(IndexWriter.java:1443)
[junit4:junit4]    > 	at org.apache.lucene.index.IndexWriter.addDocument(IndexWriter.java:1111)
[junit4:junit4]    > 	at org.apache.lucene.index.IndexWriter.addDocument(IndexWriter.java:1092)
[junit4:junit4]    > 	at org.apache.lucene.index.TestDirectoryReaderReopen.createIndex(TestDirectoryReaderReopen.java:438)
[junit4:junit4]    > 	at org.apache.lucene.index.TestDirectoryReaderReopen.testReopen(TestDirectoryReaderReopen.java:49)
[junit4:junit4]    > 	at sun.reflect.NativeMethodAccessorImpl.invoke0(Native Method)
[junit4:junit4]    > 	at sun.reflect.NativeMethodAccessorImpl.invoke(NativeMethodAccessorImpl.java:48)
[junit4:junit4]    > 	at sun.reflect.DelegatingMethodAccessorImpl.invoke(DelegatingMethodAccessorImpl.java:25)
[junit4:junit4]    > 	at java.lang.reflect.Method.invoke(Method.java:600)
[junit4:junit4]    > 	at com.carrotsearch.randomizedtesting.RandomizedRunner.invoke(RandomizedRunner.java:1559)
[junit4:junit4]    > 	at com.carrotsearch.randomizedtesting.RandomizedRunner.access$600(RandomizedRunner.java:79)
[junit4:junit4]    > 	at com.carrotsearch.randomizedtesting.RandomizedRunner$6.evaluate(RandomizedRunner.java:737)
[junit4:junit4]    > 	at com.carrotsearch.randomizedtesting.RandomizedRunner$7.evaluate(RandomizedRunner.java:773)
[junit4:junit4]    > 	at com.carrotsearch.randomizedtesting.RandomizedRunner$8.evaluate(RandomizedRunner.java:787)
[junit4:junit4]    > 	at org.apache.lucene.util.TestRuleSetupTeardownChained$1.evaluate(TestRuleSetupTeardownChained.java:50)
[junit4:junit4]    > 	at org.apache.lucene.util.TestRuleFieldCacheSanity$1.evaluate(TestRuleFieldCacheSanity.java:32)
[junit4:junit4]    > 	at org.apache.lucene.util.AbstractBeforeAfterRule$1.evaluate(AbstractBeforeAfterRule.java:45)
[junit4:junit4]    > 	at com.carrotsearch.randomizedtesting.rules.SystemPropertiesInvariantRule$1.evaluate(SystemPropertiesInvariantRule.java:55)
[junit4:junit4]    > 	at org.apache.lucene.util.TestRuleThreadAndTestName$1.evaluate(TestRuleThreadAndTestName.java:48)
[junit4:junit4]    > 	at org.apache.lucene.util.TestRuleIgnoreAfterMaxFailures$1.evaluate(TestRuleIgnoreAfterMaxFailures.java:70)
[junit4:junit4]    > 	at org.apache.lucene.util.TestRuleMarkFailure$1.evaluate(TestRuleMarkFailure.java:48)
[junit4:junit4]    > 	at com.carrotsearch.randomizedtesting.rules.StatementAdapter.evaluate(StatementAdapter.java:36)
[junit4:junit4]    > 	at com.carrotsearch.randomizedtesting.ThreadLeakControl$StatementRunner.run(ThreadLeakControl.java:345)
[junit4:junit4]    > 	at com.carrotsearch.randomizedtesting.ThreadLeakControl.forkTimeoutingTask(ThreadLeakControl.java:769)
[junit4:junit4]    > 	at com.carrotsearch.randomizedtesting.ThreadLeakControl$3.evaluate(ThreadLeakControl.java:429)
[junit4:junit4]    > 	at com.carrotsearch.randomizedtesting.RandomizedRunner.runSingleTest(RandomizedRunner.java:746)
[junit4:junit4]    > 	at com.carrotsearch.randomizedtesting.RandomizedRunner$3.evaluate(RandomizedRunner.java:648)
[junit4:junit4]    > 	at com.carrotsearch.randomizedtesting.RandomizedRunner$4.evaluate(RandomizedRunner.java:682)
[junit4:junit4]    > 	at com.carrotsearch.randomizedtesting.RandomizedRunner$5.evaluate(RandomizedRunner.java:693)
[junit4:junit4]    > 	at org.apache.lucene.util.AbstractBeforeAfterRule$1.evaluate(AbstractBeforeAfterRule.java:45)
[junit4:junit4]    > 	at org.apache.lucene.util.TestRuleStoreClassName$1.evaluate(TestRuleStoreClassName.java:38)
[junit4:junit4]    > 	at com.carrotsearch.randomizedtesting.rules.SystemPropertiesInvariantRule$1.evaluate(SystemPropertiesInvariantRule.java:55)
[junit4:junit4]    > 	at com.carrotsearch.randomizedtesting.rules.NoShadowingOrOverridesOnMethodsRule$1.evaluate(NoShadowingOrOverridesOnMethodsRule.java:39)
[junit4:junit4]    > 	at com.carrotsearch.randomizedtesting.rules.NoShadowingOrOverridesOnMethodsRule$1.evaluate(NoShadowingOrOverridesOnMethodsRule.java:39)
[junit4:junit4]    > 	at org.apache.lucene.util.TestRuleAssertionsRequired$1.evaluate(TestRuleAssertionsRequired.java:40)
[junit4:junit4]    > 	at org.apache.lucene.util.TestRuleMarkFailure$1.evaluate(TestRuleMarkFailure.java:48)
[junit4:junit4]    > 	at org.apache.lucene.util.TestRuleIgnoreAfterMaxFailures$1.evaluate(TestRuleIgnoreAfterMaxFailures.java:70)
[junit4:junit4]    > 	at org.apache.lucene.util.TestRuleIgnoreTestSuites$1.evaluate(TestRuleIgnoreTestSuites.java:55)
[junit4:junit4]    > 	at com.carrotsearch.randomizedtesting.rules.StatementAdapter.evaluate(StatementAdapter.java:36)
[junit4:junit4]    > 	at com.carrotsearch.randomizedtesting.ThreadLeakControl$StatementRunner.run(ThreadLeakControl.java:345)
[junit4:junit4]    > 	at java.lang.Thread.run(Thread.java:736)
[junit4:junit4]   2> NOTE: reproduce with: ant test  -Dtestcase=TestDirectoryReaderReopen -Dtests.method=testThreadSafety -Dtests.seed=794ABB7D513645B4 -Dtests.multiplier=3 -Dtests.slow=true -Dtests.locale=ar_OM -Dtests.timezone=America/Sitka -Dtests.file.encoding=ISO-8859-1
[junit4:junit4] FAILURE 0.01s J1 | TestDirectoryReaderReopen.testThreadSafety <<<
[junit4:junit4]    > Throwable #1: java.lang.AssertionError
[junit4:junit4]    > 	at __randomizedtesting.SeedInfo.seed([794ABB7D513645B4:E300AF2582A9F742]:0)
[junit4:junit4]    > 	at org.apache.lucene.util.packed.GrowableWriter.ensureCapacity(GrowableWriter.java:70)
[junit4:junit4]    > 	at org.apache.lucene.util.packed.GrowableWriter.set(GrowableWriter.java:83)
[junit4:junit4]    > 	at org.apache.lucene.util.fst.FST.pack(FST.java:1505)
[junit4:junit4]    > 	at org.apache.lucene.codecs.memory.MemoryPostingsFormat$TermsWriter.finish(MemoryPostingsFormat.java:273)
[junit4:junit4]    > 	at org.apache.lucene.index.FreqProxTermsWriterPerField.flush(FreqProxTermsWriterPerField.java:550)
[junit4:junit4]    > 	at org.apache.lucene.index.FreqProxTermsWriter.flush(FreqProxTermsWriter.java:85)
[junit4:junit4]    > 	at org.apache.lucene.index.TermsHash.flush(TermsHash.java:117)
[junit4:junit4]    > 	at org.apache.lucene.index.DocInverter.flush(DocInverter.java:53)
[junit4:junit4]    > 	at org.apache.lucene.index.DocFieldProcessor.flush(DocFieldProcessor.java:82)
[junit4:junit4]    > 	at org.apache.lucene.index.DocumentsWriterPerThread.flush(DocumentsWriterPerThread.java:481)
[junit4:junit4]    > 	at org.apache.lucene.index.DocumentsWriter.doFlush(DocumentsWriter.java:419)
[junit4:junit4]    > 	at org.apache.lucene.index.DocumentsWriter.flushAllThreads(DocumentsWriter.java:551)
[junit4:junit4]    > 	at org.apache.lucene.index.IndexWriter.doFlush(IndexWriter.java:2841)
[junit4:junit4]    > 	at org.apache.lucene.index.IndexWriter.flush(IndexWriter.java:2817)
[junit4:junit4]    > 	at org.apache.lucene.index.IndexWriter.forceMerge(IndexWriter.java:1593)
[junit4:junit4]    > 	at org.apache.lucene.index.IndexWriter.forceMerge(IndexWriter.java:1569)
[junit4:junit4]    > 	at org.apache.lucene.index.TestDirectoryReaderReopen.testThreadSafety(TestDirectoryReaderReopen.java:206)
[junit4:junit4]    > 	at sun.reflect.NativeMethodAccessorImpl.invoke0(Native Method)
[junit4:junit4]    > 	at sun.reflect.NativeMethodAccessorImpl.invoke(NativeMethodAccessorImpl.java:48)
[junit4:junit4]    > 	at sun.reflect.DelegatingMethodAccessorImpl.invoke(DelegatingMethodAccessorImpl.java:25)
[junit4:junit4]    > 	at java.lang.reflect.Method.invoke(Method.java:600)
[junit4:junit4]    > 	at com.carrotsearch.randomizedtesting.RandomizedRunner.invoke(RandomizedRunner.java:1559)
[junit4:junit4]    > 	at com.carrotsearch.randomizedtesting.RandomizedRunner.access$600(RandomizedRunner.java:79)
[junit4:junit4]    > 	at com.carrotsearch.randomizedtesting.RandomizedRunner$6.evaluate(RandomizedRunner.java:737)
[junit4:junit4]    > 	at com.carrotsearch.randomizedtesting.RandomizedRunner$7.evaluate(RandomizedRunner.java:773)
[junit4:junit4]    > 	at com.carrotsearch.randomizedtesting.RandomizedRunner$8.evaluate(RandomizedRunner.java:787)
[junit4:junit4]    > 	at org.apache.lucene.util.TestRuleSetupTeardownChained$1.evaluate(TestRuleSetupTeardownChained.java:50)
[junit4:junit4]    > 	at org.apache.lucene.util.TestRuleFieldCacheSanity$1.evaluate(TestRuleFieldCacheSanity.java:32)
[junit4:junit4]    > 	at org.apache.lucene.util.AbstractBeforeAfterRule$1.evaluate(AbstractBeforeAfterRule.java:45)
[junit4:junit4]    > 	at com.carrotsearch.randomizedtesting.rules.SystemPropertiesInvariantRule$1.evaluate(SystemPropertiesInvariantRule.java:55)
[junit4:junit4]    > 	at org.apache.lucene.util.TestRuleThreadAndTestName$1.evaluate(TestRuleThreadAndTestName.java:48)
[junit4:junit4]    > 	at org.apache.lucene.util.TestRuleIgnoreAfterMaxFailures$1.evaluate(TestRuleIgnoreAfterMaxFailures.java:70)
[junit4:junit4]    > 	at org.apache.lucene.util.TestRuleMarkFailure$1.evaluate(TestRuleMarkFailure.java:48)
[junit4:junit4]    > 	at com.carrotsearch.randomizedtesting.rules.StatementAdapter.evaluate(StatementAdapter.java:36)
[junit4:junit4]    > 	at com.carrotsearch.randomizedtesting.ThreadLeakControl$StatementRunner.run(ThreadLeakControl.java:345)
[junit4:junit4]    > 	at com.carrotsearch.randomizedtesting.ThreadLeakControl.forkTimeoutingTask(ThreadLeakControl.java:769)
[junit4:junit4]    > 	at com.carrotsearch.randomizedtesting.ThreadLeakControl$3.evaluate(ThreadLeakControl.java:429)
[junit4:junit4]    > 	at com.carrotsearch.randomizedtesting.RandomizedRunner.runSingleTest(RandomizedRunner.java:746)
[junit4:junit4]    > 	at com.carrotsearch.randomizedtesting.RandomizedRunner$3.evaluate(RandomizedRunner.java:648)
[junit4:junit4]    > 	at com.carrotsearch.randomizedtesting.RandomizedRunner$4.evaluate(RandomizedRunner.java:682)
[junit4:junit4]    > 	at com.carrotsearch.randomizedtesting.RandomizedRunner$5.evaluate(RandomizedRunner.java:693)
[junit4:junit4]    > 	at org.apache.lucene.util.AbstractBeforeAfterRule$1.evaluate(AbstractBeforeAfterRule.java:45)
[junit4:junit4]    > 	at org.apache.lucene.util.TestRuleStoreClassName$1.evaluate(TestRuleStoreClassName.java:38)
[junit4:junit4]    > 	at com.carrotsearch.randomizedtesting.rules.SystemPropertiesInvariantRule$1.evaluate(SystemPropertiesInvariantRule.java:55)
[junit4:junit4]    > 	at com.carrotsearch.randomizedtesting.rules.NoShadowingOrOverridesOnMethodsRule$1.evaluate(NoShadowingOrOverridesOnMethodsRule.java:39)
[junit4:junit4]    > 	at com.carrotsearch.randomizedtesting.rules.NoShadowingOrOverridesOnMethodsRule$1.evaluate(NoShadowingOrOverridesOnMethodsRule.java:39)
[junit4:junit4]    > 	at org.apache.lucene.util.TestRuleAssertionsRequired$1.evaluate(TestRuleAssertionsRequired.java:40)
[junit4:junit4]    > 	at org.apache.lucene.util.TestRuleMarkFailure$1.evaluate(TestRuleMarkFailure.java:48)
[junit4:junit4]    > 	at org.apache.lucene.util.TestRuleIgnoreAfterMaxFailures$1.evaluate(TestRuleIgnoreAfterMaxFailures.java:70)
[junit4:junit4]    > 	at org.apache.lucene.util.TestRuleIgnoreTestSuites$1.evaluate(TestRuleIgnoreTestSuites.java:55)
[junit4:junit4]    > 	at com.carrotsearch.randomizedtesting.rules.StatementAdapter.evaluate(StatementAdapter.java:36)
[junit4:junit4]    > 	at com.carrotsearch.randomizedtesting.ThreadLeakControl$StatementRunner.run(ThreadLeakControl.java:345)
[junit4:junit4]    > 	at java.lang.Thread.run(Thread.java:736)
[junit4:junit4]   2> NOTE: test params are: codec=Lucene40: {id2=PostingsFormat(name=Direct), fielda=PostingsFormat(name=Asserting), field1=PostingsFormat(name=Asserting), field2=PostingsFormat(name=Memory doPackFST= true), field3=PostingsFormat(name=Direct), field4=MockFixedIntBlock(blockSize=25), id=PostingsFormat(name=Direct)}, sim=RandomSimilarityProvider(queryNorm=false,coord=crazy): {field1=DFR GBZ(0.3), field2=IB SPL-L1, field3=IB LL-D2, field4=DFR I(n)3(800.0), id=DFR I(ne)Z(0.3)}, locale=ar_OM, timezone=America/Sitka
[junit4:junit4]   2> NOTE: Linux 3.2.0-29-generic x86/IBM Corporation 1.6.0 (32-bit)/cpus=8,threads=1,free=8729424,total=16081408
[junit4:junit4]   2> NOTE: All tests run in this JVM: [TestRollingBuffer, TestDoc, TestDocValuesScoring, TestReaderClosed, TestIndexWriterOnJRECrash, Test10KPulsings, TestDocValuesTypeCompatibility, TestLookaheadTokenFilter, TestFSTs, TestSearchWithThreads, TestSpecialOperations, TestConsistentFieldNumbers, TestSubScorerFreqs, TestPerFieldPostingsFormat, TestSimilarityBase, TestVirtualMethod, TestBasics, TestParallelAtomicReader, TestForceMergeForever, TestNot, TestHugeRamFile, TestFuzzyQuery, TestCollectionUtil, TestDocBoost, TestRAMDirectory, TestFieldValueFilter, TestBoolean2, TestSizeBoundedForceMerge, TestNeverDelete, TestFieldsReader, TestSentinelIntSet, TestPulsingReuse, TestNRTReaderWithThreads, TestStressAdvance, TestBasicOperations, TestIndexWriterOnDiskFull, TestBitUtil, TestSegmentMerger, TestDuelingCodecs, TestSpansAdvanced2, TestParallelReaderEmptyIndex, TestRegexpRandom2, TestPayloads, TestStressIndexing, TestByteBlockPool, TestNewestSegment, TestIndexWriterMergePolicy, TestMultiPhraseQuery, TestCachingCollector, TestCrash, TestSpanMultiTermQueryWrapper, Before3, Before3, TestTermsEnum, TestNamedSPILoader, TestBooleanQuery, TestSpansAdvanced, TestConstantScoreQuery, TestTopScoreDocCollector, TestTermRangeQuery, TestAddIndexes, TestMinimize, TestCharFilter, TestIndexWriterUnicode, TestCopyBytes, TestSumDocFreq, TestCheckIndex, TestField, TestNGramPhraseQuery, TestDateTools, TestSimpleSearchEquivalence, TestMergeSchedulerExternal, TestLock, TestFieldCacheSanityChecker, TestSearchForDuplicates, TestComplexExplanationsOfNonMatches, TestFieldCacheTermsFilter, TestTopDocsMerge, TestGraphTokenizers, TestNumericRangeQuery32, TestIndexWriterMerging, TestLucene40PostingsReader, TestSearchAfter, TestPersistentSnapshotDeletionPolicy, TestNRTManager, TestSort, TestArrayUtil, TestIndexWriterDelete, TestDirectoryReaderReopen]
[junit4:junit4] Completed on J1 in 0.10s, 5 tests, 2 failures <<< FAILURES!

[...truncated 302 lines...]
[junit4:junit4] Suite: org.apache.lucene.index.TestSegmentTermEnum
[junit4:junit4]   2> NOTE: reproduce with: ant test  -Dtestcase=TestSegmentTermEnum -Dtests.method=testTermEnum -Dtests.seed=794ABB7D513645B4 -Dtests.multiplier=3 -Dtests.slow=true -Dtests.locale=en_BE -Dtests.timezone=America/Mexico_City -Dtests.file.encoding=ISO-8859-1
[junit4:junit4] ERROR   0.01s J1 | TestSegmentTermEnum.testTermEnum <<<
[junit4:junit4]    > Throwable #1: java.lang.AssertionError
[junit4:junit4]    > 	at org.apache.lucene.util.packed.GrowableWriter.ensureCapacity(GrowableWriter.java:70)
[junit4:junit4]    > 	at org.apache.lucene.util.packed.GrowableWriter.set(GrowableWriter.java:83)
[junit4:junit4]    > 	at org.apache.lucene.util.fst.FST.pack(FST.java:1505)
[junit4:junit4]    > 	at org.apache.lucene.codecs.memory.MemoryPostingsFormat$TermsWriter.finish(MemoryPostingsFormat.java:273)
[junit4:junit4]    > 	at org.apache.lucene.index.FreqProxTermsWriterPerField.flush(FreqProxTermsWriterPerField.java:550)
[junit4:junit4]    > 	at org.apache.lucene.index.FreqProxTermsWriter.flush(FreqProxTermsWriter.java:85)
[junit4:junit4]    > 	at org.apache.lucene.index.TermsHash.flush(TermsHash.java:117)
[junit4:junit4]    > 	at org.apache.lucene.index.DocInverter.flush(DocInverter.java:53)
[junit4:junit4]    > 	at org.apache.lucene.index.DocFieldProcessor.flush(DocFieldProcessor.java:82)
[junit4:junit4]    > 	at org.apache.lucene.index.DocumentsWriterPerThread.flush(DocumentsWriterPerThread.java:481)
[junit4:junit4]    > 	at org.apache.lucene.index.DocumentsWriter.doFlush(DocumentsWriter.java:419)
[junit4:junit4]    > 	at org.apache.lucene.index.DocumentsWriter.flushAllThreads(DocumentsWriter.java:551)
[junit4:junit4]    > 	at org.apache.lucene.index.IndexWriter.doFlush(IndexWriter.java:2841)
[junit4:junit4]    > 	at org.apache.lucene.index.IndexWriter.flush(IndexWriter.java:2817)
[junit4:junit4]    > 	at org.apache.lucene.index.IndexWriter.closeInternal(IndexWriter.java:894)
[junit4:junit4]    > 	at org.apache.lucene.index.IndexWriter.close(IndexWriter.java:849)
[junit4:junit4]    > 	at org.apache.lucene.index.IndexWriter.close(IndexWriter.java:811)
[junit4:junit4]    > 	at org.apache.lucene.index.TestSegmentTermEnum.testTermEnum(TestSegmentTermEnum.java:62)
[junit4:junit4]    > 	at sun.reflect.NativeMethodAccessorImpl.invoke0(Native Method)
[junit4:junit4]    > 	at sun.reflect.NativeMethodAccessorImpl.invoke(NativeMethodAccessorImpl.java:48)
[junit4:junit4]    > 	at sun.reflect.DelegatingMethodAccessorImpl.invoke(DelegatingMethodAccessorImpl.java:25)
[junit4:junit4]    > 	at java.lang.reflect.Method.invoke(Method.java:600)
[junit4:junit4]    > 	at com.carrotsearch.randomizedtesting.RandomizedRunner.invoke(RandomizedRunner.java:1559)
[junit4:junit4]    > 	at com.carrotsearch.randomizedtesting.RandomizedRunner.access$600(RandomizedRunner.java:79)
[junit4:junit4]    > 	at com.carrotsearch.randomizedtesting.RandomizedRunner$6.evaluate(RandomizedRunner.java:737)
[junit4:junit4]    > 	at com.carrotsearch.randomizedtesting.RandomizedRunner$7.evaluate(RandomizedRunner.java:773)
[junit4:junit4]    > 	at com.carrotsearch.randomizedtesting.RandomizedRunner$8.evaluate(RandomizedRunner.java:787)
[junit4:junit4]    > 	at org.apache.lucene.util.TestRuleSetupTeardownChained$1.evaluate(TestRuleSetupTeardownChained.java:50)
[junit4:junit4]    > 	at org.apache.lucene.util.TestRuleFieldCacheSanity$1.evaluate(TestRuleFieldCacheSanity.java:32)
[junit4:junit4]    > 	at org.apache.lucene.util.AbstractBeforeAfterRule$1.evaluate(AbstractBeforeAfterRule.java:45)
[junit4:junit4]    > 	at com.carrotsearch.randomizedtesting.rules.SystemPropertiesInvariantRule$1.evaluate(SystemPropertiesInvariantRule.java:55)
[junit4:junit4]    > 	at org.apache.lucene.util.TestRuleThreadAndTestName$1.evaluate(TestRuleThreadAndTestName.java:48)
[junit4:junit4]    > 	at org.apache.lucene.util.TestRuleIgnoreAfterMaxFailures$1.evaluate(TestRuleIgnoreAfterMaxFailures.java:70)
[junit4:junit4]    > 	at org.apache.lucene.util.TestRuleMarkFailure$1.evaluate(TestRuleMarkFailure.java:48)
[junit4:junit4]    > 	at com.carrotsearch.randomizedtesting.rules.StatementAdapter.evaluate(StatementAdapter.java:36)
[junit4:junit4]    > 	at com.carrotsearch.randomizedtesting.ThreadLeakControl$StatementRunner.run(ThreadLeakControl.java:345)
[junit4:junit4]    > 	at com.carrotsearch.randomizedtesting.ThreadLeakControl.forkTimeoutingTask(ThreadLeakControl.java:769)
[junit4:junit4]    > 	at com.carrotsearch.randomizedtesting.ThreadLeakControl$3.evaluate(ThreadLeakControl.java:429)
[junit4:junit4]    > 	at com.carrotsearch.randomizedtesting.RandomizedRunner.runSingleTest(RandomizedRunner.java:746)
[junit4:junit4]    > 	at com.carrotsearch.randomizedtesting.RandomizedRunner$3.evaluate(RandomizedRunner.java:648)
[junit4:junit4]    > 	at com.carrotsearch.randomizedtesting.RandomizedRunner$4.evaluate(RandomizedRunner.java:682)
[junit4:junit4]    > 	at com.carrotsearch.randomizedtesting.RandomizedRunner$5.evaluate(RandomizedRunner.java:693)
[junit4:junit4]    > 	at org.apache.lucene.util.AbstractBeforeAfterRule$1.evaluate(AbstractBeforeAfterRule.java:45)
[junit4:junit4]    > 	at org.apache.lucene.util.TestRuleStoreClassName$1.evaluate(TestRuleStoreClassName.java:38)
[junit4:junit4]    > 	at com.carrotsearch.randomizedtesting.rules.SystemPropertiesInvariantRule$1.evaluate(SystemPropertiesInvariantRule.java:55)
[junit4:junit4]    > 	at com.carrotsearch.randomizedtesting.rules.NoShadowingOrOverridesOnMethodsRule$1.evaluate(NoShadowingOrOverridesOnMethodsRule.java:39)
[junit4:junit4]    > 	at com.carrotsearch.randomizedtesting.rules.NoShadowingOrOverridesOnMethodsRule$1.evaluate(NoShadowingOrOverridesOnMethodsRule.java:39)
[junit4:junit4]    > 	at org.apache.lucene.util.TestRuleAssertionsRequired$1.evaluate(TestRuleAssertionsRequired.java:40)
[junit4:junit4]    > 	at org.apache.lucene.util.TestRuleMarkFailure$1.evaluate(TestRuleMarkFailure.java:48)
[junit4:junit4]    > 	at org.apache.lucene.util.TestRuleIgnoreAfterMaxFailures$1.evaluate(TestRuleIgnoreAfterMaxFailures.java:70)
[junit4:junit4]    > 	at org.apache.lucene.util.TestRuleIgnoreTestSuites$1.evaluate(TestRuleIgnoreTestSuites.java:55)
[junit4:junit4]    > 	at com.carrotsearch.randomizedtesting.rules.StatementAdapter.evaluate(StatementAdapter.java:36)
[junit4:junit4]    > 	at com.carrotsearch.randomizedtesting.ThreadLeakControl$StatementRunner.run(ThreadLeakControl.java:345)
[junit4:junit4]    > 	at java.lang.Thread.run(Thread.java:736)
[junit4:junit4]    > Throwable #2: java.lang.RuntimeException: MockDirectoryWrapper: cannot close: there are still open locks: [write.lock]
[junit4:junit4]    > 	at org.apache.lucene.store.MockDirectoryWrapper.close(MockDirectoryWrapper.java:552)
[junit4:junit4]    > 	at org.apache.lucene.index.TestSegmentTermEnum.tearDown(TestSegmentTermEnum.java:45)
[junit4:junit4]    > 	at sun.reflect.GeneratedMethodAccessor10.invoke(Unknown Source)
[junit4:junit4]    > 	at sun.reflect.DelegatingMethodAccessorImpl.invoke(DelegatingMethodAccessorImpl.java:25)
[junit4:junit4]    > 	at java.lang.reflect.Method.invoke(Method.java:600)
[junit4:junit4]    > 	at com.carrotsearch.randomizedtesting.RandomizedRunner.invoke(RandomizedRunner.java:1559)
[junit4:junit4]    > 	at com.carrotsearch.randomizedtesting.RandomizedRunner.access$600(RandomizedRunner.java:79)
[junit4:junit4]    > 	at com.carrotsearch.randomizedtesting.RandomizedRunner$8.evaluate(RandomizedRunner.java:795)
[junit4:junit4]    > 	at org.apache.lucene.util.TestRuleSetupTeardownChained$1.evaluate(TestRuleSetupTeardownChained.java:50)
[junit4:junit4]    > 	at org.apache.lucene.util.TestRuleFieldCacheSanity$1.evaluate(TestRuleFieldCacheSanity.java:32)
[junit4:junit4]    > 	at org.apache.lucene.util.AbstractBeforeAfterRule$1.evaluate(AbstractBeforeAfterRule.java:45)
[junit4:junit4]    > 	at com.carrotsearch.randomizedtesting.rules.SystemPropertiesInvariantRule$1.evaluate(SystemPropertiesInvariantRule.java:55)
[junit4:junit4]    > 	at org.apache.lucene.util.TestRuleThreadAndTestName$1.evaluate(TestRuleThreadAndTestName.java:48)
[junit4:junit4]    > 	at org.apache.lucene.util.TestRuleIgnoreAfterMaxFailures$1.evaluate(TestRuleIgnoreAfterMaxFailures.java:70)
[junit4:junit4]    > 	at org.apache.lucene.util.TestRuleMarkFailure$1.evaluate(TestRuleMarkFailure.java:48)
[junit4:junit4]    > 	at com.carrotsearch.randomizedtesting.rules.StatementAdapter.evaluate(StatementAdapter.java:36)
[junit4:junit4]    > 	at com.carrotsearch.randomizedtesting.ThreadLeakControl$StatementRunner.run(ThreadLeakControl.java:345)
[junit4:junit4]    > 	at com.carrotsearch.randomizedtesting.ThreadLeakControl.forkTimeoutingTask(ThreadLeakControl.java:769)
[junit4:junit4]    > 	at com.carrotsearch.randomizedtesting.ThreadLeakControl$3.evaluate(ThreadLeakControl.java:429)
[junit4:junit4]    > 	at com.carrotsearch.randomizedtesting.RandomizedRunner.runSingleTest(RandomizedRunner.java:746)
[junit4:junit4]    > 	at com.carrotsearch.randomizedtesting.RandomizedRunner$3.evaluate(RandomizedRunner.java:648)
[junit4:junit4]    > 	at com.carrotsearch.randomizedtesting.RandomizedRunner$4.evaluate(RandomizedRunner.java:682)
[junit4:junit4]    > 	at com.carrotsearch.randomizedtesting.RandomizedRunner$5.evaluate(RandomizedRunner.java:693)
[junit4:junit4]    > 	at org.apache.lucene.util.AbstractBeforeAfterRule$1.evaluate(AbstractBeforeAfterRule.java:45)
[junit4:junit4]    > 	at org.apache.lucene.util.TestRuleStoreClassName$1.evaluate(TestRuleStoreClassName.java:38)
[junit4:junit4]    > 	at com.carrotsearch.randomizedtesting.rules.SystemPropertiesInvariantRule$1.evaluate(SystemPropertiesInvariantRule.java:55)
[junit4:junit4]    > 	at com.carrotsearch.randomizedtesting.rules.NoShadowingOrOverridesOnMethodsRule$1.evaluate(NoShadowingOrOverridesOnMethodsRule.java:39)
[junit4:junit4]    > 	at com.carrotsearch.randomizedtesting.rules.NoShadowingOrOverridesOnMethodsRule$1.evaluate(NoShadowingOrOverridesOnMethodsRule.java:39)
[junit4:junit4]    > 	at org.apache.lucene.util.TestRuleAssertionsRequired$1.evaluate(TestRuleAssertionsRequired.java:40)
[junit4:junit4]    > 	at org.apache.lucene.util.TestRuleMarkFailure$1.evaluate(TestRuleMarkFailure.java:48)
[junit4:junit4]    > 	at org.apache.lucene.util.TestRuleIgnoreAfterMaxFailures$1.evaluate(TestRuleIgnoreAfterMaxFailures.java:70)
[junit4:junit4]    > 	at org.apache.lucene.util.TestRuleIgnoreTestSuites$1.evaluate(TestRuleIgnoreTestSuites.java:55)
[junit4:junit4]    > 	at com.carrotsearch.randomizedtesting.rules.StatementAdapter.evaluate(StatementAdapter.java:36)
[junit4:junit4]    > 	at com.carrotsearch.randomizedtesting.ThreadLeakControl$StatementRunner.run(ThreadLeakControl.java:345)
[junit4:junit4]    > 	at java.lang.Thread.run(Thread.java:736)
[junit4:junit4]   2> NOTE: test params are: codec=Lucene40: {content=PostingsFormat(name=Memory doPackFST= true)}, sim=DefaultSimilarity, locale=en_BE, timezone=America/Mexico_City
[junit4:junit4]   2> NOTE: Linux 3.2.0-29-generic x86/IBM Corporation 1.6.0 (32-bit)/cpus=8,threads=1,free=10903880,total=85262336
[junit4:junit4]   2> NOTE: All tests run in this JVM: [TestRollingBuffer, TestDoc, TestDocValuesScoring, TestReaderClosed, TestIndexWriterOnJRECrash, Test10KPulsings, TestDocValuesTypeCompatibility, TestLookaheadTokenFilter, TestFSTs, TestSearchWithThreads, TestSpecialOperations, TestConsistentFieldNumbers, TestSubScorerFreqs, TestPerFieldPostingsFormat, TestSimilarityBase, TestVirtualMethod, TestBasics, TestParallelAtomicReader, TestForceMergeForever, TestNot, TestHugeRamFile, TestFuzzyQuery, TestCollectionUtil, TestDocBoost, TestRAMDirectory, TestFieldValueFilter, TestBoolean2, TestSizeBoundedForceMerge, TestNeverDelete, TestFieldsReader, TestSentinelIntSet, TestPulsingReuse, TestNRTReaderWithThreads, TestStressAdvance, TestBasicOperations, TestIndexWriterOnDiskFull, TestBitUtil, TestSegmentMerger, TestDuelingCodecs, TestSpansAdvanced2, TestParallelReaderEmptyIndex, TestRegexpRandom2, TestPayloads, TestStressIndexing, TestByteBlockPool, TestNewestSegment, TestIndexWriterMergePolicy, TestMultiPhraseQuery, TestCachingCollector, TestCrash, TestSpanMultiTermQueryWrapper, Before3, Before3, TestTermsEnum, TestNamedSPILoader, TestBooleanQuery, TestSpansAdvanced, TestConstantScoreQuery, TestTopScoreDocCollector, TestTermRangeQuery, TestAddIndexes, TestMinimize, TestCharFilter, TestIndexWriterUnicode, TestCopyBytes, TestSumDocFreq, TestCheckIndex, TestField, TestNGramPhraseQuery, TestDateTools, TestSimpleSearchEquivalence, TestMergeSchedulerExternal, TestLock, TestFieldCacheSanityChecker, TestSearchForDuplicates, TestComplexExplanationsOfNonMatches, TestFieldCacheTermsFilter, TestTopDocsMerge, TestGraphTokenizers, TestNumericRangeQuery32, TestIndexWriterMerging, TestLucene40PostingsReader, TestSearchAfter, TestPersistentSnapshotDeletionPolicy, TestNRTManager, TestSort, TestArrayUtil, TestIndexWriterDelete, TestDirectoryReaderReopen, TestNRTCachingDirectory, TestIndexWriterForceMerge, TestPagedBytes, TestToken, TestTypePromotion, TestCompoundFile, TestSimpleExplanations, TestMockAnalyzer, TestDeterminizeLexicon, TestDocumentsWriterStallControl, TestTieredMergePolicy, TestConcurrentMergeScheduler, TestSloppyPhraseQuery2, TestStressNRT, TestDocValues, TestUTF32ToUTF8, TestThreadedForceMerge, TestRamUsageEstimatorOnWildAnimals, TestBooleanMinShouldMatch, TestPayloadSpans, TestStressIndexing2, TestReuseDocsEnum, TestIndexInput, TestSpanSearchEquivalence, TestSpans, TestParallelCompositeReader, TestScorerPerf, TestFieldMaskingSpanQuery, TestDocumentsWriterDeleteQueue, TestFilteredQuery, TestDocumentWriter, TestQueryWrapperFilter, TestTermVectors, TestTermVectorsWriter, TestTransactionRollback, TestCompiledAutomaton, TestDocTermOrds, TestBooleanOr, TestWildcard, TestAutomatonQuery, TestRegexpQuery, TestDocCount, TestBinaryTerms, TestDocument, TestIndexWriterConfig, TestFilteredSearch, TestCachingWrapperFilter, Nested, Nested, TestSortedVIntList, TestDateFilter, ThrowInUncaught, TestSegmentTermEnum]
[junit4:junit4] Completed on J1 in 0.02s, 2 tests, 1 error <<< FAILURES!

[...truncated 122 lines...]
BUILD FAILED
/mnt/ssd/jenkins/workspace/Lucene-Solr-trunk-Linux/build.xml:29: The following error occurred while executing this line:
/mnt/ssd/jenkins/workspace/Lucene-Solr-trunk-Linux/lucene/build.xml:49: The following error occurred while executing this line:
/mnt/ssd/jenkins/workspace/Lucene-Solr-trunk-Linux/lucene/common-build.xml:1105: The following error occurred while executing this line:
/mnt/ssd/jenkins/workspace/Lucene-Solr-trunk-Linux/lucene/common-build.xml:797: There were test failures: 308 suites, 1733 tests, 2 suite-level errors, 2 errors, 2 failures, 22 ignored (14 assumptions)

Total time: 6 minutes 32 seconds
Build step 'Invoke Ant' marked build as failure
Recording test results
Description set: Java: 32bit/ibm-j9-jdk6 
Email was triggered for: Failure
Sending email for trigger: Failure



Mime
View raw message