lucene-dev mailing list archives

Site index · List index
Message view « Date » · « Thread »
Top « Date » · « Thread »
From Policeman Jenkins Server <jenk...@sd-datasolutions.de>
Subject [JENKINS] Lucene-Solr-4.x-Linux (32bit/jdk1.8.0-ea-b49) - Build # 104 - Failure!
Date Thu, 02 Aug 2012 12:01:21 GMT
Build: http://jenkins.sd-datasolutions.de/job/Lucene-Solr-4.x-Linux/104/
Java: 32bit/jdk1.8.0-ea-b49 -server -XX:+UseG1GC

1 tests failed.
REGRESSION:  org.apache.solr.handler.component.DistributedQueryElevationComponentTest.testDistribSearch

Error Message:
.responseHeader.params.size()==9,9skipped=5,4

Stack Trace:
junit.framework.AssertionFailedError: .responseHeader.params.size()==9,9skipped=5,4
	at __randomizedtesting.SeedInfo.seed([740958AA76E5330:86A61B92D031330C]:0)
	at junit.framework.Assert.fail(Assert.java:50)
	at org.apache.solr.BaseDistributedSearchTestCase.compareResponses(BaseDistributedSearchTestCase.java:670)
	at org.apache.solr.BaseDistributedSearchTestCase.query(BaseDistributedSearchTestCase.java:392)
	at org.apache.solr.handler.component.DistributedQueryElevationComponentTest.doTest(DistributedQueryElevationComponentTest.java:81)
	at org.apache.solr.BaseDistributedSearchTestCase.testDistribSearch(BaseDistributedSearchTestCase.java:679)
	at sun.reflect.NativeMethodAccessorImpl.invoke0(Native Method)
	at sun.reflect.NativeMethodAccessorImpl.invoke(NativeMethodAccessorImpl.java:57)
	at sun.reflect.DelegatingMethodAccessorImpl.invoke(DelegatingMethodAccessorImpl.java:43)
	at java.lang.reflect.Method.invoke(Method.java:474)
	at com.carrotsearch.randomizedtesting.RandomizedRunner.invoke(RandomizedRunner.java:1995)
	at com.carrotsearch.randomizedtesting.RandomizedRunner.access$1100(RandomizedRunner.java:132)
	at com.carrotsearch.randomizedtesting.RandomizedRunner$6.evaluate(RandomizedRunner.java:818)
	at com.carrotsearch.randomizedtesting.RandomizedRunner$7.evaluate(RandomizedRunner.java:877)
	at com.carrotsearch.randomizedtesting.RandomizedRunner$8.evaluate(RandomizedRunner.java:891)
	at com.carrotsearch.randomizedtesting.rules.SystemPropertiesRestoreRule$1.evaluate(SystemPropertiesRestoreRule.java:53)
	at org.apache.lucene.util.TestRuleSetupTeardownChained$1.evaluate(TestRuleSetupTeardownChained.java:50)
	at org.apache.lucene.util.TestRuleFieldCacheSanity$1.evaluate(TestRuleFieldCacheSanity.java:32)
	at org.apache.lucene.util.AbstractBeforeAfterRule$1.evaluate(AbstractBeforeAfterRule.java:45)
	at com.carrotsearch.randomizedtesting.rules.SystemPropertiesInvariantRule$1.evaluate(SystemPropertiesInvariantRule.java:55)
	at org.apache.lucene.util.TestRuleReportUncaughtExceptions$1.evaluate(TestRuleReportUncaughtExceptions.java:68)
	at org.apache.lucene.util.TestRuleThreadAndTestName$1.evaluate(TestRuleThreadAndTestName.java:48)
	at org.apache.lucene.util.TestRuleIgnoreAfterMaxFailures$1.evaluate(TestRuleIgnoreAfterMaxFailures.java:70)
	at org.apache.lucene.util.TestRuleMarkFailure$1.evaluate(TestRuleMarkFailure.java:48)
	at com.carrotsearch.randomizedtesting.RandomizedRunner.runSingleTest(RandomizedRunner.java:825)
	at com.carrotsearch.randomizedtesting.RandomizedRunner.access$700(RandomizedRunner.java:132)
	at com.carrotsearch.randomizedtesting.RandomizedRunner$3$1.run(RandomizedRunner.java:671)
	at com.carrotsearch.randomizedtesting.RandomizedRunner$3.evaluate(RandomizedRunner.java:697)
	at com.carrotsearch.randomizedtesting.RandomizedRunner$4.evaluate(RandomizedRunner.java:736)
	at com.carrotsearch.randomizedtesting.RandomizedRunner$5.evaluate(RandomizedRunner.java:747)
	at com.carrotsearch.randomizedtesting.rules.SystemPropertiesRestoreRule$1.evaluate(SystemPropertiesRestoreRule.java:53)
	at org.apache.lucene.util.AbstractBeforeAfterRule$1.evaluate(AbstractBeforeAfterRule.java:45)
	at org.apache.lucene.util.TestRuleReportUncaughtExceptions$1.evaluate(TestRuleReportUncaughtExceptions.java:68)
	at org.apache.lucene.util.TestRuleStoreClassName$1.evaluate(TestRuleStoreClassName.java:38)
	at com.carrotsearch.randomizedtesting.rules.SystemPropertiesInvariantRule$1.evaluate(SystemPropertiesInvariantRule.java:55)
	at org.apache.lucene.util.TestRuleNoInstanceHooksOverrides$1.evaluate(TestRuleNoInstanceHooksOverrides.java:53)
	at org.apache.lucene.util.TestRuleNoStaticHooksShadowing$1.evaluate(TestRuleNoStaticHooksShadowing.java:52)
	at org.apache.lucene.util.TestRuleAssertionsRequired$1.evaluate(TestRuleAssertionsRequired.java:36)
	at org.apache.lucene.util.TestRuleMarkFailure$1.evaluate(TestRuleMarkFailure.java:48)
	at org.apache.lucene.util.TestRuleIgnoreAfterMaxFailures$1.evaluate(TestRuleIgnoreAfterMaxFailures.java:70)
	at org.apache.lucene.util.TestRuleIgnoreTestSuites$1.evaluate(TestRuleIgnoreTestSuites.java:55)
	at com.carrotsearch.randomizedtesting.RandomizedRunner.runSuite(RandomizedRunner.java:605)
	at com.carrotsearch.randomizedtesting.RandomizedRunner.access$400(RandomizedRunner.java:132)
	at com.carrotsearch.randomizedtesting.RandomizedRunner$2.run(RandomizedRunner.java:551)




Build Log:
[...truncated 7197 lines...]
[junit4:junit4] Suite: org.apache.solr.handler.component.DistributedQueryElevationComponentTest
[junit4:junit4] FAILURE 2.91s J1 | DistributedQueryElevationComponentTest.testDistribSearch
[junit4:junit4]    > Throwable #1: junit.framework.AssertionFailedError: .responseHeader.params.size()==9,9skipped=5,4
[junit4:junit4]    > 	at __randomizedtesting.SeedInfo.seed([740958AA76E5330:86A61B92D031330C]:0)
[junit4:junit4]    > 	at junit.framework.Assert.fail(Assert.java:50)
[junit4:junit4]    > 	at org.apache.solr.BaseDistributedSearchTestCase.compareResponses(BaseDistributedSearchTestCase.java:670)
[junit4:junit4]    > 	at org.apache.solr.BaseDistributedSearchTestCase.query(BaseDistributedSearchTestCase.java:392)
[junit4:junit4]    > 	at org.apache.solr.handler.component.DistributedQueryElevationComponentTest.doTest(DistributedQueryElevationComponentTest.java:81)
[junit4:junit4]    > 	at org.apache.solr.BaseDistributedSearchTestCase.testDistribSearch(BaseDistributedSearchTestCase.java:679)
[junit4:junit4]    > 	at sun.reflect.NativeMethodAccessorImpl.invoke0(Native Method)
[junit4:junit4]    > 	at sun.reflect.NativeMethodAccessorImpl.invoke(NativeMethodAccessorImpl.java:57)
[junit4:junit4]    > 	at sun.reflect.DelegatingMethodAccessorImpl.invoke(DelegatingMethodAccessorImpl.java:43)
[junit4:junit4]    > 	at java.lang.reflect.Method.invoke(Method.java:474)
[junit4:junit4]    > 	at com.carrotsearch.randomizedtesting.RandomizedRunner.invoke(RandomizedRunner.java:1995)
[junit4:junit4]    > 	at com.carrotsearch.randomizedtesting.RandomizedRunner.access$1100(RandomizedRunner.java:132)
[junit4:junit4]    > 	at com.carrotsearch.randomizedtesting.RandomizedRunner$6.evaluate(RandomizedRunner.java:818)
[junit4:junit4]    > 	at com.carrotsearch.randomizedtesting.RandomizedRunner$7.evaluate(RandomizedRunner.java:877)
[junit4:junit4]    > 	at com.carrotsearch.randomizedtesting.RandomizedRunner$8.evaluate(RandomizedRunner.java:891)
[junit4:junit4]    > 	at com.carrotsearch.randomizedtesting.rules.SystemPropertiesRestoreRule$1.evaluate(SystemPropertiesRestoreRule.java:53)
[junit4:junit4]    > 	at org.apache.lucene.util.TestRuleSetupTeardownChained$1.evaluate(TestRuleSetupTeardownChained.java:50)
[junit4:junit4]    > 	at org.apache.lucene.util.TestRuleFieldCacheSanity$1.evaluate(TestRuleFieldCacheSanity.java:32)
[junit4:junit4]    > 	at org.apache.lucene.util.AbstractBeforeAfterRule$1.evaluate(AbstractBeforeAfterRule.java:45)
[junit4:junit4]    > 	at com.carrotsearch.randomizedtesting.rules.SystemPropertiesInvariantRule$1.evaluate(SystemPropertiesInvariantRule.java:55)
[junit4:junit4]    > 	at org.apache.lucene.util.TestRuleReportUncaughtExceptions$1.evaluate(TestRuleReportUncaughtExceptions.java:68)
[junit4:junit4]    > 	at org.apache.lucene.util.TestRuleThreadAndTestName$1.evaluate(TestRuleThreadAndTestName.java:48)
[junit4:junit4]    > 	at org.apache.lucene.util.TestRuleIgnoreAfterMaxFailures$1.evaluate(TestRuleIgnoreAfterMaxFailures.java:70)
[junit4:junit4]    > 	at org.apache.lucene.util.TestRuleMarkFailure$1.evaluate(TestRuleMarkFailure.java:48)
[junit4:junit4]    > 	at com.carrotsearch.randomizedtesting.RandomizedRunner.runSingleTest(RandomizedRunner.java:825)
[junit4:junit4]    > 	at com.carrotsearch.randomizedtesting.RandomizedRunner.access$700(RandomizedRunner.java:132)
[junit4:junit4]    > 	at com.carrotsearch.randomizedtesting.RandomizedRunner$3$1.run(RandomizedRunner.java:671)
[junit4:junit4]    > 	at com.carrotsearch.randomizedtesting.RandomizedRunner$3.evaluate(RandomizedRunner.java:697)
[junit4:junit4]    > 	at com.carrotsearch.randomizedtesting.RandomizedRunner$4.evaluate(RandomizedRunner.java:736)
[junit4:junit4]    > 	at com.carrotsearch.randomizedtesting.RandomizedRunner$5.evaluate(RandomizedRunner.java:747)
[junit4:junit4]    > 	at com.carrotsearch.randomizedtesting.rules.SystemPropertiesRestoreRule$1.evaluate(SystemPropertiesRestoreRule.java:53)
[junit4:junit4]    > 	at org.apache.lucene.util.AbstractBeforeAfterRule$1.evaluate(AbstractBeforeAfterRule.java:45)
[junit4:junit4]    > 	at org.apache.lucene.util.TestRuleReportUncaughtExceptions$1.evaluate(TestRuleReportUncaughtExceptions.java:68)
[junit4:junit4]    > 	at org.apache.lucene.util.TestRuleStoreClassName$1.evaluate(TestRuleStoreClassName.java:38)
[junit4:junit4]    > 	at com.carrotsearch.randomizedtesting.rules.SystemPropertiesInvariantRule$1.evaluate(SystemPropertiesInvariantRule.java:55)
[junit4:junit4]    > 	at org.apache.lucene.util.TestRuleNoInstanceHooksOverrides$1.evaluate(TestRuleNoInstanceHooksOverrides.java:53)
[junit4:junit4]    > 	at org.apache.lucene.util.TestRuleNoStaticHooksShadowing$1.evaluate(TestRuleNoStaticHooksShadowing.java:52)
[junit4:junit4]    > 	at org.apache.lucene.util.TestRuleAssertionsRequired$1.evaluate(TestRuleAssertionsRequired.java:36)
[junit4:junit4]    > 	at org.apache.lucene.util.TestRuleMarkFailure$1.evaluate(TestRuleMarkFailure.java:48)
[junit4:junit4]    > 	at org.apache.lucene.util.TestRuleIgnoreAfterMaxFailures$1.evaluate(TestRuleIgnoreAfterMaxFailures.java:70)
[junit4:junit4]    > 	at org.apache.lucene.util.TestRuleIgnoreTestSuites$1.evaluate(TestRuleIgnoreTestSuites.java:55)
[junit4:junit4]    > 	at com.carrotsearch.randomizedtesting.RandomizedRunner.runSuite(RandomizedRunner.java:605)
[junit4:junit4]    > 	at com.carrotsearch.randomizedtesting.RandomizedRunner.access$400(RandomizedRunner.java:132)
[junit4:junit4]    > 	at com.carrotsearch.randomizedtesting.RandomizedRunner$2.run(RandomizedRunner.java:551)
[junit4:junit4]    > 
[junit4:junit4]   2> 3 T194 oas.SolrTestCaseJ4.setUp ###Starting testDistribSearch
[junit4:junit4]   2> 92 T194 oejs.Server.doStart jetty-8.1.2.v20120308
[junit4:junit4]   2> 161 T194 oejs.AbstractConnector.doStart Started SocketConnector@0.0.0.0:36971
[junit4:junit4]   2> 170 T194 oasc.SolrResourceLoader.locateSolrHome JNDI not configured for solr (NoInitialContextEx)
[junit4:junit4]   2> 170 T194 oasc.SolrResourceLoader.locateSolrHome using system property solr.solr.home: /mnt/ssd/jenkins/workspace/Lucene-Solr-4.x-Linux/checkout/solr/build/solr-core/test-files/solr
[junit4:junit4]   2> 171 T194 oasc.SolrResourceLoader.<init> new SolrResourceLoader for deduced Solr Home: '/mnt/ssd/jenkins/workspace/Lucene-Solr-4.x-Linux/checkout/solr/build/solr-core/test-files/solr/'
[junit4:junit4]   2> 186 T194 oass.SolrDispatchFilter.init SolrDispatchFilter.init()
[junit4:junit4]   2> 187 T194 oasc.SolrResourceLoader.locateSolrHome JNDI not configured for solr (NoInitialContextEx)
[junit4:junit4]   2> 187 T194 oasc.SolrResourceLoader.locateSolrHome using system property solr.solr.home: /mnt/ssd/jenkins/workspace/Lucene-Solr-4.x-Linux/checkout/solr/build/solr-core/test-files/solr
[junit4:junit4]   2> 188 T194 oasc.CoreContainer$Initializer.initialize looking for solr.xml: /mnt/ssd/jenkins/workspace/Lucene-Solr-4.x-Linux/checkout/solr/build/solr-core/test-files/solr/solr.xml
[junit4:junit4]   2> 188 T194 oasc.CoreContainer.<init> New CoreContainer 5555289
[junit4:junit4]   2> 189 T194 oasc.CoreContainer.load Loading CoreContainer using Solr Home: '/mnt/ssd/jenkins/workspace/Lucene-Solr-4.x-Linux/checkout/solr/build/solr-core/test-files/solr/'
[junit4:junit4]   2> 189 T194 oasc.SolrResourceLoader.<init> new SolrResourceLoader for directory: '/mnt/ssd/jenkins/workspace/Lucene-Solr-4.x-Linux/checkout/solr/build/solr-core/test-files/solr/'
[junit4:junit4]   2> 260 T194 oasc.CoreContainer.load Registering Log Listener
[junit4:junit4]   2> 298 T194 oasc.CoreContainer.create Creating SolrCore 'collection1' using instanceDir: /mnt/ssd/jenkins/workspace/Lucene-Solr-4.x-Linux/checkout/solr/build/solr-core/test-files/solr/collection1
[junit4:junit4]   2> 299 T194 oasc.SolrResourceLoader.<init> new SolrResourceLoader for directory: '/mnt/ssd/jenkins/workspace/Lucene-Solr-4.x-Linux/checkout/solr/build/solr-core/test-files/solr/collection1/'
[junit4:junit4]   2> 299 T194 oasc.SolrResourceLoader.replaceClassLoader Adding 'file:/mnt/ssd/jenkins/workspace/Lucene-Solr-4.x-Linux/checkout/solr/build/solr-core/test-files/solr/collection1/lib/README' to classloader
[junit4:junit4]   2> 300 T194 oasc.SolrResourceLoader.replaceClassLoader Adding 'file:/mnt/ssd/jenkins/workspace/Lucene-Solr-4.x-Linux/checkout/solr/build/solr-core/test-files/solr/collection1/lib/classes/' to classloader
[junit4:junit4]   2> 354 T194 oasc.SolrConfig.<init> Using Lucene MatchVersion: LUCENE_40
[junit4:junit4]   2> 494 T194 oasc.SolrConfig.<init> Loaded SolrConfig: solrconfig-elevate.xml
[junit4:junit4]   2> 495 T194 oass.IndexSchema.readSchema Reading Solr Schema
[junit4:junit4]   2> 521 T194 oass.IndexSchema.readSchema Schema name=example
[junit4:junit4]   2> 796 T194 oass.IndexSchema.readSchema default search field in schema is text
[junit4:junit4]   2> 801 T194 oass.IndexSchema.readSchema unique key field: id
[junit4:junit4]   2> 812 T194 oasc.SolrCore.<init> [collection1] Opening new SolrCore at /mnt/ssd/jenkins/workspace/Lucene-Solr-4.x-Linux/checkout/solr/build/solr-core/test-files/solr/collection1/, dataDir=./org.apache.solr.handler.component.DistributedQueryElevationComponentTest-1343908417268/control/data/
[junit4:junit4]   2> 812 T194 oasc.JmxMonitoredMap.<init> JMX monitoring is enabled. Adding Solr mbeans to JMX Server: com.sun.jmx.mbeanserver.JmxMBeanServer@5ef8e8
[junit4:junit4]   2> 816 T194 oasc.SolrCore.getNewIndexDir WARNING New index directory detected: old=null new=./org.apache.solr.handler.component.DistributedQueryElevationComponentTest-1343908417268/control/data/index/
[junit4:junit4]   2> 822 T194 oasc.SolrCore.initIndex WARNING [collection1] Solr index directory './org.apache.solr.handler.component.DistributedQueryElevationComponentTest-1343908417268/control/data/index' doesn't exist. Creating new index...
[junit4:junit4]   2> 824 T194 oasc.SolrDeletionPolicy.onCommit SolrDeletionPolicy.onCommit: commits:num=1
[junit4:junit4]   2> 		commit{dir=MockDirWrapper(org.apache.lucene.store.RAMDirectory@13b085a lockFactory=org.apache.lucene.store.SingleInstanceLockFactory@13a6ad1),segFN=segments_1,generation=1,filenames=[segments_1]
[junit4:junit4]   2> 824 T194 oasc.SolrDeletionPolicy.updateCommits newest commit = 1
[junit4:junit4]   2> 830 T194 oasc.RequestHandlers.initHandlersFromConfig created /update: solr.UpdateRequestHandler
[junit4:junit4]   2> 831 T194 oasc.RequestHandlers.initHandlersFromConfig created /elevate: org.apache.solr.handler.component.SearchHandler
[junit4:junit4]   2> 832 T194 oasc.RequestHandlers.initHandlersFromConfig created /dataElevate: org.apache.solr.handler.component.SearchHandler
[junit4:junit4]   2> 833 T194 oashl.XMLLoader.init xsltCacheLifetimeSeconds=60
[junit4:junit4]   2> 834 T194 oasc.RequestHandlers.initHandlersFromConfig WARNING no default request handler is registered (either '/select' or 'standard')
[junit4:junit4]   2> 838 T194 oasc.SolrCore.initDeprecatedSupport WARNING solrconfig.xml uses deprecated <admin/gettableFiles>, Please update your config to use the ShowFileRequestHandler.
[junit4:junit4]   2> 839 T194 oasc.SolrCore.initDeprecatedSupport WARNING adding ShowFileRequestHandler with hidden files: [HUNSPELL-TEST.AFF, THROW.ERROR.ON.ADD.UPDATEPROCESSOR.JS, SOLRCONFIG-HIGHLIGHT.XML, SCHEMA-FOLDING.XML, BAD-SCHEMA-NONTEXT-ANALYZER.XML, SCHEMA-COPYFIELD-TEST.XML, BAD-SCHEMA-UNIQUEKEY-MULTIVALUED.XML, OLD_SYNONYMS.TXT, STEMDICT.TXT, SCHEMA-TRIE.XML, CONDITIONAL.UPDATEPROCESSOR.JS, SOLRCONFIG-TRANSFORMERS.XML, SOLRCONFIG-TERMINDEX.XML, SOLRCONFIG-REQHANDLER.INCL, SOLRCONFIG-LAZYWRITER.XML, KEEP-1.TXT, SCHEMA12.XML, ADDFIELDS.UPDATEPROCESSOR.JS, SOLRCONFIG-MERGEPOLICY.XML, MAPPING-ISOLATIN1ACCENT.TXT, KEEP-2.TXT, BAD-SOLRCONFIG-MISSING-SCRIPTFILE.XML, BAD-SCHEMA-NOT-INDEXED-BUT-TF.XML, BAD-SCHEMA-UNIQUEKEY-IS-COPYFIELD-DEST.XML, BAD-SCHEMA-SIM-GLOBAL-VS-FT-MISMATCH.XML, SOLRCONFIG-BASIC-LUCENEVERSION31.XML, BAD-SCHEMA-NOT-INDEXED-BUT-NORMS.XML, SCHEMA-REQUIRED-FIELDS.XML, SCHEMA-LMDIRICHLET.XML, SCHEMA-IB.XML, SOLRCONFIG-QUERYSENDER.XML, SCHEMA-REVERSED.XML, SOLRCONFIG-REPEATER.XML, STOPWORDS.TXT, WDFTYPES.TXT, SCHEMA-DFR.XML, SCHEMA-PHRASESUGGEST.XML, TRIVIAL.UPDATEPROCESSOR1.JS, BAD-SCHEMA-DUP-FIELD.XML, SCHEMA-NUMERIC.XML, SOLRCONFIG-MASTER2.XML, SCHEMA-STOP-KEEP.XML, SOLRCONFIG-DELPOLICY2.XML, BAD-SCHEMA-OMIT-TF-BUT-NOT-POS.XML, SCHEMA-COLLATEFILTER.XML, SOLRCONFIG-UPDATE-PROCESSOR-CHAINS.XML, SOLRCONFIG-ALTDIRECTORY.XML, SCHEMA.XML, SCHEMA_CODEC.XML, PROTWORDS.TXT, SOLRCONFIG-SPELLCHECKER.XML, SOLRCONFIG-SOLCOREPROPERTIES.XML, CURRENCY.XML, PHRASESUGGEST.TXT, XSLT, SOLRCONFIG-PROPINJECT.XML, SOLRCONFIG_PERF.XML, SOLRCONFIG-SCRIPT-UPDATEPROCESSOR.XML, SOLRCONFIG-ELEVATE.XML, SOLRCONFIG-QUERYSENDER-NOQUERY.XML, SCHEMASURROUND.XML, BAD-SCHEMA-NOT-INDEXED-BUT-POS.XML, SOLRCONFIG-PHRASESUGGEST.XML, COMPOUNDDICTIONARY.TXT, STOPWITHBOM.TXT, DA_UTF8.XML, SCHEMA-MINIMAL.XML, SOLRCONFIG-CACHING.XML, BAD-SCHEMA-EXTERNAL-FILEFIELD.XML, BAD-SCHEMA-DUP-FIELDTYPE.XML, SOLRCONFIG-SIMPLELOCK.XML, BAD-MP-SOLRCONFIG.XML, TRIVIAL.UPDATEPROCESSOR0.JS, SOLRCONFIG-MASTER1.XML, MISSING.FUNCTIONS.UPDATEPROCESSOR.JS, BAD_SOLRCONFIG.XML, STOPWORDSWRONGENCODING.TXT, DA_COMPOUNDDICTIONARY.TXT, SOLRCONFIG-SPELLCHECKCOMPONENT.XML, STOP-2.TXT, SCHEMA-BM25.XML, SCHEMA11.XML, SOLRCONFIG-BASIC.XML, OPEN-EXCHANGE-RATES.JSON, FRENCHARTICLES.TXT, SCHEMA-LMJELINEKMERCER.XML, BAD-SCHEMA-ANALYZER-CLASS-AND-NESTED.XML, SCHEMA-LUCENEMATCHVERSION.XML, BAD-SCHEMA-DUP-DYNAMICFIELD.XML, STOPTYPES-2.TXT, SOLRCONFIG-MASTER.XML, HYPHENATION.DTD, SOLRCONFIG-SLAVE.XML, SOLRCONFIG-XINCLUDE.XML, SOLRCONFIG-NOCACHE.XML, SCHEMA-REPLICATION1.XML, SOLRCONFIG-PROPINJECT-INDEXDEFAULT.XML, BAD-SCHEMA-CODEC-GLOBAL-VS-FT-MISMATCH.XML, SOLRCONFIG-TLOG.XML, SOLRCONFIG-SOLR-749.XML, BAD-SCHEMA-UNIQUEKEY-USES-DEFAULT.XML, SOLRCONFIG-SLAVE1.XML, SOLRCONFIG-ENABLEPLUGIN.XML, SOLRCONFIG-FUNCTIONQUERY.XML, SCHEMA-SIM.XML, SCHEMA-NOT-REQUIRED-UNIQUE-KEY.XML, ELEVATE.XML, STOPTYPES-1.TXT, STOP-1.TXT, MISSLEADING.EXTENSION.UPDATEPROCESSOR.JS.TXT, SOLRCONFIG-DELPOLICY1.XML, BAD-SOLRCONFIG-INVALID-SCRIPTFILE.XML, SCHEMA-TFIDF.XML, STOP-SNOWBALL.TXT, SCHEMA-COLLATE.XML, HUNSPELL-TEST.DIC, SCHEMA15.XML, SOLRCONFIG-MASTER3.XML, SCHEMA-BINARYFIELD.XML, SCHEMA-REPLICATION2.XML, BAD-SOLRCONFIG-BOGUS-SCRIPTENGINE-NAME.XML, SOLRCONFIG-NATIVELOCK.XML, SOLRCONFIG_CODEC.XML, SCHEMA-CHARFILTERS.XML, SYNONYMS.TXT, SOLRCONFIG-MASTER1-KEEPONEBACKUP.XML, SCHEMA-SPELLCHECKER.XML]
[junit4:junit4]   2> 841 T194 oass.SolrIndexSearcher.<init> Opening Searcher@1a9338 main
[junit4:junit4]   2> 842 T194 oass.SolrIndexSearcher.getIndexDir WARNING WARNING: Directory impl does not support setting indexDir: org.apache.lucene.store.MockDirectoryWrapper
[junit4:junit4]   2> 842 T194 oasu.CommitTracker.<init> Hard AutoCommit: disabled
[junit4:junit4]   2> 842 T194 oasu.CommitTracker.<init> Soft AutoCommit: disabled
[junit4:junit4]   2> 843 T194 oashc.QueryElevationComponent.inform Loading QueryElevation from: /mnt/ssd/jenkins/workspace/Lucene-Solr-4.x-Linux/checkout/solr/build/solr-core/test-files/solr/collection1/conf/elevate.xml
[junit4:junit4]   2> 851 T194 oashc.QueryElevationComponent.inform Loading QueryElevation from: /mnt/ssd/jenkins/workspace/Lucene-Solr-4.x-Linux/checkout/solr/build/solr-core/test-files/solr/collection1/conf/elevate.xml
[junit4:junit4]   2> 857 T194 oashc.HttpShardHandlerFactory.getParameter Setting socketTimeout to: 0
[junit4:junit4]   2> 857 T194 oashc.HttpShardHandlerFactory.getParameter Setting urlScheme to: http://
[junit4:junit4]   2> 858 T194 oashc.HttpShardHandlerFactory.getParameter Setting connTimeout to: 0
[junit4:junit4]   2> 858 T194 oashc.HttpShardHandlerFactory.getParameter Setting maxConnectionsPerHost to: 20
[junit4:junit4]   2> 858 T194 oashc.HttpShardHandlerFactory.getParameter Setting corePoolSize to: 0
[junit4:junit4]   2> 858 T194 oashc.HttpShardHandlerFactory.getParameter Setting maximumPoolSize to: 2147483647
[junit4:junit4]   2> 858 T194 oashc.HttpShardHandlerFactory.getParameter Setting maxThreadIdleTime to: 5
[junit4:junit4]   2> 859 T194 oashc.HttpShardHandlerFactory.getParameter Setting sizeOfQueue to: -1
[junit4:junit4]   2> 859 T194 oashc.HttpShardHandlerFactory.getParameter Setting fairnessPolicy to: false
[junit4:junit4]   2> 859 T194 oascsi.HttpClientUtil.createClient Creating new http client, config:maxConnectionsPerHost=20&maxConnections=10000&socketTimeout=0&connTimeout=0&retry=false
[junit4:junit4]   2> 862 T205 oasc.SolrCore.registerSearcher [collection1] Registered new searcher Searcher@1a9338 main{StandardDirectoryReader(segments_1:1)}
[junit4:junit4]   2> 864 T194 oasc.CoreContainer.register registering core: collection1
[junit4:junit4]   2> 865 T194 oass.SolrDispatchFilter.init user.dir=/mnt/ssd/jenkins/workspace/Lucene-Solr-4.x-Linux/checkout/solr/build/solr-core/test/J1
[junit4:junit4]   2> 865 T194 oass.SolrDispatchFilter.init SolrDispatchFilter.init() done
[junit4:junit4]   2> 871 T194 oascsi.HttpClientUtil.createClient Creating new http client, config:maxConnections=128&maxConnectionsPerHost=32&followRedirects=false
[junit4:junit4]   2> 876 T194 oejs.Server.doStart jetty-8.1.2.v20120308
[junit4:junit4]   2> 910 T194 oejs.AbstractConnector.doStart Started SocketConnector@0.0.0.0:44704
[junit4:junit4]   2> 910 T194 oasc.SolrResourceLoader.locateSolrHome JNDI not configured for solr (NoInitialContextEx)
[junit4:junit4]   2> 911 T194 oasc.SolrResourceLoader.locateSolrHome using system property solr.solr.home: /mnt/ssd/jenkins/workspace/Lucene-Solr-4.x-Linux/checkout/solr/build/solr-core/test-files/solr
[junit4:junit4]   2> 911 T194 oasc.SolrResourceLoader.<init> new SolrResourceLoader for deduced Solr Home: '/mnt/ssd/jenkins/workspace/Lucene-Solr-4.x-Linux/checkout/solr/build/solr-core/test-files/solr/'
[junit4:junit4]   2> 922 T194 oass.SolrDispatchFilter.init SolrDispatchFilter.init()
[junit4:junit4]   2> 923 T194 oasc.SolrResourceLoader.locateSolrHome JNDI not configured for solr (NoInitialContextEx)
[junit4:junit4]   2> 923 T194 oasc.SolrResourceLoader.locateSolrHome using system property solr.solr.home: /mnt/ssd/jenkins/workspace/Lucene-Solr-4.x-Linux/checkout/solr/build/solr-core/test-files/solr
[junit4:junit4]   2> 923 T194 oasc.CoreContainer$Initializer.initialize looking for solr.xml: /mnt/ssd/jenkins/workspace/Lucene-Solr-4.x-Linux/checkout/solr/build/solr-core/test-files/solr/solr.xml
[junit4:junit4]   2> 924 T194 oasc.CoreContainer.<init> New CoreContainer 16688622
[junit4:junit4]   2> 924 T194 oasc.CoreContainer.load Loading CoreContainer using Solr Home: '/mnt/ssd/jenkins/workspace/Lucene-Solr-4.x-Linux/checkout/solr/build/solr-core/test-files/solr/'
[junit4:junit4]   2> 924 T194 oasc.SolrResourceLoader.<init> new SolrResourceLoader for directory: '/mnt/ssd/jenkins/workspace/Lucene-Solr-4.x-Linux/checkout/solr/build/solr-core/test-files/solr/'
[junit4:junit4]   2> 936 T194 oasc.CoreContainer.load Registering Log Listener
[junit4:junit4]   2> 946 T194 oasc.CoreContainer.create Creating SolrCore 'collection1' using instanceDir: /mnt/ssd/jenkins/workspace/Lucene-Solr-4.x-Linux/checkout/solr/build/solr-core/test-files/solr/collection1
[junit4:junit4]   2> 946 T194 oasc.SolrResourceLoader.<init> new SolrResourceLoader for directory: '/mnt/ssd/jenkins/workspace/Lucene-Solr-4.x-Linux/checkout/solr/build/solr-core/test-files/solr/collection1/'
[junit4:junit4]   2> 947 T194 oasc.SolrResourceLoader.replaceClassLoader Adding 'file:/mnt/ssd/jenkins/workspace/Lucene-Solr-4.x-Linux/checkout/solr/build/solr-core/test-files/solr/collection1/lib/README' to classloader
[junit4:junit4]   2> 947 T194 oasc.SolrResourceLoader.replaceClassLoader Adding 'file:/mnt/ssd/jenkins/workspace/Lucene-Solr-4.x-Linux/checkout/solr/build/solr-core/test-files/solr/collection1/lib/classes/' to classloader
[junit4:junit4]   2> 966 T194 oasc.SolrConfig.<init> Using Lucene MatchVersion: LUCENE_40
[junit4:junit4]   2> 1010 T194 oasc.SolrConfig.<init> Loaded SolrConfig: solrconfig-elevate.xml
[junit4:junit4]   2> 1011 T194 oass.IndexSchema.readSchema Reading Solr Schema
[junit4:junit4]   2> 1016 T194 oass.IndexSchema.readSchema Schema name=example
[junit4:junit4]   2> 1246 T194 oass.IndexSchema.readSchema default search field in schema is text
[junit4:junit4]   2> 1248 T194 oass.IndexSchema.readSchema unique key field: id
[junit4:junit4]   2> 1252 T194 oasc.SolrCore.<init> [collection1] Opening new SolrCore at /mnt/ssd/jenkins/workspace/Lucene-Solr-4.x-Linux/checkout/solr/build/solr-core/test-files/solr/collection1/, dataDir=./org.apache.solr.handler.component.DistributedQueryElevationComponentTest-1343908417268/shard0/data/
[junit4:junit4]   2> 1253 T194 oasc.JmxMonitoredMap.<init> JMX monitoring is enabled. Adding Solr mbeans to JMX Server: com.sun.jmx.mbeanserver.JmxMBeanServer@5ef8e8
[junit4:junit4]   2> 1254 T194 oasc.SolrCore.getNewIndexDir WARNING New index directory detected: old=null new=./org.apache.solr.handler.component.DistributedQueryElevationComponentTest-1343908417268/shard0/data/index/
[junit4:junit4]   2> 1254 T194 oasc.SolrCore.initIndex WARNING [collection1] Solr index directory './org.apache.solr.handler.component.DistributedQueryElevationComponentTest-1343908417268/shard0/data/index' doesn't exist. Creating new index...
[junit4:junit4]   2> 1256 T194 oasc.SolrDeletionPolicy.onCommit SolrDeletionPolicy.onCommit: commits:num=1
[junit4:junit4]   2> 		commit{dir=MockDirWrapper(NRTCachingDirectory(org.apache.lucene.store.RAMDirectory@17d84cd lockFactory=org.apache.lucene.store.SingleInstanceLockFactory@4aee62; maxCacheMB=0.73828125 maxMergeSizeMB=0.1376953125)),segFN=segments_1,generation=1,filenames=[segments_1]
[junit4:junit4]   2> 1257 T194 oasc.SolrDeletionPolicy.updateCommits newest commit = 1
[junit4:junit4]   2> 1258 T194 oasc.RequestHandlers.initHandlersFromConfig created /update: solr.UpdateRequestHandler
[junit4:junit4]   2> 1259 T194 oasc.RequestHandlers.initHandlersFromConfig created /elevate: org.apache.solr.handler.component.SearchHandler
[junit4:junit4]   2> 1259 T194 oasc.RequestHandlers.initHandlersFromConfig created /dataElevate: org.apache.solr.handler.component.SearchHandler
[junit4:junit4]   2> 1260 T194 oashl.XMLLoader.init xsltCacheLifetimeSeconds=60
[junit4:junit4]   2> 1260 T194 oasc.RequestHandlers.initHandlersFromConfig WARNING no default request handler is registered (either '/select' or 'standard')
[junit4:junit4]   2> 1262 T194 oasc.SolrCore.initDeprecatedSupport WARNING solrconfig.xml uses deprecated <admin/gettableFiles>, Please update your config to use the ShowFileRequestHandler.
[junit4:junit4]   2> 1263 T194 oasc.SolrCore.initDeprecatedSupport WARNING adding ShowFileRequestHandler with hidden files: [HUNSPELL-TEST.AFF, THROW.ERROR.ON.ADD.UPDATEPROCESSOR.JS, SOLRCONFIG-HIGHLIGHT.XML, SCHEMA-FOLDING.XML, BAD-SCHEMA-NONTEXT-ANALYZER.XML, SCHEMA-COPYFIELD-TEST.XML, BAD-SCHEMA-UNIQUEKEY-MULTIVALUED.XML, OLD_SYNONYMS.TXT, STEMDICT.TXT, SCHEMA-TRIE.XML, CONDITIONAL.UPDATEPROCESSOR.JS, SOLRCONFIG-TRANSFORMERS.XML, SOLRCONFIG-TERMINDEX.XML, SOLRCONFIG-REQHANDLER.INCL, SOLRCONFIG-LAZYWRITER.XML, KEEP-1.TXT, SCHEMA12.XML, ADDFIELDS.UPDATEPROCESSOR.JS, SOLRCONFIG-MERGEPOLICY.XML, MAPPING-ISOLATIN1ACCENT.TXT, KEEP-2.TXT, BAD-SOLRCONFIG-MISSING-SCRIPTFILE.XML, BAD-SCHEMA-NOT-INDEXED-BUT-TF.XML, BAD-SCHEMA-UNIQUEKEY-IS-COPYFIELD-DEST.XML, BAD-SCHEMA-SIM-GLOBAL-VS-FT-MISMATCH.XML, SOLRCONFIG-BASIC-LUCENEVERSION31.XML, BAD-SCHEMA-NOT-INDEXED-BUT-NORMS.XML, SCHEMA-REQUIRED-FIELDS.XML, SCHEMA-LMDIRICHLET.XML, SCHEMA-IB.XML, SOLRCONFIG-QUERYSENDER.XML, SCHEMA-REVERSED.XML, SOLRCONFIG-REPEATER.XML, STOPWORDS.TXT, WDFTYPES.TXT, SCHEMA-DFR.XML, SCHEMA-PHRASESUGGEST.XML, TRIVIAL.UPDATEPROCESSOR1.JS, BAD-SCHEMA-DUP-FIELD.XML, SCHEMA-NUMERIC.XML, SOLRCONFIG-MASTER2.XML, SCHEMA-STOP-KEEP.XML, SOLRCONFIG-DELPOLICY2.XML, BAD-SCHEMA-OMIT-TF-BUT-NOT-POS.XML, SCHEMA-COLLATEFILTER.XML, SOLRCONFIG-UPDATE-PROCESSOR-CHAINS.XML, SOLRCONFIG-ALTDIRECTORY.XML, SCHEMA.XML, SCHEMA_CODEC.XML, PROTWORDS.TXT, SOLRCONFIG-SPELLCHECKER.XML, SOLRCONFIG-SOLCOREPROPERTIES.XML, CURRENCY.XML, PHRASESUGGEST.TXT, XSLT, SOLRCONFIG-PROPINJECT.XML, SOLRCONFIG_PERF.XML, SOLRCONFIG-SCRIPT-UPDATEPROCESSOR.XML, SOLRCONFIG-ELEVATE.XML, SOLRCONFIG-QUERYSENDER-NOQUERY.XML, SCHEMASURROUND.XML, BAD-SCHEMA-NOT-INDEXED-BUT-POS.XML, SOLRCONFIG-PHRASESUGGEST.XML, COMPOUNDDICTIONARY.TXT, STOPWITHBOM.TXT, DA_UTF8.XML, SCHEMA-MINIMAL.XML, SOLRCONFIG-CACHING.XML, BAD-SCHEMA-EXTERNAL-FILEFIELD.XML, BAD-SCHEMA-DUP-FIELDTYPE.XML, SOLRCONFIG-SIMPLELOCK.XML, BAD-MP-SOLRCONFIG.XML, TRIVIAL.UPDATEPROCESSOR0.JS, SOLRCONFIG-MASTER1.XML, MISSING.FUNCTIONS.UPDATEPROCESSOR.JS, BAD_SOLRCONFIG.XML, STOPWORDSWRONGENCODING.TXT, DA_COMPOUNDDICTIONARY.TXT, SOLRCONFIG-SPELLCHECKCOMPONENT.XML, STOP-2.TXT, SCHEMA-BM25.XML, SCHEMA11.XML, SOLRCONFIG-BASIC.XML, OPEN-EXCHANGE-RATES.JSON, FRENCHARTICLES.TXT, SCHEMA-LMJELINEKMERCER.XML, BAD-SCHEMA-ANALYZER-CLASS-AND-NESTED.XML, SCHEMA-LUCENEMATCHVERSION.XML, BAD-SCHEMA-DUP-DYNAMICFIELD.XML, STOPTYPES-2.TXT, SOLRCONFIG-MASTER.XML, HYPHENATION.DTD, SOLRCONFIG-SLAVE.XML, SOLRCONFIG-XINCLUDE.XML, SOLRCONFIG-NOCACHE.XML, SCHEMA-REPLICATION1.XML, SOLRCONFIG-PROPINJECT-INDEXDEFAULT.XML, BAD-SCHEMA-CODEC-GLOBAL-VS-FT-MISMATCH.XML, SOLRCONFIG-TLOG.XML, SOLRCONFIG-SOLR-749.XML, BAD-SCHEMA-UNIQUEKEY-USES-DEFAULT.XML, SOLRCONFIG-SLAVE1.XML, SOLRCONFIG-ENABLEPLUGIN.XML, SOLRCONFIG-FUNCTIONQUERY.XML, SCHEMA-SIM.XML, SCHEMA-NOT-REQUIRED-UNIQUE-KEY.XML, ELEVATE.XML, STOPTYPES-1.TXT, STOP-1.TXT, MISSLEADING.EXTENSION.UPDATEPROCESSOR.JS.TXT, SOLRCONFIG-DELPOLICY1.XML, BAD-SOLRCONFIG-INVALID-SCRIPTFILE.XML, SCHEMA-TFIDF.XML, STOP-SNOWBALL.TXT, SCHEMA-COLLATE.XML, HUNSPELL-TEST.DIC, SCHEMA15.XML, SOLRCONFIG-MASTER3.XML, SCHEMA-BINARYFIELD.XML, SCHEMA-REPLICATION2.XML, BAD-SOLRCONFIG-BOGUS-SCRIPTENGINE-NAME.XML, SOLRCONFIG-NATIVELOCK.XML, SOLRCONFIG_CODEC.XML, SCHEMA-CHARFILTERS.XML, SYNONYMS.TXT, SOLRCONFIG-MASTER1-KEEPONEBACKUP.XML, SCHEMA-SPELLCHECKER.XML]
[junit4:junit4]   2> 1278 T194 oass.SolrIndexSearcher.<init> Opening Searcher@1684fed main
[junit4:junit4]   2> 1278 T194 oass.SolrIndexSearcher.getIndexDir WARNING WARNING: Directory impl does not support setting indexDir: org.apache.lucene.store.MockDirectoryWrapper
[junit4:junit4]   2> 1279 T194 oasu.CommitTracker.<init> Hard AutoCommit: disabled
[junit4:junit4]   2> 1279 T194 oasu.CommitTracker.<init> Soft AutoCommit: disabled
[junit4:junit4]   2> 1280 T194 oashc.QueryElevationComponent.inform Loading QueryElevation from: /mnt/ssd/jenkins/workspace/Lucene-Solr-4.x-Linux/checkout/solr/build/solr-core/test-files/solr/collection1/conf/elevate.xml
[junit4:junit4]   2> 1289 T194 oashc.QueryElevationComponent.inform Loading QueryElevation from: /mnt/ssd/jenkins/workspace/Lucene-Solr-4.x-Linux/checkout/solr/build/solr-core/test-files/solr/collection1/conf/elevate.xml
[junit4:junit4]   2> 1307 T194 oashc.HttpShardHandlerFactory.getParameter Setting socketTimeout to: 0
[junit4:junit4]   2> 1308 T194 oashc.HttpShardHandlerFactory.getParameter Setting urlScheme to: http://
[junit4:junit4]   2> 1308 T194 oashc.HttpShardHandlerFactory.getParameter Setting connTimeout to: 0
[junit4:junit4]   2> 1310 T194 oashc.HttpShardHandlerFactory.getParameter Setting maxConnectionsPerHost to: 20
[junit4:junit4]   2> 1310 T194 oashc.HttpShardHandlerFactory.getParameter Setting corePoolSize to: 0
[junit4:junit4]   2> 1310 T194 oashc.HttpShardHandlerFactory.getParameter Setting maximumPoolSize to: 2147483647
[junit4:junit4]   2> 1310 T194 oashc.HttpShardHandlerFactory.getParameter Setting maxThreadIdleTime to: 5
[junit4:junit4]   2> 1311 T194 oashc.HttpShardHandlerFactory.getParameter Setting sizeOfQueue to: -1
[junit4:junit4]   2> 1311 T194 oashc.HttpShardHandlerFactory.getParameter Setting fairnessPolicy to: false
[junit4:junit4]   2> 1311 T194 oascsi.HttpClientUtil.createClient Creating new http client, config:maxConnectionsPerHost=20&maxConnections=10000&socketTimeout=0&connTimeout=0&retry=false
[junit4:junit4]   2> 1315 T215 oasc.SolrCore.registerSearcher [collection1] Registered new searcher Searcher@1684fed main{StandardDirectoryReader(segments_1:1)}
[junit4:junit4]   2> 1315 T194 oasc.CoreContainer.register registering core: collection1
[junit4:junit4]   2> 1317 T194 oass.SolrDispatchFilter.init user.dir=/mnt/ssd/jenkins/workspace/Lucene-Solr-4.x-Linux/checkout/solr/build/solr-core/test/J1
[junit4:junit4]   2> 1317 T194 oass.SolrDispatchFilter.init SolrDispatchFilter.init() done
[junit4:junit4]   2> 1318 T194 oascsi.HttpClientUtil.createClient Creating new http client, config:maxConnections=128&maxConnectionsPerHost=32&followRedirects=false
[junit4:junit4]   2> 1320 T194 oejs.Server.doStart jetty-8.1.2.v20120308
[junit4:junit4]   2> 1326 T194 oejs.AbstractConnector.doStart Started SocketConnector@0.0.0.0:55839
[junit4:junit4]   2> 1327 T194 oasc.SolrResourceLoader.locateSolrHome JNDI not configured for solr (NoInitialContextEx)
[junit4:junit4]   2> 1328 T194 oasc.SolrResourceLoader.locateSolrHome using system property solr.solr.home: /mnt/ssd/jenkins/workspace/Lucene-Solr-4.x-Linux/checkout/solr/build/solr-core/test-files/solr
[junit4:junit4]   2> 1329 T194 oasc.SolrResourceLoader.<init> new SolrResourceLoader for deduced Solr Home: '/mnt/ssd/jenkins/workspace/Lucene-Solr-4.x-Linux/checkout/solr/build/solr-core/test-files/solr/'
[junit4:junit4]   2> 1341 T194 oass.SolrDispatchFilter.init SolrDispatchFilter.init()
[junit4:junit4]   2> 1341 T194 oasc.SolrResourceLoader.locateSolrHome JNDI not configured for solr (NoInitialContextEx)
[junit4:junit4]   2> 1342 T194 oasc.SolrResourceLoader.locateSolrHome using system property solr.solr.home: /mnt/ssd/jenkins/workspace/Lucene-Solr-4.x-Linux/checkout/solr/build/solr-core/test-files/solr
[junit4:junit4]   2> 1342 T194 oasc.CoreContainer$Initializer.initialize looking for solr.xml: /mnt/ssd/jenkins/workspace/Lucene-Solr-4.x-Linux/checkout/solr/build/solr-core/test-files/solr/solr.xml
[junit4:junit4]   2> 1342 T194 oasc.CoreContainer.<init> New CoreContainer 13449196
[junit4:junit4]   2> 1342 T194 oasc.CoreContainer.load Loading CoreContainer using Solr Home: '/mnt/ssd/jenkins/workspace/Lucene-Solr-4.x-Linux/checkout/solr/build/solr-core/test-files/solr/'
[junit4:junit4]   2> 1343 T194 oasc.SolrResourceLoader.<init> new SolrResourceLoader for directory: '/mnt/ssd/jenkins/workspace/Lucene-Solr-4.x-Linux/checkout/solr/build/solr-core/test-files/solr/'
[junit4:junit4]   2> 1356 T194 oasc.CoreContainer.load Registering Log Listener
[junit4:junit4]   2> 1366 T194 oasc.CoreContainer.create Creating SolrCore 'collection1' using instanceDir: /mnt/ssd/jenkins/workspace/Lucene-Solr-4.x-Linux/checkout/solr/build/solr-core/test-files/solr/collection1
[junit4:junit4]   2> 1367 T194 oasc.SolrResourceLoader.<init> new SolrResourceLoader for directory: '/mnt/ssd/jenkins/workspace/Lucene-Solr-4.x-Linux/checkout/solr/build/solr-core/test-files/solr/collection1/'
[junit4:junit4]   2> 1367 T194 oasc.SolrResourceLoader.replaceClassLoader Adding 'file:/mnt/ssd/jenkins/workspace/Lucene-Solr-4.x-Linux/checkout/solr/build/solr-core/test-files/solr/collection1/lib/README' to classloader
[junit4:junit4]   2> 1367 T194 oasc.SolrResourceLoader.replaceClassLoader Adding 'file:/mnt/ssd/jenkins/workspace/Lucene-Solr-4.x-Linux/checkout/solr/build/solr-core/test-files/solr/collection1/lib/classes/' to classloader
[junit4:junit4]   2> 1403 T194 oasc.SolrConfig.<init> Using Lucene MatchVersion: LUCENE_40
[junit4:junit4]   2> 1443 T194 oasc.SolrConfig.<init> Loaded SolrConfig: solrconfig-elevate.xml
[junit4:junit4]   2> 1444 T194 oass.IndexSchema.readSchema Reading Solr Schema
[junit4:junit4]   2> 1448 T194 oass.IndexSchema.readSchema Schema name=example
[junit4:junit4]   2> 1649 T194 oass.IndexSchema.readSchema default search field in schema is text
[junit4:junit4]   2> 1652 T194 oass.IndexSchema.readSchema unique key field: id
[junit4:junit4]   2> 1658 T194 oasc.SolrCore.<init> [collection1] Opening new SolrCore at /mnt/ssd/jenkins/workspace/Lucene-Solr-4.x-Linux/checkout/solr/build/solr-core/test-files/solr/collection1/, dataDir=./org.apache.solr.handler.component.DistributedQueryElevationComponentTest-1343908417268/shard1/data/
[junit4:junit4]   2> 1658 T194 oasc.JmxMonitoredMap.<init> JMX monitoring is enabled. Adding Solr mbeans to JMX Server: com.sun.jmx.mbeanserver.JmxMBeanServer@5ef8e8
[junit4:junit4]   2> 1660 T194 oasc.SolrCore.getNewIndexDir WARNING New index directory detected: old=null new=./org.apache.solr.handler.component.DistributedQueryElevationComponentTest-1343908417268/shard1/data/index/
[junit4:junit4]   2> 1660 T194 oasc.SolrCore.initIndex WARNING [collection1] Solr index directory './org.apache.solr.handler.component.DistributedQueryElevationComponentTest-1343908417268/shard1/data/index' doesn't exist. Creating new index...
[junit4:junit4]   2> 1662 T194 oasc.SolrDeletionPolicy.onCommit SolrDeletionPolicy.onCommit: commits:num=1
[junit4:junit4]   2> 		commit{dir=BaseDirectoryWrapper(org.apache.lucene.store.RAMDirectory@1a719f6 lockFactory=org.apache.lucene.store.SingleInstanceLockFactory@199719b),segFN=segments_1,generation=1,filenames=[segments_1]
[junit4:junit4]   2> 1662 T194 oasc.SolrDeletionPolicy.updateCommits newest commit = 1
[junit4:junit4]   2> 1663 T194 oasc.RequestHandlers.initHandlersFromConfig created /update: solr.UpdateRequestHandler
[junit4:junit4]   2> 1664 T194 oasc.RequestHandlers.initHandlersFromConfig created /elevate: org.apache.solr.handler.component.SearchHandler
[junit4:junit4]   2> 1664 T194 oasc.RequestHandlers.initHandlersFromConfig created /dataElevate: org.apache.solr.handler.component.SearchHandler
[junit4:junit4]   2> 1664 T194 oashl.XMLLoader.init xsltCacheLifetimeSeconds=60
[junit4:junit4]   2> 1665 T194 oasc.RequestHandlers.initHandlersFromConfig WARNING no default request handler is registered (either '/select' or 'standard')
[junit4:junit4]   2> 1666 T194 oasc.SolrCore.initDeprecatedSupport WARNING solrconfig.xml uses deprecated <admin/gettableFiles>, Please update your config to use the ShowFileRequestHandler.
[junit4:junit4]   2> 1667 T194 oasc.SolrCore.initDeprecatedSupport WARNING adding ShowFileRequestHandler with hidden files: [HUNSPELL-TEST.AFF, THROW.ERROR.ON.ADD.UPDATEPROCESSOR.JS, SOLRCONFIG-HIGHLIGHT.XML, SCHEMA-FOLDING.XML, BAD-SCHEMA-NONTEXT-ANALYZER.XML, SCHEMA-COPYFIELD-TEST.XML, BAD-SCHEMA-UNIQUEKEY-MULTIVALUED.XML, OLD_SYNONYMS.TXT, STEMDICT.TXT, SCHEMA-TRIE.XML, CONDITIONAL.UPDATEPROCESSOR.JS, SOLRCONFIG-TRANSFORMERS.XML, SOLRCONFIG-TERMINDEX.XML, SOLRCONFIG-REQHANDLER.INCL, SOLRCONFIG-LAZYWRITER.XML, KEEP-1.TXT, SCHEMA12.XML, ADDFIELDS.UPDATEPROCESSOR.JS, SOLRCONFIG-MERGEPOLICY.XML, MAPPING-ISOLATIN1ACCENT.TXT, KEEP-2.TXT, BAD-SOLRCONFIG-MISSING-SCRIPTFILE.XML, BAD-SCHEMA-NOT-INDEXED-BUT-TF.XML, BAD-SCHEMA-UNIQUEKEY-IS-COPYFIELD-DEST.XML, BAD-SCHEMA-SIM-GLOBAL-VS-FT-MISMATCH.XML, SOLRCONFIG-BASIC-LUCENEVERSION31.XML, BAD-SCHEMA-NOT-INDEXED-BUT-NORMS.XML, SCHEMA-REQUIRED-FIELDS.XML, SCHEMA-LMDIRICHLET.XML, SCHEMA-IB.XML, SOLRCONFIG-QUERYSENDER.XML, SCHEMA-REVERSED.XML, SOLRCONFIG-REPEATER.XML, STOPWORDS.TXT, WDFTYPES.TXT, SCHEMA-DFR.XML, SCHEMA-PHRASESUGGEST.XML, TRIVIAL.UPDATEPROCESSOR1.JS, BAD-SCHEMA-DUP-FIELD.XML, SCHEMA-NUMERIC.XML, SOLRCONFIG-MASTER2.XML, SCHEMA-STOP-KEEP.XML, SOLRCONFIG-DELPOLICY2.XML, BAD-SCHEMA-OMIT-TF-BUT-NOT-POS.XML, SCHEMA-COLLATEFILTER.XML, SOLRCONFIG-UPDATE-PROCESSOR-CHAINS.XML, SOLRCONFIG-ALTDIRECTORY.XML, SCHEMA.XML, SCHEMA_CODEC.XML, PROTWORDS.TXT, SOLRCONFIG-SPELLCHECKER.XML, SOLRCONFIG-SOLCOREPROPERTIES.XML, CURRENCY.XML, PHRASESUGGEST.TXT, XSLT, SOLRCONFIG-PROPINJECT.XML, SOLRCONFIG_PERF.XML, SOLRCONFIG-SCRIPT-UPDATEPROCESSOR.XML, SOLRCONFIG-ELEVATE.XML, SOLRCONFIG-QUERYSENDER-NOQUERY.XML, SCHEMASURROUND.XML, BAD-SCHEMA-NOT-INDEXED-BUT-POS.XML, SOLRCONFIG-PHRASESUGGEST.XML, COMPOUNDDICTIONARY.TXT, STOPWITHBOM.TXT, DA_UTF8.XML, SCHEMA-MINIMAL.XML, SOLRCONFIG-CACHING.XML, BAD-SCHEMA-EXTERNAL-FILEFIELD.XML, BAD-SCHEMA-DUP-FIELDTYPE.XML, SOLRCONFIG-SIMPLELOCK.XML, BAD-MP-SOLRCONFIG.XML, TRIVIAL.UPDATEPROCESSOR0.JS, SOLRCONFIG-MASTER1.XML, MISSING.FUNCTIONS.UPDATEPROCESSOR.JS, BAD_SOLRCONFIG.XML, STOPWORDSWRONGENCODING.TXT, DA_COMPOUNDDICTIONARY.TXT, SOLRCONFIG-SPELLCHECKCOMPONENT.XML, STOP-2.TXT, SCHEMA-BM25.XML, SCHEMA11.XML, SOLRCONFIG-BASIC.XML, OPEN-EXCHANGE-RATES.JSON, FRENCHARTICLES.TXT, SCHEMA-LMJELINEKMERCER.XML, BAD-SCHEMA-ANALYZER-CLASS-AND-NESTED.XML, SCHEMA-LUCENEMATCHVERSION.XML, BAD-SCHEMA-DUP-DYNAMICFIELD.XML, STOPTYPES-2.TXT, SOLRCONFIG-MASTER.XML, HYPHENATION.DTD, SOLRCONFIG-SLAVE.XML, SOLRCONFIG-XINCLUDE.XML, SOLRCONFIG-NOCACHE.XML, SCHEMA-REPLICATION1.XML, SOLRCONFIG-PROPINJECT-INDEXDEFAULT.XML, BAD-SCHEMA-CODEC-GLOBAL-VS-FT-MISMATCH.XML, SOLRCONFIG-TLOG.XML, SOLRCONFIG-SOLR-749.XML, BAD-SCHEMA-UNIQUEKEY-USES-DEFAULT.XML, SOLRCONFIG-SLAVE1.XML, SOLRCONFIG-ENABLEPLUGIN.XML, SOLRCONFIG-FUNCTIONQUERY.XML, SCHEMA-SIM.XML, SCHEMA-NOT-REQUIRED-UNIQUE-KEY.XML, ELEVATE.XML, STOPTYPES-1.TXT, STOP-1.TXT, MISSLEADING.EXTENSION.UPDATEPROCESSOR.JS.TXT, SOLRCONFIG-DELPOLICY1.XML, BAD-SOLRCONFIG-INVALID-SCRIPTFILE.XML, SCHEMA-TFIDF.XML, STOP-SNOWBALL.TXT, SCHEMA-COLLATE.XML, HUNSPELL-TEST.DIC, SCHEMA15.XML, SOLRCONFIG-MASTER3.XML, SCHEMA-BINARYFIELD.XML, SCHEMA-REPLICATION2.XML, BAD-SOLRCONFIG-BOGUS-SCRIPTENGINE-NAME.XML, SOLRCONFIG-NATIVELOCK.XML, SOLRCONFIG_CODEC.XML, SCHEMA-CHARFILTERS.XML, SYNONYMS.TXT, SOLRCONFIG-MASTER1-KEEPONEBACKUP.XML, SCHEMA-SPELLCHECKER.XML]
[junit4:junit4]   2> 1669 T194 oass.SolrIndexSearcher.<init> Opening Searcher@153b39b main
[junit4:junit4]   2> 1669 T194 oass.SolrIndexSearcher.getIndexDir WARNING WARNING: Directory impl does not support setting indexDir: org.apache.lucene.store.BaseDirectoryWrapper
[junit4:junit4]   2> 1669 T194 oasu.CommitTracker.<init> Hard AutoCommit: disabled
[junit4:junit4]   2> 1670 T194 oasu.CommitTracker.<init> Soft AutoCommit: disabled
[junit4:junit4]   2> 1670 T194 oashc.QueryElevationComponent.inform Loading QueryElevation from: /mnt/ssd/jenkins/workspace/Lucene-Solr-4.x-Linux/checkout/solr/build/solr-core/test-files/solr/collection1/conf/elevate.xml
[junit4:junit4]   2> 1677 T194 oashc.QueryElevationComponent.inform Loading QueryElevation from: /mnt/ssd/jenkins/workspace/Lucene-Solr-4.x-Linux/checkout/solr/build/solr-core/test-files/solr/collection1/conf/elevate.xml
[junit4:junit4]   2> 1684 T194 oashc.HttpShardHandlerFactory.getParameter Setting socketTimeout to: 0
[junit4:junit4]   2> 1684 T194 oashc.HttpShardHandlerFactory.getParameter Setting urlScheme to: http://
[junit4:junit4]   2> 1685 T194 oashc.HttpShardHandlerFactory.getParameter Setting connTimeout to: 0
[junit4:junit4]   2> 1685 T194 oashc.HttpShardHandlerFactory.getParameter Setting maxConnectionsPerHost to: 20
[junit4:junit4]   2> 1685 T194 oashc.HttpShardHandlerFactory.getParameter Setting corePoolSize to: 0
[junit4:junit4]   2> 1685 T194 oashc.HttpShardHandlerFactory.getParameter Setting maximumPoolSize to: 2147483647
[junit4:junit4]   2> 1685 T194 oashc.HttpShardHandlerFactory.getParameter Setting maxThreadIdleTime to: 5
[junit4:junit4]   2> 1686 T194 oashc.HttpShardHandlerFactory.getParameter Setting sizeOfQueue to: -1
[junit4:junit4]   2> 1686 T194 oashc.HttpShardHandlerFactory.getParameter Setting fairnessPolicy to: false
[junit4:junit4]   2> 1686 T194 oascsi.HttpClientUtil.createClient Creating new http client, config:maxConnectionsPerHost=20&maxConnections=10000&socketTimeout=0&connTimeout=0&retry=false
[junit4:junit4]   2> 1690 T194 oasc.CoreContainer.register registering core: collection1
[junit4:junit4]   2> 1690 T194 oass.SolrDispatchFilter.init user.dir=/mnt/ssd/jenkins/workspace/Lucene-Solr-4.x-Linux/checkout/solr/build/solr-core/test/J1
[junit4:junit4]   2> 1690 T225 oasc.SolrCore.registerSearcher [collection1] Registered new searcher Searcher@153b39b main{StandardDirectoryReader(segments_1:1)}
[junit4:junit4]   2> 1690 T194 oass.SolrDispatchFilter.init SolrDispatchFilter.init() done
[junit4:junit4]   2> 1691 T194 oascsi.HttpClientUtil.createClient Creating new http client, config:maxConnections=128&maxConnectionsPerHost=32&followRedirects=false
[junit4:junit4]   2> 1693 T194 oejs.Server.doStart jetty-8.1.2.v20120308
[junit4:junit4]   2> 1695 T194 oejs.AbstractConnector.doStart Started SocketConnector@0.0.0.0:56495
[junit4:junit4]   2> 1695 T194 oasc.SolrResourceLoader.locateSolrHome JNDI not configured for solr (NoInitialContextEx)
[junit4:junit4]   2> 1695 T194 oasc.SolrResourceLoader.locateSolrHome using system property solr.solr.home: /mnt/ssd/jenkins/workspace/Lucene-Solr-4.x-Linux/checkout/solr/build/solr-core/test-files/solr
[junit4:junit4]   2> 1696 T194 oasc.SolrResourceLoader.<init> new SolrResourceLoader for deduced Solr Home: '/mnt/ssd/jenkins/workspace/Lucene-Solr-4.x-Linux/checkout/solr/build/solr-core/test-files/solr/'
[junit4:junit4]   2> 1703 T194 oass.SolrDispatchFilter.init SolrDispatchFilter.init()
[junit4:junit4]   2> 1704 T194 oasc.SolrResourceLoader.locateSolrHome JNDI not configured for solr (NoInitialContextEx)
[junit4:junit4]   2> 1704 T194 oasc.SolrResourceLoader.locateSolrHome using system property solr.solr.home: /mnt/ssd/jenkins/workspace/Lucene-Solr-4.x-Linux/checkout/solr/build/solr-core/test-files/solr
[junit4:junit4]   2> 1704 T194 oasc.CoreContainer$Initializer.initialize looking for solr.xml: /mnt/ssd/jenkins/workspace/Lucene-Solr-4.x-Linux/checkout/solr/build/solr-core/test-files/solr/solr.xml
[junit4:junit4]   2> 1704 T194 oasc.CoreContainer.<init> New CoreContainer 16283418
[junit4:junit4]   2> 1705 T194 oasc.CoreContainer.load Loading CoreContainer using Solr Home: '/mnt/ssd/jenkins/workspace/Lucene-Solr-4.x-Linux/checkout/solr/build/solr-core/test-files/solr/'
[junit4:junit4]   2> 1705 T194 oasc.SolrResourceLoader.<init> new SolrResourceLoader for directory: '/mnt/ssd/jenkins/workspace/Lucene-Solr-4.x-Linux/checkout/solr/build/solr-core/test-files/solr/'
[junit4:junit4]   2> 1715 T194 oasc.CoreContainer.load Registering Log Listener
[junit4:junit4]   2> 1728 T194 oasc.CoreContainer.create Creating SolrCore 'collection1' using instanceDir: /mnt/ssd/jenkins/workspace/Lucene-Solr-4.x-Linux/checkout/solr/build/solr-core/test-files/solr/collection1
[junit4:junit4]   2> 1728 T194 oasc.SolrResourceLoader.<init> new SolrResourceLoader for directory: '/mnt/ssd/jenkins/workspace/Lucene-Solr-4.x-Linux/checkout/solr/build/solr-core/test-files/solr/collection1/'
[junit4:junit4]   2> 1728 T194 oasc.SolrResourceLoader.replaceClassLoader Adding 'file:/mnt/ssd/jenkins/workspace/Lucene-Solr-4.x-Linux/checkout/solr/build/solr-core/test-files/solr/collection1/lib/README' to classloader
[junit4:junit4]   2> 1729 T194 oasc.SolrResourceLoader.replaceClassLoader Adding 'file:/mnt/ssd/jenkins/workspace/Lucene-Solr-4.x-Linux/checkout/solr/build/solr-core/test-files/solr/collection1/lib/classes/' to classloader
[junit4:junit4]   2> 1755 T194 oasc.SolrConfig.<init> Using Lucene MatchVersion: LUCENE_40
[junit4:junit4]   2> 1819 T194 oasc.SolrConfig.<init> Loaded SolrConfig: solrconfig-elevate.xml
[junit4:junit4]   2> 1820 T194 oass.IndexSchema.readSchema Reading Solr Schema
[junit4:junit4]   2> 1822 T194 oass.IndexSchema.readSchema Schema name=example
[junit4:junit4]   2> 1965 T194 oass.IndexSchema.readSchema default search field in schema is text
[junit4:junit4]   2> 1967 T194 oass.IndexSchema.readSchema unique key field: id
[junit4:junit4]   2> 1971 T194 oasc.SolrCore.<init> [collection1] Opening new SolrCore at /mnt/ssd/jenkins/workspace/Lucene-Solr-4.x-Linux/checkout/solr/build/solr-core/test-files/solr/collection1/, dataDir=./org.apache.solr.handler.component.DistributedQueryElevationComponentTest-1343908417268/shard2/data/
[junit4:junit4]   2> 1971 T194 oasc.JmxMonitoredMap.<init> JMX monitoring is enabled. Adding Solr mbeans to JMX Server: com.sun.jmx.mbeanserver.JmxMBeanServer@5ef8e8
[junit4:junit4]   2> 1972 T194 oasc.SolrCore.getNewIndexDir WARNING New index directory detected: old=null new=./org.apache.solr.handler.component.DistributedQueryElevationComponentTest-1343908417268/shard2/data/index/
[junit4:junit4]   2> 1972 T194 oasc.SolrCore.initIndex WARNING [collection1] Solr index directory './org.apache.solr.handler.component.DistributedQueryElevationComponentTest-1343908417268/shard2/data/index' doesn't exist. Creating new index...
[junit4:junit4]   2> 1973 T194 oasc.SolrDeletionPolicy.onCommit SolrDeletionPolicy.onCommit: commits:num=1
[junit4:junit4]   2> 		commit{dir=MockDirWrapper(org.apache.lucene.store.RAMDirectory@1423fa5 lockFactory=org.apache.lucene.store.SingleInstanceLockFactory@1672df6),segFN=segments_1,generation=1,filenames=[segments_1]
[junit4:junit4]   2> 1974 T194 oasc.SolrDeletionPolicy.updateCommits newest commit = 1
[junit4:junit4]   2> 1975 T194 oasc.RequestHandlers.initHandlersFromConfig created /update: solr.UpdateRequestHandler
[junit4:junit4]   2> 1976 T194 oasc.RequestHandlers.initHandlersFromConfig created /elevate: org.apache.solr.handler.component.SearchHandler
[junit4:junit4]   2> 1976 T194 oasc.RequestHandlers.initHandlersFromConfig created /dataElevate: org.apache.solr.handler.component.SearchHandler
[junit4:junit4]   2> 1977 T194 oashl.XMLLoader.init xsltCacheLifetimeSeconds=60
[junit4:junit4]   2> 1977 T194 oasc.RequestHandlers.initHandlersFromConfig WARNING no default request handler is registered (either '/select' or 'standard')
[junit4:junit4]   2> 1978 T194 oasc.SolrCore.initDeprecatedSupport WARNING solrconfig.xml uses deprecated <admin/gettableFiles>, Please update your config to use the ShowFileRequestHandler.
[junit4:junit4]   2> 1979 T194 oasc.SolrCore.initDeprecatedSupport WARNING adding ShowFileRequestHandler with hidden files: [HUNSPELL-TEST.AFF, THROW.ERROR.ON.ADD.UPDATEPROCESSOR.JS, SOLRCONFIG-HIGHLIGHT.XML, SCHEMA-FOLDING.XML, BAD-SCHEMA-NONTEXT-ANALYZER.XML, SCHEMA-COPYFIELD-TEST.XML, BAD-SCHEMA-UNIQUEKEY-MULTIVALUED.XML, OLD_SYNONYMS.TXT, STEMDICT.TXT, SCHEMA-TRIE.XML, CONDITIONAL.UPDATEPROCESSOR.JS, SOLRCONFIG-TRANSFORMERS.XML, SOLRCONFIG-TERMINDEX.XML, SOLRCONFIG-REQHANDLER.INCL, SOLRCONFIG-LAZYWRITER.XML, KEEP-1.TXT, SCHEMA12.XML, ADDFIELDS.UPDATEPROCESSOR.JS, SOLRCONFIG-MERGEPOLICY.XML, MAPPING-ISOLATIN1ACCENT.TXT, KEEP-2.TXT, BAD-SOLRCONFIG-MISSING-SCRIPTFILE.XML, BAD-SCHEMA-NOT-INDEXED-BUT-TF.XML, BAD-SCHEMA-UNIQUEKEY-IS-COPYFIELD-DEST.XML, BAD-SCHEMA-SIM-GLOBAL-VS-FT-MISMATCH.XML, SOLRCONFIG-BASIC-LUCENEVERSION31.XML, BAD-SCHEMA-NOT-INDEXED-BUT-NORMS.XML, SCHEMA-REQUIRED-FIELDS.XML, SCHEMA-LMDIRICHLET.XML, SCHEMA-IB.XML, SOLRCONFIG-QUERYSENDER.XML, SCHEMA-REVERSED.XML, SOLRCONFIG-REPEATER.XML, STOPWORDS.TXT, WDFTYPES.TXT, SCHEMA-DFR.XML, SCHEMA-PHRASESUGGEST.XML, TRIVIAL.UPDATEPROCESSOR1.JS, BAD-SCHEMA-DUP-FIELD.XML, SCHEMA-NUMERIC.XML, SOLRCONFIG-MASTER2.XML, SCHEMA-STOP-KEEP.XML, SOLRCONFIG-DELPOLICY2.XML, BAD-SCHEMA-OMIT-TF-BUT-NOT-POS.XML, SCHEMA-COLLATEFILTER.XML, SOLRCONFIG-UPDATE-PROCESSOR-CHAINS.XML, SOLRCONFIG-ALTDIRECTORY.XML, SCHEMA.XML, SCHEMA_CODEC.XML, PROTWORDS.TXT, SOLRCONFIG-SPELLCHECKER.XML, SOLRCONFIG-SOLCOREPROPERTIES.XML, CURRENCY.XML, PHRASESUGGEST.TXT, XSLT, SOLRCONFIG-PROPINJECT.XML, SOLRCONFIG_PERF.XML, SOLRCONFIG-SCRIPT-UPDATEPROCESSOR.XML, SOLRCONFIG-ELEVATE.XML, SOLRCONFIG-QUERYSENDER-NOQUERY.XML, SCHEMASURROUND.XML, BAD-SCHEMA-NOT-INDEXED-BUT-POS.XML, SOLRCONFIG-PHRASESUGGEST.XML, COMPOUNDDICTIONARY.TXT, STOPWITHBOM.TXT, DA_UTF8.XML, SCHEMA-MINIMAL.XML, SOLRCONFIG-CACHING.XML, BAD-SCHEMA-EXTERNAL-FILEFIELD.XML, BAD-SCHEMA-DUP-FIELDTYPE.XML, SOLRCONFIG-SIMPLELOCK.XML, BAD-MP-SOLRCONFIG.XML, TRIVIAL.UPDATEPROCESSOR0.JS, SOLRCONFIG-MASTER1.XML, MISSING.FUNCTIONS.UPDATEPROCESSOR.JS, BAD_SOLRCONFIG.XML, STOPWORDSWRONGENCODING.TXT, DA_COMPOUNDDICTIONARY.TXT, SOLRCONFIG-SPELLCHECKCOMPONENT.XML, STOP-2.TXT, SCHEMA-BM25.XML, SCHEMA11.XML, SOLRCONFIG-BASIC.XML, OPEN-EXCHANGE-RATES.JSON, FRENCHARTICLES.TXT, SCHEMA-LMJELINEKMERCER.XML, BAD-SCHEMA-ANALYZER-CLASS-AND-NESTED.XML, SCHEMA-LUCENEMATCHVERSION.XML, BAD-SCHEMA-DUP-DYNAMICFIELD.XML, STOPTYPES-2.TXT, SOLRCONFIG-MASTER.XML, HYPHENATION.DTD, SOLRCONFIG-SLAVE.XML, SOLRCONFIG-XINCLUDE.XML, SOLRCONFIG-NOCACHE.XML, SCHEMA-REPLICATION1.XML, SOLRCONFIG-PROPINJECT-INDEXDEFAULT.XML, BAD-SCHEMA-CODEC-GLOBAL-VS-FT-MISMATCH.XML, SOLRCONFIG-TLOG.XML, SOLRCONFIG-SOLR-749.XML, BAD-SCHEMA-UNIQUEKEY-USES-DEFAULT.XML, SOLRCONFIG-SLAVE1.XML, SOLRCONFIG-ENABLEPLUGIN.XML, SOLRCONFIG-FUNCTIONQUERY.XML, SCHEMA-SIM.XML, SCHEMA-NOT-REQUIRED-UNIQUE-KEY.XML, ELEVATE.XML, STOPTYPES-1.TXT, STOP-1.TXT, MISSLEADING.EXTENSION.UPDATEPROCESSOR.JS.TXT, SOLRCONFIG-DELPOLICY1.XML, BAD-SOLRCONFIG-INVALID-SCRIPTFILE.XML, SCHEMA-TFIDF.XML, STOP-SNOWBALL.TXT, SCHEMA-COLLATE.XML, HUNSPELL-TEST.DIC, SCHEMA15.XML, SOLRCONFIG-MASTER3.XML, SCHEMA-BINARYFIELD.XML, SCHEMA-REPLICATION2.XML, BAD-SOLRCONFIG-BOGUS-SCRIPTENGINE-NAME.XML, SOLRCONFIG-NATIVELOCK.XML, SOLRCONFIG_CODEC.XML, SCHEMA-CHARFILTERS.XML, SYNONYMS.TXT, SOLRCONFIG-MASTER1-KEEPONEBACKUP.XML, SCHEMA-SPELLCHECKER.XML]
[junit4:junit4]   2> 1981 T194 oass.SolrIndexSearcher.<init> Opening Searcher@1b1d05b main
[junit4:junit4]   2> 1981 T194 oass.SolrIndexSearcher.getIndexDir WARNING WARNING: Directory impl does not support setting indexDir: org.apache.lucene.store.MockDirectoryWrapper
[junit4:junit4]   2> 1982 T194 oasu.CommitTracker.<init> Hard AutoCommit: disabled
[junit4:junit4]   2> 1982 T194 oasu.CommitTracker.<init> Soft AutoCommit: disabled
[junit4:junit4]   2> 1983 T194 oashc.QueryElevationComponent.inform Loading QueryElevation from: /mnt/ssd/jenkins/workspace/Lucene-Solr-4.x-Linux/checkout/solr/build/solr-core/test-files/solr/collection1/conf/elevate.xml
[junit4:junit4]   2> 1991 T194 oashc.QueryElevationComponent.inform Loading QueryElevation from: /mnt/ssd/jenkins/workspace/Lucene-Solr-4.x-Linux/checkout/solr/build/solr-core/test-files/solr/collection1/conf/elevate.xml
[junit4:junit4]   2> 1999 T194 oashc.HttpShardHandlerFactory.getParameter Setting socketTimeout to: 0
[junit4:junit4]   2> 2000 T194 oashc.HttpShardHandlerFactory.getParameter Setting urlScheme to: http://
[junit4:junit4]   2> 2000 T194 oashc.HttpShardHandlerFactory.getParameter Setting connTimeout to: 0
[junit4:junit4]   2> 2000 T194 oashc.HttpShardHandlerFactory.getParameter Setting maxConnectionsPerHost to: 20
[junit4:junit4]   2> 2001 T194 oashc.HttpShardHandlerFactory.getParameter Setting corePoolSize to: 0
[junit4:junit4]   2> 2001 T194 oashc.HttpShardHandlerFactory.getParameter Setting maximumPoolSize to: 2147483647
[junit4:junit4]   2> 2001 T194 oashc.HttpShardHandlerFactory.getParameter Setting maxThreadIdleTime to: 5
[junit4:junit4]   2> 2002 T194 oashc.HttpShardHandlerFactory.getParameter Setting sizeOfQueue to: -1
[junit4:junit4]   2> 2002 T194 oashc.HttpShardHandlerFactory.getParameter Setting fairnessPolicy to: false
[junit4:junit4]   2> 2002 T194 oascsi.HttpClientUtil.createClient Creating new http client, config:maxConnectionsPerHost=20&maxConnections=10000&socketTimeout=0&connTimeout=0&retry=false
[junit4:junit4]   2> 2006 T194 oasc.CoreContainer.register registering core: collection1
[junit4:junit4]   2> 2007 T235 oasc.SolrCore.registerSearcher [collection1] Registered new searcher Searcher@1b1d05b main{StandardDirectoryReader(segments_1:1)}
[junit4:junit4]   2> 2007 T194 oass.SolrDispatchFilter.init user.dir=/mnt/ssd/jenkins/workspace/Lucene-Solr-4.x-Linux/checkout/solr/build/solr-core/test/J1
[junit4:junit4]   2> 2007 T194 oass.SolrDispatchFilter.init SolrDispatchFilter.init() done
[junit4:junit4]   2> 2007 T194 oascsi.HttpClientUtil.createClient Creating new http client, config:maxConnections=128&maxConnectionsPerHost=32&followRedirects=false
[junit4:junit4]   2> ASYNC  NEW_CORE C4 name=collection1 org.apache.solr.core.SolrCore@14e7985
[junit4:junit4]   2> 2185 T199 C4 oasu.DirectUpdateHandler2.deleteAll [collection1] REMOVING ALL DOCUMENTS FROM INDEX
[junit4:junit4]   2> 2186 T199 C4 oasc.SolrDeletionPolicy.onInit SolrDeletionPolicy.onInit: commits:num=1
[junit4:junit4]   2> 		commit{dir=MockDirWrapper(org.apache.lucene.store.RAMDirectory@13b085a lockFactory=org.apache.lucene.store.SingleInstanceLockFactory@13a6ad1),segFN=segments_1,generation=1,filenames=[segments_1]
[junit4:junit4]   2> 2187 T199 C4 oasc.SolrDeletionPolicy.updateCommits newest commit = 1
[junit4:junit4]   2> 2187 T199 C4 UPDATE [collection1] webapp=/solr path=/update params={wt=javabin&version=2} {deleteByQuery=*:*} 0 10
[junit4:junit4]   2> ASYNC  NEW_CORE C5 name=collection1 org.apache.solr.core.SolrCore@17bc00c
[junit4:junit4]   2> 2209 T208 C5 oasu.DirectUpdateHandler2.deleteAll [collection1] REMOVING ALL DOCUMENTS FROM INDEX
[junit4:junit4]   2> 2210 T208 C5 oasc.SolrDeletionPolicy.onInit SolrDeletionPolicy.onInit: commits:num=1
[junit4:junit4]   2> 		commit{dir=MockDirWrapper(NRTCachingDirectory(org.apache.lucene.store.RAMDirectory@17d84cd lockFactory=org.apache.lucene.store.SingleInstanceLockFactory@4aee62; maxCacheMB=0.73828125 maxMergeSizeMB=0.1376953125)),segFN=segments_1,generation=1,filenames=[segments_1]
[junit4:junit4]   2> 2211 T208 C5 oasc.SolrDeletionPolicy.updateCommits newest commit = 1
[junit4:junit4]   2> 2211 T208 C5 UPDATE [collection1] webapp=/solr path=/update params={wt=javabin&version=2} {deleteByQuery=*:*} 0 3
[junit4:junit4]   2> ASYNC  NEW_CORE C6 name=collection1 org.apache.solr.core.SolrCore@109f8b4
[junit4:junit4]   2> 2217 T218 C6 oasu.DirectUpdateHandler2.deleteAll [collection1] REMOVING ALL DOCUMENTS FROM INDEX
[junit4:junit4]   2> 2218 T218 C6 oasc.SolrDeletionPolicy.onInit SolrDeletionPolicy.onInit: commits:num=1
[junit4:junit4]   2> 		commit{dir=BaseDirectoryWrapper(org.apache.lucene.store.RAMDirectory@1a719f6 lockFactory=org.apache.lucene.store.SingleInstanceLockFactory@199719b),segFN=segments_1,generation=1,filenames=[segments_1]
[junit4:junit4]   2> 2226 T218 C6 oasc.SolrDeletionPolicy.updateCommits newest commit = 1
[junit4:junit4]   2> 2227 T218 C6 UPDATE [collection1] webapp=/solr path=/update params={wt=javabin&version=2} {deleteByQuery=*:*} 0 10
[junit4:junit4]   2> ASYNC  NEW_CORE C7 name=collection1 org.apache.solr.core.SolrCore@8f9b6
[junit4:junit4]   2> 2234 T228 C7 oasu.DirectUpdateHandler2.deleteAll [collection1] REMOVING ALL DOCUMENTS FROM INDEX
[junit4:junit4]   2> 2236 T228 C7 oasc.SolrDeletionPolicy.onInit SolrDeletionPolicy.onInit: commits:num=1
[junit4:junit4]   2> 		commit{dir=MockDirWrapper(org.apache.lucene.store.RAMDirectory@1423fa5 lockFactory=org.apache.lucene.store.SingleInstanceLockFactory@1672df6),segFN=segments_1,generation=1,filenames=[segments_1]
[junit4:junit4]   2> 2236 T228 C7 oasc.SolrDeletionPolicy.updateCommits newest commit = 1
[junit4:junit4]   2> 2237 T228 C7 UPDATE [collection1] webapp=/solr path=/update params={wt=javabin&version=2} {deleteByQuery=*:*} 0 3
[junit4:junit4]   2> 2248 T199 C4 UPDATE [collection1] webapp=/solr path=/update params={wt=javabin&version=2} {add=[1]} 0 8
[junit4:junit4]   2> 2252 T208 C5 UPDATE [collection1] webapp=/solr path=/update params={wt=javabin&version=2} {add=[1]} 0 1
[junit4:junit4]   2> 2258 T199 C4 UPDATE [collection1] webapp=/solr path=/update params={wt=javabin&version=2} {add=[2]} 0 2
[junit4:junit4]   2> 2264 T218 C6 UPDATE [collection1] webapp=/solr path=/update params={wt=javabin&version=2} {add=[2]} 0 1
[junit4:junit4]   2> 2269 T199 C4 UPDATE [collection1] webapp=/solr path=/update params={wt=javabin&version=2} {add=[3]} 0 0
[junit4:junit4]   2> 2273 T228 C7 UPDATE [collection1] webapp=/solr path=/update params={wt=javabin&version=2} {add=[3]} 0 1
[junit4:junit4]   2> 2277 T199 C4 UPDATE [collection1] webapp=/solr path=/update params={wt=javabin&version=2} {add=[4]} 0 2
[junit4:junit4]   2> 2281 T208 C5 UPDATE [collection1] webapp=/solr path=/update params={wt=javabin&version=2} {add=[4]} 0 1
[junit4:junit4]   2> 2285 T199 C4 UPDATE [collection1] webapp=/solr path=/update params={wt=javabin&version=2} {add=[5]} 0 1
[junit4:junit4]   2> 2288 T218 C6 UPDATE [collection1] webapp=/solr path=/update params={wt=javabin&version=2} {add=[5]} 0 0
[junit4:junit4]   2> 2292 T199 C4 UPDATE [collection1] webapp=/solr path=/update params={wt=javabin&version=2} {add=[6]} 0 1
[junit4:junit4]   2> 2296 T228 C7 UPDATE [collection1] webapp=/solr path=/update params={wt=javabin&version=2} {add=[6]} 0 1
[junit4:junit4]   2> 2300 T199 C4 UPDATE [collection1] webapp=/solr path=/update params={wt=javabin&version=2} {add=[7]} 0 1
[junit4:junit4]   2> 2303 T228 C7 UPDATE [collection1] webapp=/solr path=/update params={wt=javabin&version=2} {add=[7]} 0 1
[junit4:junit4]   2> 2312 T199 C4 oasu.DirectUpdateHandler2.commit start commit{flags=0,_version_=0,optimize=false,openSearcher=true,waitSearcher=true,expungeDeletes=false,softCommit=false}
[junit4:junit4]   2> 2318 T199 C4 oasc.SolrDeletionPolicy.onCommit SolrDeletionPolicy.onCommit: commits:num=2
[junit4:junit4]   2> 		commit{dir=MockDirWrapper(org.apache.lucene.store.RAMDirectory@13b085a lockFactory=org.apache.lucene.store.SingleInstanceLockFactory@13a6ad1),segFN=segments_1,generation=1,filenames=[segments_1]
[junit4:junit4]   2> 		commit{dir=MockDirWrapper(org.apache.lucene.store.RAMDirectory@13b085a lockFactory=org.apache.lucene.store.SingleInstanceLockFactory@13a6ad1),segFN=segments_2,generation=2,filenames=[segments_2, _0_MockVariableIntBlock_0.frq, _0_MockVariableIntBlock_0.pyl, _0_MockVariableIntBlock_0.tii, _0.fdx, _0_MockVariableIntBlock_0.tib, _0_nrm.cfe, _0.fnm, _0.si, _0.fdt, _0_Lucene40WithOrds_0.frq, _0_MockVariableIntBlock_0.pos, _0_nrm.cfs, _0_Lucene40WithOrds_0.prx, _0_Lucene40WithOrds_0.tii, _0_MockVariableIntBlock_0.doc, _0_MockVariableIntBlock_0.skp, _0_Lucene40WithOrds_0.tib]
[junit4:junit4]   2> 2318 T199 C4 oasc.SolrDeletionPolicy.updateCommits newest commit = 2
[junit4:junit4]   2> 2321 T199 C4 oass.SolrIndexSearcher.<init> Opening Searcher@1a0381a main
[junit4:junit4]   2> 2322 T199 C4 oass.SolrIndexSearcher.getIndexDir WARNING WARNING: Directory impl does not support setting indexDir: org.apache.lucene.store.MockDirectoryWrapper
[junit4:junit4]   2> 2323 T199 C4 oasu.DirectUpdateHandler2.commit end_commit_flush
[junit4:junit4]   2> 2324 T205 oasc.SolrCore.registerSearcher [collection1] Registered new searcher Searcher@1a0381a main{StandardDirectoryReader(segments_2:4 _0(4.0.0.1):C7)}
[junit4:junit4]   2> 2324 T199 C4 UPDATE [collection1] webapp=/solr path=/update params={version=2&commit=true&wt=javabin&waitSearcher=true&softCommit=false} {commit=} 0 12
[junit4:junit4]   2> 2327 T208 C5 oasu.DirectUpdateHandler2.commit start commit{flags=0,_version_=0,optimize=false,openSearcher=true,waitSearcher=true,expungeDeletes=false,softCommit=false}
[junit4:junit4]   2> 2331 T208 C5 oasc.SolrDeletionPolicy.onCommit SolrDeletionPolicy.onCommit: commits:num=2
[junit4:junit4]   2> 		commit{dir=MockDirWrapper(NRTCachingDirectory(org.apache.lucene.store.RAMDirectory@17d84cd lockFactory=org.apache.lucene.store.SingleInstanceLockFactory@4aee62; maxCacheMB=0.73828125 maxMergeSizeMB=0.1376953125)),segFN=segments_1,generation=1,filenames=[segments_1]
[junit4:junit4]   2> 		commit{dir=MockDirWrapper(NRTCachingDirectory(org.apache.lucene.store.RAMDirectory@17d84cd lockFactory=org.apache.lucene.store.SingleInstanceLockFactory@4aee62; maxCacheMB=0.73828125 maxMergeSizeMB=0.1376953125)),segFN=segments_2,generation=2,filenames=[segments_2, _0_MockVariableIntBlock_0.frq, _0_MockVariableIntBlock_0.pyl, _0_MockVariableIntBlock_0.tii, _0.fdx, _0_MockVariableIntBlock_0.tib, _0_nrm.cfe, _0.fnm, _0.si, _0.fdt, _0_Lucene40WithOrds_0.frq, _0_MockVariableIntBlock_0.pos, _0_nrm.cfs, _0_Lucene40WithOrds_0.prx, _0_Lucene40WithOrds_0.tii, _0_MockVariableIntBlock_0.doc, _0_MockVariableIntBlock_0.skp, _0_Lucene40WithOrds_0.tib]
[junit4:junit4]   2> 2331 T208 C5 oasc.SolrDeletionPolicy.updateCommits newest commit = 2
[junit4:junit4]   2> 2333 T208 C5 oass.SolrIndexSearcher.<init> Opening Searcher@b71e9d main
[junit4:junit4]   2> 2334 T208 C5 oass.SolrIndexSearcher.getIndexDir WARNING WARNING: Directory impl does not support setting indexDir: org.apache.lucene.store.MockDirectoryWrapper
[junit4:junit4]   2> 2334 T208 C5 oasu.DirectUpdateHandler2.commit end_commit_flush
[junit4:junit4]   2> 2335 T215 oasc.SolrCore.registerSearcher [collection1] Registered new searcher Searcher@b71e9d main{StandardDirectoryReader(segments_2:4 _0(4.0.0.1):C2)}
[junit4:junit4]   2> 2336 T208 C5 UPDATE [collection1] webapp=/solr path=/update params={version=2&commit=true&wt=javabin&waitSearcher=true&softCommit=false} {commit=} 0 9
[junit4:junit4]   2> 2340 T218 C6 oasu.DirectUpdateHandler2.commit start commit{flags=0,_version_=0,optimize=false,openSearcher=true,waitSearcher=true,expungeDeletes=false,softCommit=false}
[junit4:junit4]   2> 2343 T218 C6 oasc.SolrDeletionPolicy.onCommit SolrDeletionPolicy.onCommit: commits:num=2
[junit4:junit4]   2> 		commit{dir=BaseDirectoryWrapper(org.apache.lucene.store.RAMDirectory@1a719f6 lockFactory=org.apache.lucene.store.SingleInstanceLockFactory@199719b),segFN=segments_1,generation=1,filenames=[segments_1]
[junit4:junit4]   2> 		commit{dir=BaseDirectoryWrapper(org.apache.lucene.store.RAMDirectory@1a719f6 lockFactory=org.apache.lucene.store.SingleInstanceLockFactory@199719b),segFN=segments_2,generation=2,filenames=[segments_2, _0_MockVariableIntBlock_0.frq, _0_MockVariableIntBlock_0.tii, _0_MockVariableIntBlock_0.pyl, _0.fdx, _0_MockVariableIntBlock_0.tib, _0_nrm.cfe, _0.fnm, _0.si, _0.fdt, _0_Lucene40WithOrds_0.frq, _0_MockVariableIntBlock_0.pos, _0_nrm.cfs, _0_Lucene40WithOrds_0.prx, _0_Lucene40WithOrds_0.tii, _0_MockVariableIntBlock_0.doc, _0_MockVariableIntBlock_0.skp, _0_Lucene40WithOrds_0.tib]
[junit4:junit4]   2> 2344 T218 C6 oasc.SolrDeletionPolicy.updateCommits newest commit = 2
[junit4:junit4]   2> 2345 T218 C6 oass.SolrIndexSearcher.<init> Opening Searcher@1a36719 main
[junit4:junit4]   2> 2345 T218 C6 oass.SolrIndexSearcher.getIndexDir WARNING WARNING: Directory impl does not support setting indexDir: org.apache.lucene.store.BaseDirectoryWrapper
[junit4:junit4]   2> 2345 T218 C6 oasu.DirectUpdateHandler2.commit end_commit_flush
[junit4:junit4]   2> 2346 T225 oasc.SolrCore.registerSearcher [collection1] Registered new searcher Searcher@1a36719 main{StandardDirectoryReader(segments_2:4 _0(4.0.0.1):C2)}
[junit4:junit4]   2> 2347 T218 C6 UPDATE [collection1] webapp=/solr path=/update params={version=2&commit=true&wt=javabin&waitSearcher=true&softCommit=false} {commit=} 0 7
[junit4:junit4]   2> 2350 T228 C7 oasu.DirectUpdateHandler2.commit start commit{flags=0,_version_=0,optimize=false,openSearcher=true,waitSearcher=true,expungeDeletes=false,softCommit=false}
[junit4:junit4]   2> 2356 T228 C7 oasc.SolrDeletionPolicy.onCommit SolrDeletionPolicy.onCommit: commits:num=2
[junit4:junit4]   2> 		commit{dir=MockDirWrapper(org.apache.lucene.store.RAMDirectory@1423fa5 lockFactory=org.apache.lucene.store.SingleInstanceLockFactory@1672df6),segFN=segments_1,generation=1,filenames=[segments_1]
[junit4:junit4]   2> 		commit{dir=MockDirWrapper(org.apache.lucene.store.RAMDirectory@1423fa5 lockFactory=org.apache.lucene.store.SingleInstanceLockFactory@1672df6),segFN=segments_2,generation=2,filenames=[segments_2, _0_MockVariableIntBlock_0.frq, _0_MockVariableIntBlock_0.tii, _0_MockVariableIntBlock_0.pyl, _0.fdx, _0_MockVariableIntBlock_0.tib, _0_nrm.cfe, _0.fnm, _0.si, _0.fdt, _0_Lucene40WithOrds_0.frq, _0_MockVariableIntBlock_0.pos, _0_nrm.cfs, _0_Lucene40WithOrds_0.prx, _0_Lucene40WithOrds_0.tii, _0_MockVariableIntBlock_0.doc, _0_MockVariableIntBlock_0.skp, _0_Lucene40WithOrds_0.tib]
[junit4:junit4]   2> 2356 T228 C7 oasc.SolrDeletionPolicy.updateCommits newest commit = 2
[junit4:junit4]   2> 2358 T228 C7 oass.SolrIndexSearcher.<init> Opening Searcher@ed59e7 main
[junit4:junit4]   2> 2359 T228 C7 oass.SolrIndexSearcher.getIndexDir WARNING WARNING: Directory impl does not support setting indexDir: org.apache.lucene.store.MockDirectoryWrapper
[junit4:junit4]   2> 2359 T228 C7 oasu.DirectUpdateHandler2.commit end_commit_flush
[junit4:junit4]   2> 2359 T235 oasc.SolrCore.registerSearcher [collection1] Registered new searcher Searcher@ed59e7 main{StandardDirectoryReader(segments_2:4 _0(4.0.0.1):C3)}
[junit4:junit4]   2> 2360 T228 C7 UPDATE [collection1] webapp=/solr path=/update params={version=2&commit=true&wt=javabin&waitSearcher=true&softCommit=false} {commit=} 0 10
[junit4:junit4]   2> 2466 T199 C4 REQ [collection1] webapp=/solr path=/elevate params={fl=id,+score,+[elevated]&wt=javabin&q=*:*&shards.qt=/elevate&sort=id+desc&version=2&qt=/elevate&rows=500&distrib=false} hits=7 status=0 QTime=91 
[junit4:junit4]   2> 2505 T229 C7 REQ [collection1] webapp=/solr path=/elevate params={start=0&q=*:*&version=2&rows=500&fsv=true&fl=id,score&wt=javabin&NOW=1343908419736&shard.url=localhost:56495/solr|[::1]:33332/solr&sort=id+desc&shards.qt=/elevate&isShard=true&distrib=false&qt=/elevate} hits=3 status=0 QTime=4 
[junit4:junit4]   2> 2506 T219 C6 REQ [collection1] webapp=/solr path=/elevate params={start=0&q=*:*&version=2&rows=500&fsv=true&fl=id,score&wt=javabin&NOW=1343908419736&shard.url=localhost:55839/solr|[::1]:33332/solr&sort=id+desc&shards.qt=/elevate&isShard=true&distrib=false&qt=/elevate} hits=2 status=0 QTime=5 
[junit4:junit4]   2> 2506 T209 C5 REQ [collection1] webapp=/solr path=/elevate params={start=0&q=*:*&version=2&rows=500&fsv=true&fl=id,score&wt=javabin&NOW=1343908419736&shard.url=localhost:44704/solr|[::1]:33332/solr&sort=id+desc&shards.qt=/elevate&isShard=true&distrib=false&qt=/elevate} hits=2 status=0 QTime=5 
[junit4:junit4]   2> 2519 T209 C5 REQ [collection1] webapp=/solr path=/elevate params={q=*:*&version=2&rows=500&ids=4.0,1.0&fl=id,+score,+[elevated]&wt=javabin&NOW=1343908419736&shard.url=localhost:44704/solr|[::1]:33332/solr&shards.qt=/elevate&isShard=true&qt=/elevate&distrib=false} status=0 QTime=1 
[junit4:junit4]   2> 2522 T219 C6 REQ [collection1] webapp=/solr path=/elevate params={q=*:*&version=2&rows=500&ids=2.0,5.0&fl=id,+score,+[elevated]&wt=javabin&NOW=1343908419736&shard.url=localhost:55839/solr|[::1]:33332/solr&shards.qt=/elevate&isShard=true&qt=/elevate&distrib=false} status=0 QTime=1 
[junit4:junit4]   2> 2523 T229 C7 REQ [collection1] webapp=/solr path=/elevate params={q=*:*&version=2&rows=500&ids=7.0,6.0,3.0&fl=id,+score,+[elevated]&wt=javabin&NOW=1343908419736&shard.url=localhost:56495/solr|[::1]:33332/solr&shards.qt=/elevate&isShard=true&qt=/elevate&distrib=false} status=0 QTime=0 
[junit4:junit4]   2> 2529 T228 C7 REQ [collection1] webapp=/solr path=/elevate params={fl=id,+score,+[elevated]&wt=javabin&q=*:*&shards.qt=/elevate&sort=id+desc&version=2&shards=localhost:44704/solr|[::1]:33332/solr,localhost:55839/solr|[::1]:33332/solr,localhost:56495/solr|[::1]:33332/solr&qt=/elevate&rows=500} status=0 QTime=58 
[junit4:junit4]   2> 2533 T194 oas.BaseDistributedSearchTestCase.compareResponses SEVERE Mismatched responses:
[junit4:junit4]   2> 	{responseHeader={status=0,QTime=58,params={fl=id, score, [elevated],wt=javabin,q=*:*,shards.qt=/elevate,sort=id desc,version=2,shards=localhost:44704/solr|[::1]:33332/solr,localhost:55839/solr|[::1]:33332/solr,localhost:56495/solr|[::1]:33332/solr,qt=/elevate,rows=500}},response={numFound=7,start=0,maxScore=1.0,docs=[SolrDocument{id=7.0, [elevated]=false, score=1.0}, SolrDocument{id=6.0, [elevated]=false, score=1.0}, SolrDocument{id=5.0, [elevated]=false, score=1.0}, SolrDocument{id=4.0, [elevated]=false, score=1.0}, SolrDocument{id=3.0, [elevated]=false, score=1.0}, SolrDocument{id=2.0, [elevated]=false, score=1.0}, SolrDocument{id=1.0, [elevated]=false, score=1.0}]}}
[junit4:junit4]   2> 	{responseHeader={status=0,QTime=91,params={fl=id, score, [elevated],wt=javabin,q=*:*,shards.qt=/elevate,sort=id desc,version=2,qt=/elevate,rows=500,distrib=false}},response={numFound=7,start=0,maxScore=1.0,docs=[SolrDocument{id=7.0, score=1.0, [elevated]=false}, SolrDocument{id=6.0, score=1.0, [elevated]=false}, SolrDocument{id=5.0, score=1.0, [elevated]=false}, SolrDocument{id=4.0, score=1.0, [elevated]=false}, SolrDocument{id=3.0, score=1.0, [elevated]=false}, SolrDocument{id=2.0, score=1.0, [elevated]=false}, SolrDocument{id=1.0, score=1.0, [elevated]=false}]}}
[junit4:junit4]   2> 2552 T194 oasc.CoreContainer.shutdown Shutting down CoreContainer instance=5555289
[junit4:junit4]   2> 2552 T194 oasc.SolrCore.close [collection1]  CLOSING SolrCore org.apache.solr.core.SolrCore@14e7985
[junit4:junit4]   2> 2553 T194 oasc.SolrCore.closeSearcher [collection1] Closing main searcher on request.
[junit4:junit4]   2> 2562 T194 oasu.DirectUpdateHandler2.close closing DirectUpdateHandler2{commits=1,autocommits=0,soft autocommits=0,optimizes=0,rollbacks=0,expungeDeletes=0,docsPending=0,adds=0,deletesById=0,deletesByQuery=0,errors=0,cumulative_adds=7,cumulative_deletesById=0,cumulative_deletesByQuery=1,cumulative_errors=0}
[junit4:junit4]   2> 2571 T194 oejsh.ContextHandler.doStop stopped o.e.j.s.ServletContextHandler{/solr,null}
[junit4:junit4]   2> 2626 T194 oasc.CoreContainer.shutdown Shutting down CoreContainer instance=16688622
[junit4:junit4]   2> 2627 T194 oasc.SolrCore.close [collection1]  CLOSING SolrCore org.apache.solr.core.SolrCore@17bc00c
[junit4:junit4]   2> 2628 T194 oasc.SolrCore.closeSearcher [collection1] Closing main searcher on request.
[junit4:junit4]   2> 2628 T194 oasu.DirectUpdateHandler2.close closing DirectUpdateHandler2{commits=1,autocommits=0,soft autocommits=0,optimizes=0,rollbacks=0,expungeDeletes=0,docsPending=0,adds=0,deletesById=0,deletesByQuery=0,errors=0,cumulative_adds=2,cumulative_deletesById=0,cumulative_deletesByQuery=1,cumulative_errors=0}
[junit4:junit4]   2> 2642 T194 oejsh.ContextHandler.doStop stopped o.e.j.s.ServletContextHandler{/solr,null}
[junit4:junit4]   2> 2695 T194 oasc.CoreContainer.shutdown Shutting down CoreContainer instance=13449196
[junit4:junit4]   2> 2696 T194 oasc.SolrCore.close [collection1]  CLOSING SolrCore org.apache.solr.core.SolrCore@109f8b4
[junit4:junit4]   2> 2697 T194 oasc.SolrCore.closeSearcher [collection1] Closing main searcher on request.
[junit4:junit4]   2> 2698 T194 oasu.DirectUpdateHandler2.close closing DirectUpdateHandler2{commits=1,autocommits=0,soft autocommits=0,optimizes=0,rollbacks=0,expungeDeletes=0,docsPending=0,adds=0,deletesById=0,deletesByQuery=0,errors=0,cumulative_adds=2,cumulative_deletesById=0,cumulative_deletesByQuery=1,cumulative_errors=0}
[junit4:junit4]   2> 2702 T194 oejsh.ContextHandler.doStop stopped o.e.j.s.ServletContextHandler{/solr,null}
[junit4:junit4]   2> 2755 T194 oasc.CoreContainer.shutdown Shutting down CoreContainer instance=16283418
[junit4:junit4]   2> 2756 T194 oasc.SolrCore.close [collection1]  CLOSING SolrCore org.apache.solr.core.SolrCore@8f9b6
[junit4:junit4]   2> 2757 T194 oasc.SolrCore.closeSearcher [collection1] Closing main searcher on request.
[junit4:junit4]   2> 2758 T194 oasu.DirectUpdateHandler2.close closing DirectUpdateHandler2{commits=1,autocommits=0,soft autocommits=0,optimizes=0,rollbacks=0,expungeDeletes=0,docsPending=0,adds=0,deletesById=0,deletesByQuery=0,errors=0,cumulative_adds=3,cumulative_deletesById=0,cumulative_deletesByQuery=1,cumulative_errors=0}
[junit4:junit4]   2> 2771 T194 oejsh.ContextHandler.doStop stopped o.e.j.s.ServletContextHandler{/solr,null}
[junit4:junit4]   2> 2826 T194 oas.SolrTestCaseJ4.tearDown ###Ending testDistribSearch
[junit4:junit4]   2> NOTE: reproduce with: ant test  -Dtestcase=DistributedQueryElevationComponentTest -Dtests.method=testDistribSearch -Dtests.seed=740958AA76E5330 -Dtests.multiplier=3 -Dtests.slow=true -Dtests.locale=es_SV -Dtests.timezone=AST -Dtests.file.encoding=ISO-8859-1
[junit4:junit4]   2>
[junit4:junit4]    > (@AfterClass output)
[junit4:junit4]   2> 2912 T194 oas.SolrTestCaseJ4.deleteCore ###deleteCore
[junit4:junit4]   2> NOTE: test params are: codec=Lucene40: {int_i=PostingsFormat(name=Lucene40WithOrds), plow_t=MockVariableIntBlock(baseBlockSize=115), text=PostingsFormat(name=Lucene40WithOrds), field_t=PostingsFormat(name=Lucene40WithOrds), id=MockVariableIntBlock(baseBlockSize=115)}, sim=DefaultSimilarity, locale=es_SV, timezone=AST
[junit4:junit4]   2> NOTE: Linux 3.2.0-27-generic i386/Oracle Corporation 1.8.0-ea (32-bit)/cpus=8,threads=1,free=74441696,total=98566144
[junit4:junit4]   2> NOTE: All tests run in this JVM: [TestSolrXMLSerializer, MultiTermTest, LeaderElectionTest, DirectUpdateHandlerTest, DebugComponentTest, UpdateParamsTest, DistributedQueryElevationComponentTest]
[junit4:junit4]   2> 
[junit4:junit4] Completed on J1 in 2.92s, 1 test, 1 failure <<< FAILURES!

[...truncated 618 lines...]
BUILD FAILED
/mnt/ssd/jenkins/workspace/Lucene-Solr-4.x-Linux/checkout/build.xml:29: The following error occurred while executing this line:
/mnt/ssd/jenkins/workspace/Lucene-Solr-4.x-Linux/checkout/solr/build.xml:144: The following error occurred while executing this line:
/mnt/ssd/jenkins/workspace/Lucene-Solr-4.x-Linux/checkout/lucene/module-build.xml:62: The following error occurred while executing this line:
/mnt/ssd/jenkins/workspace/Lucene-Solr-4.x-Linux/checkout/lucene/common-build.xml:1095: The following error occurred while executing this line:
/mnt/ssd/jenkins/workspace/Lucene-Solr-4.x-Linux/checkout/lucene/common-build.xml:790: There were test failures: 224 suites, 903 tests, 1 failure, 5 ignored

Total time: 22 minutes 7 seconds
Build step 'Execute shell' marked build as failure
Archiving artifacts
Recording test results
Email was triggered for: Failure
Sending email for trigger: Failure



Mime
View raw message