lucene-dev mailing list archives

Site index · List index
Message view « Date » · « Thread »
Top « Date » · « Thread »
From Policeman Jenkins Server <jenk...@sd-datasolutions.de>
Subject [JENKINS] Lucene-Solr-4.x-Windows (64bit/jdk1.6.0_34) - Build # 462 - Failure!
Date Sun, 26 Aug 2012 19:31:37 GMT
Build: http://jenkins.sd-datasolutions.de/job/Lucene-Solr-4.x-Windows/462/
Java: 64bit/jdk1.6.0_34 -XX:+UseParallelGC

1 tests failed.
REGRESSION:  org.apache.solr.spelling.suggest.SuggesterWFSTTest.testRebuild

Error Message:
Exception during query

Stack Trace:
java.lang.RuntimeException: Exception during query
	at __randomizedtesting.SeedInfo.seed([40D50D8ABA8053B2:1BF0AFC98E802928]:0)
	at org.apache.solr.SolrTestCaseJ4.assertQ(SolrTestCaseJ4.java:493)
	at org.apache.solr.SolrTestCaseJ4.assertQ(SolrTestCaseJ4.java:460)
	at org.apache.solr.spelling.suggest.SuggesterTest.testRebuild(SuggesterTest.java:105)
	at sun.reflect.NativeMethodAccessorImpl.invoke0(Native Method)
	at sun.reflect.NativeMethodAccessorImpl.invoke(NativeMethodAccessorImpl.java:39)
	at sun.reflect.DelegatingMethodAccessorImpl.invoke(DelegatingMethodAccessorImpl.java:25)
	at java.lang.reflect.Method.invoke(Method.java:597)
	at com.carrotsearch.randomizedtesting.RandomizedRunner.invoke(RandomizedRunner.java:1559)
	at com.carrotsearch.randomizedtesting.RandomizedRunner.access$600(RandomizedRunner.java:79)
	at com.carrotsearch.randomizedtesting.RandomizedRunner$6.evaluate(RandomizedRunner.java:737)
	at com.carrotsearch.randomizedtesting.RandomizedRunner$7.evaluate(RandomizedRunner.java:773)
	at com.carrotsearch.randomizedtesting.RandomizedRunner$8.evaluate(RandomizedRunner.java:787)
	at com.carrotsearch.randomizedtesting.rules.SystemPropertiesRestoreRule$1.evaluate(SystemPropertiesRestoreRule.java:53)
	at org.apache.lucene.util.TestRuleSetupTeardownChained$1.evaluate(TestRuleSetupTeardownChained.java:50)
	at org.apache.lucene.util.TestRuleFieldCacheSanity$1.evaluate(TestRuleFieldCacheSanity.java:51)
	at org.apache.lucene.util.AbstractBeforeAfterRule$1.evaluate(AbstractBeforeAfterRule.java:45)
	at com.carrotsearch.randomizedtesting.rules.SystemPropertiesInvariantRule$1.evaluate(SystemPropertiesInvariantRule.java:55)
	at org.apache.lucene.util.TestRuleThreadAndTestName$1.evaluate(TestRuleThreadAndTestName.java:48)
	at org.apache.lucene.util.TestRuleIgnoreAfterMaxFailures$1.evaluate(TestRuleIgnoreAfterMaxFailures.java:70)
	at org.apache.lucene.util.TestRuleMarkFailure$1.evaluate(TestRuleMarkFailure.java:48)
	at com.carrotsearch.randomizedtesting.rules.StatementAdapter.evaluate(StatementAdapter.java:36)
	at com.carrotsearch.randomizedtesting.ThreadLeakControl$StatementRunner.run(ThreadLeakControl.java:345)
	at com.carrotsearch.randomizedtesting.ThreadLeakControl.forkTimeoutingTask(ThreadLeakControl.java:769)
	at com.carrotsearch.randomizedtesting.ThreadLeakControl$3.evaluate(ThreadLeakControl.java:429)
	at com.carrotsearch.randomizedtesting.RandomizedRunner.runSingleTest(RandomizedRunner.java:746)
	at com.carrotsearch.randomizedtesting.RandomizedRunner$3.evaluate(RandomizedRunner.java:648)
	at com.carrotsearch.randomizedtesting.RandomizedRunner$4.evaluate(RandomizedRunner.java:682)
	at com.carrotsearch.randomizedtesting.RandomizedRunner$5.evaluate(RandomizedRunner.java:693)
	at com.carrotsearch.randomizedtesting.rules.StatementAdapter.evaluate(StatementAdapter.java:36)
	at com.carrotsearch.randomizedtesting.rules.SystemPropertiesRestoreRule$1.evaluate(SystemPropertiesRestoreRule.java:53)
	at org.apache.lucene.util.AbstractBeforeAfterRule$1.evaluate(AbstractBeforeAfterRule.java:45)
	at org.apache.lucene.util.TestRuleStoreClassName$1.evaluate(TestRuleStoreClassName.java:42)
	at com.carrotsearch.randomizedtesting.rules.SystemPropertiesInvariantRule$1.evaluate(SystemPropertiesInvariantRule.java:55)
	at com.carrotsearch.randomizedtesting.rules.NoShadowingOrOverridesOnMethodsRule$1.evaluate(NoShadowingOrOverridesOnMethodsRule.java:39)
	at com.carrotsearch.randomizedtesting.rules.NoShadowingOrOverridesOnMethodsRule$1.evaluate(NoShadowingOrOverridesOnMethodsRule.java:39)
	at org.apache.lucene.util.TestRuleAssertionsRequired$1.evaluate(TestRuleAssertionsRequired.java:40)
	at org.apache.lucene.util.TestRuleMarkFailure$1.evaluate(TestRuleMarkFailure.java:48)
	at org.apache.lucene.util.TestRuleIgnoreAfterMaxFailures$1.evaluate(TestRuleIgnoreAfterMaxFailures.java:70)
	at org.apache.lucene.util.TestRuleIgnoreTestSuites$1.evaluate(TestRuleIgnoreTestSuites.java:55)
	at com.carrotsearch.randomizedtesting.rules.StatementAdapter.evaluate(StatementAdapter.java:36)
	at com.carrotsearch.randomizedtesting.ThreadLeakControl$StatementRunner.run(ThreadLeakControl.java:345)
	at java.lang.Thread.run(Thread.java:662)
Caused by: java.lang.NullPointerException
	at org.apache.lucene.search.suggest.fst.WFSTCompletionLookup.lookupPrefix(WFSTCompletionLookup.java:193)
	at org.apache.lucene.search.suggest.fst.WFSTCompletionLookup.lookup(WFSTCompletionLookup.java:155)
	at org.apache.solr.spelling.suggest.Suggester.getSuggestions(Suggester.java:190)
	at org.apache.solr.handler.component.SpellCheckComponent.process(SpellCheckComponent.java:172)
	at org.apache.solr.handler.component.SearchHandler.handleRequestBody(SearchHandler.java:206)
	at org.apache.solr.handler.RequestHandlerBase.handleRequest(RequestHandlerBase.java:129)
	at org.apache.solr.core.SolrCore.execute(SolrCore.java:1672)
	at org.apache.solr.util.TestHarness.query(TestHarness.java:351)
	at org.apache.solr.util.TestHarness.query(TestHarness.java:333)
	at org.apache.solr.SolrTestCaseJ4.assertQ(SolrTestCaseJ4.java:467)
	... 41 more




Build Log:
[...truncated 6780 lines...]
[junit4:junit4] Suite: org.apache.solr.spelling.suggest.SuggesterWFSTTest
[junit4:junit4]   2> 0 T3355 oas.SolrTestCaseJ4.initCore ####initCore
[junit4:junit4]   2> Creating dataDir: C:\Jenkins\workspace\Lucene-Solr-4.x-Windows\solr\build\solr-core\test\J0\.\solrtest-SuggesterWFSTTest-1346009330285
[junit4:junit4]   2> 1 T3355 oasc.SolrResourceLoader.<init> new SolrResourceLoader for directory: 'C:\Jenkins\workspace\Lucene-Solr-4.x-Windows\solr\build\solr-core\test-files\solr\collection1\'
[junit4:junit4]   2> 1 T3355 oasc.SolrResourceLoader.replaceClassLoader Adding 'file:/C:/Jenkins/workspace/Lucene-Solr-4.x-Windows/solr/build/solr-core/test-files/solr/collection1/lib/classes/' to classloader
[junit4:junit4]   2> 1 T3355 oasc.SolrResourceLoader.replaceClassLoader Adding 'file:/C:/Jenkins/workspace/Lucene-Solr-4.x-Windows/solr/build/solr-core/test-files/solr/collection1/lib/README' to classloader
[junit4:junit4]   2> 102 T3355 oasc.SolrConfig.<init> Using Lucene MatchVersion: LUCENE_40
[junit4:junit4]   2> 182 T3355 oasc.SolrConfig.<init> Loaded SolrConfig: solrconfig-spellchecker.xml
[junit4:junit4]   2> 182 T3355 oass.IndexSchema.readSchema Reading Solr Schema
[junit4:junit4]   2> 185 T3355 oass.IndexSchema.readSchema Schema name=Solr SpellCheck Test
[junit4:junit4]   2> 218 T3355 oass.IndexSchema.readSchema default search field in schema is text
[junit4:junit4]   2> 220 T3355 oass.IndexSchema.readSchema query parser default operator is OR
[junit4:junit4]   2> 224 T3355 oass.IndexSchema.readSchema unique key field: id
[junit4:junit4]   2> 225 T3355 oasc.SolrResourceLoader.locateSolrHome JNDI not configured for solr (NoInitialContextEx)
[junit4:junit4]   2> 226 T3355 oasc.SolrResourceLoader.locateSolrHome using system property solr.solr.home: C:\Jenkins\workspace\Lucene-Solr-4.x-Windows\solr\build\solr-core\test-files\solr
[junit4:junit4]   2> 226 T3355 oasc.SolrResourceLoader.<init> new SolrResourceLoader for directory: 'C:\Jenkins\workspace\Lucene-Solr-4.x-Windows\solr\build\solr-core\test-files\solr\'
[junit4:junit4]   2> 234 T3355 oasc.CoreContainer.<init> New CoreContainer 1397648803
[junit4:junit4]   2> 234 T3355 oasc.SolrCore.<init> [collection1] Opening new SolrCore at C:\Jenkins\workspace\Lucene-Solr-4.x-Windows\solr\build\solr-core\test-files\solr\collection1\, dataDir=C:\Jenkins\workspace\Lucene-Solr-4.x-Windows\solr\build\solr-core\test\J0\.\solrtest-SuggesterWFSTTest-1346009330285\
[junit4:junit4]   2> 234 T3355 oasc.SolrCore.<init> JMX monitoring not detected for core: collection1
[junit4:junit4]   2> 234 T3355 oasc.SolrCore.getNewIndexDir WARNING New index directory detected: old=null new=C:\Jenkins\workspace\Lucene-Solr-4.x-Windows\solr\build\solr-core\test\J0\.\solrtest-SuggesterWFSTTest-1346009330285\index/
[junit4:junit4]   2> 234 T3355 oasc.SolrCore.initIndex WARNING [collection1] Solr index directory 'C:\Jenkins\workspace\Lucene-Solr-4.x-Windows\solr\build\solr-core\test\J0\.\solrtest-SuggesterWFSTTest-1346009330285\index' doesn't exist. Creating new index...
[junit4:junit4]   2> 235 T3355 oasc.CachingDirectoryFactory.get return new directory for C:\Jenkins\workspace\Lucene-Solr-4.x-Windows\solr\build\solr-core\test\J0\.\solrtest-SuggesterWFSTTest-1346009330285\index forceNew:false
[junit4:junit4]   2> 238 T3355 oasc.SolrDeletionPolicy.onCommit SolrDeletionPolicy.onCommit: commits:num=1
[junit4:junit4]   2> 		commit{dir=MockDirWrapper(org.apache.lucene.store.SimpleFSDirectory@C:\Jenkins\workspace\Lucene-Solr-4.x-Windows\solr\build\solr-core\test\J0\solrtest-SuggesterWFSTTest-1346009330285\index lockFactory=org.apache.lucene.store.NativeFSLockFactory@12e35fa3),segFN=segments_1,generation=1,filenames=[segments_1]
[junit4:junit4]   2> 239 T3355 oasc.SolrDeletionPolicy.updateCommits newest commit = 1
[junit4:junit4]   2> 249 T3355 oasc.RequestHandlers.initHandlersFromConfig created standard: solr.StandardRequestHandler
[junit4:junit4]   2> 249 T3355 oasc.RequestHandlers.initHandlersFromConfig created /suggest: org.apache.solr.handler.component.SearchHandler
[junit4:junit4]   2> 250 T3355 oasc.RequestHandlers.initHandlersFromConfig created /suggest_tst: org.apache.solr.handler.component.SearchHandler
[junit4:junit4]   2> 250 T3355 oasc.RequestHandlers.initHandlersFromConfig created /suggest_fst: org.apache.solr.handler.component.SearchHandler
[junit4:junit4]   2> 250 T3355 oasc.RequestHandlers.initHandlersFromConfig created /suggest_wfst: org.apache.solr.handler.component.SearchHandler
[junit4:junit4]   2> 254 T3355 oass.SolrIndexSearcher.<init> Opening Searcher@753f5ec0 main
[junit4:junit4]   2> 254 T3355 oass.SolrIndexSearcher.getIndexDir WARNING WARNING: Directory impl does not support setting indexDir: org.apache.lucene.store.MockDirectoryWrapper
[junit4:junit4]   2> 255 T3355 oasu.CommitTracker.<init> Hard AutoCommit: disabled
[junit4:junit4]   2> 255 T3355 oasu.CommitTracker.<init> Soft AutoCommit: disabled
[junit4:junit4]   2> 255 T3355 oashc.SpellCheckComponent.inform Initializing spell checkers
[junit4:junit4]   2> 256 T3355 oasss.Suggester.init init: {name=suggest,classname=org.apache.solr.spelling.suggest.Suggester,lookupImpl=org.apache.solr.spelling.suggest.jaspell.JaspellLookup,field=suggest,storeDir=suggest,buildOnCommit=true,threshold=0.0}
[junit4:junit4]   2> 261 T3355 oasssj.JaspellLookupFactory.create init: {name=suggest,classname=org.apache.solr.spelling.suggest.Suggester,lookupImpl=org.apache.solr.spelling.suggest.jaspell.JaspellLookup,field=suggest,storeDir=suggest,buildOnCommit=true,threshold=0.0}
[junit4:junit4]   2> 265 T3355 oashc.SpellCheckComponent.inform Registering newSearcher listener for spellchecker: suggest
[junit4:junit4]   2> 265 T3355 oashc.SpellCheckComponent.inform No queryConverter defined, using default converter
[junit4:junit4]   2> 265 T3355 oashc.SpellCheckComponent.inform Initializing spell checkers
[junit4:junit4]   2> 265 T3355 oasss.Suggester.init init: {name=suggest_tst,classname=org.apache.solr.spelling.suggest.Suggester,lookupImpl=org.apache.solr.spelling.suggest.tst.TSTLookup,field=suggest,storeDir=suggest_tst,buildOnCommit=true,threshold=0.0}
[junit4:junit4]   2> 270 T3355 oashc.SpellCheckComponent.inform Registering newSearcher listener for spellchecker: suggest_tst
[junit4:junit4]   2> 270 T3355 oashc.SpellCheckComponent.inform No queryConverter defined, using default converter
[junit4:junit4]   2> 270 T3355 oashc.SpellCheckComponent.inform Initializing spell checkers
[junit4:junit4]   2> 271 T3355 oasss.Suggester.init init: {name=suggest_fst,classname=org.apache.solr.spelling.suggest.Suggester,lookupImpl=org.apache.solr.spelling.suggest.fst.FSTLookup,field=suggest,storeDir=suggest_fst,buildOnCommit=true,weightBuckets=5,exactMatchFirst=true}
[junit4:junit4]   2> 275 T3355 oashc.SpellCheckComponent.inform Registering newSearcher listener for spellchecker: suggest_fst
[junit4:junit4]   2> 275 T3355 oashc.SpellCheckComponent.inform No queryConverter defined, using default converter
[junit4:junit4]   2> 275 T3355 oashc.SpellCheckComponent.inform Initializing spell checkers
[junit4:junit4]   2> 276 T3355 oasss.Suggester.init init: {name=suggest_wfst,classname=org.apache.solr.spelling.suggest.Suggester,lookupImpl=org.apache.solr.spelling.suggest.fst.WFSTLookupFactory,field=suggest,storeDir=suggest_wfst,buildOnCommit=true,exactMatchFirst=true}
[junit4:junit4]   2> 278 T3355 oashc.SpellCheckComponent.inform Registering newSearcher listener for spellchecker: suggest_wfst
[junit4:junit4]   2> 279 T3355 oashc.SpellCheckComponent.inform No queryConverter defined, using default converter
[junit4:junit4]   2> 279 T3355 oashc.HttpShardHandlerFactory.getParameter Setting socketTimeout to: 0
[junit4:junit4]   2> 279 T3355 oashc.HttpShardHandlerFactory.getParameter Setting urlScheme to: http://
[junit4:junit4]   2> 280 T3355 oashc.HttpShardHandlerFactory.getParameter Setting connTimeout to: 0
[junit4:junit4]   2> 280 T3355 oashc.HttpShardHandlerFactory.getParameter Setting maxConnectionsPerHost to: 20
[junit4:junit4]   2> 280 T3355 oashc.HttpShardHandlerFactory.getParameter Setting corePoolSize to: 0
[junit4:junit4]   2> 280 T3355 oashc.HttpShardHandlerFactory.getParameter Setting maximumPoolSize to: 2147483647
[junit4:junit4]   2> 280 T3355 oashc.HttpShardHandlerFactory.getParameter Setting maxThreadIdleTime to: 5
[junit4:junit4]   2> 280 T3355 oashc.HttpShardHandlerFactory.getParameter Setting sizeOfQueue to: -1
[junit4:junit4]   2> 280 T3355 oashc.HttpShardHandlerFactory.getParameter Setting fairnessPolicy to: false
[junit4:junit4]   2> 280 T3355 oascsi.HttpClientUtil.createClient Creating new http client, config:maxConnectionsPerHost=20&maxConnections=10000&socketTimeout=0&connTimeout=0&retry=false
[junit4:junit4]   2> 284 T3355 oasc.CoreContainer.register registering core: collection1
[junit4:junit4]   2> 285 T3355 oas.SolrTestCaseJ4.initCore ####initCore end
[junit4:junit4]   2> 290 T3355 oas.SolrTestCaseJ4.setUp ###Starting testRebuild
[junit4:junit4]   2> ASYNC  NEW_CORE C242 name=collection1 org.apache.solr.core.SolrCore@2a9a2120
[junit4:junit4]   2> 297 T3355 C242 oasc.SolrDeletionPolicy.onInit SolrDeletionPolicy.onInit: commits:num=1
[junit4:junit4]   2> 		commit{dir=MockDirWrapper(org.apache.lucene.store.SimpleFSDirectory@C:\Jenkins\workspace\Lucene-Solr-4.x-Windows\solr\build\solr-core\test\J0\solrtest-SuggesterWFSTTest-1346009330285\index lockFactory=org.apache.lucene.store.NativeFSLockFactory@12e35fa3),segFN=segments_1,generation=1,filenames=[segments_1]
[junit4:junit4]   2> 297 T3355 C242 oasc.SolrDeletionPolicy.updateCommits newest commit = 1
[junit4:junit4]   2> 300 T3355 C242 UPDATE [collection1] webapp=null path=null params={} {add=[1]} 0 5
[junit4:junit4]   2> 307 T3355 C242 UPDATE [collection1] webapp=null path=null params={} {add=[2]} 0 1
[junit4:junit4]   2> 336 T3355 C242 UPDATE [collection1] webapp=null path=null params={} {add=[3]} 0 23
[junit4:junit4]   2> 343 T3355 C242 oasu.DirectUpdateHandler2.commit start commit{flags=0,_version_=0,optimize=false,openSearcher=true,waitSearcher=true,expungeDeletes=false,softCommit=false}
[junit4:junit4]   2> 346 T3355 C242 oasc.SolrDeletionPolicy.onCommit SolrDeletionPolicy.onCommit: commits:num=2
[junit4:junit4]   2> 		commit{dir=MockDirWrapper(org.apache.lucene.store.SimpleFSDirectory@C:\Jenkins\workspace\Lucene-Solr-4.x-Windows\solr\build\solr-core\test\J0\solrtest-SuggesterWFSTTest-1346009330285\index lockFactory=org.apache.lucene.store.NativeFSLockFactory@12e35fa3),segFN=segments_1,generation=1,filenames=[segments_1]
[junit4:junit4]   2> 		commit{dir=MockDirWrapper(org.apache.lucene.store.SimpleFSDirectory@C:\Jenkins\workspace\Lucene-Solr-4.x-Windows\solr\build\solr-core\test\J0\solrtest-SuggesterWFSTTest-1346009330285\index lockFactory=org.apache.lucene.store.NativeFSLockFactory@12e35fa3),segFN=segments_2,generation=2,filenames=[_0.tis, _0.nrm, _0.fnm, _0.tii, _0.frq, segments_2, _0.fdx, _0.si, _0.prx, _0.fdt]
[junit4:junit4]   2> 347 T3355 C242 oasc.SolrDeletionPolicy.updateCommits newest commit = 2
[junit4:junit4]   2> 348 T3355 C242 oasc.SolrCore.getSearcher WARNING [collection1] PERFORMANCE WARNING: Overlapping onDeckSearchers=2
[junit4:junit4]   2> 351 T3355 C242 oass.SolrIndexSearcher.<init> Opening Searcher@789560d4 main
[junit4:junit4]   2> 351 T3355 C242 oass.SolrIndexSearcher.getIndexDir WARNING WARNING: Directory impl does not support setting indexDir: org.apache.lucene.store.MockDirectoryWrapper
[junit4:junit4]   2> 351 T3355 C242 oasu.DirectUpdateHandler2.commit end_commit_flush
[junit4:junit4]   2> 352 T3356 oasc.SolrCore.registerSearcher [collection1] Registered new searcher Searcher@753f5ec0 main{StandardDirectoryReader(segments_1:1)}
[junit4:junit4]   2> 352 T3356 oashc.SpellCheckComponent$SpellCheckerListener.newSearcher Loading spell index for spellchecker: suggest
[junit4:junit4]   2> 352 T3356 oasss.Suggester.reload reload()
[junit4:junit4]   2> 354 T3356 oashc.SpellCheckComponent$SpellCheckerListener.newSearcher SEVERE Exception in reloading spell check index for spellchecker: suggest java.io.FileNotFoundException: C:\Jenkins\workspace\Lucene-Solr-4.x-Windows\solr\build\solr-core\test\J0\.\solrtest-SuggesterWFSTTest-1346009330285\suggest\jaspell.dat (The system cannot find the file specified)
[junit4:junit4]   2> 	at java.io.FileInputStream.open(Native Method)
[junit4:junit4]   2> 	at java.io.FileInputStream.<init>(FileInputStream.java:120)
[junit4:junit4]   2> 	at org.apache.solr.spelling.suggest.Suggester.reload(Suggester.java:161)
[junit4:junit4]   2> 	at org.apache.solr.handler.component.SpellCheckComponent$SpellCheckerListener.newSearcher(SpellCheckComponent.java:673)
[junit4:junit4]   2> 	at org.apache.solr.core.SolrCore$5.call(SolrCore.java:1452)
[junit4:junit4]   2> 	at java.util.concurrent.FutureTask$Sync.innerRun(FutureTask.java:303)
[junit4:junit4]   2> 	at java.util.concurrent.FutureTask.run(FutureTask.java:138)
[junit4:junit4]   2> 	at java.util.concurrent.ThreadPoolExecutor$Worker.runTask(ThreadPoolExecutor.java:886)
[junit4:junit4]   2> 	at java.util.concurrent.ThreadPoolExecutor$Worker.run(ThreadPoolExecutor.java:908)
[junit4:junit4]   2> 	at java.lang.Thread.run(Thread.java:662)
[junit4:junit4]   2> 
[junit4:junit4]   2> 355 T3356 oashc.SpellCheckComponent$SpellCheckerListener.newSearcher Loading spell index for spellchecker: suggest_tst
[junit4:junit4]   2> 355 T3356 oasss.Suggester.reload reload()
[junit4:junit4]   2> 355 T3356 oashc.SpellCheckComponent$SpellCheckerListener.newSearcher SEVERE Exception in reloading spell check index for spellchecker: suggest_tst java.io.FileNotFoundException: C:\Jenkins\workspace\Lucene-Solr-4.x-Windows\solr\build\solr-core\test\J0\.\solrtest-SuggesterWFSTTest-1346009330285\suggest_tst\tst.dat (The system cannot find the file specified)
[junit4:junit4]   2> 	at java.io.FileInputStream.open(Native Method)
[junit4:junit4]   2> 	at java.io.FileInputStream.<init>(FileInputStream.java:120)
[junit4:junit4]   2> 	at org.apache.solr.spelling.suggest.Suggester.reload(Suggester.java:161)
[junit4:junit4]   2> 	at org.apache.solr.handler.component.SpellCheckComponent$SpellCheckerListener.newSearcher(SpellCheckComponent.java:673)
[junit4:junit4]   2> 	at org.apache.solr.core.SolrCore$5.call(SolrCore.java:1452)
[junit4:junit4]   2> 	at java.util.concurrent.FutureTask$Sync.innerRun(FutureTask.java:303)
[junit4:junit4]   2> 	at java.util.concurrent.FutureTask.run(FutureTask.java:138)
[junit4:junit4]   2> 	at java.util.concurrent.ThreadPoolExecutor$Worker.runTask(ThreadPoolExecutor.java:886)
[junit4:junit4]   2> 	at java.util.concurrent.ThreadPoolExecutor$Worker.run(ThreadPoolExecutor.java:908)
[junit4:junit4]   2> 	at java.lang.Thread.run(Thread.java:662)
[junit4:junit4]   2> 
[junit4:junit4]   2> 355 T3356 oashc.SpellCheckComponent$SpellCheckerListener.newSearcher Loading spell index for spellchecker: suggest_fst
[junit4:junit4]   2> 355 T3356 oasss.Suggester.reload reload()
[junit4:junit4]   2> 356 T3356 oashc.SpellCheckComponent$SpellCheckerListener.newSearcher SEVERE Exception in reloading spell check index for spellchecker: suggest_fst java.io.FileNotFoundException: C:\Jenkins\workspace\Lucene-Solr-4.x-Windows\solr\build\solr-core\test\J0\.\solrtest-SuggesterWFSTTest-1346009330285\suggest_fst\fst.bin (The system cannot find the file specified)
[junit4:junit4]   2> 	at java.io.FileInputStream.open(Native Method)
[junit4:junit4]   2> 	at java.io.FileInputStream.<init>(FileInputStream.java:120)
[junit4:junit4]   2> 	at org.apache.solr.spelling.suggest.Suggester.reload(Suggester.java:161)
[junit4:junit4]   2> 	at org.apache.solr.handler.component.SpellCheckComponent$SpellCheckerListener.newSearcher(SpellCheckComponent.java:673)
[junit4:junit4]   2> 	at org.apache.solr.core.SolrCore$5.call(SolrCore.java:1452)
[junit4:junit4]   2> 	at java.util.concurrent.FutureTask$Sync.innerRun(FutureTask.java:303)
[junit4:junit4]   2> 	at java.util.concurrent.FutureTask.run(FutureTask.java:138)
[junit4:junit4]   2> 	at java.util.concurrent.ThreadPoolExecutor$Worker.runTask(ThreadPoolExecutor.java:886)
[junit4:junit4]   2> 	at java.util.concurrent.ThreadPoolExecutor$Worker.run(ThreadPoolExecutor.java:908)
[junit4:junit4]   2> 	at java.lang.Thread.run(Thread.java:662)
[junit4:junit4]   2> 
[junit4:junit4]   2> 356 T3356 oashc.SpellCheckComponent$SpellCheckerListener.newSearcher Loading spell index for spellchecker: suggest_wfst
[junit4:junit4]   2> 356 T3356 oasss.Suggester.reload reload()
[junit4:junit4]   2> 356 T3356 oashc.SpellCheckComponent$SpellCheckerListener.newSearcher SEVERE Exception in reloading spell check index for spellchecker: suggest_wfst java.io.FileNotFoundException: C:\Jenkins\workspace\Lucene-Solr-4.x-Windows\solr\build\solr-core\test\J0\.\solrtest-SuggesterWFSTTest-1346009330285\suggest_wfst\wfst.bin (The system cannot find the file specified)
[junit4:junit4]   2> 	at java.io.FileInputStream.open(Native Method)
[junit4:junit4]   2> 	at java.io.FileInputStream.<init>(FileInputStream.java:120)
[junit4:junit4]   2> 	at org.apache.solr.spelling.suggest.Suggester.reload(Suggester.java:161)
[junit4:junit4]   2> 	at org.apache.solr.handler.component.SpellCheckComponent$SpellCheckerListener.newSearcher(SpellCheckComponent.java:673)
[junit4:junit4]   2> 	at org.apache.solr.core.SolrCore$5.call(SolrCore.java:1452)
[junit4:junit4]   2> 	at java.util.concurrent.FutureTask$Sync.innerRun(FutureTask.java:303)
[junit4:junit4]   2> 	at java.util.concurrent.FutureTask.run(FutureTask.java:138)
[junit4:junit4]   2> 	at java.util.concurrent.ThreadPoolExecutor$Worker.runTask(ThreadPoolExecutor.java:886)
[junit4:junit4]   2> 	at java.util.concurrent.ThreadPoolExecutor$Worker.run(ThreadPoolExecutor.java:908)
[junit4:junit4]   2> 	at java.lang.Thread.run(Thread.java:662)
[junit4:junit4]   2> 
[junit4:junit4]   2> 357 T3356 oasc.SolrCore.registerSearcher [collection1] Registered new searcher Searcher@789560d4 main{StandardDirectoryReader(segments_2:3 _0(4.0.0.2):C3)}
[junit4:junit4]   2> 357 T3355 C242 UPDATE [collection1] webapp=null path=null params={} {commit=} 0 14
[junit4:junit4]   2> 361 T3355 C242 oasc.SolrException.log SEVERE java.lang.NullPointerException
[junit4:junit4]   2> 		at org.apache.lucene.search.suggest.fst.WFSTCompletionLookup.lookupPrefix(WFSTCompletionLookup.java:193)
[junit4:junit4]   2> 		at org.apache.lucene.search.suggest.fst.WFSTCompletionLookup.lookup(WFSTCompletionLookup.java:155)
[junit4:junit4]   2> 		at org.apache.solr.spelling.suggest.Suggester.getSuggestions(Suggester.java:190)
[junit4:junit4]   2> 		at org.apache.solr.handler.component.SpellCheckComponent.process(SpellCheckComponent.java:172)
[junit4:junit4]   2> 		at org.apache.solr.handler.component.SearchHandler.handleRequestBody(SearchHandler.java:206)
[junit4:junit4]   2> 		at org.apache.solr.handler.RequestHandlerBase.handleRequest(RequestHandlerBase.java:129)
[junit4:junit4]   2> 		at org.apache.solr.core.SolrCore.execute(SolrCore.java:1672)
[junit4:junit4]   2> 		at org.apache.solr.util.TestHarness.query(TestHarness.java:351)
[junit4:junit4]   2> 		at org.apache.solr.util.TestHarness.query(TestHarness.java:333)
[junit4:junit4]   2> 		at org.apache.solr.SolrTestCaseJ4.assertQ(SolrTestCaseJ4.java:467)
[junit4:junit4]   2> 		at org.apache.solr.SolrTestCaseJ4.assertQ(SolrTestCaseJ4.java:460)
[junit4:junit4]   2> 		at org.apache.solr.spelling.suggest.SuggesterTest.testRebuild(SuggesterTest.java:105)
[junit4:junit4]   2> 		at sun.reflect.NativeMethodAccessorImpl.invoke0(Native Method)
[junit4:junit4]   2> 		at sun.reflect.NativeMethodAccessorImpl.invoke(NativeMethodAccessorImpl.java:39)
[junit4:junit4]   2> 		at sun.reflect.DelegatingMethodAccessorImpl.invoke(DelegatingMethodAccessorImpl.java:25)
[junit4:junit4]   2> 		at java.lang.reflect.Method.invoke(Method.java:597)
[junit4:junit4]   2> 		at com.carrotsearch.randomizedtesting.RandomizedRunner.invoke(RandomizedRunner.java:1559)
[junit4:junit4]   2> 		at com.carrotsearch.randomizedtesting.RandomizedRunner.access$600(RandomizedRunner.java:79)
[junit4:junit4]   2> 		at com.carrotsearch.randomizedtesting.RandomizedRunner$6.evaluate(RandomizedRunner.java:737)
[junit4:junit4]   2> 		at com.carrotsearch.randomizedtesting.RandomizedRunner$7.evaluate(RandomizedRunner.java:773)
[junit4:junit4]   2> 		at com.carrotsearch.randomizedtesting.RandomizedRunner$8.evaluate(RandomizedRunner.java:787)
[junit4:junit4]   2> 		at com.carrotsearch.randomizedtesting.rules.SystemPropertiesRestoreRule$1.evaluate(SystemPropertiesRestoreRule.java:53)
[junit4:junit4]   2> 		at org.apache.lucene.util.TestRuleSetupTeardownChained$1.evaluate(TestRuleSetupTeardownChained.java:50)
[junit4:junit4]   2> 		at org.apache.lucene.util.TestRuleFieldCacheSanity$1.evaluate(TestRuleFieldCacheSanity.java:51)
[junit4:junit4]   2> 		at org.apache.lucene.util.AbstractBeforeAfterRule$1.evaluate(AbstractBeforeAfterRule.java:45)
[junit4:junit4]   2> 		at com.carrotsearch.randomizedtesting.rules.SystemPropertiesInvariantRule$1.evaluate(SystemPropertiesInvariantRule.java:55)
[junit4:junit4]   2> 		at org.apache.lucene.util.TestRuleThreadAndTestName$1.evaluate(TestRuleThreadAndTestName.java:48)
[junit4:junit4]   2> 		at org.apache.lucene.util.TestRuleIgnoreAfterMaxFailures$1.evaluate(TestRuleIgnoreAfterMaxFailures.java:70)
[junit4:junit4]   2> 		at org.apache.lucene.util.TestRuleMarkFailure$1.evaluate(TestRuleMarkFailure.java:48)
[junit4:junit4]   2> 		at com.carrotsearch.randomizedtesting.rules.StatementAdapter.evaluate(StatementAdapter.java:36)
[junit4:junit4]   2> 		at com.carrotsearch.randomizedtesting.ThreadLeakControl$StatementRunner.run(ThreadLeakControl.java:345)
[junit4:junit4]   2> 		at com.carrotsearch.randomizedtesting.ThreadLeakControl.forkTimeoutingTask(ThreadLeakControl.java:769)
[junit4:junit4]   2> 		at com.carrotsearch.randomizedtesting.ThreadLeakControl$3.evaluate(ThreadLeakControl.java:429)
[junit4:junit4]   2> 		at com.carrotsearch.randomizedtesting.RandomizedRunner.runSingleTest(RandomizedRunner.java:746)
[junit4:junit4]   2> 		at com.carrotsearch.randomizedtesting.RandomizedRunner$3.evaluate(RandomizedRunner.java:648)
[junit4:junit4]   2> 		at com.carrotsearch.randomizedtesting.RandomizedRunner$4.evaluate(RandomizedRunner.java:682)
[junit4:junit4]   2> 		at com.carrotsearch.randomizedtesting.RandomizedRunner$5.evaluate(RandomizedRunner.java:693)
[junit4:junit4]   2> 		at com.carrotsearch.randomizedtesting.rules.StatementAdapter.evaluate(StatementAdapter.java:36)
[junit4:junit4]   2> 		at com.carrotsearch.randomizedtesting.rules.SystemPropertiesRestoreRule$1.evaluate(SystemPropertiesRestoreRule.java:53)
[junit4:junit4]   2> 		at org.apache.lucene.util.AbstractBeforeAfterRule$1.evaluate(AbstractBeforeAfterRule.java:45)
[junit4:junit4]   2> 		at org.apache.lucene.util.TestRuleStoreClassName$1.evaluate(TestRuleStoreClassName.java:42)
[junit4:junit4]   2> 		at com.carrotsearch.randomizedtesting.rules.SystemPropertiesInvariantRule$1.evaluate(SystemPropertiesInvariantRule.java:55)
[junit4:junit4]   2> 		at com.carrotsearch.randomizedtesting.rules.NoShadowingOrOverridesOnMethodsRule$1.evaluate(NoShadowingOrOverridesOnMethodsRule.java:39)
[junit4:junit4]   2> 		at com.carrotsearch.randomizedtesting.rules.NoShadowingOrOverridesOnMethodsRule$1.evaluate(NoShadowingOrOverridesOnMethodsRule.java:39)
[junit4:junit4]   2> 		at org.apache.lucene.util.TestRuleAssertionsRequired$1.evaluate(TestRuleAssertionsRequired.java:40)
[junit4:junit4]   2> 		at org.apache.lucene.util.TestRuleMarkFailure$1.evaluate(TestRuleMarkFailure.java:48)
[junit4:junit4]   2> 		at org.apache.lucene.util.TestRuleIgnoreAfterMaxFailures$1.evaluate(TestRuleIgnoreAfterMaxFailures.java:70)
[junit4:junit4]   2> 		at org.apache.lucene.util.TestRuleIgnoreTestSuites$1.evaluate(TestRuleIgnoreTestSuites.java:55)
[junit4:junit4]   2> 		at com.carrotsearch.randomizedtesting.rules.StatementAdapter.evaluate(StatementAdapter.java:36)
[junit4:junit4]   2> 		at com.carrotsearch.randomizedtesting.ThreadLeakControl$StatementRunner.run(ThreadLeakControl.java:345)
[junit4:junit4]   2> 		at java.lang.Thread.run(Thread.java:662)
[junit4:junit4]   2> 	
[junit4:junit4]   2> 372 T3355 C242 REQ [collection1] webapp=null path=null params={q=ac&spellcheck.count=2&qt=/suggest_wfst&spellcheck.onlyMorePopular=true} status=500 QTime=12 
[junit4:junit4]   2> 372 T3355 oasc.SolrException.log SEVERE REQUEST FAILED: q=ac&spellcheck.count=2&qt=/suggest_wfst&spellcheck.onlyMorePopular=true:java.lang.NullPointerException
[junit4:junit4]   2> 		at org.apache.lucene.search.suggest.fst.WFSTCompletionLookup.lookupPrefix(WFSTCompletionLookup.java:193)
[junit4:junit4]   2> 		at org.apache.lucene.search.suggest.fst.WFSTCompletionLookup.lookup(WFSTCompletionLookup.java:155)
[junit4:junit4]   2> 		at org.apache.solr.spelling.suggest.Suggester.getSuggestions(Suggester.java:190)
[junit4:junit4]   2> 		at org.apache.solr.handler.component.SpellCheckComponent.process(SpellCheckComponent.java:172)
[junit4:junit4]   2> 		at org.apache.solr.handler.component.SearchHandler.handleRequestBody(SearchHandler.java:206)
[junit4:junit4]   2> 		at org.apache.solr.handler.RequestHandlerBase.handleRequest(RequestHandlerBase.java:129)
[junit4:junit4]   2> 		at org.apache.solr.core.SolrCore.execute(SolrCore.java:1672)
[junit4:junit4]   2> 		at org.apache.solr.util.TestHarness.query(TestHarness.java:351)
[junit4:junit4]   2> 		at org.apache.solr.util.TestHarness.query(TestHarness.java:333)
[junit4:junit4]   2> 		at org.apache.solr.SolrTestCaseJ4.assertQ(SolrTestCaseJ4.java:467)
[junit4:junit4]   2> 		at org.apache.solr.SolrTestCaseJ4.assertQ(SolrTestCaseJ4.java:460)
[junit4:junit4]   2> 		at org.apache.solr.spelling.suggest.SuggesterTest.testRebuild(SuggesterTest.java:105)
[junit4:junit4]   2> 		at sun.reflect.NativeMethodAccessorImpl.invoke0(Native Method)
[junit4:junit4]   2> 		at sun.reflect.NativeMethodAccessorImpl.invoke(NativeMethodAccessorImpl.java:39)
[junit4:junit4]   2> 		at sun.reflect.DelegatingMethodAccessorImpl.invoke(DelegatingMethodAccessorImpl.java:25)
[junit4:junit4]   2> 		at java.lang.reflect.Method.invoke(Method.java:597)
[junit4:junit4]   2> 		at com.carrotsearch.randomizedtesting.RandomizedRunner.invoke(RandomizedRunner.java:1559)
[junit4:junit4]   2> 		at com.carrotsearch.randomizedtesting.RandomizedRunner.access$600(RandomizedRunner.java:79)
[junit4:junit4]   2> 		at com.carrotsearch.randomizedtesting.RandomizedRunner$6.evaluate(RandomizedRunner.java:737)
[junit4:junit4]   2> 		at com.carrotsearch.randomizedtesting.RandomizedRunner$7.evaluate(RandomizedRunner.java:773)
[junit4:junit4]   2> 		at com.carrotsearch.randomizedtesting.RandomizedRunner$8.evaluate(RandomizedRunner.java:787)
[junit4:junit4]   2> 		at com.carrotsearch.randomizedtesting.rules.SystemPropertiesRestoreRule$1.evaluate(SystemPropertiesRestoreRule.java:53)
[junit4:junit4]   2> 		at org.apache.lucene.util.TestRuleSetupTeardownChained$1.evaluate(TestRuleSetupTeardownChained.java:50)
[junit4:junit4]   2> 		at org.apache.lucene.util.TestRuleFieldCacheSanity$1.evaluate(TestRuleFieldCacheSanity.java:51)
[junit4:junit4]   2> 		at org.apache.lucene.util.AbstractBeforeAfterRule$1.evaluate(AbstractBeforeAfterRule.java:45)
[junit4:junit4]   2> 		at com.carrotsearch.randomizedtesting.rules.SystemPropertiesInvariantRule$1.evaluate(SystemPropertiesInvariantRule.java:55)
[junit4:junit4]   2> 		at org.apache.lucene.util.TestRuleThreadAndTestName$1.evaluate(TestRuleThreadAndTestName.java:48)
[junit4:junit4]   2> 		at org.apache.lucene.util.TestRuleIgnoreAfterMaxFailures$1.evaluate(TestRuleIgnoreAfterMaxFailures.java:70)
[junit4:junit4]   2> 		at org.apache.lucene.util.TestRuleMarkFailure$1.evaluate(TestRuleMarkFailure.java:48)
[junit4:junit4]   2> 		at com.carrotsearch.randomizedtesting.rules.StatementAdapter.evaluate(StatementAdapter.java:36)
[junit4:junit4]   2> 		at com.carrotsearch.randomizedtesting.ThreadLeakControl$StatementRunner.run(ThreadLeakControl.java:345)
[junit4:junit4]   2> 		at com.carrotsearch.randomizedtesting.ThreadLeakControl.forkTimeoutingTask(ThreadLeakControl.java:769)
[junit4:junit4]   2> 		at com.carrotsearch.randomizedtesting.ThreadLeakControl$3.evaluate(ThreadLeakControl.java:429)
[junit4:junit4]   2> 		at com.carrotsearch.randomizedtesting.RandomizedRunner.runSingleTest(RandomizedRunner.java:746)
[junit4:junit4]   2> 		at com.carrotsearch.randomizedtesting.RandomizedRunner$3.evaluate(RandomizedRunner.java:648)
[junit4:junit4]   2> 		at com.carrotsearch.randomizedtesting.RandomizedRunner$4.evaluate(RandomizedRunner.java:682)
[junit4:junit4]   2> 		at com.carrotsearch.randomizedtesting.RandomizedRunner$5.evaluate(RandomizedRunner.java:693)
[junit4:junit4]   2> 		at com.carrotsearch.randomizedtesting.rules.StatementAdapter.evaluate(StatementAdapter.java:36)
[junit4:junit4]   2> 		at com.carrotsearch.randomizedtesting.rules.SystemPropertiesRestoreRule$1.evaluate(SystemPropertiesRestoreRule.java:53)
[junit4:junit4]   2> 		at org.apache.lucene.util.AbstractBeforeAfterRule$1.evaluate(AbstractBeforeAfterRule.java:45)
[junit4:junit4]   2> 		at org.apache.lucene.util.TestRuleStoreClassName$1.evaluate(TestRuleStoreClassName.java:42)
[junit4:junit4]   2> 		at com.carrotsearch.randomizedtesting.rules.SystemPropertiesInvariantRule$1.evaluate(SystemPropertiesInvariantRule.java:55)
[junit4:junit4]   2> 		at com.carrotsearch.randomizedtesting.rules.NoShadowingOrOverridesOnMethodsRule$1.evaluate(NoShadowingOrOverridesOnMethodsRule.java:39)
[junit4:junit4]   2> 		at com.carrotsearch.randomizedtesting.rules.NoShadowingOrOverridesOnMethodsRule$1.evaluate(NoShadowingOrOverridesOnMethodsRule.java:39)
[junit4:junit4]   2> 		at org.apache.lucene.util.TestRuleAssertionsRequired$1.evaluate(TestRuleAssertionsRequired.java:40)
[junit4:junit4]   2> 		at org.apache.lucene.util.TestRuleMarkFailure$1.evaluate(TestRuleMarkFailure.java:48)
[junit4:junit4]   2> 		at org.apache.lucene.util.TestRuleIgnoreAfterMaxFailures$1.evaluate(TestRuleIgnoreAfterMaxFailures.java:70)
[junit4:junit4]   2> 		at org.apache.lucene.util.TestRuleIgnoreTestSuites$1.evaluate(TestRuleIgnoreTestSuites.java:55)
[junit4:junit4]   2> 		at com.carrotsearch.randomizedtesting.rules.StatementAdapter.evaluate(StatementAdapter.java:36)
[junit4:junit4]   2> 		at com.carrotsearch.randomizedtesting.ThreadLeakControl$StatementRunner.run(ThreadLeakControl.java:345)
[junit4:junit4]   2> 		at java.lang.Thread.run(Thread.java:662)
[junit4:junit4]   2> 	
[junit4:junit4]   2> 373 T3355 oas.SolrTestCaseJ4.tearDown ###Ending testRebuild
[junit4:junit4]   2> NOTE: reproduce with: ant test  -Dtestcase=SuggesterWFSTTest -Dtests.method=testRebuild -Dtests.seed=40D50D8ABA8053B2 -Dtests.slow=true -Dtests.locale=sr -Dtests.timezone=Indian/Mayotte -Dtests.file.encoding=US-ASCII
[junit4:junit4] ERROR   0.13s | SuggesterWFSTTest.testRebuild <<<
[junit4:junit4]    > Throwable #1: java.lang.RuntimeException: Exception during query
[junit4:junit4]    > 	at __randomizedtesting.SeedInfo.seed([40D50D8ABA8053B2:1BF0AFC98E802928]:0)
[junit4:junit4]    > 	at org.apache.solr.SolrTestCaseJ4.assertQ(SolrTestCaseJ4.java:493)
[junit4:junit4]    > 	at org.apache.solr.SolrTestCaseJ4.assertQ(SolrTestCaseJ4.java:460)
[junit4:junit4]    > 	at org.apache.solr.spelling.suggest.SuggesterTest.testRebuild(SuggesterTest.java:105)
[junit4:junit4]    > 	at sun.reflect.NativeMethodAccessorImpl.invoke0(Native Method)
[junit4:junit4]    > 	at sun.reflect.NativeMethodAccessorImpl.invoke(NativeMethodAccessorImpl.java:39)
[junit4:junit4]    > 	at sun.reflect.DelegatingMethodAccessorImpl.invoke(DelegatingMethodAccessorImpl.java:25)
[junit4:junit4]    > 	at java.lang.reflect.Method.invoke(Method.java:597)
[junit4:junit4]    > 	at com.carrotsearch.randomizedtesting.RandomizedRunner.invoke(RandomizedRunner.java:1559)
[junit4:junit4]    > 	at com.carrotsearch.randomizedtesting.RandomizedRunner.access$600(RandomizedRunner.java:79)
[junit4:junit4]    > 	at com.carrotsearch.randomizedtesting.RandomizedRunner$6.evaluate(RandomizedRunner.java:737)
[junit4:junit4]    > 	at com.carrotsearch.randomizedtesting.RandomizedRunner$7.evaluate(RandomizedRunner.java:773)
[junit4:junit4]    > 	at com.carrotsearch.randomizedtesting.RandomizedRunner$8.evaluate(RandomizedRunner.java:787)
[junit4:junit4]    > 	at com.carrotsearch.randomizedtesting.rules.SystemPropertiesRestoreRule$1.evaluate(SystemPropertiesRestoreRule.java:53)
[junit4:junit4]    > 	at org.apache.lucene.util.TestRuleSetupTeardownChained$1.evaluate(TestRuleSetupTeardownChained.java:50)
[junit4:junit4]    > 	at org.apache.lucene.util.TestRuleFieldCacheSanity$1.evaluate(TestRuleFieldCacheSanity.java:51)
[junit4:junit4]    > 	at org.apache.lucene.util.AbstractBeforeAfterRule$1.evaluate(AbstractBeforeAfterRule.java:45)
[junit4:junit4]    > 	at com.carrotsearch.randomizedtesting.rules.SystemPropertiesInvariantRule$1.evaluate(SystemPropertiesInvariantRule.java:55)
[junit4:junit4]    > 	at org.apache.lucene.util.TestRuleThreadAndTestName$1.evaluate(TestRuleThreadAndTestName.java:48)
[junit4:junit4]    > 	at org.apache.lucene.util.TestRuleIgnoreAfterMaxFailures$1.evaluate(TestRuleIgnoreAfterMaxFailures.java:70)
[junit4:junit4]    > 	at org.apache.lucene.util.TestRuleMarkFailure$1.evaluate(TestRuleMarkFailure.java:48)
[junit4:junit4]    > 	at com.carrotsearch.randomizedtesting.rules.StatementAdapter.evaluate(StatementAdapter.java:36)
[junit4:junit4]    > 	at com.carrotsearch.randomizedtesting.ThreadLeakControl$StatementRunner.run(ThreadLeakControl.java:345)
[junit4:junit4]    > 	at com.carrotsearch.randomizedtesting.ThreadLeakControl.forkTimeoutingTask(ThreadLeakControl.java:769)
[junit4:junit4]    > 	at com.carrotsearch.randomizedtesting.ThreadLeakControl$3.evaluate(ThreadLeakControl.java:429)
[junit4:junit4]    > 	at com.carrotsearch.randomizedtesting.RandomizedRunner.runSingleTest(RandomizedRunner.java:746)
[junit4:junit4]    > 	at com.carrotsearch.randomizedtesting.RandomizedRunner$3.evaluate(RandomizedRunner.java:648)
[junit4:junit4]    > 	at com.carrotsearch.randomizedtesting.RandomizedRunner$4.evaluate(RandomizedRunner.java:682)
[junit4:junit4]    > 	at com.carrotsearch.randomizedtesting.RandomizedRunner$5.evaluate(RandomizedRunner.java:693)
[junit4:junit4]    > 	at com.carrotsearch.randomizedtesting.rules.StatementAdapter.evaluate(StatementAdapter.java:36)
[junit4:junit4]    > 	at com.carrotsearch.randomizedtesting.rules.SystemPropertiesRestoreRule$1.evaluate(SystemPropertiesRestoreRule.java:53)
[junit4:junit4]    > 	at org.apache.lucene.util.AbstractBeforeAfterRule$1.evaluate(AbstractBeforeAfterRule.java:45)
[junit4:junit4]    > 	at org.apache.lucene.util.TestRuleStoreClassName$1.evaluate(TestRuleStoreClassName.java:42)
[junit4:junit4]    > 	at com.carrotsearch.randomizedtesting.rules.SystemPropertiesInvariantRule$1.evaluate(SystemPropertiesInvariantRule.java:55)
[junit4:junit4]    > 	at com.carrotsearch.randomizedtesting.rules.NoShadowingOrOverridesOnMethodsRule$1.evaluate(NoShadowingOrOverridesOnMethodsRule.java:39)
[junit4:junit4]    > 	at com.carrotsearch.randomizedtesting.rules.NoShadowingOrOverridesOnMethodsRule$1.evaluate(NoShadowingOrOverridesOnMethodsRule.java:39)
[junit4:junit4]    > 	at org.apache.lucene.util.TestRuleAssertionsRequired$1.evaluate(TestRuleAssertionsRequired.java:40)
[junit4:junit4]    > 	at org.apache.lucene.util.TestRuleMarkFailure$1.evaluate(TestRuleMarkFailure.java:48)
[junit4:junit4]    > 	at org.apache.lucene.util.TestRuleIgnoreAfterMaxFailures$1.evaluate(TestRuleIgnoreAfterMaxFailures.java:70)
[junit4:junit4]    > 	at org.apache.lucene.util.TestRuleIgnoreTestSuites$1.evaluate(TestRuleIgnoreTestSuites.java:55)
[junit4:junit4]    > 	at com.carrotsearch.randomizedtesting.rules.StatementAdapter.evaluate(StatementAdapter.java:36)
[junit4:junit4]    > 	at com.carrotsearch.randomizedtesting.ThreadLeakControl$StatementRunner.run(ThreadLeakControl.java:345)
[junit4:junit4]    > 	at java.lang.Thread.run(Thread.java:662)
[junit4:junit4]    > Caused by: java.lang.NullPointerException
[junit4:junit4]    > 	at org.apache.lucene.search.suggest.fst.WFSTCompletionLookup.lookupPrefix(WFSTCompletionLookup.java:193)
[junit4:junit4]    > 	at org.apache.lucene.search.suggest.fst.WFSTCompletionLookup.lookup(WFSTCompletionLookup.java:155)
[junit4:junit4]    > 	at org.apache.solr.spelling.suggest.Suggester.getSuggestions(Suggester.java:190)
[junit4:junit4]    > 	at org.apache.solr.handler.component.SpellCheckComponent.process(SpellCheckComponent.java:172)
[junit4:junit4]    > 	at org.apache.solr.handler.component.SearchHandler.handleRequestBody(SearchHandler.java:206)
[junit4:junit4]    > 	at org.apache.solr.handler.RequestHandlerBase.handleRequest(RequestHandlerBase.java:129)
[junit4:junit4]    > 	at org.apache.solr.core.SolrCore.execute(SolrCore.java:1672)
[junit4:junit4]    > 	at org.apache.solr.util.TestHarness.query(TestHarness.java:351)
[junit4:junit4]    > 	at org.apache.solr.util.TestHarness.query(TestHarness.java:333)
[junit4:junit4]    > 	at org.apache.solr.SolrTestCaseJ4.assertQ(SolrTestCaseJ4.java:467)
[junit4:junit4]    > 	... 41 more
[junit4:junit4]   2> 414 T3355 oas.SolrTestCaseJ4.setUp ###Starting testReload
[junit4:junit4]   2> 420 T3355 C242 UPDATE [collection1] webapp=null path=null params={} {add=[1]} 0 1
[junit4:junit4]   2> 430 T3355 C242 UPDATE [collection1] webapp=null path=null params={} {add=[2]} 0 1
[junit4:junit4]   2> 439 T3355 C242 UPDATE [collection1] webapp=null path=null params={} {add=[3]} 0 0
[junit4:junit4]   2> 457 T3355 C242 oasu.DirectUpdateHandler2.commit start commit{flags=0,_version_=0,optimize=false,openSearcher=true,waitSearcher=true,expungeDeletes=false,softCommit=false}
[junit4:junit4]   2> 465 T3355 C242 oasc.SolrDeletionPolicy.onCommit SolrDeletionPolicy.onCommit: commits:num=2
[junit4:junit4]   2> 		commit{dir=MockDirWrapper(org.apache.lucene.store.SimpleFSDirectory@C:\Jenkins\workspace\Lucene-Solr-4.x-Windows\solr\build\solr-core\test\J0\solrtest-SuggesterWFSTTest-1346009330285\index lockFactory=org.apache.lucene.store.NativeFSLockFactory@12e35fa3),segFN=segments_2,generation=2,filenames=[_0.tis, _0.nrm, _0.fnm, _0.tii, _0.frq, segments_2, _0.fdx, _0.si, _0.prx, _0.fdt]
[junit4:junit4]   2> 		commit{dir=MockDirWrapper(org.apache.lucene.store.SimpleFSDirectory@C:\Jenkins\workspace\Lucene-Solr-4.x-Windows\solr\build\solr-core\test\J0\solrtest-SuggesterWFSTTest-1346009330285\index lockFactory=org.apache.lucene.store.NativeFSLockFactory@12e35fa3),segFN=segments_3,generation=3,filenames=[_1.fdx, _1.prx, _1.tis, _1.frq, _1.fdt, _1.si, _1.tii, _1.fnm, _1.nrm, segments_3]
[junit4:junit4]   2> 465 T3355 C242 oasc.SolrDeletionPolicy.updateCommits newest commit = 3
[junit4:junit4]   2> 471 T3355 C242 oass.SolrIndexSearcher.<init> Opening Searcher@17e1db6 main
[junit4:junit4]   2> 472 T3355 C242 oass.SolrIndexSearcher.getIndexDir WARNING WARNING: Directory impl does not support setting indexDir: org.apache.lucene.store.MockDirectoryWrapper
[junit4:junit4]   2> 472 T3355 C242 oasu.DirectUpdateHandler2.commit end_commit_flush
[junit4:junit4]   2> 473 T3356 oashc.SpellCheckComponent$SpellCheckerListener.buildSpellIndex Building spell index for spell checker: suggest
[junit4:junit4]   2> 473 T3356 oasss.Suggester.build build()
[junit4:junit4]   2> 480 T3356 oasss.Suggester.build Stored suggest data to: C:\Jenkins\workspace\Lucene-Solr-4.x-Windows\solr\build\solr-core\test\J0\.\solrtest-SuggesterWFSTTest-1346009330285\suggest\jaspell.dat
[junit4:junit4]   2> 481 T3356 oashc.SpellCheckComponent$SpellCheckerListener.buildSpellIndex Building spell index for spell checker: suggest_tst
[junit4:junit4]   2> 481 T3356 oasss.Suggester.build build()
[junit4:junit4]   2> 499 T3356 oasss.Suggester.build Stored suggest data to: C:\Jenkins\workspace\Lucene-Solr-4.x-Windows\solr\build\solr-core\test\J0\.\solrtest-SuggesterWFSTTest-1346009330285\suggest_tst\tst.dat
[junit4:junit4]   2> 499 T3356 oashc.SpellCheckComponent$SpellCheckerListener.buildSpellIndex Building spell index for spell checker: suggest_fst
[junit4:junit4]   2> 499 T3356 oasss.Suggester.build build()
[junit4:junit4]   2> 509 T3356 oasss.Suggester.build Stored suggest data to: C:\Jenkins\workspace\Lucene-Solr-4.x-Windows\solr\build\solr-core\test\J0\.\solrtest-SuggesterWFSTTest-1346009330285\suggest_fst\fst.bin
[junit4:junit4]   2> 509 T3356 oashc.SpellCheckComponent$SpellCheckerListener.buildSpellIndex Building spell index for spell checker: suggest_wfst
[junit4:junit4]   2> 509 T3356 oasss.Suggester.build build()
[junit4:junit4]   2> 515 T3356 oasss.Suggester.build Stored suggest data to: C:\Jenkins\workspace\Lucene-Solr-4.x-Windows\solr\build\solr-core\test\J0\.\solrtest-SuggesterWFSTTest-1346009330285\suggest_wfst\wfst.bin
[junit4:junit4]   2> 515 T3356 oasc.SolrCore.registerSearcher [collection1] Registered new searcher Searcher@17e1db6 main{StandardDirectoryReader(segments_3:7 _1(4.0.0.2):C3)}
[junit4:junit4]   2> 516 T3355 C242 UPDATE [collection1] webapp=null path=null params={} {commit=} 0 59
[junit4:junit4]   2> 518 T3355 oas.SolrTestCaseJ4.deleteCore ###deleteCore
[junit4:junit4]   2> 519 T3355 oasc.CoreContainer.shutdown Shutting down CoreContainer instance=1397648803
[junit4:junit4]   2> 519 T3355 oasc.SolrCore.close [collection1]  CLOSING SolrCore org.apache.solr.core.SolrCore@2a9a2120
[junit4:junit4]   2> 519 T3355 oasc.SolrCore.closeSearcher [collection1] Closing main searcher on request.
[junit4:junit4]   2> 519 T3355 oasu.DirectUpdateHandler2.close closing DirectUpdateHandler2{commits=2,autocommits=0,soft autocommits=0,optimizes=0,rollbacks=0,expungeDeletes=0,docsPending=0,adds=0,deletesById=0,deletesByQuery=0,errors=0,cumulative_adds=6,cumulative_deletesById=0,cumulative_deletesByQuery=0,cumulative_errors=0}
[junit4:junit4]   2> 519 T3355 oasu.DefaultSolrCoreState.decref SolrCoreState ref count has reached 0 - closing IndexWriter
[junit4:junit4]   2> NOTE: per solr.test.leavedatadir, dataDir will not be removed: C:\Jenkins\workspace\Lucene-Solr-4.x-Windows\solr\build\solr-core\test\J0\.\solrtest-SuggesterWFSTTest-1346009330285
[junit4:junit4]   2> 527 T3355 oas.SolrTestCaseJ4.initCore ####initCore
[junit4:junit4]   2> 527 T3355 oasc.SolrResourceLoader.<init> new SolrResourceLoader for directory: 'C:\Jenkins\workspace\Lucene-Solr-4.x-Windows\solr\build\solr-core\test-files\solr\collection1\'
[junit4:junit4]   2> 528 T3355 oasc.SolrResourceLoader.replaceClassLoader Adding 'file:/C:/Jenkins/workspace/Lucene-Solr-4.x-Windows/solr/build/solr-core/test-files/solr/collection1/lib/classes/' to classloader
[junit4:junit4]   2> 528 T3355 oasc.SolrResourceLoader.replaceClassLoader Adding 'file:/C:/Jenkins/workspace/Lucene-Solr-4.x-Windows/solr/build/solr-core/test-files/solr/collection1/lib/README' to classloader
[junit4:junit4]   2> 570 T3355 oasc.SolrConfig.<init> Using Lucene MatchVersion: LUCENE_40
[junit4:junit4]   2> 639 T3355 oasc.SolrConfig.<init> Loaded SolrConfig: solrconfig-spellchecker.xml
[junit4:junit4]   2> 639 T3355 oass.IndexSchema.readSchema Reading Solr Schema
[junit4:junit4]   2> 644 T3355 oass.IndexSchema.readSchema Schema name=test
[junit4:junit4]   2> 1391 T3355 oass.OpenExchangeRatesOrgProvider.init Initialized with rates=open-exchange-rates.json, refreshInterval=1440.
[junit4:junit4]   2> 1404 T3355 oass.IndexSchema.readSchema default search field in schema is text
[junit4:junit4]   2> 1410 T3355 oass.IndexSchema.readSchema unique key field: id
[junit4:junit4]   2> 1419 T3355 oass.FileExchangeRateProvider.reload Reloading exchange rates from file currency.xml
[junit4:junit4]   2> 1424 T3355 oass.FileExchangeRateProvider.reload Reloading exchange rates from file currency.xml
[junit4:junit4]   2> 1428 T3355 oass.OpenExchangeRatesOrgProvider.reload Reloading exchange rates from open-exchange-rates.json
[junit4:junit4]   2> 1429 T3355 oass.OpenExchangeRatesOrgProvider.reload Reloading exchange rates from open-exchange-rates.json
[junit4:junit4]   2> 1429 T3355 oasc.SolrResourceLoader.locateSolrHome JNDI not configured for solr (NoInitialContextEx)
[junit4:junit4]   2> 1429 T3355 oasc.SolrResourceLoader.locateSolrHome using system property solr.solr.home: C:\Jenkins\workspace\Lucene-Solr-4.x-Windows\solr\build\solr-core\test-files\solr
[junit4:junit4]   2> 1429 T3355 oasc.SolrResourceLoader.<init> new SolrResourceLoader for directory: 'C:\Jenkins\workspace\Lucene-Solr-4.x-Windows\solr\build\solr-core\test-files\solr\'
[junit4:junit4]   2> 1438 T3355 oasc.CoreContainer.<init> New CoreContainer 2144481188
[junit4:junit4]   2> 1439 T3355 oasc.SolrCore.<init> [collection1] Opening new SolrCore at C:\Jenkins\workspace\Lucene-Solr-4.x-Windows\solr\build\solr-core\test-files\solr\collection1\, dataDir=C:\Jenkins\workspace\Lucene-Solr-4.x-Windows\solr\build\solr-core\test\J0\.\solrtest-SuggesterWFSTTest-1346009330285\
[junit4:junit4]   2> 1439 T3355 oasc.SolrCore.<init> JMX monitoring not detected for core: collection1
[junit4:junit4]   2> 1439 T3355 oasc.SolrCore.getNewIndexDir WARNING New index directory detected: old=null new=C:\Jenkins\workspace\Lucene-Solr-4.x-Windows\solr\build\solr-core\test\J0\.\solrtest-SuggesterWFSTTest-1346009330285\index/
[junit4:junit4]   2> 1440 T3355 oasc.RequestHandlers.initHandlersFromConfig created standard: solr.StandardRequestHandler
[junit4:junit4]   2> 1441 T3355 oasc.RequestHandlers.initHandlersFromConfig created /suggest: org.apache.solr.handler.component.SearchHandler
[junit4:junit4]   2> 1441 T3355 oasc.RequestHandlers.initHandlersFromConfig created /suggest_tst: org.apache.solr.handler.component.SearchHandler
[junit4:junit4]   2> 1442 T3355 oasc.RequestHandlers.initHandlersFromConfig created /suggest_fst: org.apache.solr.handler.component.SearchHandler
[junit4:junit4]   2> 1442 T3355 oasc.RequestHandlers.initHandlersFromConfig created /suggest_wfst: org.apache.solr.handler.component.SearchHandler
[junit4:junit4]   2> 1447 T3355 oasc.CachingDirectoryFactory.get return new directory for C:\Jenkins\workspace\Lucene-Solr-4.x-Windows\solr\build\solr-core\test\J0\.\solrtest-SuggesterWFSTTest-1346009330285\index forceNew:false
[junit4:junit4]   2> 1450 T3355 oass.SolrIndexSearcher.<init> Opening Searcher@b5e6a3e main
[junit4:junit4]   2> 1450 T3355 oass.SolrIndexSearcher.getIndexDir WARNING WARNING: Directory impl does not support setting indexDir: org.apache.lucene.store.MockDirectoryWrapper
[junit4:junit4]   2> 1451 T3355 oasu.CommitTracker.<init> Hard AutoCommit: disabled
[junit4:junit4]   2> 1451 T3355 oasu.CommitTracker.<init> Soft AutoCommit: disabled
[junit4:junit4]   2> 1451 T3355 oashc.SpellCheckComponent.inform Initializing spell checkers
[junit4:junit4]   2> 1452 T3355 oasss.Suggester.init init: {name=suggest,classname=org.apache.solr.spelling.suggest.Suggester,lookupImpl=org.apache.solr.spelling.suggest.jaspell.JaspellLookup,field=suggest,storeDir=suggest,buildOnCommit=true,threshold=0.0}
[junit4:junit4]   2> 1452 T3355 oasssj.JaspellLookupFactory.create init: {name=suggest,classname=org.apache.solr.spelling.suggest.Suggester,lookupImpl=org.apache.solr.spelling.suggest.jaspell.JaspellLookup,field=suggest,storeDir=suggest,buildOnCommit=true,threshold=0.0}
[junit4:junit4]   2> 1454 T3355 oashc.SpellCheckComponent.inform Registering newSearcher listener for spellchecker: suggest
[junit4:junit4]   2> 1454 T3355 oashc.SpellCheckComponent.inform No queryConverter defined, using default converter
[junit4:junit4]   2> 1454 T3355 oashc.SpellCheckComponent.inform Initializing spell checkers
[junit4:junit4]   2> 1454 T3355 oasss.Suggester.init init: {name=suggest_tst,classname=org.apache.solr.spelling.suggest.Suggester,lookupImpl=org.apache.solr.spelling.suggest.tst.TSTLookup,field=suggest,storeDir=suggest_tst,buildOnCommit=true,threshold=0.0}
[junit4:junit4]   2> 1455 T3355 oashc.SpellCheckComponent.inform Registering newSearcher listener for spellchecker: suggest_tst
[junit4:junit4]   2> 1456 T3355 oashc.SpellCheckComponent.inform No queryConverter defined, using default converter
[junit4:junit4]   2> 1456 T3355 oashc.SpellCheckComponent.inform Initializing spell checkers
[junit4:junit4]   2> 1456 T3355 oasss.Suggester.init init: {name=suggest_fst,classname=org.apache.solr.spelling.suggest.Suggester,lookupImpl=org.apache.solr.spelling.suggest.fst.FSTLookup,field=suggest,storeDir=suggest_fst,buildOnCommit=true,weightBuckets=5,exactMatchFirst=true}
[junit4:junit4]   2> 1457 T3355 oashc.SpellCheckComponent.inform Registering newSearcher listener for spellchecker: suggest_fst
[junit4:junit4]   2> 1457 T3355 oashc.SpellCheckComponent.inform No queryConverter defined, using default converter
[junit4:junit4]   2> 1458 T3355 oashc.SpellCheckComponent.inform Initializing spell checkers
[junit4:junit4]   2> 1458 T3355 oasss.Suggester.init init: {name=suggest_wfst,classname=org.apache.solr.spelling.suggest.Suggester,lookupImpl=org.apache.solr.spelling.suggest.fst.WFSTLookupFactory,field=suggest,storeDir=suggest_wfst,buildOnCommit=true,exactMatchFirst=true}
[junit4:junit4]   2> 1459 T3355 oashc.SpellCheckComponent.inform Registering newSearcher listener for spellchecker: suggest_wfst
[junit4:junit4]   2> 1459 T3355 oashc.SpellCheckComponent.inform No queryConverter defined, using default converter
[junit4:junit4]   2> 1459 T3355 oashc.HttpShardHandlerFactory.getParameter Setting socketTimeout to: 0
[junit4:junit4]   2> 1459 T3355 oashc.HttpShardHandlerFactory.getParameter Setting urlScheme to: http://
[junit4:junit4]   2> 1459 T3355 oashc.HttpShardHandlerFactory.getParameter Setting connTimeout to: 0
[junit4:junit4]   2> 1460 T3355 oashc.HttpShardHandlerFactory.getParameter Setting maxConnectionsPerHost to: 20
[junit4:junit4]   2> 1460 T3355 oashc.HttpShardHandlerFactory.getParameter Setting corePoolSize to: 0
[junit4:junit4]   2> 1460 T3355 oashc.HttpShardHandlerFactory.getParameter Setting maximumPoolSize to: 2147483647
[junit4:junit4]   2> 1460 T3355 oashc.HttpShardHandlerFactory.getParameter Setting maxThreadIdleTime to: 5
[junit4:junit4]   2> 1461 T3355 oashc.HttpShardHandlerFactory.getParameter Setting sizeOfQueue to: -1
[junit4:junit4]   2> 1461 T3355 oashc.HttpShardHandlerFactory.getParameter Setting fairnessPolicy to: false
[junit4:junit4]   2> 1461 T3355 oascsi.HttpClientUtil.createClient Creating new http client, config:maxConnectionsPerHost=20&maxConnections=10000&socketTimeout=0&connTimeout=0&retry=false
[junit4:junit4]   2> 1466 T3357 oasc.SolrCore.registerSearcher [collection1] Registered new searcher Searcher@b5e6a3e main{StandardDirectoryReader(segments_3:7 _1(4.0.0.2):C3)}
[junit4:junit4]   2> 1466 T3355 oasc.CoreContainer.register registering core: collection1
[junit4:junit4]   2> 1469 T3355 oas.SolrTestCaseJ4.initCore ####initCore end
[junit4:junit4]   2> ASYNC  NEW_CORE C243 name=collection1 org.apache.solr.core.SolrCore@70f4ac51
[junit4:junit4]   2> 1472 T3355 C243 REQ [collection1] webapp=null path=null params={q=ac&spellcheck.count=2&qt=/suggest_wfst&spellcheck.onlyMorePopular=true} status=0 QTime=3 
[junit4:junit4]   2> 1479 T3355 oas.SolrTestCaseJ4.tearDown ###Ending testReload
[junit4:junit4]   2> 1482 T3355 oas.SolrTestCaseJ4.setUp ###Starting testSuggestions
[junit4:junit4]   2> 1493 T3355 C243 oasc.SolrDeletionPolicy.onInit SolrDeletionPolicy.onInit: commits:num=1
[junit4:junit4]   2> 		commit{dir=MockDirWrapper(org.apache.lucene.store.NIOFSDirectory@C:\Jenkins\workspace\Lucene-Solr-4.x-Windows\solr\build\solr-core\test\J0\solrtest-SuggesterWFSTTest-1346009330285\index lockFactory=org.apache.lucene.store.NativeFSLockFactory@40c14dd9),segFN=segments_3,generation=3,filenames=[_1.prx, _1.fdx, _1.tis, _1.frq, _1.fdt, _1.si, _1.tii, _1.fnm, _1.nrm, segments_3]
[junit4:junit4]   2> 1493 T3355 C243 oasc.SolrDeletionPolicy.updateCommits newest commit = 3
[junit4:junit4]   2> 1495 T3355 C243 UPDATE [collection1] webapp=null path=null params={} {add=[1]} 0 7
[junit4:junit4]   2> 1504 T3355 C243 UPDATE [collection1] webapp=null path=null params={} {add=[2]} 0 0
[junit4:junit4]   2> 1514 T3355 C243 UPDATE [collection1] webapp=null path=null params={} {add=[3]} 0 1
[junit4:junit4]   2> 1521 T3355 C243 oasu.DirectUpdateHandler2.commit start commit{flags=0,_version_=0,optimize=false,openSearcher=true,waitSearcher=true,expungeDeletes=false,softCommit=false}
[junit4:junit4]   2> 1531 T3355 C243 oasc.SolrDeletionPolicy.onCommit SolrDeletionPolicy.onCommit: commits:num=2
[junit4:junit4]   2> 		commit{dir=MockDirWrapper(org.apache.lucene.store.NIOFSDirectory@C:\Jenkins\workspace\Lucene-Solr-4.x-Windows\solr\build\solr-core\test\J0\solrtest-SuggesterWFSTTest-1346009330285\index lockFactory=org.apache.lucene.store.NativeFSLockFactory@40c14dd9),segFN=segments_3,generation=3,filenames=[_1.prx, _1.fdx, _1.tis, _1.frq, _1.fdt, _1.si, _1.tii, _1.fnm, _1.nrm, segments_3]
[junit4:junit4]   2> 		commit{dir=MockDirWrapper(org.apache.lucene.store.NIOFSDirectory@C:\Jenkins\workspace\Lucene-Solr-4.x-Windows\solr\build\solr-core\test\J0\solrtest-SuggesterWFSTTest-1346009330285\index lockFactory=org.apache.lucene.store.NativeFSLockFactory@40c14dd9),segFN=segments_4,generation=4,filenames=[_2.si, _1.tis, _1.frq, _2.prx, _2.fdt, _2.frq, _2.tii, _2.fdx, _1.fnm, _2.fnm, _1.fdx, _1.prx, _2.tis, _1.fdt, _1.si, _1.tii, _2.nrm, _1.nrm, segments_4]
[junit4:junit4]   2> 1532 T3355 C243 oasc.SolrDeletionPolicy.updateCommits newest commit = 4
[junit4:junit4]   2> 1538 T3355 C243 oass.SolrIndexSearcher.<init> Opening Searcher@674b287b main
[junit4:junit4]   2> 1538 T3355 C243 oass.SolrIndexSearcher.getIndexDir WARNING WARNING: Directory impl does not support setting indexDir: org.apache.lucene.store.MockDirectoryWrapper
[junit4:junit4]   2> 1539 T3357 oashc.SpellCheckComponent$SpellCheckerListener.buildSpellIndex Building spell index for spell checker: suggest
[junit4:junit4]   2> 1538 T3355 C243 oasu.DirectUpdateHandler2.commit end_commit_flush
[junit4:junit4]   2> 1539 T3357 oasss.Suggester.build build()
[junit4:junit4]   2> 1542 T3357 oasss.Suggester.build Stored suggest data to: C:\Jenkins\workspace\Lucene-Solr-4.x-Windows\solr\build\solr-core\test\J0\.\solrtest-SuggesterWFSTTest-1346009330285\suggest\jaspell.dat
[junit4:junit4]   2> 1542 T3357 oashc.SpellCheckComponent$SpellCheckerListener.buildSpellIndex Building spell index for spell checker: suggest_tst
[junit4:junit4]   2> 1542 T3357 oasss.Suggester.build build()
[junit4:junit4]   2> 1548 T3357 oasss.Suggester.build Stored suggest data to: C:\Jenkins\workspace\Lucene-Solr-4.x-Windows\solr\build\solr-core\test\J0\.\solrtest-SuggesterWFSTTest-1346009330285\suggest_tst\tst.dat
[junit4:junit4]   2> 1549 T3357 oashc.SpellCheckComponent$SpellCheckerListener.buildSpellIndex Building spell index for spell checker: suggest_fst
[junit4:junit4]   2> 1549 T3357 oasss.Suggester.build build()
[junit4:junit4]   2> 1554 T3357 oasss.Suggester.build Stored suggest data to: C:\Jenkins\workspace\Lucene-Solr-4.x-Windows\solr\build\solr-core\test\J0\.\solrtest-SuggesterWFSTTest-1346009330285\suggest_fst\fst.bin
[junit4:junit4]   2> 1554 T3357 oashc.SpellCheckComponent$SpellCheckerListener.buildSpellIndex Building spell index for spell checker: suggest_wfst
[junit4:junit4]   2> 1554 T3357 oasss.Suggester.build build()
[junit4:junit4]   2> 1557 T3357 oasss.Suggester.build Stored suggest data to: C:\Jenkins\workspace\Lucene-Solr-4.x-Windows\solr\build\solr-core\test\J0\.\solrtest-SuggesterWFSTTest-1346009330285\suggest_wfst\wfst.bin
[junit4:junit4]   2> 1557 T3357 oasc.SolrCore.registerSearcher [collection1] Registered new searcher Searcher@674b287b main{StandardDirectoryReader(segments_4:9 _1(4.0.0.2):C3 _2(4.0.0.2):C3)}
[junit4:junit4]   2> 1559 T3355 C243 UPDATE [collection1] webapp=null path=null params={} {commit=} 0 38
[junit4:junit4]   2> 1561 T3355 C243 REQ [collection1] webapp=null path=null params={q=ac&spellcheck.count=2&qt=/suggest_wfst&spellcheck.onlyMorePopular=true} status=0 QTime=0 
[junit4:junit4]   2> 1566 T3355 oas.SolrTestCaseJ4.tearDown ###Ending testSuggestions
[junit4:junit4]   2> 1570 T3355 oas.SolrTestCaseJ4.setUp ###Starting testAnalyzer
[junit4:junit4]   2> 1570 T3355 oasss.Suggester.init init: {lookupImpl=org.apache.solr.spelling.suggest.tst.TSTLookupFactory}
[junit4:junit4]   2> 1571 T3355 oas.SolrTestCaseJ4.tearDown ###Ending testAnalyzer
[junit4:junit4]   2> 1571 T3355 oas.SolrTestCaseJ4.deleteCore ###deleteCore
[junit4:junit4]   2> 1571 T3355 oasc.CoreContainer.shutdown Shutting down CoreContainer instance=2144481188
[junit4:junit4]   2> 1571 T3355 oasc.SolrCore.close [collection1]  CLOSING SolrCore org.apache.solr.core.SolrCore@70f4ac51
[junit4:junit4]   2> 1572 T3355 oasc.SolrCore.closeSearcher [collection1] Closing main searcher on request.
[junit4:junit4]   2> 1572 T3355 oasu.DirectUpdateHandler2.close closing DirectUpdateHandler2{commits=1,autocommits=0,soft autocommits=0,optimizes=0,rollbacks=0,expungeDeletes=0,docsPending=0,adds=0,deletesById=0,deletesByQuery=0,errors=0,cumulative_adds=3,cumulative_deletesById=0,cumulative_deletesByQuery=0,cumulative_errors=0}
[junit4:junit4]   2> 1572 T3355 oasu.DefaultSolrCoreState.decref SolrCoreState ref count has reached 0 - closing IndexWriter
[junit4:junit4]   2> NOTE: test params are: codec=Lucene3x, sim=DefaultSimilarity, locale=sr, timezone=Indian/Mayotte
[junit4:junit4]   2> NOTE: Windows 7 6.1 amd64/Sun Microsystems Inc. 1.6.0_34 (64-bit)/cpus=2,threads=1,free=140174448,total=256442368
[junit4:junit4]   2> NOTE: All tests run in this JVM: [FastVectorHighlighterTest, TestReplicationHandler, XsltUpdateRequestHandlerTest, TestFunctionQuery, PingRequestHandlerTest, LoggingHandlerTest, SpatialFilterTest, URLClassifyProcessorTest, NumericFieldsTest, CacheHeaderTest, DirectUpdateHandlerTest, OpenExchangeRatesOrgProviderTest, DirectUpdateHandlerOptimizeTest, PeerSyncTest, TestSolrDeletionPolicy2, TestQuerySenderNoQuery, TestRemoteStreaming, TestQuerySenderListener, ConvertedLegacyTest, TestWordDelimiterFilterFactory, ResourceLoaderTest, DisMaxRequestHandlerTest, SimpleFacetsTest, TestFastLRUCache, TestValueSourceCache, BasicDistributedZk2Test, SampleTest, TestDocSet, SpellingQueryConverterTest, TestConfig, AlternateDirectoryTest, StatelessScriptUpdateProcessorFactoryTest, JSONWriterTest, DistributedSpellCheckComponentTest, IndexSchemaTest, FileBasedSpellCheckerTest, TestRTGBase, TestFaceting, DistributedTermsComponentTest, TestDistributedSearch, AnalysisAfterCoreReloadTest, NoCacheHeaderTest, HighlighterTest, BadComponentTest, TestCSVLoader, CSVRequestHandlerTest, TestSurroundQueryParser, TestFastOutputStream, SolrCmdDistributorTest, CurrencyFieldTest, IndexReaderFactoryTest, TestStressReorder, TestSystemIdResolver, ZkSolrClientTest, SOLR749Test, RequestHandlersTest, SolrCoreCheckLockOnStartupTest, PathHierarchyTokenizerFactoryTest, TestUtils, TestIndexingPerformance, ClusterStateTest, StatsComponentTest, TestPropInject, SpellPossibilityIteratorTest, TestJoin, LeaderElectionIntegrationTest, TermVectorComponentDistributedTest, LeaderElectionTest, SystemInfoHandlerTest, TestDefaultSimilarityFactory, TestXIncludeConfig, PluginInfoTest, TestWriterPerf, SortByFunctionTest, TestSolrXMLSerializer, TestTrie, RecoveryZkTest, DirectSolrSpellCheckerTest, TestSolrQueryParser, DistributedQueryElevationComponentTest, TestJmxIntegration, TestCSVResponseWriter, TestCollationField, MinimalSchemaTest, TestFastWriter, DistanceFunctionTest, SpellCheckCollatorTest, BadIndexSchemaTest, SoftAutoCommitTest, WordBreakSolrSpellCheckerTest, TestStressVersions, TestPropInjectDefaults, TestBM25SimilarityFactory, TestDFRSimilarityFactory, TestRangeQuery, TestPHPSerializedResponseWriter, ClusterStateUpdateTest, TestLMDirichletSimilarityFactory, UpdateRequestProcessorFactoryTest, OverseerTest, TestRecovery, SpellCheckComponentTest, TestExtendedDismaxParser, XmlUpdateRequestHandlerTest, SearchHandlerTest, DocumentAnalysisRequestHandlerTest, DirectSolrConnectionTest, UniqFieldsUpdateProcessorFactoryTest, BasicDistributedZkTest, FullSolrCloudDistribCmdsTest, TestRealTimeGet, ZkControllerTest, TestDistributedGrouping, TestRandomFaceting, AutoCommitTest, BasicZkTest, TestHashPartitioner, SolrCoreTest, IndexBasedSpellCheckerTest, TestMultiCoreConfBootstrap, TestCoreContainer, LukeRequestHandlerTest, TestSort, TestGroupingSearch, TestFiltering, QueryElevationComponentTest, BasicFunctionalityTest, SignatureUpdateProcessorFactoryTest, TestBinaryResponseWriter, TestIndexSearcher, CoreAdminHandlerTest, SolrRequestParserTest, QueryEqualityTest, PolyFieldTest, MoreLikeThisHandlerTest, DocumentBuilderTest, MBeansHandlerTest, TestPseudoReturnFields, BinaryUpdateRequestHandlerTest, QueryParsingTest, TermsComponentTest, SolrInfoMBeanTest, StandardRequestHandlerTest, TestQueryTypes, FieldAnalysisRequestHandlerTest, TermVectorComponentTest, SuggesterWFSTTest]
[junit4:junit4] Completed in 1.61s, 4 tests, 1 error <<< FAILURES!

[...truncated 233 lines...]
BUILD FAILED
C:\Jenkins\workspace\Lucene-Solr-4.x-Windows\build.xml:29: The following error occurred while executing this line:
C:\Jenkins\workspace\Lucene-Solr-4.x-Windows\solr\build.xml:144: The following error occurred while executing this line:
C:\Jenkins\workspace\Lucene-Solr-4.x-Windows\lucene\module-build.xml:62: The following error occurred while executing this line:
C:\Jenkins\workspace\Lucene-Solr-4.x-Windows\lucene\common-build.xml:1106: The following error occurred while executing this line:
C:\Jenkins\workspace\Lucene-Solr-4.x-Windows\lucene\common-build.xml:798: There were test failures: 227 suites, 908 tests, 1 error, 11 ignored (6 assumptions)

Total time: 38 minutes 3 seconds
Build step 'Invoke Ant' marked build as failure
Recording test results
Description set: Java: 64bit/jdk1.6.0_34 -XX:+UseParallelGC
Email was triggered for: Failure
Sending email for trigger: Failure



Mime
View raw message