lucene-dev mailing list archives

Site index · List index
Message view « Date » · « Thread »
Top « Date » · « Thread »
From buil...@flonkings.com
Subject Build failed in Jenkins: Lucene-trunk-Linux-Java7-64 #105
Date Sun, 05 Aug 2012 22:25:29 GMT
See <builds.flonkings.com/job/Lucene-trunk-Linux-Java7-64/105/>

------------------------------------------
[...truncated 37784 lines...]

-clover.setup:
     [echo] Code coverage with Atlassian Clover enabled.
[ivy:cachepath] :: resolving dependencies :: com.cenqua.clover#clover-caller;working
[ivy:cachepath] 	confs: [master]
[ivy:cachepath] 	found com.cenqua.clover#clover;2.6.3 in public
[ivy:cachepath] :: resolution report :: resolve 14ms :: artifacts dl 0ms
	---------------------------------------------------------------------
	|                  |            modules            ||   artifacts   |
	|       conf       | number| search|dwnlded|evicted|| number|dwnlded|
	---------------------------------------------------------------------
	|      master      |   1   |   0   |   0   |   0   ||   1   |   0   |
	---------------------------------------------------------------------
[clover-setup] Clover Version 2.6.3, built on November 20 2009 (build-778)
[clover-setup] Loaded from: /var/lib/jenkins/.ant/lib/clover-2.6.3.jar
[clover-setup] Clover: Open Source License registered to Apache.
[clover-setup] Clover is enabled with initstring '<builds.flonkings.com/job/Lucene-trunk-Linux-Java7-64/ws/checkout/lucene/build/clover/db/coverage.db'>

clover:

compile-core:

compile-test-framework:

ivy-availability-check:

ivy-fail:

ivy-configure:
[ivy:configure] :: loading settings :: file = <builds.flonkings.com/job/Lucene-trunk-Linux-Java7-64/ws/checkout/lucene/ivy-settings.xml>

resolve:

init:

compile-lucene-core:

compile-core:

common.compile-test:

install-junit4-taskdef:

-clover.disable:

-clover.setup:
     [echo] Code coverage with Atlassian Clover enabled.
[ivy:cachepath] :: resolving dependencies :: com.cenqua.clover#clover-caller;working
[ivy:cachepath] 	confs: [master]
[ivy:cachepath] 	found com.cenqua.clover#clover;2.6.3 in public
[ivy:cachepath] :: resolution report :: resolve 13ms :: artifacts dl 1ms
	---------------------------------------------------------------------
	|                  |            modules            ||   artifacts   |
	|       conf       | number| search|dwnlded|evicted|| number|dwnlded|
	---------------------------------------------------------------------
	|      master      |   1   |   0   |   0   |   0   ||   1   |   0   |
	---------------------------------------------------------------------
[clover-setup] Clover Version 2.6.3, built on November 20 2009 (build-778)
[clover-setup] Loaded from: /var/lib/jenkins/.ant/lib/clover-2.6.3.jar
[clover-setup] Clover: Open Source License registered to Apache.
[clover-setup] Clover is enabled with initstring '<builds.flonkings.com/job/Lucene-trunk-Linux-Java7-64/ws/checkout/lucene/build/clover/db/coverage.db'>

clover:

validate:

common.test:
    [mkdir] Created dir: <builds.flonkings.com/job/Lucene-trunk-Linux-Java7-64/ws/checkout/lucene/build/suggest/test>
[junit4:junit4] <JUnit4> says olá! Master seed: C7DF8F67F5F8636C
[junit4:junit4] Executing 17 suites with 1 JVM.
[junit4:junit4] Suite: org.apache.lucene.search.suggest.fst.BytesRefSortersTest
[junit4:junit4] Completed in 1.37s, 2 tests
[junit4:junit4]  
[junit4:junit4] Suite: org.apache.lucene.search.suggest.fst.TestSort
[junit4:junit4] IGNOR/A 0.23s | TestSort.testLargerRandom
[junit4:junit4]    > Assumption #1: 'nightly' test group is disabled (@Nightly)
[junit4:junit4] Completed in 14.45s, 6 tests, 1 skipped
[junit4:junit4]  
[junit4:junit4] Suite: org.apache.lucene.search.suggest.fst.WFSTCompletionTest
[junit4:junit4] Completed in 4.20s, 2 tests
[junit4:junit4]  
[junit4:junit4] Suite: org.apache.lucene.search.spell.TestNGramDistance
[junit4:junit4] Completed in 0.62s, 4 tests
[junit4:junit4]  
[junit4:junit4] Suite: org.apache.lucene.search.suggest.fst.FSTCompletionTest
[junit4:junit4] Completed in 22.41s, 12 tests
[junit4:junit4]  
[junit4:junit4] Suite: org.apache.lucene.search.suggest.LookupBenchmarkTest
[junit4:junit4] Completed in 0.12s, 0 tests
[junit4:junit4]  
[junit4:junit4] Suite: org.apache.lucene.search.suggest.TestHighFrequencyDictionary
[junit4:junit4] Completed in 0.74s, 1 test
[junit4:junit4]  
[junit4:junit4] Suite: org.apache.lucene.search.spell.TestLuceneDictionary
[junit4:junit4] Completed in 1.96s, 6 tests
[junit4:junit4]  
[junit4:junit4] Suite: org.apache.lucene.search.spell.TestLevenshteinDistance
[junit4:junit4] Completed in 0.32s, 2 tests
[junit4:junit4]  
[junit4:junit4] Suite: org.apache.lucene.search.spell.TestSpellChecker
[junit4:junit4] Completed in 12.05s, 6 tests
[junit4:junit4]  
[junit4:junit4] Suite: org.apache.lucene.search.suggest.TestTermFreqIterator
[junit4:junit4] Completed in 5.11s, 3 tests
[junit4:junit4]  
[junit4:junit4] Suite: org.apache.lucene.search.spell.TestDirectSpellChecker
[junit4:junit4] Completed in 3.80s, 6 tests
[junit4:junit4]  
[junit4:junit4] Suite: org.apache.lucene.search.spell.TestWordBreakSpellChecker
[junit4:junit4] Completed in 0.91s, 2 tests
[junit4:junit4]  
[junit4:junit4] Suite: org.apache.lucene.search.spell.TestPlainTextDictionary
[junit4:junit4] Completed in 0.49s, 1 test
[junit4:junit4]  
[junit4:junit4] Suite: org.apache.lucene.search.suggest.TestBytesRefList
[junit4:junit4] Completed in 0.48s, 2 tests
[junit4:junit4]  
[junit4:junit4] Suite: org.apache.lucene.search.suggest.PersistenceTest
[junit4:junit4] Completed in 0.60s, 3 tests
[junit4:junit4]  
[junit4:junit4] Suite: org.apache.lucene.search.spell.TestJaroWinklerDistance
[junit4:junit4] Completed in 0.27s, 1 test
[junit4:junit4]  
[junit4:junit4] JVM J0:     0.89 ..    73.58 =    72.68s
[junit4:junit4] Execution time total: 1 minute 13 seconds
[junit4:junit4] Tests summary: 17 suites, 59 tests, 1 ignored (1 assumption)
     [echo] 5 slowest tests:
[junit4:tophints]  22.41s | org.apache.lucene.search.suggest.fst.FSTCompletionTest
[junit4:tophints]  14.45s | org.apache.lucene.search.suggest.fst.TestSort
[junit4:tophints]  12.05s | org.apache.lucene.search.spell.TestSpellChecker
[junit4:tophints]   5.11s | org.apache.lucene.search.suggest.TestTermFreqIterator
[junit4:tophints]   4.20s | org.apache.lucene.search.suggest.fst.WFSTCompletionTest

ivy-configure:
[ivy:configure] :: loading settings :: file = <builds.flonkings.com/job/Lucene-trunk-Linux-Java7-64/ws/checkout/lucene/ivy-settings.xml>

install-junit4-taskdef:

test-backwards:

test:

BUILD SUCCESSFUL
Total time: 493 minutes 32 seconds
+ RET=0
+ set -e
+ ANT_OPTS=-Xmx896M /var/lib/jenkins/tools/ant/supported18/bin/ant -Dsvnversion.exe=/var/lib/jenkins/tools/svn/svnversion
-Dsvn.exe=/var/lib/jenkins/tools/svn/svn -Dversion=5.0-2012-08-05_14-06-48 -Drun.clover=true
generate-clover-reports
Buildfile: <builds.flonkings.com/job/Lucene-trunk-Linux-Java7-64/ws/checkout/lucene/build.xml>

-clover.disable:

-clover.setup:
     [echo] Code coverage with Atlassian Clover enabled.
[ivy:cachepath] :: Ivy 2.2.0 - 20100923230623 :: http://ant.apache.org/ivy/ ::
[ivy:cachepath] :: loading settings :: url = jar:file:/var/lib/jenkins/.ant/lib/ivy-2.2.0.jar!/org/apache/ivy/core/settings/ivysettings.xml
[ivy:cachepath] :: resolving dependencies :: com.cenqua.clover#clover-caller;working
[ivy:cachepath] 	confs: [master]
[ivy:cachepath] 	found com.cenqua.clover#clover;2.6.3 in public
[ivy:cachepath] :: resolution report :: resolve 476ms :: artifacts dl 4ms
	---------------------------------------------------------------------
	|                  |            modules            ||   artifacts   |
	|       conf       | number| search|dwnlded|evicted|| number|dwnlded|
	---------------------------------------------------------------------
	|      master      |   1   |   0   |   0   |   0   ||   1   |   0   |
	---------------------------------------------------------------------
[clover-setup] Clover Version 2.6.3, built on November 20 2009 (build-778)
[clover-setup] Loaded from: /var/lib/jenkins/.ant/lib/clover-2.6.3.jar
[clover-setup] Clover: Open Source License registered to Apache.
[clover-setup] Clover is enabled with initstring '<builds.flonkings.com/job/Lucene-trunk-Linux-Java7-64/ws/checkout/lucene/build/clover/db/coverage.db'>

clover:

generate-clover-reports:
    [mkdir] Created dir: <builds.flonkings.com/job/Lucene-trunk-Linux-Java7-64/ws/checkout/lucene/build/clover/reports>
[clover-report] Clover Version 2.6.3, built on November 20 2009 (build-778)
[clover-report] Loaded from: /var/lib/jenkins/.ant/lib/clover-2.6.3.jar
[clover-report] Clover: Open Source License registered to Apache.
[clover-report] Loading coverage database from: '<builds.flonkings.com/job/Lucene-trunk-Linux-Java7-64/ws/checkout/lucene/build/clover/db/coverage.db'>
[clover-report] Loading coverage database from: '<builds.flonkings.com/job/Lucene-trunk-Linux-Java7-64/ws/checkout/lucene/build/clover/db/coverage.db'>
[clover-report] Processed 4152 test case results from 744 results files.
[clover-report] Writing HTML report to '<builds.flonkings.com/job/Lucene-trunk-Linux-Java7-64/ws/checkout/lucene/build/clover/reports'>

BUILD FAILED
<builds.flonkings.com/job/Lucene-trunk-Linux-Java7-64/ws/checkout/lucene/build.xml>:153:
com.cenqua.clover.CloverException: java.lang.IllegalArgumentException: Comparison method violates
its general contract!
	at com.cenqua.clover.reporters.html.HtmlReporter.generateCurrentReport(HtmlReporter.java:81)
	at com.cenqua.clover.reporters.html.HtmlReporter.generateReport(HtmlReporter.java:66)
	at com.cenqua.clover.reporters.CloverReporter.generateReport(CloverReporter.java:39)
	at com.cenqua.clover.tasks.CloverReportTask.generateReports(CloverReportTask.java:430)
	at com.cenqua.clover.tasks.CloverReportTask.cloverExecute(CloverReportTask.java:387)
	at com.cenqua.clover.tasks.AbstractCloverTask.execute(AbstractCloverTask.java:55)
	at org.apache.tools.ant.UnknownElement.execute(UnknownElement.java:291)
	at sun.reflect.GeneratedMethodAccessor4.invoke(Unknown Source)
	at sun.reflect.DelegatingMethodAccessorImpl.invoke(DelegatingMethodAccessorImpl.java:43)
	at java.lang.reflect.Method.invoke(Method.java:601)
	at org.apache.tools.ant.dispatch.DispatchUtils.execute(DispatchUtils.java:106)
	at org.apache.tools.ant.Task.perform(Task.java:348)
	at org.apache.tools.ant.Target.execute(Target.java:392)
	at org.apache.tools.ant.Target.performTasks(Target.java:413)
	at org.apache.tools.ant.Project.executeSortedTargets(Project.java:1399)
	at org.apache.tools.ant.Project.executeTarget(Project.java:1368)
	at org.apache.tools.ant.helper.DefaultExecutor.executeTargets(DefaultExecutor.java:41)
	at org.apache.tools.ant.Project.executeTargets(Project.java:1251)
	at org.apache.tools.ant.Main.runBuild(Main.java:811)
	at org.apache.tools.ant.Main.startAnt(Main.java:217)
	at org.apache.tools.ant.launch.Launcher.run(Launcher.java:280)
	at org.apache.tools.ant.launch.Launcher.main(Launcher.java:109)
--- Nested Exception ---
java.lang.IllegalArgumentException: Comparison method violates its general contract!
	at java.util.TimSort.mergeLo(TimSort.java:747)
	at java.util.TimSort.mergeAt(TimSort.java:483)
	at java.util.TimSort.mergeCollapse(TimSort.java:410)
	at java.util.TimSort.sort(TimSort.java:214)
	at java.util.TimSort.sort(TimSort.java:173)
	at java.util.Arrays.sort(Arrays.java:659)
	at java.util.Collections.sort(Collections.java:217)
	at com.cenqua.clover.reporters.html.RenderFileAction.insertSrcFileProperties(RenderFileAction.java:257)
	at com.cenqua.clover.reporters.html.RenderFileAction.render(RenderFileAction.java:124)
	at com.cenqua.clover.reporters.html.RenderFileAction.call(RenderFileAction.java:106)
	at com.cenqua.clover.util.CloverExecutors$CloverExecutorService.submit(CloverExecutors.java:70)
	at com.cenqua.clover.reporters.html.FullHtmlReporter.processPackage(FullHtmlReporter.java:489)
	at com.cenqua.clover.reporters.html.FullHtmlReporter.createCurrentReportImpl(FullHtmlReporter.java:328)
	at com.cenqua.clover.reporters.html.HtmlReporter.createCurrentReport(HtmlReporter.java:109)
	at com.cenqua.clover.reporters.html.HtmlReporter.generateCurrentReport(HtmlReporter.java:77)
	at com.cenqua.clover.reporters.html.HtmlReporter.generateReport(HtmlReporter.java:66)
	at com.cenqua.clover.reporters.CloverReporter.generateReport(CloverReporter.java:39)
	at com.cenqua.clover.tasks.CloverReportTask.generateReports(CloverReportTask.java:430)
	at com.cenqua.clover.tasks.CloverReportTask.cloverExecute(CloverReportTask.java:387)
	at com.cenqua.clover.tasks.AbstractCloverTask.execute(AbstractCloverTask.java:55)
	at org.apache.tools.ant.UnknownElement.execute(UnknownElement.java:291)
	at sun.reflect.GeneratedMethodAccessor4.invoke(Unknown Source)
	at sun.reflect.DelegatingMethodAccessorImpl.invoke(DelegatingMethodAccessorImpl.java:43)
	at java.lang.reflect.Method.invoke(Method.java:601)
	at org.apache.tools.ant.dispatch.DispatchUtils.execute(DispatchUtils.java:106)
	at org.apache.tools.ant.Task.perform(Task.java:348)
	at org.apache.tools.ant.Target.execute(Target.java:392)
	at org.apache.tools.ant.Target.performTasks(Target.java:413)
	at org.apache.tools.ant.Project.executeSortedTargets(Project.java:1399)
	at org.apache.tools.ant.Project.executeTarget(Project.java:1368)
	at org.apache.tools.ant.helper.DefaultExecutor.executeTargets(DefaultExecutor.java:41)
	at org.apache.tools.ant.Project.executeTargets(Project.java:1251)
	at org.apache.tools.ant.Main.runBuild(Main.java:811)
	at org.apache.tools.ant.Main.startAnt(Main.java:217)
	at org.apache.tools.ant.launch.Launcher.run(Launcher.java:280)
	at org.apache.tools.ant.launch.Launcher.main(Launcher.java:109)

Total time: 8 minutes 30 seconds
Build step 'Execute shell' marked build as failure
Archiving artifacts
Recording test results

---------------------------------------------------------------------
To unsubscribe, e-mail: dev-unsubscribe@lucene.apache.org
For additional commands, e-mail: dev-help@lucene.apache.org


Mime
View raw message