lucene-dev mailing list archives

Site index · List index
Message view « Date » · « Thread »
Top « Date » · « Thread »
From Policeman Jenkins Server <jenk...@sd-datasolutions.de>
Subject [JENKINS] Lucene-Solr-4.x-Windows (32bit/jdk1.6.0_33) - Build # 291 - Failure!
Date Fri, 17 Aug 2012 03:09:30 GMT
Build: http://jenkins.sd-datasolutions.de/job/Lucene-Solr-4.x-Windows/291/
Java: 32bit/jdk1.6.0_33 -server -XX:+UseConcMarkSweepGC

1 tests failed.
REGRESSION:  org.apache.solr.cloud.BasicZkTest.testBasic

Error Message:
Captured an uncaught exception in thread: Thread[id=64, name=Thread-14, state=RUNNABLE, group=Overseer state updater.]

Stack Trace:
com.carrotsearch.randomizedtesting.UncaughtExceptionError: Captured an uncaught exception in thread: Thread[id=64, name=Thread-14, state=RUNNABLE, group=Overseer state updater.]
	at __randomizedtesting.SeedInfo.seed([67A7F17D12E31125:CC5DEC68CD3F970B]:0)
Caused by: java.util.NoSuchElementException
	at org.apache.solr.cloud.DistributedQueue.remove(DistributedQueue.java:154)
	at org.apache.solr.cloud.Overseer$ClusterStateUpdater.run(Overseer.java:129)
	at java.lang.Thread.run(Thread.java:662)




Build Log:
[...truncated 6354 lines...]
[junit4:junit4] Suite: org.apache.solr.cloud.BasicZkTest
[junit4:junit4]   2> Creating dataDir: C:\Jenkins\workspace\Lucene-Solr-4.x-Windows\solr\build\solr-core\test\J0\.\solrtest-BasicZkTest-1345171914812
[junit4:junit4]   2> 2 T52 oasc.ZkTestServer.run STARTING ZK TEST SERVER
[junit4:junit4]   2> 20 T53 oaz.Environment.logEnv Server environment:zookeeper.version=3.3.6-1366786, built on 07/29/2012 06:22 GMT
[junit4:junit4]   2> 21 T53 oaz.Environment.logEnv Server environment:host.name=JenkinsSlave-PC
[junit4:junit4]   2> 21 T53 oaz.Environment.logEnv Server environment:java.version=1.6.0_33
[junit4:junit4]   2> 21 T53 oaz.Environment.logEnv Server environment:java.vendor=Sun Microsystems Inc.
[junit4:junit4]   2> 21 T53 oaz.Environment.logEnv Server environment:java.home=C:\Jenkins\tools\java\32bit\jdk1.6.0_33\jre
[junit4:junit4]   2> 21 T53 oaz.Environment.logEnv Server environment:java.class.path=C:\Jenkins\workspace\Lucene-Solr-4.x-Windows\solr\build\solr-core\classes\test;C:\Jenkins\workspace\Lucene-Solr-4.x-Windows\solr\build\solr-test-framework\classes\java;C:\Jenkins\workspace\Lucene-Solr-4.x-Windows\solr\build\solr-core\test-files;C:\Jenkins\workspace\Lucene-Solr-4.x-Windows\lucene\build\test-framework\classes\java;C:\Jenkins\workspace\Lucene-Solr-4.x-Windows\solr\build\solr-solrj\classes\java;C:\Jenkins\workspace\Lucene-Solr-4.x-Windows\solr\build\solr-core\classes\java;C:\Jenkins\workspace\Lucene-Solr-4.x-Windows\lucene\build\analysis\common\lucene-analyzers-common-4.0-SNAPSHOT.jar;C:\Jenkins\workspace\Lucene-Solr-4.x-Windows\lucene\build\analysis\kuromoji\lucene-analyzers-kuromoji-4.0-SNAPSHOT.jar;C:\Jenkins\workspace\Lucene-Solr-4.x-Windows\lucene\build\analysis\phonetic\lucene-analyzers-phonetic-4.0-SNAPSHOT.jar;C:\Jenkins\workspace\Lucene-Solr-4.x-Windows\lucene\build\highlighter\lucene-highlighter-4.0-SNAPSHOT.jar;C:\Jenkins\workspace\Lucene-Solr-4.x-Windows\lucene\build\memory\lucene-memory-4.0-SNAPSHOT.jar;C:\Jenkins\workspace\Lucene-Solr-4.x-Windows\lucene\build\misc\lucene-misc-4.0-SNAPSHOT.jar;C:\Jenkins\workspace\Lucene-Solr-4.x-Windows\lucene\build\spatial\lucene-spatial-4.0-SNAPSHOT.jar;C:\Jenkins\workspace\Lucene-Solr-4.x-Windows\lucene\build\suggest\lucene-suggest-4.0-SNAPSHOT.jar;C:\Jenkins\workspace\Lucene-Solr-4.x-Windows\lucene\build\grouping\lucene-grouping-4.0-SNAPSHOT.jar;C:\Jenkins\workspace\Lucene-Solr-4.x-Windows\lucene\build\queries\lucene-queries-4.0-SNAPSHOT.jar;C:\Jenkins\workspace\Lucene-Solr-4.x-Windows\lucene\build\queryparser\lucene-queryparser-4.0-SNAPSHOT.jar;C:\Jenkins\workspace\Lucene-Solr-4.x-Windows\solr\lib\commons-cli-1.2.jar;C:\Jenkins\workspace\Lucene-Solr-4.x-Windows\solr\lib\commons-codec-1.6.jar;C:\Jenkins\workspace\Lucene-Solr-4.x-Windows\solr\lib\commons-fileupload-1.2.1.jar;C:\Jenkins\workspace\Lucene-Solr-4.x-Windows\solr\lib\commons-io-2.1.jar;C:\Jenkins\workspace\Lucene-Solr-4.x-Windows\solr\lib\commons-lang-2.6.jar;C:\Jenkins\workspace\Lucene-Solr-4.x-Windows\solr\lib\easymock-2.2.jar;C:\Jenkins\workspace\Lucene-Solr-4.x-Windows\solr\lib\guava-r05.jar;C:\Jenkins\workspace\Lucene-Solr-4.x-Windows\solr\lib\httpclient-4.1.3.jar;C:\Jenkins\workspace\Lucene-Solr-4.x-Windows\solr\lib\httpcore-4.1.4.jar;C:\Jenkins\workspace\Lucene-Solr-4.x-Windows\solr\lib\httpmime-4.1.3.jar;C:\Jenkins\workspace\Lucene-Solr-4.x-Windows\solr\lib\javax.servlet-api-3.0.1.jar;C:\Jenkins\workspace\Lucene-Solr-4.x-Windows\solr\lib\jcl-over-slf4j-1.6.4.jar;C:\Jenkins\workspace\Lucene-Solr-4.x-Windows\solr\lib\log4j-over-slf4j-1.6.4.jar;C:\Jenkins\workspace\Lucene-Solr-4.x-Windows\solr\lib\slf4j-api-1.6.4.jar;C:\Jenkins\workspace\Lucene-Solr-4.x-Windows\solr\lib\slf4j-jdk14-1.6.4.jar;C:\Jenkins\workspace\Lucene-Solr-4.x-Windows\solr\lib\spatial4j-0.2.jar;C:\Jenkins\workspace\Lucene-Solr-4.x-Windows\solr\lib\wstx-asl-3.2.7.jar;C:\Jenkins\workspace\Lucene-Solr-4.x-Windows\solr\lib\zookeeper-3.3.6.jar;C:\Jenkins\workspace\Lucene-Solr-4.x-Windows\solr\example\lib\jetty-continuation-8.1.2.v20120308.jar;C:\Jenkins\workspace\Lucene-Solr-4.x-Windows\solr\example\lib\jetty-deploy-8.1.2.v20120308.jar;C:\Jenkins\workspace\Lucene-Solr-4.x-Windows\solr\example\lib\jetty-http-8.1.2.v20120308.jar;C:\Jenkins\workspace\Lucene-Solr-4.x-Windows\solr\example\lib\jetty-io-8.1.2.v20120308.jar;C:\Jenkins\workspace\Lucene-Solr-4.x-Windows\solr\example\lib\jetty-jmx-8.1.2.v20120308.jar;C:\Jenkins\workspace\Lucene-Solr-4.x-Windows\solr\example\lib\jetty-security-8.1.2.v20120308.jar;C:\Jenkins\workspace\Lucene-Solr-4.x-Windows\solr\example\lib\jetty-server-8.1.2.v20120308.jar;C:\Jenkins\workspace\Lucene-Solr-4.x-Windows\solr\example\lib\jetty-servlet-8.1.2.v20120308.jar;C:\Jenkins\workspace\Lucene-Solr-4.x-Windows\solr\example\lib\jetty-util-8.1.2.v20120308.jar;C:\Jenkins\workspace\Lucene-Solr-4.x-Windows\solr\example\lib\jetty-webapp-8.1.2.v20120308.jar;C:\Jenkins\workspace\Lucene-Solr-4.x-Windows\solr\example\lib\jetty-xml-8.1.2.v20120308.jar;C:\Jenkins\workspace\Lucene-Solr-4.x-Windows\solr\example\lib\servlet-api-3.0.jar;C:\Jenkins\workspace\Lucene-Solr-4.x-Windows\solr\example\example-DIH\solr\db\lib\hsqldb-1.8.0.10.jar;C:\Jenkins\workspace\Lucene-Solr-4.x-Windows\lucene\build\core\classes\java;C:\Jenkins\workspace\Lucene-Solr-4.x-Windows\lucene\test-framework\lib\junit-4.10.jar;C:\Jenkins\workspace\Lucene-Solr-4.x-Windows\lucene\test-framework\lib\randomizedtesting-runner-2.0.0.rc5.jar;C:\Jenkins\tools\Ant\ANT_1.8.2\lib\ant-launcher.jar;C:\Users\JenkinsSlave\.ant\lib\ivy-2.2.0.jar;C:\Jenkins\tools\Ant\ANT_1.8.2\lib\ant-antlr.jar;C:\Jenkins\tools\Ant\ANT_1.8.2\lib\ant-apache-bcel.jar;C:\Jenkins\tools\Ant\ANT_1.8.2\lib\ant-apache-bsf.jar;C:\Jenkins\tools\Ant\ANT_1.8.2\lib\ant-apache-log4j.jar;C:\Jenkins\tools\Ant\ANT_1.8.2\lib\ant-apache-oro.jar;C:\Jenkins\tools\Ant\ANT_1.8.2\lib\ant-apache-regexp.jar;C:\Jenkins\tools\Ant\ANT_1.8.2\lib\ant-apache-resolver.jar;C:\Jenkins\tools\Ant\ANT_1.8.2\lib\ant-apache-xalan2.jar;C:\Jenkins\tools\Ant\ANT_1.8.2\lib\ant-commons-logging.jar;C:\Jenkins\tools\Ant\ANT_1.8.2\lib\ant-commons-net.jar;C:\Jenkins\tools\Ant\ANT_1.8.2\lib\ant-jai.jar;C:\Jenkins\tools\Ant\ANT_1.8.2\lib\ant-javamail.jar;C:\Jenkins\tools\Ant\ANT_1.8.2\lib\ant-jdepend.jar;C:\Jenkins\tools\Ant\ANT_1.8.2\lib\ant-jmf.jar;C:\Jenkins\tools\Ant\ANT_1.8.2\lib\ant-jsch.jar;C:\Jenkins\tools\Ant\ANT_1.8.2\lib\ant-junit.jar;C:\Jenkins\tools\Ant\ANT_1.8.2\lib\ant-junit4.jar;C:\Jenkins\tools\Ant\ANT_1.8.2\lib\ant-netrexx.jar;C:\Jenkins\tools\Ant\ANT_1.8.2\lib\ant-swing.jar;C:\Jenkins\tools\Ant\ANT_1.8.2\lib\ant-testutil.jar;C:\Jenkins\tools\Ant\ANT_1.8.2\lib\ant.jar;C:\Jenkins\tools\java\32bit\jdk1.6.0_33\lib\tools.jar;C:\Users\JenkinsSlave\.ivy2\cache\com.carrotsearch.randomizedtesting\junit4-ant\jars\junit4-ant-2.0.0.rc5.jar
[junit4:junit4]   2> 31 T53 oaz.Environment.logEnv Server environment:java.library.path=C:\Jenkins\tools\java\32bit\jdk1.6.0_33\jre\bin;C:\Windows\Sun\Java\bin;C:\Windows\system32;C:\Windows;C:\Jenkins\tools\java\32bit\jdk1.6.0_33\bin;C:\Program Files (x86)\GnuWin32\bin;C:\Perl\site\bin;C:\Perl\bin;C:\Windows\system32;C:\Windows;C:\Windows\System32\Wbem;C:\Windows\System32\WindowsPowerShell\v1.0\;C:\Program Files (x86)\Java\jre6\bin;C:\Program Files (x86)\Subversion\bin;.
[junit4:junit4]   2> 32 T53 oaz.Environment.logEnv Server environment:java.io.tmpdir=C:\Users\JENKIN~2\AppData\Local\Temp\
[junit4:junit4]   2> 32 T53 oaz.Environment.logEnv Server environment:java.compiler=<NA>
[junit4:junit4]   2> 32 T53 oaz.Environment.logEnv Server environment:os.name=Windows 7
[junit4:junit4]   2> 32 T53 oaz.Environment.logEnv Server environment:os.arch=x86
[junit4:junit4]   2> 32 T53 oaz.Environment.logEnv Server environment:os.version=6.1
[junit4:junit4]   2> 32 T53 oaz.Environment.logEnv Server environment:user.name=JenkinsSlave
[junit4:junit4]   2> 32 T53 oaz.Environment.logEnv Server environment:user.home=C:\Users\JenkinsSlave
[junit4:junit4]   2> 32 T53 oaz.Environment.logEnv Server environment:user.dir=C:\Jenkins\workspace\Lucene-Solr-4.x-Windows\solr\build\solr-core\test\J0
[junit4:junit4]   2> 42 T53 oazs.ZooKeeperServer.setTickTime tickTime set to 3000
[junit4:junit4]   2> 50 T53 oazs.NIOServerCnxn$Factory.<init> binding to port 0.0.0.0/0.0.0.0:0
[junit4:junit4]   2> 66 T53 oazsp.FileTxnSnapLog.save Snapshotting: 0
[junit4:junit4]   2> 103 T52 oasc.ZkTestServer.run start zk server on port:59790
[junit4:junit4]   2> 115 T52 oaz.Environment.logEnv Client environment:zookeeper.version=3.3.6-1366786, built on 07/29/2012 06:22 GMT
[junit4:junit4]   2> 116 T52 oaz.Environment.logEnv Client environment:host.name=JenkinsSlave-PC
[junit4:junit4]   2> 116 T52 oaz.Environment.logEnv Client environment:java.version=1.6.0_33
[junit4:junit4]   2> 116 T52 oaz.Environment.logEnv Client environment:java.vendor=Sun Microsystems Inc.
[junit4:junit4]   2> 116 T52 oaz.Environment.logEnv Client environment:java.home=C:\Jenkins\tools\java\32bit\jdk1.6.0_33\jre
[junit4:junit4]   2> 116 T52 oaz.Environment.logEnv Client environment:java.class.path=C:\Jenkins\workspace\Lucene-Solr-4.x-Windows\solr\build\solr-core\classes\test;C:\Jenkins\workspace\Lucene-Solr-4.x-Windows\solr\build\solr-test-framework\classes\java;C:\Jenkins\workspace\Lucene-Solr-4.x-Windows\solr\build\solr-core\test-files;C:\Jenkins\workspace\Lucene-Solr-4.x-Windows\lucene\build\test-framework\classes\java;C:\Jenkins\workspace\Lucene-Solr-4.x-Windows\solr\build\solr-solrj\classes\java;C:\Jenkins\workspace\Lucene-Solr-4.x-Windows\solr\build\solr-core\classes\java;C:\Jenkins\workspace\Lucene-Solr-4.x-Windows\lucene\build\analysis\common\lucene-analyzers-common-4.0-SNAPSHOT.jar;C:\Jenkins\workspace\Lucene-Solr-4.x-Windows\lucene\build\analysis\kuromoji\lucene-analyzers-kuromoji-4.0-SNAPSHOT.jar;C:\Jenkins\workspace\Lucene-Solr-4.x-Windows\lucene\build\analysis\phonetic\lucene-analyzers-phonetic-4.0-SNAPSHOT.jar;C:\Jenkins\workspace\Lucene-Solr-4.x-Windows\lucene\build\highlighter\lucene-highlighter-4.0-SNAPSHOT.jar;C:\Jenkins\workspace\Lucene-Solr-4.x-Windows\lucene\build\memory\lucene-memory-4.0-SNAPSHOT.jar;C:\Jenkins\workspace\Lucene-Solr-4.x-Windows\lucene\build\misc\lucene-misc-4.0-SNAPSHOT.jar;C:\Jenkins\workspace\Lucene-Solr-4.x-Windows\lucene\build\spatial\lucene-spatial-4.0-SNAPSHOT.jar;C:\Jenkins\workspace\Lucene-Solr-4.x-Windows\lucene\build\suggest\lucene-suggest-4.0-SNAPSHOT.jar;C:\Jenkins\workspace\Lucene-Solr-4.x-Windows\lucene\build\grouping\lucene-grouping-4.0-SNAPSHOT.jar;C:\Jenkins\workspace\Lucene-Solr-4.x-Windows\lucene\build\queries\lucene-queries-4.0-SNAPSHOT.jar;C:\Jenkins\workspace\Lucene-Solr-4.x-Windows\lucene\build\queryparser\lucene-queryparser-4.0-SNAPSHOT.jar;C:\Jenkins\workspace\Lucene-Solr-4.x-Windows\solr\lib\commons-cli-1.2.jar;C:\Jenkins\workspace\Lucene-Solr-4.x-Windows\solr\lib\commons-codec-1.6.jar;C:\Jenkins\workspace\Lucene-Solr-4.x-Windows\solr\lib\commons-fileupload-1.2.1.jar;C:\Jenkins\workspace\Lucene-Solr-4.x-Windows\solr\lib\commons-io-2.1.jar;C:\Jenkins\workspace\Lucene-Solr-4.x-Windows\solr\lib\commons-lang-2.6.jar;C:\Jenkins\workspace\Lucene-Solr-4.x-Windows\solr\lib\easymock-2.2.jar;C:\Jenkins\workspace\Lucene-Solr-4.x-Windows\solr\lib\guava-r05.jar;C:\Jenkins\workspace\Lucene-Solr-4.x-Windows\solr\lib\httpclient-4.1.3.jar;C:\Jenkins\workspace\Lucene-Solr-4.x-Windows\solr\lib\httpcore-4.1.4.jar;C:\Jenkins\workspace\Lucene-Solr-4.x-Windows\solr\lib\httpmime-4.1.3.jar;C:\Jenkins\workspace\Lucene-Solr-4.x-Windows\solr\lib\javax.servlet-api-3.0.1.jar;C:\Jenkins\workspace\Lucene-Solr-4.x-Windows\solr\lib\jcl-over-slf4j-1.6.4.jar;C:\Jenkins\workspace\Lucene-Solr-4.x-Windows\solr\lib\log4j-over-slf4j-1.6.4.jar;C:\Jenkins\workspace\Lucene-Solr-4.x-Windows\solr\lib\slf4j-api-1.6.4.jar;C:\Jenkins\workspace\Lucene-Solr-4.x-Windows\solr\lib\slf4j-jdk14-1.6.4.jar;C:\Jenkins\workspace\Lucene-Solr-4.x-Windows\solr\lib\spatial4j-0.2.jar;C:\Jenkins\workspace\Lucene-Solr-4.x-Windows\solr\lib\wstx-asl-3.2.7.jar;C:\Jenkins\workspace\Lucene-Solr-4.x-Windows\solr\lib\zookeeper-3.3.6.jar;C:\Jenkins\workspace\Lucene-Solr-4.x-Windows\solr\example\lib\jetty-continuation-8.1.2.v20120308.jar;C:\Jenkins\workspace\Lucene-Solr-4.x-Windows\solr\example\lib\jetty-deploy-8.1.2.v20120308.jar;C:\Jenkins\workspace\Lucene-Solr-4.x-Windows\solr\example\lib\jetty-http-8.1.2.v20120308.jar;C:\Jenkins\workspace\Lucene-Solr-4.x-Windows\solr\example\lib\jetty-io-8.1.2.v20120308.jar;C:\Jenkins\workspace\Lucene-Solr-4.x-Windows\solr\example\lib\jetty-jmx-8.1.2.v20120308.jar;C:\Jenkins\workspace\Lucene-Solr-4.x-Windows\solr\example\lib\jetty-security-8.1.2.v20120308.jar;C:\Jenkins\workspace\Lucene-Solr-4.x-Windows\solr\example\lib\jetty-server-8.1.2.v20120308.jar;C:\Jenkins\workspace\Lucene-Solr-4.x-Windows\solr\example\lib\jetty-servlet-8.1.2.v20120308.jar;C:\Jenkins\workspace\Lucene-Solr-4.x-Windows\solr\example\lib\jetty-util-8.1.2.v20120308.jar;C:\Jenkins\workspace\Lucene-Solr-4.x-Windows\solr\example\lib\jetty-webapp-8.1.2.v20120308.jar;C:\Jenkins\workspace\Lucene-Solr-4.x-Windows\solr\example\lib\jetty-xml-8.1.2.v20120308.jar;C:\Jenkins\workspace\Lucene-Solr-4.x-Windows\solr\example\lib\servlet-api-3.0.jar;C:\Jenkins\workspace\Lucene-Solr-4.x-Windows\solr\example\example-DIH\solr\db\lib\hsqldb-1.8.0.10.jar;C:\Jenkins\workspace\Lucene-Solr-4.x-Windows\lucene\build\core\classes\java;C:\Jenkins\workspace\Lucene-Solr-4.x-Windows\lucene\test-framework\lib\junit-4.10.jar;C:\Jenkins\workspace\Lucene-Solr-4.x-Windows\lucene\test-framework\lib\randomizedtesting-runner-2.0.0.rc5.jar;C:\Jenkins\tools\Ant\ANT_1.8.2\lib\ant-launcher.jar;C:\Users\JenkinsSlave\.ant\lib\ivy-2.2.0.jar;C:\Jenkins\tools\Ant\ANT_1.8.2\lib\ant-antlr.jar;C:\Jenkins\tools\Ant\ANT_1.8.2\lib\ant-apache-bcel.jar;C:\Jenkins\tools\Ant\ANT_1.8.2\lib\ant-apache-bsf.jar;C:\Jenkins\tools\Ant\ANT_1.8.2\lib\ant-apache-log4j.jar;C:\Jenkins\tools\Ant\ANT_1.8.2\lib\ant-apache-oro.jar;C:\Jenkins\tools\Ant\ANT_1.8.2\lib\ant-apache-regexp.jar;C:\Jenkins\tools\Ant\ANT_1.8.2\lib\ant-apache-resolver.jar;C:\Jenkins\tools\Ant\ANT_1.8.2\lib\ant-apache-xalan2.jar;C:\Jenkins\tools\Ant\ANT_1.8.2\lib\ant-commons-logging.jar;C:\Jenkins\tools\Ant\ANT_1.8.2\lib\ant-commons-net.jar;C:\Jenkins\tools\Ant\ANT_1.8.2\lib\ant-jai.jar;C:\Jenkins\tools\Ant\ANT_1.8.2\lib\ant-javamail.jar;C:\Jenkins\tools\Ant\ANT_1.8.2\lib\ant-jdepend.jar;C:\Jenkins\tools\Ant\ANT_1.8.2\lib\ant-jmf.jar;C:\Jenkins\tools\Ant\ANT_1.8.2\lib\ant-jsch.jar;C:\Jenkins\tools\Ant\ANT_1.8.2\lib\ant-junit.jar;C:\Jenkins\tools\Ant\ANT_1.8.2\lib\ant-junit4.jar;C:\Jenkins\tools\Ant\ANT_1.8.2\lib\ant-netrexx.jar;C:\Jenkins\tools\Ant\ANT_1.8.2\lib\ant-swing.jar;C:\Jenkins\tools\Ant\ANT_1.8.2\lib\ant-testutil.jar;C:\Jenkins\tools\Ant\ANT_1.8.2\lib\ant.jar;C:\Jenkins\tools\java\32bit\jdk1.6.0_33\lib\tools.jar;C:\Users\JenkinsSlave\.ivy2\cache\com.carrotsearch.randomizedtesting\junit4-ant\jars\junit4-ant-2.0.0.rc5.jar
[junit4:junit4]   2> 117 T52 oaz.Environment.logEnv Client environment:java.library.path=C:\Jenkins\tools\java\32bit\jdk1.6.0_33\jre\bin;C:\Windows\Sun\Java\bin;C:\Windows\system32;C:\Windows;C:\Jenkins\tools\java\32bit\jdk1.6.0_33\bin;C:\Program Files (x86)\GnuWin32\bin;C:\Perl\site\bin;C:\Perl\bin;C:\Windows\system32;C:\Windows;C:\Windows\System32\Wbem;C:\Windows\System32\WindowsPowerShell\v1.0\;C:\Program Files (x86)\Java\jre6\bin;C:\Program Files (x86)\Subversion\bin;.
[junit4:junit4]   2> 117 T52 oaz.Environment.logEnv Client environment:java.io.tmpdir=C:\Users\JENKIN~2\AppData\Local\Temp\
[junit4:junit4]   2> 117 T52 oaz.Environment.logEnv Client environment:java.compiler=<NA>
[junit4:junit4]   2> 117 T52 oaz.Environment.logEnv Client environment:os.name=Windows 7
[junit4:junit4]   2> 117 T52 oaz.Environment.logEnv Client environment:os.arch=x86
[junit4:junit4]   2> 117 T52 oaz.Environment.logEnv Client environment:os.version=6.1
[junit4:junit4]   2> 118 T52 oaz.Environment.logEnv Client environment:user.name=JenkinsSlave
[junit4:junit4]   2> 118 T52 oaz.Environment.logEnv Client environment:user.home=C:\Users\JenkinsSlave
[junit4:junit4]   2> 118 T52 oaz.Environment.logEnv Client environment:user.dir=C:\Jenkins\workspace\Lucene-Solr-4.x-Windows\solr\build\solr-core\test\J0
[junit4:junit4]   2> 119 T52 oaz.ZooKeeper.<init> Initiating client connection, connectString=127.0.0.1:59790 sessionTimeout=10000 watcher=org.apache.solr.common.cloud.ConnectionManager@37fd24
[junit4:junit4]   2> 140 T58 oaz.ClientCnxn$SendThread.startConnect Opening socket connection to server /127.0.0.1:59790
[junit4:junit4]   2> 142 T54 oazs.NIOServerCnxn$Factory.run Accepted socket connection from /127.0.0.1:59793
[junit4:junit4]   2> 143 T58 oaz.ClientCnxn$SendThread.primeConnection Socket connection established to 127.0.0.1/127.0.0.1:59790, initiating session
[junit4:junit4]   2> 147 T54 oazs.NIOServerCnxn.readConnectRequest Client attempting to establish new session at /127.0.0.1:59793
[junit4:junit4]   2> 151 T56 oazsp.FileTxnLog.append Creating new log file: log.1
[junit4:junit4]   2> 160 T56 oazs.NIOServerCnxn.finishSessionInit Established session 0x139327e80860000 with negotiated timeout 10000 for client /127.0.0.1:59793
[junit4:junit4]   2> 160 T58 oaz.ClientCnxn$SendThread.readConnectResult Session establishment complete on server 127.0.0.1/127.0.0.1:59790, sessionid = 0x139327e80860000, negotiated timeout = 10000
[junit4:junit4]   2> 163 T59 oascc.ConnectionManager.process Watcher org.apache.solr.common.cloud.ConnectionManager@37fd24 name:ZooKeeperConnection Watcher:127.0.0.1:59790 got event WatchedEvent state:SyncConnected type:None path:null path:null type:None
[junit4:junit4]   2> 164 T52 oascc.SolrZkClient.makePath makePath: /solr
[junit4:junit4]   2> 184 T57 oazs.PrepRequestProcessor.pRequest Processed session termination for sessionid: 0x139327e80860000
[junit4:junit4]   2> 186 T52 oaz.ZooKeeper.close Session: 0x139327e80860000 closed
[junit4:junit4]   2> 186 T59 oaz.ClientCnxn$EventThread.run EventThread shut down
[junit4:junit4]   2> 187 T52 oaz.ZooKeeper.<init> Initiating client connection, connectString=127.0.0.1:59790/solr sessionTimeout=10000 watcher=org.apache.solr.common.cloud.ConnectionManager@1cbcc56
[junit4:junit4]   2> 188 T54 oazs.NIOServerCnxn.closeSock Closed socket connection for client /127.0.0.1:59793 which had sessionid 0x139327e80860000
[junit4:junit4]   2> 189 T60 oaz.ClientCnxn$SendThread.startConnect Opening socket connection to server /127.0.0.1:59790
[junit4:junit4]   2> 190 T60 oaz.ClientCnxn$SendThread.primeConnection Socket connection established to 127.0.0.1/127.0.0.1:59790, initiating session
[junit4:junit4]   2> 190 T54 oazs.NIOServerCnxn$Factory.run Accepted socket connection from /127.0.0.1:59796
[junit4:junit4]   2> 190 T54 oazs.NIOServerCnxn.readConnectRequest Client attempting to establish new session at /127.0.0.1:59796
[junit4:junit4]   2> 192 T56 oazs.NIOServerCnxn.finishSessionInit Established session 0x139327e80860001 with negotiated timeout 10000 for client /127.0.0.1:59796
[junit4:junit4]   2> 192 T60 oaz.ClientCnxn$SendThread.readConnectResult Session establishment complete on server 127.0.0.1/127.0.0.1:59790, sessionid = 0x139327e80860001, negotiated timeout = 10000
[junit4:junit4]   2> 193 T61 oascc.ConnectionManager.process Watcher org.apache.solr.common.cloud.ConnectionManager@1cbcc56 name:ZooKeeperConnection Watcher:127.0.0.1:59790/solr got event WatchedEvent state:SyncConnected type:None path:null path:null type:None
[junit4:junit4]   2> 197 T52 oascc.SolrZkClient.makePath makePath: /collections/collection1
[junit4:junit4]   2> 204 T52 oascc.SolrZkClient.makePath makePath: /collections/collection1/shards
[junit4:junit4]   2> 209 T52 oascc.SolrZkClient.makePath makePath: /collections/control_collection
[junit4:junit4]   2> 213 T52 oascc.SolrZkClient.makePath makePath: /collections/control_collection/shards
[junit4:junit4]   2> 218 T52 oasc.AbstractZkTestCase.putConfig put C:\Jenkins\workspace\Lucene-Solr-4.x-Windows\solr\build\solr-core\test-files\solr\collection1\conf\solrconfig.xml to /configs/conf1/solrconfig.xml
[junit4:junit4]   2> 224 T52 oascc.SolrZkClient.makePath makePath: /configs/conf1/solrconfig.xml
[junit4:junit4]   2> 234 T52 oasc.AbstractZkTestCase.putConfig put C:\Jenkins\workspace\Lucene-Solr-4.x-Windows\solr\build\solr-core\test-files\solr\collection1\conf\schema.xml to /configs/conf1/schema.xml
[junit4:junit4]   2> 235 T52 oascc.SolrZkClient.makePath makePath: /configs/conf1/schema.xml
[junit4:junit4]   2> 241 T52 oasc.AbstractZkTestCase.putConfig put C:\Jenkins\workspace\Lucene-Solr-4.x-Windows\solr\build\solr-core\test-files\solr\collection1\conf\solrconfig.xml to /configs/conf1/solrconfig.xml
[junit4:junit4]   2> 241 T52 oascc.SolrZkClient.makePath makePath: /configs/conf1/solrconfig.xml
[junit4:junit4]   2> 247 T52 oasc.AbstractZkTestCase.putConfig put C:\Jenkins\workspace\Lucene-Solr-4.x-Windows\solr\build\solr-core\test-files\solr\collection1\conf\stopwords.txt to /configs/conf1/stopwords.txt
[junit4:junit4]   2> 247 T52 oascc.SolrZkClient.makePath makePath: /configs/conf1/stopwords.txt
[junit4:junit4]   2> 252 T52 oasc.AbstractZkTestCase.putConfig put C:\Jenkins\workspace\Lucene-Solr-4.x-Windows\solr\build\solr-core\test-files\solr\collection1\conf\protwords.txt to /configs/conf1/protwords.txt
[junit4:junit4]   2> 253 T52 oascc.SolrZkClient.makePath makePath: /configs/conf1/protwords.txt
[junit4:junit4]   2> 258 T52 oasc.AbstractZkTestCase.putConfig put C:\Jenkins\workspace\Lucene-Solr-4.x-Windows\solr\build\solr-core\test-files\solr\collection1\conf\currency.xml to /configs/conf1/currency.xml
[junit4:junit4]   2> 259 T52 oascc.SolrZkClient.makePath makePath: /configs/conf1/currency.xml
[junit4:junit4]   2> 263 T52 oasc.AbstractZkTestCase.putConfig put C:\Jenkins\workspace\Lucene-Solr-4.x-Windows\solr\build\solr-core\test-files\solr\collection1\conf\open-exchange-rates.json to /configs/conf1/open-exchange-rates.json
[junit4:junit4]   2> 264 T52 oascc.SolrZkClient.makePath makePath: /configs/conf1/open-exchange-rates.json
[junit4:junit4]   2> 268 T52 oasc.AbstractZkTestCase.putConfig put C:\Jenkins\workspace\Lucene-Solr-4.x-Windows\solr\build\solr-core\test-files\solr\collection1\conf\mapping-ISOLatin1Accent.txt to /configs/conf1/mapping-ISOLatin1Accent.txt
[junit4:junit4]   2> 270 T52 oascc.SolrZkClient.makePath makePath: /configs/conf1/mapping-ISOLatin1Accent.txt
[junit4:junit4]   2> 278 T52 oasc.AbstractZkTestCase.putConfig put C:\Jenkins\workspace\Lucene-Solr-4.x-Windows\solr\build\solr-core\test-files\solr\collection1\conf\old_synonyms.txt to /configs/conf1/old_synonyms.txt
[junit4:junit4]   2> 278 T52 oascc.SolrZkClient.makePath makePath: /configs/conf1/old_synonyms.txt
[junit4:junit4]   2> 285 T52 oasc.AbstractZkTestCase.putConfig put C:\Jenkins\workspace\Lucene-Solr-4.x-Windows\solr\build\solr-core\test-files\solr\collection1\conf\synonyms.txt to /configs/conf1/synonyms.txt
[junit4:junit4]   2> 286 T52 oascc.SolrZkClient.makePath makePath: /configs/conf1/synonyms.txt
[junit4:junit4]   2> 292 T57 oazs.PrepRequestProcessor.pRequest Processed session termination for sessionid: 0x139327e80860001
[junit4:junit4]   2> 294 T54 oazs.NIOServerCnxn.closeSock Closed socket connection for client /127.0.0.1:59796 which had sessionid 0x139327e80860001
[junit4:junit4]   2> 294 T61 oaz.ClientCnxn$EventThread.run EventThread shut down
[junit4:junit4]   2> 294 T52 oaz.ZooKeeper.close Session: 0x139327e80860001 closed
[junit4:junit4]   2> 295 T52 oas.SolrTestCaseJ4.initCore ####initCore
[junit4:junit4]   2> 296 T52 oasc.SolrResourceLoader.<init> new SolrResourceLoader for directory: 'C:\Jenkins\workspace\Lucene-Solr-4.x-Windows\solr\build\solr-core\test-files\solr\collection1\'
[junit4:junit4]   2> 297 T52 oasc.SolrResourceLoader.replaceClassLoader Adding 'file:/C:/Jenkins/workspace/Lucene-Solr-4.x-Windows/solr/build/solr-core/test-files/solr/collection1/lib/classes/' to classloader
[junit4:junit4]   2> 297 T52 oasc.SolrResourceLoader.replaceClassLoader Adding 'file:/C:/Jenkins/workspace/Lucene-Solr-4.x-Windows/solr/build/solr-core/test-files/solr/collection1/lib/README' to classloader
[junit4:junit4]   2> 357 T52 oasc.SolrConfig.<init> Using Lucene MatchVersion: LUCENE_40
[junit4:junit4]   2> 441 T52 oasc.SolrConfig.<init> Loaded SolrConfig: solrconfig.xml
[junit4:junit4]   2> 442 T52 oass.IndexSchema.readSchema Reading Solr Schema
[junit4:junit4]   2> 455 T52 oass.IndexSchema.readSchema Schema name=test
[junit4:junit4]   2> 1200 T52 oass.OpenExchangeRatesOrgProvider.init Initialized with rates=open-exchange-rates.json, refreshInterval=1440.
[junit4:junit4]   2> 1210 T52 oass.IndexSchema.readSchema default search field in schema is text
[junit4:junit4]   2> 1214 T52 oass.IndexSchema.readSchema unique key field: id
[junit4:junit4]   2> 1226 T52 oass.FileExchangeRateProvider.reload Reloading exchange rates from file currency.xml
[junit4:junit4]   2> 1230 T52 oass.FileExchangeRateProvider.reload Reloading exchange rates from file currency.xml
[junit4:junit4]   2> 1233 T52 oass.OpenExchangeRatesOrgProvider.reload Reloading exchange rates from open-exchange-rates.json
[junit4:junit4]   2> 1235 T52 oass.OpenExchangeRatesOrgProvider.reload Reloading exchange rates from open-exchange-rates.json
[junit4:junit4]   2> 1237 T52 oasc.SolrResourceLoader.locateSolrHome JNDI not configured for solr (NoInitialContextEx)
[junit4:junit4]   2> 1237 T52 oasc.SolrResourceLoader.locateSolrHome using system property solr.solr.home: C:\Jenkins\workspace\Lucene-Solr-4.x-Windows\solr\build\solr-core\test-files\solr
[junit4:junit4]   2> 1237 T52 oasc.SolrResourceLoader.<init> new SolrResourceLoader for directory: 'C:\Jenkins\workspace\Lucene-Solr-4.x-Windows\solr\build\solr-core\test-files\solr\'
[junit4:junit4]   2> 1244 T52 oasc.CoreContainer.<init> New CoreContainer 28693818
[junit4:junit4]   2> 1244 T52 oasc.CoreContainer.initZooKeeper Zookeeper client=127.0.0.1:59790/solr
[junit4:junit4]   2> 1262 T52 oaz.ZooKeeper.<init> Initiating client connection, connectString=127.0.0.1:59790/solr sessionTimeout=10000 watcher=org.apache.solr.common.cloud.ConnectionManager@19d44df
[junit4:junit4]   2> 1263 T62 oaz.ClientCnxn$SendThread.startConnect Opening socket connection to server /127.0.0.1:59790
[junit4:junit4]   2> 1267 T62 oaz.ClientCnxn$SendThread.primeConnection Socket connection established to 127.0.0.1/127.0.0.1:59790, initiating session
[junit4:junit4]   2> 1267 T54 oazs.NIOServerCnxn$Factory.run Accepted socket connection from /127.0.0.1:59799
[junit4:junit4]   2> 1267 T54 oazs.NIOServerCnxn.readConnectRequest Client attempting to establish new session at /127.0.0.1:59799
[junit4:junit4]   2> 1271 T62 oaz.ClientCnxn$SendThread.readConnectResult Session establishment complete on server 127.0.0.1/127.0.0.1:59790, sessionid = 0x139327e80860002, negotiated timeout = 10000
[junit4:junit4]   2> 1272 T56 oazs.NIOServerCnxn.finishSessionInit Established session 0x139327e80860002 with negotiated timeout 10000 for client /127.0.0.1:59799
[junit4:junit4]   2> 1272 T63 oascc.ConnectionManager.process Watcher org.apache.solr.common.cloud.ConnectionManager@19d44df name:ZooKeeperConnection Watcher:127.0.0.1:59790/solr got event WatchedEvent state:SyncConnected type:None path:null path:null type:None
[junit4:junit4]   2> 1280 T57 oazs.PrepRequestProcessor.pRequest Got user-level KeeperException when processing sessionid:0x139327e80860002 type:create cxid:0x2 zxid:0xfffffffffffffffe txntype:unknown reqpath:n/a Error Path:/solr/overseer Error:KeeperErrorCode = NodeExists for /solr/overseer
[junit4:junit4]   2> 1285 T52 oascc.SolrZkClient.makePath makePath: /live_nodes
[junit4:junit4]   2> 1290 T52 oasc.ZkController.createEphemeralLiveNode Register node as live in ZooKeeper:/live_nodes/JenkinsSlave-PC:null_solr
[junit4:junit4]   2> 1295 T57 oazs.PrepRequestProcessor.pRequest Got user-level KeeperException when processing sessionid:0x139327e80860002 type:delete cxid:0x7 zxid:0xfffffffffffffffe txntype:unknown reqpath:n/a Error Path:/solr/live_nodes/JenkinsSlave-PC:null_solr Error:KeeperErrorCode = NoNode for /solr/live_nodes/JenkinsSlave-PC:null_solr
[junit4:junit4]   2> 1296 T52 oascc.SolrZkClient.makePath makePath: /live_nodes/JenkinsSlave-PC:null_solr
[junit4:junit4]   2> 1303 T52 oashc.HttpShardHandlerFactory.getParameter Setting socketTimeout to: 0
[junit4:junit4]   2> 1303 T52 oashc.HttpShardHandlerFactory.getParameter Setting urlScheme to: http://
[junit4:junit4]   2> 1303 T52 oashc.HttpShardHandlerFactory.getParameter Setting connTimeout to: 0
[junit4:junit4]   2> 1303 T52 oashc.HttpShardHandlerFactory.getParameter Setting maxConnectionsPerHost to: 20
[junit4:junit4]   2> 1303 T52 oashc.HttpShardHandlerFactory.getParameter Setting corePoolSize to: 0
[junit4:junit4]   2> 1303 T52 oashc.HttpShardHandlerFactory.getParameter Setting maximumPoolSize to: 2147483647
[junit4:junit4]   2> 1304 T52 oashc.HttpShardHandlerFactory.getParameter Setting maxThreadIdleTime to: 5
[junit4:junit4]   2> 1304 T52 oashc.HttpShardHandlerFactory.getParameter Setting sizeOfQueue to: -1
[junit4:junit4]   2> 1304 T52 oashc.HttpShardHandlerFactory.getParameter Setting fairnessPolicy to: false
[junit4:junit4]   2> 1304 T52 oascsi.HttpClientUtil.createClient Creating new http client, config:maxConnectionsPerHost=20&maxConnections=10000&socketTimeout=0&connTimeout=0&retry=false
[junit4:junit4]   2> 1311 T52 oascc.SolrZkClient.makePath makePath: /overseer_elect/election
[junit4:junit4]   2> 1327 T52 oascc.SolrZkClient.makePath makePath: /overseer_elect/leader
[junit4:junit4]   2> 1332 T52 oasc.Overseer.start Overseer (id=88157186613968898-JenkinsSlave-PC:null_solr-n_0000000000) starting
[junit4:junit4]   2> 1332 T57 oazs.PrepRequestProcessor.pRequest Got user-level KeeperException when processing sessionid:0x139327e80860002 type:create cxid:0x19 zxid:0xfffffffffffffffe txntype:unknown reqpath:n/a Error Path:/solr/overseer Error:KeeperErrorCode = NodeExists for /solr/overseer
[junit4:junit4]   2> 1341 T57 oazs.PrepRequestProcessor.pRequest Got user-level KeeperException when processing sessionid:0x139327e80860002 type:create cxid:0x1a zxid:0xfffffffffffffffe txntype:unknown reqpath:n/a Error Path:/solr/overseer Error:KeeperErrorCode = NodeExists for /solr/overseer
[junit4:junit4]   2> 1343 T57 oazs.PrepRequestProcessor.pRequest Got user-level KeeperException when processing sessionid:0x139327e80860002 type:create cxid:0x1b zxid:0xfffffffffffffffe txntype:unknown reqpath:n/a Error Path:/solr/overseer Error:KeeperErrorCode = NodeExists for /solr/overseer
[junit4:junit4]   2> 1347 T57 oazs.PrepRequestProcessor.pRequest Got user-level KeeperException when processing sessionid:0x139327e80860002 type:create cxid:0x1c zxid:0xfffffffffffffffe txntype:unknown reqpath:n/a Error Path:/solr/overseer Error:KeeperErrorCode = NodeExists for /solr/overseer
[junit4:junit4]   2> 1354 T65 oasc.OverseerCollectionProcessor.run Process current queue of collection creations
[junit4:junit4]   2> 1361 T52 oascc.SolrZkClient.makePath makePath: /clusterstate.json
[junit4:junit4]   2> 1371 T52 oascc.ZkStateReader.createClusterStateWatchersAndUpdate Updating cluster state from ZooKeeper... 
[junit4:junit4]   2> 1383 T52 oasc.SolrCore.<init> [collection1] Opening new SolrCore at C:\Jenkins\workspace\Lucene-Solr-4.x-Windows\solr\build\solr-core\test-files\solr\collection1\, dataDir=C:\Jenkins\workspace\Lucene-Solr-4.x-Windows\solr\build\solr-core\test\J0\.\solrtest-BasicZkTest-1345171914812\
[junit4:junit4]   2> 1383 T52 oasc.JmxMonitoredMap.<init> JMX monitoring is enabled. Adding Solr mbeans to JMX Server: com.sun.jmx.mbeanserver.JmxMBeanServer@eb67e8
[junit4:junit4]   2> 1383 T52 oasc.SolrCore.getNewIndexDir WARNING New index directory detected: old=null new=C:\Jenkins\workspace\Lucene-Solr-4.x-Windows\solr\build\solr-core\test\J0\.\solrtest-BasicZkTest-1345171914812\index/
[junit4:junit4]   2> 1384 T52 oasc.SolrCore.initIndex WARNING [collection1] Solr index directory 'C:\Jenkins\workspace\Lucene-Solr-4.x-Windows\solr\build\solr-core\test\J0\.\solrtest-BasicZkTest-1345171914812\index' doesn't exist. Creating new index...
[junit4:junit4]   2> 1385 T52 oasc.CachingDirectoryFactory.get return new directory for C:\Jenkins\workspace\Lucene-Solr-4.x-Windows\solr\build\solr-core\test\J0\.\solrtest-BasicZkTest-1345171914812\index forceNew:false
[junit4:junit4]   2> 1387 T52 oasc.SolrDeletionPolicy.onCommit SolrDeletionPolicy.onCommit: commits:num=1
[junit4:junit4]   2> 		commit{dir=MockDirWrapper(org.apache.lucene.store.RAMDirectory@1cadba6 lockFactory=org.apache.lucene.store.NativeFSLockFactory@f18070),segFN=segments_1,generation=1,filenames=[segments_1]
[junit4:junit4]   2> 1387 T52 oasc.SolrDeletionPolicy.updateCommits newest commit = 1
[junit4:junit4]   2> 1388 T52 oasc.SolrCore.initWriters created xml: solr.XMLResponseWriter
[junit4:junit4]   2> 1390 T52 oasup.UpdateRequestProcessorChain.init inserting DistributedUpdateProcessorFactory into updateRequestProcessorChain "dedupe"
[junit4:junit4]   2> 1390 T52 oasup.UpdateRequestProcessorChain.init inserting DistributedUpdateProcessorFactory into updateRequestProcessorChain "dedupe-allfields"
[junit4:junit4]   2> 1390 T52 oasup.UpdateRequestProcessorChain.init inserting DistributedUpdateProcessorFactory into updateRequestProcessorChain "stored_sig"
[junit4:junit4]   2> 1390 T52 oasup.UpdateRequestProcessorChain.init inserting DistributedUpdateProcessorFactory into updateRequestProcessorChain "uniq-fields"
[junit4:junit4]   2> 1391 T52 oasup.UpdateRequestProcessorChain.init inserting DistributedUpdateProcessorFactory into updateRequestProcessorChain "distrib-dup-test-chain-implicit"
[junit4:junit4]   2> 1391 T52 oasc.RequestHandlers.initHandlersFromConfig adding lazy requestHandler: solr.ReplicationHandler
[junit4:junit4]   2> 1391 T52 oasc.RequestHandlers.initHandlersFromConfig created /replication: solr.ReplicationHandler
[junit4:junit4]   2> 1392 T52 oasc.RequestHandlers.initHandlersFromConfig created standard: solr.StandardRequestHandler
[junit4:junit4]   2> 1392 T52 oasc.RequestHandlers.initHandlersFromConfig created /get: solr.RealTimeGetHandler
[junit4:junit4]   2> 1396 T52 oasc.RequestHandlers.initHandlersFromConfig created dismax: solr.SearchHandler
[junit4:junit4]   2> 1396 T52 oasc.RequestHandlers.initHandlersFromConfig created mock: org.apache.solr.core.MockQuerySenderListenerReqHandler
[junit4:junit4]   2> 1397 T52 oasc.RequestHandlers.initHandlersFromConfig created /admin/: org.apache.solr.handler.admin.AdminHandlers
[junit4:junit4]   2> 1397 T52 oasc.RequestHandlers.initHandlersFromConfig created defaults: solr.StandardRequestHandler
[junit4:junit4]   2> 1397 T52 oasc.RequestHandlers.initHandlersFromConfig adding lazy requestHandler: solr.StandardRequestHandler
[junit4:junit4]   2> 1397 T52 oasc.RequestHandlers.initHandlersFromConfig created lazy: solr.StandardRequestHandler
[junit4:junit4]   2> 1397 T52 oasc.RequestHandlers.initHandlersFromConfig created /update: solr.UpdateRequestHandler
[junit4:junit4]   2> 1398 T52 oasc.RequestHandlers.initHandlersFromConfig created /terms: org.apache.solr.handler.component.SearchHandler
[junit4:junit4]   2> 1398 T52 oasc.RequestHandlers.initHandlersFromConfig created spellCheckCompRH: org.apache.solr.handler.component.SearchHandler
[junit4:junit4]   2> 1399 T52 oasc.RequestHandlers.initHandlersFromConfig created spellCheckCompRH_Direct: org.apache.solr.handler.component.SearchHandler
[junit4:junit4]   2> 1399 T52 oasc.RequestHandlers.initHandlersFromConfig created spellCheckWithWordbreak: org.apache.solr.handler.component.SearchHandler
[junit4:junit4]   2> 1400 T52 oasc.RequestHandlers.initHandlersFromConfig created spellCheckWithWordbreak_Direct: org.apache.solr.handler.component.SearchHandler
[junit4:junit4]   2> 1400 T52 oasc.RequestHandlers.initHandlersFromConfig created spellCheckCompRH1: org.apache.solr.handler.component.SearchHandler
[junit4:junit4]   2> 1502 T52 oasc.RequestHandlers.initHandlersFromConfig created tvrh: org.apache.solr.handler.component.SearchHandler
[junit4:junit4]   2> 1503 T52 oasc.RequestHandlers.initHandlersFromConfig created /mlt: solr.MoreLikeThisHandler
[junit4:junit4]   2> 1503 T52 oasc.RequestHandlers.initHandlersFromConfig created /debug/dump: solr.DumpRequestHandler
[junit4:junit4]   2> 1507 T52 oashl.XMLLoader.init xsltCacheLifetimeSeconds=60
[junit4:junit4]   2> 1510 T52 oasc.SolrCore.initDeprecatedSupport WARNING solrconfig.xml uses deprecated <admin/gettableFiles>, Please update your config to use the ShowFileRequestHandler.
[junit4:junit4]   2> 1513 T52 oasc.SolrCore.initDeprecatedSupport WARNING adding ShowFileRequestHandler with hidden files: [THROW.ERROR.ON.ADD.UPDATEPROCESSOR.JS, SOLRCONFIG-HIGHLIGHT.XML, SCHEMA-REQUIRED-FIELDS.XML, TRIVIAL.UPDATEPROCESSOR1.JS, BAD-SCHEMA-DUP-DYNAMICFIELD.XML, SCHEMA-MINIMAL.XML, SCHEMA-REPLICATION2.XML, SOLRCONFIG-CACHING.XML, SOLRCONFIG-REPEATER.XML, BAD-SCHEMA-NONTEXT-ANALYZER.XML, CURRENCY.XML, SOLRCONFIG-MERGEPOLICY.XML, SOLRCONFIG-TLOG.XML, SOLRCONFIG-MASTER.XML, BAD-SCHEMA-UNIQUEKEY-MULTIVALUED.XML, SCHEMA11.XML, SOLRCONFIG-BASIC.XML, DA_COMPOUNDDICTIONARY.TXT, MISSLEADING.EXTENSION.UPDATEPROCESSOR.JS.TXT, SCHEMA-COPYFIELD-TEST.XML, SOLRCONFIG-SLAVE.XML, ELEVATE.XML, SOLRCONFIG-PROPINJECT-INDEXDEFAULT.XML, TRIVIAL.UPDATEPROCESSOR0.JS, BAD-SOLRCONFIG-BOGUS-SCRIPTENGINE-NAME.XML, SCHEMA-IB.XML, SCHEMA-CHARFILTERS.XML, SOLRCONFIG-QUERYSENDER.XML, DA_UTF8.XML, SCHEMA-REPLICATION1.XML, CONDITIONAL.UPDATEPROCESSOR.JS, MISSING.FUNCTIONS.UPDATEPROCESSOR.JS, HYPHENATION.DTD, SOLRCONFIG-ENABLEPLUGIN.XML, STEMDICT.TXT, SCHEMA-PHRASESUGGEST.XML, HUNSPELL-TEST.AFF, STOPTYPES-1.TXT, STOPWORDSWRONGENCODING.TXT, SCHEMA-NUMERIC.XML, SOLRCONFIG-TRANSFORMERS.XML, SOLRCONFIG-PROPINJECT.XML, BAD-SCHEMA-NOT-INDEXED-BUT-TF.XML, SOLRCONFIG-SIMPLELOCK.XML, WDFTYPES.TXT, STOPTYPES-2.TXT, SCHEMA-REVERSED.XML, SOLRCONFIG-SPELLCHECKCOMPONENT.XML, SCHEMA-DFR.XML, SOLRCONFIG-PHRASESUGGEST.XML, BAD-SCHEMA-NOT-INDEXED-BUT-POS.XML, KEEP-1.TXT, OPEN-EXCHANGE-RATES.JSON, STOPWITHBOM.TXT, SOLRCONFIG-SPELLCHECKER.XML, SCHEMA-BINARYFIELD.XML, SOLRCONFIG-UPDATE-PROCESSOR-CHAINS.XML, BAD-SCHEMA-OMIT-TF-BUT-NOT-POS.XML, BAD-SCHEMA-DUP-FIELDTYPE.XML, SOLRCONFIG-MASTER1.XML, SYNONYMS.TXT, SCHEMA.XML, SCHEMA_CODEC.XML, SOLRCONFIG-SOLR-749.XML, SOLRCONFIG-MASTER1-KEEPONEBACKUP.XML, STOP-2.TXT, SOLRCONFIG-FUNCTIONQUERY.XML, SOLRCONFIG-TERMINDEX.XML, SCHEMA-LMDIRICHLET.XML, SOLRCONFIG-ELEVATE.XML, STOPWORDS.TXT, SCHEMA-FOLDING.XML, SCHEMA-STOP-KEEP.XML, BAD-SCHEMA-NOT-INDEXED-BUT-NORMS.XML, SOLRCONFIG-SOLCOREPROPERTIES.XML, STOP-1.TXT, SOLRCONFIG-MASTER2.XML, SCHEMA-SPELLCHECKER.XML, SOLRCONFIG-LAZYWRITER.XML, SCHEMA-LUCENEMATCHVERSION.XML, FRENCHARTICLES.TXT, BAD-MP-SOLRCONFIG.XML, SCHEMA15.XML, SOLRCONFIG-REQHANDLER.INCL, SCHEMASURROUND.XML, SCHEMA-COLLATEFILTER.XML, SOLRCONFIG-MASTER3.XML, HUNSPELL-TEST.DIC, SOLRCONFIG-XINCLUDE.XML, BAD-SCHEMA-CODEC-GLOBAL-VS-FT-MISMATCH.XML, SOLRCONFIG-SLAVE1.XML, SOLRCONFIG-DELPOLICY1.XML, SCHEMA-SIM.XML, SCHEMA-COLLATE.XML, STOP-SNOWBALL.TXT, BAD-SCHEMA-SIM-GLOBAL-VS-FT-MISMATCH.XML, PROTWORDS.TXT, SCHEMA-TRIE.XML, SOLRCONFIG_CODEC.XML, BAD-SOLRCONFIG-INVALID-SCRIPTFILE.XML, SCHEMA-TFIDF.XML, SOLRCONFIG-SCRIPT-UPDATEPROCESSOR.XML, SCHEMA-LMJELINEKMERCER.XML, PHRASESUGGEST.TXT, BAD-SOLRCONFIG-MISSING-SCRIPTFILE.XML, SOLRCONFIG-BASIC-LUCENEVERSION31.XML, BAD-SCHEMA-UNIQUEKEY-USES-DEFAULT.XML, OLD_SYNONYMS.TXT, SOLRCONFIG-DELPOLICY2.XML, XSLT, SOLRCONFIG-NATIVELOCK.XML, BAD-SCHEMA-DUP-FIELD.XML, SOLRCONFIG-NOCACHE.XML, SCHEMA-BM25.XML, ADDFIELDS.UPDATEPROCESSOR.JS, SOLRCONFIG-ALTDIRECTORY.XML, SOLRCONFIG-QUERYSENDER-NOQUERY.XML, COMPOUNDDICTIONARY.TXT, SOLRCONFIG_PERF.XML, BAD-SCHEMA-ANALYZER-CLASS-AND-NESTED.XML, SCHEMA-NOT-REQUIRED-UNIQUE-KEY.XML, KEEP-2.TXT, BAD-SCHEMA-UNIQUEKEY-IS-COPYFIELD-DEST.XML, SCHEMA12.XML, MAPPING-ISOLATIN1ACCENT.TXT, BAD_SOLRCONFIG.XML, BAD-SCHEMA-EXTERNAL-FILEFIELD.XML]
[junit4:junit4]   2> 1504 T64 oasc.Overseer$ClusterStateUpdater.run Starting to work on the main queue
[junit4:junit4]   2> 1526 T52 oass.SolrIndexSearcher.<init> Opening Searcher@1cd0037 main
[junit4:junit4]   2> 1526 T52 oass.SolrIndexSearcher.getIndexDir WARNING WARNING: Directory impl does not support setting indexDir: org.apache.lucene.store.MockDirectoryWrapper
[junit4:junit4]   2> 1527 T52 oasu.CommitTracker.<init> Hard AutoCommit: disabled
[junit4:junit4]   2> 1527 T52 oasu.CommitTracker.<init> Soft AutoCommit: disabled
[junit4:junit4]   2> 1528 T52 oashc.SpellCheckComponent.inform Initializing spell checkers
[junit4:junit4]   2> 1543 T52 oass.DirectSolrSpellChecker.init init: {name=direct,classname=DirectSolrSpellChecker,field=lowerfilt,minQueryLength=3}
[junit4:junit4]   2> 1591 T66 oasc.SolrCore.registerSearcher [collection1] Registered new searcher Searcher@1cd0037 main{StandardDirectoryReader(segments_1:1)}
[junit4:junit4]   2> 1593 T57 oazs.PrepRequestProcessor.pRequest Got user-level KeeperException when processing sessionid:0x139327e80860002 type:create cxid:0x2d zxid:0xfffffffffffffffe txntype:unknown reqpath:n/a Error Path:/solr/overseer/queue Error:KeeperErrorCode = NoNode for /solr/overseer/queue
[junit4:junit4]   2> 2028 T64 oascc.ZkStateReader.updateClusterState Updating cloud state from ZooKeeper... 
[junit4:junit4]   2> 2036 T57 oazs.PrepRequestProcessor.pRequest Got user-level KeeperException when processing sessionid:0x139327e80860002 type:create cxid:0x38 zxid:0xfffffffffffffffe txntype:unknown reqpath:n/a Error Path:/solr/overseer/queue-work Error:KeeperErrorCode = NoNode for /solr/overseer/queue-work
[junit4:junit4]   2> 2045 T63 oascc.ZkStateReader$2.process A cluster state change has occurred - updating...
[junit4:junit4]   2> 2089 T52 oasc.CoreContainer.register registering core: collection1
[junit4:junit4]   2> 2089 T52 oasc.ZkController.register Register shard - core:collection1 address:http://JenkinsSlave-PC:null/solr shardId:shard1
[junit4:junit4]   2> 2092 T52 oascsi.HttpClientUtil.createClient Creating new http client, config:maxConnections=10000&maxConnectionsPerHost=20&connTimeout=30000&socketTimeout=30000&retry=false
[junit4:junit4]   2> 2098 T52 oascc.SolrZkClient.makePath makePath: /collections/collection1/leader_elect/shard1/election
[junit4:junit4]   2> 2111 T52 oasc.ShardLeaderElectionContext.runLeaderProcess I am the new leader: http://JenkinsSlave-PC:null/solr/collection1/
[junit4:junit4]   2> 2113 T52 oascc.SolrZkClient.makePath makePath: /collections/collection1/leaders/shard1
[junit4:junit4]   2> 2122 T57 oazs.PrepRequestProcessor.pRequest Got user-level KeeperException when processing sessionid:0x139327e80860002 type:create cxid:0x56 zxid:0xfffffffffffffffe txntype:unknown reqpath:n/a Error Path:/solr/overseer Error:KeeperErrorCode = NodeExists for /solr/overseer
[junit4:junit4]   2> 2541 T64 oascc.ZkStateReader.updateClusterState Updating cloud state from ZooKeeper... 
[junit4:junit4]   2> 2562 T63 oascc.ZkStateReader$2.process A cluster state change has occurred - updating...
[junit4:junit4]   2> 2575 T52 oasc.ZkController.register We are http://JenkinsSlave-PC:null/solr/collection1/ and leader is http://JenkinsSlave-PC:null/solr/collection1/
[junit4:junit4]   2> 2575 T52 oasc.ZkController.checkRecovery WARNING Skipping recovery according to sys prop solrcloud.skip.autorecovery
[junit4:junit4]   2> 2578 T52 oascc.ZkStateReader.updateClusterState Updating cloud state from ZooKeeper... 
[junit4:junit4]   2> 2580 T52 oas.SolrTestCaseJ4.initCore ####initCore end
[junit4:junit4]   1> azt beforeclass
[junit4:junit4]   2> 2584 T52 oas.SolrTestCaseJ4.setUp ###Starting testBasic
[junit4:junit4]   2> 2585 T52 oasc.SolrDeletionPolicy.onInit SolrDeletionPolicy.onInit: commits:num=1
[junit4:junit4]   2> 		commit{dir=MockDirWrapper(org.apache.lucene.store.RAMDirectory@1cadba6 lockFactory=org.apache.lucene.store.NativeFSLockFactory@f18070),segFN=segments_1,generation=1,filenames=[segments_1]
[junit4:junit4]   2> 2585 T52 oasc.SolrDeletionPolicy.updateCommits newest commit = 1
[junit4:junit4]   2> ASYNC  NEW_CORE C4 name=collection1 org.apache.solr.core.SolrCore@19fc33d url=http://JenkinsSlave-PC:null/solr/collection1 node=JenkinsSlave-PC:null_solr
[junit4:junit4]   2> 2599 T52 C4 Pnull REQ [collection1] webapp=null path=null params={start=0&q=qlkciyopsbgzyvkylsjhchghjrdf&qt=standard&rows=20&version=2.2} hits=0 status=0 QTime=14 
[junit4:junit4]   2> 2607 T52 C4 Pnull UPDATE [collection1] webapp=null path=null params={} {delete=[42]} 0 1
[junit4:junit4]   2> 2615 T52 C4 Pnull UPDATE [collection1] webapp=null path=null params={} {add=[42]} 0 1
[junit4:junit4]   2> 2625 T52 C4 Pnull oasu.DirectUpdateHandler2.commit start commit{flags=0,_version_=0,optimize=false,openSearcher=true,waitSearcher=true,expungeDeletes=false,softCommit=false}
[junit4:junit4]   2> 2628 T52 C4 Pnull oasc.SolrDeletionPolicy.onCommit SolrDeletionPolicy.onCommit: commits:num=2
[junit4:junit4]   2> 		commit{dir=MockDirWrapper(org.apache.lucene.store.RAMDirectory@1cadba6 lockFactory=org.apache.lucene.store.NativeFSLockFactory@f18070),segFN=segments_1,generation=1,filenames=[segments_1]
[junit4:junit4]   2> 		commit{dir=MockDirWrapper(org.apache.lucene.store.RAMDirectory@1cadba6 lockFactory=org.apache.lucene.store.NativeFSLockFactory@f18070),segFN=segments_2,generation=2,filenames=[_0.fnm, _0_Pulsing40_0.tim, _0_Memory_0.ram, _0_nrm.cfs, _0_Direct_0.frq, _0_Pulsing40_0.prx, _0_Memory_1.ram, _0_Pulsing40_0.frq, _0_nrm.cfe, segments_2, _0_Pulsing40_0.tip, _0.fdx, _0_Direct_0.tip, _0_Direct_0.prx, _0.si, _0_Direct_0.tim, _0.fdt]
[junit4:junit4]   2> 2628 T52 C4 Pnull oasc.SolrDeletionPolicy.updateCommits newest commit = 2
[junit4:junit4]   2> 2630 T52 C4 Pnull oass.SolrIndexSearcher.<init> Opening Searcher@7abaab main
[junit4:junit4]   2> 2631 T52 C4 Pnull oass.SolrIndexSearcher.getIndexDir WARNING WARNING: Directory impl does not support setting indexDir: org.apache.lucene.store.MockDirectoryWrapper
[junit4:junit4]   2> 2632 T52 C4 Pnull oasu.DirectUpdateHandler2.commit end_commit_flush
[junit4:junit4]   2> 2633 T66 oasc.SolrCore.registerSearcher [collection1] Registered new searcher Searcher@7abaab main{StandardDirectoryReader(segments_2:3 _0(4.0.0.2):C1)}
[junit4:junit4]   2> 2642 T52 C4 Pnull UPDATE [collection1] webapp=null path=null params={} {commit=} 0 17
[junit4:junit4]   2> 2649 T52 C4 Pnull REQ [collection1] webapp=null path=null params={start=0&q=id:42+AND+val_s:aa\;bb&qt=standard&rows=20&version=2.2} hits=1 status=0 QTime=4 
[junit4:junit4]   2> 2653 T52 C4 Pnull REQ [collection1] webapp=null path=null params={start=0&q=id:42+AND+val_s:"aa;bb"&qt=standard&rows=20&version=2.2} hits=1 status=0 QTime=0 
[junit4:junit4]   2> 2658 T52 C4 Pnull REQ [collection1] webapp=null path=null params={start=0&q=id:42+AND+val_s:aa&qt=standard&rows=20&version=2.2} hits=0 status=0 QTime=0 
[junit4:junit4]   2> 2666 T52 C4 Pnull UPDATE [collection1] webapp=null path=null params={} {delete=[42]} 0 1
[junit4:junit4]   2> 2673 T52 C4 Pnull oasu.DirectUpdateHandler2.commit start commit{flags=0,_version_=0,optimize=false,openSearcher=true,waitSearcher=true,expungeDeletes=false,softCommit=false}
[junit4:junit4]   2> 2673 T52 C4 Pnull oasc.SolrDeletionPolicy.onCommit SolrDeletionPolicy.onCommit: commits:num=2
[junit4:junit4]   2> 		commit{dir=MockDirWrapper(org.apache.lucene.store.RAMDirectory@1cadba6 lockFactory=org.apache.lucene.store.NativeFSLockFactory@f18070),segFN=segments_2,generation=2,filenames=[_0.fnm, _0_Pulsing40_0.tim, _0_Memory_0.ram, _0_nrm.cfs, _0_Direct_0.frq, _0_Pulsing40_0.prx, _0_Memory_1.ram, _0_Pulsing40_0.frq, _0_nrm.cfe, segments_2, _0_Pulsing40_0.tip, _0.fdx, _0_Direct_0.tip, _0_Direct_0.prx, _0.si, _0_Direct_0.tim, _0.fdt]
[junit4:junit4]   2> 		commit{dir=MockDirWrapper(org.apache.lucene.store.RAMDirectory@1cadba6 lockFactory=org.apache.lucene.store.NativeFSLockFactory@f18070),segFN=segments_3,generation=3,filenames=[segments_3]
[junit4:junit4]   2> 2674 T52 C4 Pnull oasc.SolrDeletionPolicy.updateCommits newest commit = 3
[junit4:junit4]   2> 2674 T52 C4 Pnull oass.SolrIndexSearcher.<init> Opening Searcher@1b2c86e main
[junit4:junit4]   2> 2674 T52 C4 Pnull oass.SolrIndexSearcher.getIndexDir WARNING WARNING: Directory impl does not support setting indexDir: org.apache.lucene.store.MockDirectoryWrapper
[junit4:junit4]   2> 2675 T52 C4 Pnull oasu.DirectUpdateHandler2.commit end_commit_flush
[junit4:junit4]   2> 2677 T66 oasc.SolrCore.registerSearcher [collection1] Registered new searcher Searcher@1b2c86e main{StandardDirectoryReader(segments_3:5)}
[junit4:junit4]   2> 2678 T52 C4 Pnull UPDATE [collection1] webapp=null path=null params={} {commit=} 0 5
[junit4:junit4]   2> 2681 T52 C4 Pnull REQ [collection1] webapp=null path=null params={start=0&q=id:42&qt=standard&rows=20&version=2.2} hits=0 status=0 QTime=2 
[junit4:junit4]   2> 2689 T52 C4 Pnull UPDATE [collection1] webapp=null path=null params={} {add=[42]} 0 1
[junit4:junit4]   2> 2696 T52 C4 Pnull UPDATE [collection1] webapp=null path=null params={} {add=[42]} 0 1
[junit4:junit4]   2> 2707 T52 C4 Pnull oasu.DirectUpdateHandler2.commit start commit{flags=0,_version_=0,optimize=false,openSearcher=true,waitSearcher=true,expungeDeletes=false,softCommit=false}
[junit4:junit4]   2> 2711 T52 C4 Pnull oasc.SolrDeletionPolicy.onCommit SolrDeletionPolicy.onCommit: commits:num=2
[junit4:junit4]   2> 		commit{dir=MockDirWrapper(org.apache.lucene.store.RAMDirectory@1cadba6 lockFactory=org.apache.lucene.store.NativeFSLockFactory@f18070),segFN=segments_3,generation=3,filenames=[segments_3]
[junit4:junit4]   2> 		commit{dir=MockDirWrapper(org.apache.lucene.store.RAMDirectory@1cadba6 lockFactory=org.apache.lucene.store.NativeFSLockFactory@f18070),segFN=segments_4,generation=4,filenames=[_1_nrm.cfs, _1_Pulsing40_0.tip, _1_Memory_1.ram, _1_Pulsing40_0.tim, _1_1.del, _1.fnm, _1_Direct_0.prx, _1_nrm.cfe, _1_Pulsing40_0.frq, _1.fdx, _1_Memory_0.ram, _1.fdt, _1.si, _1_Pulsing40_0.prx, _1_Direct_0.tim, _1_Direct_0.tip, _1_Direct_0.frq, segments_4]
[junit4:junit4]   2> 2712 T52 C4 Pnull oasc.SolrDeletionPolicy.updateCommits newest commit = 4
[junit4:junit4]   2> 2714 T52 C4 Pnull oass.SolrIndexSearcher.<init> Opening Searcher@1dfacc4 main
[junit4:junit4]   2> 2714 T52 C4 Pnull oass.SolrIndexSearcher.getIndexDir WARNING WARNING: Directory impl does not support setting indexDir: org.apache.lucene.store.MockDirectoryWrapper
[junit4:junit4]   2> 2715 T52 C4 Pnull oasu.DirectUpdateHandler2.commit end_commit_flush
[junit4:junit4]   2> 2715 T66 oasc.SolrCore.registerSearcher [collection1] Registered new searcher Searcher@1dfacc4 main{StandardDirectoryReader(segments_4:7 _1(4.0.0.2):C2/1)}
[junit4:junit4]   2> 2716 T52 C4 Pnull UPDATE [collection1] webapp=null path=null params={} {commit=} 0 9
[junit4:junit4]   2> 2718 T52 C4 Pnull REQ [collection1] webapp=null path=null params={start=0&q=id:42&qt=standard&rows=20&version=2.2} hits=1 status=0 QTime=1 
[junit4:junit4]   2> 2728 T52 C4 Pnull UPDATE [collection1] webapp=null path=null params={} {add=[42]} 0 2
[junit4:junit4]   2> 2735 T52 C4 Pnull UPDATE [collection1] webapp=null path=null params={} {add=[42]} 0 0
[junit4:junit4]   2> 2742 T52 C4 Pnull oasu.DirectUpdateHandler2.commit start commit{flags=0,_version_=0,optimize=false,openSearcher=true,waitSearcher=true,expungeDeletes=false,softCommit=false}
[junit4:junit4]   2> 2748 T52 C4 Pnull oasc.SolrDeletionPolicy.onCommit SolrDeletionPolicy.onCommit: commits:num=2
[junit4:junit4]   2> 		commit{dir=MockDirWrapper(org.apache.lucene.store.RAMDirectory@1cadba6 lockFactory=org.apache.lucene.store.NativeFSLockFactory@f18070),segFN=segments_4,generation=4,filenames=[_1_nrm.cfs, _1_Pulsing40_0.tip, _1_Memory_1.ram, _1_Pulsing40_0.tim, _1_1.del, _1.fnm, _1_Direct_0.prx, _1_nrm.cfe, _1_Pulsing40_0.frq, _1.fdx, _1_Memory_0.ram, _1.fdt, _1.si, _1_Pulsing40_0.prx, _1_Direct_0.tim, _1_Direct_0.tip, _1_Direct_0.frq, segments_4]
[junit4:junit4]   2> 		commit{dir=MockDirWrapper(org.apache.lucene.store.RAMDirectory@1cadba6 lockFactory=org.apache.lucene.store.NativeFSLockFactory@f18070),segFN=segments_5,generation=5,filenames=[_2_Direct_0.tip, _2.si, _2_Pulsing40_0.tim, _2_Direct_0.tim, _2_Pulsing40_0.tip, _2.fdt, _2.fdx, _2_Pulsing40_0.frq, _2.fnm, _2_Direct_0.prx, _2_nrm.cfe, _2_Memory_1.ram, _2_Direct_0.frq, _2_Memory_0.ram, _2_nrm.cfs, segments_5, _2_1.del, _2_Pulsing40_0.prx]
[junit4:junit4]   2> 2748 T52 C4 Pnull oasc.SolrDeletionPolicy.updateCommits newest commit = 5
[junit4:junit4]   2> 2750 T52 C4 Pnull oass.SolrIndexSearcher.<init> Opening Searcher@1cac08b main
[junit4:junit4]   2> 2750 T52 C4 Pnull oass.SolrIndexSearcher.getIndexDir WARNING WARNING: Directory impl does not support setting indexDir: org.apache.lucene.store.MockDirectoryWrapper
[junit4:junit4]   2> 2751 T52 C4 Pnull oasu.DirectUpdateHandler2.commit end_commit_flush
[junit4:junit4]   2> 2752 T66 oasc.SolrCore.registerSearcher [collection1] Registered new searcher Searcher@1cac08b main{StandardDirectoryReader(segments_5:11 _2(4.0.0.2):C2/1)}
[junit4:junit4]   2> 2753 T52 C4 Pnull UPDATE [collection1] webapp=null path=null params={} {commit=} 0 11
[junit4:junit4]   2> 2756 T52 C4 Pnull REQ [collection1] webapp=null path=null params={start=0&q=id:42&qt=standard&rows=20&version=2.2} hits=1 status=0 QTime=1 
[junit4:junit4]   2> 2768 T52 C4 Pnull UPDATE [collection1] webapp=null path=null params={} {add=[101]} 0 2
[junit4:junit4]   2> 3138 T52 C4 Pnull UPDATE [collection1] webapp=null path=null params={} {add=[101]} 0 1
[junit4:junit4]   2> 3146 T52 C4 Pnull UPDATE [collection1] webapp=null path=null params={} {add=[105]} 0 1
[junit4:junit4]   2> 3154 T52 C4 Pnull UPDATE [collection1] webapp=null path=null params={} {add=[102]} 0 1
[junit4:junit4]   2> 3162 T52 C4 Pnull UPDATE [collection1] webapp=null path=null params={} {add=[103]} 0 1
[junit4:junit4]   2> 3169 T52 C4 Pnull UPDATE [collection1] webapp=null path=null params={} {add=[101]} 0 1
[junit4:junit4]   2> 3177 T52 C4 Pnull oasu.DirectUpdateHandler2.commit start commit{flags=0,_version_=0,optimize=false,openSearcher=true,waitSearcher=true,expungeDeletes=false,softCommit=false}
[junit4:junit4]   2> 3207 T52 C4 Pnull oasc.SolrDeletionPolicy.onCommit SolrDeletionPolicy.onCommit: commits:num=2
[junit4:junit4]   2> 		commit{dir=MockDirWrapper(org.apache.lucene.store.RAMDirectory@1cadba6 lockFactory=org.apache.lucene.store.NativeFSLockFactory@f18070),segFN=segments_5,generation=5,filenames=[_2_Direct_0.tip, _2.si, _2_Pulsing40_0.tim, _2_Direct_0.tim, _2_Pulsing40_0.tip, _2.fdt, _2.fdx, _2_Pulsing40_0.frq, _2.fnm, _2_Direct_0.prx, _2_nrm.cfe, _2_Memory_1.ram, _2_Direct_0.frq, _2_Memory_0.ram, _2_nrm.cfs, segments_5, _2_1.del, _2_Pulsing40_0.prx]
[junit4:junit4]   2> 		commit{dir=MockDirWrapper(org.apache.lucene.store.RAMDirectory@1cadba6 lockFactory=org.apache.lucene.store.NativeFSLockFactory@f18070),segFN=segments_6,generation=6,filenames=[_2.si, _2_Direct_0.tip, _3_nrm.cfe, _3_Direct_0.frq, _2_Pulsing40_0.tim, _2_Direct_0.tim, _2_Pulsing40_0.tip, _3.fnm, _3.fdt, _3_1.del, _2_nrm.cfe, _2_Memory_1.ram, _3_Direct_0.prx, _2_Memory_0.ram, _3_Memory_0.ram, _2_nrm.cfs, _2_1.del, _2_Pulsing40_0.prx, _3_Direct_0.tip, _2.fdt, _2.fdx, _2_Pulsing40_0.frq, _2.fnm, _3.fdx, _3_nrm.cfs, _2_Direct_0.prx, _3.si, _2_Direct_0.frq, segments_6, _3_Direct_0.tim, _3_Memory_1.ram]
[junit4:junit4]   2> 3208 T52 C4 Pnull oasc.SolrDeletionPolicy.updateCommits newest commit = 6
[junit4:junit4]   2> 3208 T52 C4 Pnull oass.SolrIndexSearcher.<init> Opening Searcher@12fca35 main
[junit4:junit4]   2> 3209 T52 C4 Pnull oass.SolrIndexSearcher.getIndexDir WARNING WARNING: Directory impl does not support setting indexDir: org.apache.lucene.store.MockDirectoryWrapper
[junit4:junit4]   2> 3211 T66 oasc.SolrCore.registerSearcher [collection1] Registered new searcher Searcher@12fca35 main{StandardDirectoryReader(segments_6:13 _2(4.0.0.2):C2/1 _3(4.0.0.2):C6/2)}
[junit4:junit4]   2> 3211 T52 C4 Pnull oasu.DirectUpdateHandler2.commit end_commit_flush
[junit4:junit4]   2> 3212 T52 C4 Pnull UPDATE [collection1] webapp=null path=null params={} {commit=} 0 36
[junit4:junit4]   2> 3228 T64 oascc.ZkStateReader.updateClusterState Updating cloud state from ZooKeeper... 
[junit4:junit4]   2> 3233 T56 oazs.SyncRequestProcessor.run SyncRequestProcessor exited!
[junit4:junit4]   2> 3234 T52 oazs.FinalRequestProcessor.shutdown shutdown of request processor complete
[junit4:junit4]   2> 3236 T57 oazs.PrepRequestProcessor.run PrepRequestProcessor exited loop!
[junit4:junit4]   2> 5128 T55 oazs.SessionTrackerImpl.run SessionTrackerImpl exited loop!
[junit4:junit4]   2> 5450 T54 oazs.NIOServerCnxn$Factory.run WARNING Ignoring unexpected runtime exception java.nio.channels.CancelledKeyException
[junit4:junit4]   2> 	at sun.nio.ch.SelectionKeyImpl.ensureValid(SelectionKeyImpl.java:55)
[junit4:junit4]   2> 	at sun.nio.ch.SelectionKeyImpl.readyOps(SelectionKeyImpl.java:69)
[junit4:junit4]   2> 	at org.apache.zookeeper.server.NIOServerCnxn$Factory.run(NIOServerCnxn.java:241)
[junit4:junit4]   2> 
[junit4:junit4]   2> 5452 T52 oazs.NIOServerCnxn.closeSock Closed socket connection for client /127.0.0.1:59799 which had sessionid 0x139327e80860002
[junit4:junit4]   2> 5452 T54 oazs.NIOServerCnxn$Factory.run NIOServerCnxn factory exited run method
[junit4:junit4]   2> 5452 T62 oaz.ClientCnxn$SendThread.run Unable to read additional data from server sessionid 0x139327e80860002, likely server has closed socket, closing socket connection and attempting reconnect
[junit4:junit4]   2> 5453 T52 oazs.FinalRequestProcessor.shutdown shutdown of request processor complete
[junit4:junit4]   2> 5555 T63 oascc.ConnectionManager.process Watcher org.apache.solr.common.cloud.ConnectionManager@19d44df name:ZooKeeperConnection Watcher:127.0.0.1:59790/solr got event WatchedEvent state:Disconnected type:None path:null path:null type:None
[junit4:junit4]   2> 5748 T52 oasc.ZkTestServer.run STARTING ZK TEST SERVER
[junit4:junit4]   2> 5749 T67 oazs.ZooKeeperServer.setTickTime tickTime set to 3000
[junit4:junit4]   2> 5751 T67 oazs.NIOServerCnxn$Factory.<init> binding to port 0.0.0.0/0.0.0.0:59790
[junit4:junit4]   2> 5752 T67 oazsp.FileSnap.deserialize Reading snapshot C:\Jenkins\workspace\Lucene-Solr-4.x-Windows\solr\build\solr-core\test\J0\.\solrtest-BasicZkTest-1345171914812\zookeeper\server1\data\version-2\snapshot.0
[junit4:junit4]   2> 5756 T67 oazsp.FileTxnSnapLog.save Snapshotting: 41
[junit4:junit4]   2> 5847 T52 oasc.ZkTestServer.run start zk server on port:59790
[junit4:junit4]   2> 6157 T52 C4 Pnull REQ [collection1] webapp=null path=null params={q=id:[100+TO+110]&rows=2147483647} hits=4 status=0 QTime=11 
[junit4:junit4]   2> 6164 T52 C4 Pnull REQ [collection1] webapp=null path=null params={q=id:[100+TO+111]&rows=1147483647} hits=4 status=0 QTime=1 
[junit4:junit4]   2> 6168 T52 C4 Pnull REQ [collection1] webapp=null path=null params={start=0&q=id:[100+TO+110]&qt=standard&rows=20&version=2.2} hits=4 status=0 QTime=0 
[junit4:junit4]   2> 6179 T52 C4 Pnull UPDATE [collection1] webapp=null path=null params={} {delete=[102]} 0 1
[junit4:junit4]   2> 6186 T52 C4 Pnull oasu.DirectUpdateHandler2.commit start commit{flags=0,_version_=0,optimize=false,openSearcher=true,waitSearcher=true,expungeDeletes=false,softCommit=false}
[junit4:junit4]   2> 6190 T52 C4 Pnull oasc.SolrDeletionPolicy.onCommit SolrDeletionPolicy.onCommit: commits:num=2
[junit4:junit4]   2> 		commit{dir=MockDirWrapper(org.apache.lucene.store.RAMDirectory@1cadba6 lockFactory=org.apache.lucene.store.NativeFSLockFactory@f18070),segFN=segments_6,generation=6,filenames=[_2.si, _2_Direct_0.tip, _3_nrm.cfe, _3_Direct_0.frq, _2_Pulsing40_0.tim, _2_Direct_0.tim, _2_Pulsing40_0.tip, _3.fnm, _3.fdt, _3_1.del, _2_nrm.cfe, _2_Memory_1.ram, _3_Direct_0.prx, _2_Memory_0.ram, _3_Memory_0.ram, _2_nrm.cfs, _2_1.del, _2_Pulsing40_0.prx, _3_Direct_0.tip, _2.fdt, _2.fdx, _2_Pulsing40_0.frq, _2.fnm, _3.fdx, _3_nrm.cfs, _2_Direct_0.prx, _3.si, _2_Direct_0.frq, segments_6, _3_Direct_0.tim, _3_Memory_1.ram]
[junit4:junit4]   2> 		commit{dir=MockDirWrapper(org.apache.lucene.store.RAMDirectory@1cadba6 lockFactory=org.apache.lucene.store.NativeFSLockFactory@f18070),segFN=segments_7,generation=7,filenames=[_2.si, _2_Direct_0.tip, _3_nrm.cfe, _3_Direct_0.frq, _2_Pulsing40_0.tim, _2_Direct_0.tim, _2_Pulsing40_0.tip, _3.fnm, _3.fdt, _2_nrm.cfe, _2_Memory_1.ram, _3_Direct_0.prx, _2_Memory_0.ram, _3_Memory_0.ram, _2_nrm.cfs, _2_1.del, _2_Pulsing40_0.prx, _3_Direct_0.tip, _3_2.del, _2.fdt, _2.fdx, _2_Pulsing40_0.frq, _2.fnm, _3.fdx, _3_nrm.cfs, _2_Direct_0.prx, segments_7, _3.si, _2_Direct_0.frq, _3_Direct_0.tim, _3_Memory_1.ram]
[junit4:junit4]   2> 6191 T52 C4 Pnull oasc.SolrDeletionPolicy.updateCommits newest commit = 7
[junit4:junit4]   2> 6192 T52 C4 Pnull oass.SolrIndexSearcher.<init> Opening Searcher@db71e4 main
[junit4:junit4]   2> 6193 T52 C4 Pnull oass.SolrIndexSearcher.getIndexDir WARNING WARNING: Directory impl does not support setting indexDir: org.apache.lucene.store.MockDirectoryWrapper
[junit4:junit4]   2> 6193 T52 C4 Pnull oasu.DirectUpdateHandler2.commit end_commit_flush
[junit4:junit4]   2> 6195 T66 oasc.SolrCore.registerSearcher [collection1] Registered new searcher Searcher@db71e4 main{StandardDirectoryReader(segments_7:14 _2(4.0.0.2):C2/1 _3(4.0.0.2):C6/3)}
[junit4:junit4]   2> 6196 T52 C4 Pnull UPDATE [collection1] webapp=null path=null params={} {commit=} 0 10
[junit4:junit4]   2> 6199 T52 C4 Pnull REQ [collection1] webapp=null path=null params={start=0&q=id:[100+TO+110]&qt=standard&rows=20&version=2.2} hits=3 status=0 QTime=1 
[junit4:junit4]   2> 6207 T52 C4 Pnull UPDATE [collection1] webapp=null path=null params={} {delete=[105]} 0 0
[junit4:junit4]   2> 6216 T52 C4 Pnull oasu.DirectUpdateHandler2.commit start commit{flags=0,_version_=0,optimize=false,openSearcher=true,waitSearcher=true,expungeDeletes=false,softCommit=false}
[junit4:junit4]   2> 6219 T52 C4 Pnull oasc.SolrDeletionPolicy.onCommit SolrDeletionPolicy.onCommit: commits:num=2
[junit4:junit4]   2> 		commit{dir=MockDirWrapper(org.apache.lucene.store.RAMDirectory@1cadba6 lockFactory=org.apache.lucene.store.NativeFSLockFactory@f18070),segFN=segments_7,generation=7,filenames=[_2.si, _2_Direct_0.tip, _3_nrm.cfe, _3_Direct_0.frq, _2_Pulsing40_0.tim, _2_Direct_0.tim, _2_Pulsing40_0.tip, _3.fnm, _3.fdt, _2_nrm.cfe, _2_Memory_1.ram, _3_Direct_0.prx, _2_Memory_0.ram, _3_Memory_0.ram, _2_nrm.cfs, _2_1.del, _2_Pulsing40_0.prx, _3_Direct_0.tip, _3_2.del, _2.fdt, _2.fdx, _2_Pulsing40_0.frq, _2.fnm, _3.fdx, _3_nrm.cfs, _2_Direct_0.prx, segments_7, _3.si, _2_Direct_0.frq, _3_Direct_0.tim, _3_Memory_1.ram]
[junit4:junit4]   2> 		commit{dir=MockDirWrapper(org.apache.lucene.store.RAMDirectory@1cadba6 lockFactory=org.apache.lucene.store.NativeFSLockFactory@f18070),segFN=segments_8,generation=8,filenames=[_2.si, _2_Direct_0.tip, _3_nrm.cfe, _3_Direct_0.frq, _2_Pulsing40_0.tim, _2_Direct_0.tim, _2_Pulsing40_0.tip, _3.fnm, _3.fdt, _2_nrm.cfe, _2_Memory_1.ram, _3_Direct_0.prx, _2_Memory_0.ram, _3_Memory_0.ram, _2_nrm.cfs, _2_1.del, _2_Pulsing40_0.prx, _3_Direct_0.tip, _2.fdt, _3_3.del, _2.fdx, _2_Pulsing40_0.frq, _2.fnm, _3.fdx, _3_nrm.cfs, _2_Direct_0.prx, segments_8, _3.si, _2_Direct_0.frq, _3_Direct_0.tim, _3_Memory_1.ram]
[junit4:junit4]   2> 6220 T52 C4 Pnull oasc.SolrDeletionPolicy.updateCommits newest commit = 8
[junit4:junit4]   2> 6220 T52 C4 Pnull oass.SolrIndexSearcher.<init> Opening Searcher@44ec30 main
[junit4:junit4]   2> 6221 T52 C4 Pnull oass.SolrIndexSearcher.getIndexDir WARNING WARNING: Directory impl does not support setting indexDir: org.apache.lucene.store.MockDirectoryWrapper
[junit4:junit4]   2> 6221 T52 C4 Pnull oasu.DirectUpdateHandler2.commit end_commit_flush
[junit4:junit4]   2> 6223 T66 oasc.SolrCore.registerSearcher [collection1] Registered new searcher Searcher@44ec30 main{StandardDirectoryReader(segments_8:15 _2(4.0.0.2):C2/1 _3(4.0.0.2):C6/4)}
[junit4:junit4]   2> 6224 T52 C4 Pnull UPDATE [collection1] webapp=null path=null params={} {commit=} 0 8
[junit4:junit4]   2> 6227 T52 C4 Pnull REQ [collection1] webapp=null path=null params={start=0&q=id:[100+TO+110]&qt=standard&rows=20&version=2.2} hits=2 status=0 QTime=1 
[junit4:junit4]   2> 6237 T52 C4 Pnull UPDATE [collection1] webapp=null path=null params={} {deleteByQuery=id:[100 TO 110]} 0 2
[junit4:junit4]   2> 6247 T52 C4 Pnull oasu.DirectUpdateHandler2.commit start commit{flags=0,_version_=0,optimize=false,openSearcher=true,waitSearcher=true,expungeDeletes=false,softCommit=false}
[junit4:junit4]   2> 6251 T52 C4 Pnull oasc.SolrDeletionPolicy.onCommit SolrDeletionPolicy.onCommit: commits:num=2
[junit4:junit4]   2> 		commit{dir=MockDirWrapper(org.apache.lucene.store.RAMDirectory@1cadba6 lockFactory=org.apache.lucene.store.NativeFSLockFactory@f18070),segFN=segments_8,generation=8,filenames=[_2.si, _2_Direct_0.tip, _3_nrm.cfe, _3_Direct_0.frq, _2_Pulsing40_0.tim, _2_Direct_0.tim, _2_Pulsing40_0.tip, _3.fnm, _3.fdt, _2_nrm.cfe, _2_Memory_1.ram, _3_Direct_0.prx, _2_Memory_0.ram, _3_Memory_0.ram, _2_nrm.cfs, _2_1.del, _2_Pulsing40_0.prx, _3_Direct_0.tip, _2.fdt, _3_3.del, _2.fdx, _2_Pulsing40_0.frq, _2.fnm, _3.fdx, _3_nrm.cfs, _2_Direct_0.prx, segments_8, _3.si, _2_Direct_0.frq, _3_Direct_0.tim, _3_Memory_1.ram]
[junit4:junit4]   2> 		commit{dir=MockDirWrapper(org.apache.lucene.store.RAMDirectory@1cadba6 lockFactory=org.apache.lucene.store.NativeFSLockFactory@f18070),segFN=segments_9,generation=9,filenames=[_2_Direct_0.tip, _2.si, _2_Pulsing40_0.tim, _2_Direct_0.tim, _2_Pulsing40_0.tip, _2.fdt, _2.fdx, _2_Pulsing40_0.frq, _2.fnm, segments_9, _2_Direct_0.prx, _2_nrm.cfe, _2_Memory_1.ram, _2_Direct_0.frq, _2_Memory_0.ram, _2_nrm.cfs, _2_1.del, _2_Pulsing40_0.prx]
[junit4:junit4]   2> 6251 T52 C4 Pnull oasc.SolrDeletionPolicy.updateCommits newest commit = 9
[junit4:junit4]   2> 6252 T52 C4 Pnull oass.SolrIndexSearcher.<init> Opening Searcher@11f6413 main
[junit4:junit4]   2> 6253 T52 C4 Pnull oass.SolrIndexSearcher.getIndexDir WARNING WARNING: Directory impl does not support setting indexDir: org.apache.lucene.store.MockDirectoryWrapper
[junit4:junit4]   2> 6253 T52 C4 Pnull oasu.DirectUpdateHandler2.commit end_commit_flush
[junit4:junit4]   2> 6256 T66 oasc.SolrCore.registerSearcher [collection1] Registered new searcher Searcher@11f6413 main{StandardDirectoryReader(segments_9:17 _2(4.0.0.2):C2/1)}
[junit4:junit4]   2> 6257 T52 C4 Pnull UPDATE [collection1] webapp=null path=null params={} {commit=} 0 10
[junit4:junit4]   2> 6262 T52 C4 Pnull REQ [collection1] webapp=null path=null params={start=0&q=id:[100+TO+110]&qt=standard&rows=20&version=2.2} hits=0 status=0 QTime=2 
[junit4:junit4]   2> 7077 T62 oaz.ClientCnxn$SendThread.startConnect Opening socket connection to server 127.0.0.1/127.0.0.1:59790
[junit4:junit4]   2> 7077 T68 oazs.NIOServerCnxn$Factory.run Accepted socket connection from /127.0.0.1:59802
[junit4:junit4]   2> 7078 T62 oaz.ClientCnxn$SendThread.primeConnection Socket connection established to 127.0.0.1/127.0.0.1:59790, initiating session
[junit4:junit4]   2> 7081 T68 oazs.NIOServerCnxn.readConnectRequest Client attempting to renew session 0x139327e80860002 at /127.0.0.1:59802
[junit4:junit4]   2> 7081 T68 oazs.NIOServerCnxn.finishSessionInit Established session 0x139327e80860002 with negotiated timeout 10000 for client /127.0.0.1:59802
[junit4:junit4]   2> 7081 T62 oaz.ClientCnxn$SendThread.readConnectResult Session establishment complete on server 127.0.0.1/127.0.0.1:59790, sessionid = 0x139327e80860002, negotiated timeout = 10000
[junit4:junit4]   2> 7083 T63 oascc.ConnectionManager.process Watcher org.apache.solr.common.cloud.ConnectionManager@19d44df name:ZooKeeperConnection Watcher:127.0.0.1:59790/solr got event WatchedEvent state:SyncConnected type:None path:null path:null type:None
[junit4:junit4]   2> 7084 T71 oazs.PrepRequestProcessor.pRequest Got user-level KeeperException when processing sessionid:0x139327e80860002 type:delete cxid:0x7d zxid:0xfffffffffffffffe txntype:unknown reqpath:n/a Error Path:/solr/overseer/queue/qn-0000000006 Error:KeeperErrorCode = NoNode for /solr/overseer/queue/qn-0000000006
[junit4:junit4]   2> 7085 T70 oazsp.FileTxnLog.append Creating new log file: log.42
[junit4:junit4]   2> 7110 T52 oasc.CoreContainer.reload Reloading SolrCore 'collection1' using instanceDir: C:\Jenkins\workspace\Lucene-Solr-4.x-Windows\solr\build\solr-core\test-files\solr\collection1
[junit4:junit4]   2> 7113 T52 oasc.ZkController.createCollectionZkNode Check for collection zkNode:collection1
[junit4:junit4]   2> 7114 T64 ccr.RunnerThreadGroup.uncaughtException SEVERE RunnerThreadGroup's sub thread should always have a context and it didn't have any? java.lang.IllegalStateException: No context information for thread: Thread[id=64, name=Thread-14, state=RUNNABLE, group=Overseer state updater.]. Is this thread running under a class com.carrotsearch.randomizedtesting.RandomizedRunner runner? Add @RunWith(class com.carrotsearch.randomizedtesting.RandomizedRunner.class) to your test class. 
[junit4:junit4]   2> 	at com.carrotsearch.randomizedtesting.RandomizedContext.context(RandomizedContext.java:181)
[junit4:junit4]   2> 	at com.carrotsearch.randomizedtesting.RandomizedContext.current(RandomizedContext.java:128)
[junit4:junit4]   2> 	at com.carrotsearch.randomizedtesting.RandomizedRunner.augmentStackTrace(RandomizedRunner.java:1694)
[junit4:junit4]   2> 	at com.carrotsearch.randomizedtesting.RunnerThreadGroup.uncaughtException(RunnerThreadGroup.java:27)
[junit4:junit4]   2> 	at java.lang.ThreadGroup.uncaughtException(ThreadGroup.java:976)
[junit4:junit4]   2> 	at java.lang.Thread.dispatchUncaughtException(Thread.java:1874)
[junit4:junit4]   2> 
[junit4:junit4]   2> 7114 T52 oasc.ZkController.createCollectionZkNode Collection zkNode exists
[junit4:junit4]   2> 7115 T52 oasc.ZkController.readConfigName Load collection config from:/collections/collection1
[junit4:junit4]   2> 7116 T64 ccr.RandomizedRunner$QueueUncaughtExceptionsHandler.uncaughtException WARNING Uncaught exception in thread: Thread[Thread-14,5,Overseer state updater.] java.util.NoSuchElementException
[junit4:junit4]   2> 	at org.apache.solr.cloud.DistributedQueue.remove(DistributedQueue.java:154)
[junit4:junit4]   2> 	at org.apache.solr.cloud.Overseer$ClusterStateUpdater.run(Overseer.java:129)
[junit4:junit4]   2> 	at java.lang.Thread.run(Thread.java:662)
[junit4:junit4]   2> 
[junit4:junit4]   2> 7117 T52 oasc.SolrResourceLoader.<init> new SolrResourceLoader for directory: 'C:\Jenkins\workspace\Lucene-Solr-4.x-Windows\solr\build\solr-core\test-files\solr\collection1\'
[junit4:junit4]   2> 7118 T52 oasc.SolrResourceLoader.replaceClassLoader Adding 'file:/C:/Jenkins/workspace/Lucene-Solr-4.x-Windows/solr/build/solr-core/test-files/solr/collection1/lib/classes/' to classloader
[junit4:junit4]   2> 7118 T52 oasc.SolrResourceLoader.replaceClassLoader Adding 'file:/C:/Jenkins/workspace/Lucene-Solr-4.x-Windows/solr/build/solr-core/test-files/solr/collection1/lib/README' to classloader
[junit4:junit4]   2> 7137 T52 oasc.SolrException.log Ignoring exception matching SAXParseException
[junit4:junit4]   2> 7138 T52 oas.SolrTestCaseJ4.tearDown ###Ending testBasic
[junit4:junit4]   2> NOTE: reproduce with: ant test  -Dtestcase=BasicZkTest -Dtests.method=testBasic -Dtests.seed=67A7F17D12E31125 -Dtests.slow=true -Dtests.locale=ar_LB -Dtests.timezone=Antarctica/Mawson -Dtests.file.encoding=US-ASCII
[junit4:junit4] ERROR   4.59s | BasicZkTest.testBasic <<<
[junit4:junit4]    > Throwable #1: com.carrotsearch.randomizedtesting.UncaughtExceptionError: Captured an uncaught exception in thread: Thread[id=64, name=Thread-14, state=RUNNABLE, group=Overseer state updater.]
[junit4:junit4]    > 	at __randomizedtesting.SeedInfo.seed([67A7F17D12E31125:CC5DEC68CD3F970B]:0)
[junit4:junit4]    > Caused by: java.util.NoSuchElementException
[junit4:junit4]    > 	at org.apache.solr.cloud.DistributedQueue.remove(DistributedQueue.java:154)
[junit4:junit4]    > 	at org.apache.solr.cloud.Overseer$ClusterStateUpdater.run(Overseer.java:129)
[junit4:junit4]    > 	at java.lang.Thread.run(Thread.java:662)
[junit4:junit4]   2> 7167 T71 oazs.PrepRequestProcessor.run PrepRequestProcessor exited loop!
[junit4:junit4]   2> 7167 T70 oazs.SyncRequestProcessor.run SyncRequestProcessor exited!
[junit4:junit4]   2> 7168 T52 oazs.FinalRequestProcessor.shutdown shutdown of request processor complete
[junit4:junit4]   2> 7170 T52 oazs.NIOServerCnxn.closeSock Closed socket connection for client /127.0.0.1:59802 which had sessionid 0x139327e80860002
[junit4:junit4]   2> 7173 T62 oaz.ClientCnxn$SendThread.run Unable to read additional data from server sessionid 0x139327e80860002, likely server has closed socket, closing socket connection and attempting reconnect
[junit4:junit4]   2> 7173 T68 oazs.NIOServerCnxn$Factory.run NIOServerCnxn factory exited run method
[junit4:junit4]   2> 7174 T52 oazs.FinalRequestProcessor.shutdown shutdown of request processor complete
[junit4:junit4]   2> 7281 T63 oascc.ConnectionManager.process Watcher org.apache.solr.common.cloud.ConnectionManager@19d44df name:ZooKeeperConnection Watcher:127.0.0.1:59790/solr got event WatchedEvent state:Disconnected type:None path:null path:null type:None
[junit4:junit4]   2> 8344 T69 oazs.SessionTrackerImpl.run SessionTrackerImpl exited loop!
[junit4:junit4]   2> 9141 T62 oaz.ClientCnxn$SendThread.startConnect Opening socket connection to server 127.0.0.1/127.0.0.1:59790
[junit4:junit4]   2> 9330 T52 oas.SolrTestCaseJ4.deleteCore ###deleteCore
[junit4:junit4]   2> 9330 T52 oasc.CoreContainer.shutdown Shutting down CoreContainer instance=28693818
[junit4:junit4]   2> 9330 T52 oasc.SolrCore.close [collection1]  CLOSING SolrCore org.apache.solr.core.SolrCore@19fc33d
[junit4:junit4]   2> 9337 T52 oasc.SolrCore.closeSearcher [collection1] Closing main searcher on request.
[junit4:junit4]   2> 9337 T52 oasu.DirectUpdateHandler2.close closing DirectUpdateHandler2{commits=8,autocommits=0,soft autocommits=0,optimizes=0,rollbacks=0,expungeDeletes=0,docsPending=0,adds=0,deletesById=0,deletesByQuery=0,errors=0,cumulative_adds=11,cumulative_deletesById=4,cumulative_deletesByQuery=1,cumulative_errors=0}
[junit4:junit4]   2> 9338 T52 oasu.DefaultSolrCoreState.decref SolrCoreState ref count has reached 0 - closing IndexWriter
[junit4:junit4]   2> 10318 T52 oaz.ZooKeeper.close Session: 0x139327e80860002 closed
[junit4:junit4]   2> 10330 T63 oaz.ClientCnxn$EventThread.run EventThread shut down
[junit4:junit4]   2> NOTE: test params are: codec=Lucene40: {timestamp=PostingsFormat(name=Memory doPackFST= true), range_facet_l=PostingsFormat(name=Memory doPackFST= true), id=PostingsFormat(name=Direct), range_facet_sl=PostingsFormat(name=Direct), range_facet_si=PostingsFormat(name=Memory doPackFST= true), val_s=Pulsing40(freqCutoff=3 minBlockSize=80 maxBlockSize=214), multiDefault=PostingsFormat(name=Memory doPackFST= true), intDefault=PostingsFormat(name=Memory doPackFST= false)}, sim=RandomSimilarityProvider(queryNorm=false,coord=crazy): {}, locale=ar_LB, timezone=Antarctica/Mawson
[junit4:junit4]   2> NOTE: Windows 7 6.1 x86/Sun Microsystems Inc. 1.6.0_33 (32-bit)/cpus=2,threads=1,free=38568976,total=65470464
[junit4:junit4]   2> NOTE: All tests run in this JVM: [FileUtilsTest, TestSearchPerf, FileBasedSpellCheckerTest, FieldMutatingUpdateProcessorTest, TestNumberUtils, SignatureUpdateProcessorFactoryTest, ReturnFieldsTest, BadComponentTest, UpdateParamsTest, TestPropInjectDefaults, BasicZkTest]
[junit4:junit4] Completed in 10.35s, 1 test, 1 error <<< FAILURES!

[...truncated 660 lines...]
BUILD FAILED
C:\Jenkins\workspace\Lucene-Solr-4.x-Windows\build.xml:29: The following error occurred while executing this line:
C:\Jenkins\workspace\Lucene-Solr-4.x-Windows\solr\build.xml:144: The following error occurred while executing this line:
C:\Jenkins\workspace\Lucene-Solr-4.x-Windows\lucene\module-build.xml:62: The following error occurred while executing this line:
C:\Jenkins\workspace\Lucene-Solr-4.x-Windows\lucene\common-build.xml:1105: The following error occurred while executing this line:
C:\Jenkins\workspace\Lucene-Solr-4.x-Windows\lucene\common-build.xml:797: There were test failures: 225 suites, 906 tests, 1 error, 11 ignored (6 assumptions)

Total time: 34 minutes 19 seconds
Build step 'Invoke Ant' marked build as failure
Recording test results
Description set: Java: 32bit/jdk1.6.0_33 -server -XX:+UseConcMarkSweepGC
Email was triggered for: Failure
Sending email for trigger: Failure



Mime
View raw message