lucene-dev mailing list archives

Site index · List index
Message view « Date » · « Thread »
Top « Date » · « Thread »
From Policeman Jenkins Server <jenk...@sd-datasolutions.de>
Subject [JENKINS] Lucene-Solr-trunk-Linux (64bit/jdk1.8.0-ea-b49) - Build # 84 - Failure!
Date Wed, 01 Aug 2012 13:50:18 GMT
Build: http://jenkins.sd-datasolutions.de/job/Lucene-Solr-trunk-Linux/84/
Java: 64bit/jdk1.8.0-ea-b49 -XX:+UseParallelGC

1 tests failed.
REGRESSION:  org.apache.solr.handler.component.DistributedQueryElevationComponentTest.testDistribSearch

Error Message:
.responseHeader.params.shards:[::1]:33332/solr|localhost:49463/solr,[::1]:33332/solr|localhost:59729/solr,localhost:47218/solr!=*:*

Stack Trace:
junit.framework.AssertionFailedError: .responseHeader.params.shards:[::1]:33332/solr|localhost:49463/solr,[::1]:33332/solr|localhost:59729/solr,localhost:47218/solr!=*:*
	at __randomizedtesting.SeedInfo.seed([803FB1DF25433935:1D93FC7521C5909]:0)
	at junit.framework.Assert.fail(Assert.java:50)
	at org.apache.solr.BaseDistributedSearchTestCase.compareResponses(BaseDistributedSearchTestCase.java:670)
	at org.apache.solr.BaseDistributedSearchTestCase.query(BaseDistributedSearchTestCase.java:392)
	at org.apache.solr.handler.component.DistributedQueryElevationComponentTest.doTest(DistributedQueryElevationComponentTest.java:81)
	at org.apache.solr.BaseDistributedSearchTestCase.testDistribSearch(BaseDistributedSearchTestCase.java:679)
	at sun.reflect.NativeMethodAccessorImpl.invoke0(Native Method)
	at sun.reflect.NativeMethodAccessorImpl.invoke(NativeMethodAccessorImpl.java:57)
	at sun.reflect.DelegatingMethodAccessorImpl.invoke(DelegatingMethodAccessorImpl.java:43)
	at java.lang.reflect.Method.invoke(Method.java:474)
	at com.carrotsearch.randomizedtesting.RandomizedRunner.invoke(RandomizedRunner.java:1995)
	at com.carrotsearch.randomizedtesting.RandomizedRunner.access$1100(RandomizedRunner.java:132)
	at com.carrotsearch.randomizedtesting.RandomizedRunner$6.evaluate(RandomizedRunner.java:818)
	at com.carrotsearch.randomizedtesting.RandomizedRunner$7.evaluate(RandomizedRunner.java:877)
	at com.carrotsearch.randomizedtesting.RandomizedRunner$8.evaluate(RandomizedRunner.java:891)
	at com.carrotsearch.randomizedtesting.rules.SystemPropertiesRestoreRule$1.evaluate(SystemPropertiesRestoreRule.java:53)
	at org.apache.lucene.util.TestRuleSetupTeardownChained$1.evaluate(TestRuleSetupTeardownChained.java:50)
	at org.apache.lucene.util.TestRuleFieldCacheSanity$1.evaluate(TestRuleFieldCacheSanity.java:32)
	at org.apache.lucene.util.AbstractBeforeAfterRule$1.evaluate(AbstractBeforeAfterRule.java:45)
	at com.carrotsearch.randomizedtesting.rules.SystemPropertiesInvariantRule$1.evaluate(SystemPropertiesInvariantRule.java:55)
	at org.apache.lucene.util.TestRuleReportUncaughtExceptions$1.evaluate(TestRuleReportUncaughtExceptions.java:68)
	at org.apache.lucene.util.TestRuleThreadAndTestName$1.evaluate(TestRuleThreadAndTestName.java:48)
	at org.apache.lucene.util.TestRuleIgnoreAfterMaxFailures$1.evaluate(TestRuleIgnoreAfterMaxFailures.java:70)
	at org.apache.lucene.util.TestRuleMarkFailure$1.evaluate(TestRuleMarkFailure.java:48)
	at com.carrotsearch.randomizedtesting.RandomizedRunner.runSingleTest(RandomizedRunner.java:825)
	at com.carrotsearch.randomizedtesting.RandomizedRunner.access$700(RandomizedRunner.java:132)
	at com.carrotsearch.randomizedtesting.RandomizedRunner$3$1.run(RandomizedRunner.java:671)
	at com.carrotsearch.randomizedtesting.RandomizedRunner$3.evaluate(RandomizedRunner.java:697)
	at com.carrotsearch.randomizedtesting.RandomizedRunner$4.evaluate(RandomizedRunner.java:736)
	at com.carrotsearch.randomizedtesting.RandomizedRunner$5.evaluate(RandomizedRunner.java:747)
	at com.carrotsearch.randomizedtesting.rules.SystemPropertiesRestoreRule$1.evaluate(SystemPropertiesRestoreRule.java:53)
	at org.apache.lucene.util.AbstractBeforeAfterRule$1.evaluate(AbstractBeforeAfterRule.java:45)
	at org.apache.lucene.util.TestRuleReportUncaughtExceptions$1.evaluate(TestRuleReportUncaughtExceptions.java:68)
	at org.apache.lucene.util.TestRuleStoreClassName$1.evaluate(TestRuleStoreClassName.java:38)
	at com.carrotsearch.randomizedtesting.rules.SystemPropertiesInvariantRule$1.evaluate(SystemPropertiesInvariantRule.java:55)
	at org.apache.lucene.util.TestRuleNoInstanceHooksOverrides$1.evaluate(TestRuleNoInstanceHooksOverrides.java:53)
	at org.apache.lucene.util.TestRuleNoStaticHooksShadowing$1.evaluate(TestRuleNoStaticHooksShadowing.java:52)
	at org.apache.lucene.util.TestRuleAssertionsRequired$1.evaluate(TestRuleAssertionsRequired.java:36)
	at org.apache.lucene.util.TestRuleMarkFailure$1.evaluate(TestRuleMarkFailure.java:48)
	at org.apache.lucene.util.TestRuleIgnoreAfterMaxFailures$1.evaluate(TestRuleIgnoreAfterMaxFailures.java:70)
	at org.apache.lucene.util.TestRuleIgnoreTestSuites$1.evaluate(TestRuleIgnoreTestSuites.java:55)
	at com.carrotsearch.randomizedtesting.RandomizedRunner.runSuite(RandomizedRunner.java:605)
	at com.carrotsearch.randomizedtesting.RandomizedRunner.access$400(RandomizedRunner.java:132)
	at com.carrotsearch.randomizedtesting.RandomizedRunner$2.run(RandomizedRunner.java:551)




Build Log:
[...truncated 7145 lines...]
[junit4:junit4] Suite: org.apache.solr.handler.component.DistributedQueryElevationComponentTest
[junit4:junit4] FAILURE 2.16s J1 | DistributedQueryElevationComponentTest.testDistribSearch
[junit4:junit4]    > Throwable #1: junit.framework.AssertionFailedError: .responseHeader.params.shards:[::1]:33332/solr|localhost:49463/solr,[::1]:33332/solr|localhost:59729/solr,localhost:47218/solr!=*:*
[junit4:junit4]    > 	at __randomizedtesting.SeedInfo.seed([803FB1DF25433935:1D93FC7521C5909]:0)
[junit4:junit4]    > 	at junit.framework.Assert.fail(Assert.java:50)
[junit4:junit4]    > 	at org.apache.solr.BaseDistributedSearchTestCase.compareResponses(BaseDistributedSearchTestCase.java:670)
[junit4:junit4]    > 	at org.apache.solr.BaseDistributedSearchTestCase.query(BaseDistributedSearchTestCase.java:392)
[junit4:junit4]    > 	at org.apache.solr.handler.component.DistributedQueryElevationComponentTest.doTest(DistributedQueryElevationComponentTest.java:81)
[junit4:junit4]    > 	at org.apache.solr.BaseDistributedSearchTestCase.testDistribSearch(BaseDistributedSearchTestCase.java:679)
[junit4:junit4]    > 	at sun.reflect.NativeMethodAccessorImpl.invoke0(Native Method)
[junit4:junit4]    > 	at sun.reflect.NativeMethodAccessorImpl.invoke(NativeMethodAccessorImpl.java:57)
[junit4:junit4]    > 	at sun.reflect.DelegatingMethodAccessorImpl.invoke(DelegatingMethodAccessorImpl.java:43)
[junit4:junit4]    > 	at java.lang.reflect.Method.invoke(Method.java:474)
[junit4:junit4]    > 	at com.carrotsearch.randomizedtesting.RandomizedRunner.invoke(RandomizedRunner.java:1995)
[junit4:junit4]    > 	at com.carrotsearch.randomizedtesting.RandomizedRunner.access$1100(RandomizedRunner.java:132)
[junit4:junit4]    > 	at com.carrotsearch.randomizedtesting.RandomizedRunner$6.evaluate(RandomizedRunner.java:818)
[junit4:junit4]    > 	at com.carrotsearch.randomizedtesting.RandomizedRunner$7.evaluate(RandomizedRunner.java:877)
[junit4:junit4]    > 	at com.carrotsearch.randomizedtesting.RandomizedRunner$8.evaluate(RandomizedRunner.java:891)
[junit4:junit4]    > 	at com.carrotsearch.randomizedtesting.rules.SystemPropertiesRestoreRule$1.evaluate(SystemPropertiesRestoreRule.java:53)
[junit4:junit4]    > 	at org.apache.lucene.util.TestRuleSetupTeardownChained$1.evaluate(TestRuleSetupTeardownChained.java:50)
[junit4:junit4]    > 	at org.apache.lucene.util.TestRuleFieldCacheSanity$1.evaluate(TestRuleFieldCacheSanity.java:32)
[junit4:junit4]    > 	at org.apache.lucene.util.AbstractBeforeAfterRule$1.evaluate(AbstractBeforeAfterRule.java:45)
[junit4:junit4]    > 	at com.carrotsearch.randomizedtesting.rules.SystemPropertiesInvariantRule$1.evaluate(SystemPropertiesInvariantRule.java:55)
[junit4:junit4]    > 	at org.apache.lucene.util.TestRuleReportUncaughtExceptions$1.evaluate(TestRuleReportUncaughtExceptions.java:68)
[junit4:junit4]    > 	at org.apache.lucene.util.TestRuleThreadAndTestName$1.evaluate(TestRuleThreadAndTestName.java:48)
[junit4:junit4]    > 	at org.apache.lucene.util.TestRuleIgnoreAfterMaxFailures$1.evaluate(TestRuleIgnoreAfterMaxFailures.java:70)
[junit4:junit4]    > 	at org.apache.lucene.util.TestRuleMarkFailure$1.evaluate(TestRuleMarkFailure.java:48)
[junit4:junit4]    > 	at com.carrotsearch.randomizedtesting.RandomizedRunner.runSingleTest(RandomizedRunner.java:825)
[junit4:junit4]    > 	at com.carrotsearch.randomizedtesting.RandomizedRunner.access$700(RandomizedRunner.java:132)
[junit4:junit4]    > 	at com.carrotsearch.randomizedtesting.RandomizedRunner$3$1.run(RandomizedRunner.java:671)
[junit4:junit4]    > 	at com.carrotsearch.randomizedtesting.RandomizedRunner$3.evaluate(RandomizedRunner.java:697)
[junit4:junit4]    > 	at com.carrotsearch.randomizedtesting.RandomizedRunner$4.evaluate(RandomizedRunner.java:736)
[junit4:junit4]    > 	at com.carrotsearch.randomizedtesting.RandomizedRunner$5.evaluate(RandomizedRunner.java:747)
[junit4:junit4]    > 	at com.carrotsearch.randomizedtesting.rules.SystemPropertiesRestoreRule$1.evaluate(SystemPropertiesRestoreRule.java:53)
[junit4:junit4]    > 	at org.apache.lucene.util.AbstractBeforeAfterRule$1.evaluate(AbstractBeforeAfterRule.java:45)
[junit4:junit4]    > 	at org.apache.lucene.util.TestRuleReportUncaughtExceptions$1.evaluate(TestRuleReportUncaughtExceptions.java:68)
[junit4:junit4]    > 	at org.apache.lucene.util.TestRuleStoreClassName$1.evaluate(TestRuleStoreClassName.java:38)
[junit4:junit4]    > 	at com.carrotsearch.randomizedtesting.rules.SystemPropertiesInvariantRule$1.evaluate(SystemPropertiesInvariantRule.java:55)
[junit4:junit4]    > 	at org.apache.lucene.util.TestRuleNoInstanceHooksOverrides$1.evaluate(TestRuleNoInstanceHooksOverrides.java:53)
[junit4:junit4]    > 	at org.apache.lucene.util.TestRuleNoStaticHooksShadowing$1.evaluate(TestRuleNoStaticHooksShadowing.java:52)
[junit4:junit4]    > 	at org.apache.lucene.util.TestRuleAssertionsRequired$1.evaluate(TestRuleAssertionsRequired.java:36)
[junit4:junit4]    > 	at org.apache.lucene.util.TestRuleMarkFailure$1.evaluate(TestRuleMarkFailure.java:48)
[junit4:junit4]    > 	at org.apache.lucene.util.TestRuleIgnoreAfterMaxFailures$1.evaluate(TestRuleIgnoreAfterMaxFailures.java:70)
[junit4:junit4]    > 	at org.apache.lucene.util.TestRuleIgnoreTestSuites$1.evaluate(TestRuleIgnoreTestSuites.java:55)
[junit4:junit4]    > 	at com.carrotsearch.randomizedtesting.RandomizedRunner.runSuite(RandomizedRunner.java:605)
[junit4:junit4]    > 	at com.carrotsearch.randomizedtesting.RandomizedRunner.access$400(RandomizedRunner.java:132)
[junit4:junit4]    > 	at com.carrotsearch.randomizedtesting.RandomizedRunner$2.run(RandomizedRunner.java:551)
[junit4:junit4]    > 
[junit4:junit4]   2> 16 T143 oas.SolrTestCaseJ4.setUp ###Starting testDistribSearch
[junit4:junit4]   2> 17 T143 oejs.Server.doStart jetty-8.1.2.v20120308
[junit4:junit4]   2> 34 T143 oejs.AbstractConnector.doStart Started SocketConnector@0.0.0.0:54909
[junit4:junit4]   2> 35 T143 oasc.SolrResourceLoader.locateSolrHome JNDI not configured for solr (NoInitialContextEx)
[junit4:junit4]   2> 35 T143 oasc.SolrResourceLoader.locateSolrHome using system property solr.solr.home: /mnt/ssd/jenkins/workspace/Lucene-Solr-trunk-Linux/checkout/solr/build/solr-core/test-files/solr
[junit4:junit4]   2> 35 T143 oasc.SolrResourceLoader.<init> new SolrResourceLoader for deduced Solr Home: '/mnt/ssd/jenkins/workspace/Lucene-Solr-trunk-Linux/checkout/solr/build/solr-core/test-files/solr/'
[junit4:junit4]   2> 44 T143 oass.SolrDispatchFilter.init SolrDispatchFilter.init()
[junit4:junit4]   2> 44 T143 oasc.SolrResourceLoader.locateSolrHome JNDI not configured for solr (NoInitialContextEx)
[junit4:junit4]   2> 44 T143 oasc.SolrResourceLoader.locateSolrHome using system property solr.solr.home: /mnt/ssd/jenkins/workspace/Lucene-Solr-trunk-Linux/checkout/solr/build/solr-core/test-files/solr
[junit4:junit4]   2> 44 T143 oasc.CoreContainer$Initializer.initialize looking for solr.xml: /mnt/ssd/jenkins/workspace/Lucene-Solr-trunk-Linux/checkout/solr/build/solr-core/test-files/solr/solr.xml
[junit4:junit4]   2> 45 T143 oasc.CoreContainer.<init> New CoreContainer 1625862699
[junit4:junit4]   2> 45 T143 oasc.CoreContainer.load Loading CoreContainer using Solr Home: '/mnt/ssd/jenkins/workspace/Lucene-Solr-trunk-Linux/checkout/solr/build/solr-core/test-files/solr/'
[junit4:junit4]   2> 45 T143 oasc.SolrResourceLoader.<init> new SolrResourceLoader for directory: '/mnt/ssd/jenkins/workspace/Lucene-Solr-trunk-Linux/checkout/solr/build/solr-core/test-files/solr/'
[junit4:junit4]   2> 56 T143 oasc.CoreContainer.load Registering Log Listener
[junit4:junit4]   2> 69 T143 oasc.CoreContainer.create Creating SolrCore 'collection1' using instanceDir: /mnt/ssd/jenkins/workspace/Lucene-Solr-trunk-Linux/checkout/solr/build/solr-core/test-files/solr/collection1
[junit4:junit4]   2> 69 T143 oasc.SolrResourceLoader.<init> new SolrResourceLoader for directory: '/mnt/ssd/jenkins/workspace/Lucene-Solr-trunk-Linux/checkout/solr/build/solr-core/test-files/solr/collection1/'
[junit4:junit4]   2> 70 T143 oasc.SolrResourceLoader.replaceClassLoader Adding 'file:/mnt/ssd/jenkins/workspace/Lucene-Solr-trunk-Linux/checkout/solr/build/solr-core/test-files/solr/collection1/lib/README' to classloader
[junit4:junit4]   2> 70 T143 oasc.SolrResourceLoader.replaceClassLoader Adding 'file:/mnt/ssd/jenkins/workspace/Lucene-Solr-trunk-Linux/checkout/solr/build/solr-core/test-files/solr/collection1/lib/classes/' to classloader
[junit4:junit4]   2> 93 T143 oasc.SolrConfig.<init> Using Lucene MatchVersion: LUCENE_50
[junit4:junit4]   2> 129 T143 oasc.SolrConfig.<init> Loaded SolrConfig: solrconfig-elevate.xml
[junit4:junit4]   2> 129 T143 oass.IndexSchema.readSchema Reading Solr Schema
[junit4:junit4]   2> 132 T143 oass.IndexSchema.readSchema Schema name=example
[junit4:junit4]   2> 357 T143 oass.IndexSchema.readSchema default search field in schema is text
[junit4:junit4]   2> 359 T143 oass.IndexSchema.readSchema unique key field: id
[junit4:junit4]   2> 363 T143 oasc.SolrCore.<init> [collection1] Opening new SolrCore at /mnt/ssd/jenkins/workspace/Lucene-Solr-trunk-Linux/checkout/solr/build/solr-core/test-files/solr/collection1/, dataDir=./org.apache.solr.handler.component.DistributedQueryElevationComponentTest-1343828559693/control/data/
[junit4:junit4]   2> 364 T143 oasc.JmxMonitoredMap.<init> JMX monitoring is enabled. Adding Solr mbeans to JMX Server: com.sun.jmx.mbeanserver.JmxMBeanServer@4979e4bc
[junit4:junit4]   2> 365 T143 oasc.SolrCore.getNewIndexDir WARNING New index directory detected: old=null new=./org.apache.solr.handler.component.DistributedQueryElevationComponentTest-1343828559693/control/data/index/
[junit4:junit4]   2> 365 T143 oasc.SolrCore.initIndex WARNING [collection1] Solr index directory './org.apache.solr.handler.component.DistributedQueryElevationComponentTest-1343828559693/control/data/index' doesn't exist. Creating new index...
[junit4:junit4]   2> 367 T143 oasc.SolrDeletionPolicy.onCommit SolrDeletionPolicy.onCommit: commits:num=1
[junit4:junit4]   2> 		commit{dir=MockDirWrapper(org.apache.lucene.store.RAMDirectory@3a26243f lockFactory=org.apache.lucene.store.SingleInstanceLockFactory@266e7c62),segFN=segments_1,generation=1,filenames=[segments_1]
[junit4:junit4]   2> 367 T143 oasc.SolrDeletionPolicy.updateCommits newest commit = 1
[junit4:junit4]   2> 372 T143 oasc.RequestHandlers.initHandlersFromConfig created /update: solr.UpdateRequestHandler
[junit4:junit4]   2> 372 T143 oasc.RequestHandlers.initHandlersFromConfig created /elevate: org.apache.solr.handler.component.SearchHandler
[junit4:junit4]   2> 373 T143 oasc.RequestHandlers.initHandlersFromConfig created /dataElevate: org.apache.solr.handler.component.SearchHandler
[junit4:junit4]   2> 374 T143 oashl.XMLLoader.init xsltCacheLifetimeSeconds=60
[junit4:junit4]   2> 374 T143 oasc.RequestHandlers.initHandlersFromConfig WARNING no default request handler is registered (either '/select' or 'standard')
[junit4:junit4]   2> 375 T143 oasc.SolrCore.initDeprecatedSupport WARNING solrconfig.xml uses deprecated <admin/gettableFiles>, Please update your config to use the ShowFileRequestHandler.
[junit4:junit4]   2> 376 T143 oasc.SolrCore.initDeprecatedSupport WARNING adding ShowFileRequestHandler with hidden files: [SOLRCONFIG-MASTER1-KEEPONEBACKUP.XML, SCHEMA11.XML, SCHEMA15.XML, BAD-SCHEMA-NOT-INDEXED-BUT-TF.XML, SOLRCONFIG-BASIC.XML, SCHEMA-PHRASESUGGEST.XML, BAD-SOLRCONFIG-MISSING-SCRIPTFILE.XML, SOLRCONFIG-ELEVATE.XML, SOLRCONFIG-SLAVE1.XML, BAD-SCHEMA-SIM-GLOBAL-VS-FT-MISMATCH.XML, STOP-2.TXT, SCHEMA-TFIDF.XML, BAD-SCHEMA-NOT-INDEXED-BUT-NORMS.XML, SCHEMA-LMJELINEKMERCER.XML, SOLRCONFIG_CODEC.XML, SOLRCONFIG-TLOG.XML, FRENCHARTICLES.TXT, SOLRCONFIG-REQHANDLER.INCL, SOLRCONFIG-UPDATE-PROCESSOR-CHAINS.XML, SOLRCONFIG-TRANSFORMERS.XML, TRIVIAL.UPDATEPROCESSOR0.JS, SOLRCONFIG-SOLCOREPROPERTIES.XML, SOLRCONFIG-SPELLCHECKER.XML, SCHEMA-REVERSED.XML, STEMDICT.TXT, SCHEMA-COPYFIELD-TEST.XML, SOLRCONFIG-SOLR-749.XML, SOLRCONFIG-QUERYSENDER.XML, SOLRCONFIG-PROPINJECT-INDEXDEFAULT.XML, HUNSPELL-TEST.DIC, SCHEMA-REPLICATION2.XML, SOLRCONFIG-NATIVELOCK.XML, BAD-SCHEMA-DUP-FIELD.XML, SOLRCONFIG-MASTER1.XML, SOLRCONFIG-PROPINJECT.XML, DA_UTF8.XML, SCHEMA-MINIMAL.XML, SCHEMA-NOT-REQUIRED-UNIQUE-KEY.XML, XSLT, SCHEMA-STOP-KEEP.XML, SOLRCONFIG-QUERYSENDER-NOQUERY.XML, SOLRCONFIG-DELPOLICY1.XML, BAD-SCHEMA-EXTERNAL-FILEFIELD.XML, MAPPING-ISOLATIN1ACCENT.TXT, THROW.ERROR.ON.ADD.UPDATEPROCESSOR.JS, SOLRCONFIG-CACHING.XML, SCHEMA-SPELLCHECKER.XML, SCHEMA-NUMERIC.XML, SCHEMA-SIM.XML, SOLRCONFIG-TERMINDEX.XML, SCHEMA-COLLATE.XML, MISSING.FUNCTIONS.UPDATEPROCESSOR.JS, ELEVATE.XML, SOLRCONFIG-MERGEPOLICY.XML, PHRASESUGGEST.TXT, STOPTYPES-1.TXT, BAD_SOLRCONFIG.XML, STOPTYPES-2.TXT, BAD-SCHEMA-NOT-INDEXED-BUT-POS.XML, BAD-SCHEMA-ANALYZER-CLASS-AND-NESTED.XML, BAD-SOLRCONFIG-INVALID-SCRIPTFILE.XML, SOLRCONFIG_PERF.XML, SCHEMA-REPLICATION1.XML, BAD-SCHEMA-DUP-DYNAMICFIELD.XML, SOLRCONFIG-DELPOLICY2.XML, HYPHENATION.DTD, STOPWORDSWRONGENCODING.TXT, CONDITIONAL.UPDATEPROCESSOR.JS, SOLRCONFIG-XINCLUDE.XML, SOLRCONFIG-SCRIPT-UPDATEPROCESSOR.XML, WDFTYPES.TXT, SCHEMA-LMDIRICHLET.XML, SCHEMA_CODEC.XML, SOLRCONFIG-PHRASESUGGEST.XML, SCHEMA-BINARYFIELD.XML, COMPOUNDDICTIONARY.TXT, SOLRCONFIG-MASTER2.XML, BAD-SOLRCONFIG-BOGUS-SCRIPTENGINE-NAME.XML, SCHEMA-BM25.XML, SCHEMA-TRIE.XML, SCHEMA-REQUIRED-FIELDS.XML, SCHEMA-CHARFILTERS.XML, STOP-1.TXT, BAD-SCHEMA-CODEC-GLOBAL-VS-FT-MISMATCH.XML, SCHEMA.XML, ADDFIELDS.UPDATEPROCESSOR.JS, SCHEMA-FOLDING.XML, SOLRCONFIG-LAZYWRITER.XML, BAD-SCHEMA-UNIQUEKEY-IS-COPYFIELD-DEST.XML, SCHEMA-DFR.XML, KEEP-2.TXT, SCHEMA-LUCENEMATCHVERSION.XML, SCHEMA-IB.XML, SOLRCONFIG-MASTER.XML, SCHEMASURROUND.XML, OLD_SYNONYMS.TXT, BAD-SCHEMA-OMIT-TF-BUT-NOT-POS.XML, MISSLEADING.EXTENSION.UPDATEPROCESSOR.JS.TXT, STOP-SNOWBALL.TXT, SOLRCONFIG-MASTER3.XML, SCHEMA12.XML, BAD-MP-SOLRCONFIG.XML, HUNSPELL-TEST.AFF, OPEN-EXCHANGE-RATES.JSON, STOPWORDS.TXT, BAD-SCHEMA-NONTEXT-ANALYZER.XML, SOLRCONFIG-SLAVE.XML, SOLRCONFIG-NOCACHE.XML, BAD-SCHEMA-DUP-FIELDTYPE.XML, SOLRCONFIG-ENABLEPLUGIN.XML, BAD-SCHEMA-UNIQUEKEY-USES-DEFAULT.XML, SOLRCONFIG-ALTDIRECTORY.XML, SOLRCONFIG-HIGHLIGHT.XML, SYNONYMS.TXT, SOLRCONFIG-SPELLCHECKCOMPONENT.XML, BAD-SCHEMA-UNIQUEKEY-MULTIVALUED.XML, PROTWORDS.TXT, DA_COMPOUNDDICTIONARY.TXT, KEEP-1.TXT, TRIVIAL.UPDATEPROCESSOR1.JS, STOPWITHBOM.TXT, SOLRCONFIG-SIMPLELOCK.XML, SOLRCONFIG-REPEATER.XML, SOLRCONFIG-FUNCTIONQUERY.XML, CURRENCY.XML]
[junit4:junit4]   2> 382 T143 oass.SolrIndexSearcher.<init> Opening Searcher@570df8e1 main
[junit4:junit4]   2> 383 T143 oass.SolrIndexSearcher.getIndexDir WARNING WARNING: Directory impl does not support setting indexDir: org.apache.lucene.store.MockDirectoryWrapper
[junit4:junit4]   2> 384 T143 oasu.CommitTracker.<init> Hard AutoCommit: disabled
[junit4:junit4]   2> 384 T143 oasu.CommitTracker.<init> Soft AutoCommit: disabled
[junit4:junit4]   2> 384 T143 oashc.QueryElevationComponent.inform Loading QueryElevation from: /mnt/ssd/jenkins/workspace/Lucene-Solr-trunk-Linux/checkout/solr/build/solr-core/test-files/solr/collection1/conf/elevate.xml
[junit4:junit4]   2> 392 T143 oashc.QueryElevationComponent.inform Loading QueryElevation from: /mnt/ssd/jenkins/workspace/Lucene-Solr-trunk-Linux/checkout/solr/build/solr-core/test-files/solr/collection1/conf/elevate.xml
[junit4:junit4]   2> 407 T143 oashc.HttpShardHandlerFactory.getParameter Setting socketTimeout to: 0
[junit4:junit4]   2> 407 T143 oashc.HttpShardHandlerFactory.getParameter Setting urlScheme to: http://
[junit4:junit4]   2> 408 T143 oashc.HttpShardHandlerFactory.getParameter Setting connTimeout to: 0
[junit4:junit4]   2> 408 T143 oashc.HttpShardHandlerFactory.getParameter Setting maxConnectionsPerHost to: 20
[junit4:junit4]   2> 408 T143 oashc.HttpShardHandlerFactory.getParameter Setting corePoolSize to: 0
[junit4:junit4]   2> 408 T143 oashc.HttpShardHandlerFactory.getParameter Setting maximumPoolSize to: 2147483647
[junit4:junit4]   2> 409 T143 oashc.HttpShardHandlerFactory.getParameter Setting maxThreadIdleTime to: 5
[junit4:junit4]   2> 409 T143 oashc.HttpShardHandlerFactory.getParameter Setting sizeOfQueue to: -1
[junit4:junit4]   2> 409 T143 oashc.HttpShardHandlerFactory.getParameter Setting fairnessPolicy to: false
[junit4:junit4]   2> 421 T143 oascsi.HttpClientUtil.createClient Creating new http client, config:maxConnectionsPerHost=20&maxConnections=10000&socketTimeout=0&connTimeout=0&retry=false
[junit4:junit4]   2> 425 T153 oasc.SolrCore.registerSearcher [collection1] Registered new searcher Searcher@570df8e1 main{StandardDirectoryReader(segments_1:1)}
[junit4:junit4]   2> 426 T143 oasc.CoreContainer.register registering core: collection1
[junit4:junit4]   2> 427 T143 oass.SolrDispatchFilter.init user.dir=/mnt/ssd/jenkins/workspace/Lucene-Solr-trunk-Linux/checkout/solr/build/solr-core/test/J1
[junit4:junit4]   2> 427 T143 oass.SolrDispatchFilter.init SolrDispatchFilter.init() done
[junit4:junit4]   2> 427 T143 oascsi.HttpClientUtil.createClient Creating new http client, config:maxConnections=128&maxConnectionsPerHost=32&followRedirects=false
[junit4:junit4]   2> 430 T143 oejs.Server.doStart jetty-8.1.2.v20120308
[junit4:junit4]   2> 443 T143 oejs.AbstractConnector.doStart Started SocketConnector@0.0.0.0:49463
[junit4:junit4]   2> 444 T143 oasc.SolrResourceLoader.locateSolrHome JNDI not configured for solr (NoInitialContextEx)
[junit4:junit4]   2> 444 T143 oasc.SolrResourceLoader.locateSolrHome using system property solr.solr.home: /mnt/ssd/jenkins/workspace/Lucene-Solr-trunk-Linux/checkout/solr/build/solr-core/test-files/solr
[junit4:junit4]   2> 444 T143 oasc.SolrResourceLoader.<init> new SolrResourceLoader for deduced Solr Home: '/mnt/ssd/jenkins/workspace/Lucene-Solr-trunk-Linux/checkout/solr/build/solr-core/test-files/solr/'
[junit4:junit4]   2> 454 T143 oass.SolrDispatchFilter.init SolrDispatchFilter.init()
[junit4:junit4]   2> 454 T143 oasc.SolrResourceLoader.locateSolrHome JNDI not configured for solr (NoInitialContextEx)
[junit4:junit4]   2> 455 T143 oasc.SolrResourceLoader.locateSolrHome using system property solr.solr.home: /mnt/ssd/jenkins/workspace/Lucene-Solr-trunk-Linux/checkout/solr/build/solr-core/test-files/solr
[junit4:junit4]   2> 455 T143 oasc.CoreContainer$Initializer.initialize looking for solr.xml: /mnt/ssd/jenkins/workspace/Lucene-Solr-trunk-Linux/checkout/solr/build/solr-core/test-files/solr/solr.xml
[junit4:junit4]   2> 455 T143 oasc.CoreContainer.<init> New CoreContainer 131158630
[junit4:junit4]   2> 455 T143 oasc.CoreContainer.load Loading CoreContainer using Solr Home: '/mnt/ssd/jenkins/workspace/Lucene-Solr-trunk-Linux/checkout/solr/build/solr-core/test-files/solr/'
[junit4:junit4]   2> 456 T143 oasc.SolrResourceLoader.<init> new SolrResourceLoader for directory: '/mnt/ssd/jenkins/workspace/Lucene-Solr-trunk-Linux/checkout/solr/build/solr-core/test-files/solr/'
[junit4:junit4]   2> 468 T143 oasc.CoreContainer.load Registering Log Listener
[junit4:junit4]   2> 481 T143 oasc.CoreContainer.create Creating SolrCore 'collection1' using instanceDir: /mnt/ssd/jenkins/workspace/Lucene-Solr-trunk-Linux/checkout/solr/build/solr-core/test-files/solr/collection1
[junit4:junit4]   2> 481 T143 oasc.SolrResourceLoader.<init> new SolrResourceLoader for directory: '/mnt/ssd/jenkins/workspace/Lucene-Solr-trunk-Linux/checkout/solr/build/solr-core/test-files/solr/collection1/'
[junit4:junit4]   2> 482 T143 oasc.SolrResourceLoader.replaceClassLoader Adding 'file:/mnt/ssd/jenkins/workspace/Lucene-Solr-trunk-Linux/checkout/solr/build/solr-core/test-files/solr/collection1/lib/README' to classloader
[junit4:junit4]   2> 482 T143 oasc.SolrResourceLoader.replaceClassLoader Adding 'file:/mnt/ssd/jenkins/workspace/Lucene-Solr-trunk-Linux/checkout/solr/build/solr-core/test-files/solr/collection1/lib/classes/' to classloader
[junit4:junit4]   2> 506 T143 oasc.SolrConfig.<init> Using Lucene MatchVersion: LUCENE_50
[junit4:junit4]   2> 543 T143 oasc.SolrConfig.<init> Loaded SolrConfig: solrconfig-elevate.xml
[junit4:junit4]   2> 543 T143 oass.IndexSchema.readSchema Reading Solr Schema
[junit4:junit4]   2> 547 T143 oass.IndexSchema.readSchema Schema name=example
[junit4:junit4]   2> 706 T143 oass.IndexSchema.readSchema default search field in schema is text
[junit4:junit4]   2> 708 T143 oass.IndexSchema.readSchema unique key field: id
[junit4:junit4]   2> 715 T143 oasc.SolrCore.<init> [collection1] Opening new SolrCore at /mnt/ssd/jenkins/workspace/Lucene-Solr-trunk-Linux/checkout/solr/build/solr-core/test-files/solr/collection1/, dataDir=./org.apache.solr.handler.component.DistributedQueryElevationComponentTest-1343828559693/shard0/data/
[junit4:junit4]   2> 716 T143 oasc.JmxMonitoredMap.<init> JMX monitoring is enabled. Adding Solr mbeans to JMX Server: com.sun.jmx.mbeanserver.JmxMBeanServer@4979e4bc
[junit4:junit4]   2> 716 T143 oasc.SolrCore.getNewIndexDir WARNING New index directory detected: old=null new=./org.apache.solr.handler.component.DistributedQueryElevationComponentTest-1343828559693/shard0/data/index/
[junit4:junit4]   2> 717 T143 oasc.SolrCore.initIndex WARNING [collection1] Solr index directory './org.apache.solr.handler.component.DistributedQueryElevationComponentTest-1343828559693/shard0/data/index' doesn't exist. Creating new index...
[junit4:junit4]   2> 726 T143 oasc.SolrDeletionPolicy.onCommit SolrDeletionPolicy.onCommit: commits:num=1
[junit4:junit4]   2> 		commit{dir=MockDirWrapper(org.apache.lucene.store.RAMDirectory@5794cc69 lockFactory=org.apache.lucene.store.SingleInstanceLockFactory@24af6780),segFN=segments_1,generation=1,filenames=[segments_1]
[junit4:junit4]   2> 726 T143 oasc.SolrDeletionPolicy.updateCommits newest commit = 1
[junit4:junit4]   2> 728 T143 oasc.RequestHandlers.initHandlersFromConfig created /update: solr.UpdateRequestHandler
[junit4:junit4]   2> 728 T143 oasc.RequestHandlers.initHandlersFromConfig created /elevate: org.apache.solr.handler.component.SearchHandler
[junit4:junit4]   2> 729 T143 oasc.RequestHandlers.initHandlersFromConfig created /dataElevate: org.apache.solr.handler.component.SearchHandler
[junit4:junit4]   2> 729 T143 oashl.XMLLoader.init xsltCacheLifetimeSeconds=60
[junit4:junit4]   2> 729 T143 oasc.RequestHandlers.initHandlersFromConfig WARNING no default request handler is registered (either '/select' or 'standard')
[junit4:junit4]   2> 731 T143 oasc.SolrCore.initDeprecatedSupport WARNING solrconfig.xml uses deprecated <admin/gettableFiles>, Please update your config to use the ShowFileRequestHandler.
[junit4:junit4]   2> 732 T143 oasc.SolrCore.initDeprecatedSupport WARNING adding ShowFileRequestHandler with hidden files: [SOLRCONFIG-MASTER1-KEEPONEBACKUP.XML, SCHEMA11.XML, SCHEMA15.XML, BAD-SCHEMA-NOT-INDEXED-BUT-TF.XML, SOLRCONFIG-BASIC.XML, SCHEMA-PHRASESUGGEST.XML, BAD-SOLRCONFIG-MISSING-SCRIPTFILE.XML, SOLRCONFIG-ELEVATE.XML, SOLRCONFIG-SLAVE1.XML, BAD-SCHEMA-SIM-GLOBAL-VS-FT-MISMATCH.XML, STOP-2.TXT, SCHEMA-TFIDF.XML, BAD-SCHEMA-NOT-INDEXED-BUT-NORMS.XML, SCHEMA-LMJELINEKMERCER.XML, SOLRCONFIG_CODEC.XML, SOLRCONFIG-TLOG.XML, FRENCHARTICLES.TXT, SOLRCONFIG-REQHANDLER.INCL, SOLRCONFIG-UPDATE-PROCESSOR-CHAINS.XML, SOLRCONFIG-TRANSFORMERS.XML, TRIVIAL.UPDATEPROCESSOR0.JS, SOLRCONFIG-SOLCOREPROPERTIES.XML, SOLRCONFIG-SPELLCHECKER.XML, SCHEMA-REVERSED.XML, STEMDICT.TXT, SCHEMA-COPYFIELD-TEST.XML, SOLRCONFIG-SOLR-749.XML, SOLRCONFIG-QUERYSENDER.XML, SOLRCONFIG-PROPINJECT-INDEXDEFAULT.XML, HUNSPELL-TEST.DIC, SCHEMA-REPLICATION2.XML, SOLRCONFIG-NATIVELOCK.XML, BAD-SCHEMA-DUP-FIELD.XML, SOLRCONFIG-MASTER1.XML, SOLRCONFIG-PROPINJECT.XML, DA_UTF8.XML, SCHEMA-MINIMAL.XML, SCHEMA-NOT-REQUIRED-UNIQUE-KEY.XML, XSLT, SCHEMA-STOP-KEEP.XML, SOLRCONFIG-QUERYSENDER-NOQUERY.XML, SOLRCONFIG-DELPOLICY1.XML, BAD-SCHEMA-EXTERNAL-FILEFIELD.XML, MAPPING-ISOLATIN1ACCENT.TXT, THROW.ERROR.ON.ADD.UPDATEPROCESSOR.JS, SOLRCONFIG-CACHING.XML, SCHEMA-SPELLCHECKER.XML, SCHEMA-NUMERIC.XML, SCHEMA-SIM.XML, SOLRCONFIG-TERMINDEX.XML, SCHEMA-COLLATE.XML, MISSING.FUNCTIONS.UPDATEPROCESSOR.JS, ELEVATE.XML, SOLRCONFIG-MERGEPOLICY.XML, PHRASESUGGEST.TXT, STOPTYPES-1.TXT, BAD_SOLRCONFIG.XML, STOPTYPES-2.TXT, BAD-SCHEMA-NOT-INDEXED-BUT-POS.XML, BAD-SCHEMA-ANALYZER-CLASS-AND-NESTED.XML, BAD-SOLRCONFIG-INVALID-SCRIPTFILE.XML, SOLRCONFIG_PERF.XML, SCHEMA-REPLICATION1.XML, BAD-SCHEMA-DUP-DYNAMICFIELD.XML, SOLRCONFIG-DELPOLICY2.XML, HYPHENATION.DTD, STOPWORDSWRONGENCODING.TXT, CONDITIONAL.UPDATEPROCESSOR.JS, SOLRCONFIG-XINCLUDE.XML, SOLRCONFIG-SCRIPT-UPDATEPROCESSOR.XML, WDFTYPES.TXT, SCHEMA-LMDIRICHLET.XML, SCHEMA_CODEC.XML, SOLRCONFIG-PHRASESUGGEST.XML, SCHEMA-BINARYFIELD.XML, COMPOUNDDICTIONARY.TXT, SOLRCONFIG-MASTER2.XML, BAD-SOLRCONFIG-BOGUS-SCRIPTENGINE-NAME.XML, SCHEMA-BM25.XML, SCHEMA-TRIE.XML, SCHEMA-REQUIRED-FIELDS.XML, SCHEMA-CHARFILTERS.XML, STOP-1.TXT, BAD-SCHEMA-CODEC-GLOBAL-VS-FT-MISMATCH.XML, SCHEMA.XML, ADDFIELDS.UPDATEPROCESSOR.JS, SCHEMA-FOLDING.XML, SOLRCONFIG-LAZYWRITER.XML, BAD-SCHEMA-UNIQUEKEY-IS-COPYFIELD-DEST.XML, SCHEMA-DFR.XML, KEEP-2.TXT, SCHEMA-LUCENEMATCHVERSION.XML, SCHEMA-IB.XML, SOLRCONFIG-MASTER.XML, SCHEMASURROUND.XML, OLD_SYNONYMS.TXT, BAD-SCHEMA-OMIT-TF-BUT-NOT-POS.XML, MISSLEADING.EXTENSION.UPDATEPROCESSOR.JS.TXT, STOP-SNOWBALL.TXT, SOLRCONFIG-MASTER3.XML, SCHEMA12.XML, BAD-MP-SOLRCONFIG.XML, HUNSPELL-TEST.AFF, OPEN-EXCHANGE-RATES.JSON, STOPWORDS.TXT, BAD-SCHEMA-NONTEXT-ANALYZER.XML, SOLRCONFIG-SLAVE.XML, SOLRCONFIG-NOCACHE.XML, BAD-SCHEMA-DUP-FIELDTYPE.XML, SOLRCONFIG-ENABLEPLUGIN.XML, BAD-SCHEMA-UNIQUEKEY-USES-DEFAULT.XML, SOLRCONFIG-ALTDIRECTORY.XML, SOLRCONFIG-HIGHLIGHT.XML, SYNONYMS.TXT, SOLRCONFIG-SPELLCHECKCOMPONENT.XML, BAD-SCHEMA-UNIQUEKEY-MULTIVALUED.XML, PROTWORDS.TXT, DA_COMPOUNDDICTIONARY.TXT, KEEP-1.TXT, TRIVIAL.UPDATEPROCESSOR1.JS, STOPWITHBOM.TXT, SOLRCONFIG-SIMPLELOCK.XML, SOLRCONFIG-REPEATER.XML, SOLRCONFIG-FUNCTIONQUERY.XML, CURRENCY.XML]
[junit4:junit4]   2> 734 T143 oass.SolrIndexSearcher.<init> Opening Searcher@56d172ef main
[junit4:junit4]   2> 734 T143 oass.SolrIndexSearcher.getIndexDir WARNING WARNING: Directory impl does not support setting indexDir: org.apache.lucene.store.MockDirectoryWrapper
[junit4:junit4]   2> 735 T143 oasu.CommitTracker.<init> Hard AutoCommit: disabled
[junit4:junit4]   2> 735 T143 oasu.CommitTracker.<init> Soft AutoCommit: disabled
[junit4:junit4]   2> 736 T143 oashc.QueryElevationComponent.inform Loading QueryElevation from: /mnt/ssd/jenkins/workspace/Lucene-Solr-trunk-Linux/checkout/solr/build/solr-core/test-files/solr/collection1/conf/elevate.xml
[junit4:junit4]   2> 746 T143 oashc.QueryElevationComponent.inform Loading QueryElevation from: /mnt/ssd/jenkins/workspace/Lucene-Solr-trunk-Linux/checkout/solr/build/solr-core/test-files/solr/collection1/conf/elevate.xml
[junit4:junit4]   2> 767 T143 oashc.HttpShardHandlerFactory.getParameter Setting socketTimeout to: 0
[junit4:junit4]   2> 767 T143 oashc.HttpShardHandlerFactory.getParameter Setting urlScheme to: http://
[junit4:junit4]   2> 768 T143 oashc.HttpShardHandlerFactory.getParameter Setting connTimeout to: 0
[junit4:junit4]   2> 768 T143 oashc.HttpShardHandlerFactory.getParameter Setting maxConnectionsPerHost to: 20
[junit4:junit4]   2> 768 T143 oashc.HttpShardHandlerFactory.getParameter Setting corePoolSize to: 0
[junit4:junit4]   2> 768 T143 oashc.HttpShardHandlerFactory.getParameter Setting maximumPoolSize to: 2147483647
[junit4:junit4]   2> 769 T143 oashc.HttpShardHandlerFactory.getParameter Setting maxThreadIdleTime to: 5
[junit4:junit4]   2> 769 T143 oashc.HttpShardHandlerFactory.getParameter Setting sizeOfQueue to: -1
[junit4:junit4]   2> 769 T143 oashc.HttpShardHandlerFactory.getParameter Setting fairnessPolicy to: false
[junit4:junit4]   2> 769 T143 oascsi.HttpClientUtil.createClient Creating new http client, config:maxConnectionsPerHost=20&maxConnections=10000&socketTimeout=0&connTimeout=0&retry=false
[junit4:junit4]   2> 782 T163 oasc.SolrCore.registerSearcher [collection1] Registered new searcher Searcher@56d172ef main{StandardDirectoryReader(segments_1:1)}
[junit4:junit4]   2> 783 T143 oasc.CoreContainer.register registering core: collection1
[junit4:junit4]   2> 784 T143 oass.SolrDispatchFilter.init user.dir=/mnt/ssd/jenkins/workspace/Lucene-Solr-trunk-Linux/checkout/solr/build/solr-core/test/J1
[junit4:junit4]   2> 784 T143 oass.SolrDispatchFilter.init SolrDispatchFilter.init() done
[junit4:junit4]   2> 784 T143 oascsi.HttpClientUtil.createClient Creating new http client, config:maxConnections=128&maxConnectionsPerHost=32&followRedirects=false
[junit4:junit4]   2> 788 T143 oejs.Server.doStart jetty-8.1.2.v20120308
[junit4:junit4]   2> 848 T143 oejs.AbstractConnector.doStart Started SocketConnector@0.0.0.0:59729
[junit4:junit4]   2> 848 T143 oasc.SolrResourceLoader.locateSolrHome JNDI not configured for solr (NoInitialContextEx)
[junit4:junit4]   2> 848 T143 oasc.SolrResourceLoader.locateSolrHome using system property solr.solr.home: /mnt/ssd/jenkins/workspace/Lucene-Solr-trunk-Linux/checkout/solr/build/solr-core/test-files/solr
[junit4:junit4]   2> 849 T143 oasc.SolrResourceLoader.<init> new SolrResourceLoader for deduced Solr Home: '/mnt/ssd/jenkins/workspace/Lucene-Solr-trunk-Linux/checkout/solr/build/solr-core/test-files/solr/'
[junit4:junit4]   2> 857 T143 oass.SolrDispatchFilter.init SolrDispatchFilter.init()
[junit4:junit4]   2> 857 T143 oasc.SolrResourceLoader.locateSolrHome JNDI not configured for solr (NoInitialContextEx)
[junit4:junit4]   2> 858 T143 oasc.SolrResourceLoader.locateSolrHome using system property solr.solr.home: /mnt/ssd/jenkins/workspace/Lucene-Solr-trunk-Linux/checkout/solr/build/solr-core/test-files/solr
[junit4:junit4]   2> 858 T143 oasc.CoreContainer$Initializer.initialize looking for solr.xml: /mnt/ssd/jenkins/workspace/Lucene-Solr-trunk-Linux/checkout/solr/build/solr-core/test-files/solr/solr.xml
[junit4:junit4]   2> 858 T143 oasc.CoreContainer.<init> New CoreContainer 1842507065
[junit4:junit4]   2> 858 T143 oasc.CoreContainer.load Loading CoreContainer using Solr Home: '/mnt/ssd/jenkins/workspace/Lucene-Solr-trunk-Linux/checkout/solr/build/solr-core/test-files/solr/'
[junit4:junit4]   2> 859 T143 oasc.SolrResourceLoader.<init> new SolrResourceLoader for directory: '/mnt/ssd/jenkins/workspace/Lucene-Solr-trunk-Linux/checkout/solr/build/solr-core/test-files/solr/'
[junit4:junit4]   2> 887 T143 oasc.CoreContainer.load Registering Log Listener
[junit4:junit4]   2> 901 T143 oasc.CoreContainer.create Creating SolrCore 'collection1' using instanceDir: /mnt/ssd/jenkins/workspace/Lucene-Solr-trunk-Linux/checkout/solr/build/solr-core/test-files/solr/collection1
[junit4:junit4]   2> 901 T143 oasc.SolrResourceLoader.<init> new SolrResourceLoader for directory: '/mnt/ssd/jenkins/workspace/Lucene-Solr-trunk-Linux/checkout/solr/build/solr-core/test-files/solr/collection1/'
[junit4:junit4]   2> 902 T143 oasc.SolrResourceLoader.replaceClassLoader Adding 'file:/mnt/ssd/jenkins/workspace/Lucene-Solr-trunk-Linux/checkout/solr/build/solr-core/test-files/solr/collection1/lib/README' to classloader
[junit4:junit4]   2> 902 T143 oasc.SolrResourceLoader.replaceClassLoader Adding 'file:/mnt/ssd/jenkins/workspace/Lucene-Solr-trunk-Linux/checkout/solr/build/solr-core/test-files/solr/collection1/lib/classes/' to classloader
[junit4:junit4]   2> 925 T143 oasc.SolrConfig.<init> Using Lucene MatchVersion: LUCENE_50
[junit4:junit4]   2> 962 T143 oasc.SolrConfig.<init> Loaded SolrConfig: solrconfig-elevate.xml
[junit4:junit4]   2> 962 T143 oass.IndexSchema.readSchema Reading Solr Schema
[junit4:junit4]   2> 965 T143 oass.IndexSchema.readSchema Schema name=example
[junit4:junit4]   2> 1118 T143 oass.IndexSchema.readSchema default search field in schema is text
[junit4:junit4]   2> 1120 T143 oass.IndexSchema.readSchema unique key field: id
[junit4:junit4]   2> 1142 T143 oasc.SolrCore.<init> [collection1] Opening new SolrCore at /mnt/ssd/jenkins/workspace/Lucene-Solr-trunk-Linux/checkout/solr/build/solr-core/test-files/solr/collection1/, dataDir=./org.apache.solr.handler.component.DistributedQueryElevationComponentTest-1343828559693/shard1/data/
[junit4:junit4]   2> 1143 T143 oasc.JmxMonitoredMap.<init> JMX monitoring is enabled. Adding Solr mbeans to JMX Server: com.sun.jmx.mbeanserver.JmxMBeanServer@4979e4bc
[junit4:junit4]   2> 1143 T143 oasc.SolrCore.getNewIndexDir WARNING New index directory detected: old=null new=./org.apache.solr.handler.component.DistributedQueryElevationComponentTest-1343828559693/shard1/data/index/
[junit4:junit4]   2> 1144 T143 oasc.SolrCore.initIndex WARNING [collection1] Solr index directory './org.apache.solr.handler.component.DistributedQueryElevationComponentTest-1343828559693/shard1/data/index' doesn't exist. Creating new index...
[junit4:junit4]   2> 1152 T143 oasc.SolrDeletionPolicy.onCommit SolrDeletionPolicy.onCommit: commits:num=1
[junit4:junit4]   2> 		commit{dir=MockDirWrapper(org.apache.lucene.store.RAMDirectory@89d1e34 lockFactory=org.apache.lucene.store.SingleInstanceLockFactory@355b4560),segFN=segments_1,generation=1,filenames=[segments_1]
[junit4:junit4]   2> 1152 T143 oasc.SolrDeletionPolicy.updateCommits newest commit = 1
[junit4:junit4]   2> 1153 T143 oasc.RequestHandlers.initHandlersFromConfig created /update: solr.UpdateRequestHandler
[junit4:junit4]   2> 1154 T143 oasc.RequestHandlers.initHandlersFromConfig created /elevate: org.apache.solr.handler.component.SearchHandler
[junit4:junit4]   2> 1154 T143 oasc.RequestHandlers.initHandlersFromConfig created /dataElevate: org.apache.solr.handler.component.SearchHandler
[junit4:junit4]   2> 1155 T143 oashl.XMLLoader.init xsltCacheLifetimeSeconds=60
[junit4:junit4]   2> 1155 T143 oasc.RequestHandlers.initHandlersFromConfig WARNING no default request handler is registered (either '/select' or 'standard')
[junit4:junit4]   2> 1156 T143 oasc.SolrCore.initDeprecatedSupport WARNING solrconfig.xml uses deprecated <admin/gettableFiles>, Please update your config to use the ShowFileRequestHandler.
[junit4:junit4]   2> 1157 T143 oasc.SolrCore.initDeprecatedSupport WARNING adding ShowFileRequestHandler with hidden files: [SOLRCONFIG-MASTER1-KEEPONEBACKUP.XML, SCHEMA11.XML, SCHEMA15.XML, BAD-SCHEMA-NOT-INDEXED-BUT-TF.XML, SOLRCONFIG-BASIC.XML, SCHEMA-PHRASESUGGEST.XML, BAD-SOLRCONFIG-MISSING-SCRIPTFILE.XML, SOLRCONFIG-ELEVATE.XML, SOLRCONFIG-SLAVE1.XML, BAD-SCHEMA-SIM-GLOBAL-VS-FT-MISMATCH.XML, STOP-2.TXT, SCHEMA-TFIDF.XML, BAD-SCHEMA-NOT-INDEXED-BUT-NORMS.XML, SCHEMA-LMJELINEKMERCER.XML, SOLRCONFIG_CODEC.XML, SOLRCONFIG-TLOG.XML, FRENCHARTICLES.TXT, SOLRCONFIG-REQHANDLER.INCL, SOLRCONFIG-UPDATE-PROCESSOR-CHAINS.XML, SOLRCONFIG-TRANSFORMERS.XML, TRIVIAL.UPDATEPROCESSOR0.JS, SOLRCONFIG-SOLCOREPROPERTIES.XML, SOLRCONFIG-SPELLCHECKER.XML, SCHEMA-REVERSED.XML, STEMDICT.TXT, SCHEMA-COPYFIELD-TEST.XML, SOLRCONFIG-SOLR-749.XML, SOLRCONFIG-QUERYSENDER.XML, SOLRCONFIG-PROPINJECT-INDEXDEFAULT.XML, HUNSPELL-TEST.DIC, SCHEMA-REPLICATION2.XML, SOLRCONFIG-NATIVELOCK.XML, BAD-SCHEMA-DUP-FIELD.XML, SOLRCONFIG-MASTER1.XML, SOLRCONFIG-PROPINJECT.XML, DA_UTF8.XML, SCHEMA-MINIMAL.XML, SCHEMA-NOT-REQUIRED-UNIQUE-KEY.XML, XSLT, SCHEMA-STOP-KEEP.XML, SOLRCONFIG-QUERYSENDER-NOQUERY.XML, SOLRCONFIG-DELPOLICY1.XML, BAD-SCHEMA-EXTERNAL-FILEFIELD.XML, MAPPING-ISOLATIN1ACCENT.TXT, THROW.ERROR.ON.ADD.UPDATEPROCESSOR.JS, SOLRCONFIG-CACHING.XML, SCHEMA-SPELLCHECKER.XML, SCHEMA-NUMERIC.XML, SCHEMA-SIM.XML, SOLRCONFIG-TERMINDEX.XML, SCHEMA-COLLATE.XML, MISSING.FUNCTIONS.UPDATEPROCESSOR.JS, ELEVATE.XML, SOLRCONFIG-MERGEPOLICY.XML, PHRASESUGGEST.TXT, STOPTYPES-1.TXT, BAD_SOLRCONFIG.XML, STOPTYPES-2.TXT, BAD-SCHEMA-NOT-INDEXED-BUT-POS.XML, BAD-SCHEMA-ANALYZER-CLASS-AND-NESTED.XML, BAD-SOLRCONFIG-INVALID-SCRIPTFILE.XML, SOLRCONFIG_PERF.XML, SCHEMA-REPLICATION1.XML, BAD-SCHEMA-DUP-DYNAMICFIELD.XML, SOLRCONFIG-DELPOLICY2.XML, HYPHENATION.DTD, STOPWORDSWRONGENCODING.TXT, CONDITIONAL.UPDATEPROCESSOR.JS, SOLRCONFIG-XINCLUDE.XML, SOLRCONFIG-SCRIPT-UPDATEPROCESSOR.XML, WDFTYPES.TXT, SCHEMA-LMDIRICHLET.XML, SCHEMA_CODEC.XML, SOLRCONFIG-PHRASESUGGEST.XML, SCHEMA-BINARYFIELD.XML, COMPOUNDDICTIONARY.TXT, SOLRCONFIG-MASTER2.XML, BAD-SOLRCONFIG-BOGUS-SCRIPTENGINE-NAME.XML, SCHEMA-BM25.XML, SCHEMA-TRIE.XML, SCHEMA-REQUIRED-FIELDS.XML, SCHEMA-CHARFILTERS.XML, STOP-1.TXT, BAD-SCHEMA-CODEC-GLOBAL-VS-FT-MISMATCH.XML, SCHEMA.XML, ADDFIELDS.UPDATEPROCESSOR.JS, SCHEMA-FOLDING.XML, SOLRCONFIG-LAZYWRITER.XML, BAD-SCHEMA-UNIQUEKEY-IS-COPYFIELD-DEST.XML, SCHEMA-DFR.XML, KEEP-2.TXT, SCHEMA-LUCENEMATCHVERSION.XML, SCHEMA-IB.XML, SOLRCONFIG-MASTER.XML, SCHEMASURROUND.XML, OLD_SYNONYMS.TXT, BAD-SCHEMA-OMIT-TF-BUT-NOT-POS.XML, MISSLEADING.EXTENSION.UPDATEPROCESSOR.JS.TXT, STOP-SNOWBALL.TXT, SOLRCONFIG-MASTER3.XML, SCHEMA12.XML, BAD-MP-SOLRCONFIG.XML, HUNSPELL-TEST.AFF, OPEN-EXCHANGE-RATES.JSON, STOPWORDS.TXT, BAD-SCHEMA-NONTEXT-ANALYZER.XML, SOLRCONFIG-SLAVE.XML, SOLRCONFIG-NOCACHE.XML, BAD-SCHEMA-DUP-FIELDTYPE.XML, SOLRCONFIG-ENABLEPLUGIN.XML, BAD-SCHEMA-UNIQUEKEY-USES-DEFAULT.XML, SOLRCONFIG-ALTDIRECTORY.XML, SOLRCONFIG-HIGHLIGHT.XML, SYNONYMS.TXT, SOLRCONFIG-SPELLCHECKCOMPONENT.XML, BAD-SCHEMA-UNIQUEKEY-MULTIVALUED.XML, PROTWORDS.TXT, DA_COMPOUNDDICTIONARY.TXT, KEEP-1.TXT, TRIVIAL.UPDATEPROCESSOR1.JS, STOPWITHBOM.TXT, SOLRCONFIG-SIMPLELOCK.XML, SOLRCONFIG-REPEATER.XML, SOLRCONFIG-FUNCTIONQUERY.XML, CURRENCY.XML]
[junit4:junit4]   2> 1182 T143 oass.SolrIndexSearcher.<init> Opening Searcher@6abf4158 main
[junit4:junit4]   2> 1182 T143 oass.SolrIndexSearcher.getIndexDir WARNING WARNING: Directory impl does not support setting indexDir: org.apache.lucene.store.MockDirectoryWrapper
[junit4:junit4]   2> 1183 T143 oasu.CommitTracker.<init> Hard AutoCommit: disabled
[junit4:junit4]   2> 1183 T143 oasu.CommitTracker.<init> Soft AutoCommit: disabled
[junit4:junit4]   2> 1184 T143 oashc.QueryElevationComponent.inform Loading QueryElevation from: /mnt/ssd/jenkins/workspace/Lucene-Solr-trunk-Linux/checkout/solr/build/solr-core/test-files/solr/collection1/conf/elevate.xml
[junit4:junit4]   2> 1191 T143 oashc.QueryElevationComponent.inform Loading QueryElevation from: /mnt/ssd/jenkins/workspace/Lucene-Solr-trunk-Linux/checkout/solr/build/solr-core/test-files/solr/collection1/conf/elevate.xml
[junit4:junit4]   2> 1202 T143 oashc.HttpShardHandlerFactory.getParameter Setting socketTimeout to: 0
[junit4:junit4]   2> 1203 T143 oashc.HttpShardHandlerFactory.getParameter Setting urlScheme to: http://
[junit4:junit4]   2> 1203 T143 oashc.HttpShardHandlerFactory.getParameter Setting connTimeout to: 0
[junit4:junit4]   2> 1203 T143 oashc.HttpShardHandlerFactory.getParameter Setting maxConnectionsPerHost to: 20
[junit4:junit4]   2> 1203 T143 oashc.HttpShardHandlerFactory.getParameter Setting corePoolSize to: 0
[junit4:junit4]   2> 1204 T143 oashc.HttpShardHandlerFactory.getParameter Setting maximumPoolSize to: 2147483647
[junit4:junit4]   2> 1204 T143 oashc.HttpShardHandlerFactory.getParameter Setting maxThreadIdleTime to: 5
[junit4:junit4]   2> 1204 T143 oashc.HttpShardHandlerFactory.getParameter Setting sizeOfQueue to: -1
[junit4:junit4]   2> 1204 T143 oashc.HttpShardHandlerFactory.getParameter Setting fairnessPolicy to: false
[junit4:junit4]   2> 1204 T143 oascsi.HttpClientUtil.createClient Creating new http client, config:maxConnectionsPerHost=20&maxConnections=10000&socketTimeout=0&connTimeout=0&retry=false
[junit4:junit4]   2> 1212 T173 oasc.SolrCore.registerSearcher [collection1] Registered new searcher Searcher@6abf4158 main{StandardDirectoryReader(segments_1:1)}
[junit4:junit4]   2> 1213 T143 oasc.CoreContainer.register registering core: collection1
[junit4:junit4]   2> 1213 T143 oass.SolrDispatchFilter.init user.dir=/mnt/ssd/jenkins/workspace/Lucene-Solr-trunk-Linux/checkout/solr/build/solr-core/test/J1
[junit4:junit4]   2> 1213 T143 oass.SolrDispatchFilter.init SolrDispatchFilter.init() done
[junit4:junit4]   2> 1213 T143 oascsi.HttpClientUtil.createClient Creating new http client, config:maxConnections=128&maxConnectionsPerHost=32&followRedirects=false
[junit4:junit4]   2> 1222 T143 oejs.Server.doStart jetty-8.1.2.v20120308
[junit4:junit4]   2> 1229 T143 oejs.AbstractConnector.doStart Started SocketConnector@0.0.0.0:47218
[junit4:junit4]   2> 1229 T143 oasc.SolrResourceLoader.locateSolrHome JNDI not configured for solr (NoInitialContextEx)
[junit4:junit4]   2> 1230 T143 oasc.SolrResourceLoader.locateSolrHome using system property solr.solr.home: /mnt/ssd/jenkins/workspace/Lucene-Solr-trunk-Linux/checkout/solr/build/solr-core/test-files/solr
[junit4:junit4]   2> 1230 T143 oasc.SolrResourceLoader.<init> new SolrResourceLoader for deduced Solr Home: '/mnt/ssd/jenkins/workspace/Lucene-Solr-trunk-Linux/checkout/solr/build/solr-core/test-files/solr/'
[junit4:junit4]   2> 1238 T143 oass.SolrDispatchFilter.init SolrDispatchFilter.init()
[junit4:junit4]   2> 1238 T143 oasc.SolrResourceLoader.locateSolrHome JNDI not configured for solr (NoInitialContextEx)
[junit4:junit4]   2> 1239 T143 oasc.SolrResourceLoader.locateSolrHome using system property solr.solr.home: /mnt/ssd/jenkins/workspace/Lucene-Solr-trunk-Linux/checkout/solr/build/solr-core/test-files/solr
[junit4:junit4]   2> 1239 T143 oasc.CoreContainer$Initializer.initialize looking for solr.xml: /mnt/ssd/jenkins/workspace/Lucene-Solr-trunk-Linux/checkout/solr/build/solr-core/test-files/solr/solr.xml
[junit4:junit4]   2> 1239 T143 oasc.CoreContainer.<init> New CoreContainer 1360577134
[junit4:junit4]   2> 1239 T143 oasc.CoreContainer.load Loading CoreContainer using Solr Home: '/mnt/ssd/jenkins/workspace/Lucene-Solr-trunk-Linux/checkout/solr/build/solr-core/test-files/solr/'
[junit4:junit4]   2> 1240 T143 oasc.SolrResourceLoader.<init> new SolrResourceLoader for directory: '/mnt/ssd/jenkins/workspace/Lucene-Solr-trunk-Linux/checkout/solr/build/solr-core/test-files/solr/'
[junit4:junit4]   2> 1271 T143 oasc.CoreContainer.load Registering Log Listener
[junit4:junit4]   2> 1299 T143 oasc.CoreContainer.create Creating SolrCore 'collection1' using instanceDir: /mnt/ssd/jenkins/workspace/Lucene-Solr-trunk-Linux/checkout/solr/build/solr-core/test-files/solr/collection1
[junit4:junit4]   2> 1300 T143 oasc.SolrResourceLoader.<init> new SolrResourceLoader for directory: '/mnt/ssd/jenkins/workspace/Lucene-Solr-trunk-Linux/checkout/solr/build/solr-core/test-files/solr/collection1/'
[junit4:junit4]   2> 1306 T143 oasc.SolrResourceLoader.replaceClassLoader Adding 'file:/mnt/ssd/jenkins/workspace/Lucene-Solr-trunk-Linux/checkout/solr/build/solr-core/test-files/solr/collection1/lib/README' to classloader
[junit4:junit4]   2> 1306 T143 oasc.SolrResourceLoader.replaceClassLoader Adding 'file:/mnt/ssd/jenkins/workspace/Lucene-Solr-trunk-Linux/checkout/solr/build/solr-core/test-files/solr/collection1/lib/classes/' to classloader
[junit4:junit4]   2> 1349 T143 oasc.SolrConfig.<init> Using Lucene MatchVersion: LUCENE_50
[junit4:junit4]   2> 1377 T143 oasc.SolrConfig.<init> Loaded SolrConfig: solrconfig-elevate.xml
[junit4:junit4]   2> 1377 T143 oass.IndexSchema.readSchema Reading Solr Schema
[junit4:junit4]   2> 1379 T143 oass.IndexSchema.readSchema Schema name=example
[junit4:junit4]   2> 1525 T143 oass.IndexSchema.readSchema default search field in schema is text
[junit4:junit4]   2> 1527 T143 oass.IndexSchema.readSchema unique key field: id
[junit4:junit4]   2> 1530 T143 oasc.SolrCore.<init> [collection1] Opening new SolrCore at /mnt/ssd/jenkins/workspace/Lucene-Solr-trunk-Linux/checkout/solr/build/solr-core/test-files/solr/collection1/, dataDir=./org.apache.solr.handler.component.DistributedQueryElevationComponentTest-1343828559693/shard2/data/
[junit4:junit4]   2> 1531 T143 oasc.JmxMonitoredMap.<init> JMX monitoring is enabled. Adding Solr mbeans to JMX Server: com.sun.jmx.mbeanserver.JmxMBeanServer@4979e4bc
[junit4:junit4]   2> 1531 T143 oasc.SolrCore.getNewIndexDir WARNING New index directory detected: old=null new=./org.apache.solr.handler.component.DistributedQueryElevationComponentTest-1343828559693/shard2/data/index/
[junit4:junit4]   2> 1532 T143 oasc.SolrCore.initIndex WARNING [collection1] Solr index directory './org.apache.solr.handler.component.DistributedQueryElevationComponentTest-1343828559693/shard2/data/index' doesn't exist. Creating new index...
[junit4:junit4]   2> 1536 T143 oasc.SolrDeletionPolicy.onCommit SolrDeletionPolicy.onCommit: commits:num=1
[junit4:junit4]   2> 		commit{dir=MockDirWrapper(org.apache.lucene.store.RAMDirectory@75905090 lockFactory=org.apache.lucene.store.SingleInstanceLockFactory@46f3450b),segFN=segments_1,generation=1,filenames=[segments_1]
[junit4:junit4]   2> 1536 T143 oasc.SolrDeletionPolicy.updateCommits newest commit = 1
[junit4:junit4]   2> 1538 T143 oasc.RequestHandlers.initHandlersFromConfig created /update: solr.UpdateRequestHandler
[junit4:junit4]   2> 1539 T143 oasc.RequestHandlers.initHandlersFromConfig created /elevate: org.apache.solr.handler.component.SearchHandler
[junit4:junit4]   2> 1539 T143 oasc.RequestHandlers.initHandlersFromConfig created /dataElevate: org.apache.solr.handler.component.SearchHandler
[junit4:junit4]   2> 1540 T143 oashl.XMLLoader.init xsltCacheLifetimeSeconds=60
[junit4:junit4]   2> 1540 T143 oasc.RequestHandlers.initHandlersFromConfig WARNING no default request handler is registered (either '/select' or 'standard')
[junit4:junit4]   2> 1541 T143 oasc.SolrCore.initDeprecatedSupport WARNING solrconfig.xml uses deprecated <admin/gettableFiles>, Please update your config to use the ShowFileRequestHandler.
[junit4:junit4]   2> 1542 T143 oasc.SolrCore.initDeprecatedSupport WARNING adding ShowFileRequestHandler with hidden files: [SOLRCONFIG-MASTER1-KEEPONEBACKUP.XML, SCHEMA11.XML, SCHEMA15.XML, BAD-SCHEMA-NOT-INDEXED-BUT-TF.XML, SOLRCONFIG-BASIC.XML, SCHEMA-PHRASESUGGEST.XML, BAD-SOLRCONFIG-MISSING-SCRIPTFILE.XML, SOLRCONFIG-ELEVATE.XML, SOLRCONFIG-SLAVE1.XML, BAD-SCHEMA-SIM-GLOBAL-VS-FT-MISMATCH.XML, STOP-2.TXT, SCHEMA-TFIDF.XML, BAD-SCHEMA-NOT-INDEXED-BUT-NORMS.XML, SCHEMA-LMJELINEKMERCER.XML, SOLRCONFIG_CODEC.XML, SOLRCONFIG-TLOG.XML, FRENCHARTICLES.TXT, SOLRCONFIG-REQHANDLER.INCL, SOLRCONFIG-UPDATE-PROCESSOR-CHAINS.XML, SOLRCONFIG-TRANSFORMERS.XML, TRIVIAL.UPDATEPROCESSOR0.JS, SOLRCONFIG-SOLCOREPROPERTIES.XML, SOLRCONFIG-SPELLCHECKER.XML, SCHEMA-REVERSED.XML, STEMDICT.TXT, SCHEMA-COPYFIELD-TEST.XML, SOLRCONFIG-SOLR-749.XML, SOLRCONFIG-QUERYSENDER.XML, SOLRCONFIG-PROPINJECT-INDEXDEFAULT.XML, HUNSPELL-TEST.DIC, SCHEMA-REPLICATION2.XML, SOLRCONFIG-NATIVELOCK.XML, BAD-SCHEMA-DUP-FIELD.XML, SOLRCONFIG-MASTER1.XML, SOLRCONFIG-PROPINJECT.XML, DA_UTF8.XML, SCHEMA-MINIMAL.XML, SCHEMA-NOT-REQUIRED-UNIQUE-KEY.XML, XSLT, SCHEMA-STOP-KEEP.XML, SOLRCONFIG-QUERYSENDER-NOQUERY.XML, SOLRCONFIG-DELPOLICY1.XML, BAD-SCHEMA-EXTERNAL-FILEFIELD.XML, MAPPING-ISOLATIN1ACCENT.TXT, THROW.ERROR.ON.ADD.UPDATEPROCESSOR.JS, SOLRCONFIG-CACHING.XML, SCHEMA-SPELLCHECKER.XML, SCHEMA-NUMERIC.XML, SCHEMA-SIM.XML, SOLRCONFIG-TERMINDEX.XML, SCHEMA-COLLATE.XML, MISSING.FUNCTIONS.UPDATEPROCESSOR.JS, ELEVATE.XML, SOLRCONFIG-MERGEPOLICY.XML, PHRASESUGGEST.TXT, STOPTYPES-1.TXT, BAD_SOLRCONFIG.XML, STOPTYPES-2.TXT, BAD-SCHEMA-NOT-INDEXED-BUT-POS.XML, BAD-SCHEMA-ANALYZER-CLASS-AND-NESTED.XML, BAD-SOLRCONFIG-INVALID-SCRIPTFILE.XML, SOLRCONFIG_PERF.XML, SCHEMA-REPLICATION1.XML, BAD-SCHEMA-DUP-DYNAMICFIELD.XML, SOLRCONFIG-DELPOLICY2.XML, HYPHENATION.DTD, STOPWORDSWRONGENCODING.TXT, CONDITIONAL.UPDATEPROCESSOR.JS, SOLRCONFIG-XINCLUDE.XML, SOLRCONFIG-SCRIPT-UPDATEPROCESSOR.XML, WDFTYPES.TXT, SCHEMA-LMDIRICHLET.XML, SCHEMA_CODEC.XML, SOLRCONFIG-PHRASESUGGEST.XML, SCHEMA-BINARYFIELD.XML, COMPOUNDDICTIONARY.TXT, SOLRCONFIG-MASTER2.XML, BAD-SOLRCONFIG-BOGUS-SCRIPTENGINE-NAME.XML, SCHEMA-BM25.XML, SCHEMA-TRIE.XML, SCHEMA-REQUIRED-FIELDS.XML, SCHEMA-CHARFILTERS.XML, STOP-1.TXT, BAD-SCHEMA-CODEC-GLOBAL-VS-FT-MISMATCH.XML, SCHEMA.XML, ADDFIELDS.UPDATEPROCESSOR.JS, SCHEMA-FOLDING.XML, SOLRCONFIG-LAZYWRITER.XML, BAD-SCHEMA-UNIQUEKEY-IS-COPYFIELD-DEST.XML, SCHEMA-DFR.XML, KEEP-2.TXT, SCHEMA-LUCENEMATCHVERSION.XML, SCHEMA-IB.XML, SOLRCONFIG-MASTER.XML, SCHEMASURROUND.XML, OLD_SYNONYMS.TXT, BAD-SCHEMA-OMIT-TF-BUT-NOT-POS.XML, MISSLEADING.EXTENSION.UPDATEPROCESSOR.JS.TXT, STOP-SNOWBALL.TXT, SOLRCONFIG-MASTER3.XML, SCHEMA12.XML, BAD-MP-SOLRCONFIG.XML, HUNSPELL-TEST.AFF, OPEN-EXCHANGE-RATES.JSON, STOPWORDS.TXT, BAD-SCHEMA-NONTEXT-ANALYZER.XML, SOLRCONFIG-SLAVE.XML, SOLRCONFIG-NOCACHE.XML, BAD-SCHEMA-DUP-FIELDTYPE.XML, SOLRCONFIG-ENABLEPLUGIN.XML, BAD-SCHEMA-UNIQUEKEY-USES-DEFAULT.XML, SOLRCONFIG-ALTDIRECTORY.XML, SOLRCONFIG-HIGHLIGHT.XML, SYNONYMS.TXT, SOLRCONFIG-SPELLCHECKCOMPONENT.XML, BAD-SCHEMA-UNIQUEKEY-MULTIVALUED.XML, PROTWORDS.TXT, DA_COMPOUNDDICTIONARY.TXT, KEEP-1.TXT, TRIVIAL.UPDATEPROCESSOR1.JS, STOPWITHBOM.TXT, SOLRCONFIG-SIMPLELOCK.XML, SOLRCONFIG-REPEATER.XML, SOLRCONFIG-FUNCTIONQUERY.XML, CURRENCY.XML]
[junit4:junit4]   2> 1548 T143 oass.SolrIndexSearcher.<init> Opening Searcher@440d747d main
[junit4:junit4]   2> 1548 T143 oass.SolrIndexSearcher.getIndexDir WARNING WARNING: Directory impl does not support setting indexDir: org.apache.lucene.store.MockDirectoryWrapper
[junit4:junit4]   2> 1549 T143 oasu.CommitTracker.<init> Hard AutoCommit: disabled
[junit4:junit4]   2> 1549 T143 oasu.CommitTracker.<init> Soft AutoCommit: disabled
[junit4:junit4]   2> 1549 T143 oashc.QueryElevationComponent.inform Loading QueryElevation from: /mnt/ssd/jenkins/workspace/Lucene-Solr-trunk-Linux/checkout/solr/build/solr-core/test-files/solr/collection1/conf/elevate.xml
[junit4:junit4]   2> 1559 T143 oashc.QueryElevationComponent.inform Loading QueryElevation from: /mnt/ssd/jenkins/workspace/Lucene-Solr-trunk-Linux/checkout/solr/build/solr-core/test-files/solr/collection1/conf/elevate.xml
[junit4:junit4]   2> 1566 T143 oashc.HttpShardHandlerFactory.getParameter Setting socketTimeout to: 0
[junit4:junit4]   2> 1567 T143 oashc.HttpShardHandlerFactory.getParameter Setting urlScheme to: http://
[junit4:junit4]   2> 1567 T143 oashc.HttpShardHandlerFactory.getParameter Setting connTimeout to: 0
[junit4:junit4]   2> 1567 T143 oashc.HttpShardHandlerFactory.getParameter Setting maxConnectionsPerHost to: 20
[junit4:junit4]   2> 1567 T143 oashc.HttpShardHandlerFactory.getParameter Setting corePoolSize to: 0
[junit4:junit4]   2> 1568 T143 oashc.HttpShardHandlerFactory.getParameter Setting maximumPoolSize to: 2147483647
[junit4:junit4]   2> 1568 T143 oashc.HttpShardHandlerFactory.getParameter Setting maxThreadIdleTime to: 5
[junit4:junit4]   2> 1568 T143 oashc.HttpShardHandlerFactory.getParameter Setting sizeOfQueue to: -1
[junit4:junit4]   2> 1568 T143 oashc.HttpShardHandlerFactory.getParameter Setting fairnessPolicy to: false
[junit4:junit4]   2> 1569 T143 oascsi.HttpClientUtil.createClient Creating new http client, config:maxConnectionsPerHost=20&maxConnections=10000&socketTimeout=0&connTimeout=0&retry=false
[junit4:junit4]   2> 1572 T183 oasc.SolrCore.registerSearcher [collection1] Registered new searcher Searcher@440d747d main{StandardDirectoryReader(segments_1:1)}
[junit4:junit4]   2> 1575 T143 oasc.CoreContainer.register registering core: collection1
[junit4:junit4]   2> 1575 T143 oass.SolrDispatchFilter.init user.dir=/mnt/ssd/jenkins/workspace/Lucene-Solr-trunk-Linux/checkout/solr/build/solr-core/test/J1
[junit4:junit4]   2> 1575 T143 oass.SolrDispatchFilter.init SolrDispatchFilter.init() done
[junit4:junit4]   2> 1575 T143 oascsi.HttpClientUtil.createClient Creating new http client, config:maxConnections=128&maxConnectionsPerHost=32&followRedirects=false
[junit4:junit4]   2> ASYNC  NEW_CORE C12 name=collection1 org.apache.solr.core.SolrCore@66662913
[junit4:junit4]   2> 1601 T146 C12 oasu.DirectUpdateHandler2.deleteAll [collection1] REMOVING ALL DOCUMENTS FROM INDEX
[junit4:junit4]   2> 1602 T146 C12 oasc.SolrDeletionPolicy.onInit SolrDeletionPolicy.onInit: commits:num=1
[junit4:junit4]   2> 		commit{dir=MockDirWrapper(org.apache.lucene.store.RAMDirectory@3a26243f lockFactory=org.apache.lucene.store.SingleInstanceLockFactory@266e7c62),segFN=segments_1,generation=1,filenames=[segments_1]
[junit4:junit4]   2> 1603 T146 C12 oasc.SolrDeletionPolicy.updateCommits newest commit = 1
[junit4:junit4]   2> 1603 T146 C12 UPDATE [collection1] webapp=/solr path=/update params={wt=javabin&version=2} {deleteByQuery=*:*} 0 5
[junit4:junit4]   2> ASYNC  NEW_CORE C13 name=collection1 org.apache.solr.core.SolrCore@1c0818cf
[junit4:junit4]   2> 1610 T157 C13 oasu.DirectUpdateHandler2.deleteAll [collection1] REMOVING ALL DOCUMENTS FROM INDEX
[junit4:junit4]   2> 1611 T157 C13 oasc.SolrDeletionPolicy.onInit SolrDeletionPolicy.onInit: commits:num=1
[junit4:junit4]   2> 		commit{dir=MockDirWrapper(org.apache.lucene.store.RAMDirectory@5794cc69 lockFactory=org.apache.lucene.store.SingleInstanceLockFactory@24af6780),segFN=segments_1,generation=1,filenames=[segments_1]
[junit4:junit4]   2> 1612 T157 C13 oasc.SolrDeletionPolicy.updateCommits newest commit = 1
[junit4:junit4]   2> 1612 T157 C13 UPDATE [collection1] webapp=/solr path=/update params={wt=javabin&version=2} {deleteByQuery=*:*} 0 2
[junit4:junit4]   2> ASYNC  NEW_CORE C14 name=collection1 org.apache.solr.core.SolrCore@6351b73
[junit4:junit4]   2> 1621 T166 C14 oasu.DirectUpdateHandler2.deleteAll [collection1] REMOVING ALL DOCUMENTS FROM INDEX
[junit4:junit4]   2> 1623 T166 C14 oasc.SolrDeletionPolicy.onInit SolrDeletionPolicy.onInit: commits:num=1
[junit4:junit4]   2> 		commit{dir=MockDirWrapper(org.apache.lucene.store.RAMDirectory@89d1e34 lockFactory=org.apache.lucene.store.SingleInstanceLockFactory@355b4560),segFN=segments_1,generation=1,filenames=[segments_1]
[junit4:junit4]   2> 1624 T166 C14 oasc.SolrDeletionPolicy.updateCommits newest commit = 1
[junit4:junit4]   2> 1624 T166 C14 UPDATE [collection1] webapp=/solr path=/update params={wt=javabin&version=2} {deleteByQuery=*:*} 0 4
[junit4:junit4]   2> ASYNC  NEW_CORE C15 name=collection1 org.apache.solr.core.SolrCore@30160a24
[junit4:junit4]   2> 1634 T178 C15 oasu.DirectUpdateHandler2.deleteAll [collection1] REMOVING ALL DOCUMENTS FROM INDEX
[junit4:junit4]   2> 1635 T178 C15 oasc.SolrDeletionPolicy.onInit SolrDeletionPolicy.onInit: commits:num=1
[junit4:junit4]   2> 		commit{dir=MockDirWrapper(org.apache.lucene.store.RAMDirectory@75905090 lockFactory=org.apache.lucene.store.SingleInstanceLockFactory@46f3450b),segFN=segments_1,generation=1,filenames=[segments_1]
[junit4:junit4]   2> 1635 T178 C15 oasc.SolrDeletionPolicy.updateCommits newest commit = 1
[junit4:junit4]   2> 1636 T178 C15 UPDATE [collection1] webapp=/solr path=/update params={wt=javabin&version=2} {deleteByQuery=*:*} 0 2
[junit4:junit4]   2> 1641 T146 C12 UPDATE [collection1] webapp=/solr path=/update params={wt=javabin&version=2} {add=[1]} 0 2
[junit4:junit4]   2> 1659 T157 C13 UPDATE [collection1] webapp=/solr path=/update params={wt=javabin&version=2} {add=[1]} 0 12
[junit4:junit4]   2> 1665 T146 C12 UPDATE [collection1] webapp=/solr path=/update params={wt=javabin&version=2} {add=[2]} 0 1
[junit4:junit4]   2> 1681 T166 C14 UPDATE [collection1] webapp=/solr path=/update params={wt=javabin&version=2} {add=[2]} 0 1
[junit4:junit4]   2> 1685 T146 C12 UPDATE [collection1] webapp=/solr path=/update params={wt=javabin&version=2} {add=[3]} 0 1
[junit4:junit4]   2> 1689 T178 C15 UPDATE [collection1] webapp=/solr path=/update params={wt=javabin&version=2} {add=[3]} 0 1
[junit4:junit4]   2> 1692 T146 C12 UPDATE [collection1] webapp=/solr path=/update params={wt=javabin&version=2} {add=[4]} 0 1
[junit4:junit4]   2> 1695 T157 C13 UPDATE [collection1] webapp=/solr path=/update params={wt=javabin&version=2} {add=[4]} 0 0
[junit4:junit4]   2> 1705 T146 C12 UPDATE [collection1] webapp=/solr path=/update params={wt=javabin&version=2} {add=[5]} 0 1
[junit4:junit4]   2> 1708 T166 C14 UPDATE [collection1] webapp=/solr path=/update params={wt=javabin&version=2} {add=[5]} 0 1
[junit4:junit4]   2> 1711 T146 C12 UPDATE [collection1] webapp=/solr path=/update params={wt=javabin&version=2} {add=[6]} 0 0
[junit4:junit4]   2> 1714 T178 C15 UPDATE [collection1] webapp=/solr path=/update params={wt=javabin&version=2} {add=[6]} 0 0
[junit4:junit4]   2> 1724 T146 C12 UPDATE [collection1] webapp=/solr path=/update params={wt=javabin&version=2} {add=[7]} 0 0
[junit4:junit4]   2> 1728 T178 C15 UPDATE [collection1] webapp=/solr path=/update params={wt=javabin&version=2} {add=[7]} 0 1
[junit4:junit4]   2> 1734 T146 C12 oasu.DirectUpdateHandler2.commit start commit{flags=0,_version_=0,optimize=false,openSearcher=true,waitSearcher=true,expungeDeletes=false,softCommit=false}
[junit4:junit4]   2> 1736 T146 C12 oasc.SolrDeletionPolicy.onCommit SolrDeletionPolicy.onCommit: commits:num=2
[junit4:junit4]   2> 		commit{dir=MockDirWrapper(org.apache.lucene.store.RAMDirectory@3a26243f lockFactory=org.apache.lucene.store.SingleInstanceLockFactory@266e7c62),segFN=segments_1,generation=1,filenames=[segments_1]
[junit4:junit4]   2> 		commit{dir=MockDirWrapper(org.apache.lucene.store.RAMDirectory@3a26243f lockFactory=org.apache.lucene.store.SingleInstanceLockFactory@266e7c62),segFN=segments_2,generation=2,filenames=[_0.si, segments_2, _0.fld, _0.pst, _0.inf, _0_3.len, _0_2.len, _0_4.len]
[junit4:junit4]   2> 1737 T146 C12 oasc.SolrDeletionPolicy.updateCommits newest commit = 2
[junit4:junit4]   2> 1738 T146 C12 oass.SolrIndexSearcher.<init> Opening Searcher@353ccb63 main
[junit4:junit4]   2> 1738 T146 C12 oass.SolrIndexSearcher.getIndexDir WARNING WARNING: Directory impl does not support setting indexDir: org.apache.lucene.store.MockDirectoryWrapper
[junit4:junit4]   2> 1739 T146 C12 oasu.DirectUpdateHandler2.commit end_commit_flush
[junit4:junit4]   2> 1740 T153 oasc.SolrCore.registerSearcher [collection1] Registered new searcher Searcher@353ccb63 main{StandardDirectoryReader(segments_2:4 _0(5.0):C7)}
[junit4:junit4]   2> 1741 T146 C12 UPDATE [collection1] webapp=/solr path=/update params={waitSearcher=true&version=2&softCommit=false&commit=true&wt=javabin} {commit=} 0 8
[junit4:junit4]   2> 1745 T157 C13 oasu.DirectUpdateHandler2.commit start commit{flags=0,_version_=0,optimize=false,openSearcher=true,waitSearcher=true,expungeDeletes=false,softCommit=false}
[junit4:junit4]   2> 1747 T157 C13 oasc.SolrDeletionPolicy.onCommit SolrDeletionPolicy.onCommit: commits:num=2
[junit4:junit4]   2> 		commit{dir=MockDirWrapper(org.apache.lucene.store.RAMDirectory@5794cc69 lockFactory=org.apache.lucene.store.SingleInstanceLockFactory@24af6780),segFN=segments_1,generation=1,filenames=[segments_1]
[junit4:junit4]   2> 		commit{dir=MockDirWrapper(org.apache.lucene.store.RAMDirectory@5794cc69 lockFactory=org.apache.lucene.store.SingleInstanceLockFactory@24af6780),segFN=segments_2,generation=2,filenames=[_0.si, segments_2, _0.fld, _0.pst, _0.inf, _0_3.len, _0_2.len]
[junit4:junit4]   2> 1747 T157 C13 oasc.SolrDeletionPolicy.updateCommits newest commit = 2
[junit4:junit4]   2> 1748 T157 C13 oass.SolrIndexSearcher.<init> Opening Searcher@47adcd7f main
[junit4:junit4]   2> 1748 T157 C13 oass.SolrIndexSearcher.getIndexDir WARNING WARNING: Directory impl does not support setting indexDir: org.apache.lucene.store.MockDirectoryWrapper
[junit4:junit4]   2> 1749 T157 C13 oasu.DirectUpdateHandler2.commit end_commit_flush
[junit4:junit4]   2> 1750 T163 oasc.SolrCore.registerSearcher [collection1] Registered new searcher Searcher@47adcd7f main{StandardDirectoryReader(segments_2:4 _0(5.0):C2)}
[junit4:junit4]   2> 1750 T157 C13 UPDATE [collection1] webapp=/solr path=/update params={waitSearcher=true&version=2&softCommit=false&commit=true&wt=javabin} {commit=} 0 5
[junit4:junit4]   2> 1754 T166 C14 oasu.DirectUpdateHandler2.commit start commit{flags=0,_version_=0,optimize=false,openSearcher=true,waitSearcher=true,expungeDeletes=false,softCommit=false}
[junit4:junit4]   2> 1755 T166 C14 oasc.SolrDeletionPolicy.onCommit SolrDeletionPolicy.onCommit: commits:num=2
[junit4:junit4]   2> 		commit{dir=MockDirWrapper(org.apache.lucene.store.RAMDirectory@89d1e34 lockFactory=org.apache.lucene.store.SingleInstanceLockFactory@355b4560),segFN=segments_1,generation=1,filenames=[segments_1]
[junit4:junit4]   2> 		commit{dir=MockDirWrapper(org.apache.lucene.store.RAMDirectory@89d1e34 lockFactory=org.apache.lucene.store.SingleInstanceLockFactory@355b4560),segFN=segments_2,generation=2,filenames=[_0.si, segments_2, _0.fld, _0.pst, _0.inf, _0_3.len, _0_2.len]
[junit4:junit4]   2> 1756 T166 C14 oasc.SolrDeletionPolicy.updateCommits newest commit = 2
[junit4:junit4]   2> 1757 T166 C14 oass.SolrIndexSearcher.<init> Opening Searcher@54a36ff main
[junit4:junit4]   2> 1757 T166 C14 oass.SolrIndexSearcher.getIndexDir WARNING WARNING: Directory impl does not support setting indexDir: org.apache.lucene.store.MockDirectoryWrapper
[junit4:junit4]   2> 1757 T166 C14 oasu.DirectUpdateHandler2.commit end_commit_flush
[junit4:junit4]   2> 1758 T173 oasc.SolrCore.registerSearcher [collection1] Registered new searcher Searcher@54a36ff main{StandardDirectoryReader(segments_2:4 _0(5.0):C2)}
[junit4:junit4]   2> 1758 T166 C14 UPDATE [collection1] webapp=/solr path=/update params={waitSearcher=true&version=2&softCommit=false&commit=true&wt=javabin} {commit=} 0 4
[junit4:junit4]   2> 1763 T178 C15 oasu.DirectUpdateHandler2.commit start commit{flags=0,_version_=0,optimize=false,openSearcher=true,waitSearcher=true,expungeDeletes=false,softCommit=false}
[junit4:junit4]   2> 1764 T178 C15 oasc.SolrDeletionPolicy.onCommit SolrDeletionPolicy.onCommit: commits:num=2
[junit4:junit4]   2> 		commit{dir=MockDirWrapper(org.apache.lucene.store.RAMDirectory@75905090 lockFactory=org.apache.lucene.store.SingleInstanceLockFactory@46f3450b),segFN=segments_1,generation=1,filenames=[segments_1]
[junit4:junit4]   2> 		commit{dir=MockDirWrapper(org.apache.lucene.store.RAMDirectory@75905090 lockFactory=org.apache.lucene.store.SingleInstanceLockFactory@46f3450b),segFN=segments_2,generation=2,filenames=[_0.si, segments_2, _0.fld, _0.pst, _0.inf, _0_2.len]
[junit4:junit4]   2> 1764 T178 C15 oasc.SolrDeletionPolicy.updateCommits newest commit = 2
[junit4:junit4]   2> 1765 T178 C15 oass.SolrIndexSearcher.<init> Opening Searcher@616b99f1 main
[junit4:junit4]   2> 1766 T178 C15 oass.SolrIndexSearcher.getIndexDir WARNING WARNING: Directory impl does not support setting indexDir: org.apache.lucene.store.MockDirectoryWrapper
[junit4:junit4]   2> 1766 T178 C15 oasu.DirectUpdateHandler2.commit end_commit_flush
[junit4:junit4]   2> 1767 T183 oasc.SolrCore.registerSearcher [collection1] Registered new searcher Searcher@616b99f1 main{StandardDirectoryReader(segments_2:4 _0(5.0):C3)}
[junit4:junit4]   2> 1767 T178 C15 UPDATE [collection1] webapp=/solr path=/update params={waitSearcher=true&version=2&softCommit=false&commit=true&wt=javabin} {commit=} 0 5
[junit4:junit4]   2> 1794 T146 C12 REQ [collection1] webapp=/solr path=/elevate params={rows=500&qt=/elevate&fl=id,+score,+[elevated]&wt=javabin&shards.qt=/elevate&version=2&sort=id+desc&distrib=false&q=*:*} hits=7 status=0 QTime=20 
[junit4:junit4]   2> 1836 T175 C15 REQ [collection1] webapp=/solr path=/elevate params={NOW=1343828561478&isShard=true&shard.url=localhost:47218/solr&rows=500&fl=id,score&wt=javabin&version=2&distrib=false&qt=/elevate&shards.qt=/elevate&start=0&sort=id+desc&fsv=true&q=*:*} hits=3 status=0 QTime=1 
[junit4:junit4]   2> 1836 T158 C13 REQ [collection1] webapp=/solr path=/elevate params={NOW=1343828561478&isShard=true&shard.url=[::1]:33332/solr|localhost:49463/solr&rows=500&fl=id,score&wt=javabin&version=2&distrib=false&qt=/elevate&shards.qt=/elevate&start=0&sort=id+desc&fsv=true&q=*:*} hits=2 status=0 QTime=3 
[junit4:junit4]   2> 1841 T167 C14 REQ [collection1] webapp=/solr path=/elevate params={NOW=1343828561478&isShard=true&shard.url=[::1]:33332/solr|localhost:59729/solr&rows=500&fl=id,score&wt=javabin&version=2&distrib=false&qt=/elevate&shards.qt=/elevate&start=0&sort=id+desc&fsv=true&q=*:*} hits=2 status=0 QTime=4 
[junit4:junit4]   2> 1849 T167 C14 REQ [collection1] webapp=/solr path=/elevate params={NOW=1343828561478&isShard=true&rows=500&shard.url=[::1]:33332/solr|localhost:59729/solr&fl=id,+score,+[elevated]&wt=javabin&version=2&ids=2.0,5.0&distrib=false&qt=/elevate&shards.qt=/elevate&q=*:*} status=0 QTime=1 
[junit4:junit4]   2> 1849 T175 C15 REQ [collection1] webapp=/solr path=/elevate params={NOW=1343828561478&isShard=true&rows=500&shard.url=localhost:47218/solr&fl=id,+score,+[elevated]&wt=javabin&version=2&ids=7.0,6.0,3.0&distrib=false&qt=/elevate&shards.qt=/elevate&q=*:*} status=0 QTime=1 
[junit4:junit4]   2> 1862 T158 C13 REQ [collection1] webapp=/solr path=/elevate params={NOW=1343828561478&isShard=true&rows=500&shard.url=[::1]:33332/solr|localhost:49463/solr&fl=id,+score,+[elevated]&wt=javabin&version=2&ids=4.0,1.0&distrib=false&qt=/elevate&shards.qt=/elevate&q=*:*} status=0 QTime=13 
[junit4:junit4]   2> 1863 T178 C15 REQ [collection1] webapp=/solr path=/elevate params={rows=500&qt=/elevate&fl=id,+score,+[elevated]&wt=javabin&shards.qt=/elevate&version=2&sort=id+desc&q=*:*&shards=[::1]:33332/solr|localhost:49463/solr,[::1]:33332/solr|localhost:59729/solr,localhost:47218/solr} status=0 QTime=62 
[junit4:junit4]   2> 1865 T143 oas.BaseDistributedSearchTestCase.compareResponses SEVERE Mismatched responses:
[junit4:junit4]   2> 	{responseHeader={status=0,QTime=62,params={rows=500,qt=/elevate,fl=id, score, [elevated],wt=javabin,shards.qt=/elevate,version=2,sort=id desc,q=*:*,shards=[::1]:33332/solr|localhost:49463/solr,[::1]:33332/solr|localhost:59729/solr,localhost:47218/solr}},response={numFound=7,start=0,maxScore=1.0,docs=[SolrDocument{id=7.0, [elevated]=false, score=1.0}, SolrDocument{id=6.0, [elevated]=false, score=1.0}, SolrDocument{id=5.0, [elevated]=false, score=1.0}, SolrDocument{id=4.0, [elevated]=false, score=1.0}, SolrDocument{id=3.0, [elevated]=false, score=1.0}, SolrDocument{id=2.0, [elevated]=false, score=1.0}, SolrDocument{id=1.0, [elevated]=false, score=1.0}]}}
[junit4:junit4]   2> 	{responseHeader={status=0,QTime=20,params={rows=500,qt=/elevate,fl=id, score, [elevated],wt=javabin,shards.qt=/elevate,version=2,sort=id desc,distrib=false,q=*:*}},response={numFound=7,start=0,maxScore=1.0,docs=[SolrDocument{id=7.0, score=1.0, [elevated]=false}, SolrDocument{id=6.0, score=1.0, [elevated]=false}, SolrDocument{id=5.0, score=1.0, [elevated]=false}, SolrDocument{id=4.0, score=1.0, [elevated]=false}, SolrDocument{id=3.0, score=1.0, [elevated]=false}, SolrDocument{id=2.0, score=1.0, [elevated]=false}, SolrDocument{id=1.0, score=1.0, [elevated]=false}]}}
[junit4:junit4]   2> 1868 T143 oasc.CoreContainer.shutdown Shutting down CoreContainer instance=1625862699
[junit4:junit4]   2> 1869 T143 oasc.SolrCore.close [collection1]  CLOSING SolrCore org.apache.solr.core.SolrCore@66662913
[junit4:junit4]   2> 1870 T143 oasc.SolrCore.closeSearcher [collection1] Closing main searcher on request.
[junit4:junit4]   2> 1870 T143 oasu.DirectUpdateHandler2.close closing DirectUpdateHandler2{commits=1,autocommits=0,soft autocommits=0,optimizes=0,rollbacks=0,expungeDeletes=0,docsPending=0,adds=0,deletesById=0,deletesByQuery=0,errors=0,cumulative_adds=7,cumulative_deletesById=0,cumulative_deletesByQuery=1,cumulative_errors=0}
[junit4:junit4]   2> 1876 T143 oejsh.ContextHandler.doStop stopped o.e.j.s.ServletContextHandler{/solr,null}
[junit4:junit4]   2> 1929 T143 oasc.CoreContainer.shutdown Shutting down CoreContainer instance=131158630
[junit4:junit4]   2> 1930 T143 oasc.SolrCore.close [collection1]  CLOSING SolrCore org.apache.solr.core.SolrCore@1c0818cf
[junit4:junit4]   2> 1931 T143 oasc.SolrCore.closeSearcher [collection1] Closing main searcher on request.
[junit4:junit4]   2> 1931 T143 oasu.DirectUpdateHandler2.close closing DirectUpdateHandler2{commits=1,autocommits=0,soft autocommits=0,optimizes=0,rollbacks=0,expungeDeletes=0,docsPending=0,adds=0,deletesById=0,deletesByQuery=0,errors=0,cumulative_adds=2,cumulative_deletesById=0,cumulative_deletesByQuery=1,cumulative_errors=0}
[junit4:junit4]   2> 1934 T143 oejsh.ContextHandler.doStop stopped o.e.j.s.ServletContextHandler{/solr,null}
[junit4:junit4]   2> 1986 T143 oasc.CoreContainer.shutdown Shutting down CoreContainer instance=1842507065
[junit4:junit4]   2> 1987 T143 oasc.SolrCore.close [collection1]  CLOSING SolrCore org.apache.solr.core.SolrCore@6351b73
[junit4:junit4]   2> 1987 T143 oasc.SolrCore.closeSearcher [collection1] Closing main searcher on request.
[junit4:junit4]   2> 1988 T143 oasu.DirectUpdateHandler2.close closing DirectUpdateHandler2{commits=1,autocommits=0,soft autocommits=0,optimizes=0,rollbacks=0,expungeDeletes=0,docsPending=0,adds=0,deletesById=0,deletesByQuery=0,errors=0,cumulative_adds=2,cumulative_deletesById=0,cumulative_deletesByQuery=1,cumulative_errors=0}
[junit4:junit4]   2> 2001 T143 oejsh.ContextHandler.doStop stopped o.e.j.s.ServletContextHandler{/solr,null}
[junit4:junit4]   2> 2052 T143 oasc.CoreContainer.shutdown Shutting down CoreContainer instance=1360577134
[junit4:junit4]   2> 2053 T143 oasc.SolrCore.close [collection1]  CLOSING SolrCore org.apache.solr.core.SolrCore@30160a24
[junit4:junit4]   2> 2055 T143 oasc.SolrCore.closeSearcher [collection1] Closing main searcher on request.
[junit4:junit4]   2> 2055 T143 oasu.DirectUpdateHandler2.close closing DirectUpdateHandler2{commits=1,autocommits=0,soft autocommits=0,optimizes=0,rollbacks=0,expungeDeletes=0,docsPending=0,adds=0,deletesById=0,deletesByQuery=0,errors=0,cumulative_adds=3,cumulative_deletesById=0,cumulative_deletesByQuery=1,cumulative_errors=0}
[junit4:junit4]   2> 2067 T143 oejsh.ContextHandler.doStop stopped o.e.j.s.ServletContextHandler{/solr,null}
[junit4:junit4]   2> 2119 T143 oas.SolrTestCaseJ4.tearDown ###Ending testDistribSearch
[junit4:junit4]   2> NOTE: reproduce with: ant test  -Dtestcase=DistributedQueryElevationComponentTest -Dtests.method=testDistribSearch -Dtests.seed=803FB1DF25433935 -Dtests.multiplier=3 -Dtests.slow=true -Dtests.locale=en_IE -Dtests.timezone=Etc/GMT+5 -Dtests.file.encoding=ISO-8859-1
[junit4:junit4]   2>
[junit4:junit4]    > (@AfterClass output)
[junit4:junit4]   2> 2165 T143 oas.SolrTestCaseJ4.deleteCore ###deleteCore
[junit4:junit4]   2> NOTE: test params are: codec=SimpleText, sim=RandomSimilarityProvider(queryNorm=true,coord=false): {}, locale=en_IE, timezone=Etc/GMT+5
[junit4:junit4]   2> NOTE: Linux 3.2.0-27-generic amd64/Oracle Corporation 1.8.0-ea (64-bit)/cpus=8,threads=1,free=118039912,total=263585792
[junit4:junit4]   2> NOTE: All tests run in this JVM: [TestMergePolicyConfig, TestHashPartitioner, ShowFileRequestHandlerTest, QueryElevationComponentTest, LegacyHTMLStripCharFilterTest, TestPhraseSuggestions, XsltUpdateRequestHandlerTest, FileUtilsTest, TestSolrDeletionPolicy1, IndexReaderFactoryTest, OpenExchangeRatesOrgProviderTest, SolrInfoMBeanTest, BadIndexSchemaTest, TestStressVersions, DistributedQueryElevationComponentTest]
[junit4:junit4]   2> 
[junit4:junit4] Completed on J1 in 2.20s, 1 test, 1 failure <<< FAILURES!

[...truncated 602 lines...]
BUILD FAILED
/mnt/ssd/jenkins/workspace/Lucene-Solr-trunk-Linux/checkout/build.xml:29: The following error occurred while executing this line:
/mnt/ssd/jenkins/workspace/Lucene-Solr-trunk-Linux/checkout/solr/build.xml:144: The following error occurred while executing this line:
/mnt/ssd/jenkins/workspace/Lucene-Solr-trunk-Linux/checkout/lucene/module-build.xml:62: The following error occurred while executing this line:
/mnt/ssd/jenkins/workspace/Lucene-Solr-trunk-Linux/checkout/lucene/common-build.xml:1095: The following error occurred while executing this line:
/mnt/ssd/jenkins/workspace/Lucene-Solr-trunk-Linux/checkout/lucene/common-build.xml:790: There were test failures: 223 suites, 899 tests, 1 failure, 5 ignored

Total time: 19 minutes 10 seconds
Build step 'Execute shell' marked build as failure
Archiving artifacts
Recording test results
Email was triggered for: Failure
Sending email for trigger: Failure



Mime
View raw message