lucene-dev mailing list archives

Site index · List index
Message view « Date » · « Thread »
Top « Date » · « Thread »
From Mark Miller <markrmil...@gmail.com>
Subject Re: [JENKINS] Lucene-Solr-trunk-Linux (32bit/jdk1.8.0-ea-b49) - Build # 121 - Failure!
Date Thu, 02 Aug 2012 22:05:36 GMT
This is failing a lot with different fails lately - I've got a list of things already I need to look into - but I'll add this to it.

On Aug 2, 2012, at 5:31 PM, Policeman Jenkins Server <jenkins@sd-datasolutions.de> wrote:

> Build: http://jenkins.sd-datasolutions.de/job/Lucene-Solr-trunk-Linux/121/
> Java: 32bit/jdk1.8.0-ea-b49 -server -XX:+UseParallelGC
> 
> 1 tests failed.
> REGRESSION:  org.apache.solr.handler.component.DistributedQueryElevationComponentTest.testDistribSearch
> 
> Error Message:
> .responseHeader.params.size()==9,9skipped=4,5
> 
> Stack Trace:
> junit.framework.AssertionFailedError: .responseHeader.params.size()==9,9skipped=4,5
> 	at __randomizedtesting.SeedInfo.seed([B6FB0D16AB34F85F:371D830EDC6B9863]:0)
> 	at junit.framework.Assert.fail(Assert.java:50)
> 	at org.apache.solr.BaseDistributedSearchTestCase.compareResponses(BaseDistributedSearchTestCase.java:670)
> 	at org.apache.solr.BaseDistributedSearchTestCase.query(BaseDistributedSearchTestCase.java:392)
> 	at org.apache.solr.handler.component.DistributedQueryElevationComponentTest.doTest(DistributedQueryElevationComponentTest.java:81)
> 	at org.apache.solr.BaseDistributedSearchTestCase.testDistribSearch(BaseDistributedSearchTestCase.java:679)
> 	at sun.reflect.NativeMethodAccessorImpl.invoke0(Native Method)
> 	at sun.reflect.NativeMethodAccessorImpl.invoke(NativeMethodAccessorImpl.java:57)
> 	at sun.reflect.DelegatingMethodAccessorImpl.invoke(DelegatingMethodAccessorImpl.java:43)
> 	at java.lang.reflect.Method.invoke(Method.java:474)
> 	at com.carrotsearch.randomizedtesting.RandomizedRunner.invoke(RandomizedRunner.java:1995)
> 	at com.carrotsearch.randomizedtesting.RandomizedRunner.access$1100(RandomizedRunner.java:132)
> 	at com.carrotsearch.randomizedtesting.RandomizedRunner$6.evaluate(RandomizedRunner.java:818)
> 	at com.carrotsearch.randomizedtesting.RandomizedRunner$7.evaluate(RandomizedRunner.java:877)
> 	at com.carrotsearch.randomizedtesting.RandomizedRunner$8.evaluate(RandomizedRunner.java:891)
> 	at com.carrotsearch.randomizedtesting.rules.SystemPropertiesRestoreRule$1.evaluate(SystemPropertiesRestoreRule.java:53)
> 	at org.apache.lucene.util.TestRuleSetupTeardownChained$1.evaluate(TestRuleSetupTeardownChained.java:50)
> 	at org.apache.lucene.util.TestRuleFieldCacheSanity$1.evaluate(TestRuleFieldCacheSanity.java:32)
> 	at org.apache.lucene.util.AbstractBeforeAfterRule$1.evaluate(AbstractBeforeAfterRule.java:45)
> 	at com.carrotsearch.randomizedtesting.rules.SystemPropertiesInvariantRule$1.evaluate(SystemPropertiesInvariantRule.java:55)
> 	at org.apache.lucene.util.TestRuleReportUncaughtExceptions$1.evaluate(TestRuleReportUncaughtExceptions.java:68)
> 	at org.apache.lucene.util.TestRuleThreadAndTestName$1.evaluate(TestRuleThreadAndTestName.java:48)
> 	at org.apache.lucene.util.TestRuleIgnoreAfterMaxFailures$1.evaluate(TestRuleIgnoreAfterMaxFailures.java:70)
> 	at org.apache.lucene.util.TestRuleMarkFailure$1.evaluate(TestRuleMarkFailure.java:48)
> 	at com.carrotsearch.randomizedtesting.RandomizedRunner.runSingleTest(RandomizedRunner.java:825)
> 	at com.carrotsearch.randomizedtesting.RandomizedRunner.access$700(RandomizedRunner.java:132)
> 	at com.carrotsearch.randomizedtesting.RandomizedRunner$3$1.run(RandomizedRunner.java:671)
> 	at com.carrotsearch.randomizedtesting.RandomizedRunner$3.evaluate(RandomizedRunner.java:697)
> 	at com.carrotsearch.randomizedtesting.RandomizedRunner$4.evaluate(RandomizedRunner.java:736)
> 	at com.carrotsearch.randomizedtesting.RandomizedRunner$5.evaluate(RandomizedRunner.java:747)
> 	at com.carrotsearch.randomizedtesting.rules.SystemPropertiesRestoreRule$1.evaluate(SystemPropertiesRestoreRule.java:53)
> 	at org.apache.lucene.util.AbstractBeforeAfterRule$1.evaluate(AbstractBeforeAfterRule.java:45)
> 	at org.apache.lucene.util.TestRuleReportUncaughtExceptions$1.evaluate(TestRuleReportUncaughtExceptions.java:68)
> 	at org.apache.lucene.util.TestRuleStoreClassName$1.evaluate(TestRuleStoreClassName.java:38)
> 	at com.carrotsearch.randomizedtesting.rules.SystemPropertiesInvariantRule$1.evaluate(SystemPropertiesInvariantRule.java:55)
> 	at org.apache.lucene.util.TestRuleNoInstanceHooksOverrides$1.evaluate(TestRuleNoInstanceHooksOverrides.java:53)
> 	at org.apache.lucene.util.TestRuleNoStaticHooksShadowing$1.evaluate(TestRuleNoStaticHooksShadowing.java:52)
> 	at org.apache.lucene.util.TestRuleAssertionsRequired$1.evaluate(TestRuleAssertionsRequired.java:36)
> 	at org.apache.lucene.util.TestRuleMarkFailure$1.evaluate(TestRuleMarkFailure.java:48)
> 	at org.apache.lucene.util.TestRuleIgnoreAfterMaxFailures$1.evaluate(TestRuleIgnoreAfterMaxFailures.java:70)
> 	at org.apache.lucene.util.TestRuleIgnoreTestSuites$1.evaluate(TestRuleIgnoreTestSuites.java:55)
> 	at com.carrotsearch.randomizedtesting.RandomizedRunner.runSuite(RandomizedRunner.java:605)
> 	at com.carrotsearch.randomizedtesting.RandomizedRunner.access$400(RandomizedRunner.java:132)
> 	at com.carrotsearch.randomizedtesting.RandomizedRunner$2.run(RandomizedRunner.java:551)
> 
> 
> 
> 
> Build Log:
> [...truncated 7313 lines...]
> [junit4:junit4] Suite: org.apache.solr.handler.component.DistributedQueryElevationComponentTest
> [junit4:junit4] FAILURE 1.58s J1 | DistributedQueryElevationComponentTest.testDistribSearch
> [junit4:junit4]    > Throwable #1: junit.framework.AssertionFailedError: .responseHeader.params.size()==9,9skipped=4,5
> [junit4:junit4]    > 	at __randomizedtesting.SeedInfo.seed([B6FB0D16AB34F85F:371D830EDC6B9863]:0)
> [junit4:junit4]    > 	at junit.framework.Assert.fail(Assert.java:50)
> [junit4:junit4]    > 	at org.apache.solr.BaseDistributedSearchTestCase.compareResponses(BaseDistributedSearchTestCase.java:670)
> [junit4:junit4]    > 	at org.apache.solr.BaseDistributedSearchTestCase.query(BaseDistributedSearchTestCase.java:392)
> [junit4:junit4]    > 	at org.apache.solr.handler.component.DistributedQueryElevationComponentTest.doTest(DistributedQueryElevationComponentTest.java:81)
> [junit4:junit4]    > 	at org.apache.solr.BaseDistributedSearchTestCase.testDistribSearch(BaseDistributedSearchTestCase.java:679)
> [junit4:junit4]    > 	at sun.reflect.NativeMethodAccessorImpl.invoke0(Native Method)
> [junit4:junit4]    > 	at sun.reflect.NativeMethodAccessorImpl.invoke(NativeMethodAccessorImpl.java:57)
> [junit4:junit4]    > 	at sun.reflect.DelegatingMethodAccessorImpl.invoke(DelegatingMethodAccessorImpl.java:43)
> [junit4:junit4]    > 	at java.lang.reflect.Method.invoke(Method.java:474)
> [junit4:junit4]    > 	at com.carrotsearch.randomizedtesting.RandomizedRunner.invoke(RandomizedRunner.java:1995)
> [junit4:junit4]    > 	at com.carrotsearch.randomizedtesting.RandomizedRunner.access$1100(RandomizedRunner.java:132)
> [junit4:junit4]    > 	at com.carrotsearch.randomizedtesting.RandomizedRunner$6.evaluate(RandomizedRunner.java:818)
> [junit4:junit4]    > 	at com.carrotsearch.randomizedtesting.RandomizedRunner$7.evaluate(RandomizedRunner.java:877)
> [junit4:junit4]    > 	at com.carrotsearch.randomizedtesting.RandomizedRunner$8.evaluate(RandomizedRunner.java:891)
> [junit4:junit4]    > 	at com.carrotsearch.randomizedtesting.rules.SystemPropertiesRestoreRule$1.evaluate(SystemPropertiesRestoreRule.java:53)
> [junit4:junit4]    > 	at org.apache.lucene.util.TestRuleSetupTeardownChained$1.evaluate(TestRuleSetupTeardownChained.java:50)
> [junit4:junit4]    > 	at org.apache.lucene.util.TestRuleFieldCacheSanity$1.evaluate(TestRuleFieldCacheSanity.java:32)
> [junit4:junit4]    > 	at org.apache.lucene.util.AbstractBeforeAfterRule$1.evaluate(AbstractBeforeAfterRule.java:45)
> [junit4:junit4]    > 	at com.carrotsearch.randomizedtesting.rules.SystemPropertiesInvariantRule$1.evaluate(SystemPropertiesInvariantRule.java:55)
> [junit4:junit4]    > 	at org.apache.lucene.util.TestRuleReportUncaughtExceptions$1.evaluate(TestRuleReportUncaughtExceptions.java:68)
> [junit4:junit4]    > 	at org.apache.lucene.util.TestRuleThreadAndTestName$1.evaluate(TestRuleThreadAndTestName.java:48)
> [junit4:junit4]    > 	at org.apache.lucene.util.TestRuleIgnoreAfterMaxFailures$1.evaluate(TestRuleIgnoreAfterMaxFailures.java:70)
> [junit4:junit4]    > 	at org.apache.lucene.util.TestRuleMarkFailure$1.evaluate(TestRuleMarkFailure.java:48)
> [junit4:junit4]    > 	at com.carrotsearch.randomizedtesting.RandomizedRunner.runSingleTest(RandomizedRunner.java:825)
> [junit4:junit4]    > 	at com.carrotsearch.randomizedtesting.RandomizedRunner.access$700(RandomizedRunner.java:132)
> [junit4:junit4]    > 	at com.carrotsearch.randomizedtesting.RandomizedRunner$3$1.run(RandomizedRunner.java:671)
> [junit4:junit4]    > 	at com.carrotsearch.randomizedtesting.RandomizedRunner$3.evaluate(RandomizedRunner.java:697)
> [junit4:junit4]    > 	at com.carrotsearch.randomizedtesting.RandomizedRunner$4.evaluate(RandomizedRunner.java:736)
> [junit4:junit4]    > 	at com.carrotsearch.randomizedtesting.RandomizedRunner$5.evaluate(RandomizedRunner.java:747)
> [junit4:junit4]    > 	at com.carrotsearch.randomizedtesting.rules.SystemPropertiesRestoreRule$1.evaluate(SystemPropertiesRestoreRule.java:53)
> [junit4:junit4]    > 	at org.apache.lucene.util.AbstractBeforeAfterRule$1.evaluate(AbstractBeforeAfterRule.java:45)
> [junit4:junit4]    > 	at org.apache.lucene.util.TestRuleReportUncaughtExceptions$1.evaluate(TestRuleReportUncaughtExceptions.java:68)
> [junit4:junit4]    > 	at org.apache.lucene.util.TestRuleStoreClassName$1.evaluate(TestRuleStoreClassName.java:38)
> [junit4:junit4]    > 	at com.carrotsearch.randomizedtesting.rules.SystemPropertiesInvariantRule$1.evaluate(SystemPropertiesInvariantRule.java:55)
> [junit4:junit4]    > 	at org.apache.lucene.util.TestRuleNoInstanceHooksOverrides$1.evaluate(TestRuleNoInstanceHooksOverrides.java:53)
> [junit4:junit4]    > 	at org.apache.lucene.util.TestRuleNoStaticHooksShadowing$1.evaluate(TestRuleNoStaticHooksShadowing.java:52)
> [junit4:junit4]    > 	at org.apache.lucene.util.TestRuleAssertionsRequired$1.evaluate(TestRuleAssertionsRequired.java:36)
> [junit4:junit4]    > 	at org.apache.lucene.util.TestRuleMarkFailure$1.evaluate(TestRuleMarkFailure.java:48)
> [junit4:junit4]    > 	at org.apache.lucene.util.TestRuleIgnoreAfterMaxFailures$1.evaluate(TestRuleIgnoreAfterMaxFailures.java:70)
> [junit4:junit4]    > 	at org.apache.lucene.util.TestRuleIgnoreTestSuites$1.evaluate(TestRuleIgnoreTestSuites.java:55)
> [junit4:junit4]    > 	at com.carrotsearch.randomizedtesting.RandomizedRunner.runSuite(RandomizedRunner.java:605)
> [junit4:junit4]    > 	at com.carrotsearch.randomizedtesting.RandomizedRunner.access$400(RandomizedRunner.java:132)
> [junit4:junit4]    > 	at com.carrotsearch.randomizedtesting.RandomizedRunner$2.run(RandomizedRunner.java:551)
> [junit4:junit4]    > 
> [junit4:junit4]   2> 2 T618 oas.SolrTestCaseJ4.setUp ###Starting testDistribSearch
> [junit4:junit4]   2> 3 T618 oejs.Server.doStart jetty-8.1.2.v20120308
> [junit4:junit4]   2> 6 T618 oejs.AbstractConnector.doStart Started SocketConnector@0.0.0.0:54431
> [junit4:junit4]   2> 6 T618 oasc.SolrResourceLoader.locateSolrHome JNDI not configured for solr (NoInitialContextEx)
> [junit4:junit4]   2> 7 T618 oasc.SolrResourceLoader.locateSolrHome using system property solr.solr.home: /mnt/ssd/jenkins/workspace/Lucene-Solr-trunk-Linux/checkout/solr/build/solr-core/test-files/solr
> [junit4:junit4]   2> 7 T618 oasc.SolrResourceLoader.<init> new SolrResourceLoader for deduced Solr Home: '/mnt/ssd/jenkins/workspace/Lucene-Solr-trunk-Linux/checkout/solr/build/solr-core/test-files/solr/'
> [junit4:junit4]   2> 15 T618 oass.SolrDispatchFilter.init SolrDispatchFilter.init()
> [junit4:junit4]   2> 15 T618 oasc.SolrResourceLoader.locateSolrHome JNDI not configured for solr (NoInitialContextEx)
> [junit4:junit4]   2> 15 T618 oasc.SolrResourceLoader.locateSolrHome using system property solr.solr.home: /mnt/ssd/jenkins/workspace/Lucene-Solr-trunk-Linux/checkout/solr/build/solr-core/test-files/solr
> [junit4:junit4]   2> 16 T618 oasc.CoreContainer$Initializer.initialize looking for solr.xml: /mnt/ssd/jenkins/workspace/Lucene-Solr-trunk-Linux/checkout/solr/build/solr-core/test-files/solr/solr.xml
> [junit4:junit4]   2> 16 T618 oasc.CoreContainer.<init> New CoreContainer 4276623
> [junit4:junit4]   2> 16 T618 oasc.CoreContainer.load Loading CoreContainer using Solr Home: '/mnt/ssd/jenkins/workspace/Lucene-Solr-trunk-Linux/checkout/solr/build/solr-core/test-files/solr/'
> [junit4:junit4]   2> 17 T618 oasc.SolrResourceLoader.<init> new SolrResourceLoader for directory: '/mnt/ssd/jenkins/workspace/Lucene-Solr-trunk-Linux/checkout/solr/build/solr-core/test-files/solr/'
> [junit4:junit4]   2> 28 T618 oasc.CoreContainer.load Registering Log Listener
> [junit4:junit4]   2> 40 T618 oasc.CoreContainer.create Creating SolrCore 'collection1' using instanceDir: /mnt/ssd/jenkins/workspace/Lucene-Solr-trunk-Linux/checkout/solr/build/solr-core/test-files/solr/collection1
> [junit4:junit4]   2> 40 T618 oasc.SolrResourceLoader.<init> new SolrResourceLoader for directory: '/mnt/ssd/jenkins/workspace/Lucene-Solr-trunk-Linux/checkout/solr/build/solr-core/test-files/solr/collection1/'
> [junit4:junit4]   2> 41 T618 oasc.SolrResourceLoader.replaceClassLoader Adding 'file:/mnt/ssd/jenkins/workspace/Lucene-Solr-trunk-Linux/checkout/solr/build/solr-core/test-files/solr/collection1/lib/README' to classloader
> [junit4:junit4]   2> 41 T618 oasc.SolrResourceLoader.replaceClassLoader Adding 'file:/mnt/ssd/jenkins/workspace/Lucene-Solr-trunk-Linux/checkout/solr/build/solr-core/test-files/solr/collection1/lib/classes/' to classloader
> [junit4:junit4]   2> 64 T618 oasc.SolrConfig.<init> Using Lucene MatchVersion: LUCENE_50
> [junit4:junit4]   2> 108 T618 oasc.SolrConfig.<init> Loaded SolrConfig: solrconfig-elevate.xml
> [junit4:junit4]   2> 109 T618 oass.IndexSchema.readSchema Reading Solr Schema
> [junit4:junit4]   2> 112 T618 oass.IndexSchema.readSchema Schema name=example
> [junit4:junit4]   2> 265 T618 oass.IndexSchema.readSchema default search field in schema is text
> [junit4:junit4]   2> 268 T618 oass.IndexSchema.readSchema unique key field: id
> [junit4:junit4]   2> 271 T618 oasc.SolrCore.<init> [collection1] Opening new SolrCore at /mnt/ssd/jenkins/workspace/Lucene-Solr-trunk-Linux/checkout/solr/build/solr-core/test-files/solr/collection1/, dataDir=./org.apache.solr.handler.component.DistributedQueryElevationComponentTest-1343942738961/control/data/
> [junit4:junit4]   2> 271 T618 oasc.JmxMonitoredMap.<init> JMX monitoring is enabled. Adding Solr mbeans to JMX Server: com.sun.jmx.mbeanserver.JmxMBeanServer@67c93d
> [junit4:junit4]   2> 271 T618 oasc.SolrCore.getNewIndexDir WARNING New index directory detected: old=null new=./org.apache.solr.handler.component.DistributedQueryElevationComponentTest-1343942738961/control/data/index/
> [junit4:junit4]   2> 272 T618 oasc.SolrCore.initIndex WARNING [collection1] Solr index directory './org.apache.solr.handler.component.DistributedQueryElevationComponentTest-1343942738961/control/data/index' doesn't exist. Creating new index...
> [junit4:junit4]   2> 273 T618 oasc.SolrDeletionPolicy.onCommit SolrDeletionPolicy.onCommit: commits:num=1
> [junit4:junit4]   2> 		commit{dir=MockDirWrapper(org.apache.lucene.store.RAMDirectory@c1f63a lockFactory=org.apache.lucene.store.SingleInstanceLockFactory@f6a701),segFN=segments_1,generation=1,filenames=[segments_1]
> [junit4:junit4]   2> 274 T618 oasc.SolrDeletionPolicy.updateCommits newest commit = 1
> [junit4:junit4]   2> 277 T618 oasc.RequestHandlers.initHandlersFromConfig created /update: solr.UpdateRequestHandler
> [junit4:junit4]   2> 278 T618 oasc.RequestHandlers.initHandlersFromConfig created /elevate: org.apache.solr.handler.component.SearchHandler
> [junit4:junit4]   2> 278 T618 oasc.RequestHandlers.initHandlersFromConfig created /dataElevate: org.apache.solr.handler.component.SearchHandler
> [junit4:junit4]   2> 279 T618 oashl.XMLLoader.init xsltCacheLifetimeSeconds=60
> [junit4:junit4]   2> 279 T618 oasc.RequestHandlers.initHandlersFromConfig WARNING no default request handler is registered (either '/select' or 'standard')
> [junit4:junit4]   2> 280 T618 oasc.SolrCore.initDeprecatedSupport WARNING solrconfig.xml uses deprecated <admin/gettableFiles>, Please update your config to use the ShowFileRequestHandler.
> [junit4:junit4]   2> 281 T618 oasc.SolrCore.initDeprecatedSupport WARNING adding ShowFileRequestHandler with hidden files: [SCHEMA-BINARYFIELD.XML, SOLRCONFIG-SPELLCHECKER.XML, SOLRCONFIG-MASTER1-KEEPONEBACKUP.XML, SOLRCONFIG-MASTER1.XML, SOLRCONFIG-DELPOLICY2.XML, BAD-SOLRCONFIG-MISSING-SCRIPTFILE.XML, SOLRCONFIG-UPDATE-PROCESSOR-CHAINS.XML, HYPHENATION.DTD, FRENCHARTICLES.TXT, SOLRCONFIG-FUNCTIONQUERY.XML, STOPWITHBOM.TXT, BAD-SCHEMA-EXTERNAL-FILEFIELD.XML, SCHEMA15.XML, SOLRCONFIG-MASTER3.XML, SOLRCONFIG-TERMINDEX.XML, HUNSPELL-TEST.DIC, SOLRCONFIG-BASIC.XML, KEEP-2.TXT, SCHEMA-REVERSED.XML, SCHEMA-LMJELINEKMERCER.XML, STOPWORDSWRONGENCODING.TXT, SOLRCONFIG-ALTDIRECTORY.XML, BAD-SCHEMA-CODEC-GLOBAL-VS-FT-MISMATCH.XML, SCHEMASURROUND.XML, PHRASESUGGEST.TXT, SOLRCONFIG-SCRIPT-UPDATEPROCESSOR.XML, SCHEMA-LMDIRICHLET.XML, SCHEMA-COLLATE.XML, SCHEMA-REPLICATION2.XML, SCHEMA-BM25.XML, SCHEMA-NUMERIC.XML, SCHEMA-SIM.XML, SOLRCONFIG-MASTER2.XML, SCHEMA-PHRASESUGGEST.XML, SCHEMA-FOLDING.XML, SOLRCONFIG-QUERYSENDER-NOQUERY.XML, BAD-SCHEMA-DUP-FIELDTYPE.XML, XSLT, CONDITIONAL.UPDATEPROCESSOR.JS, BAD-SCHEMA-NOT-INDEXED-BUT-NORMS.XML, BAD-SCHEMA-ANALYZER-CLASS-AND-NESTED.XML, COMPOUNDDICTIONARY.TXT, SOLRCONFIG-TRANSFORMERS.XML, SCHEMA-DFR.XML, SCHEMA-SPELLCHECKER.XML, PROTWORDS.TXT, DA_UTF8.XML, ADDFIELDS.UPDATEPROCESSOR.JS, STEMDICT.TXT, SOLRCONFIG-ENABLEPLUGIN.XML, MISSLEADING.EXTENSION.UPDATEPROCESSOR.JS.TXT, SCHEMA-TFIDF.XML, MISSING.FUNCTIONS.UPDATEPROCESSOR.JS, STOPWORDS.TXT, STOP-1.TXT, SCHEMA-NOT-REQUIRED-UNIQUE-KEY.XML, KEEP-1.TXT, STOPTYPES-1.TXT, STOP-2.TXT, BAD-SCHEMA-NONTEXT-ANALYZER.XML, SOLRCONFIG-SIMPLELOCK.XML, SCHEMA-TRIE.XML, STOP-SNOWBALL.TXT, SOLRCONFIG_CODEC.XML, THROW.ERROR.ON.ADD.UPDATEPROCESSOR.JS, SCHEMA-IB.XML, SCHEMA-STOP-KEEP.XML, BAD-SCHEMA-NOT-INDEXED-BUT-POS.XML, SOLRCONFIG-SOLR-749.XML, SCHEMA-LUCENEMATCHVERSION.XML, BAD-SCHEMA-SIM-GLOBAL-VS-FT-MISMATCH.XML, SCHEMA_CODEC.XML, BAD-SCHEMA-UNIQUEKEY-MULTIVALUED.XML, SCHEMA-COPYFIELD-TEST.XML, SCHEMA-CHARFILTERS.XML, BAD-MP-SOLRCONFIG.XML, TRIVIAL.UPDATEPROCESSOR0.JS, SCHEMA.XML, SOLRCONFIG-SPELLCHECKCOMPONENT.XML, SOLRCONFIG-HIGHLIGHT.XML, SCHEMA11.XML, SOLRCONFIG-REQHANDLER.INCL, OPEN-EXCHANGE-RATES.JSON, BAD-SCHEMA-DUP-DYNAMICFIELD.XML, BAD-SCHEMA-OMIT-TF-BUT-NOT-POS.XML, SOLRCONFIG-DELPOLICY1.XML, SCHEMA-MINIMAL.XML, SOLRCONFIG-NOCACHE.XML, SOLRCONFIG-NATIVELOCK.XML, SOLRCONFIG-SLAVE.XML, SCHEMA12.XML, SCHEMA-REPLICATION1.XML, BAD-SCHEMA-UNIQUEKEY-USES-DEFAULT.XML, OLD_SYNONYMS.TXT, BAD-SOLRCONFIG-BOGUS-SCRIPTENGINE-NAME.XML, TRIVIAL.UPDATEPROCESSOR1.JS, ELEVATE.XML, SOLRCONFIG-LAZYWRITER.XML, SOLRCONFIG-PHRASESUGGEST.XML, SOLRCONFIG-ELEVATE.XML, BAD-SCHEMA-UNIQUEKEY-IS-COPYFIELD-DEST.XML, CURRENCY.XML, SOLRCONFIG_PERF.XML, DA_COMPOUNDDICTIONARY.TXT, WDFTYPES.TXT, HUNSPELL-TEST.AFF, SOLRCONFIG-PROPINJECT.XML, BAD_SOLRCONFIG.XML, SOLRCONFIG-PROPINJECT-INDEXDEFAULT.XML, SCHEMA-REQUIRED-FIELDS.XML, STOPTYPES-2.TXT, BAD-SCHEMA-DUP-FIELD.XML, SOLRCONFIG-MASTER.XML, BAD-SCHEMA-NOT-INDEXED-BUT-TF.XML, SOLRCONFIG-CACHING.XML, MAPPING-ISOLATIN1ACCENT.TXT, SOLRCONFIG-XINCLUDE.XML, SYNONYMS.TXT, SOLRCONFIG-REPEATER.XML, SOLRCONFIG-MERGEPOLICY.XML, SOLRCONFIG-QUERYSENDER.XML, BAD-SOLRCONFIG-INVALID-SCRIPTFILE.XML, SOLRCONFIG-SLAVE1.XML, SOLRCONFIG-SOLCOREPROPERTIES.XML, SOLRCONFIG-TLOG.XML]
> [junit4:junit4]   2> 284 T618 oass.SolrIndexSearcher.<init> Opening Searcher@baf191 main
> [junit4:junit4]   2> 284 T618 oass.SolrIndexSearcher.getIndexDir WARNING WARNING: Directory impl does not support setting indexDir: org.apache.lucene.store.MockDirectoryWrapper
> [junit4:junit4]   2> 284 T618 oasu.CommitTracker.<init> Hard AutoCommit: disabled
> [junit4:junit4]   2> 285 T618 oasu.CommitTracker.<init> Soft AutoCommit: disabled
> [junit4:junit4]   2> 286 T618 oashc.QueryElevationComponent.inform Loading QueryElevation from: /mnt/ssd/jenkins/workspace/Lucene-Solr-trunk-Linux/checkout/solr/build/solr-core/test-files/solr/collection1/conf/elevate.xml
> [junit4:junit4]   2> 295 T618 oashc.QueryElevationComponent.inform Loading QueryElevation from: /mnt/ssd/jenkins/workspace/Lucene-Solr-trunk-Linux/checkout/solr/build/solr-core/test-files/solr/collection1/conf/elevate.xml
> [junit4:junit4]   2> 302 T618 oashc.HttpShardHandlerFactory.getParameter Setting socketTimeout to: 0
> [junit4:junit4]   2> 303 T618 oashc.HttpShardHandlerFactory.getParameter Setting urlScheme to: http://
> [junit4:junit4]   2> 303 T618 oashc.HttpShardHandlerFactory.getParameter Setting connTimeout to: 0
> [junit4:junit4]   2> 303 T618 oashc.HttpShardHandlerFactory.getParameter Setting maxConnectionsPerHost to: 20
> [junit4:junit4]   2> 303 T618 oashc.HttpShardHandlerFactory.getParameter Setting corePoolSize to: 0
> [junit4:junit4]   2> 304 T618 oashc.HttpShardHandlerFactory.getParameter Setting maximumPoolSize to: 2147483647
> [junit4:junit4]   2> 304 T618 oashc.HttpShardHandlerFactory.getParameter Setting maxThreadIdleTime to: 5
> [junit4:junit4]   2> 304 T618 oashc.HttpShardHandlerFactory.getParameter Setting sizeOfQueue to: -1
> [junit4:junit4]   2> 304 T618 oashc.HttpShardHandlerFactory.getParameter Setting fairnessPolicy to: false
> [junit4:junit4]   2> 305 T618 oascsi.HttpClientUtil.createClient Creating new http client, config:maxConnectionsPerHost=20&maxConnections=10000&socketTimeout=0&connTimeout=0&retry=false
> [junit4:junit4]   2> 308 T618 oasc.CoreContainer.register registering core: collection1
> [junit4:junit4]   2> 308 T618 oass.SolrDispatchFilter.init user.dir=/mnt/ssd/jenkins/workspace/Lucene-Solr-trunk-Linux/checkout/solr/build/solr-core/test/J1
> [junit4:junit4]   2> 309 T618 oass.SolrDispatchFilter.init SolrDispatchFilter.init() done
> [junit4:junit4]   2> 309 T618 oascsi.HttpClientUtil.createClient Creating new http client, config:maxConnections=128&maxConnectionsPerHost=32&followRedirects=false
> [junit4:junit4]   2> 312 T628 oasc.SolrCore.registerSearcher [collection1] Registered new searcher Searcher@baf191 main{StandardDirectoryReader(segments_1:1)}
> [junit4:junit4]   2> 313 T618 oejs.Server.doStart jetty-8.1.2.v20120308
> [junit4:junit4]   2> 315 T618 oejs.AbstractConnector.doStart Started SocketConnector@0.0.0.0:50901
> [junit4:junit4]   2> 315 T618 oasc.SolrResourceLoader.locateSolrHome JNDI not configured for solr (NoInitialContextEx)
> [junit4:junit4]   2> 315 T618 oasc.SolrResourceLoader.locateSolrHome using system property solr.solr.home: /mnt/ssd/jenkins/workspace/Lucene-Solr-trunk-Linux/checkout/solr/build/solr-core/test-files/solr
> [junit4:junit4]   2> 316 T618 oasc.SolrResourceLoader.<init> new SolrResourceLoader for deduced Solr Home: '/mnt/ssd/jenkins/workspace/Lucene-Solr-trunk-Linux/checkout/solr/build/solr-core/test-files/solr/'
> [junit4:junit4]   2> 324 T618 oass.SolrDispatchFilter.init SolrDispatchFilter.init()
> [junit4:junit4]   2> 324 T618 oasc.SolrResourceLoader.locateSolrHome JNDI not configured for solr (NoInitialContextEx)
> [junit4:junit4]   2> 324 T618 oasc.SolrResourceLoader.locateSolrHome using system property solr.solr.home: /mnt/ssd/jenkins/workspace/Lucene-Solr-trunk-Linux/checkout/solr/build/solr-core/test-files/solr
> [junit4:junit4]   2> 325 T618 oasc.CoreContainer$Initializer.initialize looking for solr.xml: /mnt/ssd/jenkins/workspace/Lucene-Solr-trunk-Linux/checkout/solr/build/solr-core/test-files/solr/solr.xml
> [junit4:junit4]   2> 325 T618 oasc.CoreContainer.<init> New CoreContainer 19706208
> [junit4:junit4]   2> 325 T618 oasc.CoreContainer.load Loading CoreContainer using Solr Home: '/mnt/ssd/jenkins/workspace/Lucene-Solr-trunk-Linux/checkout/solr/build/solr-core/test-files/solr/'
> [junit4:junit4]   2> 325 T618 oasc.SolrResourceLoader.<init> new SolrResourceLoader for directory: '/mnt/ssd/jenkins/workspace/Lucene-Solr-trunk-Linux/checkout/solr/build/solr-core/test-files/solr/'
> [junit4:junit4]   2> 337 T618 oasc.CoreContainer.load Registering Log Listener
> [junit4:junit4]   2> 349 T618 oasc.CoreContainer.create Creating SolrCore 'collection1' using instanceDir: /mnt/ssd/jenkins/workspace/Lucene-Solr-trunk-Linux/checkout/solr/build/solr-core/test-files/solr/collection1
> [junit4:junit4]   2> 350 T618 oasc.SolrResourceLoader.<init> new SolrResourceLoader for directory: '/mnt/ssd/jenkins/workspace/Lucene-Solr-trunk-Linux/checkout/solr/build/solr-core/test-files/solr/collection1/'
> [junit4:junit4]   2> 350 T618 oasc.SolrResourceLoader.replaceClassLoader Adding 'file:/mnt/ssd/jenkins/workspace/Lucene-Solr-trunk-Linux/checkout/solr/build/solr-core/test-files/solr/collection1/lib/README' to classloader
> [junit4:junit4]   2> 351 T618 oasc.SolrResourceLoader.replaceClassLoader Adding 'file:/mnt/ssd/jenkins/workspace/Lucene-Solr-trunk-Linux/checkout/solr/build/solr-core/test-files/solr/collection1/lib/classes/' to classloader
> [junit4:junit4]   2> 376 T618 oasc.SolrConfig.<init> Using Lucene MatchVersion: LUCENE_50
> [junit4:junit4]   2> 419 T618 oasc.SolrConfig.<init> Loaded SolrConfig: solrconfig-elevate.xml
> [junit4:junit4]   2> 420 T618 oass.IndexSchema.readSchema Reading Solr Schema
> [junit4:junit4]   2> 423 T618 oass.IndexSchema.readSchema Schema name=example
> [junit4:junit4]   2> 571 T618 oass.IndexSchema.readSchema default search field in schema is text
> [junit4:junit4]   2> 573 T618 oass.IndexSchema.readSchema unique key field: id
> [junit4:junit4]   2> 574 T618 oasc.SolrCore.<init> [collection1] Opening new SolrCore at /mnt/ssd/jenkins/workspace/Lucene-Solr-trunk-Linux/checkout/solr/build/solr-core/test-files/solr/collection1/, dataDir=./org.apache.solr.handler.component.DistributedQueryElevationComponentTest-1343942738961/shard0/data/
> [junit4:junit4]   2> 575 T618 oasc.JmxMonitoredMap.<init> JMX monitoring is enabled. Adding Solr mbeans to JMX Server: com.sun.jmx.mbeanserver.JmxMBeanServer@67c93d
> [junit4:junit4]   2> 575 T618 oasc.SolrCore.getNewIndexDir WARNING New index directory detected: old=null new=./org.apache.solr.handler.component.DistributedQueryElevationComponentTest-1343942738961/shard0/data/index/
> [junit4:junit4]   2> 575 T618 oasc.SolrCore.initIndex WARNING [collection1] Solr index directory './org.apache.solr.handler.component.DistributedQueryElevationComponentTest-1343942738961/shard0/data/index' doesn't exist. Creating new index...
> [junit4:junit4]   2> 576 T618 oasc.SolrDeletionPolicy.onCommit SolrDeletionPolicy.onCommit: commits:num=1
> [junit4:junit4]   2> 		commit{dir=MockDirWrapper(org.apache.lucene.store.RAMDirectory@98046a lockFactory=org.apache.lucene.store.SingleInstanceLockFactory@7b07a9),segFN=segments_1,generation=1,filenames=[segments_1]
> [junit4:junit4]   2> 576 T618 oasc.SolrDeletionPolicy.updateCommits newest commit = 1
> [junit4:junit4]   2> 577 T618 oasc.RequestHandlers.initHandlersFromConfig created /update: solr.UpdateRequestHandler
> [junit4:junit4]   2> 577 T618 oasc.RequestHandlers.initHandlersFromConfig created /elevate: org.apache.solr.handler.component.SearchHandler
> [junit4:junit4]   2> 578 T618 oasc.RequestHandlers.initHandlersFromConfig created /dataElevate: org.apache.solr.handler.component.SearchHandler
> [junit4:junit4]   2> 578 T618 oashl.XMLLoader.init xsltCacheLifetimeSeconds=60
> [junit4:junit4]   2> 578 T618 oasc.RequestHandlers.initHandlersFromConfig WARNING no default request handler is registered (either '/select' or 'standard')
> [junit4:junit4]   2> 579 T618 oasc.SolrCore.initDeprecatedSupport WARNING solrconfig.xml uses deprecated <admin/gettableFiles>, Please update your config to use the ShowFileRequestHandler.
> [junit4:junit4]   2> 580 T618 oasc.SolrCore.initDeprecatedSupport WARNING adding ShowFileRequestHandler with hidden files: [SCHEMA-BINARYFIELD.XML, SOLRCONFIG-SPELLCHECKER.XML, SOLRCONFIG-MASTER1-KEEPONEBACKUP.XML, SOLRCONFIG-MASTER1.XML, SOLRCONFIG-DELPOLICY2.XML, BAD-SOLRCONFIG-MISSING-SCRIPTFILE.XML, SOLRCONFIG-UPDATE-PROCESSOR-CHAINS.XML, HYPHENATION.DTD, FRENCHARTICLES.TXT, SOLRCONFIG-FUNCTIONQUERY.XML, STOPWITHBOM.TXT, BAD-SCHEMA-EXTERNAL-FILEFIELD.XML, SCHEMA15.XML, SOLRCONFIG-MASTER3.XML, SOLRCONFIG-TERMINDEX.XML, HUNSPELL-TEST.DIC, SOLRCONFIG-BASIC.XML, KEEP-2.TXT, SCHEMA-REVERSED.XML, SCHEMA-LMJELINEKMERCER.XML, STOPWORDSWRONGENCODING.TXT, SOLRCONFIG-ALTDIRECTORY.XML, BAD-SCHEMA-CODEC-GLOBAL-VS-FT-MISMATCH.XML, SCHEMASURROUND.XML, PHRASESUGGEST.TXT, SOLRCONFIG-SCRIPT-UPDATEPROCESSOR.XML, SCHEMA-LMDIRICHLET.XML, SCHEMA-COLLATE.XML, SCHEMA-REPLICATION2.XML, SCHEMA-BM25.XML, SCHEMA-NUMERIC.XML, SCHEMA-SIM.XML, SOLRCONFIG-MASTER2.XML, SCHEMA-PHRASESUGGEST.XML, SCHEMA-FOLDING.XML, SOLRCONFIG-QUERYSENDER-NOQUERY.XML, BAD-SCHEMA-DUP-FIELDTYPE.XML, XSLT, CONDITIONAL.UPDATEPROCESSOR.JS, BAD-SCHEMA-NOT-INDEXED-BUT-NORMS.XML, BAD-SCHEMA-ANALYZER-CLASS-AND-NESTED.XML, COMPOUNDDICTIONARY.TXT, SOLRCONFIG-TRANSFORMERS.XML, SCHEMA-DFR.XML, SCHEMA-SPELLCHECKER.XML, PROTWORDS.TXT, DA_UTF8.XML, ADDFIELDS.UPDATEPROCESSOR.JS, STEMDICT.TXT, SOLRCONFIG-ENABLEPLUGIN.XML, MISSLEADING.EXTENSION.UPDATEPROCESSOR.JS.TXT, SCHEMA-TFIDF.XML, MISSING.FUNCTIONS.UPDATEPROCESSOR.JS, STOPWORDS.TXT, STOP-1.TXT, SCHEMA-NOT-REQUIRED-UNIQUE-KEY.XML, KEEP-1.TXT, STOPTYPES-1.TXT, STOP-2.TXT, BAD-SCHEMA-NONTEXT-ANALYZER.XML, SOLRCONFIG-SIMPLELOCK.XML, SCHEMA-TRIE.XML, STOP-SNOWBALL.TXT, SOLRCONFIG_CODEC.XML, THROW.ERROR.ON.ADD.UPDATEPROCESSOR.JS, SCHEMA-IB.XML, SCHEMA-STOP-KEEP.XML, BAD-SCHEMA-NOT-INDEXED-BUT-POS.XML, SOLRCONFIG-SOLR-749.XML, SCHEMA-LUCENEMATCHVERSION.XML, BAD-SCHEMA-SIM-GLOBAL-VS-FT-MISMATCH.XML, SCHEMA_CODEC.XML, BAD-SCHEMA-UNIQUEKEY-MULTIVALUED.XML, SCHEMA-COPYFIELD-TEST.XML, SCHEMA-CHARFILTERS.XML, BAD-MP-SOLRCONFIG.XML, TRIVIAL.UPDATEPROCESSOR0.JS, SCHEMA.XML, SOLRCONFIG-SPELLCHECKCOMPONENT.XML, SOLRCONFIG-HIGHLIGHT.XML, SCHEMA11.XML, SOLRCONFIG-REQHANDLER.INCL, OPEN-EXCHANGE-RATES.JSON, BAD-SCHEMA-DUP-DYNAMICFIELD.XML, BAD-SCHEMA-OMIT-TF-BUT-NOT-POS.XML, SOLRCONFIG-DELPOLICY1.XML, SCHEMA-MINIMAL.XML, SOLRCONFIG-NOCACHE.XML, SOLRCONFIG-NATIVELOCK.XML, SOLRCONFIG-SLAVE.XML, SCHEMA12.XML, SCHEMA-REPLICATION1.XML, BAD-SCHEMA-UNIQUEKEY-USES-DEFAULT.XML, OLD_SYNONYMS.TXT, BAD-SOLRCONFIG-BOGUS-SCRIPTENGINE-NAME.XML, TRIVIAL.UPDATEPROCESSOR1.JS, ELEVATE.XML, SOLRCONFIG-LAZYWRITER.XML, SOLRCONFIG-PHRASESUGGEST.XML, SOLRCONFIG-ELEVATE.XML, BAD-SCHEMA-UNIQUEKEY-IS-COPYFIELD-DEST.XML, CURRENCY.XML, SOLRCONFIG_PERF.XML, DA_COMPOUNDDICTIONARY.TXT, WDFTYPES.TXT, HUNSPELL-TEST.AFF, SOLRCONFIG-PROPINJECT.XML, BAD_SOLRCONFIG.XML, SOLRCONFIG-PROPINJECT-INDEXDEFAULT.XML, SCHEMA-REQUIRED-FIELDS.XML, STOPTYPES-2.TXT, BAD-SCHEMA-DUP-FIELD.XML, SOLRCONFIG-MASTER.XML, BAD-SCHEMA-NOT-INDEXED-BUT-TF.XML, SOLRCONFIG-CACHING.XML, MAPPING-ISOLATIN1ACCENT.TXT, SOLRCONFIG-XINCLUDE.XML, SYNONYMS.TXT, SOLRCONFIG-REPEATER.XML, SOLRCONFIG-MERGEPOLICY.XML, SOLRCONFIG-QUERYSENDER.XML, BAD-SOLRCONFIG-INVALID-SCRIPTFILE.XML, SOLRCONFIG-SLAVE1.XML, SOLRCONFIG-SOLCOREPROPERTIES.XML, SOLRCONFIG-TLOG.XML]
> [junit4:junit4]   2> 581 T618 oass.SolrIndexSearcher.<init> Opening Searcher@1e4d2bd main
> [junit4:junit4]   2> 582 T618 oass.SolrIndexSearcher.getIndexDir WARNING WARNING: Directory impl does not support setting indexDir: org.apache.lucene.store.MockDirectoryWrapper
> [junit4:junit4]   2> 582 T618 oasu.CommitTracker.<init> Hard AutoCommit: disabled
> [junit4:junit4]   2> 582 T618 oasu.CommitTracker.<init> Soft AutoCommit: disabled
> [junit4:junit4]   2> 583 T618 oashc.QueryElevationComponent.inform Loading QueryElevation from: /mnt/ssd/jenkins/workspace/Lucene-Solr-trunk-Linux/checkout/solr/build/solr-core/test-files/solr/collection1/conf/elevate.xml
> [junit4:junit4]   2> 590 T618 oashc.QueryElevationComponent.inform Loading QueryElevation from: /mnt/ssd/jenkins/workspace/Lucene-Solr-trunk-Linux/checkout/solr/build/solr-core/test-files/solr/collection1/conf/elevate.xml
> [junit4:junit4]   2> 597 T618 oashc.HttpShardHandlerFactory.getParameter Setting socketTimeout to: 0
> [junit4:junit4]   2> 597 T618 oashc.HttpShardHandlerFactory.getParameter Setting urlScheme to: http://
> [junit4:junit4]   2> 597 T618 oashc.HttpShardHandlerFactory.getParameter Setting connTimeout to: 0
> [junit4:junit4]   2> 597 T618 oashc.HttpShardHandlerFactory.getParameter Setting maxConnectionsPerHost to: 20
> [junit4:junit4]   2> 598 T618 oashc.HttpShardHandlerFactory.getParameter Setting corePoolSize to: 0
> [junit4:junit4]   2> 598 T618 oashc.HttpShardHandlerFactory.getParameter Setting maximumPoolSize to: 2147483647
> [junit4:junit4]   2> 598 T618 oashc.HttpShardHandlerFactory.getParameter Setting maxThreadIdleTime to: 5
> [junit4:junit4]   2> 598 T618 oashc.HttpShardHandlerFactory.getParameter Setting sizeOfQueue to: -1
> [junit4:junit4]   2> 599 T618 oashc.HttpShardHandlerFactory.getParameter Setting fairnessPolicy to: false
> [junit4:junit4]   2> 599 T618 oascsi.HttpClientUtil.createClient Creating new http client, config:maxConnectionsPerHost=20&maxConnections=10000&socketTimeout=0&connTimeout=0&retry=false
> [junit4:junit4]   2> 602 T618 oasc.CoreContainer.register registering core: collection1
> [junit4:junit4]   2> 602 T638 oasc.SolrCore.registerSearcher [collection1] Registered new searcher Searcher@1e4d2bd main{StandardDirectoryReader(segments_1:1)}
> [junit4:junit4]   2> 603 T618 oass.SolrDispatchFilter.init user.dir=/mnt/ssd/jenkins/workspace/Lucene-Solr-trunk-Linux/checkout/solr/build/solr-core/test/J1
> [junit4:junit4]   2> 603 T618 oass.SolrDispatchFilter.init SolrDispatchFilter.init() done
> [junit4:junit4]   2> 603 T618 oascsi.HttpClientUtil.createClient Creating new http client, config:maxConnections=128&maxConnectionsPerHost=32&followRedirects=false
> [junit4:junit4]   2> 606 T618 oejs.Server.doStart jetty-8.1.2.v20120308
> [junit4:junit4]   2> 608 T618 oejs.AbstractConnector.doStart Started SocketConnector@0.0.0.0:55736
> [junit4:junit4]   2> 608 T618 oasc.SolrResourceLoader.locateSolrHome JNDI not configured for solr (NoInitialContextEx)
> [junit4:junit4]   2> 609 T618 oasc.SolrResourceLoader.locateSolrHome using system property solr.solr.home: /mnt/ssd/jenkins/workspace/Lucene-Solr-trunk-Linux/checkout/solr/build/solr-core/test-files/solr
> [junit4:junit4]   2> 609 T618 oasc.SolrResourceLoader.<init> new SolrResourceLoader for deduced Solr Home: '/mnt/ssd/jenkins/workspace/Lucene-Solr-trunk-Linux/checkout/solr/build/solr-core/test-files/solr/'
> [junit4:junit4]   2> 615 T618 oass.SolrDispatchFilter.init SolrDispatchFilter.init()
> [junit4:junit4]   2> 615 T618 oasc.SolrResourceLoader.locateSolrHome JNDI not configured for solr (NoInitialContextEx)
> [junit4:junit4]   2> 616 T618 oasc.SolrResourceLoader.locateSolrHome using system property solr.solr.home: /mnt/ssd/jenkins/workspace/Lucene-Solr-trunk-Linux/checkout/solr/build/solr-core/test-files/solr
> [junit4:junit4]   2> 616 T618 oasc.CoreContainer$Initializer.initialize looking for solr.xml: /mnt/ssd/jenkins/workspace/Lucene-Solr-trunk-Linux/checkout/solr/build/solr-core/test-files/solr/solr.xml
> [junit4:junit4]   2> 616 T618 oasc.CoreContainer.<init> New CoreContainer 30672104
> [junit4:junit4]   2> 616 T618 oasc.CoreContainer.load Loading CoreContainer using Solr Home: '/mnt/ssd/jenkins/workspace/Lucene-Solr-trunk-Linux/checkout/solr/build/solr-core/test-files/solr/'
> [junit4:junit4]   2> 616 T618 oasc.SolrResourceLoader.<init> new SolrResourceLoader for directory: '/mnt/ssd/jenkins/workspace/Lucene-Solr-trunk-Linux/checkout/solr/build/solr-core/test-files/solr/'
> [junit4:junit4]   2> 631 T618 oasc.CoreContainer.load Registering Log Listener
> [junit4:junit4]   2> 643 T618 oasc.CoreContainer.create Creating SolrCore 'collection1' using instanceDir: /mnt/ssd/jenkins/workspace/Lucene-Solr-trunk-Linux/checkout/solr/build/solr-core/test-files/solr/collection1
> [junit4:junit4]   2> 644 T618 oasc.SolrResourceLoader.<init> new SolrResourceLoader for directory: '/mnt/ssd/jenkins/workspace/Lucene-Solr-trunk-Linux/checkout/solr/build/solr-core/test-files/solr/collection1/'
> [junit4:junit4]   2> 644 T618 oasc.SolrResourceLoader.replaceClassLoader Adding 'file:/mnt/ssd/jenkins/workspace/Lucene-Solr-trunk-Linux/checkout/solr/build/solr-core/test-files/solr/collection1/lib/README' to classloader
> [junit4:junit4]   2> 645 T618 oasc.SolrResourceLoader.replaceClassLoader Adding 'file:/mnt/ssd/jenkins/workspace/Lucene-Solr-trunk-Linux/checkout/solr/build/solr-core/test-files/solr/collection1/lib/classes/' to classloader
> [junit4:junit4]   2> 672 T618 oasc.SolrConfig.<init> Using Lucene MatchVersion: LUCENE_50
> [junit4:junit4]   2> 711 T618 oasc.SolrConfig.<init> Loaded SolrConfig: solrconfig-elevate.xml
> [junit4:junit4]   2> 711 T618 oass.IndexSchema.readSchema Reading Solr Schema
> [junit4:junit4]   2> 714 T618 oass.IndexSchema.readSchema Schema name=example
> [junit4:junit4]   2> 866 T618 oass.IndexSchema.readSchema default search field in schema is text
> [junit4:junit4]   2> 867 T618 oass.IndexSchema.readSchema unique key field: id
> [junit4:junit4]   2> 869 T618 oasc.SolrCore.<init> [collection1] Opening new SolrCore at /mnt/ssd/jenkins/workspace/Lucene-Solr-trunk-Linux/checkout/solr/build/solr-core/test-files/solr/collection1/, dataDir=./org.apache.solr.handler.component.DistributedQueryElevationComponentTest-1343942738961/shard1/data/
> [junit4:junit4]   2> 869 T618 oasc.JmxMonitoredMap.<init> JMX monitoring is enabled. Adding Solr mbeans to JMX Server: com.sun.jmx.mbeanserver.JmxMBeanServer@67c93d
> [junit4:junit4]   2> 870 T618 oasc.SolrCore.getNewIndexDir WARNING New index directory detected: old=null new=./org.apache.solr.handler.component.DistributedQueryElevationComponentTest-1343942738961/shard1/data/index/
> [junit4:junit4]   2> 870 T618 oasc.SolrCore.initIndex WARNING [collection1] Solr index directory './org.apache.solr.handler.component.DistributedQueryElevationComponentTest-1343942738961/shard1/data/index' doesn't exist. Creating new index...
> [junit4:junit4]   2> 871 T618 oasc.SolrDeletionPolicy.onCommit SolrDeletionPolicy.onCommit: commits:num=1
> [junit4:junit4]   2> 		commit{dir=MockDirWrapper(org.apache.lucene.store.RAMDirectory@c5afb3 lockFactory=org.apache.lucene.store.SingleInstanceLockFactory@466f8b),segFN=segments_1,generation=1,filenames=[segments_1]
> [junit4:junit4]   2> 871 T618 oasc.SolrDeletionPolicy.updateCommits newest commit = 1
> [junit4:junit4]   2> 872 T618 oasc.RequestHandlers.initHandlersFromConfig created /update: solr.UpdateRequestHandler
> [junit4:junit4]   2> 872 T618 oasc.RequestHandlers.initHandlersFromConfig created /elevate: org.apache.solr.handler.component.SearchHandler
> [junit4:junit4]   2> 872 T618 oasc.RequestHandlers.initHandlersFromConfig created /dataElevate: org.apache.solr.handler.component.SearchHandler
> [junit4:junit4]   2> 873 T618 oashl.XMLLoader.init xsltCacheLifetimeSeconds=60
> [junit4:junit4]   2> 873 T618 oasc.RequestHandlers.initHandlersFromConfig WARNING no default request handler is registered (either '/select' or 'standard')
> [junit4:junit4]   2> 874 T618 oasc.SolrCore.initDeprecatedSupport WARNING solrconfig.xml uses deprecated <admin/gettableFiles>, Please update your config to use the ShowFileRequestHandler.
> [junit4:junit4]   2> 874 T618 oasc.SolrCore.initDeprecatedSupport WARNING adding ShowFileRequestHandler with hidden files: [SCHEMA-BINARYFIELD.XML, SOLRCONFIG-SPELLCHECKER.XML, SOLRCONFIG-MASTER1-KEEPONEBACKUP.XML, SOLRCONFIG-MASTER1.XML, SOLRCONFIG-DELPOLICY2.XML, BAD-SOLRCONFIG-MISSING-SCRIPTFILE.XML, SOLRCONFIG-UPDATE-PROCESSOR-CHAINS.XML, HYPHENATION.DTD, FRENCHARTICLES.TXT, SOLRCONFIG-FUNCTIONQUERY.XML, STOPWITHBOM.TXT, BAD-SCHEMA-EXTERNAL-FILEFIELD.XML, SCHEMA15.XML, SOLRCONFIG-MASTER3.XML, SOLRCONFIG-TERMINDEX.XML, HUNSPELL-TEST.DIC, SOLRCONFIG-BASIC.XML, KEEP-2.TXT, SCHEMA-REVERSED.XML, SCHEMA-LMJELINEKMERCER.XML, STOPWORDSWRONGENCODING.TXT, SOLRCONFIG-ALTDIRECTORY.XML, BAD-SCHEMA-CODEC-GLOBAL-VS-FT-MISMATCH.XML, SCHEMASURROUND.XML, PHRASESUGGEST.TXT, SOLRCONFIG-SCRIPT-UPDATEPROCESSOR.XML, SCHEMA-LMDIRICHLET.XML, SCHEMA-COLLATE.XML, SCHEMA-REPLICATION2.XML, SCHEMA-BM25.XML, SCHEMA-NUMERIC.XML, SCHEMA-SIM.XML, SOLRCONFIG-MASTER2.XML, SCHEMA-PHRASESUGGEST.XML, SCHEMA-FOLDING.XML, SOLRCONFIG-QUERYSENDER-NOQUERY.XML, BAD-SCHEMA-DUP-FIELDTYPE.XML, XSLT, CONDITIONAL.UPDATEPROCESSOR.JS, BAD-SCHEMA-NOT-INDEXED-BUT-NORMS.XML, BAD-SCHEMA-ANALYZER-CLASS-AND-NESTED.XML, COMPOUNDDICTIONARY.TXT, SOLRCONFIG-TRANSFORMERS.XML, SCHEMA-DFR.XML, SCHEMA-SPELLCHECKER.XML, PROTWORDS.TXT, DA_UTF8.XML, ADDFIELDS.UPDATEPROCESSOR.JS, STEMDICT.TXT, SOLRCONFIG-ENABLEPLUGIN.XML, MISSLEADING.EXTENSION.UPDATEPROCESSOR.JS.TXT, SCHEMA-TFIDF.XML, MISSING.FUNCTIONS.UPDATEPROCESSOR.JS, STOPWORDS.TXT, STOP-1.TXT, SCHEMA-NOT-REQUIRED-UNIQUE-KEY.XML, KEEP-1.TXT, STOPTYPES-1.TXT, STOP-2.TXT, BAD-SCHEMA-NONTEXT-ANALYZER.XML, SOLRCONFIG-SIMPLELOCK.XML, SCHEMA-TRIE.XML, STOP-SNOWBALL.TXT, SOLRCONFIG_CODEC.XML, THROW.ERROR.ON.ADD.UPDATEPROCESSOR.JS, SCHEMA-IB.XML, SCHEMA-STOP-KEEP.XML, BAD-SCHEMA-NOT-INDEXED-BUT-POS.XML, SOLRCONFIG-SOLR-749.XML, SCHEMA-LUCENEMATCHVERSION.XML, BAD-SCHEMA-SIM-GLOBAL-VS-FT-MISMATCH.XML, SCHEMA_CODEC.XML, BAD-SCHEMA-UNIQUEKEY-MULTIVALUED.XML, SCHEMA-COPYFIELD-TEST.XML, SCHEMA-CHARFILTERS.XML, BAD-MP-SOLRCONFIG.XML, TRIVIAL.UPDATEPROCESSOR0.JS, SCHEMA.XML, SOLRCONFIG-SPELLCHECKCOMPONENT.XML, SOLRCONFIG-HIGHLIGHT.XML, SCHEMA11.XML, SOLRCONFIG-REQHANDLER.INCL, OPEN-EXCHANGE-RATES.JSON, BAD-SCHEMA-DUP-DYNAMICFIELD.XML, BAD-SCHEMA-OMIT-TF-BUT-NOT-POS.XML, SOLRCONFIG-DELPOLICY1.XML, SCHEMA-MINIMAL.XML, SOLRCONFIG-NOCACHE.XML, SOLRCONFIG-NATIVELOCK.XML, SOLRCONFIG-SLAVE.XML, SCHEMA12.XML, SCHEMA-REPLICATION1.XML, BAD-SCHEMA-UNIQUEKEY-USES-DEFAULT.XML, OLD_SYNONYMS.TXT, BAD-SOLRCONFIG-BOGUS-SCRIPTENGINE-NAME.XML, TRIVIAL.UPDATEPROCESSOR1.JS, ELEVATE.XML, SOLRCONFIG-LAZYWRITER.XML, SOLRCONFIG-PHRASESUGGEST.XML, SOLRCONFIG-ELEVATE.XML, BAD-SCHEMA-UNIQUEKEY-IS-COPYFIELD-DEST.XML, CURRENCY.XML, SOLRCONFIG_PERF.XML, DA_COMPOUNDDICTIONARY.TXT, WDFTYPES.TXT, HUNSPELL-TEST.AFF, SOLRCONFIG-PROPINJECT.XML, BAD_SOLRCONFIG.XML, SOLRCONFIG-PROPINJECT-INDEXDEFAULT.XML, SCHEMA-REQUIRED-FIELDS.XML, STOPTYPES-2.TXT, BAD-SCHEMA-DUP-FIELD.XML, SOLRCONFIG-MASTER.XML, BAD-SCHEMA-NOT-INDEXED-BUT-TF.XML, SOLRCONFIG-CACHING.XML, MAPPING-ISOLATIN1ACCENT.TXT, SOLRCONFIG-XINCLUDE.XML, SYNONYMS.TXT, SOLRCONFIG-REPEATER.XML, SOLRCONFIG-MERGEPOLICY.XML, SOLRCONFIG-QUERYSENDER.XML, BAD-SOLRCONFIG-INVALID-SCRIPTFILE.XML, SOLRCONFIG-SLAVE1.XML, SOLRCONFIG-SOLCOREPROPERTIES.XML, SOLRCONFIG-TLOG.XML]
> [junit4:junit4]   2> 876 T618 oass.SolrIndexSearcher.<init> Opening Searcher@10a9a54 main
> [junit4:junit4]   2> 876 T618 oass.SolrIndexSearcher.getIndexDir WARNING WARNING: Directory impl does not support setting indexDir: org.apache.lucene.store.MockDirectoryWrapper
> [junit4:junit4]   2> 876 T618 oasu.CommitTracker.<init> Hard AutoCommit: disabled
> [junit4:junit4]   2> 877 T618 oasu.CommitTracker.<init> Soft AutoCommit: disabled
> [junit4:junit4]   2> 877 T618 oashc.QueryElevationComponent.inform Loading QueryElevation from: /mnt/ssd/jenkins/workspace/Lucene-Solr-trunk-Linux/checkout/solr/build/solr-core/test-files/solr/collection1/conf/elevate.xml
> [junit4:junit4]   2> 883 T618 oashc.QueryElevationComponent.inform Loading QueryElevation from: /mnt/ssd/jenkins/workspace/Lucene-Solr-trunk-Linux/checkout/solr/build/solr-core/test-files/solr/collection1/conf/elevate.xml
> [junit4:junit4]   2> 890 T618 oashc.HttpShardHandlerFactory.getParameter Setting socketTimeout to: 0
> [junit4:junit4]   2> 891 T618 oashc.HttpShardHandlerFactory.getParameter Setting urlScheme to: http://
> [junit4:junit4]   2> 891 T618 oashc.HttpShardHandlerFactory.getParameter Setting connTimeout to: 0
> [junit4:junit4]   2> 891 T618 oashc.HttpShardHandlerFactory.getParameter Setting maxConnectionsPerHost to: 20
> [junit4:junit4]   2> 892 T618 oashc.HttpShardHandlerFactory.getParameter Setting corePoolSize to: 0
> [junit4:junit4]   2> 892 T618 oashc.HttpShardHandlerFactory.getParameter Setting maximumPoolSize to: 2147483647
> [junit4:junit4]   2> 892 T618 oashc.HttpShardHandlerFactory.getParameter Setting maxThreadIdleTime to: 5
> [junit4:junit4]   2> 892 T618 oashc.HttpShardHandlerFactory.getParameter Setting sizeOfQueue to: -1
> [junit4:junit4]   2> 893 T618 oashc.HttpShardHandlerFactory.getParameter Setting fairnessPolicy to: false
> [junit4:junit4]   2> 893 T618 oascsi.HttpClientUtil.createClient Creating new http client, config:maxConnectionsPerHost=20&maxConnections=10000&socketTimeout=0&connTimeout=0&retry=false
> [junit4:junit4]   2> 897 T648 oasc.SolrCore.registerSearcher [collection1] Registered new searcher Searcher@10a9a54 main{StandardDirectoryReader(segments_1:1)}
> [junit4:junit4]   2> 897 T618 oasc.CoreContainer.register registering core: collection1
> [junit4:junit4]   2> 898 T618 oass.SolrDispatchFilter.init user.dir=/mnt/ssd/jenkins/workspace/Lucene-Solr-trunk-Linux/checkout/solr/build/solr-core/test/J1
> [junit4:junit4]   2> 898 T618 oass.SolrDispatchFilter.init SolrDispatchFilter.init() done
> [junit4:junit4]   2> 899 T618 oascsi.HttpClientUtil.createClient Creating new http client, config:maxConnections=128&maxConnectionsPerHost=32&followRedirects=false
> [junit4:junit4]   2> 906 T618 oejs.Server.doStart jetty-8.1.2.v20120308
> [junit4:junit4]   2> 910 T618 oejs.AbstractConnector.doStart Started SocketConnector@0.0.0.0:34954
> [junit4:junit4]   2> 911 T618 oasc.SolrResourceLoader.locateSolrHome JNDI not configured for solr (NoInitialContextEx)
> [junit4:junit4]   2> 911 T618 oasc.SolrResourceLoader.locateSolrHome using system property solr.solr.home: /mnt/ssd/jenkins/workspace/Lucene-Solr-trunk-Linux/checkout/solr/build/solr-core/test-files/solr
> [junit4:junit4]   2> 911 T618 oasc.SolrResourceLoader.<init> new SolrResourceLoader for deduced Solr Home: '/mnt/ssd/jenkins/workspace/Lucene-Solr-trunk-Linux/checkout/solr/build/solr-core/test-files/solr/'
> [junit4:junit4]   2> 921 T618 oass.SolrDispatchFilter.init SolrDispatchFilter.init()
> [junit4:junit4]   2> 921 T618 oasc.SolrResourceLoader.locateSolrHome JNDI not configured for solr (NoInitialContextEx)
> [junit4:junit4]   2> 921 T618 oasc.SolrResourceLoader.locateSolrHome using system property solr.solr.home: /mnt/ssd/jenkins/workspace/Lucene-Solr-trunk-Linux/checkout/solr/build/solr-core/test-files/solr
> [junit4:junit4]   2> 922 T618 oasc.CoreContainer$Initializer.initialize looking for solr.xml: /mnt/ssd/jenkins/workspace/Lucene-Solr-trunk-Linux/checkout/solr/build/solr-core/test-files/solr/solr.xml
> [junit4:junit4]   2> 922 T618 oasc.CoreContainer.<init> New CoreContainer 27518011
> [junit4:junit4]   2> 922 T618 oasc.CoreContainer.load Loading CoreContainer using Solr Home: '/mnt/ssd/jenkins/workspace/Lucene-Solr-trunk-Linux/checkout/solr/build/solr-core/test-files/solr/'
> [junit4:junit4]   2> 923 T618 oasc.SolrResourceLoader.<init> new SolrResourceLoader for directory: '/mnt/ssd/jenkins/workspace/Lucene-Solr-trunk-Linux/checkout/solr/build/solr-core/test-files/solr/'
> [junit4:junit4]   2> 935 T618 oasc.CoreContainer.load Registering Log Listener
> [junit4:junit4]   2> 951 T618 oasc.CoreContainer.create Creating SolrCore 'collection1' using instanceDir: /mnt/ssd/jenkins/workspace/Lucene-Solr-trunk-Linux/checkout/solr/build/solr-core/test-files/solr/collection1
> [junit4:junit4]   2> 951 T618 oasc.SolrResourceLoader.<init> new SolrResourceLoader for directory: '/mnt/ssd/jenkins/workspace/Lucene-Solr-trunk-Linux/checkout/solr/build/solr-core/test-files/solr/collection1/'
> [junit4:junit4]   2> 952 T618 oasc.SolrResourceLoader.replaceClassLoader Adding 'file:/mnt/ssd/jenkins/workspace/Lucene-Solr-trunk-Linux/checkout/solr/build/solr-core/test-files/solr/collection1/lib/README' to classloader
> [junit4:junit4]   2> 952 T618 oasc.SolrResourceLoader.replaceClassLoader Adding 'file:/mnt/ssd/jenkins/workspace/Lucene-Solr-trunk-Linux/checkout/solr/build/solr-core/test-files/solr/collection1/lib/classes/' to classloader
> [junit4:junit4]   2> 970 T618 oasc.SolrConfig.<init> Using Lucene MatchVersion: LUCENE_50
> [junit4:junit4]   2> 1002 T618 oasc.SolrConfig.<init> Loaded SolrConfig: solrconfig-elevate.xml
> [junit4:junit4]   2> 1002 T618 oass.IndexSchema.readSchema Reading Solr Schema
> [junit4:junit4]   2> 1004 T618 oass.IndexSchema.readSchema Schema name=example
> [junit4:junit4]   2> 1118 T618 oass.IndexSchema.readSchema default search field in schema is text
> [junit4:junit4]   2> 1119 T618 oass.IndexSchema.readSchema unique key field: id
> [junit4:junit4]   2> 1122 T618 oasc.SolrCore.<init> [collection1] Opening new SolrCore at /mnt/ssd/jenkins/workspace/Lucene-Solr-trunk-Linux/checkout/solr/build/solr-core/test-files/solr/collection1/, dataDir=./org.apache.solr.handler.component.DistributedQueryElevationComponentTest-1343942738961/shard2/data/
> [junit4:junit4]   2> 1122 T618 oasc.JmxMonitoredMap.<init> JMX monitoring is enabled. Adding Solr mbeans to JMX Server: com.sun.jmx.mbeanserver.JmxMBeanServer@67c93d
> [junit4:junit4]   2> 1122 T618 oasc.SolrCore.getNewIndexDir WARNING New index directory detected: old=null new=./org.apache.solr.handler.component.DistributedQueryElevationComponentTest-1343942738961/shard2/data/index/
> [junit4:junit4]   2> 1122 T618 oasc.SolrCore.initIndex WARNING [collection1] Solr index directory './org.apache.solr.handler.component.DistributedQueryElevationComponentTest-1343942738961/shard2/data/index' doesn't exist. Creating new index...
> [junit4:junit4]   2> 1123 T618 oasc.SolrDeletionPolicy.onCommit SolrDeletionPolicy.onCommit: commits:num=1
> [junit4:junit4]   2> 		commit{dir=MockDirWrapper(org.apache.lucene.store.RAMDirectory@3965ab lockFactory=org.apache.lucene.store.SingleInstanceLockFactory@15bbd5b),segFN=segments_1,generation=1,filenames=[segments_1]
> [junit4:junit4]   2> 1124 T618 oasc.SolrDeletionPolicy.updateCommits newest commit = 1
> [junit4:junit4]   2> 1124 T618 oasc.RequestHandlers.initHandlersFromConfig created /update: solr.UpdateRequestHandler
> [junit4:junit4]   2> 1125 T618 oasc.RequestHandlers.initHandlersFromConfig created /elevate: org.apache.solr.handler.component.SearchHandler
> [junit4:junit4]   2> 1125 T618 oasc.RequestHandlers.initHandlersFromConfig created /dataElevate: org.apache.solr.handler.component.SearchHandler
> [junit4:junit4]   2> 1125 T618 oashl.XMLLoader.init xsltCacheLifetimeSeconds=60
> [junit4:junit4]   2> 1126 T618 oasc.RequestHandlers.initHandlersFromConfig WARNING no default request handler is registered (either '/select' or 'standard')
> [junit4:junit4]   2> 1126 T618 oasc.SolrCore.initDeprecatedSupport WARNING solrconfig.xml uses deprecated <admin/gettableFiles>, Please update your config to use the ShowFileRequestHandler.
> [junit4:junit4]   2> 1127 T618 oasc.SolrCore.initDeprecatedSupport WARNING adding ShowFileRequestHandler with hidden files: [SCHEMA-BINARYFIELD.XML, SOLRCONFIG-SPELLCHECKER.XML, SOLRCONFIG-MASTER1-KEEPONEBACKUP.XML, SOLRCONFIG-MASTER1.XML, SOLRCONFIG-DELPOLICY2.XML, BAD-SOLRCONFIG-MISSING-SCRIPTFILE.XML, SOLRCONFIG-UPDATE-PROCESSOR-CHAINS.XML, HYPHENATION.DTD, FRENCHARTICLES.TXT, SOLRCONFIG-FUNCTIONQUERY.XML, STOPWITHBOM.TXT, BAD-SCHEMA-EXTERNAL-FILEFIELD.XML, SCHEMA15.XML, SOLRCONFIG-MASTER3.XML, SOLRCONFIG-TERMINDEX.XML, HUNSPELL-TEST.DIC, SOLRCONFIG-BASIC.XML, KEEP-2.TXT, SCHEMA-REVERSED.XML, SCHEMA-LMJELINEKMERCER.XML, STOPWORDSWRONGENCODING.TXT, SOLRCONFIG-ALTDIRECTORY.XML, BAD-SCHEMA-CODEC-GLOBAL-VS-FT-MISMATCH.XML, SCHEMASURROUND.XML, PHRASESUGGEST.TXT, SOLRCONFIG-SCRIPT-UPDATEPROCESSOR.XML, SCHEMA-LMDIRICHLET.XML, SCHEMA-COLLATE.XML, SCHEMA-REPLICATION2.XML, SCHEMA-BM25.XML, SCHEMA-NUMERIC.XML, SCHEMA-SIM.XML, SOLRCONFIG-MASTER2.XML, SCHEMA-PHRASESUGGEST.XML, SCHEMA-FOLDING.XML, SOLRCONFIG-QUERYSENDER-NOQUERY.XML, BAD-SCHEMA-DUP-FIELDTYPE.XML, XSLT, CONDITIONAL.UPDATEPROCESSOR.JS, BAD-SCHEMA-NOT-INDEXED-BUT-NORMS.XML, BAD-SCHEMA-ANALYZER-CLASS-AND-NESTED.XML, COMPOUNDDICTIONARY.TXT, SOLRCONFIG-TRANSFORMERS.XML, SCHEMA-DFR.XML, SCHEMA-SPELLCHECKER.XML, PROTWORDS.TXT, DA_UTF8.XML, ADDFIELDS.UPDATEPROCESSOR.JS, STEMDICT.TXT, SOLRCONFIG-ENABLEPLUGIN.XML, MISSLEADING.EXTENSION.UPDATEPROCESSOR.JS.TXT, SCHEMA-TFIDF.XML, MISSING.FUNCTIONS.UPDATEPROCESSOR.JS, STOPWORDS.TXT, STOP-1.TXT, SCHEMA-NOT-REQUIRED-UNIQUE-KEY.XML, KEEP-1.TXT, STOPTYPES-1.TXT, STOP-2.TXT, BAD-SCHEMA-NONTEXT-ANALYZER.XML, SOLRCONFIG-SIMPLELOCK.XML, SCHEMA-TRIE.XML, STOP-SNOWBALL.TXT, SOLRCONFIG_CODEC.XML, THROW.ERROR.ON.ADD.UPDATEPROCESSOR.JS, SCHEMA-IB.XML, SCHEMA-STOP-KEEP.XML, BAD-SCHEMA-NOT-INDEXED-BUT-POS.XML, SOLRCONFIG-SOLR-749.XML, SCHEMA-LUCENEMATCHVERSION.XML, BAD-SCHEMA-SIM-GLOBAL-VS-FT-MISMATCH.XML, SCHEMA_CODEC.XML, BAD-SCHEMA-UNIQUEKEY-MULTIVALUED.XML, SCHEMA-COPYFIELD-TEST.XML, SCHEMA-CHARFILTERS.XML, BAD-MP-SOLRCONFIG.XML, TRIVIAL.UPDATEPROCESSOR0.JS, SCHEMA.XML, SOLRCONFIG-SPELLCHECKCOMPONENT.XML, SOLRCONFIG-HIGHLIGHT.XML, SCHEMA11.XML, SOLRCONFIG-REQHANDLER.INCL, OPEN-EXCHANGE-RATES.JSON, BAD-SCHEMA-DUP-DYNAMICFIELD.XML, BAD-SCHEMA-OMIT-TF-BUT-NOT-POS.XML, SOLRCONFIG-DELPOLICY1.XML, SCHEMA-MINIMAL.XML, SOLRCONFIG-NOCACHE.XML, SOLRCONFIG-NATIVELOCK.XML, SOLRCONFIG-SLAVE.XML, SCHEMA12.XML, SCHEMA-REPLICATION1.XML, BAD-SCHEMA-UNIQUEKEY-USES-DEFAULT.XML, OLD_SYNONYMS.TXT, BAD-SOLRCONFIG-BOGUS-SCRIPTENGINE-NAME.XML, TRIVIAL.UPDATEPROCESSOR1.JS, ELEVATE.XML, SOLRCONFIG-LAZYWRITER.XML, SOLRCONFIG-PHRASESUGGEST.XML, SOLRCONFIG-ELEVATE.XML, BAD-SCHEMA-UNIQUEKEY-IS-COPYFIELD-DEST.XML, CURRENCY.XML, SOLRCONFIG_PERF.XML, DA_COMPOUNDDICTIONARY.TXT, WDFTYPES.TXT, HUNSPELL-TEST.AFF, SOLRCONFIG-PROPINJECT.XML, BAD_SOLRCONFIG.XML, SOLRCONFIG-PROPINJECT-INDEXDEFAULT.XML, SCHEMA-REQUIRED-FIELDS.XML, STOPTYPES-2.TXT, BAD-SCHEMA-DUP-FIELD.XML, SOLRCONFIG-MASTER.XML, BAD-SCHEMA-NOT-INDEXED-BUT-TF.XML, SOLRCONFIG-CACHING.XML, MAPPING-ISOLATIN1ACCENT.TXT, SOLRCONFIG-XINCLUDE.XML, SYNONYMS.TXT, SOLRCONFIG-REPEATER.XML, SOLRCONFIG-MERGEPOLICY.XML, SOLRCONFIG-QUERYSENDER.XML, BAD-SOLRCONFIG-INVALID-SCRIPTFILE.XML, SOLRCONFIG-SLAVE1.XML, SOLRCONFIG-SOLCOREPROPERTIES.XML, SOLRCONFIG-TLOG.XML]
> [junit4:junit4]   2> 1129 T618 oass.SolrIndexSearcher.<init> Opening Searcher@19fdf78 main
> [junit4:junit4]   2> 1130 T618 oass.SolrIndexSearcher.getIndexDir WARNING WARNING: Directory impl does not support setting indexDir: org.apache.lucene.store.MockDirectoryWrapper
> [junit4:junit4]   2> 1130 T618 oasu.CommitTracker.<init> Hard AutoCommit: disabled
> [junit4:junit4]   2> 1130 T618 oasu.CommitTracker.<init> Soft AutoCommit: disabled
> [junit4:junit4]   2> 1131 T618 oashc.QueryElevationComponent.inform Loading QueryElevation from: /mnt/ssd/jenkins/workspace/Lucene-Solr-trunk-Linux/checkout/solr/build/solr-core/test-files/solr/collection1/conf/elevate.xml
> [junit4:junit4]   2> 1137 T618 oashc.QueryElevationComponent.inform Loading QueryElevation from: /mnt/ssd/jenkins/workspace/Lucene-Solr-trunk-Linux/checkout/solr/build/solr-core/test-files/solr/collection1/conf/elevate.xml
> [junit4:junit4]   2> 1143 T618 oashc.HttpShardHandlerFactory.getParameter Setting socketTimeout to: 0
> [junit4:junit4]   2> 1143 T618 oashc.HttpShardHandlerFactory.getParameter Setting urlScheme to: http://
> [junit4:junit4]   2> 1143 T618 oashc.HttpShardHandlerFactory.getParameter Setting connTimeout to: 0
> [junit4:junit4]   2> 1143 T618 oashc.HttpShardHandlerFactory.getParameter Setting maxConnectionsPerHost to: 20
> [junit4:junit4]   2> 1143 T618 oashc.HttpShardHandlerFactory.getParameter Setting corePoolSize to: 0
> [junit4:junit4]   2> 1144 T618 oashc.HttpShardHandlerFactory.getParameter Setting maximumPoolSize to: 2147483647
> [junit4:junit4]   2> 1144 T618 oashc.HttpShardHandlerFactory.getParameter Setting maxThreadIdleTime to: 5
> [junit4:junit4]   2> 1144 T618 oashc.HttpShardHandlerFactory.getParameter Setting sizeOfQueue to: -1
> [junit4:junit4]   2> 1144 T618 oashc.HttpShardHandlerFactory.getParameter Setting fairnessPolicy to: false
> [junit4:junit4]   2> 1145 T618 oascsi.HttpClientUtil.createClient Creating new http client, config:maxConnectionsPerHost=20&maxConnections=10000&socketTimeout=0&connTimeout=0&retry=false
> [junit4:junit4]   2> 1147 T658 oasc.SolrCore.registerSearcher [collection1] Registered new searcher Searcher@19fdf78 main{StandardDirectoryReader(segments_1:1)}
> [junit4:junit4]   2> 1147 T618 oasc.CoreContainer.register registering core: collection1
> [junit4:junit4]   2> 1148 T618 oass.SolrDispatchFilter.init user.dir=/mnt/ssd/jenkins/workspace/Lucene-Solr-trunk-Linux/checkout/solr/build/solr-core/test/J1
> [junit4:junit4]   2> 1148 T618 oass.SolrDispatchFilter.init SolrDispatchFilter.init() done
> [junit4:junit4]   2> 1148 T618 oascsi.HttpClientUtil.createClient Creating new http client, config:maxConnections=128&maxConnectionsPerHost=32&followRedirects=false
> [junit4:junit4]   2> ASYNC  NEW_CORE C24 name=collection1 org.apache.solr.core.SolrCore@f861c0
> [junit4:junit4]   2> 1156 T621 C24 oasu.DirectUpdateHandler2.deleteAll [collection1] REMOVING ALL DOCUMENTS FROM INDEX
> [junit4:junit4]   2> 1157 T621 C24 oasc.SolrDeletionPolicy.onInit SolrDeletionPolicy.onInit: commits:num=1
> [junit4:junit4]   2> 		commit{dir=MockDirWrapper(org.apache.lucene.store.RAMDirectory@c1f63a lockFactory=org.apache.lucene.store.SingleInstanceLockFactory@f6a701),segFN=segments_1,generation=1,filenames=[segments_1]
> [junit4:junit4]   2> 1157 T621 C24 oasc.SolrDeletionPolicy.updateCommits newest commit = 1
> [junit4:junit4]   2> 1158 T621 C24 UPDATE [collection1] webapp=/solr path=/update params={version=2&wt=javabin} {deleteByQuery=*:*} 0 4
> [junit4:junit4]   2> ASYNC  NEW_CORE C25 name=collection1 org.apache.solr.core.SolrCore@11cb88c
> [junit4:junit4]   2> 1163 T631 C25 oasu.DirectUpdateHandler2.deleteAll [collection1] REMOVING ALL DOCUMENTS FROM INDEX
> [junit4:junit4]   2> 1164 T631 C25 oasc.SolrDeletionPolicy.onInit SolrDeletionPolicy.onInit: commits:num=1
> [junit4:junit4]   2> 		commit{dir=MockDirWrapper(org.apache.lucene.store.RAMDirectory@98046a lockFactory=org.apache.lucene.store.SingleInstanceLockFactory@7b07a9),segFN=segments_1,generation=1,filenames=[segments_1]
> [junit4:junit4]   2> 1164 T631 C25 oasc.SolrDeletionPolicy.updateCommits newest commit = 1
> [junit4:junit4]   2> 1164 T631 C25 UPDATE [collection1] webapp=/solr path=/update params={version=2&wt=javabin} {deleteByQuery=*:*} 0 1
> [junit4:junit4]   2> ASYNC  NEW_CORE C26 name=collection1 org.apache.solr.core.SolrCore@f9df95
> [junit4:junit4]   2> 1173 T641 C26 oasu.DirectUpdateHandler2.deleteAll [collection1] REMOVING ALL DOCUMENTS FROM INDEX
> [junit4:junit4]   2> 1174 T641 C26 oasc.SolrDeletionPolicy.onInit SolrDeletionPolicy.onInit: commits:num=1
> [junit4:junit4]   2> 		commit{dir=MockDirWrapper(org.apache.lucene.store.RAMDirectory@c5afb3 lockFactory=org.apache.lucene.store.SingleInstanceLockFactory@466f8b),segFN=segments_1,generation=1,filenames=[segments_1]
> [junit4:junit4]   2> 1175 T641 C26 oasc.SolrDeletionPolicy.updateCommits newest commit = 1
> [junit4:junit4]   2> 1175 T641 C26 UPDATE [collection1] webapp=/solr path=/update params={version=2&wt=javabin} {deleteByQuery=*:*} 0 2
> [junit4:junit4]   2> ASYNC  NEW_CORE C27 name=collection1 org.apache.solr.core.SolrCore@6b72bb
> [junit4:junit4]   2> 1179 T651 C27 oasu.DirectUpdateHandler2.deleteAll [collection1] REMOVING ALL DOCUMENTS FROM INDEX
> [junit4:junit4]   2> 1180 T651 C27 oasc.SolrDeletionPolicy.onInit SolrDeletionPolicy.onInit: commits:num=1
> [junit4:junit4]   2> 		commit{dir=MockDirWrapper(org.apache.lucene.store.RAMDirectory@3965ab lockFactory=org.apache.lucene.store.SingleInstanceLockFactory@15bbd5b),segFN=segments_1,generation=1,filenames=[segments_1]
> [junit4:junit4]   2> 1180 T651 C27 oasc.SolrDeletionPolicy.updateCommits newest commit = 1
> [junit4:junit4]   2> 1181 T651 C27 UPDATE [collection1] webapp=/solr path=/update params={version=2&wt=javabin} {deleteByQuery=*:*} 0 2
> [junit4:junit4]   2> 1184 T621 C24 UPDATE [collection1] webapp=/solr path=/update params={version=2&wt=javabin} {add=[1]} 0 1
> [junit4:junit4]   2> 1187 T631 C25 UPDATE [collection1] webapp=/solr path=/update params={version=2&wt=javabin} {add=[1]} 0 1
> [junit4:junit4]   2> 1190 T621 C24 UPDATE [collection1] webapp=/solr path=/update params={version=2&wt=javabin} {add=[2]} 0 0
> [junit4:junit4]   2> 1192 T641 C26 UPDATE [collection1] webapp=/solr path=/update params={version=2&wt=javabin} {add=[2]} 0 0
> [junit4:junit4]   2> 1195 T621 C24 UPDATE [collection1] webapp=/solr path=/update params={version=2&wt=javabin} {add=[3]} 0 0
> [junit4:junit4]   2> 1197 T651 C27 UPDATE [collection1] webapp=/solr path=/update params={version=2&wt=javabin} {add=[3]} 0 0
> [junit4:junit4]   2> 1201 T621 C24 UPDATE [collection1] webapp=/solr path=/update params={version=2&wt=javabin} {add=[4]} 0 2
> [junit4:junit4]   2> 1203 T631 C25 UPDATE [collection1] webapp=/solr path=/update params={version=2&wt=javabin} {add=[4]} 0 0
> [junit4:junit4]   2> 1206 T621 C24 UPDATE [collection1] webapp=/solr path=/update params={version=2&wt=javabin} {add=[5]} 0 1
> [junit4:junit4]   2> 1208 T641 C26 UPDATE [collection1] webapp=/solr path=/update params={version=2&wt=javabin} {add=[5]} 0 0
> [junit4:junit4]   2> 1210 T621 C24 UPDATE [collection1] webapp=/solr path=/update params={version=2&wt=javabin} {add=[6]} 0 0
> [junit4:junit4]   2> 1213 T651 C27 UPDATE [collection1] webapp=/solr path=/update params={version=2&wt=javabin} {add=[6]} 0 1
> [junit4:junit4]   2> 1215 T621 C24 UPDATE [collection1] webapp=/solr path=/update params={version=2&wt=javabin} {add=[7]} 0 0
> [junit4:junit4]   2> 1217 T651 C27 UPDATE [collection1] webapp=/solr path=/update params={version=2&wt=javabin} {add=[7]} 0 0
> [junit4:junit4]   2> 1220 T621 C24 oasu.DirectUpdateHandler2.commit start commit{flags=0,_version_=0,optimize=false,openSearcher=true,waitSearcher=true,expungeDeletes=false,softCommit=false}
> [junit4:junit4]   2> 1221 T621 C24 oasc.SolrDeletionPolicy.onCommit SolrDeletionPolicy.onCommit: commits:num=2
> [junit4:junit4]   2> 		commit{dir=MockDirWrapper(org.apache.lucene.store.RAMDirectory@c1f63a lockFactory=org.apache.lucene.store.SingleInstanceLockFactory@f6a701),segFN=segments_1,generation=1,filenames=[segments_1]
> [junit4:junit4]   2> 		commit{dir=MockDirWrapper(org.apache.lucene.store.RAMDirectory@c1f63a lockFactory=org.apache.lucene.store.SingleInstanceLockFactory@f6a701),segFN=segments_2,generation=2,filenames=[_0_nrm.cfe, _0.fdx, _0_MockFixedIntBlock_0.pyl, _0_nrm.cfs, segments_2, _0_MockFixedIntBlock_0.pos, _0_SimpleText_0.pst, _0_MockFixedIntBlock_0.tii, _0_MockFixedIntBlock_0.frq, _0.fdt, _0.fnm, _0_MockFixedIntBlock_0.doc, _0_MockFixedIntBlock_0.tib, _0_MockFixedIntBlock_0.skp, _0.si]
> [junit4:junit4]   2> 1221 T621 C24 oasc.SolrDeletionPolicy.updateCommits newest commit = 2
> [junit4:junit4]   2> 1222 T621 C24 oass.SolrIndexSearcher.<init> Opening Searcher@11ff67d main
> [junit4:junit4]   2> 1222 T621 C24 oass.SolrIndexSearcher.getIndexDir WARNING WARNING: Directory impl does not support setting indexDir: org.apache.lucene.store.MockDirectoryWrapper
> [junit4:junit4]   2> 1223 T621 C24 oasu.DirectUpdateHandler2.commit end_commit_flush
> [junit4:junit4]   2> 1223 T628 oasc.SolrCore.registerSearcher [collection1] Registered new searcher Searcher@11ff67d main{StandardDirectoryReader(segments_2:4 _0(5.0):C7)}
> [junit4:junit4]   2> 1224 T621 C24 UPDATE [collection1] webapp=/solr path=/update params={version=2&commit=true&waitSearcher=true&wt=javabin&softCommit=false} {commit=} 0 5
> [junit4:junit4]   2> 1227 T631 C25 oasu.DirectUpdateHandler2.commit start commit{flags=0,_version_=0,optimize=false,openSearcher=true,waitSearcher=true,expungeDeletes=false,softCommit=false}
> [junit4:junit4]   2> 1240 T631 C25 oasc.SolrDeletionPolicy.onCommit SolrDeletionPolicy.onCommit: commits:num=2
> [junit4:junit4]   2> 		commit{dir=MockDirWrapper(org.apache.lucene.store.RAMDirectory@98046a lockFactory=org.apache.lucene.store.SingleInstanceLockFactory@7b07a9),segFN=segments_1,generation=1,filenames=[segments_1]
> [junit4:junit4]   2> 		commit{dir=MockDirWrapper(org.apache.lucene.store.RAMDirectory@98046a lockFactory=org.apache.lucene.store.SingleInstanceLockFactory@7b07a9),segFN=segments_2,generation=2,filenames=[_0_nrm.cfe, _0.fdx, _0_MockFixedIntBlock_0.pyl, _0_nrm.cfs, segments_2, _0_MockFixedIntBlock_0.pos, _0_SimpleText_0.pst, _0_MockFixedIntBlock_0.tii, _0_MockFixedIntBlock_0.frq, _0.fdt, _0.fnm, _0_MockFixedIntBlock_0.doc, _0_MockFixedIntBlock_0.tib, _0_MockFixedIntBlock_0.skp, _0.si]
> [junit4:junit4]   2> 1240 T631 C25 oasc.SolrDeletionPolicy.updateCommits newest commit = 2
> [junit4:junit4]   2> 1241 T631 C25 oass.SolrIndexSearcher.<init> Opening Searcher@1a987da main
> [junit4:junit4]   2> 1241 T631 C25 oass.SolrIndexSearcher.getIndexDir WARNING WARNING: Directory impl does not support setting indexDir: org.apache.lucene.store.MockDirectoryWrapper
> [junit4:junit4]   2> 1241 T631 C25 oasu.DirectUpdateHandler2.commit end_commit_flush
> [junit4:junit4]   2> 1242 T638 oasc.SolrCore.registerSearcher [collection1] Registered new searcher Searcher@1a987da main{StandardDirectoryReader(segments_2:4 _0(5.0):C2)}
> [junit4:junit4]   2> 1242 T631 C25 UPDATE [collection1] webapp=/solr path=/update params={version=2&commit=true&waitSearcher=true&wt=javabin&softCommit=false} {commit=} 0 15
> [junit4:junit4]   2> 1245 T641 C26 oasu.DirectUpdateHandler2.commit start commit{flags=0,_version_=0,optimize=false,openSearcher=true,waitSearcher=true,expungeDeletes=false,softCommit=false}
> [junit4:junit4]   2> 1247 T641 C26 oasc.SolrDeletionPolicy.onCommit SolrDeletionPolicy.onCommit: commits:num=2
> [junit4:junit4]   2> 		commit{dir=MockDirWrapper(org.apache.lucene.store.RAMDirectory@c5afb3 lockFactory=org.apache.lucene.store.SingleInstanceLockFactory@466f8b),segFN=segments_1,generation=1,filenames=[segments_1]
> [junit4:junit4]   2> 		commit{dir=MockDirWrapper(org.apache.lucene.store.RAMDirectory@c5afb3 lockFactory=org.apache.lucene.store.SingleInstanceLockFactory@466f8b),segFN=segments_2,generation=2,filenames=[_0_nrm.cfe, _0.fdx, _0_MockFixedIntBlock_0.pyl, _0_nrm.cfs, segments_2, _0_MockFixedIntBlock_0.pos, _0_SimpleText_0.pst, _0_MockFixedIntBlock_0.tii, _0_MockFixedIntBlock_0.frq, _0.fdt, _0.fnm, _0_MockFixedIntBlock_0.doc, _0_MockFixedIntBlock_0.tib, _0_MockFixedIntBlock_0.skp, _0.si]
> [junit4:junit4]   2> 1247 T641 C26 oasc.SolrDeletionPolicy.updateCommits newest commit = 2
> [junit4:junit4]   2> 1248 T641 C26 oass.SolrIndexSearcher.<init> Opening Searcher@13be9da main
> [junit4:junit4]   2> 1248 T641 C26 oass.SolrIndexSearcher.getIndexDir WARNING WARNING: Directory impl does not support setting indexDir: org.apache.lucene.store.MockDirectoryWrapper
> [junit4:junit4]   2> 1249 T641 C26 oasu.DirectUpdateHandler2.commit end_commit_flush
> [junit4:junit4]   2> 1249 T648 oasc.SolrCore.registerSearcher [collection1] Registered new searcher Searcher@13be9da main{StandardDirectoryReader(segments_2:4 _0(5.0):C2)}
> [junit4:junit4]   2> 1249 T641 C26 UPDATE [collection1] webapp=/solr path=/update params={version=2&commit=true&waitSearcher=true&wt=javabin&softCommit=false} {commit=} 0 4
> [junit4:junit4]   2> 1252 T651 C27 oasu.DirectUpdateHandler2.commit start commit{flags=0,_version_=0,optimize=false,openSearcher=true,waitSearcher=true,expungeDeletes=false,softCommit=false}
> [junit4:junit4]   2> 1253 T651 C27 oasc.SolrDeletionPolicy.onCommit SolrDeletionPolicy.onCommit: commits:num=2
> [junit4:junit4]   2> 		commit{dir=MockDirWrapper(org.apache.lucene.store.RAMDirectory@3965ab lockFactory=org.apache.lucene.store.SingleInstanceLockFactory@15bbd5b),segFN=segments_1,generation=1,filenames=[segments_1]
> [junit4:junit4]   2> 		commit{dir=MockDirWrapper(org.apache.lucene.store.RAMDirectory@3965ab lockFactory=org.apache.lucene.store.SingleInstanceLockFactory@15bbd5b),segFN=segments_2,generation=2,filenames=[_0_nrm.cfe, _0.fdx, _0_MockFixedIntBlock_0.pyl, _0_nrm.cfs, segments_2, _0_MockFixedIntBlock_0.pos, _0_SimpleText_0.pst, _0_MockFixedIntBlock_0.tii, _0_MockFixedIntBlock_0.frq, _0.fdt, _0.fnm, _0_MockFixedIntBlock_0.doc, _0_MockFixedIntBlock_0.tib, _0_MockFixedIntBlock_0.skp, _0.si]
> [junit4:junit4]   2> 1253 T651 C27 oasc.SolrDeletionPolicy.updateCommits newest commit = 2
> [junit4:junit4]   2> 1254 T651 C27 oass.SolrIndexSearcher.<init> Opening Searcher@1889649 main
> [junit4:junit4]   2> 1254 T651 C27 oass.SolrIndexSearcher.getIndexDir WARNING WARNING: Directory impl does not support setting indexDir: org.apache.lucene.store.MockDirectoryWrapper
> [junit4:junit4]   2> 1255 T651 C27 oasu.DirectUpdateHandler2.commit end_commit_flush
> [junit4:junit4]   2> 1255 T658 oasc.SolrCore.registerSearcher [collection1] Registered new searcher Searcher@1889649 main{StandardDirectoryReader(segments_2:4 _0(5.0):C3)}
> [junit4:junit4]   2> 1256 T651 C27 UPDATE [collection1] webapp=/solr path=/update params={version=2&commit=true&waitSearcher=true&wt=javabin&softCommit=false} {commit=} 0 4
> [junit4:junit4]   2> 1266 T621 C24 REQ [collection1] webapp=/solr path=/elevate params={qt=/elevate&version=2&q=*:*&distrib=false&wt=javabin&fl=id,+score,+[elevated]&sort=id+desc&shards.qt=/elevate&rows=500} hits=7 status=0 QTime=5 
> [junit4:junit4]   2> 1295 T652 C27 REQ [collection1] webapp=/solr path=/elevate params={qt=/elevate&version=2&shard.url=localhost:34954/solr&distrib=false&isShard=true&q=*:*&wt=javabin&fl=id,score&start=0&NOW=1343942740235&sort=id+desc&shards.qt=/elevate&rows=500&fsv=true} hits=3 status=0 QTime=2 
> [junit4:junit4]   2> 1295 T632 C25 REQ [collection1] webapp=/solr path=/elevate params={qt=/elevate&version=2&shard.url=localhost:50901/solr&distrib=false&isShard=true&q=*:*&wt=javabin&fl=id,score&start=0&NOW=1343942740235&sort=id+desc&shards.qt=/elevate&rows=500&fsv=true} hits=2 status=0 QTime=2 
> [junit4:junit4]   2> 1298 T642 C26 REQ [collection1] webapp=/solr path=/elevate params={qt=/elevate&version=2&shard.url=[::1]:33332/solr|localhost:55736/solr&distrib=false&isShard=true&q=*:*&wt=javabin&fl=id,score&start=0&NOW=1343942740235&sort=id+desc&shards.qt=/elevate&rows=500&fsv=true} hits=2 status=0 QTime=0 
> [junit4:junit4]   2> 1307 T652 C27 REQ [collection1] webapp=/solr path=/elevate params={qt=/elevate&version=2&shard.url=localhost:34954/solr&distrib=false&ids=7.0,3.0,6.0&isShard=true&q=*:*&wt=javabin&fl=id,+score,+[elevated]&NOW=1343942740235&shards.qt=/elevate&rows=500} status=0 QTime=0 
> [junit4:junit4]   2> 1307 T632 C25 REQ [collection1] webapp=/solr path=/elevate params={qt=/elevate&version=2&shard.url=localhost:50901/solr&distrib=false&ids=4.0,1.0&isShard=true&q=*:*&wt=javabin&fl=id,+score,+[elevated]&NOW=1343942740235&shards.qt=/elevate&rows=500} status=0 QTime=0 
> [junit4:junit4]   2> 1308 T642 C26 REQ [collection1] webapp=/solr path=/elevate params={qt=/elevate&version=2&shard.url=[::1]:33332/solr|localhost:55736/solr&distrib=false&ids=5.0,2.0&isShard=true&q=*:*&wt=javabin&fl=id,+score,+[elevated]&NOW=1343942740235&shards.qt=/elevate&rows=500} status=0 QTime=0 
> [junit4:junit4]   2> 1309 T651 C27 REQ [collection1] webapp=/solr path=/elevate params={qt=/elevate&version=2&q=*:*&wt=javabin&fl=id,+score,+[elevated]&sort=id+desc&shards.qt=/elevate&rows=500&shards=localhost:50901/solr,[::1]:33332/solr|localhost:55736/solr,localhost:34954/solr} status=0 QTime=33 
> [junit4:junit4]   2> 1310 T618 oas.BaseDistributedSearchTestCase.compareResponses SEVERE Mismatched responses:
> [junit4:junit4]   2> 	{responseHeader={status=0,QTime=33,params={qt=/elevate,version=2,q=*:*,wt=javabin,fl=id, score, [elevated],sort=id desc,shards.qt=/elevate,rows=500,shards=localhost:50901/solr,[::1]:33332/solr|localhost:55736/solr,localhost:34954/solr}},response={numFound=7,start=0,maxScore=1.0,docs=[SolrDocument{id=7.0, [elevated]=false, score=1.0}, SolrDocument{id=6.0, [elevated]=false, score=1.0}, SolrDocument{id=5.0, [elevated]=false, score=1.0}, SolrDocument{id=4.0, [elevated]=false, score=1.0}, SolrDocument{id=3.0, [elevated]=false, score=1.0}, SolrDocument{id=2.0, [elevated]=false, score=1.0}, SolrDocument{id=1.0, [elevated]=false, score=1.0}]}}
> [junit4:junit4]   2> 	{responseHeader={status=0,QTime=5,params={qt=/elevate,version=2,q=*:*,distrib=false,wt=javabin,fl=id, score, [elevated],sort=id desc,shards.qt=/elevate,rows=500}},response={numFound=7,start=0,maxScore=1.0,docs=[SolrDocument{id=7.0, score=1.0, [elevated]=false}, SolrDocument{id=6.0, score=1.0, [elevated]=false}, SolrDocument{id=5.0, score=1.0, [elevated]=false}, SolrDocument{id=4.0, score=1.0, [elevated]=false}, SolrDocument{id=3.0, score=1.0, [elevated]=false}, SolrDocument{id=2.0, score=1.0, [elevated]=false}, SolrDocument{id=1.0, score=1.0, [elevated]=false}]}}
> [junit4:junit4]   2> 1312 T618 oasc.CoreContainer.shutdown Shutting down CoreContainer instance=4276623
> [junit4:junit4]   2> 1312 T618 oasc.SolrCore.close [collection1]  CLOSING SolrCore org.apache.solr.core.SolrCore@f861c0
> [junit4:junit4]   2> 1313 T618 oasc.SolrCore.closeSearcher [collection1] Closing main searcher on request.
> [junit4:junit4]   2> 1313 T618 oasu.DirectUpdateHandler2.close closing DirectUpdateHandler2{commits=1,autocommits=0,soft autocommits=0,optimizes=0,rollbacks=0,expungeDeletes=0,docsPending=0,adds=0,deletesById=0,deletesByQuery=0,errors=0,cumulative_adds=7,cumulative_deletesById=0,cumulative_deletesByQuery=1,cumulative_errors=0}
> [junit4:junit4]   2> 1317 T618 oejsh.ContextHandler.doStop stopped o.e.j.s.ServletContextHandler{/solr,null}
> [junit4:junit4]   2> 1370 T618 oasc.CoreContainer.shutdown Shutting down CoreContainer instance=19706208
> [junit4:junit4]   2> 1371 T618 oasc.SolrCore.close [collection1]  CLOSING SolrCore org.apache.solr.core.SolrCore@11cb88c
> [junit4:junit4]   2> 1371 T618 oasc.SolrCore.closeSearcher [collection1] Closing main searcher on request.
> [junit4:junit4]   2> 1372 T618 oasu.DirectUpdateHandler2.close closing DirectUpdateHandler2{commits=1,autocommits=0,soft autocommits=0,optimizes=0,rollbacks=0,expungeDeletes=0,docsPending=0,adds=0,deletesById=0,deletesByQuery=0,errors=0,cumulative_adds=2,cumulative_deletesById=0,cumulative_deletesByQuery=1,cumulative_errors=0}
> [junit4:junit4]   2> 1375 T618 oejsh.ContextHandler.doStop stopped o.e.j.s.ServletContextHandler{/solr,null}
> [junit4:junit4]   2> 1426 T618 oasc.CoreContainer.shutdown Shutting down CoreContainer instance=30672104
> [junit4:junit4]   2> 1427 T618 oasc.SolrCore.close [collection1]  CLOSING SolrCore org.apache.solr.core.SolrCore@f9df95
> [junit4:junit4]   2> 1427 T618 oasc.SolrCore.closeSearcher [collection1] Closing main searcher on request.
> [junit4:junit4]   2> 1427 T618 oasu.DirectUpdateHandler2.close closing DirectUpdateHandler2{commits=1,autocommits=0,soft autocommits=0,optimizes=0,rollbacks=0,expungeDeletes=0,docsPending=0,adds=0,deletesById=0,deletesByQuery=0,errors=0,cumulative_adds=2,cumulative_deletesById=0,cumulative_deletesByQuery=1,cumulative_errors=0}
> [junit4:junit4]   2> 1430 T618 oejsh.ContextHandler.doStop stopped o.e.j.s.ServletContextHandler{/solr,null}
> [junit4:junit4]   2> 1485 T618 oasc.CoreContainer.shutdown Shutting down CoreContainer instance=27518011
> [junit4:junit4]   2> 1485 T618 oasc.SolrCore.close [collection1]  CLOSING SolrCore org.apache.solr.core.SolrCore@6b72bb
> [junit4:junit4]   2> 1486 T618 oasc.SolrCore.closeSearcher [collection1] Closing main searcher on request.
> [junit4:junit4]   2> 1486 T618 oasu.DirectUpdateHandler2.close closing DirectUpdateHandler2{commits=1,autocommits=0,soft autocommits=0,optimizes=0,rollbacks=0,expungeDeletes=0,docsPending=0,adds=0,deletesById=0,deletesByQuery=0,errors=0,cumulative_adds=3,cumulative_deletesById=0,cumulative_deletesByQuery=1,cumulative_errors=0}
> [junit4:junit4]   2> 1490 T618 oejsh.ContextHandler.doStop stopped o.e.j.s.ServletContextHandler{/solr,null}
> [junit4:junit4]   2> 1542 T618 oas.SolrTestCaseJ4.tearDown ###Ending testDistribSearch
> [junit4:junit4]   2> NOTE: reproduce with: ant test  -Dtestcase=DistributedQueryElevationComponentTest -Dtests.method=testDistribSearch -Dtests.seed=B6FB0D16AB34F85F -Dtests.multiplier=3 -Dtests.slow=true -Dtests.locale=lv_LV -Dtests.timezone=Europe/Nicosia -Dtests.file.encoding=UTF-8
> [junit4:junit4]   2>
> [junit4:junit4]    > (@AfterClass output)
> [junit4:junit4]   2> 1581 T618 oas.SolrTestCaseJ4.deleteCore ###deleteCore
> [junit4:junit4]   2> NOTE: test params are: codec=Lucene40: {text=PostingsFormat(name=SimpleText), int_i=PostingsFormat(name=SimpleText), plow_t=PostingsFormat(name=SimpleText), field_t=MockFixedIntBlock(blockSize=1042), id=MockFixedIntBlock(blockSize=1042)}, sim=DefaultSimilarity, locale=lv_LV, timezone=Europe/Nicosia
> [junit4:junit4]   2> NOTE: Linux 3.2.0-27-generic i386/Oracle Corporation 1.8.0-ea (32-bit)/cpus=8,threads=1,free=200786184,total=261488640
> [junit4:junit4]   2> NOTE: All tests run in this JVM: [XsltUpdateRequestHandlerTest, SoftAutoCommitTest, TestSolrDeletionPolicy2, FileUtilsTest, SuggesterTSTTest, TestFiltering, TestHashPartitioner, PrimUtilsTest, TestMergePolicyConfig, LegacyHTMLStripCharFilterTest, IndexSchemaTest, TestSolrCoreProperties, OpenExchangeRatesOrgProviderTest, TestBinaryField, HighlighterTest, TestFoldingMultitermQuery, SpellCheckCollatorTest, TestReversedWildcardFilterFactory, FieldAnalysisRequestHandlerTest, TestSolrQueryParser, QueryEqualityTest, TestSuggestSpellingConverter, TestCodecSupport, DisMaxRequestHandlerTest, TestPluginEnable, TestOmitPositions, TestQuerySenderListener, QueryParsingTest, TestDFRSimilarityFactory, TestJoin, TestDocumentBuilder, TestPHPSerializedResponseWriter, MultiTermTest, TestFaceting, OverseerTest, SuggesterWFSTTest, TestDocSet, ZkControllerTest, TimeZoneUtilsTest, TestTrie, SpellingQueryConverterTest, DistributedQueryElevationComponentTest]
> [junit4:junit4]   2> 
> [junit4:junit4] Completed on J1 in 1.59s, 1 test, 1 failure <<< FAILURES!
> 
> [...truncated 436 lines...]
> BUILD FAILED
> /mnt/ssd/jenkins/workspace/Lucene-Solr-trunk-Linux/checkout/build.xml:29: The following error occurred while executing this line:
> /mnt/ssd/jenkins/workspace/Lucene-Solr-trunk-Linux/checkout/solr/build.xml:144: The following error occurred while executing this line:
> /mnt/ssd/jenkins/workspace/Lucene-Solr-trunk-Linux/checkout/lucene/module-build.xml:62: The following error occurred while executing this line:
> /mnt/ssd/jenkins/workspace/Lucene-Solr-trunk-Linux/checkout/lucene/common-build.xml:1095: The following error occurred while executing this line:
> /mnt/ssd/jenkins/workspace/Lucene-Solr-trunk-Linux/checkout/lucene/common-build.xml:790: There were test failures: 223 suites, 899 tests, 1 failure, 5 ignored
> 
> Total time: 21 minutes 12 seconds
> Build step 'Execute shell' marked build as failure
> Archiving artifacts
> Recording test results
> Email was triggered for: Failure
> Sending email for trigger: Failure
> 
> 
> 
> ---------------------------------------------------------------------
> To unsubscribe, e-mail: dev-unsubscribe@lucene.apache.org
> For additional commands, e-mail: dev-help@lucene.apache.org

- Mark Miller
lucidimagination.com












---------------------------------------------------------------------
To unsubscribe, e-mail: dev-unsubscribe@lucene.apache.org
For additional commands, e-mail: dev-help@lucene.apache.org


Mime
View raw message