lucene-dev mailing list archives

Site index · List index
Message view « Date » · « Thread »
Top « Date » · « Thread »
From Mark Miller <markrmil...@gmail.com>
Subject Re: [JENKINS] Lucene-Solr-tests-only-4.x-java7 - Build # 252 - Failure
Date Sun, 05 Aug 2012 16:21:34 GMT
Hmmm...probably need to look at having the SyncStrategy have  a close method or have it look
at CoreContainers open/closed state.

On Aug 5, 2012, at 9:52 AM, Apache Jenkins Server <jenkins@builds.apache.org> wrote:

> Build: https://builds.apache.org/job/Lucene-Solr-tests-only-4.x-java7/252/
> 
> 1 tests failed.
> FAILED:  junit.framework.TestSuite.org.apache.solr.cloud.BasicDistributedZkTest
> 
> Error Message:
> ERROR: SolrIndexSearcher opens=1072 closes=1071
> 
> Stack Trace:
> java.lang.AssertionError: ERROR: SolrIndexSearcher opens=1072 closes=1071
> 	at __randomizedtesting.SeedInfo.seed([B27DB23B98F1349B]:0)
> 	at org.junit.Assert.fail(Assert.java:93)
> 	at org.apache.solr.SolrTestCaseJ4.endTrackingSearchers(SolrTestCaseJ4.java:216)
> 	at org.apache.solr.SolrTestCaseJ4.afterClass(SolrTestCaseJ4.java:82)
> 	at sun.reflect.NativeMethodAccessorImpl.invoke0(Native Method)
> 	at sun.reflect.NativeMethodAccessorImpl.invoke(NativeMethodAccessorImpl.java:57)
> 	at sun.reflect.DelegatingMethodAccessorImpl.invoke(DelegatingMethodAccessorImpl.java:43)
> 	at java.lang.reflect.Method.invoke(Method.java:601)
> 	at com.carrotsearch.randomizedtesting.RandomizedRunner.invoke(RandomizedRunner.java:1995)
> 	at com.carrotsearch.randomizedtesting.RandomizedRunner.access$1100(RandomizedRunner.java:132)
> 	at com.carrotsearch.randomizedtesting.RandomizedRunner$5.evaluate(RandomizedRunner.java:754)
> 	at com.carrotsearch.randomizedtesting.rules.SystemPropertiesRestoreRule$1.evaluate(SystemPropertiesRestoreRule.java:53)
> 	at org.apache.lucene.util.AbstractBeforeAfterRule$1.evaluate(AbstractBeforeAfterRule.java:45)
> 	at org.apache.lucene.util.TestRuleReportUncaughtExceptions$1.evaluate(TestRuleReportUncaughtExceptions.java:68)
> 	at org.apache.lucene.util.TestRuleStoreClassName$1.evaluate(TestRuleStoreClassName.java:38)
> 	at com.carrotsearch.randomizedtesting.rules.SystemPropertiesInvariantRule$1.evaluate(SystemPropertiesInvariantRule.java:55)
> 	at org.apache.lucene.util.TestRuleNoInstanceHooksOverrides$1.evaluate(TestRuleNoInstanceHooksOverrides.java:53)
> 	at org.apache.lucene.util.TestRuleNoStaticHooksShadowing$1.evaluate(TestRuleNoStaticHooksShadowing.java:52)
> 	at org.apache.lucene.util.TestRuleAssertionsRequired$1.evaluate(TestRuleAssertionsRequired.java:36)
> 	at org.apache.lucene.util.TestRuleMarkFailure$1.evaluate(TestRuleMarkFailure.java:48)
> 	at org.apache.lucene.util.TestRuleIgnoreAfterMaxFailures$1.evaluate(TestRuleIgnoreAfterMaxFailures.java:70)
> 	at org.apache.lucene.util.TestRuleIgnoreTestSuites$1.evaluate(TestRuleIgnoreTestSuites.java:55)
> 	at com.carrotsearch.randomizedtesting.RandomizedRunner.runSuite(RandomizedRunner.java:605)
> 	at com.carrotsearch.randomizedtesting.RandomizedRunner.access$400(RandomizedRunner.java:132)
> 	at com.carrotsearch.randomizedtesting.RandomizedRunner$2.run(RandomizedRunner.java:551)
> 
> 
> 
> 
> Build Log:
> [...truncated 7354 lines...]
> [junit4:junit4] Suite: org.apache.solr.cloud.BasicDistributedZkTest
> [junit4:junit4]    > (@AfterClass output)
> [junit4:junit4]   2> 152925 T225 oas.SolrTestCaseJ4.deleteCore ###deleteCore
> [junit4:junit4]   2> 154138 T228 oazs.SessionTrackerImpl.run SessionTrackerImpl exited
loop!
> [junit4:junit4]   2> 182479 T271 oasc.SolrException.log SEVERE http://127.0.0.1:52820/solr/collection3/:
Could not tell a replica to recover:org.apache.solr.client.solrj.SolrServerException: IOException
occured when talking to server at: http://127.0.0.1:24083/solr
> [junit4:junit4]   2> 		at org.apache.solr.client.solrj.impl.HttpSolrServer.request(HttpSolrServer.java:414)
> [junit4:junit4]   2> 		at org.apache.solr.client.solrj.impl.HttpSolrServer.request(HttpSolrServer.java:182)
> [junit4:junit4]   2> 		at org.apache.solr.cloud.SyncStrategy.requestRecovery(SyncStrategy.java:281)
> [junit4:junit4]   2> 		at org.apache.solr.cloud.SyncStrategy.syncToMe(SyncStrategy.java:225)
> [junit4:junit4]   2> 		at org.apache.solr.cloud.SyncStrategy.syncReplicas(SyncStrategy.java:118)
> [junit4:junit4]   2> 		at org.apache.solr.cloud.SyncStrategy.sync(SyncStrategy.java:85)
> [junit4:junit4]   2> 		at org.apache.solr.cloud.ShardLeaderElectionContext.runLeaderProcess(ElectionContext.java:157)
> [junit4:junit4]   2> 		at org.apache.solr.cloud.LeaderElector.runIamLeaderProcess(LeaderElector.java:151)
> [junit4:junit4]   2> 		at org.apache.solr.cloud.LeaderElector.checkIfIamLeader(LeaderElector.java:96)
> [junit4:junit4]   2> 		at org.apache.solr.cloud.LeaderElector.access$000(LeaderElector.java:57)
> [junit4:junit4]   2> 		at org.apache.solr.cloud.LeaderElector$1.process(LeaderElector.java:125)
> [junit4:junit4]   2> 		at org.apache.zookeeper.ClientCnxn$EventThread.processEvent(ClientCnxn.java:526)
> [junit4:junit4]   2> 		at org.apache.zookeeper.ClientCnxn$EventThread.run(ClientCnxn.java:502)
> [junit4:junit4]   2> 	Caused by: org.apache.http.conn.ConnectTimeoutException: Connect
to 127.0.0.1:24083 timed out
> [junit4:junit4]   2> 		at org.apache.http.conn.scheme.PlainSocketFactory.connectSocket(PlainSocketFactory.java:125)
> [junit4:junit4]   2> 		at org.apache.http.impl.conn.DefaultClientConnectionOperator.openConnection(DefaultClientConnectionOperator.java:148)
> [junit4:junit4]   2> 		at org.apache.http.impl.conn.AbstractPoolEntry.open(AbstractPoolEntry.java:150)
> [junit4:junit4]   2> 		at org.apache.http.impl.conn.AbstractPooledConnAdapter.open(AbstractPooledConnAdapter.java:121)
> [junit4:junit4]   2> 		at org.apache.http.impl.client.DefaultRequestDirector.tryConnect(DefaultRequestDirector.java:575)
> [junit4:junit4]   2> 		at org.apache.http.impl.client.DefaultRequestDirector.execute(DefaultRequestDirector.java:425)
> [junit4:junit4]   2> 		at org.apache.http.impl.client.AbstractHttpClient.execute(AbstractHttpClient.java:820)
> [junit4:junit4]   2> 		at org.apache.http.impl.client.AbstractHttpClient.execute(AbstractHttpClient.java:754)
> [junit4:junit4]   2> 		at org.apache.http.impl.client.AbstractHttpClient.execute(AbstractHttpClient.java:732)
> [junit4:junit4]   2> 		at org.apache.solr.client.solrj.impl.HttpSolrServer.request(HttpSolrServer.java:353)
> [junit4:junit4]   2> 		... 12 more
> [junit4:junit4]   2> 	
> [junit4:junit4]   2> 182480 T271 oasc.RecoveryStrategy.close WARNING Stopping recovery
for core collection3 zkNodeName=127.0.0.1:52820_solr_collection3
> [junit4:junit4]   2> 182481 T271 oasc.SolrCore.close [collection3]  CLOSING SolrCore
org.apache.solr.core.SolrCore@2751fbe0
> [junit4:junit4]   2> 182482 T271 oasc.SolrCore.closeSearcher [collection3] Closing
main searcher on request.
> [junit4:junit4]   2> 182482 T271 oasu.DirectUpdateHandler2.close closing DirectUpdateHandler2{commits=2,autocommits=0,soft
autocommits=0,optimizes=0,rollbacks=0,expungeDeletes=0,docsPending=0,adds=0,deletesById=0,deletesByQuery=0,errors=0,cumulative_adds=2,cumulative_deletesById=0,cumulative_deletesByQuery=0,cumulative_errors=0}
> [junit4:junit4]   2> 182483 T271 oasc.RecoveryStrategy.close WARNING Stopping recovery
for core collection3 zkNodeName=127.0.0.1:52820_solr_collection3
> [junit4:junit4]   2> 182483 T271 oasc.LeaderElector$1.process WARNING  org.apache.zookeeper.KeeperException$SessionExpiredException:
KeeperErrorCode = Session expired for /overseer/queue/qn-
> [junit4:junit4]   2> 	at org.apache.zookeeper.KeeperException.create(KeeperException.java:118)
> [junit4:junit4]   2> 	at org.apache.zookeeper.KeeperException.create(KeeperException.java:42)
> [junit4:junit4]   2> 	at org.apache.zookeeper.ZooKeeper.create(ZooKeeper.java:643)
> [junit4:junit4]   2> 	at org.apache.solr.common.cloud.SolrZkClient$5.execute(SolrZkClient.java:244)
> [junit4:junit4]   2> 	at org.apache.solr.common.cloud.SolrZkClient$5.execute(SolrZkClient.java:241)
> [junit4:junit4]   2> 	at org.apache.solr.common.cloud.ZkCmdExecutor.retryOperation(ZkCmdExecutor.java:67)
> [junit4:junit4]   2> 	at org.apache.solr.common.cloud.SolrZkClient.create(SolrZkClient.java:241)
> [junit4:junit4]   2> 	at org.apache.solr.cloud.DistributedQueue.offer(DistributedQueue.java:236)
> [junit4:junit4]   2> 	at org.apache.solr.cloud.ZkController.publish(ZkController.java:740)
> [junit4:junit4]   2> 	at org.apache.solr.cloud.ShardLeaderElectionContext.runLeaderProcess(ElectionContext.java:167)
> [junit4:junit4]   2> 	at org.apache.solr.cloud.LeaderElector.runIamLeaderProcess(LeaderElector.java:151)
> [junit4:junit4]   2> 	at org.apache.solr.cloud.LeaderElector.checkIfIamLeader(LeaderElector.java:96)
> [junit4:junit4]   2> 	at org.apache.solr.cloud.LeaderElector.access$000(LeaderElector.java:57)
> [junit4:junit4]   2> 	at org.apache.solr.cloud.LeaderElector$1.process(LeaderElector.java:125)
> [junit4:junit4]   2> 	at org.apache.zookeeper.ClientCnxn$EventThread.processEvent(ClientCnxn.java:526)
> [junit4:junit4]   2> 	at org.apache.zookeeper.ClientCnxn$EventThread.run(ClientCnxn.java:502)
> [junit4:junit4]   2> 
> [junit4:junit4]   2> 182484 T271 oascc.ZkStateReader$3.process Updating live nodes
> [junit4:junit4]   2> 182484 T271 oascc.ZkStateReader$3.process WARNING ZooKeeper watch
triggered, but Solr cannot talk to ZK
> [junit4:junit4]   2> 182484 T271 oasc.LeaderElector$1.process WARNING  org.apache.zookeeper.KeeperException$SessionExpiredException:
KeeperErrorCode = Session expired for /collections/awholynewcollection_3/leader_elect/shard1/election
> [junit4:junit4]   2> 	at org.apache.zookeeper.KeeperException.create(KeeperException.java:118)
> [junit4:junit4]   2> 	at org.apache.zookeeper.KeeperException.create(KeeperException.java:42)
> [junit4:junit4]   2> 	at org.apache.zookeeper.ZooKeeper.getChildren(ZooKeeper.java:1249)
> [junit4:junit4]   2> 	at org.apache.solr.common.cloud.SolrZkClient$6.execute(SolrZkClient.java:266)
> [junit4:junit4]   2> 	at org.apache.solr.common.cloud.SolrZkClient$6.execute(SolrZkClient.java:263)
> [junit4:junit4]   2> 	at org.apache.solr.common.cloud.ZkCmdExecutor.retryOperation(ZkCmdExecutor.java:67)
> [junit4:junit4]   2> 	at org.apache.solr.common.cloud.SolrZkClient.getChildren(SolrZkClient.java:263)
> [junit4:junit4]   2> 	at org.apache.solr.cloud.LeaderElector.checkIfIamLeader(LeaderElector.java:91)
> [junit4:junit4]   2> 	at org.apache.solr.cloud.LeaderElector.access$000(LeaderElector.java:57)
> [junit4:junit4]   2> 	at org.apache.solr.cloud.LeaderElector$1.process(LeaderElector.java:125)
> [junit4:junit4]   2> 	at org.apache.zookeeper.ClientCnxn$EventThread.processEvent(ClientCnxn.java:526)
> [junit4:junit4]   2> 	at org.apache.zookeeper.ClientCnxn$EventThread.run(ClientCnxn.java:502)
> [junit4:junit4]   2> 
> [junit4:junit4]   2> 182485 T271 oasc.LeaderElector$1.process WARNING  org.apache.zookeeper.KeeperException$SessionExpiredException:
KeeperErrorCode = Session expired for /overseer_elect/election
> [junit4:junit4]   2> 	at org.apache.zookeeper.KeeperException.create(KeeperException.java:118)
> [junit4:junit4]   2> 	at org.apache.zookeeper.KeeperException.create(KeeperException.java:42)
> [junit4:junit4]   2> 	at org.apache.zookeeper.ZooKeeper.getChildren(ZooKeeper.java:1249)
> [junit4:junit4]   2> 	at org.apache.solr.common.cloud.SolrZkClient$6.execute(SolrZkClient.java:266)
> [junit4:junit4]   2> 	at org.apache.solr.common.cloud.SolrZkClient$6.execute(SolrZkClient.java:263)
> [junit4:junit4]   2> 	at org.apache.solr.common.cloud.ZkCmdExecutor.retryOperation(ZkCmdExecutor.java:67)
> [junit4:junit4]   2> 	at org.apache.solr.common.cloud.SolrZkClient.getChildren(SolrZkClient.java:263)
> [junit4:junit4]   2> 	at org.apache.solr.cloud.LeaderElector.checkIfIamLeader(LeaderElector.java:91)
> [junit4:junit4]   2> 	at org.apache.solr.cloud.LeaderElector.access$000(LeaderElector.java:57)
> [junit4:junit4]   2> 	at org.apache.solr.cloud.LeaderElector$1.process(LeaderElector.java:125)
> [junit4:junit4]   2> 	at org.apache.zookeeper.ClientCnxn$EventThread.processEvent(ClientCnxn.java:526)
> [junit4:junit4]   2> 	at org.apache.zookeeper.ClientCnxn$EventThread.run(ClientCnxn.java:502)
> [junit4:junit4]   2> 
> [junit4:junit4]   2> 182486 T271 oasc.LeaderElector$1.process WARNING  org.apache.zookeeper.KeeperException$SessionExpiredException:
KeeperErrorCode = Session expired for /collections/awholynewcollection_2/leader_elect/shard1/election
> [junit4:junit4]   2> 	at org.apache.zookeeper.KeeperException.create(KeeperException.java:118)
> [junit4:junit4]   2> 	at org.apache.zookeeper.KeeperException.create(KeeperException.java:42)
> [junit4:junit4]   2> 	at org.apache.zookeeper.ZooKeeper.getChildren(ZooKeeper.java:1249)
> [junit4:junit4]   2> 	at org.apache.solr.common.cloud.SolrZkClient$6.execute(SolrZkClient.java:266)
> [junit4:junit4]   2> 	at org.apache.solr.common.cloud.SolrZkClient$6.execute(SolrZkClient.java:263)
> [junit4:junit4]   2> 	at org.apache.solr.common.cloud.ZkCmdExecutor.retryOperation(ZkCmdExecutor.java:67)
> [junit4:junit4]   2> 	at org.apache.solr.common.cloud.SolrZkClient.getChildren(SolrZkClient.java:263)
> [junit4:junit4]   2> 	at org.apache.solr.cloud.LeaderElector.checkIfIamLeader(LeaderElector.java:91)
> [junit4:junit4]   2> 	at org.apache.solr.cloud.LeaderElector.access$000(LeaderElector.java:57)
> [junit4:junit4]   2> 	at org.apache.solr.cloud.LeaderElector$1.process(LeaderElector.java:125)
> [junit4:junit4]   2> 	at org.apache.zookeeper.ClientCnxn$EventThread.processEvent(ClientCnxn.java:526)
> [junit4:junit4]   2> 	at org.apache.zookeeper.ClientCnxn$EventThread.run(ClientCnxn.java:502)
> [junit4:junit4]   2> 
> [junit4:junit4]   2> 182486 T271 oasc.LeaderElector$1.process WARNING  org.apache.zookeeper.KeeperException$SessionExpiredException:
KeeperErrorCode = Session expired for /collections/collection2/leader_elect/shard1/election
> [junit4:junit4]   2> 	at org.apache.zookeeper.KeeperException.create(KeeperException.java:118)
> [junit4:junit4]   2> 	at org.apache.zookeeper.KeeperException.create(KeeperException.java:42)
> [junit4:junit4]   2> 	at org.apache.zookeeper.ZooKeeper.getChildren(ZooKeeper.java:1249)
> [junit4:junit4]   2> 	at org.apache.solr.common.cloud.SolrZkClient$6.execute(SolrZkClient.java:266)
> [junit4:junit4]   2> 	at org.apache.solr.common.cloud.SolrZkClient$6.execute(SolrZkClient.java:263)
> [junit4:junit4]   2> 	at org.apache.solr.common.cloud.ZkCmdExecutor.retryOperation(ZkCmdExecutor.java:67)
> [junit4:junit4]   2> 	at org.apache.solr.common.cloud.SolrZkClient.getChildren(SolrZkClient.java:263)
> [junit4:junit4]   2> 	at org.apache.solr.cloud.LeaderElector.checkIfIamLeader(LeaderElector.java:91)
> [junit4:junit4]   2> 	at org.apache.solr.cloud.LeaderElector.access$000(LeaderElector.java:57)
> [junit4:junit4]   2> 	at org.apache.solr.cloud.LeaderElector$1.process(LeaderElector.java:125)
> [junit4:junit4]   2> 	at org.apache.zookeeper.ClientCnxn$EventThread.processEvent(ClientCnxn.java:526)
> [junit4:junit4]   2> 	at org.apache.zookeeper.ClientCnxn$EventThread.run(ClientCnxn.java:502)
> [junit4:junit4]   2> 
> [junit4:junit4]   2> 182487 T271 oasc.LeaderElector$1.process WARNING  org.apache.zookeeper.KeeperException$SessionExpiredException:
KeeperErrorCode = Session expired for /collections/awholynewcollection_0/leader_elect/shard1/election
> [junit4:junit4]   2> 	at org.apache.zookeeper.KeeperException.create(KeeperException.java:118)
> [junit4:junit4]   2> 	at org.apache.zookeeper.KeeperException.create(KeeperException.java:42)
> [junit4:junit4]   2> 	at org.apache.zookeeper.ZooKeeper.getChildren(ZooKeeper.java:1249)
> [junit4:junit4]   2> 	at org.apache.solr.common.cloud.SolrZkClient$6.execute(SolrZkClient.java:266)
> [junit4:junit4]   2> 	at org.apache.solr.common.cloud.SolrZkClient$6.execute(SolrZkClient.java:263)
> [junit4:junit4]   2> 	at org.apache.solr.common.cloud.ZkCmdExecutor.retryOperation(ZkCmdExecutor.java:67)
> [junit4:junit4]   2> 	at org.apache.solr.common.cloud.SolrZkClient.getChildren(SolrZkClient.java:263)
> [junit4:junit4]   2> 	at org.apache.solr.cloud.LeaderElector.checkIfIamLeader(LeaderElector.java:91)
> [junit4:junit4]   2> 	at org.apache.solr.cloud.LeaderElector.access$000(LeaderElector.java:57)
> [junit4:junit4]   2> 	at org.apache.solr.cloud.LeaderElector$1.process(LeaderElector.java:125)
> [junit4:junit4]   2> 	at org.apache.zookeeper.ClientCnxn$EventThread.processEvent(ClientCnxn.java:526)
> [junit4:junit4]   2> 	at org.apache.zookeeper.ClientCnxn$EventThread.run(ClientCnxn.java:502)
> [junit4:junit4]   2> 
> [junit4:junit4]   2> 182488 T271 oaz.ClientCnxn$EventThread.run EventThread shut down
> [junit4:junit4]   2> 197520 T570 C24 P61427 oasc.RecoveryStrategy.doRecovery SEVERE
Error while trying to recover. org.apache.solr.client.solrj.SolrServerException: IOException
occured when talking to server at: http://127.0.0.1:24083/solr
> [junit4:junit4]   2> 	at org.apache.solr.client.solrj.impl.HttpSolrServer.request(HttpSolrServer.java:414)
> [junit4:junit4]   2> 	at org.apache.solr.client.solrj.impl.HttpSolrServer.request(HttpSolrServer.java:182)
> [junit4:junit4]   2> 	at org.apache.solr.cloud.RecoveryStrategy.sendPrepRecoveryCmd(RecoveryStrategy.java:190)
> [junit4:junit4]   2> 	at org.apache.solr.cloud.RecoveryStrategy.doRecovery(RecoveryStrategy.java:305)
> [junit4:junit4]   2> 	at org.apache.solr.cloud.RecoveryStrategy.run(RecoveryStrategy.java:211)
> [junit4:junit4]   2> Caused by: org.apache.http.conn.ConnectTimeoutException: Connect
to 127.0.0.1:24083 timed out
> [junit4:junit4]   2> 	at org.apache.http.conn.scheme.PlainSocketFactory.connectSocket(PlainSocketFactory.java:125)
> [junit4:junit4]   2> 	at org.apache.http.impl.conn.DefaultClientConnectionOperator.openConnection(DefaultClientConnectionOperator.java:148)
> [junit4:junit4]   2> 	at org.apache.http.impl.conn.AbstractPoolEntry.open(AbstractPoolEntry.java:150)
> [junit4:junit4]   2> 	at org.apache.http.impl.conn.AbstractPooledConnAdapter.open(AbstractPooledConnAdapter.java:121)
> [junit4:junit4]   2> 	at org.apache.http.impl.client.DefaultRequestDirector.tryConnect(DefaultRequestDirector.java:575)
> [junit4:junit4]   2> 	at org.apache.http.impl.client.DefaultRequestDirector.execute(DefaultRequestDirector.java:425)
> [junit4:junit4]   2> 	at org.apache.http.impl.client.AbstractHttpClient.execute(AbstractHttpClient.java:820)
> [junit4:junit4]   2> 	at org.apache.http.impl.client.AbstractHttpClient.execute(AbstractHttpClient.java:754)
> [junit4:junit4]   2> 	at org.apache.http.impl.client.AbstractHttpClient.execute(AbstractHttpClient.java:732)
> [junit4:junit4]   2> 	at org.apache.solr.client.solrj.impl.HttpSolrServer.request(HttpSolrServer.java:353)
> [junit4:junit4]   2> 	... 4 more
> [junit4:junit4]   2> 
> [junit4:junit4]   2> 197521 T570 C24 P61427 oasc.RecoveryStrategy.doRecovery SEVERE
Recovery failed - trying again...
> [junit4:junit4]   2> 199523 T570 C24 P61427 oasc.RecoveryStrategy.doRecovery SEVERE
Error while trying to recover. org.apache.zookeeper.KeeperException$SessionExpiredException:
KeeperErrorCode = Session expired for /overseer/queue/qn-
> [junit4:junit4]   2> 	at org.apache.zookeeper.KeeperException.create(KeeperException.java:118)
> [junit4:junit4]   2> 	at org.apache.zookeeper.KeeperException.create(KeeperException.java:42)
> [junit4:junit4]   2> 	at org.apache.zookeeper.ZooKeeper.create(ZooKeeper.java:643)
> [junit4:junit4]   2> 	at org.apache.solr.common.cloud.SolrZkClient$5.execute(SolrZkClient.java:244)
> [junit4:junit4]   2> 	at org.apache.solr.common.cloud.SolrZkClient$5.execute(SolrZkClient.java:241)
> [junit4:junit4]   2> 	at org.apache.solr.common.cloud.ZkCmdExecutor.retryOperation(ZkCmdExecutor.java:67)
> [junit4:junit4]   2> 	at org.apache.solr.common.cloud.SolrZkClient.create(SolrZkClient.java:241)
> [junit4:junit4]   2> 	at org.apache.solr.cloud.DistributedQueue.offer(DistributedQueue.java:236)
> [junit4:junit4]   2> 	at org.apache.solr.cloud.ZkController.publish(ZkController.java:740)
> [junit4:junit4]   2> 	at org.apache.solr.cloud.RecoveryStrategy.doRecovery(RecoveryStrategy.java:293)
> [junit4:junit4]   2> 	at org.apache.solr.cloud.RecoveryStrategy.run(RecoveryStrategy.java:211)
> [junit4:junit4]   2> 
> [junit4:junit4]   2> 199524 T570 C24 P61427 oasc.RecoveryStrategy.doRecovery SEVERE
Recovery failed - trying again...
> [junit4:junit4]   2> 203528 T570 C24 P61427 oasc.RecoveryStrategy.doRecovery SEVERE
Error while trying to recover. org.apache.zookeeper.KeeperException$SessionExpiredException:
KeeperErrorCode = Session expired for /overseer/queue/qn-
> [junit4:junit4]   2> 	at org.apache.zookeeper.KeeperException.create(KeeperException.java:118)
> [junit4:junit4]   2> 	at org.apache.zookeeper.KeeperException.create(KeeperException.java:42)
> [junit4:junit4]   2> 	at org.apache.zookeeper.ZooKeeper.create(ZooKeeper.java:643)
> [junit4:junit4]   2> 	at org.apache.solr.common.cloud.SolrZkClient$5.execute(SolrZkClient.java:244)
> [junit4:junit4]   2> 	at org.apache.solr.common.cloud.SolrZkClient$5.execute(SolrZkClient.java:241)
> [junit4:junit4]   2> 	at org.apache.solr.common.cloud.ZkCmdExecutor.retryOperation(ZkCmdExecutor.java:67)
> [junit4:junit4]   2> 	at org.apache.solr.common.cloud.SolrZkClient.create(SolrZkClient.java:241)
> [junit4:junit4]   2> 	at org.apache.solr.cloud.DistributedQueue.offer(DistributedQueue.java:236)
> [junit4:junit4]   2> 	at org.apache.solr.cloud.ZkController.publish(ZkController.java:740)
> [junit4:junit4]   2> 	at org.apache.solr.cloud.RecoveryStrategy.doRecovery(RecoveryStrategy.java:293)
> [junit4:junit4]   2> 	at org.apache.solr.cloud.RecoveryStrategy.run(RecoveryStrategy.java:211)
> [junit4:junit4]   2> 
> [junit4:junit4]   2> 203528 T570 C24 P61427 oasc.RecoveryStrategy.doRecovery SEVERE
Recovery failed - trying again...
> [junit4:junit4]   2> 211536 T570 C24 P61427 oasc.RecoveryStrategy.doRecovery SEVERE
Error while trying to recover. org.apache.zookeeper.KeeperException$SessionExpiredException:
KeeperErrorCode = Session expired for /overseer/queue/qn-
> [junit4:junit4]   2> 	at org.apache.zookeeper.KeeperException.create(KeeperException.java:118)
> [junit4:junit4]   2> 	at org.apache.zookeeper.KeeperException.create(KeeperException.java:42)
> [junit4:junit4]   2> 	at org.apache.zookeeper.ZooKeeper.create(ZooKeeper.java:643)
> [junit4:junit4]   2> 	at org.apache.solr.common.cloud.SolrZkClient$5.execute(SolrZkClient.java:244)
> [junit4:junit4]   2> 	at org.apache.solr.common.cloud.SolrZkClient$5.execute(SolrZkClient.java:241)
> [junit4:junit4]   2> 	at org.apache.solr.common.cloud.ZkCmdExecutor.retryOperation(ZkCmdExecutor.java:67)
> [junit4:junit4]   2> 	at org.apache.solr.common.cloud.SolrZkClient.create(SolrZkClient.java:241)
> [junit4:junit4]   2> 	at org.apache.solr.cloud.DistributedQueue.offer(DistributedQueue.java:236)
> [junit4:junit4]   2> 	at org.apache.solr.cloud.ZkController.publish(ZkController.java:740)
> [junit4:junit4]   2> 	at org.apache.solr.cloud.RecoveryStrategy.doRecovery(RecoveryStrategy.java:293)
> [junit4:junit4]   2> 	at org.apache.solr.cloud.RecoveryStrategy.run(RecoveryStrategy.java:211)
> [junit4:junit4]   2> 
> [junit4:junit4]   2> 211537 T570 C24 P61427 oasc.RecoveryStrategy.doRecovery SEVERE
Recovery failed - trying again...
> [junit4:junit4]   2> 227553 T570 C24 P61427 oasc.RecoveryStrategy.doRecovery SEVERE
Error while trying to recover. org.apache.zookeeper.KeeperException$SessionExpiredException:
KeeperErrorCode = Session expired for /overseer/queue/qn-
> [junit4:junit4]   2> 	at org.apache.zookeeper.KeeperException.create(KeeperException.java:118)
> [junit4:junit4]   2> 	at org.apache.zookeeper.KeeperException.create(KeeperException.java:42)
> [junit4:junit4]   2> 	at org.apache.zookeeper.ZooKeeper.create(ZooKeeper.java:643)
> [junit4:junit4]   2> 	at org.apache.solr.common.cloud.SolrZkClient$5.execute(SolrZkClient.java:244)
> [junit4:junit4]   2> 	at org.apache.solr.common.cloud.SolrZkClient$5.execute(SolrZkClient.java:241)
> [junit4:junit4]   2> 	at org.apache.solr.common.cloud.ZkCmdExecutor.retryOperation(ZkCmdExecutor.java:67)
> [junit4:junit4]   2> 	at org.apache.solr.common.cloud.SolrZkClient.create(SolrZkClient.java:241)
> [junit4:junit4]   2> 	at org.apache.solr.cloud.DistributedQueue.offer(DistributedQueue.java:236)
> [junit4:junit4]   2> 	at org.apache.solr.cloud.ZkController.publish(ZkController.java:740)
> [junit4:junit4]   2> 	at org.apache.solr.cloud.RecoveryStrategy.doRecovery(RecoveryStrategy.java:293)
> [junit4:junit4]   2> 	at org.apache.solr.cloud.RecoveryStrategy.run(RecoveryStrategy.java:211)
> [junit4:junit4]   2> 
> [junit4:junit4]   2> 227553 T570 C24 P61427 oasc.RecoveryStrategy.doRecovery SEVERE
Recovery failed - trying again...
> [junit4:junit4]   2> 259585 T570 C24 P61427 oasc.RecoveryStrategy.doRecovery SEVERE
Error while trying to recover. org.apache.zookeeper.KeeperException$SessionExpiredException:
KeeperErrorCode = Session expired for /overseer/queue/qn-
> [junit4:junit4]   2> 	at org.apache.zookeeper.KeeperException.create(KeeperException.java:118)
> [junit4:junit4]   2> 	at org.apache.zookeeper.KeeperException.create(KeeperException.java:42)
> [junit4:junit4]   2> 	at org.apache.zookeeper.ZooKeeper.create(ZooKeeper.java:643)
> [junit4:junit4]   2> 	at org.apache.solr.common.cloud.SolrZkClient$5.execute(SolrZkClient.java:244)
> [junit4:junit4]   2> 	at org.apache.solr.common.cloud.SolrZkClient$5.execute(SolrZkClient.java:241)
> [junit4:junit4]   2> 	at org.apache.solr.common.cloud.ZkCmdExecutor.retryOperation(ZkCmdExecutor.java:67)
> [junit4:junit4]   2> 	at org.apache.solr.common.cloud.SolrZkClient.create(SolrZkClient.java:241)
> [junit4:junit4]   2> 	at org.apache.solr.cloud.DistributedQueue.offer(DistributedQueue.java:236)
> [junit4:junit4]   2> 	at org.apache.solr.cloud.ZkController.publish(ZkController.java:740)
> [junit4:junit4]   2> 	at org.apache.solr.cloud.RecoveryStrategy.doRecovery(RecoveryStrategy.java:293)
> [junit4:junit4]   2> 	at org.apache.solr.cloud.RecoveryStrategy.run(RecoveryStrategy.java:211)
> [junit4:junit4]   2> 
> [junit4:junit4]   2> 259585 T570 C24 P61427 oasc.RecoveryStrategy.doRecovery SEVERE
Recovery failed - trying again...
> [junit4:junit4]   2> 274095 T225 oas.SolrTestCaseJ4.endTrackingSearchers SEVERE ERROR:
SolrIndexSearcher opens=1072 closes=1071
> [junit4:junit4]   2> NOTE: test params are: codec=Lucene3x, sim=RandomSimilarityProvider(queryNorm=false,coord=true):
{}, locale=zh_CN, timezone=SystemV/EST5EDT
> [junit4:junit4]   2> NOTE: FreeBSD 9.0-RELEASE amd64/Oracle Corporation 1.7.0_04 (64-bit)/cpus=16,threads=5,free=65924752,total=357564416
> [junit4:junit4]   2> NOTE: All tests run in this JVM: [PluginInfoTest, TestSurroundQueryParser,
PreAnalyzedFieldTest, TestRandomFaceting, CurrencyFieldTest, TestArbitraryIndexDir, ReturnFieldsTest,
QueryParsingTest, CacheHeaderTest, BasicDistributedZkTest]
> [junit4:junit4]   2> NOTE: reproduce with: ant test  -Dtestcase=BasicDistributedZkTest
-Dtests.seed=B27DB23B98F1349B -Dtests.multiplier=3 -Dtests.slow=true -Dtests.locale=zh_CN
-Dtests.timezone=SystemV/EST5EDT -Dtests.file.encoding=UTF-8
> [junit4:junit4]   2> 
> [junit4:junit4] ERROR   0.00s J0 | BasicDistributedZkTest (suite)
> [junit4:junit4]    > Throwable #1: java.lang.AssertionError: ERROR: SolrIndexSearcher
opens=1072 closes=1071
> [junit4:junit4]    > 	at __randomizedtesting.SeedInfo.seed([B27DB23B98F1349B]:0)
> [junit4:junit4]    > 	at org.junit.Assert.fail(Assert.java:93)
> [junit4:junit4]    > 	at org.apache.solr.SolrTestCaseJ4.endTrackingSearchers(SolrTestCaseJ4.java:216)
> [junit4:junit4]    > 	at org.apache.solr.SolrTestCaseJ4.afterClass(SolrTestCaseJ4.java:82)
> [junit4:junit4]    > 	at sun.reflect.NativeMethodAccessorImpl.invoke0(Native Method)
> [junit4:junit4]    > 	at sun.reflect.NativeMethodAccessorImpl.invoke(NativeMethodAccessorImpl.java:57)
> [junit4:junit4]    > 	at sun.reflect.DelegatingMethodAccessorImpl.invoke(DelegatingMethodAccessorImpl.java:43)
> [junit4:junit4]    > 	at java.lang.reflect.Method.invoke(Method.java:601)
> [junit4:junit4]    > 	at com.carrotsearch.randomizedtesting.RandomizedRunner.invoke(RandomizedRunner.java:1995)
> [junit4:junit4]    > 	at com.carrotsearch.randomizedtesting.RandomizedRunner.access$1100(RandomizedRunner.java:132)
> [junit4:junit4]    > 	at com.carrotsearch.randomizedtesting.RandomizedRunner$5.evaluate(RandomizedRunner.java:754)
> [junit4:junit4]    > 	at com.carrotsearch.randomizedtesting.rules.SystemPropertiesRestoreRule$1.evaluate(SystemPropertiesRestoreRule.java:53)
> [junit4:junit4]    > 	at org.apache.lucene.util.AbstractBeforeAfterRule$1.evaluate(AbstractBeforeAfterRule.java:45)
> [junit4:junit4]    > 	at org.apache.lucene.util.TestRuleReportUncaughtExceptions$1.evaluate(TestRuleReportUncaughtExceptions.java:68)
> [junit4:junit4]    > 	at org.apache.lucene.util.TestRuleStoreClassName$1.evaluate(TestRuleStoreClassName.java:38)
> [junit4:junit4]    > 	at com.carrotsearch.randomizedtesting.rules.SystemPropertiesInvariantRule$1.evaluate(SystemPropertiesInvariantRule.java:55)
> [junit4:junit4]    > 	at org.apache.lucene.util.TestRuleNoInstanceHooksOverrides$1.evaluate(TestRuleNoInstanceHooksOverrides.java:53)
> [junit4:junit4]    > 	at org.apache.lucene.util.TestRuleNoStaticHooksShadowing$1.evaluate(TestRuleNoStaticHooksShadowing.java:52)
> [junit4:junit4]    > 	at org.apache.lucene.util.TestRuleAssertionsRequired$1.evaluate(TestRuleAssertionsRequired.java:36)
> [junit4:junit4]    > 	at org.apache.lucene.util.TestRuleMarkFailure$1.evaluate(TestRuleMarkFailure.java:48)
> [junit4:junit4]    > 	at org.apache.lucene.util.TestRuleIgnoreAfterMaxFailures$1.evaluate(TestRuleIgnoreAfterMaxFailures.java:70)
> [junit4:junit4]    > 	at org.apache.lucene.util.TestRuleIgnoreTestSuites$1.evaluate(TestRuleIgnoreTestSuites.java:55)
> [junit4:junit4]    > 	at com.carrotsearch.randomizedtesting.RandomizedRunner.runSuite(RandomizedRunner.java:605)
> [junit4:junit4]    > 	at com.carrotsearch.randomizedtesting.RandomizedRunner.access$400(RandomizedRunner.java:132)
> [junit4:junit4]    > 	at com.carrotsearch.randomizedtesting.RandomizedRunner$2.run(RandomizedRunner.java:551)
> [junit4:junit4]    >
> [junit4:junit4] Completed on J0 in 274.17s, 1 test, 1 failure <<< FAILURES!
> 
> [...truncated 495 lines...]
> BUILD FAILED
> /usr/home/hudson/hudson-slave/workspace/Lucene-Solr-tests-only-4.x-java7/checkout/build.xml:29:
The following error occurred while executing this line:
> /usr/home/hudson/hudson-slave/workspace/Lucene-Solr-tests-only-4.x-java7/checkout/solr/build.xml:144:
The following error occurred while executing this line:
> /usr/home/hudson/hudson-slave/workspace/Lucene-Solr-tests-only-4.x-java7/checkout/lucene/module-build.xml:62:
The following error occurred while executing this line:
> /usr/home/hudson/hudson-slave/workspace/Lucene-Solr-tests-only-4.x-java7/checkout/lucene/common-build.xml:1095:
The following error occurred while executing this line:
> /usr/home/hudson/hudson-slave/workspace/Lucene-Solr-tests-only-4.x-java7/checkout/lucene/common-build.xml:790:
There were test failures: 224 suites, 902 tests, 1 suite-level error, 5 ignored
> 
> Total time: 27 minutes 13 seconds
> Build step 'Execute shell' marked build as failure
> Archiving artifacts
> Recording test results
> Email was triggered for: Failure
> Sending email for trigger: Failure
> 
> 
> 
> ---------------------------------------------------------------------
> To unsubscribe, e-mail: dev-unsubscribe@lucene.apache.org
> For additional commands, e-mail: dev-help@lucene.apache.org

- Mark Miller
lucidimagination.com












---------------------------------------------------------------------
To unsubscribe, e-mail: dev-unsubscribe@lucene.apache.org
For additional commands, e-mail: dev-help@lucene.apache.org


Mime
View raw message