lucene-dev mailing list archives

Site index · List index
Message view « Date » · « Thread »
Top « Date » · « Thread »
From Policeman Jenkins Server <jenk...@sd-datasolutions.de>
Subject [JENKINS] Lucene-Solr-4.x-Linux (32bit/jdk1.8.0-ea-b49) - Build # 139 - Failure!
Date Fri, 03 Aug 2012 18:18:27 GMT
Build: http://jenkins.sd-datasolutions.de/job/Lucene-Solr-4.x-Linux/139/
Java: 32bit/jdk1.8.0-ea-b49 -client -XX:+UseG1GC

1 tests failed.
REGRESSION:  org.apache.solr.handler.component.DistributedQueryElevationComponentTest.testDistribSearch

Error Message:
.responseHeader.params.size()==9,9skipped=5,4

Stack Trace:
junit.framework.AssertionFailedError: .responseHeader.params.size()==9,9skipped=5,4
	at __randomizedtesting.SeedInfo.seed([AAD1745D1A1F0C5B:2B37FA456D406C67]:0)
	at junit.framework.Assert.fail(Assert.java:50)
	at org.apache.solr.BaseDistributedSearchTestCase.compareResponses(BaseDistributedSearchTestCase.java:670)
	at org.apache.solr.BaseDistributedSearchTestCase.query(BaseDistributedSearchTestCase.java:392)
	at org.apache.solr.handler.component.DistributedQueryElevationComponentTest.doTest(DistributedQueryElevationComponentTest.java:81)
	at org.apache.solr.BaseDistributedSearchTestCase.testDistribSearch(BaseDistributedSearchTestCase.java:679)
	at sun.reflect.NativeMethodAccessorImpl.invoke0(Native Method)
	at sun.reflect.NativeMethodAccessorImpl.invoke(NativeMethodAccessorImpl.java:57)
	at sun.reflect.DelegatingMethodAccessorImpl.invoke(DelegatingMethodAccessorImpl.java:43)
	at java.lang.reflect.Method.invoke(Method.java:474)
	at com.carrotsearch.randomizedtesting.RandomizedRunner.invoke(RandomizedRunner.java:1995)
	at com.carrotsearch.randomizedtesting.RandomizedRunner.access$1100(RandomizedRunner.java:132)
	at com.carrotsearch.randomizedtesting.RandomizedRunner$6.evaluate(RandomizedRunner.java:818)
	at com.carrotsearch.randomizedtesting.RandomizedRunner$7.evaluate(RandomizedRunner.java:877)
	at com.carrotsearch.randomizedtesting.RandomizedRunner$8.evaluate(RandomizedRunner.java:891)
	at com.carrotsearch.randomizedtesting.rules.SystemPropertiesRestoreRule$1.evaluate(SystemPropertiesRestoreRule.java:53)
	at org.apache.lucene.util.TestRuleSetupTeardownChained$1.evaluate(TestRuleSetupTeardownChained.java:50)
	at org.apache.lucene.util.TestRuleFieldCacheSanity$1.evaluate(TestRuleFieldCacheSanity.java:32)
	at org.apache.lucene.util.AbstractBeforeAfterRule$1.evaluate(AbstractBeforeAfterRule.java:45)
	at com.carrotsearch.randomizedtesting.rules.SystemPropertiesInvariantRule$1.evaluate(SystemPropertiesInvariantRule.java:55)
	at org.apache.lucene.util.TestRuleReportUncaughtExceptions$1.evaluate(TestRuleReportUncaughtExceptions.java:68)
	at org.apache.lucene.util.TestRuleThreadAndTestName$1.evaluate(TestRuleThreadAndTestName.java:48)
	at org.apache.lucene.util.TestRuleIgnoreAfterMaxFailures$1.evaluate(TestRuleIgnoreAfterMaxFailures.java:70)
	at org.apache.lucene.util.TestRuleMarkFailure$1.evaluate(TestRuleMarkFailure.java:48)
	at com.carrotsearch.randomizedtesting.RandomizedRunner.runSingleTest(RandomizedRunner.java:825)
	at com.carrotsearch.randomizedtesting.RandomizedRunner.access$700(RandomizedRunner.java:132)
	at com.carrotsearch.randomizedtesting.RandomizedRunner$3$1.run(RandomizedRunner.java:671)
	at com.carrotsearch.randomizedtesting.RandomizedRunner$3.evaluate(RandomizedRunner.java:697)
	at com.carrotsearch.randomizedtesting.RandomizedRunner$4.evaluate(RandomizedRunner.java:736)
	at com.carrotsearch.randomizedtesting.RandomizedRunner$5.evaluate(RandomizedRunner.java:747)
	at com.carrotsearch.randomizedtesting.rules.SystemPropertiesRestoreRule$1.evaluate(SystemPropertiesRestoreRule.java:53)
	at org.apache.lucene.util.AbstractBeforeAfterRule$1.evaluate(AbstractBeforeAfterRule.java:45)
	at org.apache.lucene.util.TestRuleReportUncaughtExceptions$1.evaluate(TestRuleReportUncaughtExceptions.java:68)
	at org.apache.lucene.util.TestRuleStoreClassName$1.evaluate(TestRuleStoreClassName.java:38)
	at com.carrotsearch.randomizedtesting.rules.SystemPropertiesInvariantRule$1.evaluate(SystemPropertiesInvariantRule.java:55)
	at org.apache.lucene.util.TestRuleNoInstanceHooksOverrides$1.evaluate(TestRuleNoInstanceHooksOverrides.java:53)
	at org.apache.lucene.util.TestRuleNoStaticHooksShadowing$1.evaluate(TestRuleNoStaticHooksShadowing.java:52)
	at org.apache.lucene.util.TestRuleAssertionsRequired$1.evaluate(TestRuleAssertionsRequired.java:36)
	at org.apache.lucene.util.TestRuleMarkFailure$1.evaluate(TestRuleMarkFailure.java:48)
	at org.apache.lucene.util.TestRuleIgnoreAfterMaxFailures$1.evaluate(TestRuleIgnoreAfterMaxFailures.java:70)
	at org.apache.lucene.util.TestRuleIgnoreTestSuites$1.evaluate(TestRuleIgnoreTestSuites.java:55)
	at com.carrotsearch.randomizedtesting.RandomizedRunner.runSuite(RandomizedRunner.java:605)
	at com.carrotsearch.randomizedtesting.RandomizedRunner.access$400(RandomizedRunner.java:132)
	at com.carrotsearch.randomizedtesting.RandomizedRunner$2.run(RandomizedRunner.java:551)




Build Log:
[...truncated 7368 lines...]
[junit4:junit4] Suite: org.apache.solr.handler.component.DistributedQueryElevationComponentTest
[junit4:junit4] FAILURE 1.62s J1 | DistributedQueryElevationComponentTest.testDistribSearch
[junit4:junit4]    > Throwable #1: junit.framework.AssertionFailedError: .responseHeader.params.size()==9,9skipped=5,4
[junit4:junit4]    > 	at __randomizedtesting.SeedInfo.seed([AAD1745D1A1F0C5B:2B37FA456D406C67]:0)
[junit4:junit4]    > 	at junit.framework.Assert.fail(Assert.java:50)
[junit4:junit4]    > 	at org.apache.solr.BaseDistributedSearchTestCase.compareResponses(BaseDistributedSearchTestCase.java:670)
[junit4:junit4]    > 	at org.apache.solr.BaseDistributedSearchTestCase.query(BaseDistributedSearchTestCase.java:392)
[junit4:junit4]    > 	at org.apache.solr.handler.component.DistributedQueryElevationComponentTest.doTest(DistributedQueryElevationComponentTest.java:81)
[junit4:junit4]    > 	at org.apache.solr.BaseDistributedSearchTestCase.testDistribSearch(BaseDistributedSearchTestCase.java:679)
[junit4:junit4]    > 	at sun.reflect.NativeMethodAccessorImpl.invoke0(Native Method)
[junit4:junit4]    > 	at sun.reflect.NativeMethodAccessorImpl.invoke(NativeMethodAccessorImpl.java:57)
[junit4:junit4]    > 	at sun.reflect.DelegatingMethodAccessorImpl.invoke(DelegatingMethodAccessorImpl.java:43)
[junit4:junit4]    > 	at java.lang.reflect.Method.invoke(Method.java:474)
[junit4:junit4]    > 	at com.carrotsearch.randomizedtesting.RandomizedRunner.invoke(RandomizedRunner.java:1995)
[junit4:junit4]    > 	at com.carrotsearch.randomizedtesting.RandomizedRunner.access$1100(RandomizedRunner.java:132)
[junit4:junit4]    > 	at com.carrotsearch.randomizedtesting.RandomizedRunner$6.evaluate(RandomizedRunner.java:818)
[junit4:junit4]    > 	at com.carrotsearch.randomizedtesting.RandomizedRunner$7.evaluate(RandomizedRunner.java:877)
[junit4:junit4]    > 	at com.carrotsearch.randomizedtesting.RandomizedRunner$8.evaluate(RandomizedRunner.java:891)
[junit4:junit4]    > 	at com.carrotsearch.randomizedtesting.rules.SystemPropertiesRestoreRule$1.evaluate(SystemPropertiesRestoreRule.java:53)
[junit4:junit4]    > 	at org.apache.lucene.util.TestRuleSetupTeardownChained$1.evaluate(TestRuleSetupTeardownChained.java:50)
[junit4:junit4]    > 	at org.apache.lucene.util.TestRuleFieldCacheSanity$1.evaluate(TestRuleFieldCacheSanity.java:32)
[junit4:junit4]    > 	at org.apache.lucene.util.AbstractBeforeAfterRule$1.evaluate(AbstractBeforeAfterRule.java:45)
[junit4:junit4]    > 	at com.carrotsearch.randomizedtesting.rules.SystemPropertiesInvariantRule$1.evaluate(SystemPropertiesInvariantRule.java:55)
[junit4:junit4]    > 	at org.apache.lucene.util.TestRuleReportUncaughtExceptions$1.evaluate(TestRuleReportUncaughtExceptions.java:68)
[junit4:junit4]    > 	at org.apache.lucene.util.TestRuleThreadAndTestName$1.evaluate(TestRuleThreadAndTestName.java:48)
[junit4:junit4]    > 	at org.apache.lucene.util.TestRuleIgnoreAfterMaxFailures$1.evaluate(TestRuleIgnoreAfterMaxFailures.java:70)
[junit4:junit4]    > 	at org.apache.lucene.util.TestRuleMarkFailure$1.evaluate(TestRuleMarkFailure.java:48)
[junit4:junit4]    > 	at com.carrotsearch.randomizedtesting.RandomizedRunner.runSingleTest(RandomizedRunner.java:825)
[junit4:junit4]    > 	at com.carrotsearch.randomizedtesting.RandomizedRunner.access$700(RandomizedRunner.java:132)
[junit4:junit4]    > 	at com.carrotsearch.randomizedtesting.RandomizedRunner$3$1.run(RandomizedRunner.java:671)
[junit4:junit4]    > 	at com.carrotsearch.randomizedtesting.RandomizedRunner$3.evaluate(RandomizedRunner.java:697)
[junit4:junit4]    > 	at com.carrotsearch.randomizedtesting.RandomizedRunner$4.evaluate(RandomizedRunner.java:736)
[junit4:junit4]    > 	at com.carrotsearch.randomizedtesting.RandomizedRunner$5.evaluate(RandomizedRunner.java:747)
[junit4:junit4]    > 	at com.carrotsearch.randomizedtesting.rules.SystemPropertiesRestoreRule$1.evaluate(SystemPropertiesRestoreRule.java:53)
[junit4:junit4]    > 	at org.apache.lucene.util.AbstractBeforeAfterRule$1.evaluate(AbstractBeforeAfterRule.java:45)
[junit4:junit4]    > 	at org.apache.lucene.util.TestRuleReportUncaughtExceptions$1.evaluate(TestRuleReportUncaughtExceptions.java:68)
[junit4:junit4]    > 	at org.apache.lucene.util.TestRuleStoreClassName$1.evaluate(TestRuleStoreClassName.java:38)
[junit4:junit4]    > 	at com.carrotsearch.randomizedtesting.rules.SystemPropertiesInvariantRule$1.evaluate(SystemPropertiesInvariantRule.java:55)
[junit4:junit4]    > 	at org.apache.lucene.util.TestRuleNoInstanceHooksOverrides$1.evaluate(TestRuleNoInstanceHooksOverrides.java:53)
[junit4:junit4]    > 	at org.apache.lucene.util.TestRuleNoStaticHooksShadowing$1.evaluate(TestRuleNoStaticHooksShadowing.java:52)
[junit4:junit4]    > 	at org.apache.lucene.util.TestRuleAssertionsRequired$1.evaluate(TestRuleAssertionsRequired.java:36)
[junit4:junit4]    > 	at org.apache.lucene.util.TestRuleMarkFailure$1.evaluate(TestRuleMarkFailure.java:48)
[junit4:junit4]    > 	at org.apache.lucene.util.TestRuleIgnoreAfterMaxFailures$1.evaluate(TestRuleIgnoreAfterMaxFailures.java:70)
[junit4:junit4]    > 	at org.apache.lucene.util.TestRuleIgnoreTestSuites$1.evaluate(TestRuleIgnoreTestSuites.java:55)
[junit4:junit4]    > 	at com.carrotsearch.randomizedtesting.RandomizedRunner.runSuite(RandomizedRunner.java:605)
[junit4:junit4]    > 	at com.carrotsearch.randomizedtesting.RandomizedRunner.access$400(RandomizedRunner.java:132)
[junit4:junit4]    > 	at com.carrotsearch.randomizedtesting.RandomizedRunner$2.run(RandomizedRunner.java:551)
[junit4:junit4]    > 
[junit4:junit4]   2> 1 T1000 oas.SolrTestCaseJ4.setUp ###Starting testDistribSearch
[junit4:junit4]   2> 2 T1000 oejs.Server.doStart jetty-8.1.2.v20120308
[junit4:junit4]   2> 5 T1000 oejs.AbstractConnector.doStart Started SocketConnector@0.0.0.0:38704
[junit4:junit4]   2> 5 T1000 oasc.SolrResourceLoader.locateSolrHome JNDI not configured for solr (NoInitialContextEx)
[junit4:junit4]   2> 6 T1000 oasc.SolrResourceLoader.locateSolrHome using system property solr.solr.home: /mnt/ssd/jenkins/workspace/Lucene-Solr-4.x-Linux/checkout/solr/build/solr-core/test-files/solr
[junit4:junit4]   2> 6 T1000 oasc.SolrResourceLoader.<init> new SolrResourceLoader for deduced Solr Home: '/mnt/ssd/jenkins/workspace/Lucene-Solr-4.x-Linux/checkout/solr/build/solr-core/test-files/solr/'
[junit4:junit4]   2> 13 T1000 oass.SolrDispatchFilter.init SolrDispatchFilter.init()
[junit4:junit4]   2> 14 T1000 oasc.SolrResourceLoader.locateSolrHome JNDI not configured for solr (NoInitialContextEx)
[junit4:junit4]   2> 14 T1000 oasc.SolrResourceLoader.locateSolrHome using system property solr.solr.home: /mnt/ssd/jenkins/workspace/Lucene-Solr-4.x-Linux/checkout/solr/build/solr-core/test-files/solr
[junit4:junit4]   2> 14 T1000 oasc.CoreContainer$Initializer.initialize looking for solr.xml: /mnt/ssd/jenkins/workspace/Lucene-Solr-4.x-Linux/checkout/solr/build/solr-core/test-files/solr/solr.xml
[junit4:junit4]   2> 14 T1000 oasc.CoreContainer.<init> New CoreContainer 10661892
[junit4:junit4]   2> 15 T1000 oasc.CoreContainer.load Loading CoreContainer using Solr Home: '/mnt/ssd/jenkins/workspace/Lucene-Solr-4.x-Linux/checkout/solr/build/solr-core/test-files/solr/'
[junit4:junit4]   2> 15 T1000 oasc.SolrResourceLoader.<init> new SolrResourceLoader for directory: '/mnt/ssd/jenkins/workspace/Lucene-Solr-4.x-Linux/checkout/solr/build/solr-core/test-files/solr/'
[junit4:junit4]   2> 25 T1000 oasc.CoreContainer.load Registering Log Listener
[junit4:junit4]   2> 37 T1000 oasc.CoreContainer.create Creating SolrCore 'collection1' using instanceDir: /mnt/ssd/jenkins/workspace/Lucene-Solr-4.x-Linux/checkout/solr/build/solr-core/test-files/solr/collection1
[junit4:junit4]   2> 37 T1000 oasc.SolrResourceLoader.<init> new SolrResourceLoader for directory: '/mnt/ssd/jenkins/workspace/Lucene-Solr-4.x-Linux/checkout/solr/build/solr-core/test-files/solr/collection1/'
[junit4:junit4]   2> 38 T1000 oasc.SolrResourceLoader.replaceClassLoader Adding 'file:/mnt/ssd/jenkins/workspace/Lucene-Solr-4.x-Linux/checkout/solr/build/solr-core/test-files/solr/collection1/lib/README' to classloader
[junit4:junit4]   2> 38 T1000 oasc.SolrResourceLoader.replaceClassLoader Adding 'file:/mnt/ssd/jenkins/workspace/Lucene-Solr-4.x-Linux/checkout/solr/build/solr-core/test-files/solr/collection1/lib/classes/' to classloader
[junit4:junit4]   2> 61 T1000 oasc.SolrConfig.<init> Using Lucene MatchVersion: LUCENE_40
[junit4:junit4]   2> 100 T1000 oasc.SolrConfig.<init> Loaded SolrConfig: solrconfig-elevate.xml
[junit4:junit4]   2> 100 T1000 oass.IndexSchema.readSchema Reading Solr Schema
[junit4:junit4]   2> 103 T1000 oass.IndexSchema.readSchema Schema name=example
[junit4:junit4]   2> 273 T1000 oass.IndexSchema.readSchema default search field in schema is text
[junit4:junit4]   2> 276 T1000 oass.IndexSchema.readSchema unique key field: id
[junit4:junit4]   2> 278 T1000 oasc.SolrCore.<init> [collection1] Opening new SolrCore at /mnt/ssd/jenkins/workspace/Lucene-Solr-4.x-Linux/checkout/solr/build/solr-core/test-files/solr/collection1/, dataDir=./org.apache.solr.handler.component.DistributedQueryElevationComponentTest-1344017629031/control/data/
[junit4:junit4]   2> 279 T1000 oasc.JmxMonitoredMap.<init> JMX monitoring is enabled. Adding Solr mbeans to JMX Server: com.sun.jmx.mbeanserver.JmxMBeanServer@2c0ca2
[junit4:junit4]   2> 279 T1000 oasc.SolrCore.getNewIndexDir WARNING New index directory detected: old=null new=./org.apache.solr.handler.component.DistributedQueryElevationComponentTest-1344017629031/control/data/index/
[junit4:junit4]   2> 279 T1000 oasc.SolrCore.initIndex WARNING [collection1] Solr index directory './org.apache.solr.handler.component.DistributedQueryElevationComponentTest-1344017629031/control/data/index' doesn't exist. Creating new index...
[junit4:junit4]   2> 280 T1000 oasc.SolrDeletionPolicy.onCommit SolrDeletionPolicy.onCommit: commits:num=1
[junit4:junit4]   2> 		commit{dir=MockDirWrapper(org.apache.lucene.store.RAMDirectory@fe8ef5 lockFactory=org.apache.lucene.store.SingleInstanceLockFactory@1471ba9),segFN=segments_1,generation=1,filenames=[segments_1]
[junit4:junit4]   2> 281 T1000 oasc.SolrDeletionPolicy.updateCommits newest commit = 1
[junit4:junit4]   2> 282 T1000 oasc.RequestHandlers.initHandlersFromConfig created /update: solr.UpdateRequestHandler
[junit4:junit4]   2> 282 T1000 oasc.RequestHandlers.initHandlersFromConfig created /elevate: org.apache.solr.handler.component.SearchHandler
[junit4:junit4]   2> 283 T1000 oasc.RequestHandlers.initHandlersFromConfig created /dataElevate: org.apache.solr.handler.component.SearchHandler
[junit4:junit4]   2> 283 T1000 oashl.XMLLoader.init xsltCacheLifetimeSeconds=60
[junit4:junit4]   2> 283 T1000 oasc.RequestHandlers.initHandlersFromConfig WARNING no default request handler is registered (either '/select' or 'standard')
[junit4:junit4]   2> 285 T1000 oasc.SolrCore.initDeprecatedSupport WARNING solrconfig.xml uses deprecated <admin/gettableFiles>, Please update your config to use the ShowFileRequestHandler.
[junit4:junit4]   2> 285 T1000 oasc.SolrCore.initDeprecatedSupport WARNING adding ShowFileRequestHandler with hidden files: [SCHEMA-PHRASESUGGEST.XML, SCHEMA-REQUIRED-FIELDS.XML, SCHEMA.XML, BAD-SCHEMA-SIM-GLOBAL-VS-FT-MISMATCH.XML, PHRASESUGGEST.TXT, SCHEMA-IB.XML, BAD-SOLRCONFIG-MISSING-SCRIPTFILE.XML, SCHEMA12.XML, SOLRCONFIG-QUERYSENDER.XML, STOPTYPES-2.TXT, SOLRCONFIG-TLOG.XML, BAD-SCHEMA-UNIQUEKEY-MULTIVALUED.XML, COMPOUNDDICTIONARY.TXT, SOLRCONFIG-PROPINJECT.XML, STOPTYPES-1.TXT, SOLRCONFIG-SPELLCHECKER.XML, SCHEMA-LMDIRICHLET.XML, SOLRCONFIG_CODEC.XML, SCHEMA-LMJELINEKMERCER.XML, STOP-2.TXT, SCHEMA-CHARFILTERS.XML, SOLRCONFIG-UPDATE-PROCESSOR-CHAINS.XML, SOLRCONFIG-LAZYWRITER.XML, SOLRCONFIG-PHRASESUGGEST.XML, BAD-SCHEMA-CODEC-GLOBAL-VS-FT-MISMATCH.XML, SCHEMA-SPELLCHECKER.XML, OLD_SYNONYMS.TXT, SOLRCONFIG-DELPOLICY2.XML, SOLRCONFIG-MASTER1-KEEPONEBACKUP.XML, SOLRCONFIG-BASIC.XML, HUNSPELL-TEST.DIC, SOLRCONFIG-NOCACHE.XML, SOLRCONFIG-TRANSFORMERS.XML, SOLRCONFIG-SOLCOREPROPERTIES.XML, SOLRCONFIG-MERGEPOLICY.XML, SOLRCONFIG-SLAVE.XML, SCHEMA-STOP-KEEP.XML, SOLRCONFIG-SOLR-749.XML, SCHEMA_CODEC.XML, SCHEMA15.XML, BAD-SCHEMA-UNIQUEKEY-USES-DEFAULT.XML, SOLRCONFIG-ENABLEPLUGIN.XML, SOLRCONFIG-CACHING.XML, BAD-SCHEMA-ANALYZER-CLASS-AND-NESTED.XML, SOLRCONFIG-MASTER.XML, SOLRCONFIG-QUERYSENDER-NOQUERY.XML, CURRENCY.XML, BAD-SCHEMA-DUP-FIELD.XML, SCHEMA-BINARYFIELD.XML, SOLRCONFIG-REQHANDLER.INCL, ADDFIELDS.UPDATEPROCESSOR.JS, SCHEMA-SIM.XML, SCHEMA-BM25.XML, TRIVIAL.UPDATEPROCESSOR1.JS, SOLRCONFIG-MASTER1.XML, SCHEMA-FOLDING.XML, BAD-SCHEMA-EXTERNAL-FILEFIELD.XML, SOLRCONFIG-NATIVELOCK.XML, SOLRCONFIG-ALTDIRECTORY.XML, SCHEMA-REPLICATION1.XML, SCHEMA11.XML, BAD-SOLRCONFIG-BOGUS-SCRIPTENGINE-NAME.XML, OPEN-EXCHANGE-RATES.JSON, BAD-SOLRCONFIG-INVALID-SCRIPTFILE.XML, SOLRCONFIG-SPELLCHECKCOMPONENT.XML, SOLRCONFIG-XINCLUDE.XML, WDFTYPES.TXT, SCHEMA-LUCENEMATCHVERSION.XML, BAD-SCHEMA-DUP-FIELDTYPE.XML, DA_UTF8.XML, SCHEMA-REVERSED.XML, BAD-SCHEMA-UNIQUEKEY-IS-COPYFIELD-DEST.XML, STOPWORDSWRONGENCODING.TXT, SOLRCONFIG-SLAVE1.XML, BAD-SCHEMA-NOT-INDEXED-BUT-TF.XML, SCHEMA-TFIDF.XML, HUNSPELL-TEST.AFF, SCHEMA-TRIE.XML, STOPWITHBOM.TXT, SOLRCONFIG-SIMPLELOCK.XML, SCHEMA-NUMERIC.XML, SCHEMA-MINIMAL.XML, HYPHENATION.DTD, SOLRCONFIG-DELPOLICY1.XML, SCHEMA-DFR.XML, MISSING.FUNCTIONS.UPDATEPROCESSOR.JS, SYNONYMS.TXT, SCHEMASURROUND.XML, FRENCHARTICLES.TXT, XSLT, STEMDICT.TXT, ELEVATE.XML, SOLRCONFIG-PROPINJECT-INDEXDEFAULT.XML, SOLRCONFIG-ELEVATE.XML, SOLRCONFIG-MASTER3.XML, BAD-SCHEMA-NOT-INDEXED-BUT-POS.XML, SCHEMA-NOT-REQUIRED-UNIQUE-KEY.XML, SCHEMA-COLLATE.XML, KEEP-1.TXT, SOLRCONFIG-REPEATER.XML, CONDITIONAL.UPDATEPROCESSOR.JS, SOLRCONFIG-SCRIPT-UPDATEPROCESSOR.XML, SOLRCONFIG-HIGHLIGHT.XML, THROW.ERROR.ON.ADD.UPDATEPROCESSOR.JS, STOP-1.TXT, PROTWORDS.TXT, BAD-SCHEMA-OMIT-TF-BUT-NOT-POS.XML, SOLRCONFIG-TERMINDEX.XML, BAD-SCHEMA-NOT-INDEXED-BUT-NORMS.XML, SOLRCONFIG_PERF.XML, DA_COMPOUNDDICTIONARY.TXT, STOP-SNOWBALL.TXT, SCHEMA-COLLATEFILTER.XML, SOLRCONFIG-BASIC-LUCENEVERSION31.XML, SOLRCONFIG-FUNCTIONQUERY.XML, SCHEMA-REPLICATION2.XML, STOPWORDS.TXT, MAPPING-ISOLATIN1ACCENT.TXT, BAD_SOLRCONFIG.XML, MISSLEADING.EXTENSION.UPDATEPROCESSOR.JS.TXT, BAD-SCHEMA-NONTEXT-ANALYZER.XML, SCHEMA-COPYFIELD-TEST.XML, TRIVIAL.UPDATEPROCESSOR0.JS, SOLRCONFIG-MASTER2.XML, BAD-MP-SOLRCONFIG.XML, KEEP-2.TXT, BAD-SCHEMA-DUP-DYNAMICFIELD.XML]
[junit4:junit4]   2> 288 T1000 oass.SolrIndexSearcher.<init> Opening Searcher@1253ffb main
[junit4:junit4]   2> 288 T1000 oass.SolrIndexSearcher.getIndexDir WARNING WARNING: Directory impl does not support setting indexDir: org.apache.lucene.store.MockDirectoryWrapper
[junit4:junit4]   2> 289 T1000 oasu.CommitTracker.<init> Hard AutoCommit: disabled
[junit4:junit4]   2> 289 T1000 oasu.CommitTracker.<init> Soft AutoCommit: disabled
[junit4:junit4]   2> 289 T1000 oashc.QueryElevationComponent.inform Loading QueryElevation from: /mnt/ssd/jenkins/workspace/Lucene-Solr-4.x-Linux/checkout/solr/build/solr-core/test-files/solr/collection1/conf/elevate.xml
[junit4:junit4]   2> 296 T1000 oashc.QueryElevationComponent.inform Loading QueryElevation from: /mnt/ssd/jenkins/workspace/Lucene-Solr-4.x-Linux/checkout/solr/build/solr-core/test-files/solr/collection1/conf/elevate.xml
[junit4:junit4]   2> 304 T1000 oashc.HttpShardHandlerFactory.getParameter Setting socketTimeout to: 0
[junit4:junit4]   2> 304 T1000 oashc.HttpShardHandlerFactory.getParameter Setting urlScheme to: http://
[junit4:junit4]   2> 305 T1000 oashc.HttpShardHandlerFactory.getParameter Setting connTimeout to: 0
[junit4:junit4]   2> 305 T1000 oashc.HttpShardHandlerFactory.getParameter Setting maxConnectionsPerHost to: 20
[junit4:junit4]   2> 305 T1000 oashc.HttpShardHandlerFactory.getParameter Setting corePoolSize to: 0
[junit4:junit4]   2> 305 T1000 oashc.HttpShardHandlerFactory.getParameter Setting maximumPoolSize to: 2147483647
[junit4:junit4]   2> 306 T1000 oashc.HttpShardHandlerFactory.getParameter Setting maxThreadIdleTime to: 5
[junit4:junit4]   2> 306 T1000 oashc.HttpShardHandlerFactory.getParameter Setting sizeOfQueue to: -1
[junit4:junit4]   2> 306 T1000 oashc.HttpShardHandlerFactory.getParameter Setting fairnessPolicy to: false
[junit4:junit4]   2> 306 T1000 oascsi.HttpClientUtil.createClient Creating new http client, config:maxConnectionsPerHost=20&maxConnections=10000&socketTimeout=0&connTimeout=0&retry=false
[junit4:junit4]   2> 309 T1010 oasc.SolrCore.registerSearcher [collection1] Registered new searcher Searcher@1253ffb main{StandardDirectoryReader(segments_1:1)}
[junit4:junit4]   2> 309 T1000 oasc.CoreContainer.register registering core: collection1
[junit4:junit4]   2> 310 T1000 oass.SolrDispatchFilter.init user.dir=/mnt/ssd/jenkins/workspace/Lucene-Solr-4.x-Linux/checkout/solr/build/solr-core/test/J1
[junit4:junit4]   2> 310 T1000 oass.SolrDispatchFilter.init SolrDispatchFilter.init() done
[junit4:junit4]   2> 311 T1000 oascsi.HttpClientUtil.createClient Creating new http client, config:maxConnections=128&maxConnectionsPerHost=32&followRedirects=false
[junit4:junit4]   2> 313 T1000 oejs.Server.doStart jetty-8.1.2.v20120308
[junit4:junit4]   2> 314 T1000 oejs.AbstractConnector.doStart Started SocketConnector@0.0.0.0:34183
[junit4:junit4]   2> 315 T1000 oasc.SolrResourceLoader.locateSolrHome JNDI not configured for solr (NoInitialContextEx)
[junit4:junit4]   2> 315 T1000 oasc.SolrResourceLoader.locateSolrHome using system property solr.solr.home: /mnt/ssd/jenkins/workspace/Lucene-Solr-4.x-Linux/checkout/solr/build/solr-core/test-files/solr
[junit4:junit4]   2> 315 T1000 oasc.SolrResourceLoader.<init> new SolrResourceLoader for deduced Solr Home: '/mnt/ssd/jenkins/workspace/Lucene-Solr-4.x-Linux/checkout/solr/build/solr-core/test-files/solr/'
[junit4:junit4]   2> 323 T1000 oass.SolrDispatchFilter.init SolrDispatchFilter.init()
[junit4:junit4]   2> 323 T1000 oasc.SolrResourceLoader.locateSolrHome JNDI not configured for solr (NoInitialContextEx)
[junit4:junit4]   2> 324 T1000 oasc.SolrResourceLoader.locateSolrHome using system property solr.solr.home: /mnt/ssd/jenkins/workspace/Lucene-Solr-4.x-Linux/checkout/solr/build/solr-core/test-files/solr
[junit4:junit4]   2> 324 T1000 oasc.CoreContainer$Initializer.initialize looking for solr.xml: /mnt/ssd/jenkins/workspace/Lucene-Solr-4.x-Linux/checkout/solr/build/solr-core/test-files/solr/solr.xml
[junit4:junit4]   2> 324 T1000 oasc.CoreContainer.<init> New CoreContainer 1317988
[junit4:junit4]   2> 324 T1000 oasc.CoreContainer.load Loading CoreContainer using Solr Home: '/mnt/ssd/jenkins/workspace/Lucene-Solr-4.x-Linux/checkout/solr/build/solr-core/test-files/solr/'
[junit4:junit4]   2> 325 T1000 oasc.SolrResourceLoader.<init> new SolrResourceLoader for directory: '/mnt/ssd/jenkins/workspace/Lucene-Solr-4.x-Linux/checkout/solr/build/solr-core/test-files/solr/'
[junit4:junit4]   2> 335 T1000 oasc.CoreContainer.load Registering Log Listener
[junit4:junit4]   2> 348 T1000 oasc.CoreContainer.create Creating SolrCore 'collection1' using instanceDir: /mnt/ssd/jenkins/workspace/Lucene-Solr-4.x-Linux/checkout/solr/build/solr-core/test-files/solr/collection1
[junit4:junit4]   2> 348 T1000 oasc.SolrResourceLoader.<init> new SolrResourceLoader for directory: '/mnt/ssd/jenkins/workspace/Lucene-Solr-4.x-Linux/checkout/solr/build/solr-core/test-files/solr/collection1/'
[junit4:junit4]   2> 349 T1000 oasc.SolrResourceLoader.replaceClassLoader Adding 'file:/mnt/ssd/jenkins/workspace/Lucene-Solr-4.x-Linux/checkout/solr/build/solr-core/test-files/solr/collection1/lib/README' to classloader
[junit4:junit4]   2> 349 T1000 oasc.SolrResourceLoader.replaceClassLoader Adding 'file:/mnt/ssd/jenkins/workspace/Lucene-Solr-4.x-Linux/checkout/solr/build/solr-core/test-files/solr/collection1/lib/classes/' to classloader
[junit4:junit4]   2> 373 T1000 oasc.SolrConfig.<init> Using Lucene MatchVersion: LUCENE_40
[junit4:junit4]   2> 412 T1000 oasc.SolrConfig.<init> Loaded SolrConfig: solrconfig-elevate.xml
[junit4:junit4]   2> 412 T1000 oass.IndexSchema.readSchema Reading Solr Schema
[junit4:junit4]   2> 415 T1000 oass.IndexSchema.readSchema Schema name=example
[junit4:junit4]   2> 591 T1000 oass.IndexSchema.readSchema default search field in schema is text
[junit4:junit4]   2> 593 T1000 oass.IndexSchema.readSchema unique key field: id
[junit4:junit4]   2> 596 T1000 oasc.SolrCore.<init> [collection1] Opening new SolrCore at /mnt/ssd/jenkins/workspace/Lucene-Solr-4.x-Linux/checkout/solr/build/solr-core/test-files/solr/collection1/, dataDir=./org.apache.solr.handler.component.DistributedQueryElevationComponentTest-1344017629031/shard0/data/
[junit4:junit4]   2> 596 T1000 oasc.JmxMonitoredMap.<init> JMX monitoring is enabled. Adding Solr mbeans to JMX Server: com.sun.jmx.mbeanserver.JmxMBeanServer@2c0ca2
[junit4:junit4]   2> 597 T1000 oasc.SolrCore.getNewIndexDir WARNING New index directory detected: old=null new=./org.apache.solr.handler.component.DistributedQueryElevationComponentTest-1344017629031/shard0/data/index/
[junit4:junit4]   2> 597 T1000 oasc.SolrCore.initIndex WARNING [collection1] Solr index directory './org.apache.solr.handler.component.DistributedQueryElevationComponentTest-1344017629031/shard0/data/index' doesn't exist. Creating new index...
[junit4:junit4]   2> 598 T1000 oasc.SolrDeletionPolicy.onCommit SolrDeletionPolicy.onCommit: commits:num=1
[junit4:junit4]   2> 		commit{dir=MockDirWrapper(org.apache.lucene.store.RAMDirectory@1086981 lockFactory=org.apache.lucene.store.SingleInstanceLockFactory@290df4),segFN=segments_1,generation=1,filenames=[segments_1]
[junit4:junit4]   2> 599 T1000 oasc.SolrDeletionPolicy.updateCommits newest commit = 1
[junit4:junit4]   2> 600 T1000 oasc.RequestHandlers.initHandlersFromConfig created /update: solr.UpdateRequestHandler
[junit4:junit4]   2> 600 T1000 oasc.RequestHandlers.initHandlersFromConfig created /elevate: org.apache.solr.handler.component.SearchHandler
[junit4:junit4]   2> 601 T1000 oasc.RequestHandlers.initHandlersFromConfig created /dataElevate: org.apache.solr.handler.component.SearchHandler
[junit4:junit4]   2> 601 T1000 oashl.XMLLoader.init xsltCacheLifetimeSeconds=60
[junit4:junit4]   2> 601 T1000 oasc.RequestHandlers.initHandlersFromConfig WARNING no default request handler is registered (either '/select' or 'standard')
[junit4:junit4]   2> 603 T1000 oasc.SolrCore.initDeprecatedSupport WARNING solrconfig.xml uses deprecated <admin/gettableFiles>, Please update your config to use the ShowFileRequestHandler.
[junit4:junit4]   2> 604 T1000 oasc.SolrCore.initDeprecatedSupport WARNING adding ShowFileRequestHandler with hidden files: [SCHEMA-PHRASESUGGEST.XML, SCHEMA-REQUIRED-FIELDS.XML, SCHEMA.XML, BAD-SCHEMA-SIM-GLOBAL-VS-FT-MISMATCH.XML, PHRASESUGGEST.TXT, SCHEMA-IB.XML, BAD-SOLRCONFIG-MISSING-SCRIPTFILE.XML, SCHEMA12.XML, SOLRCONFIG-QUERYSENDER.XML, STOPTYPES-2.TXT, SOLRCONFIG-TLOG.XML, BAD-SCHEMA-UNIQUEKEY-MULTIVALUED.XML, COMPOUNDDICTIONARY.TXT, SOLRCONFIG-PROPINJECT.XML, STOPTYPES-1.TXT, SOLRCONFIG-SPELLCHECKER.XML, SCHEMA-LMDIRICHLET.XML, SOLRCONFIG_CODEC.XML, SCHEMA-LMJELINEKMERCER.XML, STOP-2.TXT, SCHEMA-CHARFILTERS.XML, SOLRCONFIG-UPDATE-PROCESSOR-CHAINS.XML, SOLRCONFIG-LAZYWRITER.XML, SOLRCONFIG-PHRASESUGGEST.XML, BAD-SCHEMA-CODEC-GLOBAL-VS-FT-MISMATCH.XML, SCHEMA-SPELLCHECKER.XML, OLD_SYNONYMS.TXT, SOLRCONFIG-DELPOLICY2.XML, SOLRCONFIG-MASTER1-KEEPONEBACKUP.XML, SOLRCONFIG-BASIC.XML, HUNSPELL-TEST.DIC, SOLRCONFIG-NOCACHE.XML, SOLRCONFIG-TRANSFORMERS.XML, SOLRCONFIG-SOLCOREPROPERTIES.XML, SOLRCONFIG-MERGEPOLICY.XML, SOLRCONFIG-SLAVE.XML, SCHEMA-STOP-KEEP.XML, SOLRCONFIG-SOLR-749.XML, SCHEMA_CODEC.XML, SCHEMA15.XML, BAD-SCHEMA-UNIQUEKEY-USES-DEFAULT.XML, SOLRCONFIG-ENABLEPLUGIN.XML, SOLRCONFIG-CACHING.XML, BAD-SCHEMA-ANALYZER-CLASS-AND-NESTED.XML, SOLRCONFIG-MASTER.XML, SOLRCONFIG-QUERYSENDER-NOQUERY.XML, CURRENCY.XML, BAD-SCHEMA-DUP-FIELD.XML, SCHEMA-BINARYFIELD.XML, SOLRCONFIG-REQHANDLER.INCL, ADDFIELDS.UPDATEPROCESSOR.JS, SCHEMA-SIM.XML, SCHEMA-BM25.XML, TRIVIAL.UPDATEPROCESSOR1.JS, SOLRCONFIG-MASTER1.XML, SCHEMA-FOLDING.XML, BAD-SCHEMA-EXTERNAL-FILEFIELD.XML, SOLRCONFIG-NATIVELOCK.XML, SOLRCONFIG-ALTDIRECTORY.XML, SCHEMA-REPLICATION1.XML, SCHEMA11.XML, BAD-SOLRCONFIG-BOGUS-SCRIPTENGINE-NAME.XML, OPEN-EXCHANGE-RATES.JSON, BAD-SOLRCONFIG-INVALID-SCRIPTFILE.XML, SOLRCONFIG-SPELLCHECKCOMPONENT.XML, SOLRCONFIG-XINCLUDE.XML, WDFTYPES.TXT, SCHEMA-LUCENEMATCHVERSION.XML, BAD-SCHEMA-DUP-FIELDTYPE.XML, DA_UTF8.XML, SCHEMA-REVERSED.XML, BAD-SCHEMA-UNIQUEKEY-IS-COPYFIELD-DEST.XML, STOPWORDSWRONGENCODING.TXT, SOLRCONFIG-SLAVE1.XML, BAD-SCHEMA-NOT-INDEXED-BUT-TF.XML, SCHEMA-TFIDF.XML, HUNSPELL-TEST.AFF, SCHEMA-TRIE.XML, STOPWITHBOM.TXT, SOLRCONFIG-SIMPLELOCK.XML, SCHEMA-NUMERIC.XML, SCHEMA-MINIMAL.XML, HYPHENATION.DTD, SOLRCONFIG-DELPOLICY1.XML, SCHEMA-DFR.XML, MISSING.FUNCTIONS.UPDATEPROCESSOR.JS, SYNONYMS.TXT, SCHEMASURROUND.XML, FRENCHARTICLES.TXT, XSLT, STEMDICT.TXT, ELEVATE.XML, SOLRCONFIG-PROPINJECT-INDEXDEFAULT.XML, SOLRCONFIG-ELEVATE.XML, SOLRCONFIG-MASTER3.XML, BAD-SCHEMA-NOT-INDEXED-BUT-POS.XML, SCHEMA-NOT-REQUIRED-UNIQUE-KEY.XML, SCHEMA-COLLATE.XML, KEEP-1.TXT, SOLRCONFIG-REPEATER.XML, CONDITIONAL.UPDATEPROCESSOR.JS, SOLRCONFIG-SCRIPT-UPDATEPROCESSOR.XML, SOLRCONFIG-HIGHLIGHT.XML, THROW.ERROR.ON.ADD.UPDATEPROCESSOR.JS, STOP-1.TXT, PROTWORDS.TXT, BAD-SCHEMA-OMIT-TF-BUT-NOT-POS.XML, SOLRCONFIG-TERMINDEX.XML, BAD-SCHEMA-NOT-INDEXED-BUT-NORMS.XML, SOLRCONFIG_PERF.XML, DA_COMPOUNDDICTIONARY.TXT, STOP-SNOWBALL.TXT, SCHEMA-COLLATEFILTER.XML, SOLRCONFIG-BASIC-LUCENEVERSION31.XML, SOLRCONFIG-FUNCTIONQUERY.XML, SCHEMA-REPLICATION2.XML, STOPWORDS.TXT, MAPPING-ISOLATIN1ACCENT.TXT, BAD_SOLRCONFIG.XML, MISSLEADING.EXTENSION.UPDATEPROCESSOR.JS.TXT, BAD-SCHEMA-NONTEXT-ANALYZER.XML, SCHEMA-COPYFIELD-TEST.XML, TRIVIAL.UPDATEPROCESSOR0.JS, SOLRCONFIG-MASTER2.XML, BAD-MP-SOLRCONFIG.XML, KEEP-2.TXT, BAD-SCHEMA-DUP-DYNAMICFIELD.XML]
[junit4:junit4]   2> 606 T1000 oass.SolrIndexSearcher.<init> Opening Searcher@1c5281e main
[junit4:junit4]   2> 606 T1000 oass.SolrIndexSearcher.getIndexDir WARNING WARNING: Directory impl does not support setting indexDir: org.apache.lucene.store.MockDirectoryWrapper
[junit4:junit4]   2> 607 T1000 oasu.CommitTracker.<init> Hard AutoCommit: disabled
[junit4:junit4]   2> 607 T1000 oasu.CommitTracker.<init> Soft AutoCommit: disabled
[junit4:junit4]   2> 607 T1000 oashc.QueryElevationComponent.inform Loading QueryElevation from: /mnt/ssd/jenkins/workspace/Lucene-Solr-4.x-Linux/checkout/solr/build/solr-core/test-files/solr/collection1/conf/elevate.xml
[junit4:junit4]   2> 615 T1000 oashc.QueryElevationComponent.inform Loading QueryElevation from: /mnt/ssd/jenkins/workspace/Lucene-Solr-4.x-Linux/checkout/solr/build/solr-core/test-files/solr/collection1/conf/elevate.xml
[junit4:junit4]   2> 623 T1000 oashc.HttpShardHandlerFactory.getParameter Setting socketTimeout to: 0
[junit4:junit4]   2> 623 T1000 oashc.HttpShardHandlerFactory.getParameter Setting urlScheme to: http://
[junit4:junit4]   2> 623 T1000 oashc.HttpShardHandlerFactory.getParameter Setting connTimeout to: 0
[junit4:junit4]   2> 624 T1000 oashc.HttpShardHandlerFactory.getParameter Setting maxConnectionsPerHost to: 20
[junit4:junit4]   2> 624 T1000 oashc.HttpShardHandlerFactory.getParameter Setting corePoolSize to: 0
[junit4:junit4]   2> 624 T1000 oashc.HttpShardHandlerFactory.getParameter Setting maximumPoolSize to: 2147483647
[junit4:junit4]   2> 625 T1000 oashc.HttpShardHandlerFactory.getParameter Setting maxThreadIdleTime to: 5
[junit4:junit4]   2> 625 T1000 oashc.HttpShardHandlerFactory.getParameter Setting sizeOfQueue to: -1
[junit4:junit4]   2> 625 T1000 oashc.HttpShardHandlerFactory.getParameter Setting fairnessPolicy to: false
[junit4:junit4]   2> 625 T1000 oascsi.HttpClientUtil.createClient Creating new http client, config:maxConnectionsPerHost=20&maxConnections=10000&socketTimeout=0&connTimeout=0&retry=false
[junit4:junit4]   2> 628 T1020 oasc.SolrCore.registerSearcher [collection1] Registered new searcher Searcher@1c5281e main{StandardDirectoryReader(segments_1:1)}
[junit4:junit4]   2> 628 T1000 oasc.CoreContainer.register registering core: collection1
[junit4:junit4]   2> 629 T1000 oass.SolrDispatchFilter.init user.dir=/mnt/ssd/jenkins/workspace/Lucene-Solr-4.x-Linux/checkout/solr/build/solr-core/test/J1
[junit4:junit4]   2> 629 T1000 oass.SolrDispatchFilter.init SolrDispatchFilter.init() done
[junit4:junit4]   2> 629 T1000 oascsi.HttpClientUtil.createClient Creating new http client, config:maxConnections=128&maxConnectionsPerHost=32&followRedirects=false
[junit4:junit4]   2> 632 T1000 oejs.Server.doStart jetty-8.1.2.v20120308
[junit4:junit4]   2> 633 T1000 oejs.AbstractConnector.doStart Started SocketConnector@0.0.0.0:36173
[junit4:junit4]   2> 634 T1000 oasc.SolrResourceLoader.locateSolrHome JNDI not configured for solr (NoInitialContextEx)
[junit4:junit4]   2> 634 T1000 oasc.SolrResourceLoader.locateSolrHome using system property solr.solr.home: /mnt/ssd/jenkins/workspace/Lucene-Solr-4.x-Linux/checkout/solr/build/solr-core/test-files/solr
[junit4:junit4]   2> 634 T1000 oasc.SolrResourceLoader.<init> new SolrResourceLoader for deduced Solr Home: '/mnt/ssd/jenkins/workspace/Lucene-Solr-4.x-Linux/checkout/solr/build/solr-core/test-files/solr/'
[junit4:junit4]   2> 642 T1000 oass.SolrDispatchFilter.init SolrDispatchFilter.init()
[junit4:junit4]   2> 643 T1000 oasc.SolrResourceLoader.locateSolrHome JNDI not configured for solr (NoInitialContextEx)
[junit4:junit4]   2> 643 T1000 oasc.SolrResourceLoader.locateSolrHome using system property solr.solr.home: /mnt/ssd/jenkins/workspace/Lucene-Solr-4.x-Linux/checkout/solr/build/solr-core/test-files/solr
[junit4:junit4]   2> 643 T1000 oasc.CoreContainer$Initializer.initialize looking for solr.xml: /mnt/ssd/jenkins/workspace/Lucene-Solr-4.x-Linux/checkout/solr/build/solr-core/test-files/solr/solr.xml
[junit4:junit4]   2> 643 T1000 oasc.CoreContainer.<init> New CoreContainer 23835082
[junit4:junit4]   2> 644 T1000 oasc.CoreContainer.load Loading CoreContainer using Solr Home: '/mnt/ssd/jenkins/workspace/Lucene-Solr-4.x-Linux/checkout/solr/build/solr-core/test-files/solr/'
[junit4:junit4]   2> 644 T1000 oasc.SolrResourceLoader.<init> new SolrResourceLoader for directory: '/mnt/ssd/jenkins/workspace/Lucene-Solr-4.x-Linux/checkout/solr/build/solr-core/test-files/solr/'
[junit4:junit4]   2> 655 T1000 oasc.CoreContainer.load Registering Log Listener
[junit4:junit4]   2> 668 T1000 oasc.CoreContainer.create Creating SolrCore 'collection1' using instanceDir: /mnt/ssd/jenkins/workspace/Lucene-Solr-4.x-Linux/checkout/solr/build/solr-core/test-files/solr/collection1
[junit4:junit4]   2> 668 T1000 oasc.SolrResourceLoader.<init> new SolrResourceLoader for directory: '/mnt/ssd/jenkins/workspace/Lucene-Solr-4.x-Linux/checkout/solr/build/solr-core/test-files/solr/collection1/'
[junit4:junit4]   2> 669 T1000 oasc.SolrResourceLoader.replaceClassLoader Adding 'file:/mnt/ssd/jenkins/workspace/Lucene-Solr-4.x-Linux/checkout/solr/build/solr-core/test-files/solr/collection1/lib/README' to classloader
[junit4:junit4]   2> 669 T1000 oasc.SolrResourceLoader.replaceClassLoader Adding 'file:/mnt/ssd/jenkins/workspace/Lucene-Solr-4.x-Linux/checkout/solr/build/solr-core/test-files/solr/collection1/lib/classes/' to classloader
[junit4:junit4]   2> 694 T1000 oasc.SolrConfig.<init> Using Lucene MatchVersion: LUCENE_40
[junit4:junit4]   2> 734 T1000 oasc.SolrConfig.<init> Loaded SolrConfig: solrconfig-elevate.xml
[junit4:junit4]   2> 734 T1000 oass.IndexSchema.readSchema Reading Solr Schema
[junit4:junit4]   2> 737 T1000 oass.IndexSchema.readSchema Schema name=example
[junit4:junit4]   2> 898 T1000 oass.IndexSchema.readSchema default search field in schema is text
[junit4:junit4]   2> 901 T1000 oass.IndexSchema.readSchema unique key field: id
[junit4:junit4]   2> 903 T1000 oasc.SolrCore.<init> [collection1] Opening new SolrCore at /mnt/ssd/jenkins/workspace/Lucene-Solr-4.x-Linux/checkout/solr/build/solr-core/test-files/solr/collection1/, dataDir=./org.apache.solr.handler.component.DistributedQueryElevationComponentTest-1344017629031/shard1/data/
[junit4:junit4]   2> 904 T1000 oasc.JmxMonitoredMap.<init> JMX monitoring is enabled. Adding Solr mbeans to JMX Server: com.sun.jmx.mbeanserver.JmxMBeanServer@2c0ca2
[junit4:junit4]   2> 904 T1000 oasc.SolrCore.getNewIndexDir WARNING New index directory detected: old=null new=./org.apache.solr.handler.component.DistributedQueryElevationComponentTest-1344017629031/shard1/data/index/
[junit4:junit4]   2> 905 T1000 oasc.SolrCore.initIndex WARNING [collection1] Solr index directory './org.apache.solr.handler.component.DistributedQueryElevationComponentTest-1344017629031/shard1/data/index' doesn't exist. Creating new index...
[junit4:junit4]   2> 906 T1000 oasc.SolrDeletionPolicy.onCommit SolrDeletionPolicy.onCommit: commits:num=1
[junit4:junit4]   2> 		commit{dir=MockDirWrapper(org.apache.lucene.store.NIOFSDirectory@/mnt/ssd/jenkins/workspace/Lucene-Solr-4.x-Linux/checkout/solr/build/solr-core/test/J1/index1967919682tmp lockFactory=org.apache.lucene.store.SingleInstanceLockFactory@374c9d),segFN=segments_1,generation=1,filenames=[segments_1]
[junit4:junit4]   2> 907 T1000 oasc.SolrDeletionPolicy.updateCommits newest commit = 1
[junit4:junit4]   2> 908 T1000 oasc.RequestHandlers.initHandlersFromConfig created /update: solr.UpdateRequestHandler
[junit4:junit4]   2> 908 T1000 oasc.RequestHandlers.initHandlersFromConfig created /elevate: org.apache.solr.handler.component.SearchHandler
[junit4:junit4]   2> 908 T1000 oasc.RequestHandlers.initHandlersFromConfig created /dataElevate: org.apache.solr.handler.component.SearchHandler
[junit4:junit4]   2> 909 T1000 oashl.XMLLoader.init xsltCacheLifetimeSeconds=60
[junit4:junit4]   2> 909 T1000 oasc.RequestHandlers.initHandlersFromConfig WARNING no default request handler is registered (either '/select' or 'standard')
[junit4:junit4]   2> 911 T1000 oasc.SolrCore.initDeprecatedSupport WARNING solrconfig.xml uses deprecated <admin/gettableFiles>, Please update your config to use the ShowFileRequestHandler.
[junit4:junit4]   2> 912 T1000 oasc.SolrCore.initDeprecatedSupport WARNING adding ShowFileRequestHandler with hidden files: [SCHEMA-PHRASESUGGEST.XML, SCHEMA-REQUIRED-FIELDS.XML, SCHEMA.XML, BAD-SCHEMA-SIM-GLOBAL-VS-FT-MISMATCH.XML, PHRASESUGGEST.TXT, SCHEMA-IB.XML, BAD-SOLRCONFIG-MISSING-SCRIPTFILE.XML, SCHEMA12.XML, SOLRCONFIG-QUERYSENDER.XML, STOPTYPES-2.TXT, SOLRCONFIG-TLOG.XML, BAD-SCHEMA-UNIQUEKEY-MULTIVALUED.XML, COMPOUNDDICTIONARY.TXT, SOLRCONFIG-PROPINJECT.XML, STOPTYPES-1.TXT, SOLRCONFIG-SPELLCHECKER.XML, SCHEMA-LMDIRICHLET.XML, SOLRCONFIG_CODEC.XML, SCHEMA-LMJELINEKMERCER.XML, STOP-2.TXT, SCHEMA-CHARFILTERS.XML, SOLRCONFIG-UPDATE-PROCESSOR-CHAINS.XML, SOLRCONFIG-LAZYWRITER.XML, SOLRCONFIG-PHRASESUGGEST.XML, BAD-SCHEMA-CODEC-GLOBAL-VS-FT-MISMATCH.XML, SCHEMA-SPELLCHECKER.XML, OLD_SYNONYMS.TXT, SOLRCONFIG-DELPOLICY2.XML, SOLRCONFIG-MASTER1-KEEPONEBACKUP.XML, SOLRCONFIG-BASIC.XML, HUNSPELL-TEST.DIC, SOLRCONFIG-NOCACHE.XML, SOLRCONFIG-TRANSFORMERS.XML, SOLRCONFIG-SOLCOREPROPERTIES.XML, SOLRCONFIG-MERGEPOLICY.XML, SOLRCONFIG-SLAVE.XML, SCHEMA-STOP-KEEP.XML, SOLRCONFIG-SOLR-749.XML, SCHEMA_CODEC.XML, SCHEMA15.XML, BAD-SCHEMA-UNIQUEKEY-USES-DEFAULT.XML, SOLRCONFIG-ENABLEPLUGIN.XML, SOLRCONFIG-CACHING.XML, BAD-SCHEMA-ANALYZER-CLASS-AND-NESTED.XML, SOLRCONFIG-MASTER.XML, SOLRCONFIG-QUERYSENDER-NOQUERY.XML, CURRENCY.XML, BAD-SCHEMA-DUP-FIELD.XML, SCHEMA-BINARYFIELD.XML, SOLRCONFIG-REQHANDLER.INCL, ADDFIELDS.UPDATEPROCESSOR.JS, SCHEMA-SIM.XML, SCHEMA-BM25.XML, TRIVIAL.UPDATEPROCESSOR1.JS, SOLRCONFIG-MASTER1.XML, SCHEMA-FOLDING.XML, BAD-SCHEMA-EXTERNAL-FILEFIELD.XML, SOLRCONFIG-NATIVELOCK.XML, SOLRCONFIG-ALTDIRECTORY.XML, SCHEMA-REPLICATION1.XML, SCHEMA11.XML, BAD-SOLRCONFIG-BOGUS-SCRIPTENGINE-NAME.XML, OPEN-EXCHANGE-RATES.JSON, BAD-SOLRCONFIG-INVALID-SCRIPTFILE.XML, SOLRCONFIG-SPELLCHECKCOMPONENT.XML, SOLRCONFIG-XINCLUDE.XML, WDFTYPES.TXT, SCHEMA-LUCENEMATCHVERSION.XML, BAD-SCHEMA-DUP-FIELDTYPE.XML, DA_UTF8.XML, SCHEMA-REVERSED.XML, BAD-SCHEMA-UNIQUEKEY-IS-COPYFIELD-DEST.XML, STOPWORDSWRONGENCODING.TXT, SOLRCONFIG-SLAVE1.XML, BAD-SCHEMA-NOT-INDEXED-BUT-TF.XML, SCHEMA-TFIDF.XML, HUNSPELL-TEST.AFF, SCHEMA-TRIE.XML, STOPWITHBOM.TXT, SOLRCONFIG-SIMPLELOCK.XML, SCHEMA-NUMERIC.XML, SCHEMA-MINIMAL.XML, HYPHENATION.DTD, SOLRCONFIG-DELPOLICY1.XML, SCHEMA-DFR.XML, MISSING.FUNCTIONS.UPDATEPROCESSOR.JS, SYNONYMS.TXT, SCHEMASURROUND.XML, FRENCHARTICLES.TXT, XSLT, STEMDICT.TXT, ELEVATE.XML, SOLRCONFIG-PROPINJECT-INDEXDEFAULT.XML, SOLRCONFIG-ELEVATE.XML, SOLRCONFIG-MASTER3.XML, BAD-SCHEMA-NOT-INDEXED-BUT-POS.XML, SCHEMA-NOT-REQUIRED-UNIQUE-KEY.XML, SCHEMA-COLLATE.XML, KEEP-1.TXT, SOLRCONFIG-REPEATER.XML, CONDITIONAL.UPDATEPROCESSOR.JS, SOLRCONFIG-SCRIPT-UPDATEPROCESSOR.XML, SOLRCONFIG-HIGHLIGHT.XML, THROW.ERROR.ON.ADD.UPDATEPROCESSOR.JS, STOP-1.TXT, PROTWORDS.TXT, BAD-SCHEMA-OMIT-TF-BUT-NOT-POS.XML, SOLRCONFIG-TERMINDEX.XML, BAD-SCHEMA-NOT-INDEXED-BUT-NORMS.XML, SOLRCONFIG_PERF.XML, DA_COMPOUNDDICTIONARY.TXT, STOP-SNOWBALL.TXT, SCHEMA-COLLATEFILTER.XML, SOLRCONFIG-BASIC-LUCENEVERSION31.XML, SOLRCONFIG-FUNCTIONQUERY.XML, SCHEMA-REPLICATION2.XML, STOPWORDS.TXT, MAPPING-ISOLATIN1ACCENT.TXT, BAD_SOLRCONFIG.XML, MISSLEADING.EXTENSION.UPDATEPROCESSOR.JS.TXT, BAD-SCHEMA-NONTEXT-ANALYZER.XML, SCHEMA-COPYFIELD-TEST.XML, TRIVIAL.UPDATEPROCESSOR0.JS, SOLRCONFIG-MASTER2.XML, BAD-MP-SOLRCONFIG.XML, KEEP-2.TXT, BAD-SCHEMA-DUP-DYNAMICFIELD.XML]
[junit4:junit4]   2> 914 T1000 oass.SolrIndexSearcher.<init> Opening Searcher@814b52 main
[junit4:junit4]   2> 915 T1000 oass.SolrIndexSearcher.getIndexDir WARNING WARNING: Directory impl does not support setting indexDir: org.apache.lucene.store.MockDirectoryWrapper
[junit4:junit4]   2> 915 T1000 oasu.CommitTracker.<init> Hard AutoCommit: disabled
[junit4:junit4]   2> 915 T1000 oasu.CommitTracker.<init> Soft AutoCommit: disabled
[junit4:junit4]   2> 916 T1000 oashc.QueryElevationComponent.inform Loading QueryElevation from: /mnt/ssd/jenkins/workspace/Lucene-Solr-4.x-Linux/checkout/solr/build/solr-core/test-files/solr/collection1/conf/elevate.xml
[junit4:junit4]   2> 923 T1000 oashc.QueryElevationComponent.inform Loading QueryElevation from: /mnt/ssd/jenkins/workspace/Lucene-Solr-4.x-Linux/checkout/solr/build/solr-core/test-files/solr/collection1/conf/elevate.xml
[junit4:junit4]   2> 931 T1000 oashc.HttpShardHandlerFactory.getParameter Setting socketTimeout to: 0
[junit4:junit4]   2> 932 T1000 oashc.HttpShardHandlerFactory.getParameter Setting urlScheme to: http://
[junit4:junit4]   2> 932 T1000 oashc.HttpShardHandlerFactory.getParameter Setting connTimeout to: 0
[junit4:junit4]   2> 932 T1000 oashc.HttpShardHandlerFactory.getParameter Setting maxConnectionsPerHost to: 20
[junit4:junit4]   2> 933 T1000 oashc.HttpShardHandlerFactory.getParameter Setting corePoolSize to: 0
[junit4:junit4]   2> 933 T1000 oashc.HttpShardHandlerFactory.getParameter Setting maximumPoolSize to: 2147483647
[junit4:junit4]   2> 933 T1000 oashc.HttpShardHandlerFactory.getParameter Setting maxThreadIdleTime to: 5
[junit4:junit4]   2> 933 T1000 oashc.HttpShardHandlerFactory.getParameter Setting sizeOfQueue to: -1
[junit4:junit4]   2> 934 T1000 oashc.HttpShardHandlerFactory.getParameter Setting fairnessPolicy to: false
[junit4:junit4]   2> 934 T1000 oascsi.HttpClientUtil.createClient Creating new http client, config:maxConnectionsPerHost=20&maxConnections=10000&socketTimeout=0&connTimeout=0&retry=false
[junit4:junit4]   2> 937 T1030 oasc.SolrCore.registerSearcher [collection1] Registered new searcher Searcher@814b52 main{StandardDirectoryReader(segments_1:1)}
[junit4:junit4]   2> 937 T1000 oasc.CoreContainer.register registering core: collection1
[junit4:junit4]   2> 938 T1000 oass.SolrDispatchFilter.init user.dir=/mnt/ssd/jenkins/workspace/Lucene-Solr-4.x-Linux/checkout/solr/build/solr-core/test/J1
[junit4:junit4]   2> 938 T1000 oass.SolrDispatchFilter.init SolrDispatchFilter.init() done
[junit4:junit4]   2> 938 T1000 oascsi.HttpClientUtil.createClient Creating new http client, config:maxConnections=128&maxConnectionsPerHost=32&followRedirects=false
[junit4:junit4]   2> 941 T1000 oejs.Server.doStart jetty-8.1.2.v20120308
[junit4:junit4]   2> 942 T1000 oejs.AbstractConnector.doStart Started SocketConnector@0.0.0.0:39229
[junit4:junit4]   2> 943 T1000 oasc.SolrResourceLoader.locateSolrHome JNDI not configured for solr (NoInitialContextEx)
[junit4:junit4]   2> 943 T1000 oasc.SolrResourceLoader.locateSolrHome using system property solr.solr.home: /mnt/ssd/jenkins/workspace/Lucene-Solr-4.x-Linux/checkout/solr/build/solr-core/test-files/solr
[junit4:junit4]   2> 943 T1000 oasc.SolrResourceLoader.<init> new SolrResourceLoader for deduced Solr Home: '/mnt/ssd/jenkins/workspace/Lucene-Solr-4.x-Linux/checkout/solr/build/solr-core/test-files/solr/'
[junit4:junit4]   2> 951 T1000 oass.SolrDispatchFilter.init SolrDispatchFilter.init()
[junit4:junit4]   2> 952 T1000 oasc.SolrResourceLoader.locateSolrHome JNDI not configured for solr (NoInitialContextEx)
[junit4:junit4]   2> 952 T1000 oasc.SolrResourceLoader.locateSolrHome using system property solr.solr.home: /mnt/ssd/jenkins/workspace/Lucene-Solr-4.x-Linux/checkout/solr/build/solr-core/test-files/solr
[junit4:junit4]   2> 952 T1000 oasc.CoreContainer$Initializer.initialize looking for solr.xml: /mnt/ssd/jenkins/workspace/Lucene-Solr-4.x-Linux/checkout/solr/build/solr-core/test-files/solr/solr.xml
[junit4:junit4]   2> 952 T1000 oasc.CoreContainer.<init> New CoreContainer 1000336
[junit4:junit4]   2> 953 T1000 oasc.CoreContainer.load Loading CoreContainer using Solr Home: '/mnt/ssd/jenkins/workspace/Lucene-Solr-4.x-Linux/checkout/solr/build/solr-core/test-files/solr/'
[junit4:junit4]   2> 953 T1000 oasc.SolrResourceLoader.<init> new SolrResourceLoader for directory: '/mnt/ssd/jenkins/workspace/Lucene-Solr-4.x-Linux/checkout/solr/build/solr-core/test-files/solr/'
[junit4:junit4]   2> 963 T1000 oasc.CoreContainer.load Registering Log Listener
[junit4:junit4]   2> 975 T1000 oasc.CoreContainer.create Creating SolrCore 'collection1' using instanceDir: /mnt/ssd/jenkins/workspace/Lucene-Solr-4.x-Linux/checkout/solr/build/solr-core/test-files/solr/collection1
[junit4:junit4]   2> 975 T1000 oasc.SolrResourceLoader.<init> new SolrResourceLoader for directory: '/mnt/ssd/jenkins/workspace/Lucene-Solr-4.x-Linux/checkout/solr/build/solr-core/test-files/solr/collection1/'
[junit4:junit4]   2> 975 T1000 oasc.SolrResourceLoader.replaceClassLoader Adding 'file:/mnt/ssd/jenkins/workspace/Lucene-Solr-4.x-Linux/checkout/solr/build/solr-core/test-files/solr/collection1/lib/README' to classloader
[junit4:junit4]   2> 976 T1000 oasc.SolrResourceLoader.replaceClassLoader Adding 'file:/mnt/ssd/jenkins/workspace/Lucene-Solr-4.x-Linux/checkout/solr/build/solr-core/test-files/solr/collection1/lib/classes/' to classloader
[junit4:junit4]   2> 998 T1000 oasc.SolrConfig.<init> Using Lucene MatchVersion: LUCENE_40
[junit4:junit4]   2> 1035 T1000 oasc.SolrConfig.<init> Loaded SolrConfig: solrconfig-elevate.xml
[junit4:junit4]   2> 1035 T1000 oass.IndexSchema.readSchema Reading Solr Schema
[junit4:junit4]   2> 1038 T1000 oass.IndexSchema.readSchema Schema name=example
[junit4:junit4]   2> 1202 T1000 oass.IndexSchema.readSchema default search field in schema is text
[junit4:junit4]   2> 1204 T1000 oass.IndexSchema.readSchema unique key field: id
[junit4:junit4]   2> 1206 T1000 oasc.SolrCore.<init> [collection1] Opening new SolrCore at /mnt/ssd/jenkins/workspace/Lucene-Solr-4.x-Linux/checkout/solr/build/solr-core/test-files/solr/collection1/, dataDir=./org.apache.solr.handler.component.DistributedQueryElevationComponentTest-1344017629031/shard2/data/
[junit4:junit4]   2> 1207 T1000 oasc.JmxMonitoredMap.<init> JMX monitoring is enabled. Adding Solr mbeans to JMX Server: com.sun.jmx.mbeanserver.JmxMBeanServer@2c0ca2
[junit4:junit4]   2> 1207 T1000 oasc.SolrCore.getNewIndexDir WARNING New index directory detected: old=null new=./org.apache.solr.handler.component.DistributedQueryElevationComponentTest-1344017629031/shard2/data/index/
[junit4:junit4]   2> 1207 T1000 oasc.SolrCore.initIndex WARNING [collection1] Solr index directory './org.apache.solr.handler.component.DistributedQueryElevationComponentTest-1344017629031/shard2/data/index' doesn't exist. Creating new index...
[junit4:junit4]   2> 1208 T1000 oasc.SolrDeletionPolicy.onCommit SolrDeletionPolicy.onCommit: commits:num=1
[junit4:junit4]   2> 		commit{dir=MockDirWrapper(org.apache.lucene.store.RAMDirectory@1347d89 lockFactory=org.apache.lucene.store.SingleInstanceLockFactory@12adeaf),segFN=segments_1,generation=1,filenames=[segments_1]
[junit4:junit4]   2> 1209 T1000 oasc.SolrDeletionPolicy.updateCommits newest commit = 1
[junit4:junit4]   2> 1210 T1000 oasc.RequestHandlers.initHandlersFromConfig created /update: solr.UpdateRequestHandler
[junit4:junit4]   2> 1210 T1000 oasc.RequestHandlers.initHandlersFromConfig created /elevate: org.apache.solr.handler.component.SearchHandler
[junit4:junit4]   2> 1210 T1000 oasc.RequestHandlers.initHandlersFromConfig created /dataElevate: org.apache.solr.handler.component.SearchHandler
[junit4:junit4]   2> 1211 T1000 oashl.XMLLoader.init xsltCacheLifetimeSeconds=60
[junit4:junit4]   2> 1211 T1000 oasc.RequestHandlers.initHandlersFromConfig WARNING no default request handler is registered (either '/select' or 'standard')
[junit4:junit4]   2> 1212 T1000 oasc.SolrCore.initDeprecatedSupport WARNING solrconfig.xml uses deprecated <admin/gettableFiles>, Please update your config to use the ShowFileRequestHandler.
[junit4:junit4]   2> 1213 T1000 oasc.SolrCore.initDeprecatedSupport WARNING adding ShowFileRequestHandler with hidden files: [SCHEMA-PHRASESUGGEST.XML, SCHEMA-REQUIRED-FIELDS.XML, SCHEMA.XML, BAD-SCHEMA-SIM-GLOBAL-VS-FT-MISMATCH.XML, PHRASESUGGEST.TXT, SCHEMA-IB.XML, BAD-SOLRCONFIG-MISSING-SCRIPTFILE.XML, SCHEMA12.XML, SOLRCONFIG-QUERYSENDER.XML, STOPTYPES-2.TXT, SOLRCONFIG-TLOG.XML, BAD-SCHEMA-UNIQUEKEY-MULTIVALUED.XML, COMPOUNDDICTIONARY.TXT, SOLRCONFIG-PROPINJECT.XML, STOPTYPES-1.TXT, SOLRCONFIG-SPELLCHECKER.XML, SCHEMA-LMDIRICHLET.XML, SOLRCONFIG_CODEC.XML, SCHEMA-LMJELINEKMERCER.XML, STOP-2.TXT, SCHEMA-CHARFILTERS.XML, SOLRCONFIG-UPDATE-PROCESSOR-CHAINS.XML, SOLRCONFIG-LAZYWRITER.XML, SOLRCONFIG-PHRASESUGGEST.XML, BAD-SCHEMA-CODEC-GLOBAL-VS-FT-MISMATCH.XML, SCHEMA-SPELLCHECKER.XML, OLD_SYNONYMS.TXT, SOLRCONFIG-DELPOLICY2.XML, SOLRCONFIG-MASTER1-KEEPONEBACKUP.XML, SOLRCONFIG-BASIC.XML, HUNSPELL-TEST.DIC, SOLRCONFIG-NOCACHE.XML, SOLRCONFIG-TRANSFORMERS.XML, SOLRCONFIG-SOLCOREPROPERTIES.XML, SOLRCONFIG-MERGEPOLICY.XML, SOLRCONFIG-SLAVE.XML, SCHEMA-STOP-KEEP.XML, SOLRCONFIG-SOLR-749.XML, SCHEMA_CODEC.XML, SCHEMA15.XML, BAD-SCHEMA-UNIQUEKEY-USES-DEFAULT.XML, SOLRCONFIG-ENABLEPLUGIN.XML, SOLRCONFIG-CACHING.XML, BAD-SCHEMA-ANALYZER-CLASS-AND-NESTED.XML, SOLRCONFIG-MASTER.XML, SOLRCONFIG-QUERYSENDER-NOQUERY.XML, CURRENCY.XML, BAD-SCHEMA-DUP-FIELD.XML, SCHEMA-BINARYFIELD.XML, SOLRCONFIG-REQHANDLER.INCL, ADDFIELDS.UPDATEPROCESSOR.JS, SCHEMA-SIM.XML, SCHEMA-BM25.XML, TRIVIAL.UPDATEPROCESSOR1.JS, SOLRCONFIG-MASTER1.XML, SCHEMA-FOLDING.XML, BAD-SCHEMA-EXTERNAL-FILEFIELD.XML, SOLRCONFIG-NATIVELOCK.XML, SOLRCONFIG-ALTDIRECTORY.XML, SCHEMA-REPLICATION1.XML, SCHEMA11.XML, BAD-SOLRCONFIG-BOGUS-SCRIPTENGINE-NAME.XML, OPEN-EXCHANGE-RATES.JSON, BAD-SOLRCONFIG-INVALID-SCRIPTFILE.XML, SOLRCONFIG-SPELLCHECKCOMPONENT.XML, SOLRCONFIG-XINCLUDE.XML, WDFTYPES.TXT, SCHEMA-LUCENEMATCHVERSION.XML, BAD-SCHEMA-DUP-FIELDTYPE.XML, DA_UTF8.XML, SCHEMA-REVERSED.XML, BAD-SCHEMA-UNIQUEKEY-IS-COPYFIELD-DEST.XML, STOPWORDSWRONGENCODING.TXT, SOLRCONFIG-SLAVE1.XML, BAD-SCHEMA-NOT-INDEXED-BUT-TF.XML, SCHEMA-TFIDF.XML, HUNSPELL-TEST.AFF, SCHEMA-TRIE.XML, STOPWITHBOM.TXT, SOLRCONFIG-SIMPLELOCK.XML, SCHEMA-NUMERIC.XML, SCHEMA-MINIMAL.XML, HYPHENATION.DTD, SOLRCONFIG-DELPOLICY1.XML, SCHEMA-DFR.XML, MISSING.FUNCTIONS.UPDATEPROCESSOR.JS, SYNONYMS.TXT, SCHEMASURROUND.XML, FRENCHARTICLES.TXT, XSLT, STEMDICT.TXT, ELEVATE.XML, SOLRCONFIG-PROPINJECT-INDEXDEFAULT.XML, SOLRCONFIG-ELEVATE.XML, SOLRCONFIG-MASTER3.XML, BAD-SCHEMA-NOT-INDEXED-BUT-POS.XML, SCHEMA-NOT-REQUIRED-UNIQUE-KEY.XML, SCHEMA-COLLATE.XML, KEEP-1.TXT, SOLRCONFIG-REPEATER.XML, CONDITIONAL.UPDATEPROCESSOR.JS, SOLRCONFIG-SCRIPT-UPDATEPROCESSOR.XML, SOLRCONFIG-HIGHLIGHT.XML, THROW.ERROR.ON.ADD.UPDATEPROCESSOR.JS, STOP-1.TXT, PROTWORDS.TXT, BAD-SCHEMA-OMIT-TF-BUT-NOT-POS.XML, SOLRCONFIG-TERMINDEX.XML, BAD-SCHEMA-NOT-INDEXED-BUT-NORMS.XML, SOLRCONFIG_PERF.XML, DA_COMPOUNDDICTIONARY.TXT, STOP-SNOWBALL.TXT, SCHEMA-COLLATEFILTER.XML, SOLRCONFIG-BASIC-LUCENEVERSION31.XML, SOLRCONFIG-FUNCTIONQUERY.XML, SCHEMA-REPLICATION2.XML, STOPWORDS.TXT, MAPPING-ISOLATIN1ACCENT.TXT, BAD_SOLRCONFIG.XML, MISSLEADING.EXTENSION.UPDATEPROCESSOR.JS.TXT, BAD-SCHEMA-NONTEXT-ANALYZER.XML, SCHEMA-COPYFIELD-TEST.XML, TRIVIAL.UPDATEPROCESSOR0.JS, SOLRCONFIG-MASTER2.XML, BAD-MP-SOLRCONFIG.XML, KEEP-2.TXT, BAD-SCHEMA-DUP-DYNAMICFIELD.XML]
[junit4:junit4]   2> 1215 T1000 oass.SolrIndexSearcher.<init> Opening Searcher@8f0d37 main
[junit4:junit4]   2> 1215 T1000 oass.SolrIndexSearcher.getIndexDir WARNING WARNING: Directory impl does not support setting indexDir: org.apache.lucene.store.MockDirectoryWrapper
[junit4:junit4]   2> 1216 T1000 oasu.CommitTracker.<init> Hard AutoCommit: disabled
[junit4:junit4]   2> 1216 T1000 oasu.CommitTracker.<init> Soft AutoCommit: disabled
[junit4:junit4]   2> 1216 T1000 oashc.QueryElevationComponent.inform Loading QueryElevation from: /mnt/ssd/jenkins/workspace/Lucene-Solr-4.x-Linux/checkout/solr/build/solr-core/test-files/solr/collection1/conf/elevate.xml
[junit4:junit4]   2> 1223 T1000 oashc.QueryElevationComponent.inform Loading QueryElevation from: /mnt/ssd/jenkins/workspace/Lucene-Solr-4.x-Linux/checkout/solr/build/solr-core/test-files/solr/collection1/conf/elevate.xml
[junit4:junit4]   2> 1230 T1000 oashc.HttpShardHandlerFactory.getParameter Setting socketTimeout to: 0
[junit4:junit4]   2> 1231 T1000 oashc.HttpShardHandlerFactory.getParameter Setting urlScheme to: http://
[junit4:junit4]   2> 1231 T1000 oashc.HttpShardHandlerFactory.getParameter Setting connTimeout to: 0
[junit4:junit4]   2> 1231 T1000 oashc.HttpShardHandlerFactory.getParameter Setting maxConnectionsPerHost to: 20
[junit4:junit4]   2> 1231 T1000 oashc.HttpShardHandlerFactory.getParameter Setting corePoolSize to: 0
[junit4:junit4]   2> 1232 T1000 oashc.HttpShardHandlerFactory.getParameter Setting maximumPoolSize to: 2147483647
[junit4:junit4]   2> 1232 T1000 oashc.HttpShardHandlerFactory.getParameter Setting maxThreadIdleTime to: 5
[junit4:junit4]   2> 1232 T1000 oashc.HttpShardHandlerFactory.getParameter Setting sizeOfQueue to: -1
[junit4:junit4]   2> 1232 T1000 oashc.HttpShardHandlerFactory.getParameter Setting fairnessPolicy to: false
[junit4:junit4]   2> 1233 T1000 oascsi.HttpClientUtil.createClient Creating new http client, config:maxConnectionsPerHost=20&maxConnections=10000&socketTimeout=0&connTimeout=0&retry=false
[junit4:junit4]   2> 1235 T1040 oasc.SolrCore.registerSearcher [collection1] Registered new searcher Searcher@8f0d37 main{StandardDirectoryReader(segments_1:1)}
[junit4:junit4]   2> 1235 T1000 oasc.CoreContainer.register registering core: collection1
[junit4:junit4]   2> 1236 T1000 oass.SolrDispatchFilter.init user.dir=/mnt/ssd/jenkins/workspace/Lucene-Solr-4.x-Linux/checkout/solr/build/solr-core/test/J1
[junit4:junit4]   2> 1236 T1000 oass.SolrDispatchFilter.init SolrDispatchFilter.init() done
[junit4:junit4]   2> 1236 T1000 oascsi.HttpClientUtil.createClient Creating new http client, config:maxConnections=128&maxConnectionsPerHost=32&followRedirects=false
[junit4:junit4]   2> ASYNC  NEW_CORE C39 name=collection1 org.apache.solr.core.SolrCore@143629a
[junit4:junit4]   2> 1242 T1003 C39 oasu.DirectUpdateHandler2.deleteAll [collection1] REMOVING ALL DOCUMENTS FROM INDEX
[junit4:junit4]   2> 1243 T1003 C39 oasc.SolrDeletionPolicy.onInit SolrDeletionPolicy.onInit: commits:num=1
[junit4:junit4]   2> 		commit{dir=MockDirWrapper(org.apache.lucene.store.RAMDirectory@fe8ef5 lockFactory=org.apache.lucene.store.SingleInstanceLockFactory@1471ba9),segFN=segments_1,generation=1,filenames=[segments_1]
[junit4:junit4]   2> 1244 T1003 C39 oasc.SolrDeletionPolicy.updateCommits newest commit = 1
[junit4:junit4]   2> 1244 T1003 C39 UPDATE [collection1] webapp=/solr path=/update params={wt=javabin&version=2} {deleteByQuery=*:*} 0 2
[junit4:junit4]   2> ASYNC  NEW_CORE C40 name=collection1 org.apache.solr.core.SolrCore@122b2cb
[junit4:junit4]   2> 1249 T1013 C40 oasu.DirectUpdateHandler2.deleteAll [collection1] REMOVING ALL DOCUMENTS FROM INDEX
[junit4:junit4]   2> 1251 T1013 C40 oasc.SolrDeletionPolicy.onInit SolrDeletionPolicy.onInit: commits:num=1
[junit4:junit4]   2> 		commit{dir=MockDirWrapper(org.apache.lucene.store.RAMDirectory@1086981 lockFactory=org.apache.lucene.store.SingleInstanceLockFactory@290df4),segFN=segments_1,generation=1,filenames=[segments_1]
[junit4:junit4]   2> 1251 T1013 C40 oasc.SolrDeletionPolicy.updateCommits newest commit = 1
[junit4:junit4]   2> 1252 T1013 C40 UPDATE [collection1] webapp=/solr path=/update params={wt=javabin&version=2} {deleteByQuery=*:*} 0 3
[junit4:junit4]   2> ASYNC  NEW_CORE C41 name=collection1 org.apache.solr.core.SolrCore@9dea70
[junit4:junit4]   2> 1256 T1023 C41 oasu.DirectUpdateHandler2.deleteAll [collection1] REMOVING ALL DOCUMENTS FROM INDEX
[junit4:junit4]   2> 1257 T1023 C41 oasc.SolrDeletionPolicy.onInit SolrDeletionPolicy.onInit: commits:num=1
[junit4:junit4]   2> 		commit{dir=MockDirWrapper(org.apache.lucene.store.NIOFSDirectory@/mnt/ssd/jenkins/workspace/Lucene-Solr-4.x-Linux/checkout/solr/build/solr-core/test/J1/index1967919682tmp lockFactory=org.apache.lucene.store.SingleInstanceLockFactory@374c9d),segFN=segments_1,generation=1,filenames=[segments_1]
[junit4:junit4]   2> 1257 T1023 C41 oasc.SolrDeletionPolicy.updateCommits newest commit = 1
[junit4:junit4]   2> 1258 T1023 C41 UPDATE [collection1] webapp=/solr path=/update params={wt=javabin&version=2} {deleteByQuery=*:*} 0 3
[junit4:junit4]   2> ASYNC  NEW_CORE C42 name=collection1 org.apache.solr.core.SolrCore@1186785
[junit4:junit4]   2> 1262 T1033 C42 oasu.DirectUpdateHandler2.deleteAll [collection1] REMOVING ALL DOCUMENTS FROM INDEX
[junit4:junit4]   2> 1263 T1033 C42 oasc.SolrDeletionPolicy.onInit SolrDeletionPolicy.onInit: commits:num=1
[junit4:junit4]   2> 		commit{dir=MockDirWrapper(org.apache.lucene.store.RAMDirectory@1347d89 lockFactory=org.apache.lucene.store.SingleInstanceLockFactory@12adeaf),segFN=segments_1,generation=1,filenames=[segments_1]
[junit4:junit4]   2> 1263 T1033 C42 oasc.SolrDeletionPolicy.updateCommits newest commit = 1
[junit4:junit4]   2> 1263 T1033 C42 UPDATE [collection1] webapp=/solr path=/update params={wt=javabin&version=2} {deleteByQuery=*:*} 0 2
[junit4:junit4]   2> 1266 T1003 C39 UPDATE [collection1] webapp=/solr path=/update params={wt=javabin&version=2} {add=[1]} 0 1
[junit4:junit4]   2> 1268 T1013 C40 UPDATE [collection1] webapp=/solr path=/update params={wt=javabin&version=2} {add=[1]} 0 0
[junit4:junit4]   2> 1270 T1003 C39 UPDATE [collection1] webapp=/solr path=/update params={wt=javabin&version=2} {add=[2]} 0 0
[junit4:junit4]   2> 1272 T1023 C41 UPDATE [collection1] webapp=/solr path=/update params={wt=javabin&version=2} {add=[2]} 0 0
[junit4:junit4]   2> 1274 T1003 C39 UPDATE [collection1] webapp=/solr path=/update params={wt=javabin&version=2} {add=[3]} 0 0
[junit4:junit4]   2> 1276 T1033 C42 UPDATE [collection1] webapp=/solr path=/update params={wt=javabin&version=2} {add=[3]} 0 0
[junit4:junit4]   2> 1278 T1003 C39 UPDATE [collection1] webapp=/solr path=/update params={wt=javabin&version=2} {add=[4]} 0 0
[junit4:junit4]   2> 1280 T1013 C40 UPDATE [collection1] webapp=/solr path=/update params={wt=javabin&version=2} {add=[4]} 0 1
[junit4:junit4]   2> 1281 T1003 C39 UPDATE [collection1] webapp=/solr path=/update params={wt=javabin&version=2} {add=[5]} 0 0
[junit4:junit4]   2> 1283 T1023 C41 UPDATE [collection1] webapp=/solr path=/update params={wt=javabin&version=2} {add=[5]} 0 0
[junit4:junit4]   2> 1285 T1003 C39 UPDATE [collection1] webapp=/solr path=/update params={wt=javabin&version=2} {add=[6]} 0 0
[junit4:junit4]   2> 1287 T1033 C42 UPDATE [collection1] webapp=/solr path=/update params={wt=javabin&version=2} {add=[6]} 0 0
[junit4:junit4]   2> 1289 T1003 C39 UPDATE [collection1] webapp=/solr path=/update params={wt=javabin&version=2} {add=[7]} 0 0
[junit4:junit4]   2> 1290 T1033 C42 UPDATE [collection1] webapp=/solr path=/update params={wt=javabin&version=2} {add=[7]} 0 0
[junit4:junit4]   2> 1292 T1003 C39 oasu.DirectUpdateHandler2.commit start commit{flags=0,_version_=0,optimize=false,openSearcher=true,waitSearcher=true,expungeDeletes=false,softCommit=false}
[junit4:junit4]   2> 1293 T1003 C39 oasc.SolrDeletionPolicy.onCommit SolrDeletionPolicy.onCommit: commits:num=2
[junit4:junit4]   2> 		commit{dir=MockDirWrapper(org.apache.lucene.store.RAMDirectory@fe8ef5 lockFactory=org.apache.lucene.store.SingleInstanceLockFactory@1471ba9),segFN=segments_1,generation=1,filenames=[segments_1]
[junit4:junit4]   2> 		commit{dir=MockDirWrapper(org.apache.lucene.store.RAMDirectory@fe8ef5 lockFactory=org.apache.lucene.store.SingleInstanceLockFactory@1471ba9),segFN=segments_2,generation=2,filenames=[segments_2, _0.si, _0_MockSep_0.pos, _0_MockSep_0.pyl, _0_MockSep_0.tib, _0_MockSep_0.skp, _0.fdx, _0_MockSep_0.frq, _0.fdt, _0_Asserting_0.tip, _0_MockSep_0.tii, _0_Asserting_0.tim, _0_MockSep_0.doc, _0.fnm, _0_Asserting_0.prx, _0_nrm.cfe, _0_Asserting_0.frq, _0_nrm.cfs]
[junit4:junit4]   2> 1294 T1003 C39 oasc.SolrDeletionPolicy.updateCommits newest commit = 2
[junit4:junit4]   2> 1295 T1003 C39 oass.SolrIndexSearcher.<init> Opening Searcher@13e87bf main
[junit4:junit4]   2> 1295 T1003 C39 oass.SolrIndexSearcher.getIndexDir WARNING WARNING: Directory impl does not support setting indexDir: org.apache.lucene.store.MockDirectoryWrapper
[junit4:junit4]   2> 1296 T1003 C39 oasu.DirectUpdateHandler2.commit end_commit_flush
[junit4:junit4]   2> 1297 T1010 oasc.SolrCore.registerSearcher [collection1] Registered new searcher Searcher@13e87bf main{StandardDirectoryReader(segments_2:4 _0(4.0.0.1):C7)}
[junit4:junit4]   2> 1297 T1003 C39 UPDATE [collection1] webapp=/solr path=/update params={wt=javabin&softCommit=false&version=2&waitSearcher=true&commit=true} {commit=} 0 5
[junit4:junit4]   2> 1299 T1013 C40 oasu.DirectUpdateHandler2.commit start commit{flags=0,_version_=0,optimize=false,openSearcher=true,waitSearcher=true,expungeDeletes=false,softCommit=false}
[junit4:junit4]   2> 1301 T1013 C40 oasc.SolrDeletionPolicy.onCommit SolrDeletionPolicy.onCommit: commits:num=2
[junit4:junit4]   2> 		commit{dir=MockDirWrapper(org.apache.lucene.store.RAMDirectory@1086981 lockFactory=org.apache.lucene.store.SingleInstanceLockFactory@290df4),segFN=segments_1,generation=1,filenames=[segments_1]
[junit4:junit4]   2> 		commit{dir=MockDirWrapper(org.apache.lucene.store.RAMDirectory@1086981 lockFactory=org.apache.lucene.store.SingleInstanceLockFactory@290df4),segFN=segments_2,generation=2,filenames=[segments_2, _0.si, _0_MockSep_0.pos, _0_MockSep_0.pyl, _0_MockSep_0.tib, _0_MockSep_0.skp, _0.fdx, _0_MockSep_0.frq, _0.fdt, _0_Asserting_0.tip, _0_MockSep_0.tii, _0_Asserting_0.tim, _0_MockSep_0.doc, _0.fnm, _0_Asserting_0.prx, _0_nrm.cfe, _0_Asserting_0.frq, _0_nrm.cfs]
[junit4:junit4]   2> 1302 T1013 C40 oasc.SolrDeletionPolicy.updateCommits newest commit = 2
[junit4:junit4]   2> 1303 T1013 C40 oass.SolrIndexSearcher.<init> Opening Searcher@1c0c6e9 main
[junit4:junit4]   2> 1303 T1013 C40 oass.SolrIndexSearcher.getIndexDir WARNING WARNING: Directory impl does not support setting indexDir: org.apache.lucene.store.MockDirectoryWrapper
[junit4:junit4]   2> 1304 T1013 C40 oasu.DirectUpdateHandler2.commit end_commit_flush
[junit4:junit4]   2> 1305 T1020 oasc.SolrCore.registerSearcher [collection1] Registered new searcher Searcher@1c0c6e9 main{StandardDirectoryReader(segments_2:4 _0(4.0.0.1):C2)}
[junit4:junit4]   2> 1305 T1013 C40 UPDATE [collection1] webapp=/solr path=/update params={wt=javabin&softCommit=false&version=2&waitSearcher=true&commit=true} {commit=} 0 6
[junit4:junit4]   2> 1307 T1023 C41 oasu.DirectUpdateHandler2.commit start commit{flags=0,_version_=0,optimize=false,openSearcher=true,waitSearcher=true,expungeDeletes=false,softCommit=false}
[junit4:junit4]   2> 1310 T1023 C41 oasc.SolrDeletionPolicy.onCommit SolrDeletionPolicy.onCommit: commits:num=2
[junit4:junit4]   2> 		commit{dir=MockDirWrapper(org.apache.lucene.store.NIOFSDirectory@/mnt/ssd/jenkins/workspace/Lucene-Solr-4.x-Linux/checkout/solr/build/solr-core/test/J1/index1967919682tmp lockFactory=org.apache.lucene.store.SingleInstanceLockFactory@374c9d),segFN=segments_1,generation=1,filenames=[segments_1]
[junit4:junit4]   2> 		commit{dir=MockDirWrapper(org.apache.lucene.store.NIOFSDirectory@/mnt/ssd/jenkins/workspace/Lucene-Solr-4.x-Linux/checkout/solr/build/solr-core/test/J1/index1967919682tmp lockFactory=org.apache.lucene.store.SingleInstanceLockFactory@374c9d),segFN=segments_2,generation=2,filenames=[segments_2, _0.si, _0_MockSep_0.pos, _0_MockSep_0.tib, _0_MockSep_0.pyl, _0_MockSep_0.skp, _0.fdx, _0_MockSep_0.frq, _0.fdt, _0_Asserting_0.tip, _0_Asserting_0.tim, _0_MockSep_0.tii, _0_MockSep_0.doc, _0.fnm, _0_Asserting_0.prx, _0_nrm.cfe, _0_Asserting_0.frq, _0_nrm.cfs]
[junit4:junit4]   2> 1310 T1023 C41 oasc.SolrDeletionPolicy.updateCommits newest commit = 2
[junit4:junit4]   2> 1312 T1023 C41 oass.SolrIndexSearcher.<init> Opening Searcher@1df142b main
[junit4:junit4]   2> 1312 T1023 C41 oass.SolrIndexSearcher.getIndexDir WARNING WARNING: Directory impl does not support setting indexDir: org.apache.lucene.store.MockDirectoryWrapper
[junit4:junit4]   2> 1313 T1023 C41 oasu.DirectUpdateHandler2.commit end_commit_flush
[junit4:junit4]   2> 1313 T1030 oasc.SolrCore.registerSearcher [collection1] Registered new searcher Searcher@1df142b main{StandardDirectoryReader(segments_2:4 _0(4.0.0.1):C2)}
[junit4:junit4]   2> 1314 T1023 C41 UPDATE [collection1] webapp=/solr path=/update params={wt=javabin&softCommit=false&version=2&waitSearcher=true&commit=true} {commit=} 0 7
[junit4:junit4]   2> 1316 T1033 C42 oasu.DirectUpdateHandler2.commit start commit{flags=0,_version_=0,optimize=false,openSearcher=true,waitSearcher=true,expungeDeletes=false,softCommit=false}
[junit4:junit4]   2> 1317 T1033 C42 oasc.SolrDeletionPolicy.onCommit SolrDeletionPolicy.onCommit: commits:num=2
[junit4:junit4]   2> 		commit{dir=MockDirWrapper(org.apache.lucene.store.RAMDirectory@1347d89 lockFactory=org.apache.lucene.store.SingleInstanceLockFactory@12adeaf),segFN=segments_1,generation=1,filenames=[segments_1]
[junit4:junit4]   2> 		commit{dir=MockDirWrapper(org.apache.lucene.store.RAMDirectory@1347d89 lockFactory=org.apache.lucene.store.SingleInstanceLockFactory@12adeaf),segFN=segments_2,generation=2,filenames=[segments_2, _0.si, _0_MockSep_0.pos, _0_MockSep_0.tib, _0_MockSep_0.pyl, _0_MockSep_0.skp, _0.fdx, _0_MockSep_0.frq, _0.fdt, _0_Asserting_0.tip, _0_Asserting_0.tim, _0_MockSep_0.tii, _0_MockSep_0.doc, _0.fnm, _0_Asserting_0.prx, _0_nrm.cfe, _0_Asserting_0.frq, _0_nrm.cfs]
[junit4:junit4]   2> 1318 T1033 C42 oasc.SolrDeletionPolicy.updateCommits newest commit = 2
[junit4:junit4]   2> 1319 T1033 C42 oass.SolrIndexSearcher.<init> Opening Searcher@18b7543 main
[junit4:junit4]   2> 1319 T1033 C42 oass.SolrIndexSearcher.getIndexDir WARNING WARNING: Directory impl does not support setting indexDir: org.apache.lucene.store.MockDirectoryWrapper
[junit4:junit4]   2> 1320 T1033 C42 oasu.DirectUpdateHandler2.commit end_commit_flush
[junit4:junit4]   2> 1320 T1040 oasc.SolrCore.registerSearcher [collection1] Registered new searcher Searcher@18b7543 main{StandardDirectoryReader(segments_2:4 _0(4.0.0.1):C3)}
[junit4:junit4]   2> 1321 T1033 C42 UPDATE [collection1] webapp=/solr path=/update params={wt=javabin&softCommit=false&version=2&waitSearcher=true&commit=true} {commit=} 0 6
[junit4:junit4]   2> 1326 T1003 C39 REQ [collection1] webapp=/solr path=/elevate params={wt=javabin&shards.qt=/elevate&fl=id,+score,+[elevated]&qt=/elevate&rows=500&version=2&q=*:*&sort=id+desc&distrib=false} hits=7 status=0 QTime=3 
[junit4:junit4]   2> 1330 T1024 C41 REQ [collection1] webapp=/solr path=/elevate params={fsv=true&fl=id,score&isShard=true&rows=500&qt=/elevate&version=2&NOW=1344017630357&q=*:*&distrib=false&shard.url=localhost:36173/solr&wt=javabin&shards.qt=/elevate&start=0&sort=id+desc} hits=2 status=0 QTime=0 
[junit4:junit4]   2> 1331 T1014 C40 REQ [collection1] webapp=/solr path=/elevate params={fsv=true&fl=id,score&isShard=true&rows=500&qt=/elevate&version=2&NOW=1344017630357&q=*:*&distrib=false&shard.url=localhost:34183/solr&wt=javabin&shards.qt=/elevate&start=0&sort=id+desc} hits=2 status=0 QTime=0 
[junit4:junit4]   2> 1331 T1034 C42 REQ [collection1] webapp=/solr path=/elevate params={fsv=true&fl=id,score&isShard=true&rows=500&qt=/elevate&version=2&NOW=1344017630357&q=*:*&distrib=false&shard.url=localhost:39229/solr&wt=javabin&shards.qt=/elevate&start=0&sort=id+desc} hits=3 status=0 QTime=0 
[junit4:junit4]   2> 1337 T1034 C42 REQ [collection1] webapp=/solr path=/elevate params={fl=id,+score,+[elevated]&isShard=true&qt=/elevate&rows=500&ids=7.0,6.0,3.0&version=2&NOW=1344017630357&q=*:*&distrib=false&shard.url=localhost:39229/solr&wt=javabin&shards.qt=/elevate} status=0 QTime=1 
[junit4:junit4]   2> 1337 T1014 C40 REQ [collection1] webapp=/solr path=/elevate params={fl=id,+score,+[elevated]&isShard=true&qt=/elevate&rows=500&ids=1.0,4.0&version=2&NOW=1344017630357&q=*:*&distrib=false&shard.url=localhost:34183/solr&wt=javabin&shards.qt=/elevate} status=0 QTime=0 
[junit4:junit4]   2> 1337 T1024 C41 REQ [collection1] webapp=/solr path=/elevate params={fl=id,+score,+[elevated]&isShard=true&qt=/elevate&rows=500&ids=5.0,2.0&version=2&NOW=1344017630357&q=*:*&distrib=false&shard.url=localhost:36173/solr&wt=javabin&shards.qt=/elevate} status=0 QTime=0 
[junit4:junit4]   2> 1338 T1033 C42 REQ [collection1] webapp=/solr path=/elevate params={wt=javabin&shards.qt=/elevate&fl=id,+score,+[elevated]&qt=/elevate&rows=500&version=2&shards=localhost:34183/solr,localhost:36173/solr,localhost:39229/solr&q=*:*&sort=id+desc} status=0 QTime=10 
[junit4:junit4]   2> 1338 T1000 oas.BaseDistributedSearchTestCase.compareResponses SEVERE Mismatched responses:
[junit4:junit4]   2> 	{responseHeader={status=0,QTime=10,params={wt=javabin,shards.qt=/elevate,fl=id, score, [elevated],qt=/elevate,rows=500,version=2,shards=localhost:34183/solr,localhost:36173/solr,localhost:39229/solr,q=*:*,sort=id desc}},response={numFound=7,start=0,maxScore=1.0,docs=[SolrDocument{id=7.0, [elevated]=false, score=1.0}, SolrDocument{id=6.0, [elevated]=false, score=1.0}, SolrDocument{id=5.0, [elevated]=false, score=1.0}, SolrDocument{id=4.0, [elevated]=false, score=1.0}, SolrDocument{id=3.0, [elevated]=false, score=1.0}, SolrDocument{id=2.0, [elevated]=false, score=1.0}, SolrDocument{id=1.0, [elevated]=false, score=1.0}]}}
[junit4:junit4]   2> 	{responseHeader={status=0,QTime=3,params={wt=javabin,shards.qt=/elevate,fl=id, score, [elevated],qt=/elevate,rows=500,version=2,q=*:*,sort=id desc,distrib=false}},response={numFound=7,start=0,maxScore=1.0,docs=[SolrDocument{id=7.0, score=1.0, [elevated]=false}, SolrDocument{id=6.0, score=1.0, [elevated]=false}, SolrDocument{id=5.0, score=1.0, [elevated]=false}, SolrDocument{id=4.0, score=1.0, [elevated]=false}, SolrDocument{id=3.0, score=1.0, [elevated]=false}, SolrDocument{id=2.0, score=1.0, [elevated]=false}, SolrDocument{id=1.0, score=1.0, [elevated]=false}]}}
[junit4:junit4]   2> 1339 T1000 oasc.CoreContainer.shutdown Shutting down CoreContainer instance=10661892
[junit4:junit4]   2> 1340 T1000 oasc.SolrCore.close [collection1]  CLOSING SolrCore org.apache.solr.core.SolrCore@143629a
[junit4:junit4]   2> 1341 T1000 oasc.SolrCore.closeSearcher [collection1] Closing main searcher on request.
[junit4:junit4]   2> 1341 T1000 oasu.DirectUpdateHandler2.close closing DirectUpdateHandler2{commits=1,autocommits=0,soft autocommits=0,optimizes=0,rollbacks=0,expungeDeletes=0,docsPending=0,adds=0,deletesById=0,deletesByQuery=0,errors=0,cumulative_adds=7,cumulative_deletesById=0,cumulative_deletesByQuery=1,cumulative_errors=0}
[junit4:junit4]   2> 1344 T1000 oejsh.ContextHandler.doStop stopped o.e.j.s.ServletContextHandler{/solr,null}
[junit4:junit4]   2> 1397 T1000 oasc.CoreContainer.shutdown Shutting down CoreContainer instance=1317988
[junit4:junit4]   2> 1398 T1000 oasc.SolrCore.close [collection1]  CLOSING SolrCore org.apache.solr.core.SolrCore@122b2cb
[junit4:junit4]   2> 1398 T1000 oasc.SolrCore.closeSearcher [collection1] Closing main searcher on request.
[junit4:junit4]   2> 1399 T1000 oasu.DirectUpdateHandler2.close closing DirectUpdateHandler2{commits=1,autocommits=0,soft autocommits=0,optimizes=0,rollbacks=0,expungeDeletes=0,docsPending=0,adds=0,deletesById=0,deletesByQuery=0,errors=0,cumulative_adds=2,cumulative_deletesById=0,cumulative_deletesByQuery=1,cumulative_errors=0}
[junit4:junit4]   2> 1401 T1000 oejsh.ContextHandler.doStop stopped o.e.j.s.ServletContextHandler{/solr,null}
[junit4:junit4]   2> 1453 T1000 oasc.CoreContainer.shutdown Shutting down CoreContainer instance=23835082
[junit4:junit4]   2> 1453 T1000 oasc.SolrCore.close [collection1]  CLOSING SolrCore org.apache.solr.core.SolrCore@9dea70
[junit4:junit4]   2> 1454 T1000 oasc.SolrCore.closeSearcher [collection1] Closing main searcher on request.
[junit4:junit4]   2> 1455 T1000 oasu.DirectUpdateHandler2.close closing DirectUpdateHandler2{commits=1,autocommits=0,soft autocommits=0,optimizes=0,rollbacks=0,expungeDeletes=0,docsPending=0,adds=0,deletesById=0,deletesByQuery=0,errors=0,cumulative_adds=2,cumulative_deletesById=0,cumulative_deletesByQuery=1,cumulative_errors=0}
[junit4:junit4]   2> 1460 T1000 oejsh.ContextHandler.doStop stopped o.e.j.s.ServletContextHandler{/solr,null}
[junit4:junit4]   2> 1513 T1000 oasc.CoreContainer.shutdown Shutting down CoreContainer instance=1000336
[junit4:junit4]   2> 1514 T1000 oasc.SolrCore.close [collection1]  CLOSING SolrCore org.apache.solr.core.SolrCore@1186785
[junit4:junit4]   2> 1515 T1000 oasc.SolrCore.closeSearcher [collection1] Closing main searcher on request.
[junit4:junit4]   2> 1515 T1000 oasu.DirectUpdateHandler2.close closing DirectUpdateHandler2{commits=1,autocommits=0,soft autocommits=0,optimizes=0,rollbacks=0,expungeDeletes=0,docsPending=0,adds=0,deletesById=0,deletesByQuery=0,errors=0,cumulative_adds=3,cumulative_deletesById=0,cumulative_deletesByQuery=1,cumulative_errors=0}
[junit4:junit4]   2> 1519 T1000 oejsh.ContextHandler.doStop stopped o.e.j.s.ServletContextHandler{/solr,null}
[junit4:junit4]   2> 1570 T1000 oas.SolrTestCaseJ4.tearDown ###Ending testDistribSearch
[junit4:junit4]   2> NOTE: reproduce with: ant test  -Dtestcase=DistributedQueryElevationComponentTest -Dtests.method=testDistribSearch -Dtests.seed=AAD1745D1A1F0C5B -Dtests.multiplier=3 -Dtests.slow=true -Dtests.locale=nl_NL -Dtests.timezone=America/Grenada -Dtests.file.encoding=UTF-8
[junit4:junit4]   2>
[junit4:junit4]    > (@AfterClass output)
[junit4:junit4]   2> 1622 T1000 oas.SolrTestCaseJ4.deleteCore ###deleteCore
[junit4:junit4]   2> NOTE: test params are: codec=Lucene40: {field_t=PostingsFormat(name=MockSep), id=PostingsFormat(name=Asserting), text=PostingsFormat(name=MockSep), plow_t=PostingsFormat(name=Asserting), int_i=PostingsFormat(name=MockSep)}, sim=DefaultSimilarity, locale=nl_NL, timezone=America/Grenada
[junit4:junit4]   2> NOTE: Linux 3.2.0-27-generic i386/Oracle Corporation 1.8.0-ea (32-bit)/cpus=8,threads=1,free=320786872,total=493879296
[junit4:junit4]   2> NOTE: All tests run in this JVM: [SimpleFacetsTest, OverseerTest, TestMergePolicyConfig, PrimUtilsTest, TestRemoteStreaming, PrimitiveFieldTypeTest, TestPHPSerializedResponseWriter, BadIndexSchemaTest, TestOmitPositions, QueryElevationComponentTest, TestBinaryResponseWriter, TimeZoneUtilsTest, TestSolrDeletionPolicy2, ZkControllerTest, TestFoldingMultitermQuery, TestDFRSimilarityFactory, SyncSliceTest, SuggesterWFSTTest, LegacyHTMLStripCharFilterTest, JsonLoaderTest, TestBinaryField, MultiTermTest, TestLRUCache, TestJoin, SampleTest, TestQuerySenderListener, TestSolrXMLSerializer, SuggesterTSTTest, TestRealTimeGet, TestHashPartitioner, QueryEqualityTest, DisMaxRequestHandlerTest, TestPropInject, FieldAnalysisRequestHandlerTest, TestSolrCoreProperties, IndexBasedSpellCheckerTest, LukeRequestHandlerTest, PolyFieldTest, BasicZkTest, ReturnFieldsTest, ScriptEngineTest, IndexReaderFactoryTest, SpellCheckCollatorTest, DistributedQueryElevationComponentTest]
[junit4:junit4]   2> 
[junit4:junit4] Completed on J1 in 1.64s, 1 test, 1 failure <<< FAILURES!

[...truncated 454 lines...]
BUILD FAILED
/mnt/ssd/jenkins/workspace/Lucene-Solr-4.x-Linux/checkout/build.xml:29: The following error occurred while executing this line:
/mnt/ssd/jenkins/workspace/Lucene-Solr-4.x-Linux/checkout/solr/build.xml:144: The following error occurred while executing this line:
/mnt/ssd/jenkins/workspace/Lucene-Solr-4.x-Linux/checkout/lucene/module-build.xml:62: The following error occurred while executing this line:
/mnt/ssd/jenkins/workspace/Lucene-Solr-4.x-Linux/checkout/lucene/common-build.xml:1095: The following error occurred while executing this line:
/mnt/ssd/jenkins/workspace/Lucene-Solr-4.x-Linux/checkout/lucene/common-build.xml:790: There were test failures: 224 suites, 903 tests, 1 failure, 5 ignored

Total time: 21 minutes 3 seconds
Build step 'Execute shell' marked build as failure
Archiving artifacts
Recording test results
Email was triggered for: Failure
Sending email for trigger: Failure



Mime
View raw message