lucene-dev mailing list archives

Site index · List index
Message view « Date » · « Thread »
Top « Date » · « Thread »
From Policeman Jenkins Server <jenk...@sd-datasolutions.de>
Subject [JENKINS] Lucene-Solr-trunk-Windows (32bit/jdk1.7.0_06) - Build # 437 - Still Failing!
Date Sat, 25 Aug 2012 02:48:06 GMT
Build: http://jenkins.sd-datasolutions.de/job/Lucene-Solr-trunk-Windows/437/
Java: 32bit/jdk1.7.0_06 -server -XX:+UseConcMarkSweepGC

1 tests failed.
REGRESSION:  org.apache.solr.spelling.suggest.SuggesterFSTTest.testRebuild

Error Message:
Exception during query

Stack Trace:
java.lang.RuntimeException: Exception during query
	at __randomizedtesting.SeedInfo.seed([6882DDFB35222062:33A77FB801225AF8]:0)
	at org.apache.solr.SolrTestCaseJ4.assertQ(SolrTestCaseJ4.java:493)
	at org.apache.solr.SolrTestCaseJ4.assertQ(SolrTestCaseJ4.java:460)
	at org.apache.solr.spelling.suggest.SuggesterTest.testRebuild(SuggesterTest.java:105)
	at sun.reflect.NativeMethodAccessorImpl.invoke0(Native Method)
	at sun.reflect.NativeMethodAccessorImpl.invoke(NativeMethodAccessorImpl.java:57)
	at sun.reflect.DelegatingMethodAccessorImpl.invoke(DelegatingMethodAccessorImpl.java:43)
	at java.lang.reflect.Method.invoke(Method.java:601)
	at com.carrotsearch.randomizedtesting.RandomizedRunner.invoke(RandomizedRunner.java:1559)
	at com.carrotsearch.randomizedtesting.RandomizedRunner.access$600(RandomizedRunner.java:79)
	at com.carrotsearch.randomizedtesting.RandomizedRunner$6.evaluate(RandomizedRunner.java:737)
	at com.carrotsearch.randomizedtesting.RandomizedRunner$7.evaluate(RandomizedRunner.java:773)
	at com.carrotsearch.randomizedtesting.RandomizedRunner$8.evaluate(RandomizedRunner.java:787)
	at com.carrotsearch.randomizedtesting.rules.SystemPropertiesRestoreRule$1.evaluate(SystemPropertiesRestoreRule.java:53)
	at org.apache.lucene.util.TestRuleSetupTeardownChained$1.evaluate(TestRuleSetupTeardownChained.java:50)
	at org.apache.lucene.util.TestRuleFieldCacheSanity$1.evaluate(TestRuleFieldCacheSanity.java:51)
	at org.apache.lucene.util.AbstractBeforeAfterRule$1.evaluate(AbstractBeforeAfterRule.java:45)
	at com.carrotsearch.randomizedtesting.rules.SystemPropertiesInvariantRule$1.evaluate(SystemPropertiesInvariantRule.java:55)
	at org.apache.lucene.util.TestRuleThreadAndTestName$1.evaluate(TestRuleThreadAndTestName.java:48)
	at org.apache.lucene.util.TestRuleIgnoreAfterMaxFailures$1.evaluate(TestRuleIgnoreAfterMaxFailures.java:70)
	at org.apache.lucene.util.TestRuleMarkFailure$1.evaluate(TestRuleMarkFailure.java:48)
	at com.carrotsearch.randomizedtesting.rules.StatementAdapter.evaluate(StatementAdapter.java:36)
	at com.carrotsearch.randomizedtesting.ThreadLeakControl$StatementRunner.run(ThreadLeakControl.java:345)
	at com.carrotsearch.randomizedtesting.ThreadLeakControl.forkTimeoutingTask(ThreadLeakControl.java:769)
	at com.carrotsearch.randomizedtesting.ThreadLeakControl$3.evaluate(ThreadLeakControl.java:429)
	at com.carrotsearch.randomizedtesting.RandomizedRunner.runSingleTest(RandomizedRunner.java:746)
	at com.carrotsearch.randomizedtesting.RandomizedRunner$3.evaluate(RandomizedRunner.java:648)
	at com.carrotsearch.randomizedtesting.RandomizedRunner$4.evaluate(RandomizedRunner.java:682)
	at com.carrotsearch.randomizedtesting.RandomizedRunner$5.evaluate(RandomizedRunner.java:693)
	at com.carrotsearch.randomizedtesting.rules.StatementAdapter.evaluate(StatementAdapter.java:36)
	at com.carrotsearch.randomizedtesting.rules.SystemPropertiesRestoreRule$1.evaluate(SystemPropertiesRestoreRule.java:53)
	at org.apache.lucene.util.AbstractBeforeAfterRule$1.evaluate(AbstractBeforeAfterRule.java:45)
	at org.apache.lucene.util.TestRuleStoreClassName$1.evaluate(TestRuleStoreClassName.java:42)
	at com.carrotsearch.randomizedtesting.rules.SystemPropertiesInvariantRule$1.evaluate(SystemPropertiesInvariantRule.java:55)
	at com.carrotsearch.randomizedtesting.rules.NoShadowingOrOverridesOnMethodsRule$1.evaluate(NoShadowingOrOverridesOnMethodsRule.java:39)
	at com.carrotsearch.randomizedtesting.rules.NoShadowingOrOverridesOnMethodsRule$1.evaluate(NoShadowingOrOverridesOnMethodsRule.java:39)
	at org.apache.lucene.util.TestRuleAssertionsRequired$1.evaluate(TestRuleAssertionsRequired.java:40)
	at org.apache.lucene.util.TestRuleMarkFailure$1.evaluate(TestRuleMarkFailure.java:48)
	at org.apache.lucene.util.TestRuleIgnoreAfterMaxFailures$1.evaluate(TestRuleIgnoreAfterMaxFailures.java:70)
	at org.apache.lucene.util.TestRuleIgnoreTestSuites$1.evaluate(TestRuleIgnoreTestSuites.java:55)
	at com.carrotsearch.randomizedtesting.rules.StatementAdapter.evaluate(StatementAdapter.java:36)
	at com.carrotsearch.randomizedtesting.ThreadLeakControl$StatementRunner.run(ThreadLeakControl.java:345)
	at java.lang.Thread.run(Thread.java:722)
Caused by: java.lang.NullPointerException
	at org.apache.lucene.search.suggest.fst.FSTCompletionLookup.lookup(FSTCompletionLookup.java:240)
	at org.apache.solr.spelling.suggest.Suggester.getSuggestions(Suggester.java:190)
	at org.apache.solr.handler.component.SpellCheckComponent.process(SpellCheckComponent.java:172)
	at org.apache.solr.handler.component.SearchHandler.handleRequestBody(SearchHandler.java:206)
	at org.apache.solr.handler.RequestHandlerBase.handleRequest(RequestHandlerBase.java:129)
	at org.apache.solr.core.SolrCore.execute(SolrCore.java:1672)
	at org.apache.solr.util.TestHarness.query(TestHarness.java:351)
	at org.apache.solr.util.TestHarness.query(TestHarness.java:333)
	at org.apache.solr.SolrTestCaseJ4.assertQ(SolrTestCaseJ4.java:467)
	... 41 more




Build Log:
[...truncated 7433 lines...]
[junit4:junit4] Suite: org.apache.solr.spelling.suggest.SuggesterFSTTest
[junit4:junit4]   2> 0 T3409 oas.SolrTestCaseJ4.initCore ####initCore
[junit4:junit4]   2> Creating dataDir: C:\Jenkins\workspace\Lucene-Solr-trunk-Windows\solr\build\solr-core\test\J0\.\solrtest-SuggesterFSTTest-1345862719297
[junit4:junit4]   2> 0 T3409 oasc.SolrResourceLoader.<init> new SolrResourceLoader for directory: 'C:\Jenkins\workspace\Lucene-Solr-trunk-Windows\solr\build\solr-core\test-files\solr\collection1\'
[junit4:junit4]   2> 1 T3409 oasc.SolrResourceLoader.replaceClassLoader Adding 'file:/C:/Jenkins/workspace/Lucene-Solr-trunk-Windows/solr/build/solr-core/test-files/solr/collection1/lib/classes/' to classloader
[junit4:junit4]   2> 1 T3409 oasc.SolrResourceLoader.replaceClassLoader Adding 'file:/C:/Jenkins/workspace/Lucene-Solr-trunk-Windows/solr/build/solr-core/test-files/solr/collection1/lib/README' to classloader
[junit4:junit4]   2> 47 T3409 oasc.SolrConfig.<init> Using Lucene MatchVersion: LUCENE_50
[junit4:junit4]   2> 111 T3409 oasc.SolrConfig.<init> Loaded SolrConfig: solrconfig-spellchecker.xml
[junit4:junit4]   2> 112 T3409 oass.IndexSchema.readSchema Reading Solr Schema
[junit4:junit4]   2> 115 T3409 oass.IndexSchema.readSchema Schema name=Solr SpellCheck Test
[junit4:junit4]   2> 159 T3409 oass.IndexSchema.readSchema default search field in schema is text
[junit4:junit4]   2> 160 T3409 oass.IndexSchema.readSchema query parser default operator is OR
[junit4:junit4]   2> 161 T3409 oass.IndexSchema.readSchema unique key field: id
[junit4:junit4]   2> 163 T3409 oasc.SolrResourceLoader.locateSolrHome JNDI not configured for solr (NoInitialContextEx)
[junit4:junit4]   2> 164 T3409 oasc.SolrResourceLoader.locateSolrHome using system property solr.solr.home: C:\Jenkins\workspace\Lucene-Solr-trunk-Windows\solr\build\solr-core\test-files\solr
[junit4:junit4]   2> 164 T3409 oasc.SolrResourceLoader.<init> new SolrResourceLoader for directory: 'C:\Jenkins\workspace\Lucene-Solr-trunk-Windows\solr\build\solr-core\test-files\solr\'
[junit4:junit4]   2> 173 T3409 oasc.CoreContainer.<init> New CoreContainer 24898075
[junit4:junit4]   2> 174 T3409 oasc.SolrCore.<init> [collection1] Opening new SolrCore at C:\Jenkins\workspace\Lucene-Solr-trunk-Windows\solr\build\solr-core\test-files\solr\collection1\, dataDir=C:\Jenkins\workspace\Lucene-Solr-trunk-Windows\solr\build\solr-core\test\J0\.\solrtest-SuggesterFSTTest-1345862719297\
[junit4:junit4]   2> 174 T3409 oasc.SolrCore.<init> JMX monitoring not detected for core: collection1
[junit4:junit4]   2> 174 T3409 oasc.SolrCore.getNewIndexDir WARNING New index directory detected: old=null new=C:\Jenkins\workspace\Lucene-Solr-trunk-Windows\solr\build\solr-core\test\J0\.\solrtest-SuggesterFSTTest-1345862719297\index/
[junit4:junit4]   2> 175 T3409 oasc.SolrCore.initIndex WARNING [collection1] Solr index directory 'C:\Jenkins\workspace\Lucene-Solr-trunk-Windows\solr\build\solr-core\test\J0\.\solrtest-SuggesterFSTTest-1345862719297\index' doesn't exist. Creating new index...
[junit4:junit4]   2> 176 T3409 oasc.CachingDirectoryFactory.get return new directory for C:\Jenkins\workspace\Lucene-Solr-trunk-Windows\solr\build\solr-core\test\J0\.\solrtest-SuggesterFSTTest-1345862719297\index forceNew:false
[junit4:junit4]   2> 179 T3409 oasc.SolrDeletionPolicy.onCommit SolrDeletionPolicy.onCommit: commits:num=1
[junit4:junit4]   2> 		commit{dir=MockDirWrapper(org.apache.lucene.store.MMapDirectory@C:\Jenkins\workspace\Lucene-Solr-trunk-Windows\solr\build\solr-core\test\J0\solrtest-SuggesterFSTTest-1345862719297\index lockFactory=org.apache.lucene.store.NativeFSLockFactory@1168d3d),segFN=segments_1,generation=1,filenames=[segments_1]
[junit4:junit4]   2> 179 T3409 oasc.SolrDeletionPolicy.updateCommits newest commit = 1
[junit4:junit4]   2> 180 T3409 oasc.RequestHandlers.initHandlersFromConfig created standard: solr.StandardRequestHandler
[junit4:junit4]   2> 180 T3409 oasc.RequestHandlers.initHandlersFromConfig created /suggest: org.apache.solr.handler.component.SearchHandler
[junit4:junit4]   2> 180 T3409 oasc.RequestHandlers.initHandlersFromConfig created /suggest_tst: org.apache.solr.handler.component.SearchHandler
[junit4:junit4]   2> 180 T3409 oasc.RequestHandlers.initHandlersFromConfig created /suggest_fst: org.apache.solr.handler.component.SearchHandler
[junit4:junit4]   2> 181 T3409 oasc.RequestHandlers.initHandlersFromConfig created /suggest_wfst: org.apache.solr.handler.component.SearchHandler
[junit4:junit4]   2> 185 T3409 oass.SolrIndexSearcher.<init> Opening Searcher@15e28d5 main
[junit4:junit4]   2> 185 T3409 oass.SolrIndexSearcher.getIndexDir WARNING WARNING: Directory impl does not support setting indexDir: org.apache.lucene.store.MockDirectoryWrapper
[junit4:junit4]   2> 185 T3409 oasu.CommitTracker.<init> Hard AutoCommit: disabled
[junit4:junit4]   2> 185 T3409 oasu.CommitTracker.<init> Soft AutoCommit: disabled
[junit4:junit4]   2> 185 T3409 oashc.SpellCheckComponent.inform Initializing spell checkers
[junit4:junit4]   2> 185 T3409 oasss.Suggester.init init: {name=suggest,classname=org.apache.solr.spelling.suggest.Suggester,lookupImpl=org.apache.solr.spelling.suggest.jaspell.JaspellLookup,field=suggest,storeDir=suggest,buildOnCommit=true,threshold=0.0}
[junit4:junit4]   2> 185 T3409 oasssj.JaspellLookupFactory.create init: {name=suggest,classname=org.apache.solr.spelling.suggest.Suggester,lookupImpl=org.apache.solr.spelling.suggest.jaspell.JaspellLookup,field=suggest,storeDir=suggest,buildOnCommit=true,threshold=0.0}
[junit4:junit4]   2> 186 T3409 oashc.SpellCheckComponent.inform Registering newSearcher listener for spellchecker: suggest
[junit4:junit4]   2> 186 T3409 oashc.SpellCheckComponent.inform No queryConverter defined, using default converter
[junit4:junit4]   2> 186 T3409 oashc.SpellCheckComponent.inform Initializing spell checkers
[junit4:junit4]   2> 186 T3409 oasss.Suggester.init init: {name=suggest_tst,classname=org.apache.solr.spelling.suggest.Suggester,lookupImpl=org.apache.solr.spelling.suggest.tst.TSTLookup,field=suggest,storeDir=suggest_tst,buildOnCommit=true,threshold=0.0}
[junit4:junit4]   2> 187 T3409 oashc.SpellCheckComponent.inform Registering newSearcher listener for spellchecker: suggest_tst
[junit4:junit4]   2> 187 T3409 oashc.SpellCheckComponent.inform No queryConverter defined, using default converter
[junit4:junit4]   2> 187 T3409 oashc.SpellCheckComponent.inform Initializing spell checkers
[junit4:junit4]   2> 187 T3409 oasss.Suggester.init init: {name=suggest_fst,classname=org.apache.solr.spelling.suggest.Suggester,lookupImpl=org.apache.solr.spelling.suggest.fst.FSTLookup,field=suggest,storeDir=suggest_fst,buildOnCommit=true,weightBuckets=5,exactMatchFirst=true}
[junit4:junit4]   2> 188 T3409 oashc.SpellCheckComponent.inform Registering newSearcher listener for spellchecker: suggest_fst
[junit4:junit4]   2> 188 T3409 oashc.SpellCheckComponent.inform No queryConverter defined, using default converter
[junit4:junit4]   2> 188 T3409 oashc.SpellCheckComponent.inform Initializing spell checkers
[junit4:junit4]   2> 188 T3409 oasss.Suggester.init init: {name=suggest_wfst,classname=org.apache.solr.spelling.suggest.Suggester,lookupImpl=org.apache.solr.spelling.suggest.fst.WFSTLookupFactory,field=suggest,storeDir=suggest_wfst,buildOnCommit=true,exactMatchFirst=true}
[junit4:junit4]   2> 188 T3409 oashc.SpellCheckComponent.inform Registering newSearcher listener for spellchecker: suggest_wfst
[junit4:junit4]   2> 189 T3409 oashc.SpellCheckComponent.inform No queryConverter defined, using default converter
[junit4:junit4]   2> 189 T3409 oashc.HttpShardHandlerFactory.getParameter Setting socketTimeout to: 0
[junit4:junit4]   2> 189 T3409 oashc.HttpShardHandlerFactory.getParameter Setting urlScheme to: http://
[junit4:junit4]   2> 189 T3409 oashc.HttpShardHandlerFactory.getParameter Setting connTimeout to: 0
[junit4:junit4]   2> 189 T3409 oashc.HttpShardHandlerFactory.getParameter Setting maxConnectionsPerHost to: 20
[junit4:junit4]   2> 189 T3409 oashc.HttpShardHandlerFactory.getParameter Setting corePoolSize to: 0
[junit4:junit4]   2> 189 T3409 oashc.HttpShardHandlerFactory.getParameter Setting maximumPoolSize to: 2147483647
[junit4:junit4]   2> 189 T3409 oashc.HttpShardHandlerFactory.getParameter Setting maxThreadIdleTime to: 5
[junit4:junit4]   2> 190 T3409 oashc.HttpShardHandlerFactory.getParameter Setting sizeOfQueue to: -1
[junit4:junit4]   2> 190 T3409 oashc.HttpShardHandlerFactory.getParameter Setting fairnessPolicy to: false
[junit4:junit4]   2> 190 T3409 oascsi.HttpClientUtil.createClient Creating new http client, config:maxConnectionsPerHost=20&maxConnections=10000&socketTimeout=0&connTimeout=0&retry=false
[junit4:junit4]   2> 193 T3409 oasc.CoreContainer.register registering core: collection1
[junit4:junit4]   2> 193 T3409 oas.SolrTestCaseJ4.initCore ####initCore end
[junit4:junit4]   2> 202 T3409 oas.SolrTestCaseJ4.setUp ###Starting testRebuild
[junit4:junit4]   2> ASYNC  NEW_CORE C268 name=collection1 org.apache.solr.core.SolrCore@1effb9
[junit4:junit4]   2> 208 T3409 C268 oasc.SolrDeletionPolicy.onInit SolrDeletionPolicy.onInit: commits:num=1
[junit4:junit4]   2> 		commit{dir=MockDirWrapper(org.apache.lucene.store.MMapDirectory@C:\Jenkins\workspace\Lucene-Solr-trunk-Windows\solr\build\solr-core\test\J0\solrtest-SuggesterFSTTest-1345862719297\index lockFactory=org.apache.lucene.store.NativeFSLockFactory@1168d3d),segFN=segments_1,generation=1,filenames=[segments_1]
[junit4:junit4]   2> 208 T3409 C268 oasc.SolrDeletionPolicy.updateCommits newest commit = 1
[junit4:junit4]   2> 213 T3409 C268 UPDATE [collection1] webapp=null path=null params={} {add=[1]} 0 8
[junit4:junit4]   2> 218 T3409 C268 UPDATE [collection1] webapp=null path=null params={} {add=[2]} 0 0
[junit4:junit4]   2> 227 T3409 C268 UPDATE [collection1] webapp=null path=null params={} {add=[3]} 0 0
[junit4:junit4]   2> 232 T3409 C268 oasu.DirectUpdateHandler2.commit start commit{flags=0,_version_=0,optimize=false,openSearcher=true,waitSearcher=true,expungeDeletes=false,softCommit=false}
[junit4:junit4]   2> 239 T3409 C268 oasc.SolrDeletionPolicy.onCommit SolrDeletionPolicy.onCommit: commits:num=2
[junit4:junit4]   2> 		commit{dir=MockDirWrapper(org.apache.lucene.store.MMapDirectory@C:\Jenkins\workspace\Lucene-Solr-trunk-Windows\solr\build\solr-core\test\J0\solrtest-SuggesterFSTTest-1345862719297\index lockFactory=org.apache.lucene.store.NativeFSLockFactory@1168d3d),segFN=segments_1,generation=1,filenames=[segments_1]
[junit4:junit4]   2> 		commit{dir=MockDirWrapper(org.apache.lucene.store.MMapDirectory@C:\Jenkins\workspace\Lucene-Solr-trunk-Windows\solr\build\solr-core\test\J0\solrtest-SuggesterFSTTest-1345862719297\index lockFactory=org.apache.lucene.store.NativeFSLockFactory@1168d3d),segFN=segments_2,generation=2,filenames=[_0_Block_0.pos, _0_Block_0.tip, _0_MockRandom_0.tib, _0.fnm, _0_Pulsing40_0.tim, _0_Block_0.doc, _0_Block_0.tim, _0_MockRandom_0.prx, _0_nrm.cfs, _0_Pulsing40_0.prx, _0_Pulsing40_0.frq, _0_MockRandom_0.frq, _0_MockRandom_0.sd, _0_MockRandom_0.tiv, _0_SimpleText_0.pst, _0_nrm.cfe, _0_Pulsing40_0.tip, segments_2, _0.fdx, _0.si, _0.fdt]
[junit4:junit4]   2> 240 T3409 C268 oasc.SolrDeletionPolicy.updateCommits newest commit = 2
[junit4:junit4]   2> 240 T3409 C268 oasc.SolrCore.getSearcher WARNING [collection1] PERFORMANCE WARNING: Overlapping onDeckSearchers=2
[junit4:junit4]   2> 246 T3409 C268 oass.SolrIndexSearcher.<init> Opening Searcher@e00ce0 main
[junit4:junit4]   2> 246 T3409 C268 oass.SolrIndexSearcher.getIndexDir WARNING WARNING: Directory impl does not support setting indexDir: org.apache.lucene.store.MockDirectoryWrapper
[junit4:junit4]   2> 246 T3409 C268 oasu.DirectUpdateHandler2.commit end_commit_flush
[junit4:junit4]   2> 247 T3410 oasc.SolrCore.registerSearcher [collection1] Registered new searcher Searcher@15e28d5 main{StandardDirectoryReader(segments_1:1)}
[junit4:junit4]   2> 247 T3410 oashc.SpellCheckComponent$SpellCheckerListener.newSearcher Loading spell index for spellchecker: suggest
[junit4:junit4]   2> 247 T3410 oasss.Suggester.reload reload()
[junit4:junit4]   2> 248 T3410 oashc.SpellCheckComponent$SpellCheckerListener.newSearcher SEVERE Exception in reloading spell check index for spellchecker: suggest java.io.FileNotFoundException: C:\Jenkins\workspace\Lucene-Solr-trunk-Windows\solr\build\solr-core\test\J0\.\solrtest-SuggesterFSTTest-1345862719297\suggest\jaspell.dat (The system cannot find the file specified)
[junit4:junit4]   2> 	at java.io.FileInputStream.open(Native Method)
[junit4:junit4]   2> 	at java.io.FileInputStream.<init>(FileInputStream.java:138)
[junit4:junit4]   2> 	at org.apache.solr.spelling.suggest.Suggester.reload(Suggester.java:161)
[junit4:junit4]   2> 	at org.apache.solr.handler.component.SpellCheckComponent$SpellCheckerListener.newSearcher(SpellCheckComponent.java:673)
[junit4:junit4]   2> 	at org.apache.solr.core.SolrCore$5.call(SolrCore.java:1452)
[junit4:junit4]   2> 	at java.util.concurrent.FutureTask$Sync.innerRun(FutureTask.java:334)
[junit4:junit4]   2> 	at java.util.concurrent.FutureTask.run(FutureTask.java:166)
[junit4:junit4]   2> 	at java.util.concurrent.ThreadPoolExecutor.runWorker(ThreadPoolExecutor.java:1110)
[junit4:junit4]   2> 	at java.util.concurrent.ThreadPoolExecutor$Worker.run(ThreadPoolExecutor.java:603)
[junit4:junit4]   2> 	at java.lang.Thread.run(Thread.java:722)
[junit4:junit4]   2> 
[junit4:junit4]   2> 248 T3410 oashc.SpellCheckComponent$SpellCheckerListener.newSearcher Loading spell index for spellchecker: suggest_tst
[junit4:junit4]   2> 248 T3410 oasss.Suggester.reload reload()
[junit4:junit4]   2> 248 T3410 oashc.SpellCheckComponent$SpellCheckerListener.newSearcher SEVERE Exception in reloading spell check index for spellchecker: suggest_tst java.io.FileNotFoundException: C:\Jenkins\workspace\Lucene-Solr-trunk-Windows\solr\build\solr-core\test\J0\.\solrtest-SuggesterFSTTest-1345862719297\suggest_tst\tst.dat (The system cannot find the file specified)
[junit4:junit4]   2> 	at java.io.FileInputStream.open(Native Method)
[junit4:junit4]   2> 	at java.io.FileInputStream.<init>(FileInputStream.java:138)
[junit4:junit4]   2> 	at org.apache.solr.spelling.suggest.Suggester.reload(Suggester.java:161)
[junit4:junit4]   2> 	at org.apache.solr.handler.component.SpellCheckComponent$SpellCheckerListener.newSearcher(SpellCheckComponent.java:673)
[junit4:junit4]   2> 	at org.apache.solr.core.SolrCore$5.call(SolrCore.java:1452)
[junit4:junit4]   2> 	at java.util.concurrent.FutureTask$Sync.innerRun(FutureTask.java:334)
[junit4:junit4]   2> 	at java.util.concurrent.FutureTask.run(FutureTask.java:166)
[junit4:junit4]   2> 	at java.util.concurrent.ThreadPoolExecutor.runWorker(ThreadPoolExecutor.java:1110)
[junit4:junit4]   2> 	at java.util.concurrent.ThreadPoolExecutor$Worker.run(ThreadPoolExecutor.java:603)
[junit4:junit4]   2> 	at java.lang.Thread.run(Thread.java:722)
[junit4:junit4]   2> 
[junit4:junit4]   2> 248 T3410 oashc.SpellCheckComponent$SpellCheckerListener.newSearcher Loading spell index for spellchecker: suggest_fst
[junit4:junit4]   2> 248 T3410 oasss.Suggester.reload reload()
[junit4:junit4]   2> 248 T3410 oashc.SpellCheckComponent$SpellCheckerListener.newSearcher SEVERE Exception in reloading spell check index for spellchecker: suggest_fst java.io.FileNotFoundException: C:\Jenkins\workspace\Lucene-Solr-trunk-Windows\solr\build\solr-core\test\J0\.\solrtest-SuggesterFSTTest-1345862719297\suggest_fst\fst.bin (The system cannot find the file specified)
[junit4:junit4]   2> 	at java.io.FileInputStream.open(Native Method)
[junit4:junit4]   2> 	at java.io.FileInputStream.<init>(FileInputStream.java:138)
[junit4:junit4]   2> 	at org.apache.solr.spelling.suggest.Suggester.reload(Suggester.java:161)
[junit4:junit4]   2> 	at org.apache.solr.handler.component.SpellCheckComponent$SpellCheckerListener.newSearcher(SpellCheckComponent.java:673)
[junit4:junit4]   2> 	at org.apache.solr.core.SolrCore$5.call(SolrCore.java:1452)
[junit4:junit4]   2> 	at java.util.concurrent.FutureTask$Sync.innerRun(FutureTask.java:334)
[junit4:junit4]   2> 	at java.util.concurrent.FutureTask.run(FutureTask.java:166)
[junit4:junit4]   2> 	at java.util.concurrent.ThreadPoolExecutor.runWorker(ThreadPoolExecutor.java:1110)
[junit4:junit4]   2> 	at java.util.concurrent.ThreadPoolExecutor$Worker.run(ThreadPoolExecutor.java:603)
[junit4:junit4]   2> 	at java.lang.Thread.run(Thread.java:722)
[junit4:junit4]   2> 
[junit4:junit4]   2> 248 T3410 oashc.SpellCheckComponent$SpellCheckerListener.newSearcher Loading spell index for spellchecker: suggest_wfst
[junit4:junit4]   2> 248 T3410 oasss.Suggester.reload reload()
[junit4:junit4]   2> 248 T3410 oashc.SpellCheckComponent$SpellCheckerListener.newSearcher SEVERE Exception in reloading spell check index for spellchecker: suggest_wfst java.io.FileNotFoundException: C:\Jenkins\workspace\Lucene-Solr-trunk-Windows\solr\build\solr-core\test\J0\.\solrtest-SuggesterFSTTest-1345862719297\suggest_wfst\wfst.bin (The system cannot find the file specified)
[junit4:junit4]   2> 	at java.io.FileInputStream.open(Native Method)
[junit4:junit4]   2> 	at java.io.FileInputStream.<init>(FileInputStream.java:138)
[junit4:junit4]   2> 	at org.apache.solr.spelling.suggest.Suggester.reload(Suggester.java:161)
[junit4:junit4]   2> 	at org.apache.solr.handler.component.SpellCheckComponent$SpellCheckerListener.newSearcher(SpellCheckComponent.java:673)
[junit4:junit4]   2> 	at org.apache.solr.core.SolrCore$5.call(SolrCore.java:1452)
[junit4:junit4]   2> 	at java.util.concurrent.FutureTask$Sync.innerRun(FutureTask.java:334)
[junit4:junit4]   2> 	at java.util.concurrent.FutureTask.run(FutureTask.java:166)
[junit4:junit4]   2> 	at java.util.concurrent.ThreadPoolExecutor.runWorker(ThreadPoolExecutor.java:1110)
[junit4:junit4]   2> 	at java.util.concurrent.ThreadPoolExecutor$Worker.run(ThreadPoolExecutor.java:603)
[junit4:junit4]   2> 	at java.lang.Thread.run(Thread.java:722)
[junit4:junit4]   2> 
[junit4:junit4]   2> 250 T3410 oasc.SolrCore.registerSearcher [collection1] Registered new searcher Searcher@e00ce0 main{StandardDirectoryReader(segments_2:3 _0(5.0):C3)}
[junit4:junit4]   2> 251 T3409 C268 UPDATE [collection1] webapp=null path=null params={} {commit=} 0 19
[junit4:junit4]   2> 251 T3409 C268 oasc.SolrException.log SEVERE java.lang.NullPointerException
[junit4:junit4]   2> 		at org.apache.lucene.search.suggest.fst.FSTCompletionLookup.lookup(FSTCompletionLookup.java:240)
[junit4:junit4]   2> 		at org.apache.solr.spelling.suggest.Suggester.getSuggestions(Suggester.java:190)
[junit4:junit4]   2> 		at org.apache.solr.handler.component.SpellCheckComponent.process(SpellCheckComponent.java:172)
[junit4:junit4]   2> 		at org.apache.solr.handler.component.SearchHandler.handleRequestBody(SearchHandler.java:206)
[junit4:junit4]   2> 		at org.apache.solr.handler.RequestHandlerBase.handleRequest(RequestHandlerBase.java:129)
[junit4:junit4]   2> 		at org.apache.solr.core.SolrCore.execute(SolrCore.java:1672)
[junit4:junit4]   2> 		at org.apache.solr.util.TestHarness.query(TestHarness.java:351)
[junit4:junit4]   2> 		at org.apache.solr.util.TestHarness.query(TestHarness.java:333)
[junit4:junit4]   2> 		at org.apache.solr.SolrTestCaseJ4.assertQ(SolrTestCaseJ4.java:467)
[junit4:junit4]   2> 		at org.apache.solr.SolrTestCaseJ4.assertQ(SolrTestCaseJ4.java:460)
[junit4:junit4]   2> 		at org.apache.solr.spelling.suggest.SuggesterTest.testRebuild(SuggesterTest.java:105)
[junit4:junit4]   2> 		at sun.reflect.NativeMethodAccessorImpl.invoke0(Native Method)
[junit4:junit4]   2> 		at sun.reflect.NativeMethodAccessorImpl.invoke(NativeMethodAccessorImpl.java:57)
[junit4:junit4]   2> 		at sun.reflect.DelegatingMethodAccessorImpl.invoke(DelegatingMethodAccessorImpl.java:43)
[junit4:junit4]   2> 		at java.lang.reflect.Method.invoke(Method.java:601)
[junit4:junit4]   2> 		at com.carrotsearch.randomizedtesting.RandomizedRunner.invoke(RandomizedRunner.java:1559)
[junit4:junit4]   2> 		at com.carrotsearch.randomizedtesting.RandomizedRunner.access$600(RandomizedRunner.java:79)
[junit4:junit4]   2> 		at com.carrotsearch.randomizedtesting.RandomizedRunner$6.evaluate(RandomizedRunner.java:737)
[junit4:junit4]   2> 		at com.carrotsearch.randomizedtesting.RandomizedRunner$7.evaluate(RandomizedRunner.java:773)
[junit4:junit4]   2> 		at com.carrotsearch.randomizedtesting.RandomizedRunner$8.evaluate(RandomizedRunner.java:787)
[junit4:junit4]   2> 		at com.carrotsearch.randomizedtesting.rules.SystemPropertiesRestoreRule$1.evaluate(SystemPropertiesRestoreRule.java:53)
[junit4:junit4]   2> 		at org.apache.lucene.util.TestRuleSetupTeardownChained$1.evaluate(TestRuleSetupTeardownChained.java:50)
[junit4:junit4]   2> 		at org.apache.lucene.util.TestRuleFieldCacheSanity$1.evaluate(TestRuleFieldCacheSanity.java:51)
[junit4:junit4]   2> 		at org.apache.lucene.util.AbstractBeforeAfterRule$1.evaluate(AbstractBeforeAfterRule.java:45)
[junit4:junit4]   2> 		at com.carrotsearch.randomizedtesting.rules.SystemPropertiesInvariantRule$1.evaluate(SystemPropertiesInvariantRule.java:55)
[junit4:junit4]   2> 		at org.apache.lucene.util.TestRuleThreadAndTestName$1.evaluate(TestRuleThreadAndTestName.java:48)
[junit4:junit4]   2> 		at org.apache.lucene.util.TestRuleIgnoreAfterMaxFailures$1.evaluate(TestRuleIgnoreAfterMaxFailures.java:70)
[junit4:junit4]   2> 		at org.apache.lucene.util.TestRuleMarkFailure$1.evaluate(TestRuleMarkFailure.java:48)
[junit4:junit4]   2> 		at com.carrotsearch.randomizedtesting.rules.StatementAdapter.evaluate(StatementAdapter.java:36)
[junit4:junit4]   2> 		at com.carrotsearch.randomizedtesting.ThreadLeakControl$StatementRunner.run(ThreadLeakControl.java:345)
[junit4:junit4]   2> 		at com.carrotsearch.randomizedtesting.ThreadLeakControl.forkTimeoutingTask(ThreadLeakControl.java:769)
[junit4:junit4]   2> 		at com.carrotsearch.randomizedtesting.ThreadLeakControl$3.evaluate(ThreadLeakControl.java:429)
[junit4:junit4]   2> 		at com.carrotsearch.randomizedtesting.RandomizedRunner.runSingleTest(RandomizedRunner.java:746)
[junit4:junit4]   2> 		at com.carrotsearch.randomizedtesting.RandomizedRunner$3.evaluate(RandomizedRunner.java:648)
[junit4:junit4]   2> 		at com.carrotsearch.randomizedtesting.RandomizedRunner$4.evaluate(RandomizedRunner.java:682)
[junit4:junit4]   2> 		at com.carrotsearch.randomizedtesting.RandomizedRunner$5.evaluate(RandomizedRunner.java:693)
[junit4:junit4]   2> 		at com.carrotsearch.randomizedtesting.rules.StatementAdapter.evaluate(StatementAdapter.java:36)
[junit4:junit4]   2> 		at com.carrotsearch.randomizedtesting.rules.SystemPropertiesRestoreRule$1.evaluate(SystemPropertiesRestoreRule.java:53)
[junit4:junit4]   2> 		at org.apache.lucene.util.AbstractBeforeAfterRule$1.evaluate(AbstractBeforeAfterRule.java:45)
[junit4:junit4]   2> 		at org.apache.lucene.util.TestRuleStoreClassName$1.evaluate(TestRuleStoreClassName.java:42)
[junit4:junit4]   2> 		at com.carrotsearch.randomizedtesting.rules.SystemPropertiesInvariantRule$1.evaluate(SystemPropertiesInvariantRule.java:55)
[junit4:junit4]   2> 		at com.carrotsearch.randomizedtesting.rules.NoShadowingOrOverridesOnMethodsRule$1.evaluate(NoShadowingOrOverridesOnMethodsRule.java:39)
[junit4:junit4]   2> 		at com.carrotsearch.randomizedtesting.rules.NoShadowingOrOverridesOnMethodsRule$1.evaluate(NoShadowingOrOverridesOnMethodsRule.java:39)
[junit4:junit4]   2> 		at org.apache.lucene.util.TestRuleAssertionsRequired$1.evaluate(TestRuleAssertionsRequired.java:40)
[junit4:junit4]   2> 		at org.apache.lucene.util.TestRuleMarkFailure$1.evaluate(TestRuleMarkFailure.java:48)
[junit4:junit4]   2> 		at org.apache.lucene.util.TestRuleIgnoreAfterMaxFailures$1.evaluate(TestRuleIgnoreAfterMaxFailures.java:70)
[junit4:junit4]   2> 		at org.apache.lucene.util.TestRuleIgnoreTestSuites$1.evaluate(TestRuleIgnoreTestSuites.java:55)
[junit4:junit4]   2> 		at com.carrotsearch.randomizedtesting.rules.StatementAdapter.evaluate(StatementAdapter.java:36)
[junit4:junit4]   2> 		at com.carrotsearch.randomizedtesting.ThreadLeakControl$StatementRunner.run(ThreadLeakControl.java:345)
[junit4:junit4]   2> 		at java.lang.Thread.run(Thread.java:722)
[junit4:junit4]   2> 	
[junit4:junit4]   2> 252 T3409 C268 REQ [collection1] webapp=null path=null params={q=ac&spellcheck.count=2&qt=/suggest_fst&spellcheck.onlyMorePopular=true} status=500 QTime=1 
[junit4:junit4]   2> 252 T3409 oasc.SolrException.log SEVERE REQUEST FAILED: q=ac&spellcheck.count=2&qt=/suggest_fst&spellcheck.onlyMorePopular=true:java.lang.NullPointerException
[junit4:junit4]   2> 		at org.apache.lucene.search.suggest.fst.FSTCompletionLookup.lookup(FSTCompletionLookup.java:240)
[junit4:junit4]   2> 		at org.apache.solr.spelling.suggest.Suggester.getSuggestions(Suggester.java:190)
[junit4:junit4]   2> 		at org.apache.solr.handler.component.SpellCheckComponent.process(SpellCheckComponent.java:172)
[junit4:junit4]   2> 		at org.apache.solr.handler.component.SearchHandler.handleRequestBody(SearchHandler.java:206)
[junit4:junit4]   2> 		at org.apache.solr.handler.RequestHandlerBase.handleRequest(RequestHandlerBase.java:129)
[junit4:junit4]   2> 		at org.apache.solr.core.SolrCore.execute(SolrCore.java:1672)
[junit4:junit4]   2> 		at org.apache.solr.util.TestHarness.query(TestHarness.java:351)
[junit4:junit4]   2> 		at org.apache.solr.util.TestHarness.query(TestHarness.java:333)
[junit4:junit4]   2> 		at org.apache.solr.SolrTestCaseJ4.assertQ(SolrTestCaseJ4.java:467)
[junit4:junit4]   2> 		at org.apache.solr.SolrTestCaseJ4.assertQ(SolrTestCaseJ4.java:460)
[junit4:junit4]   2> 		at org.apache.solr.spelling.suggest.SuggesterTest.testRebuild(SuggesterTest.java:105)
[junit4:junit4]   2> 		at sun.reflect.NativeMethodAccessorImpl.invoke0(Native Method)
[junit4:junit4]   2> 		at sun.reflect.NativeMethodAccessorImpl.invoke(NativeMethodAccessorImpl.java:57)
[junit4:junit4]   2> 		at sun.reflect.DelegatingMethodAccessorImpl.invoke(DelegatingMethodAccessorImpl.java:43)
[junit4:junit4]   2> 		at java.lang.reflect.Method.invoke(Method.java:601)
[junit4:junit4]   2> 		at com.carrotsearch.randomizedtesting.RandomizedRunner.invoke(RandomizedRunner.java:1559)
[junit4:junit4]   2> 		at com.carrotsearch.randomizedtesting.RandomizedRunner.access$600(RandomizedRunner.java:79)
[junit4:junit4]   2> 		at com.carrotsearch.randomizedtesting.RandomizedRunner$6.evaluate(RandomizedRunner.java:737)
[junit4:junit4]   2> 		at com.carrotsearch.randomizedtesting.RandomizedRunner$7.evaluate(RandomizedRunner.java:773)
[junit4:junit4]   2> 		at com.carrotsearch.randomizedtesting.RandomizedRunner$8.evaluate(RandomizedRunner.java:787)
[junit4:junit4]   2> 		at com.carrotsearch.randomizedtesting.rules.SystemPropertiesRestoreRule$1.evaluate(SystemPropertiesRestoreRule.java:53)
[junit4:junit4]   2> 		at org.apache.lucene.util.TestRuleSetupTeardownChained$1.evaluate(TestRuleSetupTeardownChained.java:50)
[junit4:junit4]   2> 		at org.apache.lucene.util.TestRuleFieldCacheSanity$1.evaluate(TestRuleFieldCacheSanity.java:51)
[junit4:junit4]   2> 		at org.apache.lucene.util.AbstractBeforeAfterRule$1.evaluate(AbstractBeforeAfterRule.java:45)
[junit4:junit4]   2> 		at com.carrotsearch.randomizedtesting.rules.SystemPropertiesInvariantRule$1.evaluate(SystemPropertiesInvariantRule.java:55)
[junit4:junit4]   2> 		at org.apache.lucene.util.TestRuleThreadAndTestName$1.evaluate(TestRuleThreadAndTestName.java:48)
[junit4:junit4]   2> 		at org.apache.lucene.util.TestRuleIgnoreAfterMaxFailures$1.evaluate(TestRuleIgnoreAfterMaxFailures.java:70)
[junit4:junit4]   2> 		at org.apache.lucene.util.TestRuleMarkFailure$1.evaluate(TestRuleMarkFailure.java:48)
[junit4:junit4]   2> 		at com.carrotsearch.randomizedtesting.rules.StatementAdapter.evaluate(StatementAdapter.java:36)
[junit4:junit4]   2> 		at com.carrotsearch.randomizedtesting.ThreadLeakControl$StatementRunner.run(ThreadLeakControl.java:345)
[junit4:junit4]   2> 		at com.carrotsearch.randomizedtesting.ThreadLeakControl.forkTimeoutingTask(ThreadLeakControl.java:769)
[junit4:junit4]   2> 		at com.carrotsearch.randomizedtesting.ThreadLeakControl$3.evaluate(ThreadLeakControl.java:429)
[junit4:junit4]   2> 		at com.carrotsearch.randomizedtesting.RandomizedRunner.runSingleTest(RandomizedRunner.java:746)
[junit4:junit4]   2> 		at com.carrotsearch.randomizedtesting.RandomizedRunner$3.evaluate(RandomizedRunner.java:648)
[junit4:junit4]   2> 		at com.carrotsearch.randomizedtesting.RandomizedRunner$4.evaluate(RandomizedRunner.java:682)
[junit4:junit4]   2> 		at com.carrotsearch.randomizedtesting.RandomizedRunner$5.evaluate(RandomizedRunner.java:693)
[junit4:junit4]   2> 		at com.carrotsearch.randomizedtesting.rules.StatementAdapter.evaluate(StatementAdapter.java:36)
[junit4:junit4]   2> 		at com.carrotsearch.randomizedtesting.rules.SystemPropertiesRestoreRule$1.evaluate(SystemPropertiesRestoreRule.java:53)
[junit4:junit4]   2> 		at org.apache.lucene.util.AbstractBeforeAfterRule$1.evaluate(AbstractBeforeAfterRule.java:45)
[junit4:junit4]   2> 		at org.apache.lucene.util.TestRuleStoreClassName$1.evaluate(TestRuleStoreClassName.java:42)
[junit4:junit4]   2> 		at com.carrotsearch.randomizedtesting.rules.SystemPropertiesInvariantRule$1.evaluate(SystemPropertiesInvariantRule.java:55)
[junit4:junit4]   2> 		at com.carrotsearch.randomizedtesting.rules.NoShadowingOrOverridesOnMethodsRule$1.evaluate(NoShadowingOrOverridesOnMethodsRule.java:39)
[junit4:junit4]   2> 		at com.carrotsearch.randomizedtesting.rules.NoShadowingOrOverridesOnMethodsRule$1.evaluate(NoShadowingOrOverridesOnMethodsRule.java:39)
[junit4:junit4]   2> 		at org.apache.lucene.util.TestRuleAssertionsRequired$1.evaluate(TestRuleAssertionsRequired.java:40)
[junit4:junit4]   2> 		at org.apache.lucene.util.TestRuleMarkFailure$1.evaluate(TestRuleMarkFailure.java:48)
[junit4:junit4]   2> 		at org.apache.lucene.util.TestRuleIgnoreAfterMaxFailures$1.evaluate(TestRuleIgnoreAfterMaxFailures.java:70)
[junit4:junit4]   2> 		at org.apache.lucene.util.TestRuleIgnoreTestSuites$1.evaluate(TestRuleIgnoreTestSuites.java:55)
[junit4:junit4]   2> 		at com.carrotsearch.randomizedtesting.rules.StatementAdapter.evaluate(StatementAdapter.java:36)
[junit4:junit4]   2> 		at com.carrotsearch.randomizedtesting.ThreadLeakControl$StatementRunner.run(ThreadLeakControl.java:345)
[junit4:junit4]   2> 		at java.lang.Thread.run(Thread.java:722)
[junit4:junit4]   2> 	
[junit4:junit4]   2> 253 T3409 oas.SolrTestCaseJ4.tearDown ###Ending testRebuild
[junit4:junit4]   2> NOTE: reproduce with: ant test  -Dtestcase=SuggesterFSTTest -Dtests.method=testRebuild -Dtests.seed=6882DDFB35222062 -Dtests.slow=true -Dtests.locale=hu_HU -Dtests.timezone=America/Fort_Wayne -Dtests.file.encoding=US-ASCII
[junit4:junit4] ERROR   0.07s | SuggesterFSTTest.testRebuild <<<
[junit4:junit4]    > Throwable #1: java.lang.RuntimeException: Exception during query
[junit4:junit4]    > 	at __randomizedtesting.SeedInfo.seed([6882DDFB35222062:33A77FB801225AF8]:0)
[junit4:junit4]    > 	at org.apache.solr.SolrTestCaseJ4.assertQ(SolrTestCaseJ4.java:493)
[junit4:junit4]    > 	at org.apache.solr.SolrTestCaseJ4.assertQ(SolrTestCaseJ4.java:460)
[junit4:junit4]    > 	at org.apache.solr.spelling.suggest.SuggesterTest.testRebuild(SuggesterTest.java:105)
[junit4:junit4]    > 	at sun.reflect.NativeMethodAccessorImpl.invoke0(Native Method)
[junit4:junit4]    > 	at sun.reflect.NativeMethodAccessorImpl.invoke(NativeMethodAccessorImpl.java:57)
[junit4:junit4]    > 	at sun.reflect.DelegatingMethodAccessorImpl.invoke(DelegatingMethodAccessorImpl.java:43)
[junit4:junit4]    > 	at java.lang.reflect.Method.invoke(Method.java:601)
[junit4:junit4]    > 	at com.carrotsearch.randomizedtesting.RandomizedRunner.invoke(RandomizedRunner.java:1559)
[junit4:junit4]    > 	at com.carrotsearch.randomizedtesting.RandomizedRunner.access$600(RandomizedRunner.java:79)
[junit4:junit4]    > 	at com.carrotsearch.randomizedtesting.RandomizedRunner$6.evaluate(RandomizedRunner.java:737)
[junit4:junit4]    > 	at com.carrotsearch.randomizedtesting.RandomizedRunner$7.evaluate(RandomizedRunner.java:773)
[junit4:junit4]    > 	at com.carrotsearch.randomizedtesting.RandomizedRunner$8.evaluate(RandomizedRunner.java:787)
[junit4:junit4]    > 	at com.carrotsearch.randomizedtesting.rules.SystemPropertiesRestoreRule$1.evaluate(SystemPropertiesRestoreRule.java:53)
[junit4:junit4]    > 	at org.apache.lucene.util.TestRuleSetupTeardownChained$1.evaluate(TestRuleSetupTeardownChained.java:50)
[junit4:junit4]    > 	at org.apache.lucene.util.TestRuleFieldCacheSanity$1.evaluate(TestRuleFieldCacheSanity.java:51)
[junit4:junit4]    > 	at org.apache.lucene.util.AbstractBeforeAfterRule$1.evaluate(AbstractBeforeAfterRule.java:45)
[junit4:junit4]    > 	at com.carrotsearch.randomizedtesting.rules.SystemPropertiesInvariantRule$1.evaluate(SystemPropertiesInvariantRule.java:55)
[junit4:junit4]    > 	at org.apache.lucene.util.TestRuleThreadAndTestName$1.evaluate(TestRuleThreadAndTestName.java:48)
[junit4:junit4]    > 	at org.apache.lucene.util.TestRuleIgnoreAfterMaxFailures$1.evaluate(TestRuleIgnoreAfterMaxFailures.java:70)
[junit4:junit4]    > 	at org.apache.lucene.util.TestRuleMarkFailure$1.evaluate(TestRuleMarkFailure.java:48)
[junit4:junit4]    > 	at com.carrotsearch.randomizedtesting.rules.StatementAdapter.evaluate(StatementAdapter.java:36)
[junit4:junit4]    > 	at com.carrotsearch.randomizedtesting.ThreadLeakControl$StatementRunner.run(ThreadLeakControl.java:345)
[junit4:junit4]    > 	at com.carrotsearch.randomizedtesting.ThreadLeakControl.forkTimeoutingTask(ThreadLeakControl.java:769)
[junit4:junit4]    > 	at com.carrotsearch.randomizedtesting.ThreadLeakControl$3.evaluate(ThreadLeakControl.java:429)
[junit4:junit4]    > 	at com.carrotsearch.randomizedtesting.RandomizedRunner.runSingleTest(RandomizedRunner.java:746)
[junit4:junit4]    > 	at com.carrotsearch.randomizedtesting.RandomizedRunner$3.evaluate(RandomizedRunner.java:648)
[junit4:junit4]    > 	at com.carrotsearch.randomizedtesting.RandomizedRunner$4.evaluate(RandomizedRunner.java:682)
[junit4:junit4]    > 	at com.carrotsearch.randomizedtesting.RandomizedRunner$5.evaluate(RandomizedRunner.java:693)
[junit4:junit4]    > 	at com.carrotsearch.randomizedtesting.rules.StatementAdapter.evaluate(StatementAdapter.java:36)
[junit4:junit4]    > 	at com.carrotsearch.randomizedtesting.rules.SystemPropertiesRestoreRule$1.evaluate(SystemPropertiesRestoreRule.java:53)
[junit4:junit4]    > 	at org.apache.lucene.util.AbstractBeforeAfterRule$1.evaluate(AbstractBeforeAfterRule.java:45)
[junit4:junit4]    > 	at org.apache.lucene.util.TestRuleStoreClassName$1.evaluate(TestRuleStoreClassName.java:42)
[junit4:junit4]    > 	at com.carrotsearch.randomizedtesting.rules.SystemPropertiesInvariantRule$1.evaluate(SystemPropertiesInvariantRule.java:55)
[junit4:junit4]    > 	at com.carrotsearch.randomizedtesting.rules.NoShadowingOrOverridesOnMethodsRule$1.evaluate(NoShadowingOrOverridesOnMethodsRule.java:39)
[junit4:junit4]    > 	at com.carrotsearch.randomizedtesting.rules.NoShadowingOrOverridesOnMethodsRule$1.evaluate(NoShadowingOrOverridesOnMethodsRule.java:39)
[junit4:junit4]    > 	at org.apache.lucene.util.TestRuleAssertionsRequired$1.evaluate(TestRuleAssertionsRequired.java:40)
[junit4:junit4]    > 	at org.apache.lucene.util.TestRuleMarkFailure$1.evaluate(TestRuleMarkFailure.java:48)
[junit4:junit4]    > 	at org.apache.lucene.util.TestRuleIgnoreAfterMaxFailures$1.evaluate(TestRuleIgnoreAfterMaxFailures.java:70)
[junit4:junit4]    > 	at org.apache.lucene.util.TestRuleIgnoreTestSuites$1.evaluate(TestRuleIgnoreTestSuites.java:55)
[junit4:junit4]    > 	at com.carrotsearch.randomizedtesting.rules.StatementAdapter.evaluate(StatementAdapter.java:36)
[junit4:junit4]    > 	at com.carrotsearch.randomizedtesting.ThreadLeakControl$StatementRunner.run(ThreadLeakControl.java:345)
[junit4:junit4]    > 	at java.lang.Thread.run(Thread.java:722)
[junit4:junit4]    > Caused by: java.lang.NullPointerException
[junit4:junit4]    > 	at org.apache.lucene.search.suggest.fst.FSTCompletionLookup.lookup(FSTCompletionLookup.java:240)
[junit4:junit4]    > 	at org.apache.solr.spelling.suggest.Suggester.getSuggestions(Suggester.java:190)
[junit4:junit4]    > 	at org.apache.solr.handler.component.SpellCheckComponent.process(SpellCheckComponent.java:172)
[junit4:junit4]    > 	at org.apache.solr.handler.component.SearchHandler.handleRequestBody(SearchHandler.java:206)
[junit4:junit4]    > 	at org.apache.solr.handler.RequestHandlerBase.handleRequest(RequestHandlerBase.java:129)
[junit4:junit4]    > 	at org.apache.solr.core.SolrCore.execute(SolrCore.java:1672)
[junit4:junit4]    > 	at org.apache.solr.util.TestHarness.query(TestHarness.java:351)
[junit4:junit4]    > 	at org.apache.solr.util.TestHarness.query(TestHarness.java:333)
[junit4:junit4]    > 	at org.apache.solr.SolrTestCaseJ4.assertQ(SolrTestCaseJ4.java:467)
[junit4:junit4]    > 	... 41 more
[junit4:junit4]   2> 264 T3409 oas.SolrTestCaseJ4.setUp ###Starting testReload
[junit4:junit4]   2> 268 T3409 C268 UPDATE [collection1] webapp=null path=null params={} {add=[1]} 0 0
[junit4:junit4]   2> 275 T3409 C268 UPDATE [collection1] webapp=null path=null params={} {add=[2]} 0 0
[junit4:junit4]   2> 281 T3409 C268 UPDATE [collection1] webapp=null path=null params={} {add=[3]} 0 0
[junit4:junit4]   2> 288 T3409 C268 oasu.DirectUpdateHandler2.commit start commit{flags=0,_version_=0,optimize=false,openSearcher=true,waitSearcher=true,expungeDeletes=false,softCommit=false}
[junit4:junit4]   2> 313 T3409 C268 oasc.SolrDeletionPolicy.onCommit SolrDeletionPolicy.onCommit: commits:num=2
[junit4:junit4]   2> 		commit{dir=MockDirWrapper(org.apache.lucene.store.MMapDirectory@C:\Jenkins\workspace\Lucene-Solr-trunk-Windows\solr\build\solr-core\test\J0\solrtest-SuggesterFSTTest-1345862719297\index lockFactory=org.apache.lucene.store.NativeFSLockFactory@1168d3d),segFN=segments_2,generation=2,filenames=[_0_Block_0.pos, _0_Block_0.tip, _0_MockRandom_0.tib, _0.fnm, _0_Pulsing40_0.tim, _0_Block_0.doc, _0_Block_0.tim, _0_MockRandom_0.prx, _0_nrm.cfs, _0_Pulsing40_0.prx, _0_Pulsing40_0.frq, _0_MockRandom_0.frq, _0_MockRandom_0.sd, _0_MockRandom_0.tiv, _0_SimpleText_0.pst, _0_nrm.cfe, _0_Pulsing40_0.tip, segments_2, _0.fdx, _0.si, _0.fdt]
[junit4:junit4]   2> 		commit{dir=MockDirWrapper(org.apache.lucene.store.MMapDirectory@C:\Jenkins\workspace\Lucene-Solr-trunk-Windows\solr\build\solr-core\test\J0\solrtest-SuggesterFSTTest-1345862719297\index lockFactory=org.apache.lucene.store.NativeFSLockFactory@1168d3d),segFN=segments_3,generation=3,filenames=[_1_Block_0.pos, _1_Block_0.tip, _1_nrm.cfs, _1_MockRandom_0.tiv, _1_Pulsing40_0.tip, _1_Block_0.tim, _1_Pulsing40_0.tim, _1_MockRandom_0.sd, _1.fnm, _1_nrm.cfe, _1_Pulsing40_0.frq, _1.fdx, _1_MockRandom_0.prx, _1_MockRandom_0.tib, _1.fdt, _1.si, _1_Pulsing40_0.prx, _1_MockRandom_0.frq, _1_Block_0.doc, segments_3, _1_SimpleText_0.pst]
[junit4:junit4]   2> 313 T3409 C268 oasc.SolrDeletionPolicy.updateCommits newest commit = 3
[junit4:junit4]   2> 323 T3409 C268 oass.SolrIndexSearcher.<init> Opening Searcher@145adac main
[junit4:junit4]   2> 323 T3409 C268 oass.SolrIndexSearcher.getIndexDir WARNING WARNING: Directory impl does not support setting indexDir: org.apache.lucene.store.MockDirectoryWrapper
[junit4:junit4]   2> 323 T3409 C268 oasu.DirectUpdateHandler2.commit end_commit_flush
[junit4:junit4]   2> 324 T3410 oashc.SpellCheckComponent$SpellCheckerListener.buildSpellIndex Building spell index for spell checker: suggest
[junit4:junit4]   2> 324 T3410 oasss.Suggester.build build()
[junit4:junit4]   2> 326 T3410 oasss.Suggester.build Stored suggest data to: C:\Jenkins\workspace\Lucene-Solr-trunk-Windows\solr\build\solr-core\test\J0\.\solrtest-SuggesterFSTTest-1345862719297\suggest\jaspell.dat
[junit4:junit4]   2> 326 T3410 oashc.SpellCheckComponent$SpellCheckerListener.buildSpellIndex Building spell index for spell checker: suggest_tst
[junit4:junit4]   2> 326 T3410 oasss.Suggester.build build()
[junit4:junit4]   2> 332 T3410 oasss.Suggester.build Stored suggest data to: C:\Jenkins\workspace\Lucene-Solr-trunk-Windows\solr\build\solr-core\test\J0\.\solrtest-SuggesterFSTTest-1345862719297\suggest_tst\tst.dat
[junit4:junit4]   2> 332 T3410 oashc.SpellCheckComponent$SpellCheckerListener.buildSpellIndex Building spell index for spell checker: suggest_fst
[junit4:junit4]   2> 332 T3410 oasss.Suggester.build build()
[junit4:junit4]   2> 335 T3410 oasss.Suggester.build Stored suggest data to: C:\Jenkins\workspace\Lucene-Solr-trunk-Windows\solr\build\solr-core\test\J0\.\solrtest-SuggesterFSTTest-1345862719297\suggest_fst\fst.bin
[junit4:junit4]   2> 335 T3410 oashc.SpellCheckComponent$SpellCheckerListener.buildSpellIndex Building spell index for spell checker: suggest_wfst
[junit4:junit4]   2> 335 T3410 oasss.Suggester.build build()
[junit4:junit4]   2> 337 T3410 oasss.Suggester.build Stored suggest data to: C:\Jenkins\workspace\Lucene-Solr-trunk-Windows\solr\build\solr-core\test\J0\.\solrtest-SuggesterFSTTest-1345862719297\suggest_wfst\wfst.bin
[junit4:junit4]   2> 337 T3410 oasc.SolrCore.registerSearcher [collection1] Registered new searcher Searcher@145adac main{StandardDirectoryReader(segments_3:7 _1(5.0):C3)}
[junit4:junit4]   2> 342 T3409 C268 UPDATE [collection1] webapp=null path=null params={} {commit=} 0 54
[junit4:junit4]   2> 343 T3409 oas.SolrTestCaseJ4.deleteCore ###deleteCore
[junit4:junit4]   2> 343 T3409 oasc.CoreContainer.shutdown Shutting down CoreContainer instance=24898075
[junit4:junit4]   2> 343 T3409 oasc.SolrCore.close [collection1]  CLOSING SolrCore org.apache.solr.core.SolrCore@1effb9
[junit4:junit4]   2> 345 T3409 oasc.SolrCore.closeSearcher [collection1] Closing main searcher on request.
[junit4:junit4]   2> 349 T3409 oasu.DirectUpdateHandler2.close closing DirectUpdateHandler2{commits=2,autocommits=0,soft autocommits=0,optimizes=0,rollbacks=0,expungeDeletes=0,docsPending=0,adds=0,deletesById=0,deletesByQuery=0,errors=0,cumulative_adds=6,cumulative_deletesById=0,cumulative_deletesByQuery=0,cumulative_errors=0}
[junit4:junit4]   2> 349 T3409 oasu.DefaultSolrCoreState.decref SolrCoreState ref count has reached 0 - closing IndexWriter
[junit4:junit4]   2> NOTE: per solr.test.leavedatadir, dataDir will not be removed: C:\Jenkins\workspace\Lucene-Solr-trunk-Windows\solr\build\solr-core\test\J0\.\solrtest-SuggesterFSTTest-1345862719297
[junit4:junit4]   2> 364 T3409 oas.SolrTestCaseJ4.initCore ####initCore
[junit4:junit4]   2> 364 T3409 oasc.SolrResourceLoader.<init> new SolrResourceLoader for directory: 'C:\Jenkins\workspace\Lucene-Solr-trunk-Windows\solr\build\solr-core\test-files\solr\collection1\'
[junit4:junit4]   2> 365 T3409 oasc.SolrResourceLoader.replaceClassLoader Adding 'file:/C:/Jenkins/workspace/Lucene-Solr-trunk-Windows/solr/build/solr-core/test-files/solr/collection1/lib/classes/' to classloader
[junit4:junit4]   2> 365 T3409 oasc.SolrResourceLoader.replaceClassLoader Adding 'file:/C:/Jenkins/workspace/Lucene-Solr-trunk-Windows/solr/build/solr-core/test-files/solr/collection1/lib/README' to classloader
[junit4:junit4]   2> 393 T3409 oasc.SolrConfig.<init> Using Lucene MatchVersion: LUCENE_50
[junit4:junit4]   2> 444 T3409 oasc.SolrConfig.<init> Loaded SolrConfig: solrconfig-spellchecker.xml
[junit4:junit4]   2> 444 T3409 oass.IndexSchema.readSchema Reading Solr Schema
[junit4:junit4]   2> 447 T3409 oass.IndexSchema.readSchema Schema name=test
[junit4:junit4]   2> 956 T3409 oass.OpenExchangeRatesOrgProvider.init Initialized with rates=open-exchange-rates.json, refreshInterval=1440.
[junit4:junit4]   2> 965 T3409 oass.IndexSchema.readSchema default search field in schema is text
[junit4:junit4]   2> 969 T3409 oass.IndexSchema.readSchema unique key field: id
[junit4:junit4]   2> 973 T3409 oass.FileExchangeRateProvider.reload Reloading exchange rates from file currency.xml
[junit4:junit4]   2> 975 T3409 oass.FileExchangeRateProvider.reload Reloading exchange rates from file currency.xml
[junit4:junit4]   2> 978 T3409 oass.OpenExchangeRatesOrgProvider.reload Reloading exchange rates from open-exchange-rates.json
[junit4:junit4]   2> 978 T3409 oass.OpenExchangeRatesOrgProvider.reload Reloading exchange rates from open-exchange-rates.json
[junit4:junit4]   2> 978 T3409 oasc.SolrResourceLoader.locateSolrHome JNDI not configured for solr (NoInitialContextEx)
[junit4:junit4]   2> 978 T3409 oasc.SolrResourceLoader.locateSolrHome using system property solr.solr.home: C:\Jenkins\workspace\Lucene-Solr-trunk-Windows\solr\build\solr-core\test-files\solr
[junit4:junit4]   2> 978 T3409 oasc.SolrResourceLoader.<init> new SolrResourceLoader for directory: 'C:\Jenkins\workspace\Lucene-Solr-trunk-Windows\solr\build\solr-core\test-files\solr\'
[junit4:junit4]   2> 985 T3409 oasc.CoreContainer.<init> New CoreContainer 23863157
[junit4:junit4]   2> 985 T3409 oasc.SolrCore.<init> [collection1] Opening new SolrCore at C:\Jenkins\workspace\Lucene-Solr-trunk-Windows\solr\build\solr-core\test-files\solr\collection1\, dataDir=C:\Jenkins\workspace\Lucene-Solr-trunk-Windows\solr\build\solr-core\test\J0\.\solrtest-SuggesterFSTTest-1345862719297\
[junit4:junit4]   2> 985 T3409 oasc.SolrCore.<init> JMX monitoring not detected for core: collection1
[junit4:junit4]   2> 986 T3409 oasc.SolrCore.getNewIndexDir WARNING New index directory detected: old=null new=C:\Jenkins\workspace\Lucene-Solr-trunk-Windows\solr\build\solr-core\test\J0\.\solrtest-SuggesterFSTTest-1345862719297\index/
[junit4:junit4]   2> 987 T3409 oasc.RequestHandlers.initHandlersFromConfig created standard: solr.StandardRequestHandler
[junit4:junit4]   2> 987 T3409 oasc.RequestHandlers.initHandlersFromConfig created /suggest: org.apache.solr.handler.component.SearchHandler
[junit4:junit4]   2> 987 T3409 oasc.RequestHandlers.initHandlersFromConfig created /suggest_tst: org.apache.solr.handler.component.SearchHandler
[junit4:junit4]   2> 987 T3409 oasc.RequestHandlers.initHandlersFromConfig created /suggest_fst: org.apache.solr.handler.component.SearchHandler
[junit4:junit4]   2> 988 T3409 oasc.RequestHandlers.initHandlersFromConfig created /suggest_wfst: org.apache.solr.handler.component.SearchHandler
[junit4:junit4]   2> 991 T3409 oasc.CachingDirectoryFactory.get return new directory for C:\Jenkins\workspace\Lucene-Solr-trunk-Windows\solr\build\solr-core\test\J0\.\solrtest-SuggesterFSTTest-1345862719297\index forceNew:false
[junit4:junit4]   2> 994 T3409 oass.SolrIndexSearcher.<init> Opening Searcher@d8d52 main
[junit4:junit4]   2> 994 T3409 oass.SolrIndexSearcher.getIndexDir WARNING WARNING: Directory impl does not support setting indexDir: org.apache.lucene.store.MockDirectoryWrapper
[junit4:junit4]   2> 994 T3409 oasu.CommitTracker.<init> Hard AutoCommit: disabled
[junit4:junit4]   2> 994 T3409 oasu.CommitTracker.<init> Soft AutoCommit: disabled
[junit4:junit4]   2> 994 T3409 oashc.SpellCheckComponent.inform Initializing spell checkers
[junit4:junit4]   2> 994 T3409 oasss.Suggester.init init: {name=suggest,classname=org.apache.solr.spelling.suggest.Suggester,lookupImpl=org.apache.solr.spelling.suggest.jaspell.JaspellLookup,field=suggest,storeDir=suggest,buildOnCommit=true,threshold=0.0}
[junit4:junit4]   2> 995 T3409 oasssj.JaspellLookupFactory.create init: {name=suggest,classname=org.apache.solr.spelling.suggest.Suggester,lookupImpl=org.apache.solr.spelling.suggest.jaspell.JaspellLookup,field=suggest,storeDir=suggest,buildOnCommit=true,threshold=0.0}
[junit4:junit4]   2> 996 T3409 oashc.SpellCheckComponent.inform Registering newSearcher listener for spellchecker: suggest
[junit4:junit4]   2> 996 T3409 oashc.SpellCheckComponent.inform No queryConverter defined, using default converter
[junit4:junit4]   2> 996 T3409 oashc.SpellCheckComponent.inform Initializing spell checkers
[junit4:junit4]   2> 996 T3409 oasss.Suggester.init init: {name=suggest_tst,classname=org.apache.solr.spelling.suggest.Suggester,lookupImpl=org.apache.solr.spelling.suggest.tst.TSTLookup,field=suggest,storeDir=suggest_tst,buildOnCommit=true,threshold=0.0}
[junit4:junit4]   2> 996 T3409 oashc.SpellCheckComponent.inform Registering newSearcher listener for spellchecker: suggest_tst
[junit4:junit4]   2> 997 T3409 oashc.SpellCheckComponent.inform No queryConverter defined, using default converter
[junit4:junit4]   2> 997 T3409 oashc.SpellCheckComponent.inform Initializing spell checkers
[junit4:junit4]   2> 997 T3409 oasss.Suggester.init init: {name=suggest_fst,classname=org.apache.solr.spelling.suggest.Suggester,lookupImpl=org.apache.solr.spelling.suggest.fst.FSTLookup,field=suggest,storeDir=suggest_fst,buildOnCommit=true,weightBuckets=5,exactMatchFirst=true}
[junit4:junit4]   2> 998 T3409 oashc.SpellCheckComponent.inform Registering newSearcher listener for spellchecker: suggest_fst
[junit4:junit4]   2> 998 T3409 oashc.SpellCheckComponent.inform No queryConverter defined, using default converter
[junit4:junit4]   2> 998 T3409 oashc.SpellCheckComponent.inform Initializing spell checkers
[junit4:junit4]   2> 998 T3409 oasss.Suggester.init init: {name=suggest_wfst,classname=org.apache.solr.spelling.suggest.Suggester,lookupImpl=org.apache.solr.spelling.suggest.fst.WFSTLookupFactory,field=suggest,storeDir=suggest_wfst,buildOnCommit=true,exactMatchFirst=true}
[junit4:junit4]   2> 998 T3409 oashc.SpellCheckComponent.inform Registering newSearcher listener for spellchecker: suggest_wfst
[junit4:junit4]   2> 999 T3409 oashc.SpellCheckComponent.inform No queryConverter defined, using default converter
[junit4:junit4]   2> 999 T3409 oashc.HttpShardHandlerFactory.getParameter Setting socketTimeout to: 0
[junit4:junit4]   2> 999 T3409 oashc.HttpShardHandlerFactory.getParameter Setting urlScheme to: http://
[junit4:junit4]   2> 999 T3409 oashc.HttpShardHandlerFactory.getParameter Setting connTimeout to: 0
[junit4:junit4]   2> 1000 T3409 oashc.HttpShardHandlerFactory.getParameter Setting maxConnectionsPerHost to: 20
[junit4:junit4]   2> 1000 T3409 oashc.HttpShardHandlerFactory.getParameter Setting corePoolSize to: 0
[junit4:junit4]   2> 1000 T3409 oashc.HttpShardHandlerFactory.getParameter Setting maximumPoolSize to: 2147483647
[junit4:junit4]   2> 1000 T3409 oashc.HttpShardHandlerFactory.getParameter Setting maxThreadIdleTime to: 5
[junit4:junit4]   2> 1000 T3409 oashc.HttpShardHandlerFactory.getParameter Setting sizeOfQueue to: -1
[junit4:junit4]   2> 1000 T3409 oashc.HttpShardHandlerFactory.getParameter Setting fairnessPolicy to: false
[junit4:junit4]   2> 1000 T3409 oascsi.HttpClientUtil.createClient Creating new http client, config:maxConnectionsPerHost=20&maxConnections=10000&socketTimeout=0&connTimeout=0&retry=false
[junit4:junit4]   2> 1003 T3411 oasc.SolrCore.registerSearcher [collection1] Registered new searcher Searcher@d8d52 main{StandardDirectoryReader(segments_3:7 _1(5.0):C3)}
[junit4:junit4]   2> 1003 T3409 oasc.CoreContainer.register registering core: collection1
[junit4:junit4]   2> 1004 T3409 oas.SolrTestCaseJ4.initCore ####initCore end
[junit4:junit4]   2> ASYNC  NEW_CORE C269 name=collection1 org.apache.solr.core.SolrCore@193e68e
[junit4:junit4]   2> 1005 T3409 C269 REQ [collection1] webapp=null path=null params={q=ac&spellcheck.count=2&qt=/suggest_fst&spellcheck.onlyMorePopular=true} status=0 QTime=1 
[junit4:junit4]   2> 1009 T3409 oas.SolrTestCaseJ4.tearDown ###Ending testReload
[junit4:junit4]   2> 1011 T3409 oas.SolrTestCaseJ4.setUp ###Starting testSuggestions
[junit4:junit4]   2> 1017 T3409 C269 oasc.SolrDeletionPolicy.onInit SolrDeletionPolicy.onInit: commits:num=1
[junit4:junit4]   2> 		commit{dir=MockDirWrapper(org.apache.lucene.store.SimpleFSDirectory@C:\Jenkins\workspace\Lucene-Solr-trunk-Windows\solr\build\solr-core\test\J0\solrtest-SuggesterFSTTest-1345862719297\index lockFactory=org.apache.lucene.store.NativeFSLockFactory@10039f7),segFN=segments_3,generation=3,filenames=[_1_Block_0.pos, _1_Block_0.tip, _1_nrm.cfs, _1_MockRandom_0.tiv, _1_Pulsing40_0.tip, _1_Block_0.tim, _1_Pulsing40_0.tim, _1_MockRandom_0.sd, _1.fnm, _1_nrm.cfe, _1_Pulsing40_0.frq, _1.fdx, _1_MockRandom_0.prx, _1_MockRandom_0.tib, _1.fdt, _1_Pulsing40_0.prx, _1.si, _1_MockRandom_0.frq, _1_Block_0.doc, segments_3, _1_SimpleText_0.pst]
[junit4:junit4]   2> 1018 T3409 C269 oasc.SolrDeletionPolicy.updateCommits newest commit = 3
[junit4:junit4]   2> 1018 T3409 C269 UPDATE [collection1] webapp=null path=null params={} {add=[1]} 0 4
[junit4:junit4]   2> 1022 T3409 C269 UPDATE [collection1] webapp=null path=null params={} {add=[2]} 0 0
[junit4:junit4]   2> 1027 T3409 C269 UPDATE [collection1] webapp=null path=null params={} {add=[3]} 0 0
[junit4:junit4]   2> 1035 T3409 C269 oasu.DirectUpdateHandler2.commit start commit{flags=0,_version_=0,optimize=false,openSearcher=true,waitSearcher=true,expungeDeletes=false,softCommit=false}
[junit4:junit4]   2> 1057 T3409 C269 oasc.SolrDeletionPolicy.onCommit SolrDeletionPolicy.onCommit: commits:num=2
[junit4:junit4]   2> 		commit{dir=MockDirWrapper(org.apache.lucene.store.SimpleFSDirectory@C:\Jenkins\workspace\Lucene-Solr-trunk-Windows\solr\build\solr-core\test\J0\solrtest-SuggesterFSTTest-1345862719297\index lockFactory=org.apache.lucene.store.NativeFSLockFactory@10039f7),segFN=segments_3,generation=3,filenames=[_1_Block_0.pos, _1_Block_0.tip, _1_nrm.cfs, _1_MockRandom_0.tiv, _1_Pulsing40_0.tip, _1_Block_0.tim, _1_Pulsing40_0.tim, _1_MockRandom_0.sd, _1.fnm, _1_nrm.cfe, _1_Pulsing40_0.frq, _1.fdx, _1_MockRandom_0.prx, _1_MockRandom_0.tib, _1.fdt, _1_Pulsing40_0.prx, _1.si, _1_MockRandom_0.frq, _1_Block_0.doc, segments_3, _1_SimpleText_0.pst]
[junit4:junit4]   2> 		commit{dir=MockDirWrapper(org.apache.lucene.store.SimpleFSDirectory@C:\Jenkins\workspace\Lucene-Solr-trunk-Windows\solr\build\solr-core\test\J0\solrtest-SuggesterFSTTest-1345862719297\index lockFactory=org.apache.lucene.store.NativeFSLockFactory@10039f7),segFN=segments_4,generation=4,filenames=[_2.si, _2_Block_0.pos, _2_Pulsing40_0.tim, _2_Block_0.tim, _2_SimpleText_0.pst, _1_Pulsing40_0.tip, _2_Block_0.tip, _2_Pulsing40_0.tip, _1_Pulsing40_0.tim, _1.fnm, _2_MockRandom_0.tiv, _1_Pulsing40_0.frq, _2_nrm.cfe, _2_MockRandom_0.pyl, _1_Pulsing40_0.prx, _2_MockRandom_0.pos, _2_MockRandom_0.tib, _2_nrm.cfs, _1_Block_0.doc, _2_Pulsing40_0.prx, _1_Block_0.tip, _1_Block_0.pos, _1_MockRandom_0.tiv, _1_nrm.cfs, _1_Block_0.tim, _2.fdt, _1_MockRandom_0.sd, _2.fdx, _2_Pulsing40_0.frq, _2.fnm, _1_nrm.cfe, _2_MockRandom_0.sd, _1.fdx, _1_MockRandom_0.prx, _1_MockRandom_0.tib, _2_MockRandom_0.skp, _1.fdt, _1.si, _2_MockRandom_0.frq, _2_Block_0.doc, _1_MockRandom_0.frq, _2_MockRandom_0.doc, segments_4, _1_SimpleText_0.pst]
[junit4:junit4]   2> 1058 T3409 C269 oasc.SolrDeletionPolicy.updateCommits newest commit = 4
[junit4:junit4]   2> 1064 T3409 C269 oass.SolrIndexSearcher.<init> Opening Searcher@dd74fe main
[junit4:junit4]   2> 1064 T3409 C269 oass.SolrIndexSearcher.getIndexDir WARNING WARNING: Directory impl does not support setting indexDir: org.apache.lucene.store.MockDirectoryWrapper
[junit4:junit4]   2> 1064 T3411 oashc.SpellCheckComponent$SpellCheckerListener.buildSpellIndex Building spell index for spell checker: suggest
[junit4:junit4]   2> 1064 T3409 C269 oasu.DirectUpdateHandler2.commit end_commit_flush
[junit4:junit4]   2> 1065 T3411 oasss.Suggester.build build()
[junit4:junit4]   2> 1066 T3411 oasss.Suggester.build Stored suggest data to: C:\Jenkins\workspace\Lucene-Solr-trunk-Windows\solr\build\solr-core\test\J0\.\solrtest-SuggesterFSTTest-1345862719297\suggest\jaspell.dat
[junit4:junit4]   2> 1066 T3411 oashc.SpellCheckComponent$SpellCheckerListener.buildSpellIndex Building spell index for spell checker: suggest_tst
[junit4:junit4]   2> 1066 T3411 oasss.Suggester.build build()
[junit4:junit4]   2> 1071 T3411 oasss.Suggester.build Stored suggest data to: C:\Jenkins\workspace\Lucene-Solr-trunk-Windows\solr\build\solr-core\test\J0\.\solrtest-SuggesterFSTTest-1345862719297\suggest_tst\tst.dat
[junit4:junit4]   2> 1071 T3411 oashc.SpellCheckComponent$SpellCheckerListener.buildSpellIndex Building spell index for spell checker: suggest_fst
[junit4:junit4]   2> 1071 T3411 oasss.Suggester.build build()
[junit4:junit4]   2> 1076 T3411 oasss.Suggester.build Stored suggest data to: C:\Jenkins\workspace\Lucene-Solr-trunk-Windows\solr\build\solr-core\test\J0\.\solrtest-SuggesterFSTTest-1345862719297\suggest_fst\fst.bin
[junit4:junit4]   2> 1077 T3411 oashc.SpellCheckComponent$SpellCheckerListener.buildSpellIndex Building spell index for spell checker: suggest_wfst
[junit4:junit4]   2> 1077 T3411 oasss.Suggester.build build()
[junit4:junit4]   2> 1078 T3411 oasss.Suggester.build Stored suggest data to: C:\Jenkins\workspace\Lucene-Solr-trunk-Windows\solr\build\solr-core\test\J0\.\solrtest-SuggesterFSTTest-1345862719297\suggest_wfst\wfst.bin
[junit4:junit4]   2> 1079 T3411 oasc.SolrCore.registerSearcher [collection1] Registered new searcher Searcher@dd74fe main{StandardDirectoryReader(segments_4:9 _1(5.0):C3 _2(5.0):C3)}
[junit4:junit4]   2> 1079 T3409 C269 UPDATE [collection1] webapp=null path=null params={} {commit=} 0 44
[junit4:junit4]   2> 1080 T3409 C269 REQ [collection1] webapp=null path=null params={q=ac&spellcheck.count=2&qt=/suggest_fst&spellcheck.onlyMorePopular=true} status=0 QTime=0 
[junit4:junit4]   2> 1084 T3409 oas.SolrTestCaseJ4.tearDown ###Ending testSuggestions
[junit4:junit4]   2> 1086 T3409 oas.SolrTestCaseJ4.setUp ###Starting testAnalyzer
[junit4:junit4]   2> 1086 T3409 oasss.Suggester.init init: {lookupImpl=org.apache.solr.spelling.suggest.tst.TSTLookupFactory}
[junit4:junit4]   2> 1086 T3409 oas.SolrTestCaseJ4.tearDown ###Ending testAnalyzer
[junit4:junit4]   2> 1087 T3409 oas.SolrTestCaseJ4.deleteCore ###deleteCore
[junit4:junit4]   2> 1087 T3409 oasc.CoreContainer.shutdown Shutting down CoreContainer instance=23863157
[junit4:junit4]   2> 1087 T3409 oasc.SolrCore.close [collection1]  CLOSING SolrCore org.apache.solr.core.SolrCore@193e68e
[junit4:junit4]   2> 1087 T3409 oasc.SolrCore.closeSearcher [collection1] Closing main searcher on request.
[junit4:junit4]   2> 1088 T3409 oasu.DirectUpdateHandler2.close closing DirectUpdateHandler2{commits=1,autocommits=0,soft autocommits=0,optimizes=0,rollbacks=0,expungeDeletes=0,docsPending=0,adds=0,deletesById=0,deletesByQuery=0,errors=0,cumulative_adds=3,cumulative_deletesById=0,cumulative_deletesByQuery=0,cumulative_errors=0}
[junit4:junit4]   2> 1088 T3409 oasu.DefaultSolrCoreState.decref SolrCoreState ref count has reached 0 - closing IndexWriter
[junit4:junit4]   2> NOTE: test params are: codec=Lucene40: {timestamp=PostingsFormat(name=MockRandom), range_facet_l=PostingsFormat(name=MockRandom), id=PostingsFormat(name=SimpleText), range_facet_sl=PostingsFormat(name=SimpleText), range_facet_si=PostingsFormat(name=MockRandom), text=Pulsing40(freqCutoff=3 minBlockSize=13 maxBlockSize=100), multiDefault=PostingsFormat(name=MockRandom), suggest=PostingsFormat(name=MockRandom), intDefault=Block(blocksize=128), spell=Block(blocksize=128)}, sim=RandomSimilarityProvider(queryNorm=false,coord=no): {}, locale=hu_HU, timezone=America/Fort_Wayne
[junit4:junit4]   2> NOTE: Windows 7 6.1 x86/Oracle Corporation 1.7.0_06 (32-bit)/cpus=2,threads=1,free=87776048,total=222158848
[junit4:junit4]   2> NOTE: All tests run in this JVM: [TestUpdate, SimplePostToolTest, TestJoin, TestPerFieldSimilarity, SortByFunctionTest, TestXIncludeConfig, EchoParamsTest, UpdateRequestProcessorFactoryTest, BasicDistributedZk2Test, DistanceFunctionTest, SignatureUpdateProcessorFactoryTest, DocumentAnalysisRequestHandlerTest, TestWriterPerf, MinimalSchemaTest, DistributedSpellCheckComponentTest, XsltUpdateRequestHandlerTest, AnalysisAfterCoreReloadTest, TestPropInjectDefaults, HighlighterTest, TestSolrCoreProperties, FieldAnalysisRequestHandlerTest, ZkSolrClientTest, LeaderElectionIntegrationTest, TestBinaryResponseWriter, LukeRequestHandlerTest, DisMaxRequestHandlerTest, SearchHandlerTest, TestConfig, SimpleFacetsTest, DirectSolrSpellCheckerTest, TestIndexingPerformance, TestDocSet, PathHierarchyTokenizerFactoryTest, PrimUtilsTest, PeerSyncTest, SpellingQueryConverterTest, IndexSchemaRuntimeFieldTest, TestSolrXMLSerializer, TestCSVResponseWriter, TestReplicationHandler, SpellPossibilityIteratorTest, OutputWriterTest, TestStressLucene, TestSort, TestCoreContainer, DirectUpdateHandlerOptimizeTest, AlternateDirectoryTest, TestCharFilters, TestSolrDeletionPolicy2, BasicFunctionalityTest, TestUtils, IndexSchemaTest, TestFiltering, TestRangeQuery, QueryParsingTest, NoCacheHeaderTest, IndexReaderFactoryTest, CoreContainerCoreInitFailuresTest, TestExtendedDismaxParser, TestTrie, TestHashPartitioner, TestSolrQueryParser, TestRealTimeGet, ZkCLITest, BinaryUpdateRequestHandlerTest, TestBM25SimilarityFactory, QueryEqualityTest, CircularListTest, TermVectorComponentDistributedTest, UniqFieldsUpdateProcessorFactoryTest, QueryElevationComponentTest, TestSearchPerf, TestDefaultSimilarityFactory, MultiTermTest, TestOmitPositions, RAMDirectoryFactoryTest, SuggesterWFSTTest, IndexBasedSpellCheckerTest, SolrCoreCheckLockOnStartupTest, TestQueryUtils, SolrCmdDistributorTest, TestRandomFaceting, TestDistributedSearch, BadComponentTest, TestQuerySenderListener, TestReload, TestStressVersions, NumericFieldsTest, XmlUpdateRequestHandlerTest, URLClassifyProcessorTest, ZkControllerTest, TestDocumentBuilder, StatelessScriptUpdateProcessorFactoryTest, TestDFRSimilarityFactory, AutoCommitTest, TestBinaryField, SampleTest, TestFunctionQuery, TestFastOutputStream, SolrRequestParserTest, TestLMDirichletSimilarityFactory, CacheHeaderTest, TimeZoneUtilsTest, SolrCoreTest, TestWordDelimiterFilterFactory, ZkNodePropsTest, TestLFUCache, TestPHPSerializedResponseWriter, RecoveryZkTest, BasicDistributedZkTest, OverseerTest, SpellCheckComponentTest, FullSolrCloudDistribCmdsTest, LeaderElectionTest, TestDistributedGrouping, SpellCheckCollatorTest, SoftAutoCommitTest, BasicZkTest, TestFaceting, WordBreakSolrSpellCheckerTest, DistributedTermsComponentTest, StatsComponentTest, TestRecovery, DirectUpdateHandlerTest, TestMultiCoreConfBootstrap, TestGroupingSearch, FileBasedSpellCheckerTest, ConvertedLegacyTest, TestJmxIntegration, TestIndexSearcher, CoreAdminHandlerTest, DirectSolrConnectionTest, TestRemoteStreaming, TestCSVLoader, PolyFieldTest, SpatialFilterTest, MoreLikeThisHandlerTest, DocumentBuilderTest, MBeansHandlerTest, DistributedQueryElevationComponentTest, CurrencyFieldTest, TestPseudoReturnFields, TermsComponentTest, SolrInfoMBeanTest, StandardRequestHandlerTest, TestQueryTypes, PingRequestHandlerTest, TermVectorComponentTest, JsonLoaderTest, TestSurroundQueryParser, SolrPluginUtilsTest, TestValueSourceCache, FastVectorHighlighterTest, TestReversedWildcardFilterFactory, DebugComponentTest, JSONWriterTest, ReturnFieldsTest, RequestHandlersTest, RequiredFieldsTest, SuggesterFSTTest]
[junit4:junit4] Completed in 1.13s, 4 tests, 1 error <<< FAILURES!

[...truncated 197 lines...]
BUILD FAILED
C:\Jenkins\workspace\Lucene-Solr-trunk-Windows\build.xml:29: The following error occurred while executing this line:
C:\Jenkins\workspace\Lucene-Solr-trunk-Windows\solr\build.xml:144: The following error occurred while executing this line:
C:\Jenkins\workspace\Lucene-Solr-trunk-Windows\lucene\module-build.xml:62: The following error occurred while executing this line:
C:\Jenkins\workspace\Lucene-Solr-trunk-Windows\lucene\common-build.xml:1106: The following error occurred while executing this line:
C:\Jenkins\workspace\Lucene-Solr-trunk-Windows\lucene\common-build.xml:798: There were test failures: 227 suites, 915 tests, 1 error, 11 ignored (6 assumptions)

Total time: 37 minutes 28 seconds
Build step 'Invoke Ant' marked build as failure
Recording test results
Description set: Java: 32bit/jdk1.7.0_06 -server -XX:+UseConcMarkSweepGC
Email was triggered for: Failure
Sending email for trigger: Failure



Mime
View raw message