lucene-dev mailing list archives

Site index · List index
Message view « Date » · « Thread »
Top « Date » · « Thread »
From Policeman Jenkins Server <jenk...@sd-datasolutions.de>
Subject [JENKINS] Lucene-Solr-trunk-Linux (32bit/jdk1.8.0-ea-b49) - Build # 117 - Still Failing!
Date Thu, 02 Aug 2012 18:22:55 GMT
Build: http://jenkins.sd-datasolutions.de/job/Lucene-Solr-trunk-Linux/117/
Java: 32bit/jdk1.8.0-ea-b49 -server -XX:+UseParallelGC

1 tests failed.
FAILED:  org.apache.solr.handler.component.DistributedQueryElevationComponentTest.testDistribSearch

Error Message:
.responseHeader.params.shards:localhost:54794/solr,localhost:41554/solr|[::1]:33332/solr,localhost:50226/solr|[::1]:33332/solr!=javabin

Stack Trace:
junit.framework.AssertionFailedError: .responseHeader.params.shards:localhost:54794/solr,localhost:41554/solr|[::1]:33332/solr,localhost:50226/solr|[::1]:33332/solr!=javabin
	at __randomizedtesting.SeedInfo.seed([8A54C6EA087980A2:BB248F27F26E09E]:0)
	at junit.framework.Assert.fail(Assert.java:50)
	at org.apache.solr.BaseDistributedSearchTestCase.compareResponses(BaseDistributedSearchTestCase.java:670)
	at org.apache.solr.BaseDistributedSearchTestCase.query(BaseDistributedSearchTestCase.java:392)
	at org.apache.solr.handler.component.DistributedQueryElevationComponentTest.doTest(DistributedQueryElevationComponentTest.java:81)
	at org.apache.solr.BaseDistributedSearchTestCase.testDistribSearch(BaseDistributedSearchTestCase.java:679)
	at sun.reflect.NativeMethodAccessorImpl.invoke0(Native Method)
	at sun.reflect.NativeMethodAccessorImpl.invoke(NativeMethodAccessorImpl.java:57)
	at sun.reflect.DelegatingMethodAccessorImpl.invoke(DelegatingMethodAccessorImpl.java:43)
	at java.lang.reflect.Method.invoke(Method.java:474)
	at com.carrotsearch.randomizedtesting.RandomizedRunner.invoke(RandomizedRunner.java:1995)
	at com.carrotsearch.randomizedtesting.RandomizedRunner.access$1100(RandomizedRunner.java:132)
	at com.carrotsearch.randomizedtesting.RandomizedRunner$6.evaluate(RandomizedRunner.java:818)
	at com.carrotsearch.randomizedtesting.RandomizedRunner$7.evaluate(RandomizedRunner.java:877)
	at com.carrotsearch.randomizedtesting.RandomizedRunner$8.evaluate(RandomizedRunner.java:891)
	at com.carrotsearch.randomizedtesting.rules.SystemPropertiesRestoreRule$1.evaluate(SystemPropertiesRestoreRule.java:53)
	at org.apache.lucene.util.TestRuleSetupTeardownChained$1.evaluate(TestRuleSetupTeardownChained.java:50)
	at org.apache.lucene.util.TestRuleFieldCacheSanity$1.evaluate(TestRuleFieldCacheSanity.java:32)
	at org.apache.lucene.util.AbstractBeforeAfterRule$1.evaluate(AbstractBeforeAfterRule.java:45)
	at com.carrotsearch.randomizedtesting.rules.SystemPropertiesInvariantRule$1.evaluate(SystemPropertiesInvariantRule.java:55)
	at org.apache.lucene.util.TestRuleReportUncaughtExceptions$1.evaluate(TestRuleReportUncaughtExceptions.java:68)
	at org.apache.lucene.util.TestRuleThreadAndTestName$1.evaluate(TestRuleThreadAndTestName.java:48)
	at org.apache.lucene.util.TestRuleIgnoreAfterMaxFailures$1.evaluate(TestRuleIgnoreAfterMaxFailures.java:70)
	at org.apache.lucene.util.TestRuleMarkFailure$1.evaluate(TestRuleMarkFailure.java:48)
	at com.carrotsearch.randomizedtesting.RandomizedRunner.runSingleTest(RandomizedRunner.java:825)
	at com.carrotsearch.randomizedtesting.RandomizedRunner.access$700(RandomizedRunner.java:132)
	at com.carrotsearch.randomizedtesting.RandomizedRunner$3$1.run(RandomizedRunner.java:671)
	at com.carrotsearch.randomizedtesting.RandomizedRunner$3.evaluate(RandomizedRunner.java:697)
	at com.carrotsearch.randomizedtesting.RandomizedRunner$4.evaluate(RandomizedRunner.java:736)
	at com.carrotsearch.randomizedtesting.RandomizedRunner$5.evaluate(RandomizedRunner.java:747)
	at com.carrotsearch.randomizedtesting.rules.SystemPropertiesRestoreRule$1.evaluate(SystemPropertiesRestoreRule.java:53)
	at org.apache.lucene.util.AbstractBeforeAfterRule$1.evaluate(AbstractBeforeAfterRule.java:45)
	at org.apache.lucene.util.TestRuleReportUncaughtExceptions$1.evaluate(TestRuleReportUncaughtExceptions.java:68)
	at org.apache.lucene.util.TestRuleStoreClassName$1.evaluate(TestRuleStoreClassName.java:38)
	at com.carrotsearch.randomizedtesting.rules.SystemPropertiesInvariantRule$1.evaluate(SystemPropertiesInvariantRule.java:55)
	at org.apache.lucene.util.TestRuleNoInstanceHooksOverrides$1.evaluate(TestRuleNoInstanceHooksOverrides.java:53)
	at org.apache.lucene.util.TestRuleNoStaticHooksShadowing$1.evaluate(TestRuleNoStaticHooksShadowing.java:52)
	at org.apache.lucene.util.TestRuleAssertionsRequired$1.evaluate(TestRuleAssertionsRequired.java:36)
	at org.apache.lucene.util.TestRuleMarkFailure$1.evaluate(TestRuleMarkFailure.java:48)
	at org.apache.lucene.util.TestRuleIgnoreAfterMaxFailures$1.evaluate(TestRuleIgnoreAfterMaxFailures.java:70)
	at org.apache.lucene.util.TestRuleIgnoreTestSuites$1.evaluate(TestRuleIgnoreTestSuites.java:55)
	at com.carrotsearch.randomizedtesting.RandomizedRunner.runSuite(RandomizedRunner.java:605)
	at com.carrotsearch.randomizedtesting.RandomizedRunner.access$400(RandomizedRunner.java:132)
	at com.carrotsearch.randomizedtesting.RandomizedRunner$2.run(RandomizedRunner.java:551)




Build Log:
[...truncated 7223 lines...]
[junit4:junit4] Suite: org.apache.solr.handler.component.DistributedQueryElevationComponentTest
[junit4:junit4] FAILURE 1.36s J1 | DistributedQueryElevationComponentTest.testDistribSearch
[junit4:junit4]    > Throwable #1: junit.framework.AssertionFailedError: .responseHeader.params.shards:localhost:54794/solr,localhost:41554/solr|[::1]:33332/solr,localhost:50226/solr|[::1]:33332/solr!=javabin
[junit4:junit4]    > 	at __randomizedtesting.SeedInfo.seed([8A54C6EA087980A2:BB248F27F26E09E]:0)
[junit4:junit4]    > 	at junit.framework.Assert.fail(Assert.java:50)
[junit4:junit4]    > 	at org.apache.solr.BaseDistributedSearchTestCase.compareResponses(BaseDistributedSearchTestCase.java:670)
[junit4:junit4]    > 	at org.apache.solr.BaseDistributedSearchTestCase.query(BaseDistributedSearchTestCase.java:392)
[junit4:junit4]    > 	at org.apache.solr.handler.component.DistributedQueryElevationComponentTest.doTest(DistributedQueryElevationComponentTest.java:81)
[junit4:junit4]    > 	at org.apache.solr.BaseDistributedSearchTestCase.testDistribSearch(BaseDistributedSearchTestCase.java:679)
[junit4:junit4]    > 	at sun.reflect.NativeMethodAccessorImpl.invoke0(Native Method)
[junit4:junit4]    > 	at sun.reflect.NativeMethodAccessorImpl.invoke(NativeMethodAccessorImpl.java:57)
[junit4:junit4]    > 	at sun.reflect.DelegatingMethodAccessorImpl.invoke(DelegatingMethodAccessorImpl.java:43)
[junit4:junit4]    > 	at java.lang.reflect.Method.invoke(Method.java:474)
[junit4:junit4]    > 	at com.carrotsearch.randomizedtesting.RandomizedRunner.invoke(RandomizedRunner.java:1995)
[junit4:junit4]    > 	at com.carrotsearch.randomizedtesting.RandomizedRunner.access$1100(RandomizedRunner.java:132)
[junit4:junit4]    > 	at com.carrotsearch.randomizedtesting.RandomizedRunner$6.evaluate(RandomizedRunner.java:818)
[junit4:junit4]    > 	at com.carrotsearch.randomizedtesting.RandomizedRunner$7.evaluate(RandomizedRunner.java:877)
[junit4:junit4]    > 	at com.carrotsearch.randomizedtesting.RandomizedRunner$8.evaluate(RandomizedRunner.java:891)
[junit4:junit4]    > 	at com.carrotsearch.randomizedtesting.rules.SystemPropertiesRestoreRule$1.evaluate(SystemPropertiesRestoreRule.java:53)
[junit4:junit4]    > 	at org.apache.lucene.util.TestRuleSetupTeardownChained$1.evaluate(TestRuleSetupTeardownChained.java:50)
[junit4:junit4]    > 	at org.apache.lucene.util.TestRuleFieldCacheSanity$1.evaluate(TestRuleFieldCacheSanity.java:32)
[junit4:junit4]    > 	at org.apache.lucene.util.AbstractBeforeAfterRule$1.evaluate(AbstractBeforeAfterRule.java:45)
[junit4:junit4]    > 	at com.carrotsearch.randomizedtesting.rules.SystemPropertiesInvariantRule$1.evaluate(SystemPropertiesInvariantRule.java:55)
[junit4:junit4]    > 	at org.apache.lucene.util.TestRuleReportUncaughtExceptions$1.evaluate(TestRuleReportUncaughtExceptions.java:68)
[junit4:junit4]    > 	at org.apache.lucene.util.TestRuleThreadAndTestName$1.evaluate(TestRuleThreadAndTestName.java:48)
[junit4:junit4]    > 	at org.apache.lucene.util.TestRuleIgnoreAfterMaxFailures$1.evaluate(TestRuleIgnoreAfterMaxFailures.java:70)
[junit4:junit4]    > 	at org.apache.lucene.util.TestRuleMarkFailure$1.evaluate(TestRuleMarkFailure.java:48)
[junit4:junit4]    > 	at com.carrotsearch.randomizedtesting.RandomizedRunner.runSingleTest(RandomizedRunner.java:825)
[junit4:junit4]    > 	at com.carrotsearch.randomizedtesting.RandomizedRunner.access$700(RandomizedRunner.java:132)
[junit4:junit4]    > 	at com.carrotsearch.randomizedtesting.RandomizedRunner$3$1.run(RandomizedRunner.java:671)
[junit4:junit4]    > 	at com.carrotsearch.randomizedtesting.RandomizedRunner$3.evaluate(RandomizedRunner.java:697)
[junit4:junit4]    > 	at com.carrotsearch.randomizedtesting.RandomizedRunner$4.evaluate(RandomizedRunner.java:736)
[junit4:junit4]    > 	at com.carrotsearch.randomizedtesting.RandomizedRunner$5.evaluate(RandomizedRunner.java:747)
[junit4:junit4]    > 	at com.carrotsearch.randomizedtesting.rules.SystemPropertiesRestoreRule$1.evaluate(SystemPropertiesRestoreRule.java:53)
[junit4:junit4]    > 	at org.apache.lucene.util.AbstractBeforeAfterRule$1.evaluate(AbstractBeforeAfterRule.java:45)
[junit4:junit4]    > 	at org.apache.lucene.util.TestRuleReportUncaughtExceptions$1.evaluate(TestRuleReportUncaughtExceptions.java:68)
[junit4:junit4]    > 	at org.apache.lucene.util.TestRuleStoreClassName$1.evaluate(TestRuleStoreClassName.java:38)
[junit4:junit4]    > 	at com.carrotsearch.randomizedtesting.rules.SystemPropertiesInvariantRule$1.evaluate(SystemPropertiesInvariantRule.java:55)
[junit4:junit4]    > 	at org.apache.lucene.util.TestRuleNoInstanceHooksOverrides$1.evaluate(TestRuleNoInstanceHooksOverrides.java:53)
[junit4:junit4]    > 	at org.apache.lucene.util.TestRuleNoStaticHooksShadowing$1.evaluate(TestRuleNoStaticHooksShadowing.java:52)
[junit4:junit4]    > 	at org.apache.lucene.util.TestRuleAssertionsRequired$1.evaluate(TestRuleAssertionsRequired.java:36)
[junit4:junit4]    > 	at org.apache.lucene.util.TestRuleMarkFailure$1.evaluate(TestRuleMarkFailure.java:48)
[junit4:junit4]    > 	at org.apache.lucene.util.TestRuleIgnoreAfterMaxFailures$1.evaluate(TestRuleIgnoreAfterMaxFailures.java:70)
[junit4:junit4]    > 	at org.apache.lucene.util.TestRuleIgnoreTestSuites$1.evaluate(TestRuleIgnoreTestSuites.java:55)
[junit4:junit4]    > 	at com.carrotsearch.randomizedtesting.RandomizedRunner.runSuite(RandomizedRunner.java:605)
[junit4:junit4]    > 	at com.carrotsearch.randomizedtesting.RandomizedRunner.access$400(RandomizedRunner.java:132)
[junit4:junit4]    > 	at com.carrotsearch.randomizedtesting.RandomizedRunner$2.run(RandomizedRunner.java:551)
[junit4:junit4]    > 
[junit4:junit4]   2> 5 T876 oas.SolrTestCaseJ4.setUp ###Starting testDistribSearch
[junit4:junit4]   2> 6 T876 oejs.Server.doStart jetty-8.1.2.v20120308
[junit4:junit4]   2> 9 T876 oejs.AbstractConnector.doStart Started SocketConnector@0.0.0.0:49762
[junit4:junit4]   2> 9 T876 oasc.SolrResourceLoader.locateSolrHome JNDI not configured for solr (NoInitialContextEx)
[junit4:junit4]   2> 9 T876 oasc.SolrResourceLoader.locateSolrHome using system property solr.solr.home: /mnt/ssd/jenkins/workspace/Lucene-Solr-trunk-Linux/checkout/solr/build/solr-core/test-files/solr
[junit4:junit4]   2> 10 T876 oasc.SolrResourceLoader.<init> new SolrResourceLoader for deduced Solr Home: '/mnt/ssd/jenkins/workspace/Lucene-Solr-trunk-Linux/checkout/solr/build/solr-core/test-files/solr/'
[junit4:junit4]   2> 18 T876 oass.SolrDispatchFilter.init SolrDispatchFilter.init()
[junit4:junit4]   2> 18 T876 oasc.SolrResourceLoader.locateSolrHome JNDI not configured for solr (NoInitialContextEx)
[junit4:junit4]   2> 18 T876 oasc.SolrResourceLoader.locateSolrHome using system property solr.solr.home: /mnt/ssd/jenkins/workspace/Lucene-Solr-trunk-Linux/checkout/solr/build/solr-core/test-files/solr
[junit4:junit4]   2> 19 T876 oasc.CoreContainer$Initializer.initialize looking for solr.xml: /mnt/ssd/jenkins/workspace/Lucene-Solr-trunk-Linux/checkout/solr/build/solr-core/test-files/solr/solr.xml
[junit4:junit4]   2> 19 T876 oasc.CoreContainer.<init> New CoreContainer 725502
[junit4:junit4]   2> 19 T876 oasc.CoreContainer.load Loading CoreContainer using Solr Home: '/mnt/ssd/jenkins/workspace/Lucene-Solr-trunk-Linux/checkout/solr/build/solr-core/test-files/solr/'
[junit4:junit4]   2> 19 T876 oasc.SolrResourceLoader.<init> new SolrResourceLoader for directory: '/mnt/ssd/jenkins/workspace/Lucene-Solr-trunk-Linux/checkout/solr/build/solr-core/test-files/solr/'
[junit4:junit4]   2> 30 T876 oasc.CoreContainer.load Registering Log Listener
[junit4:junit4]   2> 43 T876 oasc.CoreContainer.create Creating SolrCore 'collection1' using instanceDir: /mnt/ssd/jenkins/workspace/Lucene-Solr-trunk-Linux/checkout/solr/build/solr-core/test-files/solr/collection1
[junit4:junit4]   2> 43 T876 oasc.SolrResourceLoader.<init> new SolrResourceLoader for directory: '/mnt/ssd/jenkins/workspace/Lucene-Solr-trunk-Linux/checkout/solr/build/solr-core/test-files/solr/collection1/'
[junit4:junit4]   2> 44 T876 oasc.SolrResourceLoader.replaceClassLoader Adding 'file:/mnt/ssd/jenkins/workspace/Lucene-Solr-trunk-Linux/checkout/solr/build/solr-core/test-files/solr/collection1/lib/README' to classloader
[junit4:junit4]   2> 44 T876 oasc.SolrResourceLoader.replaceClassLoader Adding 'file:/mnt/ssd/jenkins/workspace/Lucene-Solr-trunk-Linux/checkout/solr/build/solr-core/test-files/solr/collection1/lib/classes/' to classloader
[junit4:junit4]   2> 64 T876 oasc.SolrConfig.<init> Using Lucene MatchVersion: LUCENE_50
[junit4:junit4]   2> 98 T876 oasc.SolrConfig.<init> Loaded SolrConfig: solrconfig-elevate.xml
[junit4:junit4]   2> 98 T876 oass.IndexSchema.readSchema Reading Solr Schema
[junit4:junit4]   2> 101 T876 oass.IndexSchema.readSchema Schema name=example
[junit4:junit4]   2> 234 T876 oass.IndexSchema.readSchema default search field in schema is text
[junit4:junit4]   2> 236 T876 oass.IndexSchema.readSchema unique key field: id
[junit4:junit4]   2> 238 T876 oasc.SolrCore.<init> [collection1] Opening new SolrCore at /mnt/ssd/jenkins/workspace/Lucene-Solr-trunk-Linux/checkout/solr/build/solr-core/test-files/solr/collection1/, dataDir=./org.apache.solr.handler.component.DistributedQueryElevationComponentTest-1343931509630/control/data/
[junit4:junit4]   2> 238 T876 oasc.JmxMonitoredMap.<init> JMX monitoring is enabled. Adding Solr mbeans to JMX Server: com.sun.jmx.mbeanserver.JmxMBeanServer@d5f50d
[junit4:junit4]   2> 239 T876 oasc.SolrCore.getNewIndexDir WARNING New index directory detected: old=null new=./org.apache.solr.handler.component.DistributedQueryElevationComponentTest-1343931509630/control/data/index/
[junit4:junit4]   2> 239 T876 oasc.SolrCore.initIndex WARNING [collection1] Solr index directory './org.apache.solr.handler.component.DistributedQueryElevationComponentTest-1343931509630/control/data/index' doesn't exist. Creating new index...
[junit4:junit4]   2> 240 T876 oasc.SolrDeletionPolicy.onCommit SolrDeletionPolicy.onCommit: commits:num=1
[junit4:junit4]   2> 		commit{dir=MockDirWrapper(org.apache.lucene.store.RAMDirectory@11b6b6c lockFactory=org.apache.lucene.store.SingleInstanceLockFactory@142bd58),segFN=segments_1,generation=1,filenames=[segments_1]
[junit4:junit4]   2> 241 T876 oasc.SolrDeletionPolicy.updateCommits newest commit = 1
[junit4:junit4]   2> 242 T876 oasc.RequestHandlers.initHandlersFromConfig created /update: solr.UpdateRequestHandler
[junit4:junit4]   2> 242 T876 oasc.RequestHandlers.initHandlersFromConfig created /elevate: org.apache.solr.handler.component.SearchHandler
[junit4:junit4]   2> 242 T876 oasc.RequestHandlers.initHandlersFromConfig created /dataElevate: org.apache.solr.handler.component.SearchHandler
[junit4:junit4]   2> 243 T876 oashl.XMLLoader.init xsltCacheLifetimeSeconds=60
[junit4:junit4]   2> 243 T876 oasc.RequestHandlers.initHandlersFromConfig WARNING no default request handler is registered (either '/select' or 'standard')
[junit4:junit4]   2> 244 T876 oasc.SolrCore.initDeprecatedSupport WARNING solrconfig.xml uses deprecated <admin/gettableFiles>, Please update your config to use the ShowFileRequestHandler.
[junit4:junit4]   2> 245 T876 oasc.SolrCore.initDeprecatedSupport WARNING adding ShowFileRequestHandler with hidden files: [THROW.ERROR.ON.ADD.UPDATEPROCESSOR.JS, STOPTYPES-1.TXT, SCHEMA-SIM.XML, STOP-SNOWBALL.TXT, SCHEMA-LMJELINEKMERCER.XML, STOP-2.TXT, SOLRCONFIG-SLAVE1.XML, STEMDICT.TXT, SCHEMA-TFIDF.XML, SOLRCONFIG_PERF.XML, SOLRCONFIG-SOLCOREPROPERTIES.XML, SOLRCONFIG-SOLR-749.XML, STOPWORDS.TXT, STOPTYPES-2.TXT, DA_COMPOUNDDICTIONARY.TXT, SOLRCONFIG-MASTER2.XML, SCHEMA15.XML, MISSING.FUNCTIONS.UPDATEPROCESSOR.JS, SYNONYMS.TXT, BAD-SCHEMA-EXTERNAL-FILEFIELD.XML, SCHEMA-LMDIRICHLET.XML, BAD-SCHEMA-UNIQUEKEY-MULTIVALUED.XML, SOLRCONFIG-MASTER1.XML, STOPWORDSWRONGENCODING.TXT, KEEP-2.TXT, BAD-SCHEMA-NONTEXT-ANALYZER.XML, SCHEMASURROUND.XML, DA_UTF8.XML, SOLRCONFIG-TLOG.XML, SOLRCONFIG-PROPINJECT.XML, TRIVIAL.UPDATEPROCESSOR0.JS, PROTWORDS.TXT, SOLRCONFIG-TRANSFORMERS.XML, SOLRCONFIG-MERGEPOLICY.XML, BAD-SCHEMA-UNIQUEKEY-IS-COPYFIELD-DEST.XML, ELEVATE.XML, SOLRCONFIG-DELPOLICY1.XML, BAD-SOLRCONFIG-INVALID-SCRIPTFILE.XML, SOLRCONFIG-QUERYSENDER.XML, SOLRCONFIG-QUERYSENDER-NOQUERY.XML, BAD-SCHEMA-NOT-INDEXED-BUT-POS.XML, SCHEMA.XML, BAD-SCHEMA-DUP-FIELD.XML, SCHEMA_CODEC.XML, SOLRCONFIG-REPEATER.XML, BAD-SCHEMA-OMIT-TF-BUT-NOT-POS.XML, SCHEMA-CHARFILTERS.XML, SOLRCONFIG-ELEVATE.XML, SCHEMA-REPLICATION1.XML, BAD-SCHEMA-CODEC-GLOBAL-VS-FT-MISMATCH.XML, SCHEMA-LUCENEMATCHVERSION.XML, SCHEMA-FOLDING.XML, SOLRCONFIG-SLAVE.XML, OPEN-EXCHANGE-RATES.JSON, BAD-SCHEMA-UNIQUEKEY-USES-DEFAULT.XML, SCHEMA-REVERSED.XML, SCHEMA-STOP-KEEP.XML, HUNSPELL-TEST.AFF, SOLRCONFIG-LAZYWRITER.XML, SOLRCONFIG-DELPOLICY2.XML, HYPHENATION.DTD, TRIVIAL.UPDATEPROCESSOR1.JS, SCHEMA-COLLATE.XML, SOLRCONFIG-NATIVELOCK.XML, ADDFIELDS.UPDATEPROCESSOR.JS, SOLRCONFIG-BASIC.XML, SOLRCONFIG-CACHING.XML, WDFTYPES.TXT, SOLRCONFIG-ALTDIRECTORY.XML, BAD-SCHEMA-SIM-GLOBAL-VS-FT-MISMATCH.XML, BAD-SCHEMA-ANALYZER-CLASS-AND-NESTED.XML, SOLRCONFIG-MASTER3.XML, SOLRCONFIG-PHRASESUGGEST.XML, SCHEMA-PHRASESUGGEST.XML, SOLRCONFIG-FUNCTIONQUERY.XML, SOLRCONFIG-HIGHLIGHT.XML, SCHEMA-DFR.XML, SCHEMA-BM25.XML, SCHEMA-NOT-REQUIRED-UNIQUE-KEY.XML, SOLRCONFIG-ENABLEPLUGIN.XML, SCHEMA-NUMERIC.XML, SCHEMA11.XML, SCHEMA-MINIMAL.XML, BAD-SOLRCONFIG-MISSING-SCRIPTFILE.XML, HUNSPELL-TEST.DIC, BAD_SOLRCONFIG.XML, SOLRCONFIG-MASTER1-KEEPONEBACKUP.XML, XSLT, BAD-SCHEMA-NOT-INDEXED-BUT-TF.XML, SCHEMA12.XML, SOLRCONFIG-NOCACHE.XML, BAD-SCHEMA-DUP-FIELDTYPE.XML, SOLRCONFIG-MASTER.XML, BAD-SCHEMA-DUP-DYNAMICFIELD.XML, FRENCHARTICLES.TXT, SCHEMA-REQUIRED-FIELDS.XML, SOLRCONFIG-SPELLCHECKER.XML, PHRASESUGGEST.TXT, BAD-MP-SOLRCONFIG.XML, SOLRCONFIG-PROPINJECT-INDEXDEFAULT.XML, STOP-1.TXT, MAPPING-ISOLATIN1ACCENT.TXT, SCHEMA-BINARYFIELD.XML, SCHEMA-REPLICATION2.XML, SOLRCONFIG-SIMPLELOCK.XML, OLD_SYNONYMS.TXT, STOPWITHBOM.TXT, SOLRCONFIG_CODEC.XML, KEEP-1.TXT, SOLRCONFIG-UPDATE-PROCESSOR-CHAINS.XML, SCHEMA-COPYFIELD-TEST.XML, CONDITIONAL.UPDATEPROCESSOR.JS, SOLRCONFIG-SCRIPT-UPDATEPROCESSOR.XML, SOLRCONFIG-REQHANDLER.INCL, SCHEMA-TRIE.XML, MISSLEADING.EXTENSION.UPDATEPROCESSOR.JS.TXT, SCHEMA-SPELLCHECKER.XML, SCHEMA-IB.XML, SOLRCONFIG-TERMINDEX.XML, BAD-SCHEMA-NOT-INDEXED-BUT-NORMS.XML, COMPOUNDDICTIONARY.TXT, BAD-SOLRCONFIG-BOGUS-SCRIPTENGINE-NAME.XML, SOLRCONFIG-XINCLUDE.XML, SOLRCONFIG-SPELLCHECKCOMPONENT.XML, CURRENCY.XML]
[junit4:junit4]   2> 247 T876 oass.SolrIndexSearcher.<init> Opening Searcher@1cab6b8 main
[junit4:junit4]   2> 248 T876 oass.SolrIndexSearcher.getIndexDir WARNING WARNING: Directory impl does not support setting indexDir: org.apache.lucene.store.MockDirectoryWrapper
[junit4:junit4]   2> 248 T876 oasu.CommitTracker.<init> Hard AutoCommit: disabled
[junit4:junit4]   2> 248 T876 oasu.CommitTracker.<init> Soft AutoCommit: disabled
[junit4:junit4]   2> 248 T876 oashc.QueryElevationComponent.inform Loading QueryElevation from: /mnt/ssd/jenkins/workspace/Lucene-Solr-trunk-Linux/checkout/solr/build/solr-core/test-files/solr/collection1/conf/elevate.xml
[junit4:junit4]   2> 259 T876 oashc.QueryElevationComponent.inform Loading QueryElevation from: /mnt/ssd/jenkins/workspace/Lucene-Solr-trunk-Linux/checkout/solr/build/solr-core/test-files/solr/collection1/conf/elevate.xml
[junit4:junit4]   2> 267 T876 oashc.HttpShardHandlerFactory.getParameter Setting socketTimeout to: 0
[junit4:junit4]   2> 267 T876 oashc.HttpShardHandlerFactory.getParameter Setting urlScheme to: http://
[junit4:junit4]   2> 268 T876 oashc.HttpShardHandlerFactory.getParameter Setting connTimeout to: 0
[junit4:junit4]   2> 268 T876 oashc.HttpShardHandlerFactory.getParameter Setting maxConnectionsPerHost to: 20
[junit4:junit4]   2> 268 T876 oashc.HttpShardHandlerFactory.getParameter Setting corePoolSize to: 0
[junit4:junit4]   2> 269 T876 oashc.HttpShardHandlerFactory.getParameter Setting maximumPoolSize to: 2147483647
[junit4:junit4]   2> 269 T876 oashc.HttpShardHandlerFactory.getParameter Setting maxThreadIdleTime to: 5
[junit4:junit4]   2> 269 T876 oashc.HttpShardHandlerFactory.getParameter Setting sizeOfQueue to: -1
[junit4:junit4]   2> 269 T876 oashc.HttpShardHandlerFactory.getParameter Setting fairnessPolicy to: false
[junit4:junit4]   2> 270 T876 oascsi.HttpClientUtil.createClient Creating new http client, config:maxConnectionsPerHost=20&maxConnections=10000&socketTimeout=0&connTimeout=0&retry=false
[junit4:junit4]   2> 274 T886 oasc.SolrCore.registerSearcher [collection1] Registered new searcher Searcher@1cab6b8 main{StandardDirectoryReader(segments_1:1)}
[junit4:junit4]   2> 274 T876 oasc.CoreContainer.register registering core: collection1
[junit4:junit4]   2> 274 T876 oass.SolrDispatchFilter.init user.dir=/mnt/ssd/jenkins/workspace/Lucene-Solr-trunk-Linux/checkout/solr/build/solr-core/test/J1
[junit4:junit4]   2> 275 T876 oass.SolrDispatchFilter.init SolrDispatchFilter.init() done
[junit4:junit4]   2> 275 T876 oascsi.HttpClientUtil.createClient Creating new http client, config:maxConnections=128&maxConnectionsPerHost=32&followRedirects=false
[junit4:junit4]   2> 277 T876 oejs.Server.doStart jetty-8.1.2.v20120308
[junit4:junit4]   2> 279 T876 oejs.AbstractConnector.doStart Started SocketConnector@0.0.0.0:54794
[junit4:junit4]   2> 280 T876 oasc.SolrResourceLoader.locateSolrHome JNDI not configured for solr (NoInitialContextEx)
[junit4:junit4]   2> 280 T876 oasc.SolrResourceLoader.locateSolrHome using system property solr.solr.home: /mnt/ssd/jenkins/workspace/Lucene-Solr-trunk-Linux/checkout/solr/build/solr-core/test-files/solr
[junit4:junit4]   2> 280 T876 oasc.SolrResourceLoader.<init> new SolrResourceLoader for deduced Solr Home: '/mnt/ssd/jenkins/workspace/Lucene-Solr-trunk-Linux/checkout/solr/build/solr-core/test-files/solr/'
[junit4:junit4]   2> 290 T876 oass.SolrDispatchFilter.init SolrDispatchFilter.init()
[junit4:junit4]   2> 290 T876 oasc.SolrResourceLoader.locateSolrHome JNDI not configured for solr (NoInitialContextEx)
[junit4:junit4]   2> 291 T876 oasc.SolrResourceLoader.locateSolrHome using system property solr.solr.home: /mnt/ssd/jenkins/workspace/Lucene-Solr-trunk-Linux/checkout/solr/build/solr-core/test-files/solr
[junit4:junit4]   2> 291 T876 oasc.CoreContainer$Initializer.initialize looking for solr.xml: /mnt/ssd/jenkins/workspace/Lucene-Solr-trunk-Linux/checkout/solr/build/solr-core/test-files/solr/solr.xml
[junit4:junit4]   2> 291 T876 oasc.CoreContainer.<init> New CoreContainer 27599581
[junit4:junit4]   2> 292 T876 oasc.CoreContainer.load Loading CoreContainer using Solr Home: '/mnt/ssd/jenkins/workspace/Lucene-Solr-trunk-Linux/checkout/solr/build/solr-core/test-files/solr/'
[junit4:junit4]   2> 292 T876 oasc.SolrResourceLoader.<init> new SolrResourceLoader for directory: '/mnt/ssd/jenkins/workspace/Lucene-Solr-trunk-Linux/checkout/solr/build/solr-core/test-files/solr/'
[junit4:junit4]   2> 304 T876 oasc.CoreContainer.load Registering Log Listener
[junit4:junit4]   2> 318 T876 oasc.CoreContainer.create Creating SolrCore 'collection1' using instanceDir: /mnt/ssd/jenkins/workspace/Lucene-Solr-trunk-Linux/checkout/solr/build/solr-core/test-files/solr/collection1
[junit4:junit4]   2> 318 T876 oasc.SolrResourceLoader.<init> new SolrResourceLoader for directory: '/mnt/ssd/jenkins/workspace/Lucene-Solr-trunk-Linux/checkout/solr/build/solr-core/test-files/solr/collection1/'
[junit4:junit4]   2> 321 T876 oasc.SolrResourceLoader.replaceClassLoader Adding 'file:/mnt/ssd/jenkins/workspace/Lucene-Solr-trunk-Linux/checkout/solr/build/solr-core/test-files/solr/collection1/lib/README' to classloader
[junit4:junit4]   2> 322 T876 oasc.SolrResourceLoader.replaceClassLoader Adding 'file:/mnt/ssd/jenkins/workspace/Lucene-Solr-trunk-Linux/checkout/solr/build/solr-core/test-files/solr/collection1/lib/classes/' to classloader
[junit4:junit4]   2> 348 T876 oasc.SolrConfig.<init> Using Lucene MatchVersion: LUCENE_50
[junit4:junit4]   2> 389 T876 oasc.SolrConfig.<init> Loaded SolrConfig: solrconfig-elevate.xml
[junit4:junit4]   2> 389 T876 oass.IndexSchema.readSchema Reading Solr Schema
[junit4:junit4]   2> 392 T876 oass.IndexSchema.readSchema Schema name=example
[junit4:junit4]   2> 517 T876 oass.IndexSchema.readSchema default search field in schema is text
[junit4:junit4]   2> 518 T876 oass.IndexSchema.readSchema unique key field: id
[junit4:junit4]   2> 520 T876 oasc.SolrCore.<init> [collection1] Opening new SolrCore at /mnt/ssd/jenkins/workspace/Lucene-Solr-trunk-Linux/checkout/solr/build/solr-core/test-files/solr/collection1/, dataDir=./org.apache.solr.handler.component.DistributedQueryElevationComponentTest-1343931509630/shard0/data/
[junit4:junit4]   2> 520 T876 oasc.JmxMonitoredMap.<init> JMX monitoring is enabled. Adding Solr mbeans to JMX Server: com.sun.jmx.mbeanserver.JmxMBeanServer@d5f50d
[junit4:junit4]   2> 521 T876 oasc.SolrCore.getNewIndexDir WARNING New index directory detected: old=null new=./org.apache.solr.handler.component.DistributedQueryElevationComponentTest-1343931509630/shard0/data/index/
[junit4:junit4]   2> 521 T876 oasc.SolrCore.initIndex WARNING [collection1] Solr index directory './org.apache.solr.handler.component.DistributedQueryElevationComponentTest-1343931509630/shard0/data/index' doesn't exist. Creating new index...
[junit4:junit4]   2> 522 T876 oasc.SolrDeletionPolicy.onCommit SolrDeletionPolicy.onCommit: commits:num=1
[junit4:junit4]   2> 		commit{dir=MockDirWrapper(org.apache.lucene.store.RAMDirectory@134f77b lockFactory=org.apache.lucene.store.SingleInstanceLockFactory@110dae2),segFN=segments_1,generation=1,filenames=[segments_1]
[junit4:junit4]   2> 522 T876 oasc.SolrDeletionPolicy.updateCommits newest commit = 1
[junit4:junit4]   2> 523 T876 oasc.RequestHandlers.initHandlersFromConfig created /update: solr.UpdateRequestHandler
[junit4:junit4]   2> 524 T876 oasc.RequestHandlers.initHandlersFromConfig created /elevate: org.apache.solr.handler.component.SearchHandler
[junit4:junit4]   2> 524 T876 oasc.RequestHandlers.initHandlersFromConfig created /dataElevate: org.apache.solr.handler.component.SearchHandler
[junit4:junit4]   2> 524 T876 oashl.XMLLoader.init xsltCacheLifetimeSeconds=60
[junit4:junit4]   2> 524 T876 oasc.RequestHandlers.initHandlersFromConfig WARNING no default request handler is registered (either '/select' or 'standard')
[junit4:junit4]   2> 525 T876 oasc.SolrCore.initDeprecatedSupport WARNING solrconfig.xml uses deprecated <admin/gettableFiles>, Please update your config to use the ShowFileRequestHandler.
[junit4:junit4]   2> 526 T876 oasc.SolrCore.initDeprecatedSupport WARNING adding ShowFileRequestHandler with hidden files: [THROW.ERROR.ON.ADD.UPDATEPROCESSOR.JS, STOPTYPES-1.TXT, SCHEMA-SIM.XML, STOP-SNOWBALL.TXT, SCHEMA-LMJELINEKMERCER.XML, STOP-2.TXT, SOLRCONFIG-SLAVE1.XML, STEMDICT.TXT, SCHEMA-TFIDF.XML, SOLRCONFIG_PERF.XML, SOLRCONFIG-SOLCOREPROPERTIES.XML, SOLRCONFIG-SOLR-749.XML, STOPWORDS.TXT, STOPTYPES-2.TXT, DA_COMPOUNDDICTIONARY.TXT, SOLRCONFIG-MASTER2.XML, SCHEMA15.XML, MISSING.FUNCTIONS.UPDATEPROCESSOR.JS, SYNONYMS.TXT, BAD-SCHEMA-EXTERNAL-FILEFIELD.XML, SCHEMA-LMDIRICHLET.XML, BAD-SCHEMA-UNIQUEKEY-MULTIVALUED.XML, SOLRCONFIG-MASTER1.XML, STOPWORDSWRONGENCODING.TXT, KEEP-2.TXT, BAD-SCHEMA-NONTEXT-ANALYZER.XML, SCHEMASURROUND.XML, DA_UTF8.XML, SOLRCONFIG-TLOG.XML, SOLRCONFIG-PROPINJECT.XML, TRIVIAL.UPDATEPROCESSOR0.JS, PROTWORDS.TXT, SOLRCONFIG-TRANSFORMERS.XML, SOLRCONFIG-MERGEPOLICY.XML, BAD-SCHEMA-UNIQUEKEY-IS-COPYFIELD-DEST.XML, ELEVATE.XML, SOLRCONFIG-DELPOLICY1.XML, BAD-SOLRCONFIG-INVALID-SCRIPTFILE.XML, SOLRCONFIG-QUERYSENDER.XML, SOLRCONFIG-QUERYSENDER-NOQUERY.XML, BAD-SCHEMA-NOT-INDEXED-BUT-POS.XML, SCHEMA.XML, BAD-SCHEMA-DUP-FIELD.XML, SCHEMA_CODEC.XML, SOLRCONFIG-REPEATER.XML, BAD-SCHEMA-OMIT-TF-BUT-NOT-POS.XML, SCHEMA-CHARFILTERS.XML, SOLRCONFIG-ELEVATE.XML, SCHEMA-REPLICATION1.XML, BAD-SCHEMA-CODEC-GLOBAL-VS-FT-MISMATCH.XML, SCHEMA-LUCENEMATCHVERSION.XML, SCHEMA-FOLDING.XML, SOLRCONFIG-SLAVE.XML, OPEN-EXCHANGE-RATES.JSON, BAD-SCHEMA-UNIQUEKEY-USES-DEFAULT.XML, SCHEMA-REVERSED.XML, SCHEMA-STOP-KEEP.XML, HUNSPELL-TEST.AFF, SOLRCONFIG-LAZYWRITER.XML, SOLRCONFIG-DELPOLICY2.XML, HYPHENATION.DTD, TRIVIAL.UPDATEPROCESSOR1.JS, SCHEMA-COLLATE.XML, SOLRCONFIG-NATIVELOCK.XML, ADDFIELDS.UPDATEPROCESSOR.JS, SOLRCONFIG-BASIC.XML, SOLRCONFIG-CACHING.XML, WDFTYPES.TXT, SOLRCONFIG-ALTDIRECTORY.XML, BAD-SCHEMA-SIM-GLOBAL-VS-FT-MISMATCH.XML, BAD-SCHEMA-ANALYZER-CLASS-AND-NESTED.XML, SOLRCONFIG-MASTER3.XML, SOLRCONFIG-PHRASESUGGEST.XML, SCHEMA-PHRASESUGGEST.XML, SOLRCONFIG-FUNCTIONQUERY.XML, SOLRCONFIG-HIGHLIGHT.XML, SCHEMA-DFR.XML, SCHEMA-BM25.XML, SCHEMA-NOT-REQUIRED-UNIQUE-KEY.XML, SOLRCONFIG-ENABLEPLUGIN.XML, SCHEMA-NUMERIC.XML, SCHEMA11.XML, SCHEMA-MINIMAL.XML, BAD-SOLRCONFIG-MISSING-SCRIPTFILE.XML, HUNSPELL-TEST.DIC, BAD_SOLRCONFIG.XML, SOLRCONFIG-MASTER1-KEEPONEBACKUP.XML, XSLT, BAD-SCHEMA-NOT-INDEXED-BUT-TF.XML, SCHEMA12.XML, SOLRCONFIG-NOCACHE.XML, BAD-SCHEMA-DUP-FIELDTYPE.XML, SOLRCONFIG-MASTER.XML, BAD-SCHEMA-DUP-DYNAMICFIELD.XML, FRENCHARTICLES.TXT, SCHEMA-REQUIRED-FIELDS.XML, SOLRCONFIG-SPELLCHECKER.XML, PHRASESUGGEST.TXT, BAD-MP-SOLRCONFIG.XML, SOLRCONFIG-PROPINJECT-INDEXDEFAULT.XML, STOP-1.TXT, MAPPING-ISOLATIN1ACCENT.TXT, SCHEMA-BINARYFIELD.XML, SCHEMA-REPLICATION2.XML, SOLRCONFIG-SIMPLELOCK.XML, OLD_SYNONYMS.TXT, STOPWITHBOM.TXT, SOLRCONFIG_CODEC.XML, KEEP-1.TXT, SOLRCONFIG-UPDATE-PROCESSOR-CHAINS.XML, SCHEMA-COPYFIELD-TEST.XML, CONDITIONAL.UPDATEPROCESSOR.JS, SOLRCONFIG-SCRIPT-UPDATEPROCESSOR.XML, SOLRCONFIG-REQHANDLER.INCL, SCHEMA-TRIE.XML, MISSLEADING.EXTENSION.UPDATEPROCESSOR.JS.TXT, SCHEMA-SPELLCHECKER.XML, SCHEMA-IB.XML, SOLRCONFIG-TERMINDEX.XML, BAD-SCHEMA-NOT-INDEXED-BUT-NORMS.XML, COMPOUNDDICTIONARY.TXT, BAD-SOLRCONFIG-BOGUS-SCRIPTENGINE-NAME.XML, SOLRCONFIG-XINCLUDE.XML, SOLRCONFIG-SPELLCHECKCOMPONENT.XML, CURRENCY.XML]
[junit4:junit4]   2> 528 T876 oass.SolrIndexSearcher.<init> Opening Searcher@1416889 main
[junit4:junit4]   2> 528 T876 oass.SolrIndexSearcher.getIndexDir WARNING WARNING: Directory impl does not support setting indexDir: org.apache.lucene.store.MockDirectoryWrapper
[junit4:junit4]   2> 528 T876 oasu.CommitTracker.<init> Hard AutoCommit: disabled
[junit4:junit4]   2> 529 T876 oasu.CommitTracker.<init> Soft AutoCommit: disabled
[junit4:junit4]   2> 529 T876 oashc.QueryElevationComponent.inform Loading QueryElevation from: /mnt/ssd/jenkins/workspace/Lucene-Solr-trunk-Linux/checkout/solr/build/solr-core/test-files/solr/collection1/conf/elevate.xml
[junit4:junit4]   2> 535 T876 oashc.QueryElevationComponent.inform Loading QueryElevation from: /mnt/ssd/jenkins/workspace/Lucene-Solr-trunk-Linux/checkout/solr/build/solr-core/test-files/solr/collection1/conf/elevate.xml
[junit4:junit4]   2> 540 T876 oashc.HttpShardHandlerFactory.getParameter Setting socketTimeout to: 0
[junit4:junit4]   2> 541 T876 oashc.HttpShardHandlerFactory.getParameter Setting urlScheme to: http://
[junit4:junit4]   2> 541 T876 oashc.HttpShardHandlerFactory.getParameter Setting connTimeout to: 0
[junit4:junit4]   2> 541 T876 oashc.HttpShardHandlerFactory.getParameter Setting maxConnectionsPerHost to: 20
[junit4:junit4]   2> 541 T876 oashc.HttpShardHandlerFactory.getParameter Setting corePoolSize to: 0
[junit4:junit4]   2> 541 T876 oashc.HttpShardHandlerFactory.getParameter Setting maximumPoolSize to: 2147483647
[junit4:junit4]   2> 541 T876 oashc.HttpShardHandlerFactory.getParameter Setting maxThreadIdleTime to: 5
[junit4:junit4]   2> 542 T876 oashc.HttpShardHandlerFactory.getParameter Setting sizeOfQueue to: -1
[junit4:junit4]   2> 542 T876 oashc.HttpShardHandlerFactory.getParameter Setting fairnessPolicy to: false
[junit4:junit4]   2> 542 T876 oascsi.HttpClientUtil.createClient Creating new http client, config:maxConnectionsPerHost=20&maxConnections=10000&socketTimeout=0&connTimeout=0&retry=false
[junit4:junit4]   2> 544 T896 oasc.SolrCore.registerSearcher [collection1] Registered new searcher Searcher@1416889 main{StandardDirectoryReader(segments_1:1)}
[junit4:junit4]   2> 544 T876 oasc.CoreContainer.register registering core: collection1
[junit4:junit4]   2> 544 T876 oass.SolrDispatchFilter.init user.dir=/mnt/ssd/jenkins/workspace/Lucene-Solr-trunk-Linux/checkout/solr/build/solr-core/test/J1
[junit4:junit4]   2> 545 T876 oass.SolrDispatchFilter.init SolrDispatchFilter.init() done
[junit4:junit4]   2> 545 T876 oascsi.HttpClientUtil.createClient Creating new http client, config:maxConnections=128&maxConnectionsPerHost=32&followRedirects=false
[junit4:junit4]   2> 547 T876 oejs.Server.doStart jetty-8.1.2.v20120308
[junit4:junit4]   2> 548 T876 oejs.AbstractConnector.doStart Started SocketConnector@0.0.0.0:41554
[junit4:junit4]   2> 549 T876 oasc.SolrResourceLoader.locateSolrHome JNDI not configured for solr (NoInitialContextEx)
[junit4:junit4]   2> 549 T876 oasc.SolrResourceLoader.locateSolrHome using system property solr.solr.home: /mnt/ssd/jenkins/workspace/Lucene-Solr-trunk-Linux/checkout/solr/build/solr-core/test-files/solr
[junit4:junit4]   2> 549 T876 oasc.SolrResourceLoader.<init> new SolrResourceLoader for deduced Solr Home: '/mnt/ssd/jenkins/workspace/Lucene-Solr-trunk-Linux/checkout/solr/build/solr-core/test-files/solr/'
[junit4:junit4]   2> 554 T876 oass.SolrDispatchFilter.init SolrDispatchFilter.init()
[junit4:junit4]   2> 555 T876 oasc.SolrResourceLoader.locateSolrHome JNDI not configured for solr (NoInitialContextEx)
[junit4:junit4]   2> 555 T876 oasc.SolrResourceLoader.locateSolrHome using system property solr.solr.home: /mnt/ssd/jenkins/workspace/Lucene-Solr-trunk-Linux/checkout/solr/build/solr-core/test-files/solr
[junit4:junit4]   2> 555 T876 oasc.CoreContainer$Initializer.initialize looking for solr.xml: /mnt/ssd/jenkins/workspace/Lucene-Solr-trunk-Linux/checkout/solr/build/solr-core/test-files/solr/solr.xml
[junit4:junit4]   2> 555 T876 oasc.CoreContainer.<init> New CoreContainer 974504
[junit4:junit4]   2> 555 T876 oasc.CoreContainer.load Loading CoreContainer using Solr Home: '/mnt/ssd/jenkins/workspace/Lucene-Solr-trunk-Linux/checkout/solr/build/solr-core/test-files/solr/'
[junit4:junit4]   2> 556 T876 oasc.SolrResourceLoader.<init> new SolrResourceLoader for directory: '/mnt/ssd/jenkins/workspace/Lucene-Solr-trunk-Linux/checkout/solr/build/solr-core/test-files/solr/'
[junit4:junit4]   2> 563 T876 oasc.CoreContainer.load Registering Log Listener
[junit4:junit4]   2> 571 T876 oasc.CoreContainer.create Creating SolrCore 'collection1' using instanceDir: /mnt/ssd/jenkins/workspace/Lucene-Solr-trunk-Linux/checkout/solr/build/solr-core/test-files/solr/collection1
[junit4:junit4]   2> 571 T876 oasc.SolrResourceLoader.<init> new SolrResourceLoader for directory: '/mnt/ssd/jenkins/workspace/Lucene-Solr-trunk-Linux/checkout/solr/build/solr-core/test-files/solr/collection1/'
[junit4:junit4]   2> 572 T876 oasc.SolrResourceLoader.replaceClassLoader Adding 'file:/mnt/ssd/jenkins/workspace/Lucene-Solr-trunk-Linux/checkout/solr/build/solr-core/test-files/solr/collection1/lib/README' to classloader
[junit4:junit4]   2> 572 T876 oasc.SolrResourceLoader.replaceClassLoader Adding 'file:/mnt/ssd/jenkins/workspace/Lucene-Solr-trunk-Linux/checkout/solr/build/solr-core/test-files/solr/collection1/lib/classes/' to classloader
[junit4:junit4]   2> 588 T876 oasc.SolrConfig.<init> Using Lucene MatchVersion: LUCENE_50
[junit4:junit4]   2> 612 T876 oasc.SolrConfig.<init> Loaded SolrConfig: solrconfig-elevate.xml
[junit4:junit4]   2> 613 T876 oass.IndexSchema.readSchema Reading Solr Schema
[junit4:junit4]   2> 615 T876 oass.IndexSchema.readSchema Schema name=example
[junit4:junit4]   2> 719 T876 oass.IndexSchema.readSchema default search field in schema is text
[junit4:junit4]   2> 720 T876 oass.IndexSchema.readSchema unique key field: id
[junit4:junit4]   2> 722 T876 oasc.SolrCore.<init> [collection1] Opening new SolrCore at /mnt/ssd/jenkins/workspace/Lucene-Solr-trunk-Linux/checkout/solr/build/solr-core/test-files/solr/collection1/, dataDir=./org.apache.solr.handler.component.DistributedQueryElevationComponentTest-1343931509630/shard1/data/
[junit4:junit4]   2> 722 T876 oasc.JmxMonitoredMap.<init> JMX monitoring is enabled. Adding Solr mbeans to JMX Server: com.sun.jmx.mbeanserver.JmxMBeanServer@d5f50d
[junit4:junit4]   2> 723 T876 oasc.SolrCore.getNewIndexDir WARNING New index directory detected: old=null new=./org.apache.solr.handler.component.DistributedQueryElevationComponentTest-1343931509630/shard1/data/index/
[junit4:junit4]   2> 723 T876 oasc.SolrCore.initIndex WARNING [collection1] Solr index directory './org.apache.solr.handler.component.DistributedQueryElevationComponentTest-1343931509630/shard1/data/index' doesn't exist. Creating new index...
[junit4:junit4]   2> 724 T876 oasc.SolrDeletionPolicy.onCommit SolrDeletionPolicy.onCommit: commits:num=1
[junit4:junit4]   2> 		commit{dir=MockDirWrapper(org.apache.lucene.store.RAMDirectory@249fc0 lockFactory=org.apache.lucene.store.SingleInstanceLockFactory@1a99cab),segFN=segments_1,generation=1,filenames=[segments_1]
[junit4:junit4]   2> 724 T876 oasc.SolrDeletionPolicy.updateCommits newest commit = 1
[junit4:junit4]   2> 724 T876 oasc.RequestHandlers.initHandlersFromConfig created /update: solr.UpdateRequestHandler
[junit4:junit4]   2> 725 T876 oasc.RequestHandlers.initHandlersFromConfig created /elevate: org.apache.solr.handler.component.SearchHandler
[junit4:junit4]   2> 725 T876 oasc.RequestHandlers.initHandlersFromConfig created /dataElevate: org.apache.solr.handler.component.SearchHandler
[junit4:junit4]   2> 725 T876 oashl.XMLLoader.init xsltCacheLifetimeSeconds=60
[junit4:junit4]   2> 725 T876 oasc.RequestHandlers.initHandlersFromConfig WARNING no default request handler is registered (either '/select' or 'standard')
[junit4:junit4]   2> 726 T876 oasc.SolrCore.initDeprecatedSupport WARNING solrconfig.xml uses deprecated <admin/gettableFiles>, Please update your config to use the ShowFileRequestHandler.
[junit4:junit4]   2> 727 T876 oasc.SolrCore.initDeprecatedSupport WARNING adding ShowFileRequestHandler with hidden files: [THROW.ERROR.ON.ADD.UPDATEPROCESSOR.JS, STOPTYPES-1.TXT, SCHEMA-SIM.XML, STOP-SNOWBALL.TXT, SCHEMA-LMJELINEKMERCER.XML, STOP-2.TXT, SOLRCONFIG-SLAVE1.XML, STEMDICT.TXT, SCHEMA-TFIDF.XML, SOLRCONFIG_PERF.XML, SOLRCONFIG-SOLCOREPROPERTIES.XML, SOLRCONFIG-SOLR-749.XML, STOPWORDS.TXT, STOPTYPES-2.TXT, DA_COMPOUNDDICTIONARY.TXT, SOLRCONFIG-MASTER2.XML, SCHEMA15.XML, MISSING.FUNCTIONS.UPDATEPROCESSOR.JS, SYNONYMS.TXT, BAD-SCHEMA-EXTERNAL-FILEFIELD.XML, SCHEMA-LMDIRICHLET.XML, BAD-SCHEMA-UNIQUEKEY-MULTIVALUED.XML, SOLRCONFIG-MASTER1.XML, STOPWORDSWRONGENCODING.TXT, KEEP-2.TXT, BAD-SCHEMA-NONTEXT-ANALYZER.XML, SCHEMASURROUND.XML, DA_UTF8.XML, SOLRCONFIG-TLOG.XML, SOLRCONFIG-PROPINJECT.XML, TRIVIAL.UPDATEPROCESSOR0.JS, PROTWORDS.TXT, SOLRCONFIG-TRANSFORMERS.XML, SOLRCONFIG-MERGEPOLICY.XML, BAD-SCHEMA-UNIQUEKEY-IS-COPYFIELD-DEST.XML, ELEVATE.XML, SOLRCONFIG-DELPOLICY1.XML, BAD-SOLRCONFIG-INVALID-SCRIPTFILE.XML, SOLRCONFIG-QUERYSENDER.XML, SOLRCONFIG-QUERYSENDER-NOQUERY.XML, BAD-SCHEMA-NOT-INDEXED-BUT-POS.XML, SCHEMA.XML, BAD-SCHEMA-DUP-FIELD.XML, SCHEMA_CODEC.XML, SOLRCONFIG-REPEATER.XML, BAD-SCHEMA-OMIT-TF-BUT-NOT-POS.XML, SCHEMA-CHARFILTERS.XML, SOLRCONFIG-ELEVATE.XML, SCHEMA-REPLICATION1.XML, BAD-SCHEMA-CODEC-GLOBAL-VS-FT-MISMATCH.XML, SCHEMA-LUCENEMATCHVERSION.XML, SCHEMA-FOLDING.XML, SOLRCONFIG-SLAVE.XML, OPEN-EXCHANGE-RATES.JSON, BAD-SCHEMA-UNIQUEKEY-USES-DEFAULT.XML, SCHEMA-REVERSED.XML, SCHEMA-STOP-KEEP.XML, HUNSPELL-TEST.AFF, SOLRCONFIG-LAZYWRITER.XML, SOLRCONFIG-DELPOLICY2.XML, HYPHENATION.DTD, TRIVIAL.UPDATEPROCESSOR1.JS, SCHEMA-COLLATE.XML, SOLRCONFIG-NATIVELOCK.XML, ADDFIELDS.UPDATEPROCESSOR.JS, SOLRCONFIG-BASIC.XML, SOLRCONFIG-CACHING.XML, WDFTYPES.TXT, SOLRCONFIG-ALTDIRECTORY.XML, BAD-SCHEMA-SIM-GLOBAL-VS-FT-MISMATCH.XML, BAD-SCHEMA-ANALYZER-CLASS-AND-NESTED.XML, SOLRCONFIG-MASTER3.XML, SOLRCONFIG-PHRASESUGGEST.XML, SCHEMA-PHRASESUGGEST.XML, SOLRCONFIG-FUNCTIONQUERY.XML, SOLRCONFIG-HIGHLIGHT.XML, SCHEMA-DFR.XML, SCHEMA-BM25.XML, SCHEMA-NOT-REQUIRED-UNIQUE-KEY.XML, SOLRCONFIG-ENABLEPLUGIN.XML, SCHEMA-NUMERIC.XML, SCHEMA11.XML, SCHEMA-MINIMAL.XML, BAD-SOLRCONFIG-MISSING-SCRIPTFILE.XML, HUNSPELL-TEST.DIC, BAD_SOLRCONFIG.XML, SOLRCONFIG-MASTER1-KEEPONEBACKUP.XML, XSLT, BAD-SCHEMA-NOT-INDEXED-BUT-TF.XML, SCHEMA12.XML, SOLRCONFIG-NOCACHE.XML, BAD-SCHEMA-DUP-FIELDTYPE.XML, SOLRCONFIG-MASTER.XML, BAD-SCHEMA-DUP-DYNAMICFIELD.XML, FRENCHARTICLES.TXT, SCHEMA-REQUIRED-FIELDS.XML, SOLRCONFIG-SPELLCHECKER.XML, PHRASESUGGEST.TXT, BAD-MP-SOLRCONFIG.XML, SOLRCONFIG-PROPINJECT-INDEXDEFAULT.XML, STOP-1.TXT, MAPPING-ISOLATIN1ACCENT.TXT, SCHEMA-BINARYFIELD.XML, SCHEMA-REPLICATION2.XML, SOLRCONFIG-SIMPLELOCK.XML, OLD_SYNONYMS.TXT, STOPWITHBOM.TXT, SOLRCONFIG_CODEC.XML, KEEP-1.TXT, SOLRCONFIG-UPDATE-PROCESSOR-CHAINS.XML, SCHEMA-COPYFIELD-TEST.XML, CONDITIONAL.UPDATEPROCESSOR.JS, SOLRCONFIG-SCRIPT-UPDATEPROCESSOR.XML, SOLRCONFIG-REQHANDLER.INCL, SCHEMA-TRIE.XML, MISSLEADING.EXTENSION.UPDATEPROCESSOR.JS.TXT, SCHEMA-SPELLCHECKER.XML, SCHEMA-IB.XML, SOLRCONFIG-TERMINDEX.XML, BAD-SCHEMA-NOT-INDEXED-BUT-NORMS.XML, COMPOUNDDICTIONARY.TXT, BAD-SOLRCONFIG-BOGUS-SCRIPTENGINE-NAME.XML, SOLRCONFIG-XINCLUDE.XML, SOLRCONFIG-SPELLCHECKCOMPONENT.XML, CURRENCY.XML]
[junit4:junit4]   2> 729 T876 oass.SolrIndexSearcher.<init> Opening Searcher@1c65df1 main
[junit4:junit4]   2> 729 T876 oass.SolrIndexSearcher.getIndexDir WARNING WARNING: Directory impl does not support setting indexDir: org.apache.lucene.store.MockDirectoryWrapper
[junit4:junit4]   2> 729 T876 oasu.CommitTracker.<init> Hard AutoCommit: disabled
[junit4:junit4]   2> 729 T876 oasu.CommitTracker.<init> Soft AutoCommit: disabled
[junit4:junit4]   2> 729 T876 oashc.QueryElevationComponent.inform Loading QueryElevation from: /mnt/ssd/jenkins/workspace/Lucene-Solr-trunk-Linux/checkout/solr/build/solr-core/test-files/solr/collection1/conf/elevate.xml
[junit4:junit4]   2> 734 T876 oashc.QueryElevationComponent.inform Loading QueryElevation from: /mnt/ssd/jenkins/workspace/Lucene-Solr-trunk-Linux/checkout/solr/build/solr-core/test-files/solr/collection1/conf/elevate.xml
[junit4:junit4]   2> 739 T876 oashc.HttpShardHandlerFactory.getParameter Setting socketTimeout to: 0
[junit4:junit4]   2> 740 T876 oashc.HttpShardHandlerFactory.getParameter Setting urlScheme to: http://
[junit4:junit4]   2> 740 T876 oashc.HttpShardHandlerFactory.getParameter Setting connTimeout to: 0
[junit4:junit4]   2> 740 T876 oashc.HttpShardHandlerFactory.getParameter Setting maxConnectionsPerHost to: 20
[junit4:junit4]   2> 740 T876 oashc.HttpShardHandlerFactory.getParameter Setting corePoolSize to: 0
[junit4:junit4]   2> 740 T876 oashc.HttpShardHandlerFactory.getParameter Setting maximumPoolSize to: 2147483647
[junit4:junit4]   2> 740 T876 oashc.HttpShardHandlerFactory.getParameter Setting maxThreadIdleTime to: 5
[junit4:junit4]   2> 741 T876 oashc.HttpShardHandlerFactory.getParameter Setting sizeOfQueue to: -1
[junit4:junit4]   2> 741 T876 oashc.HttpShardHandlerFactory.getParameter Setting fairnessPolicy to: false
[junit4:junit4]   2> 741 T876 oascsi.HttpClientUtil.createClient Creating new http client, config:maxConnectionsPerHost=20&maxConnections=10000&socketTimeout=0&connTimeout=0&retry=false
[junit4:junit4]   2> 743 T906 oasc.SolrCore.registerSearcher [collection1] Registered new searcher Searcher@1c65df1 main{StandardDirectoryReader(segments_1:1)}
[junit4:junit4]   2> 743 T876 oasc.CoreContainer.register registering core: collection1
[junit4:junit4]   2> 744 T876 oass.SolrDispatchFilter.init user.dir=/mnt/ssd/jenkins/workspace/Lucene-Solr-trunk-Linux/checkout/solr/build/solr-core/test/J1
[junit4:junit4]   2> 744 T876 oass.SolrDispatchFilter.init SolrDispatchFilter.init() done
[junit4:junit4]   2> 744 T876 oascsi.HttpClientUtil.createClient Creating new http client, config:maxConnections=128&maxConnectionsPerHost=32&followRedirects=false
[junit4:junit4]   2> 746 T876 oejs.Server.doStart jetty-8.1.2.v20120308
[junit4:junit4]   2> 748 T876 oejs.AbstractConnector.doStart Started SocketConnector@0.0.0.0:50226
[junit4:junit4]   2> 749 T876 oasc.SolrResourceLoader.locateSolrHome JNDI not configured for solr (NoInitialContextEx)
[junit4:junit4]   2> 749 T876 oasc.SolrResourceLoader.locateSolrHome using system property solr.solr.home: /mnt/ssd/jenkins/workspace/Lucene-Solr-trunk-Linux/checkout/solr/build/solr-core/test-files/solr
[junit4:junit4]   2> 749 T876 oasc.SolrResourceLoader.<init> new SolrResourceLoader for deduced Solr Home: '/mnt/ssd/jenkins/workspace/Lucene-Solr-trunk-Linux/checkout/solr/build/solr-core/test-files/solr/'
[junit4:junit4]   2> 756 T876 oass.SolrDispatchFilter.init SolrDispatchFilter.init()
[junit4:junit4]   2> 756 T876 oasc.SolrResourceLoader.locateSolrHome JNDI not configured for solr (NoInitialContextEx)
[junit4:junit4]   2> 756 T876 oasc.SolrResourceLoader.locateSolrHome using system property solr.solr.home: /mnt/ssd/jenkins/workspace/Lucene-Solr-trunk-Linux/checkout/solr/build/solr-core/test-files/solr
[junit4:junit4]   2> 757 T876 oasc.CoreContainer$Initializer.initialize looking for solr.xml: /mnt/ssd/jenkins/workspace/Lucene-Solr-trunk-Linux/checkout/solr/build/solr-core/test-files/solr/solr.xml
[junit4:junit4]   2> 757 T876 oasc.CoreContainer.<init> New CoreContainer 26404301
[junit4:junit4]   2> 757 T876 oasc.CoreContainer.load Loading CoreContainer using Solr Home: '/mnt/ssd/jenkins/workspace/Lucene-Solr-trunk-Linux/checkout/solr/build/solr-core/test-files/solr/'
[junit4:junit4]   2> 757 T876 oasc.SolrResourceLoader.<init> new SolrResourceLoader for directory: '/mnt/ssd/jenkins/workspace/Lucene-Solr-trunk-Linux/checkout/solr/build/solr-core/test-files/solr/'
[junit4:junit4]   2> 766 T876 oasc.CoreContainer.load Registering Log Listener
[junit4:junit4]   2> 779 T876 oasc.CoreContainer.create Creating SolrCore 'collection1' using instanceDir: /mnt/ssd/jenkins/workspace/Lucene-Solr-trunk-Linux/checkout/solr/build/solr-core/test-files/solr/collection1
[junit4:junit4]   2> 779 T876 oasc.SolrResourceLoader.<init> new SolrResourceLoader for directory: '/mnt/ssd/jenkins/workspace/Lucene-Solr-trunk-Linux/checkout/solr/build/solr-core/test-files/solr/collection1/'
[junit4:junit4]   2> 781 T876 oasc.SolrResourceLoader.replaceClassLoader Adding 'file:/mnt/ssd/jenkins/workspace/Lucene-Solr-trunk-Linux/checkout/solr/build/solr-core/test-files/solr/collection1/lib/README' to classloader
[junit4:junit4]   2> 782 T876 oasc.SolrResourceLoader.replaceClassLoader Adding 'file:/mnt/ssd/jenkins/workspace/Lucene-Solr-trunk-Linux/checkout/solr/build/solr-core/test-files/solr/collection1/lib/classes/' to classloader
[junit4:junit4]   2> 807 T876 oasc.SolrConfig.<init> Using Lucene MatchVersion: LUCENE_50
[junit4:junit4]   2> 843 T876 oasc.SolrConfig.<init> Loaded SolrConfig: solrconfig-elevate.xml
[junit4:junit4]   2> 843 T876 oass.IndexSchema.readSchema Reading Solr Schema
[junit4:junit4]   2> 845 T876 oass.IndexSchema.readSchema Schema name=example
[junit4:junit4]   2> 860 T750 oaz.ClientCnxn$SendThread.startConnect Opening socket connection to server localhost.localdomain/127.0.0.1:43872
[junit4:junit4]   2> 861 T750 oaz.ClientCnxn$SendThread.run WARNING Session 0x138e88e16570010 for server null, unexpected error, closing socket connection and attempting reconnect java.net.ConnectException: Connection refused
[junit4:junit4]   2> 	at sun.nio.ch.SocketChannelImpl.checkConnect(Native Method)
[junit4:junit4]   2> 	at sun.nio.ch.SocketChannelImpl.finishConnect(SocketChannelImpl.java:692)
[junit4:junit4]   2> 	at org.apache.zookeeper.ClientCnxn$SendThread.run(ClientCnxn.java:1143)
[junit4:junit4]   2> 
[junit4:junit4]   2> 954 T876 oass.IndexSchema.readSchema default search field in schema is text
[junit4:junit4]   2> 958 T876 oass.IndexSchema.readSchema unique key field: id
[junit4:junit4]   2> 960 T876 oasc.SolrCore.<init> [collection1] Opening new SolrCore at /mnt/ssd/jenkins/workspace/Lucene-Solr-trunk-Linux/checkout/solr/build/solr-core/test-files/solr/collection1/, dataDir=./org.apache.solr.handler.component.DistributedQueryElevationComponentTest-1343931509630/shard2/data/
[junit4:junit4]   2> 960 T876 oasc.JmxMonitoredMap.<init> JMX monitoring is enabled. Adding Solr mbeans to JMX Server: com.sun.jmx.mbeanserver.JmxMBeanServer@d5f50d
[junit4:junit4]   2> 960 T876 oasc.SolrCore.getNewIndexDir WARNING New index directory detected: old=null new=./org.apache.solr.handler.component.DistributedQueryElevationComponentTest-1343931509630/shard2/data/index/
[junit4:junit4]   2> 961 T876 oasc.SolrCore.initIndex WARNING [collection1] Solr index directory './org.apache.solr.handler.component.DistributedQueryElevationComponentTest-1343931509630/shard2/data/index' doesn't exist. Creating new index...
[junit4:junit4]   2> 962 T876 oasc.SolrDeletionPolicy.onCommit SolrDeletionPolicy.onCommit: commits:num=1
[junit4:junit4]   2> 		commit{dir=MockDirWrapper(org.apache.lucene.store.RAMDirectory@505729 lockFactory=org.apache.lucene.store.SingleInstanceLockFactory@cc49d2),segFN=segments_1,generation=1,filenames=[segments_1]
[junit4:junit4]   2> 962 T876 oasc.SolrDeletionPolicy.updateCommits newest commit = 1
[junit4:junit4]   2> 963 T876 oasc.RequestHandlers.initHandlersFromConfig created /update: solr.UpdateRequestHandler
[junit4:junit4]   2> 963 T876 oasc.RequestHandlers.initHandlersFromConfig created /elevate: org.apache.solr.handler.component.SearchHandler
[junit4:junit4]   2> 964 T876 oasc.RequestHandlers.initHandlersFromConfig created /dataElevate: org.apache.solr.handler.component.SearchHandler
[junit4:junit4]   2> 964 T876 oashl.XMLLoader.init xsltCacheLifetimeSeconds=60
[junit4:junit4]   2> 964 T876 oasc.RequestHandlers.initHandlersFromConfig WARNING no default request handler is registered (either '/select' or 'standard')
[junit4:junit4]   2> 965 T876 oasc.SolrCore.initDeprecatedSupport WARNING solrconfig.xml uses deprecated <admin/gettableFiles>, Please update your config to use the ShowFileRequestHandler.
[junit4:junit4]   2> 966 T876 oasc.SolrCore.initDeprecatedSupport WARNING adding ShowFileRequestHandler with hidden files: [THROW.ERROR.ON.ADD.UPDATEPROCESSOR.JS, STOPTYPES-1.TXT, SCHEMA-SIM.XML, STOP-SNOWBALL.TXT, SCHEMA-LMJELINEKMERCER.XML, STOP-2.TXT, SOLRCONFIG-SLAVE1.XML, STEMDICT.TXT, SCHEMA-TFIDF.XML, SOLRCONFIG_PERF.XML, SOLRCONFIG-SOLCOREPROPERTIES.XML, SOLRCONFIG-SOLR-749.XML, STOPWORDS.TXT, STOPTYPES-2.TXT, DA_COMPOUNDDICTIONARY.TXT, SOLRCONFIG-MASTER2.XML, SCHEMA15.XML, MISSING.FUNCTIONS.UPDATEPROCESSOR.JS, SYNONYMS.TXT, BAD-SCHEMA-EXTERNAL-FILEFIELD.XML, SCHEMA-LMDIRICHLET.XML, BAD-SCHEMA-UNIQUEKEY-MULTIVALUED.XML, SOLRCONFIG-MASTER1.XML, STOPWORDSWRONGENCODING.TXT, KEEP-2.TXT, BAD-SCHEMA-NONTEXT-ANALYZER.XML, SCHEMASURROUND.XML, DA_UTF8.XML, SOLRCONFIG-TLOG.XML, SOLRCONFIG-PROPINJECT.XML, TRIVIAL.UPDATEPROCESSOR0.JS, PROTWORDS.TXT, SOLRCONFIG-TRANSFORMERS.XML, SOLRCONFIG-MERGEPOLICY.XML, BAD-SCHEMA-UNIQUEKEY-IS-COPYFIELD-DEST.XML, ELEVATE.XML, SOLRCONFIG-DELPOLICY1.XML, BAD-SOLRCONFIG-INVALID-SCRIPTFILE.XML, SOLRCONFIG-QUERYSENDER.XML, SOLRCONFIG-QUERYSENDER-NOQUERY.XML, BAD-SCHEMA-NOT-INDEXED-BUT-POS.XML, SCHEMA.XML, BAD-SCHEMA-DUP-FIELD.XML, SCHEMA_CODEC.XML, SOLRCONFIG-REPEATER.XML, BAD-SCHEMA-OMIT-TF-BUT-NOT-POS.XML, SCHEMA-CHARFILTERS.XML, SOLRCONFIG-ELEVATE.XML, SCHEMA-REPLICATION1.XML, BAD-SCHEMA-CODEC-GLOBAL-VS-FT-MISMATCH.XML, SCHEMA-LUCENEMATCHVERSION.XML, SCHEMA-FOLDING.XML, SOLRCONFIG-SLAVE.XML, OPEN-EXCHANGE-RATES.JSON, BAD-SCHEMA-UNIQUEKEY-USES-DEFAULT.XML, SCHEMA-REVERSED.XML, SCHEMA-STOP-KEEP.XML, HUNSPELL-TEST.AFF, SOLRCONFIG-LAZYWRITER.XML, SOLRCONFIG-DELPOLICY2.XML, HYPHENATION.DTD, TRIVIAL.UPDATEPROCESSOR1.JS, SCHEMA-COLLATE.XML, SOLRCONFIG-NATIVELOCK.XML, ADDFIELDS.UPDATEPROCESSOR.JS, SOLRCONFIG-BASIC.XML, SOLRCONFIG-CACHING.XML, WDFTYPES.TXT, SOLRCONFIG-ALTDIRECTORY.XML, BAD-SCHEMA-SIM-GLOBAL-VS-FT-MISMATCH.XML, BAD-SCHEMA-ANALYZER-CLASS-AND-NESTED.XML, SOLRCONFIG-MASTER3.XML, SOLRCONFIG-PHRASESUGGEST.XML, SCHEMA-PHRASESUGGEST.XML, SOLRCONFIG-FUNCTIONQUERY.XML, SOLRCONFIG-HIGHLIGHT.XML, SCHEMA-DFR.XML, SCHEMA-BM25.XML, SCHEMA-NOT-REQUIRED-UNIQUE-KEY.XML, SOLRCONFIG-ENABLEPLUGIN.XML, SCHEMA-NUMERIC.XML, SCHEMA11.XML, SCHEMA-MINIMAL.XML, BAD-SOLRCONFIG-MISSING-SCRIPTFILE.XML, HUNSPELL-TEST.DIC, BAD_SOLRCONFIG.XML, SOLRCONFIG-MASTER1-KEEPONEBACKUP.XML, XSLT, BAD-SCHEMA-NOT-INDEXED-BUT-TF.XML, SCHEMA12.XML, SOLRCONFIG-NOCACHE.XML, BAD-SCHEMA-DUP-FIELDTYPE.XML, SOLRCONFIG-MASTER.XML, BAD-SCHEMA-DUP-DYNAMICFIELD.XML, FRENCHARTICLES.TXT, SCHEMA-REQUIRED-FIELDS.XML, SOLRCONFIG-SPELLCHECKER.XML, PHRASESUGGEST.TXT, BAD-MP-SOLRCONFIG.XML, SOLRCONFIG-PROPINJECT-INDEXDEFAULT.XML, STOP-1.TXT, MAPPING-ISOLATIN1ACCENT.TXT, SCHEMA-BINARYFIELD.XML, SCHEMA-REPLICATION2.XML, SOLRCONFIG-SIMPLELOCK.XML, OLD_SYNONYMS.TXT, STOPWITHBOM.TXT, SOLRCONFIG_CODEC.XML, KEEP-1.TXT, SOLRCONFIG-UPDATE-PROCESSOR-CHAINS.XML, SCHEMA-COPYFIELD-TEST.XML, CONDITIONAL.UPDATEPROCESSOR.JS, SOLRCONFIG-SCRIPT-UPDATEPROCESSOR.XML, SOLRCONFIG-REQHANDLER.INCL, SCHEMA-TRIE.XML, MISSLEADING.EXTENSION.UPDATEPROCESSOR.JS.TXT, SCHEMA-SPELLCHECKER.XML, SCHEMA-IB.XML, SOLRCONFIG-TERMINDEX.XML, BAD-SCHEMA-NOT-INDEXED-BUT-NORMS.XML, COMPOUNDDICTIONARY.TXT, BAD-SOLRCONFIG-BOGUS-SCRIPTENGINE-NAME.XML, SOLRCONFIG-XINCLUDE.XML, SOLRCONFIG-SPELLCHECKCOMPONENT.XML, CURRENCY.XML]
[junit4:junit4]   2> 967 T876 oass.SolrIndexSearcher.<init> Opening Searcher@13bd968 main
[junit4:junit4]   2> 967 T876 oass.SolrIndexSearcher.getIndexDir WARNING WARNING: Directory impl does not support setting indexDir: org.apache.lucene.store.MockDirectoryWrapper
[junit4:junit4]   2> 968 T876 oasu.CommitTracker.<init> Hard AutoCommit: disabled
[junit4:junit4]   2> 968 T876 oasu.CommitTracker.<init> Soft AutoCommit: disabled
[junit4:junit4]   2> 968 T876 oashc.QueryElevationComponent.inform Loading QueryElevation from: /mnt/ssd/jenkins/workspace/Lucene-Solr-trunk-Linux/checkout/solr/build/solr-core/test-files/solr/collection1/conf/elevate.xml
[junit4:junit4]   2> 973 T876 oashc.QueryElevationComponent.inform Loading QueryElevation from: /mnt/ssd/jenkins/workspace/Lucene-Solr-trunk-Linux/checkout/solr/build/solr-core/test-files/solr/collection1/conf/elevate.xml
[junit4:junit4]   2> 979 T876 oashc.HttpShardHandlerFactory.getParameter Setting socketTimeout to: 0
[junit4:junit4]   2> 980 T876 oashc.HttpShardHandlerFactory.getParameter Setting urlScheme to: http://
[junit4:junit4]   2> 980 T876 oashc.HttpShardHandlerFactory.getParameter Setting connTimeout to: 0
[junit4:junit4]   2> 980 T876 oashc.HttpShardHandlerFactory.getParameter Setting maxConnectionsPerHost to: 20
[junit4:junit4]   2> 980 T876 oashc.HttpShardHandlerFactory.getParameter Setting corePoolSize to: 0
[junit4:junit4]   2> 980 T876 oashc.HttpShardHandlerFactory.getParameter Setting maximumPoolSize to: 2147483647
[junit4:junit4]   2> 981 T876 oashc.HttpShardHandlerFactory.getParameter Setting maxThreadIdleTime to: 5
[junit4:junit4]   2> 981 T876 oashc.HttpShardHandlerFactory.getParameter Setting sizeOfQueue to: -1
[junit4:junit4]   2> 981 T876 oashc.HttpShardHandlerFactory.getParameter Setting fairnessPolicy to: false
[junit4:junit4]   2> 982 T876 oascsi.HttpClientUtil.createClient Creating new http client, config:maxConnectionsPerHost=20&maxConnections=10000&socketTimeout=0&connTimeout=0&retry=false
[junit4:junit4]   2> 984 T916 oasc.SolrCore.registerSearcher [collection1] Registered new searcher Searcher@13bd968 main{StandardDirectoryReader(segments_1:1)}
[junit4:junit4]   2> 984 T876 oasc.CoreContainer.register registering core: collection1
[junit4:junit4]   2> 984 T876 oass.SolrDispatchFilter.init user.dir=/mnt/ssd/jenkins/workspace/Lucene-Solr-trunk-Linux/checkout/solr/build/solr-core/test/J1
[junit4:junit4]   2> 985 T876 oass.SolrDispatchFilter.init SolrDispatchFilter.init() done
[junit4:junit4]   2> 985 T876 oascsi.HttpClientUtil.createClient Creating new http client, config:maxConnections=128&maxConnectionsPerHost=32&followRedirects=false
[junit4:junit4]   2> ASYNC  NEW_CORE C46 name=collection1 org.apache.solr.core.SolrCore@3ba9fb
[junit4:junit4]   2> 993 T879 C46 oasu.DirectUpdateHandler2.deleteAll [collection1] REMOVING ALL DOCUMENTS FROM INDEX
[junit4:junit4]   2> 994 T879 C46 oasc.SolrDeletionPolicy.onInit SolrDeletionPolicy.onInit: commits:num=1
[junit4:junit4]   2> 		commit{dir=MockDirWrapper(org.apache.lucene.store.RAMDirectory@11b6b6c lockFactory=org.apache.lucene.store.SingleInstanceLockFactory@142bd58),segFN=segments_1,generation=1,filenames=[segments_1]
[junit4:junit4]   2> 995 T879 C46 oasc.SolrDeletionPolicy.updateCommits newest commit = 1
[junit4:junit4]   2> 995 T879 C46 UPDATE [collection1] webapp=/solr path=/update params={version=2&wt=javabin} {deleteByQuery=*:*} 0 2
[junit4:junit4]   2> ASYNC  NEW_CORE C47 name=collection1 org.apache.solr.core.SolrCore@6eb905
[junit4:junit4]   2> 998 T889 C47 oasu.DirectUpdateHandler2.deleteAll [collection1] REMOVING ALL DOCUMENTS FROM INDEX
[junit4:junit4]   2> 999 T889 C47 oasc.SolrDeletionPolicy.onInit SolrDeletionPolicy.onInit: commits:num=1
[junit4:junit4]   2> 		commit{dir=MockDirWrapper(org.apache.lucene.store.RAMDirectory@134f77b lockFactory=org.apache.lucene.store.SingleInstanceLockFactory@110dae2),segFN=segments_1,generation=1,filenames=[segments_1]
[junit4:junit4]   2> 999 T889 C47 oasc.SolrDeletionPolicy.updateCommits newest commit = 1
[junit4:junit4]   2> 1000 T889 C47 UPDATE [collection1] webapp=/solr path=/update params={version=2&wt=javabin} {deleteByQuery=*:*} 0 2
[junit4:junit4]   2> ASYNC  NEW_CORE C48 name=collection1 org.apache.solr.core.SolrCore@11ea2a
[junit4:junit4]   2> 1003 T899 C48 oasu.DirectUpdateHandler2.deleteAll [collection1] REMOVING ALL DOCUMENTS FROM INDEX
[junit4:junit4]   2> 1004 T899 C48 oasc.SolrDeletionPolicy.onInit SolrDeletionPolicy.onInit: commits:num=1
[junit4:junit4]   2> 		commit{dir=MockDirWrapper(org.apache.lucene.store.RAMDirectory@249fc0 lockFactory=org.apache.lucene.store.SingleInstanceLockFactory@1a99cab),segFN=segments_1,generation=1,filenames=[segments_1]
[junit4:junit4]   2> 1004 T899 C48 oasc.SolrDeletionPolicy.updateCommits newest commit = 1
[junit4:junit4]   2> 1004 T899 C48 UPDATE [collection1] webapp=/solr path=/update params={version=2&wt=javabin} {deleteByQuery=*:*} 0 1
[junit4:junit4]   2> ASYNC  NEW_CORE C49 name=collection1 org.apache.solr.core.SolrCore@14ae506
[junit4:junit4]   2> 1008 T909 C49 oasu.DirectUpdateHandler2.deleteAll [collection1] REMOVING ALL DOCUMENTS FROM INDEX
[junit4:junit4]   2> 1010 T909 C49 oasc.SolrDeletionPolicy.onInit SolrDeletionPolicy.onInit: commits:num=1
[junit4:junit4]   2> 		commit{dir=MockDirWrapper(org.apache.lucene.store.RAMDirectory@505729 lockFactory=org.apache.lucene.store.SingleInstanceLockFactory@cc49d2),segFN=segments_1,generation=1,filenames=[segments_1]
[junit4:junit4]   2> 1010 T909 C49 oasc.SolrDeletionPolicy.updateCommits newest commit = 1
[junit4:junit4]   2> 1010 T909 C49 UPDATE [collection1] webapp=/solr path=/update params={version=2&wt=javabin} {deleteByQuery=*:*} 0 2
[junit4:junit4]   2> 1013 T879 C46 UPDATE [collection1] webapp=/solr path=/update params={version=2&wt=javabin} {add=[1]} 0 1
[junit4:junit4]   2> 1016 T889 C47 UPDATE [collection1] webapp=/solr path=/update params={version=2&wt=javabin} {add=[1]} 0 1
[junit4:junit4]   2> 1018 T879 C46 UPDATE [collection1] webapp=/solr path=/update params={version=2&wt=javabin} {add=[2]} 0 1
[junit4:junit4]   2> 1020 T899 C48 UPDATE [collection1] webapp=/solr path=/update params={version=2&wt=javabin} {add=[2]} 0 0
[junit4:junit4]   2> 1022 T879 C46 UPDATE [collection1] webapp=/solr path=/update params={version=2&wt=javabin} {add=[3]} 0 0
[junit4:junit4]   2> 1024 T909 C49 UPDATE [collection1] webapp=/solr path=/update params={version=2&wt=javabin} {add=[3]} 0 1
[junit4:junit4]   2> 1026 T879 C46 UPDATE [collection1] webapp=/solr path=/update params={version=2&wt=javabin} {add=[4]} 0 0
[junit4:junit4]   2> 1031 T889 C47 UPDATE [collection1] webapp=/solr path=/update params={version=2&wt=javabin} {add=[4]} 0 4
[junit4:junit4]   2> 1033 T879 C46 UPDATE [collection1] webapp=/solr path=/update params={version=2&wt=javabin} {add=[5]} 0 0
[junit4:junit4]   2> 1035 T899 C48 UPDATE [collection1] webapp=/solr path=/update params={version=2&wt=javabin} {add=[5]} 0 0
[junit4:junit4]   2> 1037 T879 C46 UPDATE [collection1] webapp=/solr path=/update params={version=2&wt=javabin} {add=[6]} 0 0
[junit4:junit4]   2> 1039 T909 C49 UPDATE [collection1] webapp=/solr path=/update params={version=2&wt=javabin} {add=[6]} 0 0
[junit4:junit4]   2> 1041 T879 C46 UPDATE [collection1] webapp=/solr path=/update params={version=2&wt=javabin} {add=[7]} 0 0
[junit4:junit4]   2> 1043 T909 C49 UPDATE [collection1] webapp=/solr path=/update params={version=2&wt=javabin} {add=[7]} 0 0
[junit4:junit4]   2> 1045 T879 C46 oasu.DirectUpdateHandler2.commit start commit{flags=0,_version_=0,optimize=false,openSearcher=true,waitSearcher=true,expungeDeletes=false,softCommit=false}
[junit4:junit4]   2> 1047 T879 C46 oasc.SolrDeletionPolicy.onCommit SolrDeletionPolicy.onCommit: commits:num=2
[junit4:junit4]   2> 		commit{dir=MockDirWrapper(org.apache.lucene.store.RAMDirectory@11b6b6c lockFactory=org.apache.lucene.store.SingleInstanceLockFactory@142bd58),segFN=segments_1,generation=1,filenames=[segments_1]
[junit4:junit4]   2> 		commit{dir=MockDirWrapper(org.apache.lucene.store.RAMDirectory@11b6b6c lockFactory=org.apache.lucene.store.SingleInstanceLockFactory@142bd58),segFN=segments_2,generation=2,filenames=[_0.pst, _0_3.len, _0.inf, _0.fld, _0_2.len, _0.si, _0_4.len, segments_2]
[junit4:junit4]   2> 1047 T879 C46 oasc.SolrDeletionPolicy.updateCommits newest commit = 2
[junit4:junit4]   2> 1048 T879 C46 oass.SolrIndexSearcher.<init> Opening Searcher@165b50e main
[junit4:junit4]   2> 1048 T879 C46 oass.SolrIndexSearcher.getIndexDir WARNING WARNING: Directory impl does not support setting indexDir: org.apache.lucene.store.MockDirectoryWrapper
[junit4:junit4]   2> 1049 T879 C46 oasu.DirectUpdateHandler2.commit end_commit_flush
[junit4:junit4]   2> 1049 T886 oasc.SolrCore.registerSearcher [collection1] Registered new searcher Searcher@165b50e main{StandardDirectoryReader(segments_2:4 _0(5.0):C7)}
[junit4:junit4]   2> 1049 T879 C46 UPDATE [collection1] webapp=/solr path=/update params={waitSearcher=true&wt=javabin&commit=true&version=2&softCommit=false} {commit=} 0 4
[junit4:junit4]   2> 1052 T889 C47 oasu.DirectUpdateHandler2.commit start commit{flags=0,_version_=0,optimize=false,openSearcher=true,waitSearcher=true,expungeDeletes=false,softCommit=false}
[junit4:junit4]   2> 1052 T889 C47 oasc.SolrDeletionPolicy.onCommit SolrDeletionPolicy.onCommit: commits:num=2
[junit4:junit4]   2> 		commit{dir=MockDirWrapper(org.apache.lucene.store.RAMDirectory@134f77b lockFactory=org.apache.lucene.store.SingleInstanceLockFactory@110dae2),segFN=segments_1,generation=1,filenames=[segments_1]
[junit4:junit4]   2> 		commit{dir=MockDirWrapper(org.apache.lucene.store.RAMDirectory@134f77b lockFactory=org.apache.lucene.store.SingleInstanceLockFactory@110dae2),segFN=segments_2,generation=2,filenames=[_0.pst, _0_3.len, _0.inf, _0.fld, _0_2.len, _0.si, segments_2]
[junit4:junit4]   2> 1053 T889 C47 oasc.SolrDeletionPolicy.updateCommits newest commit = 2
[junit4:junit4]   2> 1053 T889 C47 oass.SolrIndexSearcher.<init> Opening Searcher@61ea2c main
[junit4:junit4]   2> 1054 T889 C47 oass.SolrIndexSearcher.getIndexDir WARNING WARNING: Directory impl does not support setting indexDir: org.apache.lucene.store.MockDirectoryWrapper
[junit4:junit4]   2> 1054 T889 C47 oasu.DirectUpdateHandler2.commit end_commit_flush
[junit4:junit4]   2> 1054 T896 oasc.SolrCore.registerSearcher [collection1] Registered new searcher Searcher@61ea2c main{StandardDirectoryReader(segments_2:4 _0(5.0):C2)}
[junit4:junit4]   2> 1055 T889 C47 UPDATE [collection1] webapp=/solr path=/update params={waitSearcher=true&wt=javabin&commit=true&version=2&softCommit=false} {commit=} 0 3
[junit4:junit4]   2> 1057 T899 C48 oasu.DirectUpdateHandler2.commit start commit{flags=0,_version_=0,optimize=false,openSearcher=true,waitSearcher=true,expungeDeletes=false,softCommit=false}
[junit4:junit4]   2> 1058 T899 C48 oasc.SolrDeletionPolicy.onCommit SolrDeletionPolicy.onCommit: commits:num=2
[junit4:junit4]   2> 		commit{dir=MockDirWrapper(org.apache.lucene.store.RAMDirectory@249fc0 lockFactory=org.apache.lucene.store.SingleInstanceLockFactory@1a99cab),segFN=segments_1,generation=1,filenames=[segments_1]
[junit4:junit4]   2> 		commit{dir=MockDirWrapper(org.apache.lucene.store.RAMDirectory@249fc0 lockFactory=org.apache.lucene.store.SingleInstanceLockFactory@1a99cab),segFN=segments_2,generation=2,filenames=[_0.pst, _0_3.len, _0.inf, _0.fld, _0_2.len, _0.si, segments_2]
[junit4:junit4]   2> 1058 T899 C48 oasc.SolrDeletionPolicy.updateCommits newest commit = 2
[junit4:junit4]   2> 1059 T899 C48 oass.SolrIndexSearcher.<init> Opening Searcher@b7ee22 main
[junit4:junit4]   2> 1059 T899 C48 oass.SolrIndexSearcher.getIndexDir WARNING WARNING: Directory impl does not support setting indexDir: org.apache.lucene.store.MockDirectoryWrapper
[junit4:junit4]   2> 1059 T899 C48 oasu.DirectUpdateHandler2.commit end_commit_flush
[junit4:junit4]   2> 1059 T906 oasc.SolrCore.registerSearcher [collection1] Registered new searcher Searcher@b7ee22 main{StandardDirectoryReader(segments_2:4 _0(5.0):C2)}
[junit4:junit4]   2> 1060 T899 C48 UPDATE [collection1] webapp=/solr path=/update params={waitSearcher=true&wt=javabin&commit=true&version=2&softCommit=false} {commit=} 0 3
[junit4:junit4]   2> 1061 T909 C49 oasu.DirectUpdateHandler2.commit start commit{flags=0,_version_=0,optimize=false,openSearcher=true,waitSearcher=true,expungeDeletes=false,softCommit=false}
[junit4:junit4]   2> 1062 T909 C49 oasc.SolrDeletionPolicy.onCommit SolrDeletionPolicy.onCommit: commits:num=2
[junit4:junit4]   2> 		commit{dir=MockDirWrapper(org.apache.lucene.store.RAMDirectory@505729 lockFactory=org.apache.lucene.store.SingleInstanceLockFactory@cc49d2),segFN=segments_1,generation=1,filenames=[segments_1]
[junit4:junit4]   2> 		commit{dir=MockDirWrapper(org.apache.lucene.store.RAMDirectory@505729 lockFactory=org.apache.lucene.store.SingleInstanceLockFactory@cc49d2),segFN=segments_2,generation=2,filenames=[_0.pst, _0.inf, _0.fld, _0_2.len, _0.si, segments_2]
[junit4:junit4]   2> 1063 T909 C49 oasc.SolrDeletionPolicy.updateCommits newest commit = 2
[junit4:junit4]   2> 1063 T909 C49 oass.SolrIndexSearcher.<init> Opening Searcher@1c2aebb main
[junit4:junit4]   2> 1063 T909 C49 oass.SolrIndexSearcher.getIndexDir WARNING WARNING: Directory impl does not support setting indexDir: org.apache.lucene.store.MockDirectoryWrapper
[junit4:junit4]   2> 1064 T909 C49 oasu.DirectUpdateHandler2.commit end_commit_flush
[junit4:junit4]   2> 1064 T916 oasc.SolrCore.registerSearcher [collection1] Registered new searcher Searcher@1c2aebb main{StandardDirectoryReader(segments_2:4 _0(5.0):C3)}
[junit4:junit4]   2> 1064 T909 C49 UPDATE [collection1] webapp=/solr path=/update params={waitSearcher=true&wt=javabin&commit=true&version=2&softCommit=false} {commit=} 0 3
[junit4:junit4]   2> 1072 T879 C46 REQ [collection1] webapp=/solr path=/elevate params={q=*:*&shards.qt=/elevate&distrib=false&fl=id,+score,+[elevated]&version=2&sort=id+desc&qt=/elevate&rows=500&wt=javabin} hits=7 status=0 QTime=6 
[junit4:junit4]   2> 1077 T900 C48 REQ [collection1] webapp=/solr path=/elevate params={distrib=false&shards.qt=/elevate&version=2&isShard=true&wt=javabin&q=*:*&start=0&fl=id,score&sort=id+desc&rows=500&qt=/elevate&fsv=true&NOW=1343931510698&shard.url=localhost:41554/solr|[::1]:33332/solr} hits=2 status=0 QTime=0 
[junit4:junit4]   2> 1077 T910 C49 REQ [collection1] webapp=/solr path=/elevate params={distrib=false&shards.qt=/elevate&version=2&isShard=true&wt=javabin&q=*:*&start=0&fl=id,score&sort=id+desc&rows=500&qt=/elevate&fsv=true&NOW=1343931510698&shard.url=localhost:50226/solr|[::1]:33332/solr} hits=3 status=0 QTime=0 
[junit4:junit4]   2> 1077 T890 C47 REQ [collection1] webapp=/solr path=/elevate params={distrib=false&shards.qt=/elevate&version=2&isShard=true&wt=javabin&q=*:*&start=0&fl=id,score&sort=id+desc&rows=500&qt=/elevate&fsv=true&NOW=1343931510698&shard.url=localhost:54794/solr} hits=2 status=0 QTime=0 
[junit4:junit4]   2> 1080 T900 C48 REQ [collection1] webapp=/solr path=/elevate params={shards.qt=/elevate&distrib=false&version=2&isShard=true&wt=javabin&q=*:*&ids=5.0,2.0&fl=id,+score,+[elevated]&qt=/elevate&rows=500&NOW=1343931510698&shard.url=localhost:41554/solr|[::1]:33332/solr} status=0 QTime=0 
[junit4:junit4]   2> 1080 T910 C49 REQ [collection1] webapp=/solr path=/elevate params={shards.qt=/elevate&distrib=false&version=2&isShard=true&wt=javabin&q=*:*&ids=3.0,6.0,7.0&fl=id,+score,+[elevated]&qt=/elevate&rows=500&NOW=1343931510698&shard.url=localhost:50226/solr|[::1]:33332/solr} status=0 QTime=0 
[junit4:junit4]   2> 1080 T890 C47 REQ [collection1] webapp=/solr path=/elevate params={shards.qt=/elevate&distrib=false&version=2&isShard=true&wt=javabin&q=*:*&ids=4.0,1.0&fl=id,+score,+[elevated]&qt=/elevate&rows=500&NOW=1343931510698&shard.url=localhost:54794/solr} status=0 QTime=0 
[junit4:junit4]   2> 1080 T889 C47 REQ [collection1] webapp=/solr path=/elevate params={q=*:*&shards.qt=/elevate&fl=id,+score,+[elevated]&version=2&sort=id+desc&qt=/elevate&rows=500&wt=javabin&shards=localhost:54794/solr,localhost:41554/solr|[::1]:33332/solr,localhost:50226/solr|[::1]:33332/solr} status=0 QTime=6 
[junit4:junit4]   2> 1081 T876 oas.BaseDistributedSearchTestCase.compareResponses SEVERE Mismatched responses:
[junit4:junit4]   2> 	{responseHeader={status=0,QTime=6,params={q=*:*,shards.qt=/elevate,fl=id, score, [elevated],version=2,sort=id desc,qt=/elevate,rows=500,wt=javabin,shards=localhost:54794/solr,localhost:41554/solr|[::1]:33332/solr,localhost:50226/solr|[::1]:33332/solr}},response={numFound=7,start=0,maxScore=1.0,docs=[SolrDocument{id=7.0, [elevated]=false, score=1.0}, SolrDocument{id=6.0, [elevated]=false, score=1.0}, SolrDocument{id=5.0, [elevated]=false, score=1.0}, SolrDocument{id=4.0, [elevated]=false, score=1.0}, SolrDocument{id=3.0, [elevated]=false, score=1.0}, SolrDocument{id=2.0, [elevated]=false, score=1.0}, SolrDocument{id=1.0, [elevated]=false, score=1.0}]}}
[junit4:junit4]   2> 	{responseHeader={status=0,QTime=6,params={q=*:*,shards.qt=/elevate,distrib=false,fl=id, score, [elevated],version=2,sort=id desc,qt=/elevate,rows=500,wt=javabin}},response={numFound=7,start=0,maxScore=1.0,docs=[SolrDocument{id=7.0, score=1.0, [elevated]=false}, SolrDocument{id=6.0, score=1.0, [elevated]=false}, SolrDocument{id=5.0, score=1.0, [elevated]=false}, SolrDocument{id=4.0, score=1.0, [elevated]=false}, SolrDocument{id=3.0, score=1.0, [elevated]=false}, SolrDocument{id=2.0, score=1.0, [elevated]=false}, SolrDocument{id=1.0, score=1.0, [elevated]=false}]}}
[junit4:junit4]   2> 1084 T876 oasc.CoreContainer.shutdown Shutting down CoreContainer instance=725502
[junit4:junit4]   2> 1084 T876 oasc.SolrCore.close [collection1]  CLOSING SolrCore org.apache.solr.core.SolrCore@3ba9fb
[junit4:junit4]   2> 1085 T876 oasc.SolrCore.closeSearcher [collection1] Closing main searcher on request.
[junit4:junit4]   2> 1085 T876 oasu.DirectUpdateHandler2.close closing DirectUpdateHandler2{commits=1,autocommits=0,soft autocommits=0,optimizes=0,rollbacks=0,expungeDeletes=0,docsPending=0,adds=0,deletesById=0,deletesByQuery=0,errors=0,cumulative_adds=7,cumulative_deletesById=0,cumulative_deletesByQuery=1,cumulative_errors=0}
[junit4:junit4]   2> 1087 T876 oejsh.ContextHandler.doStop stopped o.e.j.s.ServletContextHandler{/solr,null}
[junit4:junit4]   2> 1138 T876 oasc.CoreContainer.shutdown Shutting down CoreContainer instance=27599581
[junit4:junit4]   2> 1139 T876 oasc.SolrCore.close [collection1]  CLOSING SolrCore org.apache.solr.core.SolrCore@6eb905
[junit4:junit4]   2> 1139 T876 oasc.SolrCore.closeSearcher [collection1] Closing main searcher on request.
[junit4:junit4]   2> 1140 T876 oasu.DirectUpdateHandler2.close closing DirectUpdateHandler2{commits=1,autocommits=0,soft autocommits=0,optimizes=0,rollbacks=0,expungeDeletes=0,docsPending=0,adds=0,deletesById=0,deletesByQuery=0,errors=0,cumulative_adds=2,cumulative_deletesById=0,cumulative_deletesByQuery=1,cumulative_errors=0}
[junit4:junit4]   2> 1142 T876 oejsh.ContextHandler.doStop stopped o.e.j.s.ServletContextHandler{/solr,null}
[junit4:junit4]   2> 1194 T876 oasc.CoreContainer.shutdown Shutting down CoreContainer instance=974504
[junit4:junit4]   2> 1194 T876 oasc.SolrCore.close [collection1]  CLOSING SolrCore org.apache.solr.core.SolrCore@11ea2a
[junit4:junit4]   2> 1195 T876 oasc.SolrCore.closeSearcher [collection1] Closing main searcher on request.
[junit4:junit4]   2> 1195 T876 oasu.DirectUpdateHandler2.close closing DirectUpdateHandler2{commits=1,autocommits=0,soft autocommits=0,optimizes=0,rollbacks=0,expungeDeletes=0,docsPending=0,adds=0,deletesById=0,deletesByQuery=0,errors=0,cumulative_adds=2,cumulative_deletesById=0,cumulative_deletesByQuery=1,cumulative_errors=0}
[junit4:junit4]   2> 1197 T876 oejsh.ContextHandler.doStop stopped o.e.j.s.ServletContextHandler{/solr,null}
[junit4:junit4]   2> 1249 T876 oasc.CoreContainer.shutdown Shutting down CoreContainer instance=26404301
[junit4:junit4]   2> 1250 T876 oasc.SolrCore.close [collection1]  CLOSING SolrCore org.apache.solr.core.SolrCore@14ae506
[junit4:junit4]   2> 1251 T876 oasc.SolrCore.closeSearcher [collection1] Closing main searcher on request.
[junit4:junit4]   2> 1251 T876 oasu.DirectUpdateHandler2.close closing DirectUpdateHandler2{commits=1,autocommits=0,soft autocommits=0,optimizes=0,rollbacks=0,expungeDeletes=0,docsPending=0,adds=0,deletesById=0,deletesByQuery=0,errors=0,cumulative_adds=3,cumulative_deletesById=0,cumulative_deletesByQuery=1,cumulative_errors=0}
[junit4:junit4]   2> 1257 T876 oejsh.ContextHandler.doStop stopped o.e.j.s.ServletContextHandler{/solr,null}
[junit4:junit4]   2> 1309 T876 oas.SolrTestCaseJ4.tearDown ###Ending testDistribSearch
[junit4:junit4]   2> NOTE: reproduce with: ant test  -Dtestcase=DistributedQueryElevationComponentTest -Dtests.method=testDistribSearch -Dtests.seed=8A54C6EA087980A2 -Dtests.multiplier=3 -Dtests.slow=true -Dtests.locale=en_NZ -Dtests.timezone=Europe/Oslo -Dtests.file.encoding=UTF-8
[junit4:junit4]   2>
[junit4:junit4]    > (@AfterClass output)
[junit4:junit4]   2> 1356 T876 oas.SolrTestCaseJ4.deleteCore ###deleteCore
[junit4:junit4]   2> NOTE: test params are: codec=SimpleText, sim=RandomSimilarityProvider(queryNorm=true,coord=false): {}, locale=en_NZ, timezone=Europe/Oslo
[junit4:junit4]   2> NOTE: Linux 3.2.0-27-generic i386/Oracle Corporation 1.8.0-ea (32-bit)/cpus=8,threads=1,free=164625432,total=241958912
[junit4:junit4]   2> NOTE: All tests run in this JVM: [SolrIndexConfigTest, TestSolrDeletionPolicy1, TestJoin, HighlighterTest, OutputWriterTest, TestDocSet, BasicZkTest, TestFoldingMultitermQuery, TestSolrCoreProperties, QueryElevationComponentTest, PrimUtilsTest, SuggesterTest, TestDFRSimilarityFactory, TestPhraseSuggestions, JsonLoaderTest, TestSolrQueryParser, QueryParsingTest, DebugComponentTest, SolrInfoMBeanTest, SpellCheckComponentTest, FullSolrCloudTest, TestCSVResponseWriter, DirectUpdateHandlerTest, TestWriterPerf, TestStressVersions, FileUtilsTest, SimpleFacetsTest, SuggesterTSTTest, TestRemoteStreaming, BasicFunctionalityTest, TestUpdate, MultiTermTest, UpdateParamsTest, ReturnFieldsTest, TestSolrJ, FieldAnalysisRequestHandlerTest, URLClassifyProcessorTest, TestSolrDeletionPolicy2, DocumentBuilderTest, TestOmitPositions, TestCharFilters, DistributedQueryElevationComponentTest]
[junit4:junit4]   2> 
[junit4:junit4] Completed on J1 in 1.36s, 1 test, 1 failure <<< FAILURES!

[...truncated 477 lines...]
BUILD FAILED
/mnt/ssd/jenkins/workspace/Lucene-Solr-trunk-Linux/checkout/build.xml:29: The following error occurred while executing this line:
/mnt/ssd/jenkins/workspace/Lucene-Solr-trunk-Linux/checkout/solr/build.xml:144: The following error occurred while executing this line:
/mnt/ssd/jenkins/workspace/Lucene-Solr-trunk-Linux/checkout/lucene/module-build.xml:62: The following error occurred while executing this line:
/mnt/ssd/jenkins/workspace/Lucene-Solr-trunk-Linux/checkout/lucene/common-build.xml:1095: The following error occurred while executing this line:
/mnt/ssd/jenkins/workspace/Lucene-Solr-trunk-Linux/checkout/lucene/common-build.xml:790: There were test failures: 223 suites, 899 tests, 1 failure, 5 ignored

Total time: 20 minutes 39 seconds
Build step 'Execute shell' marked build as failure
Archiving artifacts
Recording test results
Email was triggered for: Failure
Sending email for trigger: Failure



Mime
View raw message