lucene-dev mailing list archives

Site index · List index
Message view « Date » · « Thread »
Top « Date » · « Thread »
From Policeman Jenkins Server <jenk...@sd-datasolutions.de>
Subject [JENKINS] Lucene-Solr-4.x-Windows (64bit/jdk1.7.0_06) - Build # 417 - Failure!
Date Fri, 24 Aug 2012 05:19:58 GMT
Build: http://jenkins.sd-datasolutions.de/job/Lucene-Solr-4.x-Windows/417/
Java: 64bit/jdk1.7.0_06 -XX:+UseSerialGC

1 tests failed.
REGRESSION:  org.apache.solr.spelling.suggest.SuggesterTest.testSuggestions

Error Message:
Exception during query

Stack Trace:
java.lang.RuntimeException: Exception during query
	at __randomizedtesting.SeedInfo.seed([EA828E6D4DAF512A:4C5EB798839B06D4]:0)
	at org.apache.solr.SolrTestCaseJ4.assertQ(SolrTestCaseJ4.java:493)
	at org.apache.solr.SolrTestCaseJ4.assertQ(SolrTestCaseJ4.java:460)
	at org.apache.solr.spelling.suggest.SuggesterTest.testSuggestions(SuggesterTest.java:71)
	at sun.reflect.NativeMethodAccessorImpl.invoke0(Native Method)
	at sun.reflect.NativeMethodAccessorImpl.invoke(NativeMethodAccessorImpl.java:57)
	at sun.reflect.DelegatingMethodAccessorImpl.invoke(DelegatingMethodAccessorImpl.java:43)
	at java.lang.reflect.Method.invoke(Method.java:601)
	at com.carrotsearch.randomizedtesting.RandomizedRunner.invoke(RandomizedRunner.java:1559)
	at com.carrotsearch.randomizedtesting.RandomizedRunner.access$600(RandomizedRunner.java:79)
	at com.carrotsearch.randomizedtesting.RandomizedRunner$6.evaluate(RandomizedRunner.java:737)
	at com.carrotsearch.randomizedtesting.RandomizedRunner$7.evaluate(RandomizedRunner.java:773)
	at com.carrotsearch.randomizedtesting.RandomizedRunner$8.evaluate(RandomizedRunner.java:787)
	at com.carrotsearch.randomizedtesting.rules.SystemPropertiesRestoreRule$1.evaluate(SystemPropertiesRestoreRule.java:53)
	at org.apache.lucene.util.TestRuleSetupTeardownChained$1.evaluate(TestRuleSetupTeardownChained.java:50)
	at org.apache.lucene.util.TestRuleFieldCacheSanity$1.evaluate(TestRuleFieldCacheSanity.java:51)
	at org.apache.lucene.util.AbstractBeforeAfterRule$1.evaluate(AbstractBeforeAfterRule.java:45)
	at com.carrotsearch.randomizedtesting.rules.SystemPropertiesInvariantRule$1.evaluate(SystemPropertiesInvariantRule.java:55)
	at org.apache.lucene.util.TestRuleThreadAndTestName$1.evaluate(TestRuleThreadAndTestName.java:48)
	at org.apache.lucene.util.TestRuleIgnoreAfterMaxFailures$1.evaluate(TestRuleIgnoreAfterMaxFailures.java:70)
	at org.apache.lucene.util.TestRuleMarkFailure$1.evaluate(TestRuleMarkFailure.java:48)
	at com.carrotsearch.randomizedtesting.rules.StatementAdapter.evaluate(StatementAdapter.java:36)
	at com.carrotsearch.randomizedtesting.ThreadLeakControl$StatementRunner.run(ThreadLeakControl.java:345)
	at com.carrotsearch.randomizedtesting.ThreadLeakControl.forkTimeoutingTask(ThreadLeakControl.java:769)
	at com.carrotsearch.randomizedtesting.ThreadLeakControl$3.evaluate(ThreadLeakControl.java:429)
	at com.carrotsearch.randomizedtesting.RandomizedRunner.runSingleTest(RandomizedRunner.java:746)
	at com.carrotsearch.randomizedtesting.RandomizedRunner$3.evaluate(RandomizedRunner.java:648)
	at com.carrotsearch.randomizedtesting.RandomizedRunner$4.evaluate(RandomizedRunner.java:682)
	at com.carrotsearch.randomizedtesting.RandomizedRunner$5.evaluate(RandomizedRunner.java:693)
	at com.carrotsearch.randomizedtesting.rules.StatementAdapter.evaluate(StatementAdapter.java:36)
	at com.carrotsearch.randomizedtesting.rules.SystemPropertiesRestoreRule$1.evaluate(SystemPropertiesRestoreRule.java:53)
	at org.apache.lucene.util.AbstractBeforeAfterRule$1.evaluate(AbstractBeforeAfterRule.java:45)
	at org.apache.lucene.util.TestRuleStoreClassName$1.evaluate(TestRuleStoreClassName.java:42)
	at com.carrotsearch.randomizedtesting.rules.SystemPropertiesInvariantRule$1.evaluate(SystemPropertiesInvariantRule.java:55)
	at com.carrotsearch.randomizedtesting.rules.NoShadowingOrOverridesOnMethodsRule$1.evaluate(NoShadowingOrOverridesOnMethodsRule.java:39)
	at com.carrotsearch.randomizedtesting.rules.NoShadowingOrOverridesOnMethodsRule$1.evaluate(NoShadowingOrOverridesOnMethodsRule.java:39)
	at org.apache.lucene.util.TestRuleAssertionsRequired$1.evaluate(TestRuleAssertionsRequired.java:40)
	at org.apache.lucene.util.TestRuleMarkFailure$1.evaluate(TestRuleMarkFailure.java:48)
	at org.apache.lucene.util.TestRuleIgnoreAfterMaxFailures$1.evaluate(TestRuleIgnoreAfterMaxFailures.java:70)
	at org.apache.lucene.util.TestRuleIgnoreTestSuites$1.evaluate(TestRuleIgnoreTestSuites.java:55)
	at com.carrotsearch.randomizedtesting.rules.StatementAdapter.evaluate(StatementAdapter.java:36)
	at com.carrotsearch.randomizedtesting.ThreadLeakControl$StatementRunner.run(ThreadLeakControl.java:345)
	at java.lang.Thread.run(Thread.java:722)
Caused by: java.lang.RuntimeException: REQUEST FAILED: xpath=//lst[@name='spellcheck']/lst[@name='suggestions']/lst[@name='ac']/int[@name='numFound'][.='2']
	xml response was: <?xml version="1.0" encoding="UTF-8"?>
<response>
<lst name="responseHeader"><int name="status">0</int><int name="QTime">0</int></lst><lst name="spellcheck"><lst name="suggestions"/></lst>
</response>

	request was:q=ac&spellcheck.count=2&qt=/suggest&spellcheck.onlyMorePopular=true
	at org.apache.solr.SolrTestCaseJ4.assertQ(SolrTestCaseJ4.java:486)
	... 41 more




Build Log:
[...truncated 7377 lines...]
[junit4:junit4] Suite: org.apache.solr.spelling.suggest.SuggesterTest
[junit4:junit4]   2> 0 T1414 oas.SolrTestCaseJ4.initCore ####initCore
[junit4:junit4]   2> Creating dataDir: C:\Jenkins\workspace\Lucene-Solr-4.x-Windows\solr\build\solr-core\test\J0\.\solrtest-SuggesterTest-1345784953297
[junit4:junit4]   2> 2 T1414 oasc.SolrResourceLoader.<init> new SolrResourceLoader for directory: 'C:\Jenkins\workspace\Lucene-Solr-4.x-Windows\solr\build\solr-core\test-files\solr\collection1\'
[junit4:junit4]   2> 3 T1414 oasc.SolrResourceLoader.replaceClassLoader Adding 'file:/C:/Jenkins/workspace/Lucene-Solr-4.x-Windows/solr/build/solr-core/test-files/solr/collection1/lib/classes/' to classloader
[junit4:junit4]   2> 3 T1414 oasc.SolrResourceLoader.replaceClassLoader Adding 'file:/C:/Jenkins/workspace/Lucene-Solr-4.x-Windows/solr/build/solr-core/test-files/solr/collection1/lib/README' to classloader
[junit4:junit4]   2> 55 T1414 oasc.SolrConfig.<init> Using Lucene MatchVersion: LUCENE_40
[junit4:junit4]   2> 110 T1414 oasc.SolrConfig.<init> Loaded SolrConfig: solrconfig-spellchecker.xml
[junit4:junit4]   2> 110 T1414 oass.IndexSchema.readSchema Reading Solr Schema
[junit4:junit4]   2> 120 T1414 oass.IndexSchema.readSchema Schema name=Solr SpellCheck Test
[junit4:junit4]   2> 179 T1414 oass.IndexSchema.readSchema default search field in schema is text
[junit4:junit4]   2> 181 T1414 oass.IndexSchema.readSchema query parser default operator is OR
[junit4:junit4]   2> 186 T1414 oass.IndexSchema.readSchema unique key field: id
[junit4:junit4]   2> 187 T1414 oasc.SolrResourceLoader.locateSolrHome JNDI not configured for solr (NoInitialContextEx)
[junit4:junit4]   2> 187 T1414 oasc.SolrResourceLoader.locateSolrHome using system property solr.solr.home: C:\Jenkins\workspace\Lucene-Solr-4.x-Windows\solr\build\solr-core\test-files\solr
[junit4:junit4]   2> 187 T1414 oasc.SolrResourceLoader.<init> new SolrResourceLoader for directory: 'C:\Jenkins\workspace\Lucene-Solr-4.x-Windows\solr\build\solr-core\test-files\solr\'
[junit4:junit4]   2> 199 T1414 oasc.CoreContainer.<init> New CoreContainer 1226003348
[junit4:junit4]   2> 199 T1414 oasc.SolrCore.<init> [collection1] Opening new SolrCore at C:\Jenkins\workspace\Lucene-Solr-4.x-Windows\solr\build\solr-core\test-files\solr\collection1\, dataDir=C:\Jenkins\workspace\Lucene-Solr-4.x-Windows\solr\build\solr-core\test\J0\.\solrtest-SuggesterTest-1345784953297\
[junit4:junit4]   2> 199 T1414 oasc.SolrCore.<init> JMX monitoring not detected for core: collection1
[junit4:junit4]   2> 200 T1414 oasc.SolrCore.getNewIndexDir WARNING New index directory detected: old=null new=C:\Jenkins\workspace\Lucene-Solr-4.x-Windows\solr\build\solr-core\test\J0\.\solrtest-SuggesterTest-1345784953297\index/
[junit4:junit4]   2> 200 T1414 oasc.SolrCore.initIndex WARNING [collection1] Solr index directory 'C:\Jenkins\workspace\Lucene-Solr-4.x-Windows\solr\build\solr-core\test\J0\.\solrtest-SuggesterTest-1345784953297\index' doesn't exist. Creating new index...
[junit4:junit4]   2> 203 T1414 oasc.CachingDirectoryFactory.get return new directory for C:\Jenkins\workspace\Lucene-Solr-4.x-Windows\solr\build\solr-core\test\J0\.\solrtest-SuggesterTest-1345784953297\index forceNew:false
[junit4:junit4]   2> 206 T1414 oasc.SolrDeletionPolicy.onCommit SolrDeletionPolicy.onCommit: commits:num=1
[junit4:junit4]   2> 		commit{dir=MockDirWrapper(org.apache.lucene.store.MMapDirectory@C:\Jenkins\workspace\Lucene-Solr-4.x-Windows\solr\build\solr-core\test\J0\solrtest-SuggesterTest-1345784953297\index lockFactory=org.apache.lucene.store.NativeFSLockFactory@263ec46d),segFN=segments_1,generation=1,filenames=[segments_1]
[junit4:junit4]   2> 207 T1414 oasc.SolrDeletionPolicy.updateCommits newest commit = 1
[junit4:junit4]   2> 208 T1414 oasc.RequestHandlers.initHandlersFromConfig created standard: solr.StandardRequestHandler
[junit4:junit4]   2> 208 T1414 oasc.RequestHandlers.initHandlersFromConfig created /suggest: org.apache.solr.handler.component.SearchHandler
[junit4:junit4]   2> 208 T1414 oasc.RequestHandlers.initHandlersFromConfig created /suggest_tst: org.apache.solr.handler.component.SearchHandler
[junit4:junit4]   2> 209 T1414 oasc.RequestHandlers.initHandlersFromConfig created /suggest_fst: org.apache.solr.handler.component.SearchHandler
[junit4:junit4]   2> 209 T1414 oasc.RequestHandlers.initHandlersFromConfig created /suggest_wfst: org.apache.solr.handler.component.SearchHandler
[junit4:junit4]   2> 214 T1414 oass.SolrIndexSearcher.<init> Opening Searcher@7183df6b main
[junit4:junit4]   2> 214 T1414 oass.SolrIndexSearcher.getIndexDir WARNING WARNING: Directory impl does not support setting indexDir: org.apache.lucene.store.MockDirectoryWrapper
[junit4:junit4]   2> 215 T1414 oasu.CommitTracker.<init> Hard AutoCommit: disabled
[junit4:junit4]   2> 215 T1414 oasu.CommitTracker.<init> Soft AutoCommit: disabled
[junit4:junit4]   2> 216 T1414 oashc.SpellCheckComponent.inform Initializing spell checkers
[junit4:junit4]   2> 217 T1414 oasss.Suggester.init init: {name=suggest,classname=org.apache.solr.spelling.suggest.Suggester,lookupImpl=org.apache.solr.spelling.suggest.jaspell.JaspellLookup,field=suggest,storeDir=suggest,buildOnCommit=true,threshold=0.0}
[junit4:junit4]   2> 218 T1414 oasssj.JaspellLookupFactory.create init: {name=suggest,classname=org.apache.solr.spelling.suggest.Suggester,lookupImpl=org.apache.solr.spelling.suggest.jaspell.JaspellLookup,field=suggest,storeDir=suggest,buildOnCommit=true,threshold=0.0}
[junit4:junit4]   2> 218 T1414 oashc.SpellCheckComponent.inform Registering newSearcher listener for spellchecker: suggest
[junit4:junit4]   2> 219 T1414 oashc.SpellCheckComponent.inform No queryConverter defined, using default converter
[junit4:junit4]   2> 220 T1414 oashc.SpellCheckComponent.inform Initializing spell checkers
[junit4:junit4]   2> 220 T1414 oasss.Suggester.init init: {name=suggest_tst,classname=org.apache.solr.spelling.suggest.Suggester,lookupImpl=org.apache.solr.spelling.suggest.tst.TSTLookup,field=suggest,storeDir=suggest_tst,buildOnCommit=true,threshold=0.0}
[junit4:junit4]   2> 221 T1414 oashc.SpellCheckComponent.inform Registering newSearcher listener for spellchecker: suggest_tst
[junit4:junit4]   2> 221 T1414 oashc.SpellCheckComponent.inform No queryConverter defined, using default converter
[junit4:junit4]   2> 222 T1414 oashc.SpellCheckComponent.inform Initializing spell checkers
[junit4:junit4]   2> 222 T1414 oasss.Suggester.init init: {name=suggest_fst,classname=org.apache.solr.spelling.suggest.Suggester,lookupImpl=org.apache.solr.spelling.suggest.fst.FSTLookup,field=suggest,storeDir=suggest_fst,buildOnCommit=true,weightBuckets=5,exactMatchFirst=true}
[junit4:junit4]   2> 224 T1414 oashc.SpellCheckComponent.inform Registering newSearcher listener for spellchecker: suggest_fst
[junit4:junit4]   2> 224 T1414 oashc.SpellCheckComponent.inform No queryConverter defined, using default converter
[junit4:junit4]   2> 225 T1414 oashc.SpellCheckComponent.inform Initializing spell checkers
[junit4:junit4]   2> 225 T1414 oasss.Suggester.init init: {name=suggest_wfst,classname=org.apache.solr.spelling.suggest.Suggester,lookupImpl=org.apache.solr.spelling.suggest.fst.WFSTLookupFactory,field=suggest,storeDir=suggest_wfst,buildOnCommit=true,exactMatchFirst=true}
[junit4:junit4]   2> 226 T1414 oashc.SpellCheckComponent.inform Registering newSearcher listener for spellchecker: suggest_wfst
[junit4:junit4]   2> 226 T1414 oashc.SpellCheckComponent.inform No queryConverter defined, using default converter
[junit4:junit4]   2> 226 T1414 oashc.HttpShardHandlerFactory.getParameter Setting socketTimeout to: 0
[junit4:junit4]   2> 226 T1414 oashc.HttpShardHandlerFactory.getParameter Setting urlScheme to: http://
[junit4:junit4]   2> 226 T1414 oashc.HttpShardHandlerFactory.getParameter Setting connTimeout to: 0
[junit4:junit4]   2> 227 T1414 oashc.HttpShardHandlerFactory.getParameter Setting maxConnectionsPerHost to: 20
[junit4:junit4]   2> 227 T1414 oashc.HttpShardHandlerFactory.getParameter Setting corePoolSize to: 0
[junit4:junit4]   2> 227 T1414 oashc.HttpShardHandlerFactory.getParameter Setting maximumPoolSize to: 2147483647
[junit4:junit4]   2> 227 T1414 oashc.HttpShardHandlerFactory.getParameter Setting maxThreadIdleTime to: 5
[junit4:junit4]   2> 227 T1414 oashc.HttpShardHandlerFactory.getParameter Setting sizeOfQueue to: -1
[junit4:junit4]   2> 228 T1414 oashc.HttpShardHandlerFactory.getParameter Setting fairnessPolicy to: false
[junit4:junit4]   2> 228 T1414 oascsi.HttpClientUtil.createClient Creating new http client, config:maxConnectionsPerHost=20&maxConnections=10000&socketTimeout=0&connTimeout=0&retry=false
[junit4:junit4]   2> 234 T1414 oasc.CoreContainer.register registering core: collection1
[junit4:junit4]   2> 235 T1414 oas.SolrTestCaseJ4.initCore ####initCore end
[junit4:junit4]   2> 240 T1414 oas.SolrTestCaseJ4.setUp ###Starting testSuggestions
[junit4:junit4]   2> ASYNC  NEW_CORE C118 name=collection1 org.apache.solr.core.SolrCore@3b538de5
[junit4:junit4]   2> 247 T1414 C118 oasc.SolrDeletionPolicy.onInit SolrDeletionPolicy.onInit: commits:num=1
[junit4:junit4]   2> 		commit{dir=MockDirWrapper(org.apache.lucene.store.MMapDirectory@C:\Jenkins\workspace\Lucene-Solr-4.x-Windows\solr\build\solr-core\test\J0\solrtest-SuggesterTest-1345784953297\index lockFactory=org.apache.lucene.store.NativeFSLockFactory@263ec46d),segFN=segments_1,generation=1,filenames=[segments_1]
[junit4:junit4]   2> 247 T1414 C118 oasc.SolrDeletionPolicy.updateCommits newest commit = 1
[junit4:junit4]   2> 247 T1414 C118 UPDATE [collection1] webapp=null path=null params={} {add=[1]} 0 3
[junit4:junit4]   2> 256 T1414 C118 UPDATE [collection1] webapp=null path=null params={} {add=[2]} 0 0
[junit4:junit4]   2> 261 T1414 C118 UPDATE [collection1] webapp=null path=null params={} {add=[3]} 0 0
[junit4:junit4]   2> 268 T1414 C118 oasu.DirectUpdateHandler2.commit start commit{flags=0,_version_=0,optimize=false,openSearcher=true,waitSearcher=true,expungeDeletes=false,softCommit=false}
[junit4:junit4]   2> 272 T1414 C118 oasc.SolrDeletionPolicy.onCommit SolrDeletionPolicy.onCommit: commits:num=2
[junit4:junit4]   2> 		commit{dir=MockDirWrapper(org.apache.lucene.store.MMapDirectory@C:\Jenkins\workspace\Lucene-Solr-4.x-Windows\solr\build\solr-core\test\J0\solrtest-SuggesterTest-1345784953297\index lockFactory=org.apache.lucene.store.NativeFSLockFactory@263ec46d),segFN=segments_1,generation=1,filenames=[segments_1]
[junit4:junit4]   2> 		commit{dir=MockDirWrapper(org.apache.lucene.store.MMapDirectory@C:\Jenkins\workspace\Lucene-Solr-4.x-Windows\solr\build\solr-core\test\J0\solrtest-SuggesterTest-1345784953297\index lockFactory=org.apache.lucene.store.NativeFSLockFactory@263ec46d),segFN=segments_2,generation=2,filenames=[_0.fnm, _0.frq, _0.tim, _0_nrm.cfe, segments_2, _0.fdx, _0_nrm.cfs, _0.si, _0.prx, _0.tip, _0.fdt]
[junit4:junit4]   2> 272 T1414 C118 oasc.SolrDeletionPolicy.updateCommits newest commit = 2
[junit4:junit4]   2> 273 T1414 C118 oasc.SolrCore.getSearcher WARNING [collection1] PERFORMANCE WARNING: Overlapping onDeckSearchers=2
[junit4:junit4]   2> 282 T1414 C118 oass.SolrIndexSearcher.<init> Opening Searcher@1ad38adc main
[junit4:junit4]   2> 282 T1414 C118 oass.SolrIndexSearcher.getIndexDir WARNING WARNING: Directory impl does not support setting indexDir: org.apache.lucene.store.MockDirectoryWrapper
[junit4:junit4]   2> 282 T1414 C118 oasu.DirectUpdateHandler2.commit end_commit_flush
[junit4:junit4]   2> 282 T1415 oasc.SolrCore.registerSearcher [collection1] Registered new searcher Searcher@7183df6b main{StandardDirectoryReader(segments_1:1)}
[junit4:junit4]   2> 284 T1415 oashc.SpellCheckComponent$SpellCheckerListener.newSearcher Loading spell index for spellchecker: suggest
[junit4:junit4]   2> 284 T1415 oasss.Suggester.reload reload()
[junit4:junit4]   2> 284 T1415 oashc.SpellCheckComponent$SpellCheckerListener.newSearcher SEVERE Exception in reloading spell check index for spellchecker: suggest java.io.FileNotFoundException: C:\Jenkins\workspace\Lucene-Solr-4.x-Windows\solr\build\solr-core\test\J0\.\solrtest-SuggesterTest-1345784953297\suggest\jaspell.dat (The system cannot find the file specified)
[junit4:junit4]   2> 	at java.io.FileInputStream.open(Native Method)
[junit4:junit4]   2> 	at java.io.FileInputStream.<init>(FileInputStream.java:138)
[junit4:junit4]   2> 	at org.apache.solr.spelling.suggest.Suggester.reload(Suggester.java:161)
[junit4:junit4]   2> 	at org.apache.solr.handler.component.SpellCheckComponent$SpellCheckerListener.newSearcher(SpellCheckComponent.java:673)
[junit4:junit4]   2> 	at org.apache.solr.core.SolrCore$5.call(SolrCore.java:1452)
[junit4:junit4]   2> 	at java.util.concurrent.FutureTask$Sync.innerRun(FutureTask.java:334)
[junit4:junit4]   2> 	at java.util.concurrent.FutureTask.run(FutureTask.java:166)
[junit4:junit4]   2> 	at java.util.concurrent.ThreadPoolExecutor.runWorker(ThreadPoolExecutor.java:1110)
[junit4:junit4]   2> 	at java.util.concurrent.ThreadPoolExecutor$Worker.run(ThreadPoolExecutor.java:603)
[junit4:junit4]   2> 	at java.lang.Thread.run(Thread.java:722)
[junit4:junit4]   2> 
[junit4:junit4]   2> 290 T1415 oashc.SpellCheckComponent$SpellCheckerListener.newSearcher Loading spell index for spellchecker: suggest_tst
[junit4:junit4]   2> 290 T1415 oasss.Suggester.reload reload()
[junit4:junit4]   2> 291 T1415 oashc.SpellCheckComponent$SpellCheckerListener.newSearcher SEVERE Exception in reloading spell check index for spellchecker: suggest_tst java.io.FileNotFoundException: C:\Jenkins\workspace\Lucene-Solr-4.x-Windows\solr\build\solr-core\test\J0\.\solrtest-SuggesterTest-1345784953297\suggest_tst\tst.dat (The system cannot find the file specified)
[junit4:junit4]   2> 	at java.io.FileInputStream.open(Native Method)
[junit4:junit4]   2> 	at java.io.FileInputStream.<init>(FileInputStream.java:138)
[junit4:junit4]   2> 	at org.apache.solr.spelling.suggest.Suggester.reload(Suggester.java:161)
[junit4:junit4]   2> 	at org.apache.solr.handler.component.SpellCheckComponent$SpellCheckerListener.newSearcher(SpellCheckComponent.java:673)
[junit4:junit4]   2> 	at org.apache.solr.core.SolrCore$5.call(SolrCore.java:1452)
[junit4:junit4]   2> 	at java.util.concurrent.FutureTask$Sync.innerRun(FutureTask.java:334)
[junit4:junit4]   2> 	at java.util.concurrent.FutureTask.run(FutureTask.java:166)
[junit4:junit4]   2> 	at java.util.concurrent.ThreadPoolExecutor.runWorker(ThreadPoolExecutor.java:1110)
[junit4:junit4]   2> 	at java.util.concurrent.ThreadPoolExecutor$Worker.run(ThreadPoolExecutor.java:603)
[junit4:junit4]   2> 	at java.lang.Thread.run(Thread.java:722)
[junit4:junit4]   2> 
[junit4:junit4]   2> 291 T1415 oashc.SpellCheckComponent$SpellCheckerListener.newSearcher Loading spell index for spellchecker: suggest_fst
[junit4:junit4]   2> 291 T1415 oasss.Suggester.reload reload()
[junit4:junit4]   2> 291 T1415 oashc.SpellCheckComponent$SpellCheckerListener.newSearcher SEVERE Exception in reloading spell check index for spellchecker: suggest_fst java.io.FileNotFoundException: C:\Jenkins\workspace\Lucene-Solr-4.x-Windows\solr\build\solr-core\test\J0\.\solrtest-SuggesterTest-1345784953297\suggest_fst\fst.bin (The system cannot find the file specified)
[junit4:junit4]   2> 	at java.io.FileInputStream.open(Native Method)
[junit4:junit4]   2> 	at java.io.FileInputStream.<init>(FileInputStream.java:138)
[junit4:junit4]   2> 	at org.apache.solr.spelling.suggest.Suggester.reload(Suggester.java:161)
[junit4:junit4]   2> 	at org.apache.solr.handler.component.SpellCheckComponent$SpellCheckerListener.newSearcher(SpellCheckComponent.java:673)
[junit4:junit4]   2> 	at org.apache.solr.core.SolrCore$5.call(SolrCore.java:1452)
[junit4:junit4]   2> 	at java.util.concurrent.FutureTask$Sync.innerRun(FutureTask.java:334)
[junit4:junit4]   2> 	at java.util.concurrent.FutureTask.run(FutureTask.java:166)
[junit4:junit4]   2> 	at java.util.concurrent.ThreadPoolExecutor.runWorker(ThreadPoolExecutor.java:1110)
[junit4:junit4]   2> 	at java.util.concurrent.ThreadPoolExecutor$Worker.run(ThreadPoolExecutor.java:603)
[junit4:junit4]   2> 	at java.lang.Thread.run(Thread.java:722)
[junit4:junit4]   2> 
[junit4:junit4]   2> 292 T1415 oashc.SpellCheckComponent$SpellCheckerListener.newSearcher Loading spell index for spellchecker: suggest_wfst
[junit4:junit4]   2> 292 T1415 oasss.Suggester.reload reload()
[junit4:junit4]   2> 292 T1415 oashc.SpellCheckComponent$SpellCheckerListener.newSearcher SEVERE Exception in reloading spell check index for spellchecker: suggest_wfst java.io.FileNotFoundException: C:\Jenkins\workspace\Lucene-Solr-4.x-Windows\solr\build\solr-core\test\J0\.\solrtest-SuggesterTest-1345784953297\suggest_wfst\wfst.bin (The system cannot find the file specified)
[junit4:junit4]   2> 	at java.io.FileInputStream.open(Native Method)
[junit4:junit4]   2> 	at java.io.FileInputStream.<init>(FileInputStream.java:138)
[junit4:junit4]   2> 	at org.apache.solr.spelling.suggest.Suggester.reload(Suggester.java:161)
[junit4:junit4]   2> 	at org.apache.solr.handler.component.SpellCheckComponent$SpellCheckerListener.newSearcher(SpellCheckComponent.java:673)
[junit4:junit4]   2> 	at org.apache.solr.core.SolrCore$5.call(SolrCore.java:1452)
[junit4:junit4]   2> 	at java.util.concurrent.FutureTask$Sync.innerRun(FutureTask.java:334)
[junit4:junit4]   2> 	at java.util.concurrent.FutureTask.run(FutureTask.java:166)
[junit4:junit4]   2> 	at java.util.concurrent.ThreadPoolExecutor.runWorker(ThreadPoolExecutor.java:1110)
[junit4:junit4]   2> 	at java.util.concurrent.ThreadPoolExecutor$Worker.run(ThreadPoolExecutor.java:603)
[junit4:junit4]   2> 	at java.lang.Thread.run(Thread.java:722)
[junit4:junit4]   2> 
[junit4:junit4]   2> 294 T1415 oasc.SolrCore.registerSearcher [collection1] Registered new searcher Searcher@1ad38adc main{StandardDirectoryReader(segments_2:3 _0(4.0.0.2):C3)}
[junit4:junit4]   2> 294 T1414 C118 UPDATE [collection1] webapp=null path=null params={} {commit=} 0 26
[junit4:junit4]   2> 296 T1414 C118 REQ [collection1] webapp=null path=null params={q=ac&spellcheck.count=2&qt=/suggest&spellcheck.onlyMorePopular=true} status=0 QTime=0 
[junit4:junit4]   2> 298 T1414 oas.SolrTestCaseJ4.assertQ SEVERE REQUEST FAILED: xpath=//lst[@name='spellcheck']/lst[@name='suggestions']/lst[@name='ac']/int[@name='numFound'][.='2']
[junit4:junit4]   2> 		xml response was: <?xml version="1.0" encoding="UTF-8"?>
[junit4:junit4]   2> 	<response>
[junit4:junit4]   2> 	<lst name="responseHeader"><int name="status">0</int><int name="QTime">0</int></lst><lst name="spellcheck"><lst name="suggestions"/></lst>
[junit4:junit4]   2> 	</response>
[junit4:junit4]   2> 	
[junit4:junit4]   2> 		request was:q=ac&spellcheck.count=2&qt=/suggest&spellcheck.onlyMorePopular=true
[junit4:junit4]   2> 299 T1414 oasc.SolrException.log SEVERE REQUEST FAILED: q=ac&spellcheck.count=2&qt=/suggest&spellcheck.onlyMorePopular=true:java.lang.RuntimeException: REQUEST FAILED: xpath=//lst[@name='spellcheck']/lst[@name='suggestions']/lst[@name='ac']/int[@name='numFound'][.='2']
[junit4:junit4]   2> 		xml response was: <?xml version="1.0" encoding="UTF-8"?>
[junit4:junit4]   2> 	<response>
[junit4:junit4]   2> 	<lst name="responseHeader"><int name="status">0</int><int name="QTime">0</int></lst><lst name="spellcheck"><lst name="suggestions"/></lst>
[junit4:junit4]   2> 	</response>
[junit4:junit4]   2> 	
[junit4:junit4]   2> 		request was:q=ac&spellcheck.count=2&qt=/suggest&spellcheck.onlyMorePopular=true
[junit4:junit4]   2> 		at org.apache.solr.SolrTestCaseJ4.assertQ(SolrTestCaseJ4.java:486)
[junit4:junit4]   2> 		at org.apache.solr.SolrTestCaseJ4.assertQ(SolrTestCaseJ4.java:460)
[junit4:junit4]   2> 		at org.apache.solr.spelling.suggest.SuggesterTest.testSuggestions(SuggesterTest.java:71)
[junit4:junit4]   2> 		at sun.reflect.NativeMethodAccessorImpl.invoke0(Native Method)
[junit4:junit4]   2> 		at sun.reflect.NativeMethodAccessorImpl.invoke(NativeMethodAccessorImpl.java:57)
[junit4:junit4]   2> 		at sun.reflect.DelegatingMethodAccessorImpl.invoke(DelegatingMethodAccessorImpl.java:43)
[junit4:junit4]   2> 		at java.lang.reflect.Method.invoke(Method.java:601)
[junit4:junit4]   2> 		at com.carrotsearch.randomizedtesting.RandomizedRunner.invoke(RandomizedRunner.java:1559)
[junit4:junit4]   2> 		at com.carrotsearch.randomizedtesting.RandomizedRunner.access$600(RandomizedRunner.java:79)
[junit4:junit4]   2> 		at com.carrotsearch.randomizedtesting.RandomizedRunner$6.evaluate(RandomizedRunner.java:737)
[junit4:junit4]   2> 		at com.carrotsearch.randomizedtesting.RandomizedRunner$7.evaluate(RandomizedRunner.java:773)
[junit4:junit4]   2> 		at com.carrotsearch.randomizedtesting.RandomizedRunner$8.evaluate(RandomizedRunner.java:787)
[junit4:junit4]   2> 		at com.carrotsearch.randomizedtesting.rules.SystemPropertiesRestoreRule$1.evaluate(SystemPropertiesRestoreRule.java:53)
[junit4:junit4]   2> 		at org.apache.lucene.util.TestRuleSetupTeardownChained$1.evaluate(TestRuleSetupTeardownChained.java:50)
[junit4:junit4]   2> 		at org.apache.lucene.util.TestRuleFieldCacheSanity$1.evaluate(TestRuleFieldCacheSanity.java:51)
[junit4:junit4]   2> 		at org.apache.lucene.util.AbstractBeforeAfterRule$1.evaluate(AbstractBeforeAfterRule.java:45)
[junit4:junit4]   2> 		at com.carrotsearch.randomizedtesting.rules.SystemPropertiesInvariantRule$1.evaluate(SystemPropertiesInvariantRule.java:55)
[junit4:junit4]   2> 		at org.apache.lucene.util.TestRuleThreadAndTestName$1.evaluate(TestRuleThreadAndTestName.java:48)
[junit4:junit4]   2> 		at org.apache.lucene.util.TestRuleIgnoreAfterMaxFailures$1.evaluate(TestRuleIgnoreAfterMaxFailures.java:70)
[junit4:junit4]   2> 		at org.apache.lucene.util.TestRuleMarkFailure$1.evaluate(TestRuleMarkFailure.java:48)
[junit4:junit4]   2> 		at com.carrotsearch.randomizedtesting.rules.StatementAdapter.evaluate(StatementAdapter.java:36)
[junit4:junit4]   2> 		at com.carrotsearch.randomizedtesting.ThreadLeakControl$StatementRunner.run(ThreadLeakControl.java:345)
[junit4:junit4]   2> 		at com.carrotsearch.randomizedtesting.ThreadLeakControl.forkTimeoutingTask(ThreadLeakControl.java:769)
[junit4:junit4]   2> 		at com.carrotsearch.randomizedtesting.ThreadLeakControl$3.evaluate(ThreadLeakControl.java:429)
[junit4:junit4]   2> 		at com.carrotsearch.randomizedtesting.RandomizedRunner.runSingleTest(RandomizedRunner.java:746)
[junit4:junit4]   2> 		at com.carrotsearch.randomizedtesting.RandomizedRunner$3.evaluate(RandomizedRunner.java:648)
[junit4:junit4]   2> 		at com.carrotsearch.randomizedtesting.RandomizedRunner$4.evaluate(RandomizedRunner.java:682)
[junit4:junit4]   2> 		at com.carrotsearch.randomizedtesting.RandomizedRunner$5.evaluate(RandomizedRunner.java:693)
[junit4:junit4]   2> 		at com.carrotsearch.randomizedtesting.rules.StatementAdapter.evaluate(StatementAdapter.java:36)
[junit4:junit4]   2> 		at com.carrotsearch.randomizedtesting.rules.SystemPropertiesRestoreRule$1.evaluate(SystemPropertiesRestoreRule.java:53)
[junit4:junit4]   2> 		at org.apache.lucene.util.AbstractBeforeAfterRule$1.evaluate(AbstractBeforeAfterRule.java:45)
[junit4:junit4]   2> 		at org.apache.lucene.util.TestRuleStoreClassName$1.evaluate(TestRuleStoreClassName.java:42)
[junit4:junit4]   2> 		at com.carrotsearch.randomizedtesting.rules.SystemPropertiesInvariantRule$1.evaluate(SystemPropertiesInvariantRule.java:55)
[junit4:junit4]   2> 		at com.carrotsearch.randomizedtesting.rules.NoShadowingOrOverridesOnMethodsRule$1.evaluate(NoShadowingOrOverridesOnMethodsRule.java:39)
[junit4:junit4]   2> 		at com.carrotsearch.randomizedtesting.rules.NoShadowingOrOverridesOnMethodsRule$1.evaluate(NoShadowingOrOverridesOnMethodsRule.java:39)
[junit4:junit4]   2> 		at org.apache.lucene.util.TestRuleAssertionsRequired$1.evaluate(TestRuleAssertionsRequired.java:40)
[junit4:junit4]   2> 		at org.apache.lucene.util.TestRuleMarkFailure$1.evaluate(TestRuleMarkFailure.java:48)
[junit4:junit4]   2> 		at org.apache.lucene.util.TestRuleIgnoreAfterMaxFailures$1.evaluate(TestRuleIgnoreAfterMaxFailures.java:70)
[junit4:junit4]   2> 		at org.apache.lucene.util.TestRuleIgnoreTestSuites$1.evaluate(TestRuleIgnoreTestSuites.java:55)
[junit4:junit4]   2> 		at com.carrotsearch.randomizedtesting.rules.StatementAdapter.evaluate(StatementAdapter.java:36)
[junit4:junit4]   2> 		at com.carrotsearch.randomizedtesting.ThreadLeakControl$StatementRunner.run(ThreadLeakControl.java:345)
[junit4:junit4]   2> 		at java.lang.Thread.run(Thread.java:722)
[junit4:junit4]   2> 	
[junit4:junit4]   2> 301 T1414 oas.SolrTestCaseJ4.tearDown ###Ending testSuggestions
[junit4:junit4]   2> NOTE: reproduce with: ant test  -Dtestcase=SuggesterTest -Dtests.method=testSuggestions -Dtests.seed=EA828E6D4DAF512A -Dtests.slow=true -Dtests.locale=mk -Dtests.timezone=Asia/Macau -Dtests.file.encoding=ISO-8859-1
[junit4:junit4] ERROR   0.07s | SuggesterTest.testSuggestions <<<
[junit4:junit4]    > Throwable #1: java.lang.RuntimeException: Exception during query
[junit4:junit4]    > 	at __randomizedtesting.SeedInfo.seed([EA828E6D4DAF512A:4C5EB798839B06D4]:0)
[junit4:junit4]    > 	at org.apache.solr.SolrTestCaseJ4.assertQ(SolrTestCaseJ4.java:493)
[junit4:junit4]    > 	at org.apache.solr.SolrTestCaseJ4.assertQ(SolrTestCaseJ4.java:460)
[junit4:junit4]    > 	at org.apache.solr.spelling.suggest.SuggesterTest.testSuggestions(SuggesterTest.java:71)
[junit4:junit4]    > 	at sun.reflect.NativeMethodAccessorImpl.invoke0(Native Method)
[junit4:junit4]    > 	at sun.reflect.NativeMethodAccessorImpl.invoke(NativeMethodAccessorImpl.java:57)
[junit4:junit4]    > 	at sun.reflect.DelegatingMethodAccessorImpl.invoke(DelegatingMethodAccessorImpl.java:43)
[junit4:junit4]    > 	at java.lang.reflect.Method.invoke(Method.java:601)
[junit4:junit4]    > 	at com.carrotsearch.randomizedtesting.RandomizedRunner.invoke(RandomizedRunner.java:1559)
[junit4:junit4]    > 	at com.carrotsearch.randomizedtesting.RandomizedRunner.access$600(RandomizedRunner.java:79)
[junit4:junit4]    > 	at com.carrotsearch.randomizedtesting.RandomizedRunner$6.evaluate(RandomizedRunner.java:737)
[junit4:junit4]    > 	at com.carrotsearch.randomizedtesting.RandomizedRunner$7.evaluate(RandomizedRunner.java:773)
[junit4:junit4]    > 	at com.carrotsearch.randomizedtesting.RandomizedRunner$8.evaluate(RandomizedRunner.java:787)
[junit4:junit4]    > 	at com.carrotsearch.randomizedtesting.rules.SystemPropertiesRestoreRule$1.evaluate(SystemPropertiesRestoreRule.java:53)
[junit4:junit4]    > 	at org.apache.lucene.util.TestRuleSetupTeardownChained$1.evaluate(TestRuleSetupTeardownChained.java:50)
[junit4:junit4]    > 	at org.apache.lucene.util.TestRuleFieldCacheSanity$1.evaluate(TestRuleFieldCacheSanity.java:51)
[junit4:junit4]    > 	at org.apache.lucene.util.AbstractBeforeAfterRule$1.evaluate(AbstractBeforeAfterRule.java:45)
[junit4:junit4]    > 	at com.carrotsearch.randomizedtesting.rules.SystemPropertiesInvariantRule$1.evaluate(SystemPropertiesInvariantRule.java:55)
[junit4:junit4]    > 	at org.apache.lucene.util.TestRuleThreadAndTestName$1.evaluate(TestRuleThreadAndTestName.java:48)
[junit4:junit4]    > 	at org.apache.lucene.util.TestRuleIgnoreAfterMaxFailures$1.evaluate(TestRuleIgnoreAfterMaxFailures.java:70)
[junit4:junit4]    > 	at org.apache.lucene.util.TestRuleMarkFailure$1.evaluate(TestRuleMarkFailure.java:48)
[junit4:junit4]    > 	at com.carrotsearch.randomizedtesting.rules.StatementAdapter.evaluate(StatementAdapter.java:36)
[junit4:junit4]    > 	at com.carrotsearch.randomizedtesting.ThreadLeakControl$StatementRunner.run(ThreadLeakControl.java:345)
[junit4:junit4]    > 	at com.carrotsearch.randomizedtesting.ThreadLeakControl.forkTimeoutingTask(ThreadLeakControl.java:769)
[junit4:junit4]    > 	at com.carrotsearch.randomizedtesting.ThreadLeakControl$3.evaluate(ThreadLeakControl.java:429)
[junit4:junit4]    > 	at com.carrotsearch.randomizedtesting.RandomizedRunner.runSingleTest(RandomizedRunner.java:746)
[junit4:junit4]    > 	at com.carrotsearch.randomizedtesting.RandomizedRunner$3.evaluate(RandomizedRunner.java:648)
[junit4:junit4]    > 	at com.carrotsearch.randomizedtesting.RandomizedRunner$4.evaluate(RandomizedRunner.java:682)
[junit4:junit4]    > 	at com.carrotsearch.randomizedtesting.RandomizedRunner$5.evaluate(RandomizedRunner.java:693)
[junit4:junit4]    > 	at com.carrotsearch.randomizedtesting.rules.StatementAdapter.evaluate(StatementAdapter.java:36)
[junit4:junit4]    > 	at com.carrotsearch.randomizedtesting.rules.SystemPropertiesRestoreRule$1.evaluate(SystemPropertiesRestoreRule.java:53)
[junit4:junit4]    > 	at org.apache.lucene.util.AbstractBeforeAfterRule$1.evaluate(AbstractBeforeAfterRule.java:45)
[junit4:junit4]    > 	at org.apache.lucene.util.TestRuleStoreClassName$1.evaluate(TestRuleStoreClassName.java:42)
[junit4:junit4]    > 	at com.carrotsearch.randomizedtesting.rules.SystemPropertiesInvariantRule$1.evaluate(SystemPropertiesInvariantRule.java:55)
[junit4:junit4]    > 	at com.carrotsearch.randomizedtesting.rules.NoShadowingOrOverridesOnMethodsRule$1.evaluate(NoShadowingOrOverridesOnMethodsRule.java:39)
[junit4:junit4]    > 	at com.carrotsearch.randomizedtesting.rules.NoShadowingOrOverridesOnMethodsRule$1.evaluate(NoShadowingOrOverridesOnMethodsRule.java:39)
[junit4:junit4]    > 	at org.apache.lucene.util.TestRuleAssertionsRequired$1.evaluate(TestRuleAssertionsRequired.java:40)
[junit4:junit4]    > 	at org.apache.lucene.util.TestRuleMarkFailure$1.evaluate(TestRuleMarkFailure.java:48)
[junit4:junit4]    > 	at org.apache.lucene.util.TestRuleIgnoreAfterMaxFailures$1.evaluate(TestRuleIgnoreAfterMaxFailures.java:70)
[junit4:junit4]    > 	at org.apache.lucene.util.TestRuleIgnoreTestSuites$1.evaluate(TestRuleIgnoreTestSuites.java:55)
[junit4:junit4]    > 	at com.carrotsearch.randomizedtesting.rules.StatementAdapter.evaluate(StatementAdapter.java:36)
[junit4:junit4]    > 	at com.carrotsearch.randomizedtesting.ThreadLeakControl$StatementRunner.run(ThreadLeakControl.java:345)
[junit4:junit4]    > 	at java.lang.Thread.run(Thread.java:722)
[junit4:junit4]    > Caused by: java.lang.RuntimeException: REQUEST FAILED: xpath=//lst[@name='spellcheck']/lst[@name='suggestions']/lst[@name='ac']/int[@name='numFound'][.='2']
[junit4:junit4]    > 	xml response was: <?xml version="1.0" encoding="UTF-8"?>
[junit4:junit4]    > <response>
[junit4:junit4]    > <lst name="responseHeader"><int name="status">0</int><int name="QTime">0</int></lst><lst name="spellcheck"><lst name="suggestions"/></lst>
[junit4:junit4]    > </response>
[junit4:junit4]    > 
[junit4:junit4]    > 	request was:q=ac&spellcheck.count=2&qt=/suggest&spellcheck.onlyMorePopular=true
[junit4:junit4]    > 	at org.apache.solr.SolrTestCaseJ4.assertQ(SolrTestCaseJ4.java:486)
[junit4:junit4]    > 	... 41 more
[junit4:junit4]   2> 312 T1414 oas.SolrTestCaseJ4.setUp ###Starting testAnalyzer
[junit4:junit4]   2> 313 T1414 oasss.Suggester.init init: {lookupImpl=org.apache.solr.spelling.suggest.tst.TSTLookupFactory}
[junit4:junit4]   2> 313 T1414 oas.SolrTestCaseJ4.tearDown ###Ending testAnalyzer
[junit4:junit4]   2> 317 T1414 oas.SolrTestCaseJ4.setUp ###Starting testRebuild
[junit4:junit4]   2> 329 T1414 C118 UPDATE [collection1] webapp=null path=null params={} {add=[1]} 0 1
[junit4:junit4]   2> 338 T1414 C118 UPDATE [collection1] webapp=null path=null params={} {add=[2]} 0 1
[junit4:junit4]   2> 348 T1414 C118 UPDATE [collection1] webapp=null path=null params={} {add=[3]} 0 0
[junit4:junit4]   2> 362 T1414 C118 oasu.DirectUpdateHandler2.commit start commit{flags=0,_version_=0,optimize=false,openSearcher=true,waitSearcher=true,expungeDeletes=false,softCommit=false}
[junit4:junit4]   2> 378 T1414 C118 oasc.SolrDeletionPolicy.onCommit SolrDeletionPolicy.onCommit: commits:num=2
[junit4:junit4]   2> 		commit{dir=MockDirWrapper(org.apache.lucene.store.MMapDirectory@C:\Jenkins\workspace\Lucene-Solr-4.x-Windows\solr\build\solr-core\test\J0\solrtest-SuggesterTest-1345784953297\index lockFactory=org.apache.lucene.store.NativeFSLockFactory@263ec46d),segFN=segments_2,generation=2,filenames=[_0.fnm, _0.frq, _0.tim, _0_nrm.cfe, segments_2, _0.fdx, _0_nrm.cfs, _0.si, _0.prx, _0.tip, _0.fdt]
[junit4:junit4]   2> 		commit{dir=MockDirWrapper(org.apache.lucene.store.MMapDirectory@C:\Jenkins\workspace\Lucene-Solr-4.x-Windows\solr\build\solr-core\test\J0\solrtest-SuggesterTest-1345784953297\index lockFactory=org.apache.lucene.store.NativeFSLockFactory@263ec46d),segFN=segments_3,generation=3,filenames=[_1.fdx, _1.prx, _1_nrm.cfs, _1.frq, _1.fdt, _1.si, _1.tip, _1.fnm, _1.tim, segments_3, _1_nrm.cfe]
[junit4:junit4]   2> 379 T1414 C118 oasc.SolrDeletionPolicy.updateCommits newest commit = 3
[junit4:junit4]   2> 388 T1414 C118 oass.SolrIndexSearcher.<init> Opening Searcher@78dd0413 main
[junit4:junit4]   2> 389 T1414 C118 oass.SolrIndexSearcher.getIndexDir WARNING WARNING: Directory impl does not support setting indexDir: org.apache.lucene.store.MockDirectoryWrapper
[junit4:junit4]   2> 389 T1415 oashc.SpellCheckComponent$SpellCheckerListener.buildSpellIndex Building spell index for spell checker: suggest
[junit4:junit4]   2> 389 T1415 oasss.Suggester.build build()
[junit4:junit4]   2> 391 T1415 oasss.Suggester.build Stored suggest data to: C:\Jenkins\workspace\Lucene-Solr-4.x-Windows\solr\build\solr-core\test\J0\.\solrtest-SuggesterTest-1345784953297\suggest\jaspell.dat
[junit4:junit4]   2> 391 T1415 oashc.SpellCheckComponent$SpellCheckerListener.buildSpellIndex Building spell index for spell checker: suggest_tst
[junit4:junit4]   2> 391 T1415 oasss.Suggester.build build()
[junit4:junit4]   2> 391 T1414 C118 oasu.DirectUpdateHandler2.commit end_commit_flush
[junit4:junit4]   2> 401 T1415 oasss.Suggester.build Stored suggest data to: C:\Jenkins\workspace\Lucene-Solr-4.x-Windows\solr\build\solr-core\test\J0\.\solrtest-SuggesterTest-1345784953297\suggest_tst\tst.dat
[junit4:junit4]   2> 402 T1415 oashc.SpellCheckComponent$SpellCheckerListener.buildSpellIndex Building spell index for spell checker: suggest_fst
[junit4:junit4]   2> 402 T1415 oasss.Suggester.build build()
[junit4:junit4]   2> 407 T1415 oasss.Suggester.build Stored suggest data to: C:\Jenkins\workspace\Lucene-Solr-4.x-Windows\solr\build\solr-core\test\J0\.\solrtest-SuggesterTest-1345784953297\suggest_fst\fst.bin
[junit4:junit4]   2> 407 T1415 oashc.SpellCheckComponent$SpellCheckerListener.buildSpellIndex Building spell index for spell checker: suggest_wfst
[junit4:junit4]   2> 407 T1415 oasss.Suggester.build build()
[junit4:junit4]   2> 410 T1415 oasss.Suggester.build Stored suggest data to: C:\Jenkins\workspace\Lucene-Solr-4.x-Windows\solr\build\solr-core\test\J0\.\solrtest-SuggesterTest-1345784953297\suggest_wfst\wfst.bin
[junit4:junit4]   2> 410 T1415 oasc.SolrCore.registerSearcher [collection1] Registered new searcher Searcher@78dd0413 main{StandardDirectoryReader(segments_3:7 _1(4.0.0.2):C3)}
[junit4:junit4]   2> 412 T1414 C118 UPDATE [collection1] webapp=null path=null params={} {commit=} 0 50
[junit4:junit4]   2> 415 T1414 C118 REQ [collection1] webapp=null path=null params={q=ac&spellcheck.count=2&qt=/suggest&spellcheck.onlyMorePopular=true} status=0 QTime=2 
[junit4:junit4]   2> 427 T1414 C118 UPDATE [collection1] webapp=null path=null params={} {add=[4]} 0 0
[junit4:junit4]   2> 433 T1414 C118 oasu.DirectUpdateHandler2.commit start commit{flags=0,_version_=0,optimize=false,openSearcher=true,waitSearcher=true,expungeDeletes=false,softCommit=false}
[junit4:junit4]   2> 445 T1414 C118 oasc.SolrDeletionPolicy.onCommit SolrDeletionPolicy.onCommit: commits:num=2
[junit4:junit4]   2> 		commit{dir=MockDirWrapper(org.apache.lucene.store.MMapDirectory@C:\Jenkins\workspace\Lucene-Solr-4.x-Windows\solr\build\solr-core\test\J0\solrtest-SuggesterTest-1345784953297\index lockFactory=org.apache.lucene.store.NativeFSLockFactory@263ec46d),segFN=segments_3,generation=3,filenames=[_1.fdx, _1.prx, _1_nrm.cfs, _1.frq, _1.fdt, _1.si, _1.tip, _1.fnm, _1.tim, segments_3, _1_nrm.cfe]
[junit4:junit4]   2> 		commit{dir=MockDirWrapper(org.apache.lucene.store.MMapDirectory@C:\Jenkins\workspace\Lucene-Solr-4.x-Windows\solr\build\solr-core\test\J0\solrtest-SuggesterTest-1345784953297\index lockFactory=org.apache.lucene.store.NativeFSLockFactory@263ec46d),segFN=segments_4,generation=4,filenames=[_2.si, _1_nrm.cfs, _2.prx, _1.frq, _2.fdt, _2.frq, _2.fdx, _1.fnm, _2.tim, _2.fnm, _1_nrm.cfe, _2.tip, _1.prx, _1.fdx, _2_nrm.cfe, _1.fdt, _1.si, _2_nrm.cfs, _1.tip, _1.tim, segments_4]
[junit4:junit4]   2> 445 T1414 C118 oasc.SolrDeletionPolicy.updateCommits newest commit = 4
[junit4:junit4]   2> 453 T1414 C118 oass.SolrIndexSearcher.<init> Opening Searcher@12e0863a main
[junit4:junit4]   2> 453 T1414 C118 oass.SolrIndexSearcher.getIndexDir WARNING WARNING: Directory impl does not support setting indexDir: org.apache.lucene.store.MockDirectoryWrapper
[junit4:junit4]   2> 454 T1415 oashc.SpellCheckComponent$SpellCheckerListener.buildSpellIndex Building spell index for spell checker: suggest
[junit4:junit4]   2> 454 T1415 oasss.Suggester.build build()
[junit4:junit4]   2> 458 T1415 oasss.Suggester.build Stored suggest data to: C:\Jenkins\workspace\Lucene-Solr-4.x-Windows\solr\build\solr-core\test\J0\.\solrtest-SuggesterTest-1345784953297\suggest\jaspell.dat
[junit4:junit4]   2> 458 T1415 oashc.SpellCheckComponent$SpellCheckerListener.buildSpellIndex Building spell index for spell checker: suggest_tst
[junit4:junit4]   2> 458 T1415 oasss.Suggester.build build()
[junit4:junit4]   2> 464 T1415 oasss.Suggester.build Stored suggest data to: C:\Jenkins\workspace\Lucene-Solr-4.x-Windows\solr\build\solr-core\test\J0\.\solrtest-SuggesterTest-1345784953297\suggest_tst\tst.dat
[junit4:junit4]   2> 464 T1415 oashc.SpellCheckComponent$SpellCheckerListener.buildSpellIndex Building spell index for spell checker: suggest_fst
[junit4:junit4]   2> 464 T1415 oasss.Suggester.build build()
[junit4:junit4]   2> 468 T1415 oasss.Suggester.build Stored suggest data to: C:\Jenkins\workspace\Lucene-Solr-4.x-Windows\solr\build\solr-core\test\J0\.\solrtest-SuggesterTest-1345784953297\suggest_fst\fst.bin
[junit4:junit4]   2> 468 T1415 oashc.SpellCheckComponent$SpellCheckerListener.buildSpellIndex Building spell index for spell checker: suggest_wfst
[junit4:junit4]   2> 468 T1415 oasss.Suggester.build build()
[junit4:junit4]   2> 471 T1415 oasss.Suggester.build Stored suggest data to: C:\Jenkins\workspace\Lucene-Solr-4.x-Windows\solr\build\solr-core\test\J0\.\solrtest-SuggesterTest-1345784953297\suggest_wfst\wfst.bin
[junit4:junit4]   2> 471 T1415 oasc.SolrCore.registerSearcher [collection1] Registered new searcher Searcher@12e0863a main{StandardDirectoryReader(segments_4:9 _1(4.0.0.2):C3 _2(4.0.0.2):C1)}
[junit4:junit4]   2> 471 T1414 C118 oasu.DirectUpdateHandler2.commit end_commit_flush
[junit4:junit4]   2> 471 T1414 C118 UPDATE [collection1] webapp=null path=null params={} {commit=} 0 38
[junit4:junit4]   2> 474 T1414 C118 REQ [collection1] webapp=null path=null params={q=ac&spellcheck.count=2&qt=/suggest&spellcheck.onlyMorePopular=true} status=0 QTime=0 
[junit4:junit4]   2> 476 T1414 oas.SolrTestCaseJ4.tearDown ###Ending testRebuild
[junit4:junit4]   2> 477 T1414 oas.SolrTestCaseJ4.setUp ###Starting testReload
[junit4:junit4]   2> 483 T1414 C118 UPDATE [collection1] webapp=null path=null params={} {add=[1]} 0 1
[junit4:junit4]   2> 489 T1414 C118 UPDATE [collection1] webapp=null path=null params={} {add=[2]} 0 0
[junit4:junit4]   2> 496 T1414 C118 UPDATE [collection1] webapp=null path=null params={} {add=[3]} 0 1
[junit4:junit4]   2> 501 T1414 C118 oasu.DirectUpdateHandler2.commit start commit{flags=0,_version_=0,optimize=false,openSearcher=true,waitSearcher=true,expungeDeletes=false,softCommit=false}
[junit4:junit4]   2> 527 T1414 C118 oasc.SolrDeletionPolicy.onCommit SolrDeletionPolicy.onCommit: commits:num=2
[junit4:junit4]   2> 		commit{dir=MockDirWrapper(org.apache.lucene.store.MMapDirectory@C:\Jenkins\workspace\Lucene-Solr-4.x-Windows\solr\build\solr-core\test\J0\solrtest-SuggesterTest-1345784953297\index lockFactory=org.apache.lucene.store.NativeFSLockFactory@263ec46d),segFN=segments_4,generation=4,filenames=[_2.si, _1_nrm.cfs, _2.prx, _1.frq, _2.fdt, _2.frq, _2.fdx, _1.fnm, _2.tim, _2.fnm, _1_nrm.cfe, _2.tip, _1.prx, _1.fdx, _2_nrm.cfe, _1.fdt, _1.si, _2_nrm.cfs, _1.tip, _1.tim, segments_4]
[junit4:junit4]   2> 		commit{dir=MockDirWrapper(org.apache.lucene.store.MMapDirectory@C:\Jenkins\workspace\Lucene-Solr-4.x-Windows\solr\build\solr-core\test\J0\solrtest-SuggesterTest-1345784953297\index lockFactory=org.apache.lucene.store.NativeFSLockFactory@263ec46d),segFN=segments_5,generation=5,filenames=[_2.si, _3_nrm.cfe, _3.frq, _2.prx, _3.tim, _2.frq, _2.fdt, _3.fdt, _3.prx, _3.fnm, _2.fdx, _2.fnm, _2.tim, _3.fdx, _3_nrm.cfs, _2.tip, _2_nrm.cfe, _3.si, _3.tip, segments_5, _2_nrm.cfs]
[junit4:junit4]   2> 527 T1414 C118 oasc.SolrDeletionPolicy.updateCommits newest commit = 5
[junit4:junit4]   2> 535 T1414 C118 oass.SolrIndexSearcher.<init> Opening Searcher@535e7b65 main
[junit4:junit4]   2> 536 T1414 C118 oass.SolrIndexSearcher.getIndexDir WARNING WARNING: Directory impl does not support setting indexDir: org.apache.lucene.store.MockDirectoryWrapper
[junit4:junit4]   2> 536 T1414 C118 oasu.DirectUpdateHandler2.commit end_commit_flush
[junit4:junit4]   2> 547 T1415 oashc.SpellCheckComponent$SpellCheckerListener.buildSpellIndex Building spell index for spell checker: suggest
[junit4:junit4]   2> 547 T1415 oasss.Suggester.build build()
[junit4:junit4]   2> 549 T1415 oasss.Suggester.build Stored suggest data to: C:\Jenkins\workspace\Lucene-Solr-4.x-Windows\solr\build\solr-core\test\J0\.\solrtest-SuggesterTest-1345784953297\suggest\jaspell.dat
[junit4:junit4]   2> 549 T1415 oashc.SpellCheckComponent$SpellCheckerListener.buildSpellIndex Building spell index for spell checker: suggest_tst
[junit4:junit4]   2> 549 T1415 oasss.Suggester.build build()
[junit4:junit4]   2> 554 T1415 oasss.Suggester.build Stored suggest data to: C:\Jenkins\workspace\Lucene-Solr-4.x-Windows\solr\build\solr-core\test\J0\.\solrtest-SuggesterTest-1345784953297\suggest_tst\tst.dat
[junit4:junit4]   2> 554 T1415 oashc.SpellCheckComponent$SpellCheckerListener.buildSpellIndex Building spell index for spell checker: suggest_fst
[junit4:junit4]   2> 554 T1415 oasss.Suggester.build build()
[junit4:junit4]   2> 560 T1415 oasss.Suggester.build Stored suggest data to: C:\Jenkins\workspace\Lucene-Solr-4.x-Windows\solr\build\solr-core\test\J0\.\solrtest-SuggesterTest-1345784953297\suggest_fst\fst.bin
[junit4:junit4]   2> 560 T1415 oashc.SpellCheckComponent$SpellCheckerListener.buildSpellIndex Building spell index for spell checker: suggest_wfst
[junit4:junit4]   2> 560 T1415 oasss.Suggester.build build()
[junit4:junit4]   2> 562 T1415 oasss.Suggester.build Stored suggest data to: C:\Jenkins\workspace\Lucene-Solr-4.x-Windows\solr\build\solr-core\test\J0\.\solrtest-SuggesterTest-1345784953297\suggest_wfst\wfst.bin
[junit4:junit4]   2> 562 T1415 oasc.SolrCore.registerSearcher [collection1] Registered new searcher Searcher@535e7b65 main{StandardDirectoryReader(segments_5:13 _2(4.0.0.2):C1 _3(4.0.0.2):C3)}
[junit4:junit4]   2> 564 T1414 C118 UPDATE [collection1] webapp=null path=null params={} {commit=} 0 64
[junit4:junit4]   2> 567 T1414 oas.SolrTestCaseJ4.deleteCore ###deleteCore
[junit4:junit4]   2> 567 T1414 oasc.CoreContainer.shutdown Shutting down CoreContainer instance=1226003348
[junit4:junit4]   2> 567 T1414 oasc.SolrCore.close [collection1]  CLOSING SolrCore org.apache.solr.core.SolrCore@3b538de5
[junit4:junit4]   2> 568 T1414 oasc.SolrCore.closeSearcher [collection1] Closing main searcher on request.
[junit4:junit4]   2> 571 T1414 oasu.DirectUpdateHandler2.close closing DirectUpdateHandler2{commits=4,autocommits=0,soft autocommits=0,optimizes=0,rollbacks=0,expungeDeletes=0,docsPending=0,adds=0,deletesById=0,deletesByQuery=0,errors=0,cumulative_adds=10,cumulative_deletesById=0,cumulative_deletesByQuery=0,cumulative_errors=0}
[junit4:junit4]   2> 571 T1414 oasu.DefaultSolrCoreState.decref SolrCoreState ref count has reached 0 - closing IndexWriter
[junit4:junit4]   2> NOTE: per solr.test.leavedatadir, dataDir will not be removed: C:\Jenkins\workspace\Lucene-Solr-4.x-Windows\solr\build\solr-core\test\J0\.\solrtest-SuggesterTest-1345784953297
[junit4:junit4]   2> 584 T1414 oas.SolrTestCaseJ4.initCore ####initCore
[junit4:junit4]   2> 584 T1414 oasc.SolrResourceLoader.<init> new SolrResourceLoader for directory: 'C:\Jenkins\workspace\Lucene-Solr-4.x-Windows\solr\build\solr-core\test-files\solr\collection1\'
[junit4:junit4]   2> 585 T1414 oasc.SolrResourceLoader.replaceClassLoader Adding 'file:/C:/Jenkins/workspace/Lucene-Solr-4.x-Windows/solr/build/solr-core/test-files/solr/collection1/lib/classes/' to classloader
[junit4:junit4]   2> 585 T1414 oasc.SolrResourceLoader.replaceClassLoader Adding 'file:/C:/Jenkins/workspace/Lucene-Solr-4.x-Windows/solr/build/solr-core/test-files/solr/collection1/lib/README' to classloader
[junit4:junit4]   2> 641 T1414 oasc.SolrConfig.<init> Using Lucene MatchVersion: LUCENE_40
[junit4:junit4]   2> 707 T1414 oasc.SolrConfig.<init> Loaded SolrConfig: solrconfig-spellchecker.xml
[junit4:junit4]   2> 707 T1414 oass.IndexSchema.readSchema Reading Solr Schema
[junit4:junit4]   2> 711 T1414 oass.IndexSchema.readSchema Schema name=test
[junit4:junit4]   2> 1534 T1414 oass.OpenExchangeRatesOrgProvider.init Initialized with rates=open-exchange-rates.json, refreshInterval=1440.
[junit4:junit4]   2> 1541 T1414 oass.IndexSchema.readSchema default search field in schema is text
[junit4:junit4]   2> 1544 T1414 oass.IndexSchema.readSchema unique key field: id
[junit4:junit4]   2> 1548 T1414 oass.FileExchangeRateProvider.reload Reloading exchange rates from file currency.xml
[junit4:junit4]   2> 1551 T1414 oass.FileExchangeRateProvider.reload Reloading exchange rates from file currency.xml
[junit4:junit4]   2> 1554 T1414 oass.OpenExchangeRatesOrgProvider.reload Reloading exchange rates from open-exchange-rates.json
[junit4:junit4]   2> 1555 T1414 oass.OpenExchangeRatesOrgProvider.reload Reloading exchange rates from open-exchange-rates.json
[junit4:junit4]   2> 1555 T1414 oasc.SolrResourceLoader.locateSolrHome JNDI not configured for solr (NoInitialContextEx)
[junit4:junit4]   2> 1555 T1414 oasc.SolrResourceLoader.locateSolrHome using system property solr.solr.home: C:\Jenkins\workspace\Lucene-Solr-4.x-Windows\solr\build\solr-core\test-files\solr
[junit4:junit4]   2> 1556 T1414 oasc.SolrResourceLoader.<init> new SolrResourceLoader for directory: 'C:\Jenkins\workspace\Lucene-Solr-4.x-Windows\solr\build\solr-core\test-files\solr\'
[junit4:junit4]   2> 1561 T1414 oasc.CoreContainer.<init> New CoreContainer 1502850196
[junit4:junit4]   2> 1561 T1414 oasc.SolrCore.<init> [collection1] Opening new SolrCore at C:\Jenkins\workspace\Lucene-Solr-4.x-Windows\solr\build\solr-core\test-files\solr\collection1\, dataDir=C:\Jenkins\workspace\Lucene-Solr-4.x-Windows\solr\build\solr-core\test\J0\.\solrtest-SuggesterTest-1345784953297\
[junit4:junit4]   2> 1561 T1414 oasc.SolrCore.<init> JMX monitoring not detected for core: collection1
[junit4:junit4]   2> 1562 T1414 oasc.SolrCore.getNewIndexDir WARNING New index directory detected: old=null new=C:\Jenkins\workspace\Lucene-Solr-4.x-Windows\solr\build\solr-core\test\J0\.\solrtest-SuggesterTest-1345784953297\index/
[junit4:junit4]   2> 1563 T1414 oasc.RequestHandlers.initHandlersFromConfig created standard: solr.StandardRequestHandler
[junit4:junit4]   2> 1563 T1414 oasc.RequestHandlers.initHandlersFromConfig created /suggest: org.apache.solr.handler.component.SearchHandler
[junit4:junit4]   2> 1563 T1414 oasc.RequestHandlers.initHandlersFromConfig created /suggest_tst: org.apache.solr.handler.component.SearchHandler
[junit4:junit4]   2> 1563 T1414 oasc.RequestHandlers.initHandlersFromConfig created /suggest_fst: org.apache.solr.handler.component.SearchHandler
[junit4:junit4]   2> 1564 T1414 oasc.RequestHandlers.initHandlersFromConfig created /suggest_wfst: org.apache.solr.handler.component.SearchHandler
[junit4:junit4]   2> 1570 T1414 oasc.CachingDirectoryFactory.get return new directory for C:\Jenkins\workspace\Lucene-Solr-4.x-Windows\solr\build\solr-core\test\J0\.\solrtest-SuggesterTest-1345784953297\index forceNew:false
[junit4:junit4]   2> 1575 T1414 oass.SolrIndexSearcher.<init> Opening Searcher@52756ed1 main
[junit4:junit4]   2> 1575 T1414 oass.SolrIndexSearcher.getIndexDir WARNING WARNING: Directory impl does not support setting indexDir: org.apache.lucene.store.MockDirectoryWrapper
[junit4:junit4]   2> 1576 T1414 oasu.CommitTracker.<init> Hard AutoCommit: disabled
[junit4:junit4]   2> 1576 T1414 oasu.CommitTracker.<init> Soft AutoCommit: disabled
[junit4:junit4]   2> 1576 T1414 oashc.SpellCheckComponent.inform Initializing spell checkers
[junit4:junit4]   2> 1576 T1414 oasss.Suggester.init init: {name=suggest,classname=org.apache.solr.spelling.suggest.Suggester,lookupImpl=org.apache.solr.spelling.suggest.jaspell.JaspellLookup,field=suggest,storeDir=suggest,buildOnCommit=true,threshold=0.0}
[junit4:junit4]   2> 1577 T1414 oasssj.JaspellLookupFactory.create init: {name=suggest,classname=org.apache.solr.spelling.suggest.Suggester,lookupImpl=org.apache.solr.spelling.suggest.jaspell.JaspellLookup,field=suggest,storeDir=suggest,buildOnCommit=true,threshold=0.0}
[junit4:junit4]   2> 1578 T1414 oashc.SpellCheckComponent.inform Registering newSearcher listener for spellchecker: suggest
[junit4:junit4]   2> 1578 T1414 oashc.SpellCheckComponent.inform No queryConverter defined, using default converter
[junit4:junit4]   2> 1578 T1414 oashc.SpellCheckComponent.inform Initializing spell checkers
[junit4:junit4]   2> 1578 T1414 oasss.Suggester.init init: {name=suggest_tst,classname=org.apache.solr.spelling.suggest.Suggester,lookupImpl=org.apache.solr.spelling.suggest.tst.TSTLookup,field=suggest,storeDir=suggest_tst,buildOnCommit=true,threshold=0.0}
[junit4:junit4]   2> 1579 T1414 oashc.SpellCheckComponent.inform Registering newSearcher listener for spellchecker: suggest_tst
[junit4:junit4]   2> 1580 T1414 oashc.SpellCheckComponent.inform No queryConverter defined, using default converter
[junit4:junit4]   2> 1580 T1414 oashc.SpellCheckComponent.inform Initializing spell checkers
[junit4:junit4]   2> 1580 T1414 oasss.Suggester.init init: {name=suggest_fst,classname=org.apache.solr.spelling.suggest.Suggester,lookupImpl=org.apache.solr.spelling.suggest.fst.FSTLookup,field=suggest,storeDir=suggest_fst,buildOnCommit=true,weightBuckets=5,exactMatchFirst=true}
[junit4:junit4]   2> 1580 T1414 oashc.SpellCheckComponent.inform Registering newSearcher listener for spellchecker: suggest_fst
[junit4:junit4]   2> 1581 T1414 oashc.SpellCheckComponent.inform No queryConverter defined, using default converter
[junit4:junit4]   2> 1581 T1414 oashc.SpellCheckComponent.inform Initializing spell checkers
[junit4:junit4]   2> 1581 T1414 oasss.Suggester.init init: {name=suggest_wfst,classname=org.apache.solr.spelling.suggest.Suggester,lookupImpl=org.apache.solr.spelling.suggest.fst.WFSTLookupFactory,field=suggest,storeDir=suggest_wfst,buildOnCommit=true,exactMatchFirst=true}
[junit4:junit4]   2> 1582 T1414 oashc.SpellCheckComponent.inform Registering newSearcher listener for spellchecker: suggest_wfst
[junit4:junit4]   2> 1582 T1414 oashc.SpellCheckComponent.inform No queryConverter defined, using default converter
[junit4:junit4]   2> 1582 T1414 oashc.HttpShardHandlerFactory.getParameter Setting socketTimeout to: 0
[junit4:junit4]   2> 1582 T1414 oashc.HttpShardHandlerFactory.getParameter Setting urlScheme to: http://
[junit4:junit4]   2> 1582 T1414 oashc.HttpShardHandlerFactory.getParameter Setting connTimeout to: 0
[junit4:junit4]   2> 1582 T1414 oashc.HttpShardHandlerFactory.getParameter Setting maxConnectionsPerHost to: 20
[junit4:junit4]   2> 1582 T1414 oashc.HttpShardHandlerFactory.getParameter Setting corePoolSize to: 0
[junit4:junit4]   2> 1583 T1414 oashc.HttpShardHandlerFactory.getParameter Setting maximumPoolSize to: 2147483647
[junit4:junit4]   2> 1583 T1414 oashc.HttpShardHandlerFactory.getParameter Setting maxThreadIdleTime to: 5
[junit4:junit4]   2> 1583 T1414 oashc.HttpShardHandlerFactory.getParameter Setting sizeOfQueue to: -1
[junit4:junit4]   2> 1583 T1414 oashc.HttpShardHandlerFactory.getParameter Setting fairnessPolicy to: false
[junit4:junit4]   2> 1583 T1414 oascsi.HttpClientUtil.createClient Creating new http client, config:maxConnectionsPerHost=20&maxConnections=10000&socketTimeout=0&connTimeout=0&retry=false
[junit4:junit4]   2> 1587 T1414 oasc.CoreContainer.register registering core: collection1
[junit4:junit4]   2> 1587 T1416 oasc.SolrCore.registerSearcher [collection1] Registered new searcher Searcher@52756ed1 main{StandardDirectoryReader(segments_5:13 _2(4.0.0.2):C1 _3(4.0.0.2):C3)}
[junit4:junit4]   2> 1588 T1414 oas.SolrTestCaseJ4.initCore ####initCore end
[junit4:junit4]   2> ASYNC  NEW_CORE C119 name=collection1 org.apache.solr.core.SolrCore@2055cac3
[junit4:junit4]   2> 1589 T1414 C119 REQ [collection1] webapp=null path=null params={q=ac&spellcheck.count=2&qt=/suggest&spellcheck.onlyMorePopular=true} status=0 QTime=1 
[junit4:junit4]   2> 1598 T1414 oas.SolrTestCaseJ4.tearDown ###Ending testReload
[junit4:junit4]   2> 1598 T1414 oas.SolrTestCaseJ4.deleteCore ###deleteCore
[junit4:junit4]   2> 1599 T1414 oasc.CoreContainer.shutdown Shutting down CoreContainer instance=1502850196
[junit4:junit4]   2> 1599 T1414 oasc.SolrCore.close [collection1]  CLOSING SolrCore org.apache.solr.core.SolrCore@2055cac3
[junit4:junit4]   2> 1599 T1414 oasc.SolrCore.closeSearcher [collection1] Closing main searcher on request.
[junit4:junit4]   2> 1599 T1414 oasu.DirectUpdateHandler2.close closing DirectUpdateHandler2{commits=0,autocommits=0,soft autocommits=0,optimizes=0,rollbacks=0,expungeDeletes=0,docsPending=0,adds=0,deletesById=0,deletesByQuery=0,errors=0,cumulative_adds=0,cumulative_deletesById=0,cumulative_deletesByQuery=0,cumulative_errors=0}
[junit4:junit4]   2> 1599 T1414 oasu.DefaultSolrCoreState.decref SolrCoreState ref count has reached 0 - closing IndexWriter
[junit4:junit4]   2> NOTE: test params are: codec=Asserting, sim=DefaultSimilarity, locale=mk, timezone=Asia/Macau
[junit4:junit4]   2> NOTE: Windows 7 6.1 amd64/Oracle Corporation 1.7.0_06 (64-bit)/cpus=2,threads=1,free=70951784,total=109871104
[junit4:junit4]   2> NOTE: All tests run in this JVM: [TestLRUCache, DOMUtilTest, DirectUpdateHandlerOptimizeTest, TestDocSet, TestRecovery, ZkControllerTest, TestQueryTypes, MBeansHandlerTest, RAMDirectoryFactoryTest, SystemInfoHandlerTest, LegacyHTMLStripCharFilterTest, PreAnalyzedFieldTest, XmlUpdateRequestHandlerTest, TestUtils, PrimUtilsTest, TestSolrDeletionPolicy2, TestBinaryField, TestSolrCoreProperties, JsonLoaderTest, StandardRequestHandlerTest, SortByFunctionTest, LeaderElectionTest, FullSolrCloudDistribCmdsTest, TestIBSimilarityFactory, TestPropInjectDefaults, BinaryUpdateRequestHandlerTest, ZkNodePropsTest, BasicFunctionalityTest, QueryElevationComponentTest, DateFieldTest, UUIDFieldTest, SolrRequestParserTest, AnalysisAfterCoreReloadTest, TestStressRecovery, CoreAdminHandlerTest, SyncSliceTest, SolrCmdDistributorTest, SolrPluginUtilsTest, TestQueryUtils, SpatialFilterTest, ScriptEngineTest, SolrCoreTest, TestBM25SimilarityFactory, TestFunctionQuery, TestLMDirichletSimilarityFactory, IndexSchemaTest, WordBreakSolrSpellCheckerTest, FileUtilsTest, BadComponentTest, TestLuceneMatchVersion, TestReplicationHandler, TestXIncludeConfig, FastVectorHighlighterTest, RequiredFieldsTest, TestSolrXMLSerializer, SpellingQueryConverterTest, TestCSVResponseWriter, PrimitiveFieldTypeTest, TestPseudoReturnFields, SpellCheckComponentTest, TestCharFilters, TestDFRSimilarityFactory, TimeZoneUtilsTest, TestJoin, CurrencyFieldTest, TestSearchPerf, TestWriterPerf, TestLMJelinekMercerSimilarityFactory, TestSolrQueryParser, TestRemoteStreaming, TestPluginEnable, TestDistributedGrouping, TestStressVersions, EchoParamsTest, TestReversedWildcardFilterFactory, SuggesterFSTTest, ClusterStateUpdateTest, TestSort, CacheHeaderTest, PolyFieldTest, FieldMutatingUpdateProcessorTest, NotRequiredUniqueKeyTest, TestMergePolicyConfig, RequestHandlersTest, TestQuerySenderNoQuery, CircularListTest, TestFoldingMultitermQuery, DisMaxRequestHandlerTest, TestSolrDeletionPolicy1, DirectUpdateHandlerTest, DistributedQueryElevationComponentTest, ShowFileRequestHandlerTest, FieldAnalysisRequestHandlerTest, SimpleFacetsTest, TestCodecSupport, TestIndexingPerformance, MoreLikeThisHandlerTest, ConvertedLegacyTest, TestValueSourceCache, HighlighterTest, SuggesterTest]
[junit4:junit4] Completed in 1.64s, 4 tests, 1 error <<< FAILURES!

[...truncated 371 lines...]
BUILD FAILED
C:\Jenkins\workspace\Lucene-Solr-4.x-Windows\build.xml:29: The following error occurred while executing this line:
C:\Jenkins\workspace\Lucene-Solr-4.x-Windows\solr\build.xml:144: The following error occurred while executing this line:
C:\Jenkins\workspace\Lucene-Solr-4.x-Windows\lucene\module-build.xml:62: The following error occurred while executing this line:
C:\Jenkins\workspace\Lucene-Solr-4.x-Windows\lucene\common-build.xml:1105: The following error occurred while executing this line:
C:\Jenkins\workspace\Lucene-Solr-4.x-Windows\lucene\common-build.xml:797: There were test failures: 227 suites, 908 tests, 1 error, 11 ignored (6 assumptions)

Total time: 33 minutes 51 seconds
Build step 'Invoke Ant' marked build as failure
Recording test results
Description set: Java: 64bit/jdk1.7.0_06 -XX:+UseSerialGC
Email was triggered for: Failure
Sending email for trigger: Failure



Mime
View raw message