lucene-dev mailing list archives

Site index · List index
Message view « Date » · « Thread »
Top « Date » · « Thread »
From Apache Jenkins Server <jenk...@builds.apache.org>
Subject [JENKINS] Lucene-Solr-Tests-trunk-Java6 - Build # 15151 - Failure
Date Thu, 30 Aug 2012 16:21:26 GMT
Build: https://builds.apache.org/job/Lucene-Solr-Tests-trunk-Java6/15151/

3 tests failed.
REGRESSION:  org.apache.solr.cloud.BasicDistributedZkTest.testDistribSearch

Error Message:


Stack Trace:
java.lang.RuntimeException
	at org.apache.solr.common.cloud.SolrZkClient.<init>(SolrZkClient.java:156)
	at org.apache.solr.common.cloud.SolrZkClient.<init>(SolrZkClient.java:104)
	at org.apache.solr.common.cloud.SolrZkClient.<init>(SolrZkClient.java:86)
	at org.apache.solr.cloud.AbstractZkTestCase.buildZooKeeper(AbstractZkTestCase.java:90)
	at org.apache.solr.cloud.AbstractZkTestCase.buildZooKeeper(AbstractZkTestCase.java:84)
	at org.apache.solr.cloud.AbstractDistribZkTestBase.setUp(AbstractDistribZkTestBase.java:68)
	at sun.reflect.NativeMethodAccessorImpl.invoke0(Native Method)
	at sun.reflect.NativeMethodAccessorImpl.invoke(NativeMethodAccessorImpl.java:57)
	at sun.reflect.DelegatingMethodAccessorImpl.invoke(DelegatingMethodAccessorImpl.java:43)
	at java.lang.reflect.Method.invoke(Method.java:616)
	at com.carrotsearch.randomizedtesting.RandomizedRunner.invoke(RandomizedRunner.java:1559)
	at com.carrotsearch.randomizedtesting.RandomizedRunner.access$600(RandomizedRunner.java:79)
	at com.carrotsearch.randomizedtesting.RandomizedRunner$7.evaluate(RandomizedRunner.java:771)
	at com.carrotsearch.randomizedtesting.RandomizedRunner$8.evaluate(RandomizedRunner.java:787)
	at com.carrotsearch.randomizedtesting.rules.SystemPropertiesRestoreRule$1.evaluate(SystemPropertiesRestoreRule.java:53)
	at org.apache.lucene.util.TestRuleSetupTeardownChained$1.evaluate(TestRuleSetupTeardownChained.java:50)
	at org.apache.lucene.util.TestRuleFieldCacheSanity$1.evaluate(TestRuleFieldCacheSanity.java:51)
	at org.apache.lucene.util.AbstractBeforeAfterRule$1.evaluate(AbstractBeforeAfterRule.java:45)
	at com.carrotsearch.randomizedtesting.rules.SystemPropertiesInvariantRule$1.evaluate(SystemPropertiesInvariantRule.java:55)
	at org.apache.lucene.util.TestRuleThreadAndTestName$1.evaluate(TestRuleThreadAndTestName.java:48)
	at org.apache.lucene.util.TestRuleIgnoreAfterMaxFailures$1.evaluate(TestRuleIgnoreAfterMaxFailures.java:70)
	at org.apache.lucene.util.TestRuleMarkFailure$1.evaluate(TestRuleMarkFailure.java:48)
	at com.carrotsearch.randomizedtesting.rules.StatementAdapter.evaluate(StatementAdapter.java:36)
	at com.carrotsearch.randomizedtesting.ThreadLeakControl$StatementRunner.run(ThreadLeakControl.java:345)
	at com.carrotsearch.randomizedtesting.ThreadLeakControl.forkTimeoutingTask(ThreadLeakControl.java:769)
	at com.carrotsearch.randomizedtesting.ThreadLeakControl$3.evaluate(ThreadLeakControl.java:429)
	at com.carrotsearch.randomizedtesting.RandomizedRunner.runSingleTest(RandomizedRunner.java:746)
	at com.carrotsearch.randomizedtesting.RandomizedRunner$3.evaluate(RandomizedRunner.java:648)
	at com.carrotsearch.randomizedtesting.RandomizedRunner$4.evaluate(RandomizedRunner.java:682)
	at com.carrotsearch.randomizedtesting.RandomizedRunner$5.evaluate(RandomizedRunner.java:693)
	at com.carrotsearch.randomizedtesting.rules.StatementAdapter.evaluate(StatementAdapter.java:36)
	at com.carrotsearch.randomizedtesting.rules.SystemPropertiesRestoreRule$1.evaluate(SystemPropertiesRestoreRule.java:53)
	at org.apache.lucene.util.AbstractBeforeAfterRule$1.evaluate(AbstractBeforeAfterRule.java:45)
	at org.apache.lucene.util.TestRuleStoreClassName$1.evaluate(TestRuleStoreClassName.java:42)
	at com.carrotsearch.randomizedtesting.rules.SystemPropertiesInvariantRule$1.evaluate(SystemPropertiesInvariantRule.java:55)
	at com.carrotsearch.randomizedtesting.rules.NoShadowingOrOverridesOnMethodsRule$1.evaluate(NoShadowingOrOverridesOnMethodsRule.java:39)
	at com.carrotsearch.randomizedtesting.rules.NoShadowingOrOverridesOnMethodsRule$1.evaluate(NoShadowingOrOverridesOnMethodsRule.java:39)
	at org.apache.lucene.util.TestRuleAssertionsRequired$1.evaluate(TestRuleAssertionsRequired.java:40)
	at org.apache.lucene.util.TestRuleMarkFailure$1.evaluate(TestRuleMarkFailure.java:48)
	at org.apache.lucene.util.TestRuleIgnoreAfterMaxFailures$1.evaluate(TestRuleIgnoreAfterMaxFailures.java:70)
	at org.apache.lucene.util.TestRuleIgnoreTestSuites$1.evaluate(TestRuleIgnoreTestSuites.java:55)
	at com.carrotsearch.randomizedtesting.rules.StatementAdapter.evaluate(StatementAdapter.java:36)
	at com.carrotsearch.randomizedtesting.ThreadLeakControl$StatementRunner.run(ThreadLeakControl.java:345)
	at java.lang.Thread.run(Thread.java:679)


FAILED:  junit.framework.TestSuite.org.apache.solr.cloud.BasicDistributedZkTest

Error Message:
2 threads leaked from SUITE scope at org.apache.solr.cloud.BasicDistributedZkTest:     1) Thread[id=261, name=TEST-BasicDistributedZkTest.testDistribSearch-seed#[3EFF6AEF71FE5FAD]-SendThread(localhost:48357), state=TIMED_WAITING, group=TGRP-BasicDistributedZkTest]         at java.lang.Thread.sleep(Native Method)         at org.apache.zookeeper.ClientCnxn$SendThread.startConnect(ClientCnxn.java:1045)         at org.apache.zookeeper.ClientCnxn$SendThread.run(ClientCnxn.java:1101)    2) Thread[id=262, name=TEST-BasicDistributedZkTest.testDistribSearch-seed#[3EFF6AEF71FE5FAD]-EventThread, state=WAITING, group=TGRP-BasicDistributedZkTest]         at sun.misc.Unsafe.park(Native Method)         at java.util.concurrent.locks.LockSupport.park(LockSupport.java:186)         at java.util.concurrent.locks.AbstractQueuedSynchronizer$ConditionObject.await(AbstractQueuedSynchronizer.java:2043)         at java.util.concurrent.LinkedBlockingQueue.take(LinkedBlockingQueue.java:386)         at org.apache.zookeeper.ClientCnxn$EventThread.run(ClientCnxn.java:498)

Stack Trace:
com.carrotsearch.randomizedtesting.ThreadLeakError: 2 threads leaked from SUITE scope at org.apache.solr.cloud.BasicDistributedZkTest: 
   1) Thread[id=261, name=TEST-BasicDistributedZkTest.testDistribSearch-seed#[3EFF6AEF71FE5FAD]-SendThread(localhost:48357), state=TIMED_WAITING, group=TGRP-BasicDistributedZkTest]
        at java.lang.Thread.sleep(Native Method)
        at org.apache.zookeeper.ClientCnxn$SendThread.startConnect(ClientCnxn.java:1045)
        at org.apache.zookeeper.ClientCnxn$SendThread.run(ClientCnxn.java:1101)
   2) Thread[id=262, name=TEST-BasicDistributedZkTest.testDistribSearch-seed#[3EFF6AEF71FE5FAD]-EventThread, state=WAITING, group=TGRP-BasicDistributedZkTest]
        at sun.misc.Unsafe.park(Native Method)
        at java.util.concurrent.locks.LockSupport.park(LockSupport.java:186)
        at java.util.concurrent.locks.AbstractQueuedSynchronizer$ConditionObject.await(AbstractQueuedSynchronizer.java:2043)
        at java.util.concurrent.LinkedBlockingQueue.take(LinkedBlockingQueue.java:386)
        at org.apache.zookeeper.ClientCnxn$EventThread.run(ClientCnxn.java:498)
	at __randomizedtesting.SeedInfo.seed([3EFF6AEF71FE5FAD]:0)


FAILED:  junit.framework.TestSuite.org.apache.solr.cloud.BasicDistributedZkTest

Error Message:
There are still zombie threads that couldn't be terminated:    1) Thread[id=261, name=TEST-BasicDistributedZkTest.testDistribSearch-seed#[3EFF6AEF71FE5FAD]-SendThread(localhost:48357), state=RUNNABLE, group=TGRP-BasicDistributedZkTest]         at sun.nio.ch.KqueueArrayWrapper.interrupt(Native Method)         at sun.nio.ch.KqueueArrayWrapper.interrupt(KqueueArrayWrapper.java:206)         at sun.nio.ch.KqueueSelectorImpl.wakeup(KqueueSelectorImpl.java:194)         at java.nio.channels.spi.AbstractSelector$1.interrupt(AbstractSelector.java:210)         at java.nio.channels.spi.AbstractSelector.begin(AbstractSelector.java:215)         at sun.nio.ch.KqueueSelectorImpl.doSelect(KqueueSelectorImpl.java:68)         at sun.nio.ch.SelectorImpl.lockAndDoSelect(SelectorImpl.java:87)         at sun.nio.ch.SelectorImpl.select(SelectorImpl.java:98)         at org.apache.zookeeper.ClientCnxn$SendThread.run(ClientCnxn.java:1131)

Stack Trace:
com.carrotsearch.randomizedtesting.ThreadLeakError: There are still zombie threads that couldn't be terminated:
   1) Thread[id=261, name=TEST-BasicDistributedZkTest.testDistribSearch-seed#[3EFF6AEF71FE5FAD]-SendThread(localhost:48357), state=RUNNABLE, group=TGRP-BasicDistributedZkTest]
        at sun.nio.ch.KqueueArrayWrapper.interrupt(Native Method)
        at sun.nio.ch.KqueueArrayWrapper.interrupt(KqueueArrayWrapper.java:206)
        at sun.nio.ch.KqueueSelectorImpl.wakeup(KqueueSelectorImpl.java:194)
        at java.nio.channels.spi.AbstractSelector$1.interrupt(AbstractSelector.java:210)
        at java.nio.channels.spi.AbstractSelector.begin(AbstractSelector.java:215)
        at sun.nio.ch.KqueueSelectorImpl.doSelect(KqueueSelectorImpl.java:68)
        at sun.nio.ch.SelectorImpl.lockAndDoSelect(SelectorImpl.java:87)
        at sun.nio.ch.SelectorImpl.select(SelectorImpl.java:98)
        at org.apache.zookeeper.ClientCnxn$SendThread.run(ClientCnxn.java:1131)
	at __randomizedtesting.SeedInfo.seed([3EFF6AEF71FE5FAD]:0)




Build Log:
[...truncated 6066 lines...]
[junit4:junit4] Suite: org.apache.solr.cloud.BasicDistributedZkTest
[junit4:junit4]   2> 5 T255 oas.SolrTestCaseJ4.setUp ###Starting testDistribSearch
[junit4:junit4]   2> Creating dataDir: /usr/home/hudson/hudson-slave/workspace/Lucene-Solr-Tests-trunk-Java6/solr/build/solr-core/test/J0/./solrtest-BasicDistributedZkTest-1346343594218
[junit4:junit4]   2> 11 T255 oasc.ZkTestServer.run STARTING ZK TEST SERVER
[junit4:junit4]   2> 80 T256 oaz.Environment.logEnv Server environment:zookeeper.version=3.3.6-1366786, built on 07/29/2012 06:22 GMT
[junit4:junit4]   2> 81 T256 oaz.Environment.logEnv Server environment:host.name=lucene.zones.apache.org
[junit4:junit4]   2> 81 T256 oaz.Environment.logEnv Server environment:java.version=1.6.0_32
[junit4:junit4]   2> 81 T256 oaz.Environment.logEnv Server environment:java.vendor=Sun Microsystems Inc.
[junit4:junit4]   2> 81 T256 oaz.Environment.logEnv Server environment:java.home=/usr/local/openjdk6/jre
[junit4:junit4]   2> 81 T256 oaz.Environment.logEnv Server environment:java.class.path=/usr/home/hudson/hudson-slave/workspace/Lucene-Solr-Tests-trunk-Java6/solr/build/solr-core/classes/test:/usr/home/hudson/hudson-slave/workspace/Lucene-Solr-Tests-trunk-Java6/solr/build/solr-test-framework/classes/java:/usr/home/hudson/hudson-slave/workspace/Lucene-Solr-Tests-trunk-Java6/solr/build/solr-core/test-files:/usr/home/hudson/hudson-slave/workspace/Lucene-Solr-Tests-trunk-Java6/lucene/build/test-framework/classes/java:/usr/home/hudson/hudson-slave/workspace/Lucene-Solr-Tests-trunk-Java6/solr/build/solr-solrj/classes/java:/usr/home/hudson/hudson-slave/workspace/Lucene-Solr-Tests-trunk-Java6/solr/build/solr-core/classes/java:/usr/home/hudson/hudson-slave/workspace/Lucene-Solr-Tests-trunk-Java6/lucene/build/analysis/common/lucene-analyzers-common-5.0-SNAPSHOT.jar:/usr/home/hudson/hudson-slave/workspace/Lucene-Solr-Tests-trunk-Java6/lucene/build/analysis/kuromoji/lucene-analyzers-kuromoji-5.0-SNAPSHOT.jar:/usr/home/hudson/hudson-slave/workspace/Lucene-Solr-Tests-trunk-Java6/lucene/build/analysis/phonetic/lucene-analyzers-phonetic-5.0-SNAPSHOT.jar:/usr/home/hudson/hudson-slave/workspace/Lucene-Solr-Tests-trunk-Java6/lucene/build/highlighter/lucene-highlighter-5.0-SNAPSHOT.jar:/usr/home/hudson/hudson-slave/workspace/Lucene-Solr-Tests-trunk-Java6/lucene/build/memory/lucene-memory-5.0-SNAPSHOT.jar:/usr/home/hudson/hudson-slave/workspace/Lucene-Solr-Tests-trunk-Java6/lucene/build/misc/lucene-misc-5.0-SNAPSHOT.jar:/usr/home/hudson/hudson-slave/workspace/Lucene-Solr-Tests-trunk-Java6/lucene/build/spatial/lucene-spatial-5.0-SNAPSHOT.jar:/usr/home/hudson/hudson-slave/workspace/Lucene-Solr-Tests-trunk-Java6/lucene/build/suggest/lucene-suggest-5.0-SNAPSHOT.jar:/usr/home/hudson/hudson-slave/workspace/Lucene-Solr-Tests-trunk-Java6/lucene/build/grouping/lucene-grouping-5.0-SNAPSHOT.jar:/usr/home/hudson/hudson-slave/workspace/Lucene-Solr-Tests-trunk-Java6/lucene/build/queries/lucene-queries-5.0-SNAPSHOT.jar:/usr/home/hudson/hudson-slave/workspace/Lucene-Solr-Tests-trunk-Java6/lucene/build/queryparser/lucene-queryparser-5.0-SNAPSHOT.jar:/usr/home/hudson/hudson-slave/workspace/Lucene-Solr-Tests-trunk-Java6/solr/lib/commons-cli-1.2.jar:/usr/home/hudson/hudson-slave/workspace/Lucene-Solr-Tests-trunk-Java6/solr/lib/commons-codec-1.6.jar:/usr/home/hudson/hudson-slave/workspace/Lucene-Solr-Tests-trunk-Java6/solr/lib/commons-fileupload-1.2.1.jar:/usr/home/hudson/hudson-slave/workspace/Lucene-Solr-Tests-trunk-Java6/solr/lib/commons-io-2.1.jar:/usr/home/hudson/hudson-slave/workspace/Lucene-Solr-Tests-trunk-Java6/solr/lib/commons-lang-2.6.jar:/usr/home/hudson/hudson-slave/workspace/Lucene-Solr-Tests-trunk-Java6/solr/lib/easymock-2.2.jar:/usr/home/hudson/hudson-slave/workspace/Lucene-Solr-Tests-trunk-Java6/solr/lib/guava-r05.jar:/usr/home/hudson/hudson-slave/workspace/Lucene-Solr-Tests-trunk-Java6/solr/lib/httpclient-4.1.3.jar:/usr/home/hudson/hudson-slave/workspace/Lucene-Solr-Tests-trunk-Java6/solr/lib/httpcore-4.1.4.jar:/usr/home/hudson/hudson-slave/workspace/Lucene-Solr-Tests-trunk-Java6/solr/lib/httpmime-4.1.3.jar:/usr/home/hudson/hudson-slave/workspace/Lucene-Solr-Tests-trunk-Java6/solr/lib/javax.servlet-api-3.0.1.jar:/usr/home/hudson/hudson-slave/workspace/Lucene-Solr-Tests-trunk-Java6/solr/lib/jcl-over-slf4j-1.6.4.jar:/usr/home/hudson/hudson-slave/workspace/Lucene-Solr-Tests-trunk-Java6/solr/lib/log4j-over-slf4j-1.6.4.jar:/usr/home/hudson/hudson-slave/workspace/Lucene-Solr-Tests-trunk-Java6/solr/lib/slf4j-api-1.6.4.jar:/usr/home/hudson/hudson-slave/workspace/Lucene-Solr-Tests-trunk-Java6/solr/lib/slf4j-jdk14-1.6.4.jar:/usr/home/hudson/hudson-slave/workspace/Lucene-Solr-Tests-trunk-Java6/solr/lib/spatial4j-0.2.jar:/usr/home/hudson/hudson-slave/workspace/Lucene-Solr-Tests-trunk-Java6/solr/lib/wstx-asl-3.2.7.jar:/usr/home/hudson/hudson-slave/workspace/Lucene-Solr-Tests-trunk-Java6/solr/lib/zookeeper-3.3.6.jar:/usr/home/hudson/hudson-slave/workspace/Lucene-Solr-Tests-trunk-Java6/solr/example/lib/jetty-continuation-8.1.2.v20120308.jar:/usr/home/hudson/hudson-slave/workspace/Lucene-Solr-Tests-trunk-Java6/solr/example/lib/jetty-deploy-8.1.2.v20120308.jar:/usr/home/hudson/hudson-slave/workspace/Lucene-Solr-Tests-trunk-Java6/solr/example/lib/jetty-http-8.1.2.v20120308.jar:/usr/home/hudson/hudson-slave/workspace/Lucene-Solr-Tests-trunk-Java6/solr/example/lib/jetty-io-8.1.2.v20120308.jar:/usr/home/hudson/hudson-slave/workspace/Lucene-Solr-Tests-trunk-Java6/solr/example/lib/jetty-jmx-8.1.2.v20120308.jar:/usr/home/hudson/hudson-slave/workspace/Lucene-Solr-Tests-trunk-Java6/solr/example/lib/jetty-security-8.1.2.v20120308.jar:/usr/home/hudson/hudson-slave/workspace/Lucene-Solr-Tests-trunk-Java6/solr/example/lib/jetty-server-8.1.2.v20120308.jar:/usr/home/hudson/hudson-slave/workspace/Lucene-Solr-Tests-trunk-Java6/solr/example/lib/jetty-servlet-8.1.2.v20120308.jar:/usr/home/hudson/hudson-slave/workspace/Lucene-Solr-Tests-trunk-Java6/solr/example/lib/jetty-util-8.1.2.v20120308.jar:/usr/home/hudson/hudson-slave/workspace/Lucene-Solr-Tests-trunk-Java6/solr/example/lib/jetty-webapp-8.1.2.v20120308.jar:/usr/home/hudson/hudson-slave/workspace/Lucene-Solr-Tests-trunk-Java6/solr/example/lib/jetty-xml-8.1.2.v20120308.jar:/usr/home/hudson/hudson-slave/workspace/Lucene-Solr-Tests-trunk-Java6/solr/example/lib/servlet-api-3.0.jar:/usr/home/hudson/hudson-slave/workspace/Lucene-Solr-Tests-trunk-Java6/solr/example/example-DIH/solr/db/lib/hsqldb-1.8.0.10.jar:/usr/home/hudson/hudson-slave/workspace/Lucene-Solr-Tests-trunk-Java6/lucene/build/core/classes/java:/usr/home/hudson/hudson-slave/workspace/Lucene-Solr-Tests-trunk-Java6/lucene/test-framework/lib/junit-4.10.jar:/usr/home/hudson/hudson-slave/workspace/Lucene-Solr-Tests-trunk-Java6/lucene/test-framework/lib/randomizedtesting-runner-2.0.0.rc5.jar:/home/hudson/hudson-slave/tools/Ant/ant-1.8.2/lib/ant-launcher.jar:/home/hudson/.ant/lib/ivy-2.2.0.jar:/home/hudson/hudson-slave/tools/Ant/ant-1.8.2/lib/ant-apache-regexp.jar:/home/hudson/hudson-slave/tools/Ant/ant-1.8.2/lib/ant-junit.jar:/home/hudson/hudson-slave/tools/Ant/ant-1.8.2/lib/ant-apache-bsf.jar:/home/hudson/hudson-slave/tools/Ant/ant-1.8.2/lib/ant-commons-net.jar:/home/hudson/hudson-slave/tools/Ant/ant-1.8.2/lib/ant-antlr.jar:/home/hudson/hudson-slave/tools/Ant/ant-1.8.2/lib/ant-apache-log4j.jar:/home/hudson/hudson-slave/tools/Ant/ant-1.8.2/lib/ant-commons-logging.jar:/home/hudson/hudson-slave/tools/Ant/ant-1.8.2/lib/ant-apache-xalan2.jar:/home/hudson/hudson-slave/tools/Ant/ant-1.8.2/lib/ant-apache-oro.jar:/home/hudson/hudson-slave/tools/Ant/ant-1.8.2/lib/ant-junit4.jar:/home/hudson/hudson-slave/tools/Ant/ant-1.8.2/lib/ant-netrexx.jar:/home/hudson/hudson-slave/tools/Ant/ant-1.8.2/lib/ant-swing.jar:/home/hudson/hudson-slave/tools/Ant/ant-1.8.2/lib/ant-javamail.jar:/home/hudson/hudson-slave/tools/Ant/ant-1.8.2/lib/ant-jsch.jar:/home/hudson/hudson-slave/tools/Ant/ant-1.8.2/lib/ant-jmf.jar:/home/hudson/hudson-slave/tools/Ant/ant-1.8.2/lib/ant.jar:/home/hudson/hudson-slave/tools/Ant/ant-1.8.2/lib/ant-apache-bcel.jar:/home/hudson/hudson-slave/tools/Ant/ant-1.8.2/lib/ant-jai.jar:/home/hudson/hudson-slave/tools/Ant/ant-1.8.2/lib/ant-testutil.jar:/home/hudson/hudson-slave/tools/Ant/ant-1.8.2/lib/ant-apache-resolver.jar:/home/hudson/hudson-slave/tools/Ant/ant-1.8.2/lib/ant-jdepend.jar:/usr/local/openjdk6/lib/tools.jar:/home/hudson/.ivy2/cache/com.carrotsearch.randomizedtesting/junit4-ant/jars/junit4-ant-2.0.0.rc5.jar
[junit4:junit4]   2> 82 T256 oaz.Environment.logEnv Server environment:java.library.path=/usr/local/openjdk6/jre/lib/amd64/server:/usr/local/openjdk6/jre/lib/amd64:/usr/local/openjdk6/jre/../lib/amd64:/usr/java/packages/lib/amd64:/lib:/usr/lib:/usr/local/lib
[junit4:junit4]   2> 82 T256 oaz.Environment.logEnv Server environment:java.io.tmpdir=.
[junit4:junit4]   2> 82 T256 oaz.Environment.logEnv Server environment:java.compiler=<NA>
[junit4:junit4]   2> 82 T256 oaz.Environment.logEnv Server environment:os.name=FreeBSD
[junit4:junit4]   2> 82 T256 oaz.Environment.logEnv Server environment:os.arch=amd64
[junit4:junit4]   2> 83 T256 oaz.Environment.logEnv Server environment:os.version=9.0-RELEASE
[junit4:junit4]   2> 83 T256 oaz.Environment.logEnv Server environment:user.name=hudson
[junit4:junit4]   2> 83 T256 oaz.Environment.logEnv Server environment:user.home=/home/hudson
[junit4:junit4]   2> 83 T256 oaz.Environment.logEnv Server environment:user.dir=/usr/home/hudson/hudson-slave/workspace/Lucene-Solr-Tests-trunk-Java6/solr/build/solr-core/test/J0
[junit4:junit4]   2> 112 T256 oazs.ZooKeeperServer.setTickTime tickTime set to 3000
[junit4:junit4]   2> 139 T256 oazs.NIOServerCnxn$Factory.<init> binding to port 0.0.0.0/0.0.0.0:0
[junit4:junit4]   2> 186 T256 oazsp.FileTxnSnapLog.save Snapshotting: 0
[junit4:junit4]   2> 218 T255 oasc.ZkTestServer.run start zk server on port:48357
[junit4:junit4]   2> 293 T255 oaz.Environment.logEnv Client environment:zookeeper.version=3.3.6-1366786, built on 07/29/2012 06:22 GMT
[junit4:junit4]   2> 293 T255 oaz.Environment.logEnv Client environment:host.name=lucene.zones.apache.org
[junit4:junit4]   2> 293 T255 oaz.Environment.logEnv Client environment:java.version=1.6.0_32
[junit4:junit4]   2> 294 T255 oaz.Environment.logEnv Client environment:java.vendor=Sun Microsystems Inc.
[junit4:junit4]   2> 294 T255 oaz.Environment.logEnv Client environment:java.home=/usr/local/openjdk6/jre
[junit4:junit4]   2> 294 T255 oaz.Environment.logEnv Client environment:java.class.path=/usr/home/hudson/hudson-slave/workspace/Lucene-Solr-Tests-trunk-Java6/solr/build/solr-core/classes/test:/usr/home/hudson/hudson-slave/workspace/Lucene-Solr-Tests-trunk-Java6/solr/build/solr-test-framework/classes/java:/usr/home/hudson/hudson-slave/workspace/Lucene-Solr-Tests-trunk-Java6/solr/build/solr-core/test-files:/usr/home/hudson/hudson-slave/workspace/Lucene-Solr-Tests-trunk-Java6/lucene/build/test-framework/classes/java:/usr/home/hudson/hudson-slave/workspace/Lucene-Solr-Tests-trunk-Java6/solr/build/solr-solrj/classes/java:/usr/home/hudson/hudson-slave/workspace/Lucene-Solr-Tests-trunk-Java6/solr/build/solr-core/classes/java:/usr/home/hudson/hudson-slave/workspace/Lucene-Solr-Tests-trunk-Java6/lucene/build/analysis/common/lucene-analyzers-common-5.0-SNAPSHOT.jar:/usr/home/hudson/hudson-slave/workspace/Lucene-Solr-Tests-trunk-Java6/lucene/build/analysis/kuromoji/lucene-analyzers-kuromoji-5.0-SNAPSHOT.jar:/usr/home/hudson/hudson-slave/workspace/Lucene-Solr-Tests-trunk-Java6/lucene/build/analysis/phonetic/lucene-analyzers-phonetic-5.0-SNAPSHOT.jar:/usr/home/hudson/hudson-slave/workspace/Lucene-Solr-Tests-trunk-Java6/lucene/build/highlighter/lucene-highlighter-5.0-SNAPSHOT.jar:/usr/home/hudson/hudson-slave/workspace/Lucene-Solr-Tests-trunk-Java6/lucene/build/memory/lucene-memory-5.0-SNAPSHOT.jar:/usr/home/hudson/hudson-slave/workspace/Lucene-Solr-Tests-trunk-Java6/lucene/build/misc/lucene-misc-5.0-SNAPSHOT.jar:/usr/home/hudson/hudson-slave/workspace/Lucene-Solr-Tests-trunk-Java6/lucene/build/spatial/lucene-spatial-5.0-SNAPSHOT.jar:/usr/home/hudson/hudson-slave/workspace/Lucene-Solr-Tests-trunk-Java6/lucene/build/suggest/lucene-suggest-5.0-SNAPSHOT.jar:/usr/home/hudson/hudson-slave/workspace/Lucene-Solr-Tests-trunk-Java6/lucene/build/grouping/lucene-grouping-5.0-SNAPSHOT.jar:/usr/home/hudson/hudson-slave/workspace/Lucene-Solr-Tests-trunk-Java6/lucene/build/queries/lucene-queries-5.0-SNAPSHOT.jar:/usr/home/hudson/hudson-slave/workspace/Lucene-Solr-Tests-trunk-Java6/lucene/build/queryparser/lucene-queryparser-5.0-SNAPSHOT.jar:/usr/home/hudson/hudson-slave/workspace/Lucene-Solr-Tests-trunk-Java6/solr/lib/commons-cli-1.2.jar:/usr/home/hudson/hudson-slave/workspace/Lucene-Solr-Tests-trunk-Java6/solr/lib/commons-codec-1.6.jar:/usr/home/hudson/hudson-slave/workspace/Lucene-Solr-Tests-trunk-Java6/solr/lib/commons-fileupload-1.2.1.jar:/usr/home/hudson/hudson-slave/workspace/Lucene-Solr-Tests-trunk-Java6/solr/lib/commons-io-2.1.jar:/usr/home/hudson/hudson-slave/workspace/Lucene-Solr-Tests-trunk-Java6/solr/lib/commons-lang-2.6.jar:/usr/home/hudson/hudson-slave/workspace/Lucene-Solr-Tests-trunk-Java6/solr/lib/easymock-2.2.jar:/usr/home/hudson/hudson-slave/workspace/Lucene-Solr-Tests-trunk-Java6/solr/lib/guava-r05.jar:/usr/home/hudson/hudson-slave/workspace/Lucene-Solr-Tests-trunk-Java6/solr/lib/httpclient-4.1.3.jar:/usr/home/hudson/hudson-slave/workspace/Lucene-Solr-Tests-trunk-Java6/solr/lib/httpcore-4.1.4.jar:/usr/home/hudson/hudson-slave/workspace/Lucene-Solr-Tests-trunk-Java6/solr/lib/httpmime-4.1.3.jar:/usr/home/hudson/hudson-slave/workspace/Lucene-Solr-Tests-trunk-Java6/solr/lib/javax.servlet-api-3.0.1.jar:/usr/home/hudson/hudson-slave/workspace/Lucene-Solr-Tests-trunk-Java6/solr/lib/jcl-over-slf4j-1.6.4.jar:/usr/home/hudson/hudson-slave/workspace/Lucene-Solr-Tests-trunk-Java6/solr/lib/log4j-over-slf4j-1.6.4.jar:/usr/home/hudson/hudson-slave/workspace/Lucene-Solr-Tests-trunk-Java6/solr/lib/slf4j-api-1.6.4.jar:/usr/home/hudson/hudson-slave/workspace/Lucene-Solr-Tests-trunk-Java6/solr/lib/slf4j-jdk14-1.6.4.jar:/usr/home/hudson/hudson-slave/workspace/Lucene-Solr-Tests-trunk-Java6/solr/lib/spatial4j-0.2.jar:/usr/home/hudson/hudson-slave/workspace/Lucene-Solr-Tests-trunk-Java6/solr/lib/wstx-asl-3.2.7.jar:/usr/home/hudson/hudson-slave/workspace/Lucene-Solr-Tests-trunk-Java6/solr/lib/zookeeper-3.3.6.jar:/usr/home/hudson/hudson-slave/workspace/Lucene-Solr-Tests-trunk-Java6/solr/example/lib/jetty-continuation-8.1.2.v20120308.jar:/usr/home/hudson/hudson-slave/workspace/Lucene-Solr-Tests-trunk-Java6/solr/example/lib/jetty-deploy-8.1.2.v20120308.jar:/usr/home/hudson/hudson-slave/workspace/Lucene-Solr-Tests-trunk-Java6/solr/example/lib/jetty-http-8.1.2.v20120308.jar:/usr/home/hudson/hudson-slave/workspace/Lucene-Solr-Tests-trunk-Java6/solr/example/lib/jetty-io-8.1.2.v20120308.jar:/usr/home/hudson/hudson-slave/workspace/Lucene-Solr-Tests-trunk-Java6/solr/example/lib/jetty-jmx-8.1.2.v20120308.jar:/usr/home/hudson/hudson-slave/workspace/Lucene-Solr-Tests-trunk-Java6/solr/example/lib/jetty-security-8.1.2.v20120308.jar:/usr/home/hudson/hudson-slave/workspace/Lucene-Solr-Tests-trunk-Java6/solr/example/lib/jetty-server-8.1.2.v20120308.jar:/usr/home/hudson/hudson-slave/workspace/Lucene-Solr-Tests-trunk-Java6/solr/example/lib/jetty-servlet-8.1.2.v20120308.jar:/usr/home/hudson/hudson-slave/workspace/Lucene-Solr-Tests-trunk-Java6/solr/example/lib/jetty-util-8.1.2.v20120308.jar:/usr/home/hudson/hudson-slave/workspace/Lucene-Solr-Tests-trunk-Java6/solr/example/lib/jetty-webapp-8.1.2.v20120308.jar:/usr/home/hudson/hudson-slave/workspace/Lucene-Solr-Tests-trunk-Java6/solr/example/lib/jetty-xml-8.1.2.v20120308.jar:/usr/home/hudson/hudson-slave/workspace/Lucene-Solr-Tests-trunk-Java6/solr/example/lib/servlet-api-3.0.jar:/usr/home/hudson/hudson-slave/workspace/Lucene-Solr-Tests-trunk-Java6/solr/example/example-DIH/solr/db/lib/hsqldb-1.8.0.10.jar:/usr/home/hudson/hudson-slave/workspace/Lucene-Solr-Tests-trunk-Java6/lucene/build/core/classes/java:/usr/home/hudson/hudson-slave/workspace/Lucene-Solr-Tests-trunk-Java6/lucene/test-framework/lib/junit-4.10.jar:/usr/home/hudson/hudson-slave/workspace/Lucene-Solr-Tests-trunk-Java6/lucene/test-framework/lib/randomizedtesting-runner-2.0.0.rc5.jar:/home/hudson/hudson-slave/tools/Ant/ant-1.8.2/lib/ant-launcher.jar:/home/hudson/.ant/lib/ivy-2.2.0.jar:/home/hudson/hudson-slave/tools/Ant/ant-1.8.2/lib/ant-apache-regexp.jar:/home/hudson/hudson-slave/tools/Ant/ant-1.8.2/lib/ant-junit.jar:/home/hudson/hudson-slave/tools/Ant/ant-1.8.2/lib/ant-apache-bsf.jar:/home/hudson/hudson-slave/tools/Ant/ant-1.8.2/lib/ant-commons-net.jar:/home/hudson/hudson-slave/tools/Ant/ant-1.8.2/lib/ant-antlr.jar:/home/hudson/hudson-slave/tools/Ant/ant-1.8.2/lib/ant-apache-log4j.jar:/home/hudson/hudson-slave/tools/Ant/ant-1.8.2/lib/ant-commons-logging.jar:/home/hudson/hudson-slave/tools/Ant/ant-1.8.2/lib/ant-apache-xalan2.jar:/home/hudson/hudson-slave/tools/Ant/ant-1.8.2/lib/ant-apache-oro.jar:/home/hudson/hudson-slave/tools/Ant/ant-1.8.2/lib/ant-junit4.jar:/home/hudson/hudson-slave/tools/Ant/ant-1.8.2/lib/ant-netrexx.jar:/home/hudson/hudson-slave/tools/Ant/ant-1.8.2/lib/ant-swing.jar:/home/hudson/hudson-slave/tools/Ant/ant-1.8.2/lib/ant-javamail.jar:/home/hudson/hudson-slave/tools/Ant/ant-1.8.2/lib/ant-jsch.jar:/home/hudson/hudson-slave/tools/Ant/ant-1.8.2/lib/ant-jmf.jar:/home/hudson/hudson-slave/tools/Ant/ant-1.8.2/lib/ant.jar:/home/hudson/hudson-slave/tools/Ant/ant-1.8.2/lib/ant-apache-bcel.jar:/home/hudson/hudson-slave/tools/Ant/ant-1.8.2/lib/ant-jai.jar:/home/hudson/hudson-slave/tools/Ant/ant-1.8.2/lib/ant-testutil.jar:/home/hudson/hudson-slave/tools/Ant/ant-1.8.2/lib/ant-apache-resolver.jar:/home/hudson/hudson-slave/tools/Ant/ant-1.8.2/lib/ant-jdepend.jar:/usr/local/openjdk6/lib/tools.jar:/home/hudson/.ivy2/cache/com.carrotsearch.randomizedtesting/junit4-ant/jars/junit4-ant-2.0.0.rc5.jar
[junit4:junit4]   2> 295 T255 oaz.Environment.logEnv Client environment:java.library.path=/usr/local/openjdk6/jre/lib/amd64/server:/usr/local/openjdk6/jre/lib/amd64:/usr/local/openjdk6/jre/../lib/amd64:/usr/java/packages/lib/amd64:/lib:/usr/lib:/usr/local/lib
[junit4:junit4]   2> 295 T255 oaz.Environment.logEnv Client environment:java.io.tmpdir=.
[junit4:junit4]   2> 296 T255 oaz.Environment.logEnv Client environment:java.compiler=<NA>
[junit4:junit4]   2> 296 T255 oaz.Environment.logEnv Client environment:os.name=FreeBSD
[junit4:junit4]   2> 296 T255 oaz.Environment.logEnv Client environment:os.arch=amd64
[junit4:junit4]   2> 296 T255 oaz.Environment.logEnv Client environment:os.version=9.0-RELEASE
[junit4:junit4]   2> 297 T255 oaz.Environment.logEnv Client environment:user.name=hudson
[junit4:junit4]   2> 297 T255 oaz.Environment.logEnv Client environment:user.home=/home/hudson
[junit4:junit4]   2> 297 T255 oaz.Environment.logEnv Client environment:user.dir=/usr/home/hudson/hudson-slave/workspace/Lucene-Solr-Tests-trunk-Java6/solr/build/solr-core/test/J0
[junit4:junit4]   2> 302 T255 oaz.ZooKeeper.<init> Initiating client connection, connectString=127.0.0.1:48357 sessionTimeout=10000 watcher=org.apache.solr.common.cloud.ConnectionManager@2a811e2b
[junit4:junit4]   2> 333 T261 oaz.ClientCnxn$SendThread.startConnect Opening socket connection to server /127.0.0.1:48357
[junit4:junit4]   2> 337 T261 oaz.ClientCnxn$SendThread.primeConnection Socket connection established to localhost/127.0.0.1:48357, initiating session
[junit4:junit4]   2> 337 T257 oazs.NIOServerCnxn$Factory.run WARNING Ignoring unexpected runtime exception java.security.AccessControlException: access denied (java.net.SocketPermission 140.211.11.196:10516 accept,resolve)
[junit4:junit4]   2> 	at java.security.AccessControlContext.checkPermission(AccessControlContext.java:393)
[junit4:junit4]   2> 	at java.security.AccessController.checkPermission(AccessController.java:553)
[junit4:junit4]   2> 	at java.lang.SecurityManager.checkPermission(SecurityManager.java:549)
[junit4:junit4]   2> 	at java.lang.SecurityManager.checkAccept(SecurityManager.java:1174)
[junit4:junit4]   2> 	at sun.nio.ch.ServerSocketChannelImpl.accept(ServerSocketChannelImpl.java:183)
[junit4:junit4]   2> 	at org.apache.zookeeper.server.NIOServerCnxn$Factory.run(NIOServerCnxn.java:242)
[junit4:junit4]   2> 
[junit4:junit4]   2> 341 T261 oaz.ClientCnxn$SendThread.run Unable to read additional data from server sessionid 0x0, likely server has closed socket, closing socket connection and attempting reconnect
[junit4:junit4]   2> 1342 T257 oazs.NIOServerCnxn$Factory.run WARNING Ignoring unexpected runtime exception java.lang.NullPointerException
[junit4:junit4]   2> 	at org.apache.zookeeper.server.NIOServerCnxn$Factory.run(NIOServerCnxn.java:244)
[junit4:junit4]   2> 
[junit4:junit4]   2> 2343 T257 oazs.NIOServerCnxn$Factory.run WARNING Ignoring unexpected runtime exception java.lang.NullPointerException
[junit4:junit4]   2> 	at org.apache.zookeeper.server.NIOServerCnxn$Factory.run(NIOServerCnxn.java:244)
[junit4:junit4]   2> 
[junit4:junit4]   2> 2385 T261 oaz.ClientCnxn$SendThread.startConnect Opening socket connection to server localhost/127.0.0.1:48357
[junit4:junit4]   2> 2385 T261 oaz.ClientCnxn$SendThread.primeConnection Socket connection established to localhost/127.0.0.1:48357, initiating session
[junit4:junit4]   2> 2386 T257 oazs.NIOServerCnxn$Factory.run WARNING Ignoring unexpected runtime exception java.security.AccessControlException: access denied (java.net.SocketPermission 140.211.11.196:45241 accept,resolve)
[junit4:junit4]   2> 	at java.security.AccessControlContext.checkPermission(AccessControlContext.java:393)
[junit4:junit4]   2> 	at java.security.AccessController.checkPermission(AccessController.java:553)
[junit4:junit4]   2> 	at java.lang.SecurityManager.checkPermission(SecurityManager.java:549)
[junit4:junit4]   2> 	at java.lang.SecurityManager.checkAccept(SecurityManager.java:1174)
[junit4:junit4]   2> 	at sun.nio.ch.ServerSocketChannelImpl.accept(ServerSocketChannelImpl.java:183)
[junit4:junit4]   2> 	at org.apache.zookeeper.server.NIOServerCnxn$Factory.run(NIOServerCnxn.java:242)
[junit4:junit4]   2> 
[junit4:junit4]   2> 2386 T261 oaz.ClientCnxn$SendThread.run Unable to read additional data from server sessionid 0x0, likely server has closed socket, closing socket connection and attempting reconnect
[junit4:junit4]   2> 3387 T257 oazs.NIOServerCnxn$Factory.run WARNING Ignoring unexpected runtime exception java.lang.NullPointerException
[junit4:junit4]   2> 	at org.apache.zookeeper.server.NIOServerCnxn$Factory.run(NIOServerCnxn.java:244)
[junit4:junit4]   2> 
[junit4:junit4]   2> 4214 T261 oaz.ClientCnxn$SendThread.startConnect Opening socket connection to server localhost/127.0.0.1:48357
[junit4:junit4]   2> 4214 T261 oaz.ClientCnxn$SendThread.primeConnection Socket connection established to localhost/127.0.0.1:48357, initiating session
[junit4:junit4]   2> 4215 T257 oazs.NIOServerCnxn$Factory.run WARNING Ignoring unexpected runtime exception java.security.AccessControlException: access denied (java.net.SocketPermission 140.211.11.196:45248 accept,resolve)
[junit4:junit4]   2> 	at java.security.AccessControlContext.checkPermission(AccessControlContext.java:393)
[junit4:junit4]   2> 	at java.security.AccessController.checkPermission(AccessController.java:553)
[junit4:junit4]   2> 	at java.lang.SecurityManager.checkPermission(SecurityManager.java:549)
[junit4:junit4]   2> 	at java.lang.SecurityManager.checkAccept(SecurityManager.java:1174)
[junit4:junit4]   2> 	at sun.nio.ch.ServerSocketChannelImpl.accept(ServerSocketChannelImpl.java:183)
[junit4:junit4]   2> 	at org.apache.zookeeper.server.NIOServerCnxn$Factory.run(NIOServerCnxn.java:242)
[junit4:junit4]   2> 
[junit4:junit4]   2> 4215 T261 oaz.ClientCnxn$SendThread.run Unable to read additional data from server sessionid 0x0, likely server has closed socket, closing socket connection and attempting reconnect
[junit4:junit4]   2> 5216 T257 oazs.NIOServerCnxn$Factory.run WARNING Ignoring unexpected runtime exception java.lang.NullPointerException
[junit4:junit4]   2> 	at org.apache.zookeeper.server.NIOServerCnxn$Factory.run(NIOServerCnxn.java:244)
[junit4:junit4]   2> 
[junit4:junit4]   2> 5991 T261 oaz.ClientCnxn$SendThread.startConnect Opening socket connection to server localhost/127.0.0.1:48357
[junit4:junit4]   2> 5991 T261 oaz.ClientCnxn$SendThread.primeConnection Socket connection established to localhost/127.0.0.1:48357, initiating session
[junit4:junit4]   2> 5992 T257 oazs.NIOServerCnxn$Factory.run WARNING Ignoring unexpected runtime exception java.security.AccessControlException: access denied (java.net.SocketPermission 140.211.11.196:45253 accept,resolve)
[junit4:junit4]   2> 	at java.security.AccessControlContext.checkPermission(AccessControlContext.java:393)
[junit4:junit4]   2> 	at java.security.AccessController.checkPermission(AccessController.java:553)
[junit4:junit4]   2> 	at java.lang.SecurityManager.checkPermission(SecurityManager.java:549)
[junit4:junit4]   2> 	at java.lang.SecurityManager.checkAccept(SecurityManager.java:1174)
[junit4:junit4]   2> 	at sun.nio.ch.ServerSocketChannelImpl.accept(ServerSocketChannelImpl.java:183)
[junit4:junit4]   2> 	at org.apache.zookeeper.server.NIOServerCnxn$Factory.run(NIOServerCnxn.java:242)
[junit4:junit4]   2> 
[junit4:junit4]   2> 5992 T261 oaz.ClientCnxn$SendThread.run Unable to read additional data from server sessionid 0x0, likely server has closed socket, closing socket connection and attempting reconnect
[junit4:junit4]   2> 6993 T257 oazs.NIOServerCnxn$Factory.run WARNING Ignoring unexpected runtime exception java.lang.NullPointerException
[junit4:junit4]   2> 	at org.apache.zookeeper.server.NIOServerCnxn$Factory.run(NIOServerCnxn.java:244)
[junit4:junit4]   2> 
[junit4:junit4]   2> 7771 T261 oaz.ClientCnxn$SendThread.startConnect Opening socket connection to server localhost/127.0.0.1:48357
[junit4:junit4]   2> 7771 T261 oaz.ClientCnxn$SendThread.primeConnection Socket connection established to localhost/127.0.0.1:48357, initiating session
[junit4:junit4]   2> 7772 T257 oazs.NIOServerCnxn$Factory.run WARNING Ignoring unexpected runtime exception java.security.AccessControlException: access denied (java.net.SocketPermission 140.211.11.196:45259 accept,resolve)
[junit4:junit4]   2> 	at java.security.AccessControlContext.checkPermission(AccessControlContext.java:393)
[junit4:junit4]   2> 	at java.security.AccessController.checkPermission(AccessController.java:553)
[junit4:junit4]   2> 	at java.lang.SecurityManager.checkPermission(SecurityManager.java:549)
[junit4:junit4]   2> 	at java.lang.SecurityManager.checkAccept(SecurityManager.java:1174)
[junit4:junit4]   2> 	at sun.nio.ch.ServerSocketChannelImpl.accept(ServerSocketChannelImpl.java:183)
[junit4:junit4]   2> 	at org.apache.zookeeper.server.NIOServerCnxn$Factory.run(NIOServerCnxn.java:242)
[junit4:junit4]   2> 
[junit4:junit4]   2> 7772 T261 oaz.ClientCnxn$SendThread.run Unable to read additional data from server sessionid 0x0, likely server has closed socket, closing socket connection and attempting reconnect
[junit4:junit4]   2> 8773 T257 oazs.NIOServerCnxn$Factory.run WARNING Ignoring unexpected runtime exception java.lang.NullPointerException
[junit4:junit4]   2> 	at org.apache.zookeeper.server.NIOServerCnxn$Factory.run(NIOServerCnxn.java:244)
[junit4:junit4]   2> 
[junit4:junit4]   2> 9739 T261 oaz.ClientCnxn$SendThread.startConnect Opening socket connection to server localhost/127.0.0.1:48357
[junit4:junit4]   2> 9739 T261 oaz.ClientCnxn$SendThread.primeConnection Socket connection established to localhost/127.0.0.1:48357, initiating session
[junit4:junit4]   2> 9740 T257 oazs.NIOServerCnxn$Factory.run WARNING Ignoring unexpected runtime exception java.security.AccessControlException: access denied (java.net.SocketPermission 140.211.11.196:45265 accept,resolve)
[junit4:junit4]   2> 	at java.security.AccessControlContext.checkPermission(AccessControlContext.java:393)
[junit4:junit4]   2> 	at java.security.AccessController.checkPermission(AccessController.java:553)
[junit4:junit4]   2> 	at java.lang.SecurityManager.checkPermission(SecurityManager.java:549)
[junit4:junit4]   2> 	at java.lang.SecurityManager.checkAccept(SecurityManager.java:1174)
[junit4:junit4]   2> 	at sun.nio.ch.ServerSocketChannelImpl.accept(ServerSocketChannelImpl.java:183)
[junit4:junit4]   2> 	at org.apache.zookeeper.server.NIOServerCnxn$Factory.run(NIOServerCnxn.java:242)
[junit4:junit4]   2> 
[junit4:junit4]   2> 9740 T261 oaz.ClientCnxn$SendThread.run Unable to read additional data from server sessionid 0x0, likely server has closed socket, closing socket connection and attempting reconnect
[junit4:junit4]   2> 10741 T257 oazs.NIOServerCnxn$Factory.run WARNING Ignoring unexpected runtime exception java.lang.NullPointerException
[junit4:junit4]   2> 	at org.apache.zookeeper.server.NIOServerCnxn$Factory.run(NIOServerCnxn.java:244)
[junit4:junit4]   2> 
[junit4:junit4]   2> 10889 T261 oaz.ClientCnxn$SendThread.startConnect Opening socket connection to server localhost/127.0.0.1:48357
[junit4:junit4]   2> 10889 T261 oaz.ClientCnxn$SendThread.primeConnection Socket connection established to localhost/127.0.0.1:48357, initiating session
[junit4:junit4]   2> 10890 T257 oazs.NIOServerCnxn$Factory.run WARNING Ignoring unexpected runtime exception java.security.AccessControlException: access denied (java.net.SocketPermission 140.211.11.196:45273 accept,resolve)
[junit4:junit4]   2> 	at java.security.AccessControlContext.checkPermission(AccessControlContext.java:393)
[junit4:junit4]   2> 	at java.security.AccessController.checkPermission(AccessController.java:553)
[junit4:junit4]   2> 	at java.lang.SecurityManager.checkPermission(SecurityManager.java:549)
[junit4:junit4]   2> 	at java.lang.SecurityManager.checkAccept(SecurityManager.java:1174)
[junit4:junit4]   2> 	at sun.nio.ch.ServerSocketChannelImpl.accept(ServerSocketChannelImpl.java:183)
[junit4:junit4]   2> 	at org.apache.zookeeper.server.NIOServerCnxn$Factory.run(NIOServerCnxn.java:242)
[junit4:junit4]   2> 
[junit4:junit4]   2> 10890 T261 oaz.ClientCnxn$SendThread.run Unable to read additional data from server sessionid 0x0, likely server has closed socket, closing socket connection and attempting reconnect
[junit4:junit4]   2> 11891 T257 oazs.NIOServerCnxn$Factory.run WARNING Ignoring unexpected runtime exception java.lang.NullPointerException
[junit4:junit4]   2> 	at org.apache.zookeeper.server.NIOServerCnxn$Factory.run(NIOServerCnxn.java:244)
[junit4:junit4]   2> 
[junit4:junit4]   2> 12318 T261 oaz.ClientCnxn$SendThread.startConnect Opening socket connection to server localhost/127.0.0.1:48357
[junit4:junit4]   2> 12318 T261 oaz.ClientCnxn$SendThread.primeConnection Socket connection established to localhost/127.0.0.1:48357, initiating session
[junit4:junit4]   2> 12319 T257 oazs.NIOServerCnxn$Factory.run WARNING Ignoring unexpected runtime exception java.security.AccessControlException: access denied (java.net.SocketPermission 140.211.11.196:45279 accept,resolve)
[junit4:junit4]   2> 	at java.security.AccessControlContext.checkPermission(AccessControlContext.java:393)
[junit4:junit4]   2> 	at java.security.AccessController.checkPermission(AccessController.java:553)
[junit4:junit4]   2> 	at java.lang.SecurityManager.checkPermission(SecurityManager.java:549)
[junit4:junit4]   2> 	at java.lang.SecurityManager.checkAccept(SecurityManager.java:1174)
[junit4:junit4]   2> 	at sun.nio.ch.ServerSocketChannelImpl.accept(ServerSocketChannelImpl.java:183)
[junit4:junit4]   2> 	at org.apache.zookeeper.server.NIOServerCnxn$Factory.run(NIOServerCnxn.java:242)
[junit4:junit4]   2> 
[junit4:junit4]   2> 12319 T261 oaz.ClientCnxn$SendThread.run Unable to read additional data from server sessionid 0x0, likely server has closed socket, closing socket connection and attempting reconnect
[junit4:junit4]   2> 13320 T257 oazs.NIOServerCnxn$Factory.run WARNING Ignoring unexpected runtime exception java.lang.NullPointerException
[junit4:junit4]   2> 	at org.apache.zookeeper.server.NIOServerCnxn$Factory.run(NIOServerCnxn.java:244)
[junit4:junit4]   2> 
[junit4:junit4]   2> 14002 T261 oaz.ClientCnxn$SendThread.startConnect Opening socket connection to server localhost/127.0.0.1:48357
[junit4:junit4]   2> 14003 T261 oaz.ClientCnxn$SendThread.primeConnection Socket connection established to localhost/127.0.0.1:48357, initiating session
[junit4:junit4]   2> 14003 T257 oazs.NIOServerCnxn$Factory.run WARNING Ignoring unexpected runtime exception java.security.AccessControlException: access denied (java.net.SocketPermission 140.211.11.196:45289 accept,resolve)
[junit4:junit4]   2> 	at java.security.AccessControlContext.checkPermission(AccessControlContext.java:393)
[junit4:junit4]   2> 	at java.security.AccessController.checkPermission(AccessController.java:553)
[junit4:junit4]   2> 	at java.lang.SecurityManager.checkPermission(SecurityManager.java:549)
[junit4:junit4]   2> 	at java.lang.SecurityManager.checkAccept(SecurityManager.java:1174)
[junit4:junit4]   2> 	at sun.nio.ch.ServerSocketChannelImpl.accept(ServerSocketChannelImpl.java:183)
[junit4:junit4]   2> 	at org.apache.zookeeper.server.NIOServerCnxn$Factory.run(NIOServerCnxn.java:242)
[junit4:junit4]   2> 
[junit4:junit4]   2> 14003 T261 oaz.ClientCnxn$SendThread.run Unable to read additional data from server sessionid 0x0, likely server has closed socket, closing socket connection and attempting reconnect
[junit4:junit4]   2> 15004 T257 oazs.NIOServerCnxn$Factory.run WARNING Ignoring unexpected runtime exception java.lang.NullPointerException
[junit4:junit4]   2> 	at org.apache.zookeeper.server.NIOServerCnxn$Factory.run(NIOServerCnxn.java:244)
[junit4:junit4]   2> 
[junit4:junit4]   2> 16005 T257 oazs.NIOServerCnxn$Factory.run WARNING Ignoring unexpected runtime exception java.lang.NullPointerException
[junit4:junit4]   2> 	at org.apache.zookeeper.server.NIOServerCnxn$Factory.run(NIOServerCnxn.java:244)
[junit4:junit4]   2> 
[junit4:junit4]   2> 16013 T261 oaz.ClientCnxn$SendThread.startConnect Opening socket connection to server localhost/127.0.0.1:48357
[junit4:junit4]   2> 16013 T261 oaz.ClientCnxn$SendThread.primeConnection Socket connection established to localhost/127.0.0.1:48357, initiating session
[junit4:junit4]   2> 16014 T257 oazs.NIOServerCnxn$Factory.run WARNING Ignoring unexpected runtime exception java.security.AccessControlException: access denied (java.net.SocketPermission 140.211.11.196:45295 accept,resolve)
[junit4:junit4]   2> 	at java.security.AccessControlContext.checkPermission(AccessControlContext.java:393)
[junit4:junit4]   2> 	at java.security.AccessController.checkPermission(AccessController.java:553)
[junit4:junit4]   2> 	at java.lang.SecurityManager.checkPermission(SecurityManager.java:549)
[junit4:junit4]   2> 	at java.lang.SecurityManager.checkAccept(SecurityManager.java:1174)
[junit4:junit4]   2> 	at sun.nio.ch.ServerSocketChannelImpl.accept(ServerSocketChannelImpl.java:183)
[junit4:junit4]   2> 	at org.apache.zookeeper.server.NIOServerCnxn$Factory.run(NIOServerCnxn.java:242)
[junit4:junit4]   2> 
[junit4:junit4]   2> 16014 T261 oaz.ClientCnxn$SendThread.run Unable to read additional data from server sessionid 0x0, likely server has closed socket, closing socket connection and attempting reconnect
[junit4:junit4]   2> 17015 T257 oazs.NIOServerCnxn$Factory.run WARNING Ignoring unexpected runtime exception java.lang.NullPointerException
[junit4:junit4]   2> 	at org.apache.zookeeper.server.NIOServerCnxn$Factory.run(NIOServerCnxn.java:244)
[junit4:junit4]   2> 
[junit4:junit4]   2> 17500 T261 oaz.ClientCnxn$SendThread.startConnect Opening socket connection to server localhost/127.0.0.1:48357
[junit4:junit4]   2> 17501 T261 oaz.ClientCnxn$SendThread.primeConnection Socket connection established to localhost/127.0.0.1:48357, initiating session
[junit4:junit4]   2> 17501 T257 oazs.NIOServerCnxn$Factory.run WARNING Ignoring unexpected runtime exception java.security.AccessControlException: access denied (java.net.SocketPermission 140.211.11.196:45300 accept,resolve)
[junit4:junit4]   2> 	at java.security.AccessControlContext.checkPermission(AccessControlContext.java:393)
[junit4:junit4]   2> 	at java.security.AccessController.checkPermission(AccessController.java:553)
[junit4:junit4]   2> 	at java.lang.SecurityManager.checkPermission(SecurityManager.java:549)
[junit4:junit4]   2> 	at java.lang.SecurityManager.checkAccept(SecurityManager.java:1174)
[junit4:junit4]   2> 	at sun.nio.ch.ServerSocketChannelImpl.accept(ServerSocketChannelImpl.java:183)
[junit4:junit4]   2> 	at org.apache.zookeeper.server.NIOServerCnxn$Factory.run(NIOServerCnxn.java:242)
[junit4:junit4]   2> 
[junit4:junit4]   2> 17501 T261 oaz.ClientCnxn$SendThread.run Unable to read additional data from server sessionid 0x0, likely server has closed socket, closing socket connection and attempting reconnect
[junit4:junit4]   2> 18502 T257 oazs.NIOServerCnxn$Factory.run WARNING Ignoring unexpected runtime exception java.lang.NullPointerException
[junit4:junit4]   2> 	at org.apache.zookeeper.server.NIOServerCnxn$Factory.run(NIOServerCnxn.java:244)
[junit4:junit4]   2> 
[junit4:junit4]   2> 19198 T261 oaz.ClientCnxn$SendThread.startConnect Opening socket connection to server localhost/127.0.0.1:48357
[junit4:junit4]   2> 19199 T261 oaz.ClientCnxn$SendThread.primeConnection Socket connection established to localhost/127.0.0.1:48357, initiating session
[junit4:junit4]   2> 19199 T257 oazs.NIOServerCnxn$Factory.run WARNING Ignoring unexpected runtime exception java.security.AccessControlException: access denied (java.net.SocketPermission 140.211.11.196:45307 accept,resolve)
[junit4:junit4]   2> 	at java.security.AccessControlContext.checkPermission(AccessControlContext.java:393)
[junit4:junit4]   2> 	at java.security.AccessController.checkPermission(AccessController.java:553)
[junit4:junit4]   2> 	at java.lang.SecurityManager.checkPermission(SecurityManager.java:549)
[junit4:junit4]   2> 	at java.lang.SecurityManager.checkAccept(SecurityManager.java:1174)
[junit4:junit4]   2> 	at sun.nio.ch.ServerSocketChannelImpl.accept(ServerSocketChannelImpl.java:183)
[junit4:junit4]   2> 	at org.apache.zookeeper.server.NIOServerCnxn$Factory.run(NIOServerCnxn.java:242)
[junit4:junit4]   2> 
[junit4:junit4]   2> 19199 T261 oaz.ClientCnxn$SendThread.run WARNING Session 0x0 for server localhost/127.0.0.1:48357, unexpected error, closing socket connection and attempting reconnect java.io.IOException: Connection reset by peer
[junit4:junit4]   2> 	at sun.nio.ch.FileDispatcher.read0(Native Method)
[junit4:junit4]   2> 	at sun.nio.ch.SocketDispatcher.read(SocketDispatcher.java:39)
[junit4:junit4]   2> 	at sun.nio.ch.IOUtil.readIntoNativeBuffer(IOUtil.java:251)
[junit4:junit4]   2> 	at sun.nio.ch.IOUtil.read(IOUtil.java:218)
[junit4:junit4]   2> 	at sun.nio.ch.SocketChannelImpl.read(SocketChannelImpl.java:254)
[junit4:junit4]   2> 	at org.apache.zookeeper.ClientCnxn$SendThread.doIO(ClientCnxn.java:856)
[junit4:junit4]   2> 	at org.apache.zookeeper.ClientCnxn$SendThread.run(ClientCnxn.java:1154)
[junit4:junit4]   2> 
[junit4:junit4]   2> 20200 T257 oazs.NIOServerCnxn$Factory.run WARNING Ignoring unexpected runtime exception java.lang.NullPointerException
[junit4:junit4]   2> 	at org.apache.zookeeper.server.NIOServerCnxn$Factory.run(NIOServerCnxn.java:244)
[junit4:junit4]   2> 
[junit4:junit4]   2> 20567 T261 oaz.ClientCnxn$SendThread.startConnect Opening socket connection to server localhost/127.0.0.1:48357
[junit4:junit4]   2> 20568 T261 oaz.ClientCnxn$SendThread.primeConnection Socket connection established to localhost/127.0.0.1:48357, initiating session
[junit4:junit4]   2> 20568 T257 oazs.NIOServerCnxn$Factory.run WARNING Ignoring unexpected runtime exception java.security.AccessControlException: access denied (java.net.SocketPermission 140.211.11.196:45312 accept,resolve)
[junit4:junit4]   2> 	at java.security.AccessControlContext.checkPermission(AccessControlContext.java:393)
[junit4:junit4]   2> 	at java.security.AccessController.checkPermission(AccessController.java:553)
[junit4:junit4]   2> 	at java.lang.SecurityManager.checkPermission(SecurityManager.java:549)
[junit4:junit4]   2> 	at java.lang.SecurityManager.checkAccept(SecurityManager.java:1174)
[junit4:junit4]   2> 	at sun.nio.ch.ServerSocketChannelImpl.accept(ServerSocketChannelImpl.java:183)
[junit4:junit4]   2> 	at org.apache.zookeeper.server.NIOServerCnxn$Factory.run(NIOServerCnxn.java:242)
[junit4:junit4]   2> 
[junit4:junit4]   2> 20568 T261 oaz.ClientCnxn$SendThread.run Unable to read additional data from server sessionid 0x0, likely server has closed socket, closing socket connection and attempting reconnect
[junit4:junit4]   2> 21569 T257 oazs.NIOServerCnxn$Factory.run WARNING Ignoring unexpected runtime exception java.lang.NullPointerException
[junit4:junit4]   2> 	at org.apache.zookeeper.server.NIOServerCnxn$Factory.run(NIOServerCnxn.java:244)
[junit4:junit4]   2> 
[junit4:junit4]   2> 21882 T261 oaz.ClientCnxn$SendThread.startConnect Opening socket connection to server localhost/127.0.0.1:48357
[junit4:junit4]   2> 21882 T261 oaz.ClientCnxn$SendThread.primeConnection Socket connection established to localhost/127.0.0.1:48357, initiating session
[junit4:junit4]   2> 21883 T257 oazs.NIOServerCnxn$Factory.run WARNING Ignoring unexpected runtime exception java.security.AccessControlException: access denied (java.net.SocketPermission 140.211.11.196:45314 accept,resolve)
[junit4:junit4]   2> 	at java.security.AccessControlContext.checkPermission(AccessControlContext.java:393)
[junit4:junit4]   2> 	at java.security.AccessController.checkPermission(AccessController.java:553)
[junit4:junit4]   2> 	at java.lang.SecurityManager.checkPermission(SecurityManager.java:549)
[junit4:junit4]   2> 	at java.lang.SecurityManager.checkAccept(SecurityManager.java:1174)
[junit4:junit4]   2> 	at sun.nio.ch.ServerSocketChannelImpl.accept(ServerSocketChannelImpl.java:183)
[junit4:junit4]   2> 	at org.apache.zookeeper.server.NIOServerCnxn$Factory.run(NIOServerCnxn.java:242)
[junit4:junit4]   2> 
[junit4:junit4]   2> 21883 T261 oaz.ClientCnxn$SendThread.run Unable to read additional data from server sessionid 0x0, likely server has closed socket, closing socket connection and attempting reconnect
[junit4:junit4]   2> 22884 T257 oazs.NIOServerCnxn$Factory.run WARNING Ignoring unexpected runtime exception java.lang.NullPointerException
[junit4:junit4]   2> 	at org.apache.zookeeper.server.NIOServerCnxn$Factory.run(NIOServerCnxn.java:244)
[junit4:junit4]   2> 
[junit4:junit4]   2> 23695 T261 oaz.ClientCnxn$SendThread.startConnect Opening socket connection to server localhost/127.0.0.1:48357
[junit4:junit4]   2> 23696 T261 oaz.ClientCnxn$SendThread.primeConnection Socket connection established to localhost/127.0.0.1:48357, initiating session
[junit4:junit4]   2> 23696 T257 oazs.NIOServerCnxn$Factory.run WARNING Ignoring unexpected runtime exception java.security.AccessControlException: access denied (java.net.SocketPermission 140.211.11.196:45320 accept,resolve)
[junit4:junit4]   2> 	at java.security.AccessControlContext.checkPermission(AccessControlContext.java:393)
[junit4:junit4]   2> 	at java.security.AccessController.checkPermission(AccessController.java:553)
[junit4:junit4]   2> 	at java.lang.SecurityManager.checkPermission(SecurityManager.java:549)
[junit4:junit4]   2> 	at java.lang.SecurityManager.checkAccept(SecurityManager.java:1174)
[junit4:junit4]   2> 	at sun.nio.ch.ServerSocketChannelImpl.accept(ServerSocketChannelImpl.java:183)
[junit4:junit4]   2> 	at org.apache.zookeeper.server.NIOServerCnxn$Factory.run(NIOServerCnxn.java:242)
[junit4:junit4]   2> 
[junit4:junit4]   2> 23696 T261 oaz.ClientCnxn$SendThread.run Unable to read additional data from server sessionid 0x0, likely server has closed socket, closing socket connection and attempting reconnect
[junit4:junit4]   2> 24697 T257 oazs.NIOServerCnxn$Factory.run WARNING Ignoring unexpected runtime exception java.lang.NullPointerException
[junit4:junit4]   2> 	at org.apache.zookeeper.server.NIOServerCnxn$Factory.run(NIOServerCnxn.java:244)
[junit4:junit4]   2> 
[junit4:junit4]   2> 25408 T261 oaz.ClientCnxn$SendThread.startConnect Opening socket connection to server localhost/127.0.0.1:48357
[junit4:junit4]   2> 25409 T261 oaz.ClientCnxn$SendThread.primeConnection Socket connection established to localhost/127.0.0.1:48357, initiating session
[junit4:junit4]   2> 25409 T257 oazs.NIOServerCnxn$Factory.run WARNING Ignoring unexpected runtime exception java.security.AccessControlException: access denied (java.net.SocketPermission 140.211.11.196:45327 accept,resolve)
[junit4:junit4]   2> 	at java.security.AccessControlContext.checkPermission(AccessControlContext.java:393)
[junit4:junit4]   2> 	at java.security.AccessController.checkPermission(AccessController.java:553)
[junit4:junit4]   2> 	at java.lang.SecurityManager.checkPermission(SecurityManager.java:549)
[junit4:junit4]   2> 	at java.lang.SecurityManager.checkAccept(SecurityManager.java:1174)
[junit4:junit4]   2> 	at sun.nio.ch.ServerSocketChannelImpl.accept(ServerSocketChannelImpl.java:183)
[junit4:junit4]   2> 	at org.apache.zookeeper.server.NIOServerCnxn$Factory.run(NIOServerCnxn.java:242)
[junit4:junit4]   2> 
[junit4:junit4]   2> 25409 T261 oaz.ClientCnxn$SendThread.run Unable to read additional data from server sessionid 0x0, likely server has closed socket, closing socket connection and attempting reconnect
[junit4:junit4]   2> 26410 T257 oazs.NIOServerCnxn$Factory.run WARNING Ignoring unexpected runtime exception java.lang.NullPointerException
[junit4:junit4]   2> 	at org.apache.zookeeper.server.NIOServerCnxn$Factory.run(NIOServerCnxn.java:244)
[junit4:junit4]   2> 
[junit4:junit4]   2> 27221 T261 oaz.ClientCnxn$SendThread.startConnect Opening socket connection to server localhost/127.0.0.1:48357
[junit4:junit4]   2> 27222 T261 oaz.ClientCnxn$SendThread.primeConnection Socket connection established to localhost/127.0.0.1:48357, initiating session
[junit4:junit4]   2> 27222 T257 oazs.NIOServerCnxn$Factory.run WARNING Ignoring unexpected runtime exception java.security.AccessControlException: access denied (java.net.SocketPermission 140.211.11.196:45333 accept,resolve)
[junit4:junit4]   2> 	at java.security.AccessControlContext.checkPermission(AccessControlContext.java:393)
[junit4:junit4]   2> 	at java.security.AccessController.checkPermission(AccessController.java:553)
[junit4:junit4]   2> 	at java.lang.SecurityManager.checkPermission(SecurityManager.java:549)
[junit4:junit4]   2> 	at java.lang.SecurityManager.checkAccept(SecurityManager.java:1174)
[junit4:junit4]   2> 	at sun.nio.ch.ServerSocketChannelImpl.accept(ServerSocketChannelImpl.java:183)
[junit4:junit4]   2> 	at org.apache.zookeeper.server.NIOServerCnxn$Factory.run(NIOServerCnxn.java:242)
[junit4:junit4]   2> 
[junit4:junit4]   2> 27222 T261 oaz.ClientCnxn$SendThread.run Unable to read additional data from server sessionid 0x0, likely server has closed socket, closing socket connection and attempting reconnect
[junit4:junit4]   2> 28223 T257 oazs.NIOServerCnxn$Factory.run WARNING Ignoring unexpected runtime exception java.lang.NullPointerException
[junit4:junit4]   2> 	at org.apache.zookeeper.server.NIOServerCnxn$Factory.run(NIOServerCnxn.java:244)
[junit4:junit4]   2> 
[junit4:junit4]   2> 28992 T261 oaz.ClientCnxn$SendThread.startConnect Opening socket connection to server localhost/127.0.0.1:48357
[junit4:junit4]   2> 28992 T261 oaz.ClientCnxn$SendThread.primeConnection Socket connection established to localhost/127.0.0.1:48357, initiating session
[junit4:junit4]   2> 28993 T257 oazs.NIOServerCnxn$Factory.run WARNING Ignoring unexpected runtime exception java.security.AccessControlException: access denied (java.net.SocketPermission 140.211.11.196:45338 accept,resolve)
[junit4:junit4]   2> 	at java.security.AccessControlContext.checkPermission(AccessControlContext.java:393)
[junit4:junit4]   2> 	at java.security.AccessController.checkPermission(AccessController.java:553)
[junit4:junit4]   2> 	at java.lang.SecurityManager.checkPermission(SecurityManager.java:549)
[junit4:junit4]   2> 	at java.lang.SecurityManager.checkAccept(SecurityManager.java:1174)
[junit4:junit4]   2> 	at sun.nio.ch.ServerSocketChannelImpl.accept(ServerSocketChannelImpl.java:183)
[junit4:junit4]   2> 	at org.apache.zookeeper.server.NIOServerCnxn$Factory.run(NIOServerCnxn.java:242)
[junit4:junit4]   2> 
[junit4:junit4]   2> 28993 T261 oaz.ClientCnxn$SendThread.run Unable to read additional data from server sessionid 0x0, likely server has closed socket, closing socket connection and attempting reconnect
[junit4:junit4]   2> 29994 T257 oazs.NIOServerCnxn$Factory.run WARNING Ignoring unexpected runtime exception java.lang.NullPointerException
[junit4:junit4]   2> 	at org.apache.zookeeper.server.NIOServerCnxn$Factory.run(NIOServerCnxn.java:244)
[junit4:junit4]   2> 
[junit4:junit4]   2> 30393 T259 oazs.SyncRequestProcessor.run SyncRequestProcessor exited!
[junit4:junit4]   2> 30393 T260 oazs.PrepRequestProcessor.run PrepRequestProcessor exited loop!
[junit4:junit4]   2> 30394 T255 oazs.FinalRequestProcessor.shutdown shutdown of request processor complete
[junit4:junit4]   2> 30636 T257 oazs.NIOServerCnxn$Factory.run NIOServerCnxn factory exited run method
[junit4:junit4]   2> 30637 T255 oazs.FinalRequestProcessor.shutdown shutdown of request processor complete
[junit4:junit4]   2> 30662 T261 oaz.ClientCnxn$SendThread.startConnect Opening socket connection to server localhost/127.0.0.1:48357
[junit4:junit4]   2> NOTE: reproduce with: ant test  -Dtestcase=BasicDistributedZkTest -Dtests.method=testDistribSearch -Dtests.seed=3EFF6AEF71FE5FAD -Dtests.multiplier=3 -Dtests.slow=true -Dtests.locale=ga -Dtests.timezone=Europe/Podgorica -Dtests.file.encoding=ISO-8859-1
[junit4:junit4] ERROR   30.7s J0 | BasicDistributedZkTest.testDistribSearch <<<
[junit4:junit4]    > Throwable #1: java.lang.RuntimeException
[junit4:junit4]    > 	at org.apache.solr.common.cloud.SolrZkClient.<init>(SolrZkClient.java:156)
[junit4:junit4]    > 	at org.apache.solr.common.cloud.SolrZkClient.<init>(SolrZkClient.java:104)
[junit4:junit4]    > 	at org.apache.solr.common.cloud.SolrZkClient.<init>(SolrZkClient.java:86)
[junit4:junit4]    > 	at org.apache.solr.cloud.AbstractZkTestCase.buildZooKeeper(AbstractZkTestCase.java:90)
[junit4:junit4]    > 	at org.apache.solr.cloud.AbstractZkTestCase.buildZooKeeper(AbstractZkTestCase.java:84)
[junit4:junit4]    > 	at org.apache.solr.cloud.AbstractDistribZkTestBase.setUp(AbstractDistribZkTestBase.java:68)
[junit4:junit4]    > 	at sun.reflect.NativeMethodAccessorImpl.invoke0(Native Method)
[junit4:junit4]    > 	at sun.reflect.NativeMethodAccessorImpl.invoke(NativeMethodAccessorImpl.java:57)
[junit4:junit4]    > 	at sun.reflect.DelegatingMethodAccessorImpl.invoke(DelegatingMethodAccessorImpl.java:43)
[junit4:junit4]    > 	at java.lang.reflect.Method.invoke(Method.java:616)
[junit4:junit4]    > 	at com.carrotsearch.randomizedtesting.RandomizedRunner.invoke(RandomizedRunner.java:1559)
[junit4:junit4]    > 	at com.carrotsearch.randomizedtesting.RandomizedRunner.access$600(RandomizedRunner.java:79)
[junit4:junit4]    > 	at com.carrotsearch.randomizedtesting.RandomizedRunner$7.evaluate(RandomizedRunner.java:771)
[junit4:junit4]    > 	at com.carrotsearch.randomizedtesting.RandomizedRunner$8.evaluate(RandomizedRunner.java:787)
[junit4:junit4]    > 	at com.carrotsearch.randomizedtesting.rules.SystemPropertiesRestoreRule$1.evaluate(SystemPropertiesRestoreRule.java:53)
[junit4:junit4]    > 	at org.apache.lucene.util.TestRuleSetupTeardownChained$1.evaluate(TestRuleSetupTeardownChained.java:50)
[junit4:junit4]    > 	at org.apache.lucene.util.TestRuleFieldCacheSanity$1.evaluate(TestRuleFieldCacheSanity.java:51)
[junit4:junit4]    > 	at org.apache.lucene.util.AbstractBeforeAfterRule$1.evaluate(AbstractBeforeAfterRule.java:45)
[junit4:junit4]    > 	at com.carrotsearch.randomizedtesting.rules.SystemPropertiesInvariantRule$1.evaluate(SystemPropertiesInvariantRule.java:55)
[junit4:junit4]    > 	at org.apache.lucene.util.TestRuleThreadAndTestName$1.evaluate(TestRuleThreadAndTestName.java:48)
[junit4:junit4]    > 	at org.apache.lucene.util.TestRuleIgnoreAfterMaxFailures$1.evaluate(TestRuleIgnoreAfterMaxFailures.java:70)
[junit4:junit4]    > 	at org.apache.lucene.util.TestRuleMarkFailure$1.evaluate(TestRuleMarkFailure.java:48)
[junit4:junit4]    > 	at com.carrotsearch.randomizedtesting.rules.StatementAdapter.evaluate(StatementAdapter.java:36)
[junit4:junit4]    > 	at com.carrotsearch.randomizedtesting.ThreadLeakControl$StatementRunner.run(ThreadLeakControl.java:345)
[junit4:junit4]    > 	at com.carrotsearch.randomizedtesting.ThreadLeakControl.forkTimeoutingTask(ThreadLeakControl.java:769)
[junit4:junit4]    > 	at com.carrotsearch.randomizedtesting.ThreadLeakControl$3.evaluate(ThreadLeakControl.java:429)
[junit4:junit4]    > 	at com.carrotsearch.randomizedtesting.RandomizedRunner.runSingleTest(RandomizedRunner.java:746)
[junit4:junit4]    > 	at com.carrotsearch.randomizedtesting.RandomizedRunner$3.evaluate(RandomizedRunner.java:648)
[junit4:junit4]    > 	at com.carrotsearch.randomizedtesting.RandomizedRunner$4.evaluate(RandomizedRunner.java:682)
[junit4:junit4]    > 	at com.carrotsearch.randomizedtesting.RandomizedRunner$5.evaluate(RandomizedRunner.java:693)
[junit4:junit4]    > 	at com.carrotsearch.randomizedtesting.rules.StatementAdapter.evaluate(StatementAdapter.java:36)
[junit4:junit4]    > 	at com.carrotsearch.randomizedtesting.rules.SystemPropertiesRestoreRule$1.evaluate(SystemPropertiesRestoreRule.java:53)
[junit4:junit4]    > 	at org.apache.lucene.util.AbstractBeforeAfterRule$1.evaluate(AbstractBeforeAfterRule.java:45)
[junit4:junit4]    > 	at org.apache.lucene.util.TestRuleStoreClassName$1.evaluate(TestRuleStoreClassName.java:42)
[junit4:junit4]    > 	at com.carrotsearch.randomizedtesting.rules.SystemPropertiesInvariantRule$1.evaluate(SystemPropertiesInvariantRule.java:55)
[junit4:junit4]    > 	at com.carrotsearch.randomizedtesting.rules.NoShadowingOrOverridesOnMethodsRule$1.evaluate(NoShadowingOrOverridesOnMethodsRule.java:39)
[junit4:junit4]    > 	at com.carrotsearch.randomizedtesting.rules.NoShadowingOrOverridesOnMethodsRule$1.evaluate(NoShadowingOrOverridesOnMethodsRule.java:39)
[junit4:junit4]    > 	at org.apache.lucene.util.TestRuleAssertionsRequired$1.evaluate(TestRuleAssertionsRequired.java:40)
[junit4:junit4]    > 	at org.apache.lucene.util.TestRuleMarkFailure$1.evaluate(TestRuleMarkFailure.java:48)
[junit4:junit4]    > 	at org.apache.lucene.util.TestRuleIgnoreAfterMaxFailures$1.evaluate(TestRuleIgnoreAfterMaxFailures.java:70)
[junit4:junit4]    > 	at org.apache.lucene.util.TestRuleIgnoreTestSuites$1.evaluate(TestRuleIgnoreTestSuites.java:55)
[junit4:junit4]    > 	at com.carrotsearch.randomizedtesting.rules.StatementAdapter.evaluate(StatementAdapter.java:36)
[junit4:junit4]    > 	at com.carrotsearch.randomizedtesting.ThreadLeakControl$StatementRunner.run(ThreadLeakControl.java:345)
[junit4:junit4]    > 	at java.lang.Thread.run(Thread.java:679)
[junit4:junit4]    > Throwable #2: java.lang.NullPointerException
[junit4:junit4]    > 	at org.apache.solr.BaseDistributedSearchTestCase.destroyServers(BaseDistributedSearchTestCase.java:241)
[junit4:junit4]    > 	at org.apache.solr.BaseDistributedSearchTestCase.tearDown(BaseDistributedSearchTestCase.java:182)
[junit4:junit4]    > 	at org.apache.solr.cloud.AbstractDistribZkTestBase.tearDown(AbstractDistribZkTestBase.java:205)
[junit4:junit4]    > 	at org.apache.solr.cloud.BasicDistributedZkTest.tearDown(BasicDistributedZkTest.java:1041)
[junit4:junit4]    > 	at sun.reflect.NativeMethodAccessorImpl.invoke0(Native Method)
[junit4:junit4]    > 	at sun.reflect.NativeMethodAccessorImpl.invoke(NativeMethodAccessorImpl.java:57)
[junit4:junit4]    > 	at sun.reflect.DelegatingMethodAccessorImpl.invoke(DelegatingMethodAccessorImpl.java:43)
[junit4:junit4]    > 	at java.lang.reflect.Method.invoke(Method.java:616)
[junit4:junit4]    > 	at com.carrotsearch.randomizedtesting.RandomizedRunner.invoke(RandomizedRunner.java:1559)
[junit4:junit4]    > 	at com.carrotsearch.randomizedtesting.RandomizedRunner.access$600(RandomizedRunner.java:79)
[junit4:junit4]    > 	at com.carrotsearch.randomizedtesting.RandomizedRunner$8.evaluate(RandomizedRunner.java:795)
[junit4:junit4]    > 	at com.carrotsearch.randomizedtesting.rules.SystemPropertiesRestoreRule$1.evaluate(SystemPropertiesRestoreRule.java:53)
[junit4:junit4]    > 	at org.apache.lucene.util.TestRuleSetupTeardownChained$1.evaluate(TestRuleSetupTeardownChained.java:50)
[junit4:junit4]    > 	at org.apache.lucene.util.TestRuleFieldCacheSanity$1.evaluate(TestRuleFieldCacheSanity.java:51)
[junit4:junit4]    > 	at org.apache.lucene.util.AbstractBeforeAfterRule$1.evaluate(AbstractBeforeAfterRule.java:45)
[junit4:junit4]    > 	at com.carrotsearch.randomizedtesting.rules.SystemPropertiesInvariantRule$1.evaluate(SystemPropertiesInvariantRule.java:55)
[junit4:junit4]    > 	at org.apache.lucene.util.TestRuleThreadAndTestName$1.evaluate(TestRuleThreadAndTestName.java:48)
[junit4:junit4]    > 	at org.apache.lucene.util.TestRuleIgnoreAfterMaxFailures$1.evaluate(TestRuleIgnoreAfterMaxFailures.java:70)
[junit4:junit4]    > 	at org.apache.lucene.util.TestRuleMarkFailure$1.evaluate(TestRuleMarkFailure.java:48)
[junit4:junit4]    > 	at com.carrotsearch.randomizedtesting.rules.StatementAdapter.evaluate(StatementAdapter.java:36)
[junit4:junit4]    > 	at com.carrotsearch.randomizedtesting.ThreadLeakControl$StatementRunner.run(ThreadLeakControl.java:345)
[junit4:junit4]    > 	at com.carrotsearch.randomizedtesting.ThreadLeakControl.forkTimeoutingTask(ThreadLeakControl.java:769)
[junit4:junit4]    > 	at com.carrotsearch.randomizedtesting.ThreadLeakControl$3.evaluate(ThreadLeakControl.java:429)
[junit4:junit4]    > 	at com.carrotsearch.randomizedtesting.RandomizedRunner.runSingleTest(RandomizedRunner.java:746)
[junit4:junit4]    > 	at com.carrotsearch.randomizedtesting.RandomizedRunner$3.evaluate(RandomizedRunner.java:648)
[junit4:junit4]    > 	at com.carrotsearch.randomizedtesting.RandomizedRunner$4.evaluate(RandomizedRunner.java:682)
[junit4:junit4]    > 	at com.carrotsearch.randomizedtesting.RandomizedRunner$5.evaluate(RandomizedRunner.java:693)
[junit4:junit4]    > 	at com.carrotsearch.randomizedtesting.rules.StatementAdapter.evaluate(StatementAdapter.java:36)
[junit4:junit4]    > 	at com.carrotsearch.randomizedtesting.rules.SystemPropertiesRestoreRule$1.evaluate(SystemPropertiesRestoreRule.java:53)
[junit4:junit4]    > 	at org.apache.lucene.util.AbstractBeforeAfterRule$1.evaluate(AbstractBeforeAfterRule.java:45)
[junit4:junit4]    > 	at org.apache.lucene.util.TestRuleStoreClassName$1.evaluate(TestRuleStoreClassName.java:42)
[junit4:junit4]    > 	at com.carrotsearch.randomizedtesting.rules.SystemPropertiesInvariantRule$1.evaluate(SystemPropertiesInvariantRule.java:55)
[junit4:junit4]    > 	at com.carrotsearch.randomizedtesting.rules.NoShadowingOrOverridesOnMethodsRule$1.evaluate(NoShadowingOrOverridesOnMethodsRule.java:39)
[junit4:junit4]    > 	at com.carrotsearch.randomizedtesting.rules.NoShadowingOrOverridesOnMethodsRule$1.evaluate(NoShadowingOrOverridesOnMethodsRule.java:39)
[junit4:junit4]    > 	at org.apache.lucene.util.TestRuleAssertionsRequired$1.evaluate(TestRuleAssertionsRequired.java:40)
[junit4:junit4]    > 	at org.apache.lucene.util.TestRuleMarkFailure$1.evaluate(TestRuleMarkFailure.java:48)
[junit4:junit4]    > 	at org.apache.lucene.util.TestRuleIgnoreAfterMaxFailures$1.evaluate(TestRuleIgnoreAfterMaxFailures.java:70)
[junit4:junit4]    > 	at org.apache.lucene.util.TestRuleIgnoreTestSuites$1.evaluate(TestRuleIgnoreTestSuites.java:55)
[junit4:junit4]    > 	at com.carrotsearch.randomizedtesting.rules.StatementAdapter.evaluate(StatementAdapter.java:36)
[junit4:junit4]    > 	at com.carrotsearch.randomizedtesting.ThreadLeakControl$StatementRunner.run(ThreadLeakControl.java:345)
[junit4:junit4]    > 	at java.lang.Thread.run(Thread.java:679)
[junit4:junit4]   2> 30726 T255 oas.SolrTestCaseJ4.deleteCore ###deleteCore
[junit4:junit4]   2> 30729 T254 ccr.ThreadLeakControl.checkThreadLeaks WARNING Will linger awaiting termination of 3 leaked thread(s).
[junit4:junit4]   2> 32789 T258 oazs.SessionTrackerImpl.run SessionTrackerImpl exited loop!
[junit4:junit4]   2> 39095 T261 oaz.ClientCnxn$SendThread.run Client session timed out, have not heard from server in 10001ms for sessionid 0x0, closing socket connection and attempting reconnect
[junit4:junit4]   2> 40832 T261 oaz.ClientCnxn$SendThread.startConnect Opening socket connection to server localhost/127.0.0.1:48357
[junit4:junit4]   2> 49197 T261 oaz.ClientCnxn$SendThread.run Client session timed out, have not heard from server in 10001ms for sessionid 0x0, closing socket connection and attempting reconnect
[junit4:junit4]   2> 50811 T254 ccr.ThreadLeakControl.checkThreadLeaks SEVERE 2 threads leaked from SUITE scope at org.apache.solr.cloud.BasicDistributedZkTest: 
[junit4:junit4]   2> 	   1) Thread[id=261, name=TEST-BasicDistributedZkTest.testDistribSearch-seed#[3EFF6AEF71FE5FAD]-SendThread(localhost:48357), state=TIMED_WAITING, group=TGRP-BasicDistributedZkTest]
[junit4:junit4]   2> 	        at java.lang.Thread.sleep(Native Method)
[junit4:junit4]   2> 	        at org.apache.zookeeper.ClientCnxn$SendThread.startConnect(ClientCnxn.java:1045)
[junit4:junit4]   2> 	        at org.apache.zookeeper.ClientCnxn$SendThread.run(ClientCnxn.java:1101)
[junit4:junit4]   2> 	   2) Thread[id=262, name=TEST-BasicDistributedZkTest.testDistribSearch-seed#[3EFF6AEF71FE5FAD]-EventThread, state=WAITING, group=TGRP-BasicDistributedZkTest]
[junit4:junit4]   2> 	        at sun.misc.Unsafe.park(Native Method)
[junit4:junit4]   2> 	        at java.util.concurrent.locks.LockSupport.park(LockSupport.java:186)
[junit4:junit4]   2> 	        at java.util.concurrent.locks.AbstractQueuedSynchronizer$ConditionObject.await(AbstractQueuedSynchronizer.java:2043)
[junit4:junit4]   2> 	        at java.util.concurrent.LinkedBlockingQueue.take(LinkedBlockingQueue.java:386)
[junit4:junit4]   2> 	        at org.apache.zookeeper.ClientCnxn$EventThread.run(ClientCnxn.java:498)
[junit4:junit4]   2> 50812 T254 ccr.ThreadLeakControl.tryToInterruptAll Starting to interrupt leaked threads:
[junit4:junit4]   2> 	   1) Thread[id=261, name=TEST-BasicDistributedZkTest.testDistribSearch-seed#[3EFF6AEF71FE5FAD]-SendThread(localhost:48357), state=TIMED_WAITING, group=TGRP-BasicDistributedZkTest]
[junit4:junit4]   2> 	   2) Thread[id=262, name=TEST-BasicDistributedZkTest.testDistribSearch-seed#[3EFF6AEF71FE5FAD]-EventThread, state=WAITING, group=TGRP-BasicDistributedZkTest]
[junit4:junit4]   2> 50812 T261 oaz.ClientCnxn$SendThread.startConnect WARNING Unexpected exception java.lang.InterruptedException: sleep interrupted
[junit4:junit4]   2> 	at java.lang.Thread.sleep(Native Method)
[junit4:junit4]   2> 	at org.apache.zookeeper.ClientCnxn$SendThread.startConnect(ClientCnxn.java:1045)
[junit4:junit4]   2> 	at org.apache.zookeeper.ClientCnxn$SendThread.run(ClientCnxn.java:1101)
[junit4:junit4]   2> 
[junit4:junit4]   2> 50812 T262 oaz.ClientCnxn$EventThread.run SEVERE Event thread exiting due to interruption java.lang.InterruptedException
[junit4:junit4]   2> 	at java.util.concurrent.locks.AbstractQueuedSynchronizer$ConditionObject.reportInterruptAfterWait(AbstractQueuedSynchronizer.java:2017)
[junit4:junit4]   2> 	at java.util.concurrent.locks.AbstractQueuedSynchronizer$ConditionObject.await(AbstractQueuedSynchronizer.java:2052)
[junit4:junit4]   2> 	at java.util.concurrent.LinkedBlockingQueue.take(LinkedBlockingQueue.java:386)
[junit4:junit4]   2> 	at org.apache.zookeeper.ClientCnxn$EventThread.run(ClientCnxn.java:498)
[junit4:junit4]   2> 
[junit4:junit4]   2> 50813 T261 oaz.ClientCnxn$SendThread.startConnect Opening socket connection to server localhost/127.0.0.1:48357
[junit4:junit4]   2> 50813 T262 oaz.ClientCnxn$EventThread.run EventThread shut down
[junit4:junit4]   2> 53818 T254 ccr.ThreadLeakControl.tryToInterruptAll SEVERE There are still zombie threads that couldn't be terminated:
[junit4:junit4]   2> 	   1) Thread[id=261, name=TEST-BasicDistributedZkTest.testDistribSearch-seed#[3EFF6AEF71FE5FAD]-SendThread(localhost:48357), state=RUNNABLE, group=TGRP-BasicDistributedZkTest]
[junit4:junit4]   2> 	        at sun.nio.ch.KqueueArrayWrapper.interrupt(Native Method)
[junit4:junit4]   2> 	        at sun.nio.ch.KqueueArrayWrapper.interrupt(KqueueArrayWrapper.java:206)
[junit4:junit4]   2> 	        at sun.nio.ch.KqueueSelectorImpl.wakeup(KqueueSelectorImpl.java:194)
[junit4:junit4]   2> 	        at java.nio.channels.spi.AbstractSelector$1.interrupt(AbstractSelector.java:210)
[junit4:junit4]   2> 	        at java.nio.channels.spi.AbstractSelector.begin(AbstractSelector.java:215)
[junit4:junit4]   2> 	        at sun.nio.ch.KqueueSelectorImpl.doSelect(KqueueSelectorImpl.java:68)
[junit4:junit4]   2> 	        at sun.nio.ch.SelectorImpl.lockAndDoSelect(SelectorImpl.java:87)
[junit4:junit4]   2> 	        at sun.nio.ch.SelectorImpl.select(SelectorImpl.java:98)
[junit4:junit4]   2> 	        at org.apache.zookeeper.ClientCnxn$SendThread.run(ClientCnxn.java:1131)
[junit4:junit4]   2> NOTE: test params are: codec=Lucene40: {}, sim=DefaultSimilarity, locale=ga, timezone=Europe/Podgorica
[junit4:junit4]   2> NOTE: FreeBSD 9.0-RELEASE amd64/Sun Microsystems Inc. 1.6.0_32 (64-bit)/cpus=16,threads=2,free=183954824,total=273743872
[junit4:junit4]   2> NOTE: All tests run in this JVM: [TestRandomFaceting, RequestHandlersTest, FieldAnalysisRequestHandlerTest, CircularListTest, TermsComponentTest, TestPseudoReturnFields, SuggesterFSTTest, TestFaceting, BasicDistributedZkTest]
[junit4:junit4]   2> NOTE: reproduce with: ant test  -Dtestcase=BasicDistributedZkTest -Dtests.seed=3EFF6AEF71FE5FAD -Dtests.multiplier=3 -Dtests.slow=true -Dtests.locale=ga -Dtests.timezone=Europe/Podgorica -Dtests.file.encoding=ISO-8859-1
[junit4:junit4] ERROR   0.00s J0 | BasicDistributedZkTest (suite) <<<
[junit4:junit4]    > Throwable #1: com.carrotsearch.randomizedtesting.ThreadLeakError: 2 threads leaked from SUITE scope at org.apache.solr.cloud.BasicDistributedZkTest: 
[junit4:junit4]    >    1) Thread[id=261, name=TEST-BasicDistributedZkTest.testDistribSearch-seed#[3EFF6AEF71FE5FAD]-SendThread(localhost:48357), state=TIMED_WAITING, group=TGRP-BasicDistributedZkTest]
[junit4:junit4]    >         at java.lang.Thread.sleep(Native Method)
[junit4:junit4]    >         at org.apache.zookeeper.ClientCnxn$SendThread.startConnect(ClientCnxn.java:1045)
[junit4:junit4]    >         at org.apache.zookeeper.ClientCnxn$SendThread.run(ClientCnxn.java:1101)
[junit4:junit4]    >    2) Thread[id=262, name=TEST-BasicDistributedZkTest.testDistribSearch-seed#[3EFF6AEF71FE5FAD]-EventThread, state=WAITING, group=TGRP-BasicDistributedZkTest]
[junit4:junit4]    >         at sun.misc.Unsafe.park(Native Method)
[junit4:junit4]    >         at java.util.concurrent.locks.LockSupport.park(LockSupport.java:186)
[junit4:junit4]    >         at java.util.concurrent.locks.AbstractQueuedSynchronizer$ConditionObject.await(AbstractQueuedSynchronizer.java:2043)
[junit4:junit4]    >         at java.util.concurrent.LinkedBlockingQueue.take(LinkedBlockingQueue.java:386)
[junit4:junit4]    >         at org.apache.zookeeper.ClientCnxn$EventThread.run(ClientCnxn.java:498)
[junit4:junit4]    > 	at __randomizedtesting.SeedInfo.seed([3EFF6AEF71FE5FAD]:0)
[junit4:junit4]    > Throwable #2: com.carrotsearch.randomizedtesting.ThreadLeakError: There are still zombie threads that couldn't be terminated:
[junit4:junit4]    >    1) Thread[id=261, name=TEST-BasicDistributedZkTest.testDistribSearch-seed#[3EFF6AEF71FE5FAD]-SendThread(localhost:48357), state=RUNNABLE, group=TGRP-BasicDistributedZkTest]
[junit4:junit4]    >         at sun.nio.ch.KqueueArrayWrapper.interrupt(Native Method)
[junit4:junit4]    >         at sun.nio.ch.KqueueArrayWrapper.interrupt(KqueueArrayWrapper.java:206)
[junit4:junit4]    >         at sun.nio.ch.KqueueSelectorImpl.wakeup(KqueueSelectorImpl.java:194)
[junit4:junit4]    >         at java.nio.channels.spi.AbstractSelector$1.interrupt(AbstractSelector.java:210)
[junit4:junit4]    >         at java.nio.channels.spi.AbstractSelector.begin(AbstractSelector.java:215)
[junit4:junit4]    >         at sun.nio.ch.KqueueSelectorImpl.doSelect(KqueueSelectorImpl.java:68)
[junit4:junit4]    >         at sun.nio.ch.SelectorImpl.lockAndDoSelect(SelectorImpl.java:87)
[junit4:junit4]    >         at sun.nio.ch.SelectorImpl.select(SelectorImpl.java:98)
[junit4:junit4]    >         at org.apache.zookeeper.ClientCnxn$SendThread.run(ClientCnxn.java:1131)
[junit4:junit4]    > 	at __randomizedtesting.SeedInfo.seed([3EFF6AEF71FE5FAD]:0)
[junit4:junit4] Completed on J0 in 53.87s, 1 test, 3 errors <<< FAILURES!

[...truncated 486 lines...]
[junit4:junit4] ERROR: JVM J1 ended with an exception, command line: /usr/local/openjdk6/jre/bin/java -Dtests.prefix=tests -Dtests.seed=3EFF6AEF71FE5FAD -Xmx512M -Dtests.iters= -Dtests.verbose=false -Dtests.infostream=false -Dtests.lockdir=/usr/home/hudson/hudson-slave/workspace/Lucene-Solr-Tests-trunk-Java6/lucene/build -Dtests.codec=random -Dtests.postingsformat=random -Dtests.locale=random -Dtests.timezone=random -Dtests.directory=random -Dtests.linedocsfile=europarl.lines.txt.gz -Dtests.luceneMatchVersion=5.0 -Dtests.cleanthreads=perClass -Djava.util.logging.config.file=/usr/home/hudson/hudson-slave/workspace/Lucene-Solr-Tests-trunk-Java6/solr/testlogging.properties -Dtests.nightly=false -Dtests.weekly=false -Dtests.slow=true -Dtests.asserts.gracious=false -Dtests.multiplier=3 -DtempDir=. -Djava.io.tmpdir=. -Dtests.sandbox.dir=/usr/home/hudson/hudson-slave/workspace/Lucene-Solr-Tests-trunk-Java6/solr/build/solr-core -Djava.security.manager=java.lang.SecurityManager -Djava.security.policy=/usr/home/hudson/hudson-slave/workspace/Lucene-Solr-Tests-trunk-Java6/lucene/tools/junit4/tests.policy -Dlucene.version=5.0-SNAPSHOT -Djetty.testMode=1 -Djetty.insecurerandom=1 -Dsolr.directoryFactory=org.apache.solr.core.MockDirectoryFactory -Dfile.encoding=ISO-8859-1 -classpath /usr/home/hudson/hudson-slave/workspace/Lucene-Solr-Tests-trunk-Java6/solr/build/solr-core/classes/test:/usr/home/hudson/hudson-slave/workspace/Lucene-Solr-Tests-trunk-Java6/solr/build/solr-test-framework/classes/java:/usr/home/hudson/hudson-slave/workspace/Lucene-Solr-Tests-trunk-Java6/solr/build/solr-core/test-files:/usr/home/hudson/hudson-slave/workspace/Lucene-Solr-Tests-trunk-Java6/lucene/build/test-framework/classes/java:/usr/home/hudson/hudson-slave/workspace/Lucene-Solr-Tests-trunk-Java6/solr/build/solr-solrj/classes/java:/usr/home/hudson/hudson-slave/workspace/Lucene-Solr-Tests-trunk-Java6/solr/build/solr-core/classes/java:/usr/home/hudson/hudson-slave/workspace/Lucene-Solr-Tests-trunk-Java6/lucene/build/analysis/common/lucene-analyzers-common-5.0-SNAPSHOT.jar:/usr/home/hudson/hudson-slave/workspace/Lucene-Solr-Tests-trunk-Java6/lucene/build/analysis/kuromoji/lucene-analyzers-kuromoji-5.0-SNAPSHOT.jar:/usr/home/hudson/hudson-slave/workspace/Lucene-Solr-Tests-trunk-Java6/lucene/build/analysis/phonetic/lucene-analyzers-phonetic-5.0-SNAPSHOT.jar:/usr/home/hudson/hudson-slave/workspace/Lucene-Solr-Tests-trunk-Java6/lucene/build/highlighter/lucene-highlighter-5.0-SNAPSHOT.jar:/usr/home/hudson/hudson-slave/workspace/Lucene-Solr-Tests-trunk-Java6/lucene/build/memory/lucene-memory-5.0-SNAPSHOT.jar:/usr/home/hudson/hudson-slave/workspace/Lucene-Solr-Tests-trunk-Java6/lucene/build/misc/lucene-misc-5.0-SNAPSHOT.jar:/usr/home/hudson/hudson-slave/workspace/Lucene-Solr-Tests-trunk-Java6/lucene/build/spatial/lucene-spatial-5.0-SNAPSHOT.jar:/usr/home/hudson/hudson-slave/workspace/Lucene-Solr-Tests-trunk-Java6/lucene/build/suggest/lucene-suggest-5.0-SNAPSHOT.jar:/usr/home/hudson/hudson-slave/workspace/Lucene-Solr-Tests-trunk-Java6/lucene/build/grouping/lucene-grouping-5.0-SNAPSHOT.jar:/usr/home/hudson/hudson-slave/workspace/Lucene-Solr-Tests-trunk-Java6/lucene/build/queries/lucene-queries-5.0-SNAPSHOT.jar:/usr/home/hudson/hudson-slave/workspace/Lucene-Solr-Tests-trunk-Java6/lucene/build/queryparser/lucene-queryparser-5.0-SNAPSHOT.jar:/usr/home/hudson/hudson-slave/workspace/Lucene-Solr-Tests-trunk-Java6/solr/lib/commons-cli-1.2.jar:/usr/home/hudson/hudson-slave/workspace/Lucene-Solr-Tests-trunk-Java6/solr/lib/commons-codec-1.6.jar:/usr/home/hudson/hudson-slave/workspace/Lucene-Solr-Tests-trunk-Java6/solr/lib/commons-fileupload-1.2.1.jar:/usr/home/hudson/hudson-slave/workspace/Lucene-Solr-Tests-trunk-Java6/solr/lib/commons-io-2.1.jar:/usr/home/hudson/hudson-slave/workspace/Lucene-Solr-Tests-trunk-Java6/solr/lib/commons-lang-2.6.jar:/usr/home/hudson/hudson-slave/workspace/Lucene-Solr-Tests-trunk-Java6/solr/lib/easymock-2.2.jar:/usr/home/hudson/hudson-slave/workspace/Lucene-Solr-Tests-trunk-Java6/solr/lib/guava-r05.jar:/usr/home/hudson/hudson-slave/workspace/Lucene-Solr-Tests-trunk-Java6/solr/lib/httpclient-4.1.3.jar:/usr/home/hudson/hudson-slave/workspace/Lucene-Solr-Tests-trunk-Java6/solr/lib/httpcore-4.1.4.jar:/usr/home/hudson/hudson-slave/workspace/Lucene-Solr-Tests-trunk-Java6/solr/lib/httpmime-4.1.3.jar:/usr/home/hudson/hudson-slave/workspace/Lucene-Solr-Tests-trunk-Java6/solr/lib/javax.servlet-api-3.0.1.jar:/usr/home/hudson/hudson-slave/workspace/Lucene-Solr-Tests-trunk-Java6/solr/lib/jcl-over-slf4j-1.6.4.jar:/usr/home/hudson/hudson-slave/workspace/Lucene-Solr-Tests-trunk-Java6/solr/lib/log4j-over-slf4j-1.6.4.jar:/usr/home/hudson/hudson-slave/workspace/Lucene-Solr-Tests-trunk-Java6/solr/lib/slf4j-api-1.6.4.jar:/usr/home/hudson/hudson-slave/workspace/Lucene-Solr-Tests-trunk-Java6/solr/lib/slf4j-jdk14-1.6.4.jar:/usr/home/hudson/hudson-slave/workspace/Lucene-Solr-Tests-trunk-Java6/solr/lib/spatial4j-0.2.jar:/usr/home/hudson/hudson-slave/workspace/Lucene-Solr-Tests-trunk-Java6/solr/lib/wstx-asl-3.2.7.jar:/usr/home/hudson/hudson-slave/workspace/Lucene-Solr-Tests-trunk-Java6/solr/lib/zookeeper-3.3.6.jar:/usr/home/hudson/hudson-slave/workspace/Lucene-Solr-Tests-trunk-Java6/solr/example/lib/jetty-continuation-8.1.2.v20120308.jar:/usr/home/hudson/hudson-slave/workspace/Lucene-Solr-Tests-trunk-Java6/solr/example/lib/jetty-deploy-8.1.2.v20120308.jar:/usr/home/hudson/hudson-slave/workspace/Lucene-Solr-Tests-trunk-Java6/solr/example/lib/jetty-http-8.1.2.v20120308.jar:/usr/home/hudson/hudson-slave/workspace/Lucene-Solr-Tests-trunk-Java6/solr/example/lib/jetty-io-8.1.2.v20120308.jar:/usr/home/hudson/hudson-slave/workspace/Lucene-Solr-Tests-trunk-Java6/solr/example/lib/jetty-jmx-8.1.2.v20120308.jar:/usr/home/hudson/hudson-slave/workspace/Lucene-Solr-Tests-trunk-Java6/solr/example/lib/jetty-security-8.1.2.v20120308.jar:/usr/home/hudson/hudson-slave/workspace/Lucene-Solr-Tests-trunk-Java6/solr/example/lib/jetty-server-8.1.2.v20120308.jar:/usr/home/hudson/hudson-slave/workspace/Lucene-Solr-Tests-trunk-Java6/solr/example/lib/jetty-servlet-8.1.2.v20120308.jar:/usr/home/hudson/hudson-slave/workspace/Lucene-Solr-Tests-trunk-Java6/solr/example/lib/jetty-util-8.1.2.v20120308.jar:/usr/home/hudson/hudson-slave/workspace/Lucene-Solr-Tests-trunk-Java6/solr/example/lib/jetty-webapp-8.1.2.v20120308.jar:/usr/home/hudson/hudson-slave/workspace/Lucene-Solr-Tests-trunk-Java6/solr/example/lib/jetty-xml-8.1.2.v20120308.jar:/usr/home/hudson/hudson-slave/workspace/Lucene-Solr-Tests-trunk-Java6/solr/example/lib/servlet-api-3.0.jar:/usr/home/hudson/hudson-slave/workspace/Lucene-Solr-Tests-trunk-Java6/solr/example/example-DIH/solr/db/lib/hsqldb-1.8.0.10.jar:/usr/home/hudson/hudson-slave/workspace/Lucene-Solr-Tests-trunk-Java6/lucene/build/core/classes/java:/usr/home/hudson/hudson-slave/workspace/Lucene-Solr-Tests-trunk-Java6/lucene/test-framework/lib/junit-4.10.jar:/usr/home/hudson/hudson-slave/workspace/Lucene-Solr-Tests-trunk-Java6/lucene/test-framework/lib/randomizedtesting-runner-2.0.0.rc5.jar:/home/hudson/hudson-slave/tools/Ant/ant-1.8.2/lib/ant-launcher.jar:/home/hudson/.ant/lib/ivy-2.2.0.jar:/home/hudson/hudson-slave/tools/Ant/ant-1.8.2/lib/ant-apache-regexp.jar:/home/hudson/hudson-slave/tools/Ant/ant-1.8.2/lib/ant-junit.jar:/home/hudson/hudson-slave/tools/Ant/ant-1.8.2/lib/ant-apache-bsf.jar:/home/hudson/hudson-slave/tools/Ant/ant-1.8.2/lib/ant-commons-net.jar:/home/hudson/hudson-slave/tools/Ant/ant-1.8.2/lib/ant-antlr.jar:/home/hudson/hudson-slave/tools/Ant/ant-1.8.2/lib/ant-apache-log4j.jar:/home/hudson/hudson-slave/tools/Ant/ant-1.8.2/lib/ant-commons-logging.jar:/home/hudson/hudson-slave/tools/Ant/ant-1.8.2/lib/ant-apache-xalan2.jar:/home/hudson/hudson-slave/tools/Ant/ant-1.8.2/lib/ant-apache-oro.jar:/home/hudson/hudson-slave/tools/Ant/ant-1.8.2/lib/ant-junit4.jar:/home/hudson/hudson-slave/tools/Ant/ant-1.8.2/lib/ant-netrexx.jar:/home/hudson/hudson-slave/tools/Ant/ant-1.8.2/lib/ant-swing.jar:/home/hudson/hudson-slave/tools/Ant/ant-1.8.2/lib/ant-javamail.jar:/home/hudson/hudson-slave/tools/Ant/ant-1.8.2/lib/ant-jsch.jar:/home/hudson/hudson-slave/tools/Ant/ant-1.8.2/lib/ant-jmf.jar:/home/hudson/hudson-slave/tools/Ant/ant-1.8.2/lib/ant.jar:/home/hudson/hudson-slave/tools/Ant/ant-1.8.2/lib/ant-apache-bcel.jar:/home/hudson/hudson-slave/tools/Ant/ant-1.8.2/lib/ant-jai.jar:/home/hudson/hudson-slave/tools/Ant/ant-1.8.2/lib/ant-testutil.jar:/home/hudson/hudson-slave/tools/Ant/ant-1.8.2/lib/ant-apache-resolver.jar:/home/hudson/hudson-slave/tools/Ant/ant-1.8.2/lib/ant-jdepend.jar:/usr/local/openjdk6/lib/tools.jar:/home/hudson/.ivy2/cache/com.carrotsearch.randomizedtesting/junit4-ant/jars/junit4-ant-2.0.0.rc5.jar -ea:org.apache.lucene... -ea:org.apache.solr... com.carrotsearch.ant.tasks.junit4.slave.SlaveMainSafe -eventsfile /usr/home/hudson/hudson-slave/workspace/Lucene-Solr-Tests-trunk-Java6/solr/build/solr-core/test/junit4-J1-20120830_161816_449.events @/usr/home/hudson/hudson-slave/workspace/Lucene-Solr-Tests-trunk-Java6/solr/build/solr-core/test/junit4-J1-20120830_161816_449.suites
[junit4:junit4] ERROR: JVM J1 ended with an exception: Forked process exited with an error code: 11
[junit4:junit4] 	at com.carrotsearch.ant.tasks.junit4.JUnit4.forkProcess(JUnit4.java:1312)
[junit4:junit4] 	at com.carrotsearch.ant.tasks.junit4.JUnit4.executeSlave(JUnit4.java:1178)
[junit4:junit4] 	at com.carrotsearch.ant.tasks.junit4.JUnit4.access$000(JUnit4.java:65)
[junit4:junit4] 	at com.carrotsearch.ant.tasks.junit4.JUnit4$2.call(JUnit4.java:813)
[junit4:junit4] 	at com.carrotsearch.ant.tasks.junit4.JUnit4$2.call(JUnit4.java:810)
[junit4:junit4] 	at java.util.concurrent.FutureTask$Sync.innerRun(FutureTask.java:334)
[junit4:junit4] 	at java.util.concurrent.FutureTask.run(FutureTask.java:166)
[junit4:junit4] 	at java.util.concurrent.ThreadPoolExecutor.runWorker(ThreadPoolExecutor.java:1110)
[junit4:junit4] 	at java.util.concurrent.ThreadPoolExecutor$Worker.run(ThreadPoolExecutor.java:603)
[junit4:junit4] 	at java.lang.Thread.run(Thread.java:679)

BUILD FAILED
/usr/home/hudson/hudson-slave/workspace/Lucene-Solr-Tests-trunk-Java6/build.xml:29: The following error occurred while executing this line:
/usr/home/hudson/hudson-slave/workspace/Lucene-Solr-Tests-trunk-Java6/solr/build.xml:144: The following error occurred while executing this line:
/usr/home/hudson/hudson-slave/workspace/Lucene-Solr-Tests-trunk-Java6/lucene/module-build.xml:62: The following error occurred while executing this line:
/usr/home/hudson/hudson-slave/workspace/Lucene-Solr-Tests-trunk-Java6/lucene/common-build.xml:1055: The following error occurred while executing this line:
/usr/home/hudson/hudson-slave/workspace/Lucene-Solr-Tests-trunk-Java6/lucene/common-build.xml:741: At least one slave process threw an unexpected exception, first: Forked process exited with an error code: 11

Total time: 18 minutes 0 seconds
Build step 'Invoke Ant' marked build as failure
Recording test results
Email was triggered for: Failure
Sending email for trigger: Failure



Mime
View raw message