lucene-dev mailing list archives

Site index · List index
Message view « Date » · « Thread »
Top « Date » · « Thread »
From Policeman Jenkins Server <jenk...@sd-datasolutions.de>
Subject [JENKINS] Lucene-Solr-4.x-Linux (32bit/jdk1.8.0-ea-b49) - Build # 128 - Failure!
Date Fri, 03 Aug 2012 08:46:56 GMT
Build: http://jenkins.sd-datasolutions.de/job/Lucene-Solr-4.x-Linux/128/
Java: 32bit/jdk1.8.0-ea-b49 -server -XX:+UseConcMarkSweepGC

1 tests failed.
REGRESSION:  org.apache.solr.handler.component.DistributedQueryElevationComponentTest.testDistribSearch

Error Message:
.responseHeader.params.size()==9,9skipped=4,5

Stack Trace:
junit.framework.AssertionFailedError: .responseHeader.params.size()==9,9skipped=4,5
	at __randomizedtesting.SeedInfo.seed([1041E7DA96564794:91A769C2E10927A8]:0)
	at junit.framework.Assert.fail(Assert.java:50)
	at org.apache.solr.BaseDistributedSearchTestCase.compareResponses(BaseDistributedSearchTestCase.java:670)
	at org.apache.solr.BaseDistributedSearchTestCase.query(BaseDistributedSearchTestCase.java:392)
	at org.apache.solr.handler.component.DistributedQueryElevationComponentTest.doTest(DistributedQueryElevationComponentTest.java:81)
	at org.apache.solr.BaseDistributedSearchTestCase.testDistribSearch(BaseDistributedSearchTestCase.java:679)
	at sun.reflect.NativeMethodAccessorImpl.invoke0(Native Method)
	at sun.reflect.NativeMethodAccessorImpl.invoke(NativeMethodAccessorImpl.java:57)
	at sun.reflect.DelegatingMethodAccessorImpl.invoke(DelegatingMethodAccessorImpl.java:43)
	at java.lang.reflect.Method.invoke(Method.java:474)
	at com.carrotsearch.randomizedtesting.RandomizedRunner.invoke(RandomizedRunner.java:1995)
	at com.carrotsearch.randomizedtesting.RandomizedRunner.access$1100(RandomizedRunner.java:132)
	at com.carrotsearch.randomizedtesting.RandomizedRunner$6.evaluate(RandomizedRunner.java:818)
	at com.carrotsearch.randomizedtesting.RandomizedRunner$7.evaluate(RandomizedRunner.java:877)
	at com.carrotsearch.randomizedtesting.RandomizedRunner$8.evaluate(RandomizedRunner.java:891)
	at com.carrotsearch.randomizedtesting.rules.SystemPropertiesRestoreRule$1.evaluate(SystemPropertiesRestoreRule.java:53)
	at org.apache.lucene.util.TestRuleSetupTeardownChained$1.evaluate(TestRuleSetupTeardownChained.java:50)
	at org.apache.lucene.util.TestRuleFieldCacheSanity$1.evaluate(TestRuleFieldCacheSanity.java:32)
	at org.apache.lucene.util.AbstractBeforeAfterRule$1.evaluate(AbstractBeforeAfterRule.java:45)
	at com.carrotsearch.randomizedtesting.rules.SystemPropertiesInvariantRule$1.evaluate(SystemPropertiesInvariantRule.java:55)
	at org.apache.lucene.util.TestRuleReportUncaughtExceptions$1.evaluate(TestRuleReportUncaughtExceptions.java:68)
	at org.apache.lucene.util.TestRuleThreadAndTestName$1.evaluate(TestRuleThreadAndTestName.java:48)
	at org.apache.lucene.util.TestRuleIgnoreAfterMaxFailures$1.evaluate(TestRuleIgnoreAfterMaxFailures.java:70)
	at org.apache.lucene.util.TestRuleMarkFailure$1.evaluate(TestRuleMarkFailure.java:48)
	at com.carrotsearch.randomizedtesting.RandomizedRunner.runSingleTest(RandomizedRunner.java:825)
	at com.carrotsearch.randomizedtesting.RandomizedRunner.access$700(RandomizedRunner.java:132)
	at com.carrotsearch.randomizedtesting.RandomizedRunner$3$1.run(RandomizedRunner.java:671)
	at com.carrotsearch.randomizedtesting.RandomizedRunner$3.evaluate(RandomizedRunner.java:697)
	at com.carrotsearch.randomizedtesting.RandomizedRunner$4.evaluate(RandomizedRunner.java:736)
	at com.carrotsearch.randomizedtesting.RandomizedRunner$5.evaluate(RandomizedRunner.java:747)
	at com.carrotsearch.randomizedtesting.rules.SystemPropertiesRestoreRule$1.evaluate(SystemPropertiesRestoreRule.java:53)
	at org.apache.lucene.util.AbstractBeforeAfterRule$1.evaluate(AbstractBeforeAfterRule.java:45)
	at org.apache.lucene.util.TestRuleReportUncaughtExceptions$1.evaluate(TestRuleReportUncaughtExceptions.java:68)
	at org.apache.lucene.util.TestRuleStoreClassName$1.evaluate(TestRuleStoreClassName.java:38)
	at com.carrotsearch.randomizedtesting.rules.SystemPropertiesInvariantRule$1.evaluate(SystemPropertiesInvariantRule.java:55)
	at org.apache.lucene.util.TestRuleNoInstanceHooksOverrides$1.evaluate(TestRuleNoInstanceHooksOverrides.java:53)
	at org.apache.lucene.util.TestRuleNoStaticHooksShadowing$1.evaluate(TestRuleNoStaticHooksShadowing.java:52)
	at org.apache.lucene.util.TestRuleAssertionsRequired$1.evaluate(TestRuleAssertionsRequired.java:36)
	at org.apache.lucene.util.TestRuleMarkFailure$1.evaluate(TestRuleMarkFailure.java:48)
	at org.apache.lucene.util.TestRuleIgnoreAfterMaxFailures$1.evaluate(TestRuleIgnoreAfterMaxFailures.java:70)
	at org.apache.lucene.util.TestRuleIgnoreTestSuites$1.evaluate(TestRuleIgnoreTestSuites.java:55)
	at com.carrotsearch.randomizedtesting.RandomizedRunner.runSuite(RandomizedRunner.java:605)
	at com.carrotsearch.randomizedtesting.RandomizedRunner.access$400(RandomizedRunner.java:132)
	at com.carrotsearch.randomizedtesting.RandomizedRunner$2.run(RandomizedRunner.java:551)




Build Log:
[...truncated 7387 lines...]
[junit4:junit4] Suite: org.apache.solr.handler.component.DistributedQueryElevationComponentTest
[junit4:junit4] FAILURE 1.70s J1 | DistributedQueryElevationComponentTest.testDistribSearch
[junit4:junit4]    > Throwable #1: junit.framework.AssertionFailedError: .responseHeader.params.size()==9,9skipped=4,5
[junit4:junit4]    > 	at __randomizedtesting.SeedInfo.seed([1041E7DA96564794:91A769C2E10927A8]:0)
[junit4:junit4]    > 	at junit.framework.Assert.fail(Assert.java:50)
[junit4:junit4]    > 	at org.apache.solr.BaseDistributedSearchTestCase.compareResponses(BaseDistributedSearchTestCase.java:670)
[junit4:junit4]    > 	at org.apache.solr.BaseDistributedSearchTestCase.query(BaseDistributedSearchTestCase.java:392)
[junit4:junit4]    > 	at org.apache.solr.handler.component.DistributedQueryElevationComponentTest.doTest(DistributedQueryElevationComponentTest.java:81)
[junit4:junit4]    > 	at org.apache.solr.BaseDistributedSearchTestCase.testDistribSearch(BaseDistributedSearchTestCase.java:679)
[junit4:junit4]    > 	at sun.reflect.NativeMethodAccessorImpl.invoke0(Native Method)
[junit4:junit4]    > 	at sun.reflect.NativeMethodAccessorImpl.invoke(NativeMethodAccessorImpl.java:57)
[junit4:junit4]    > 	at sun.reflect.DelegatingMethodAccessorImpl.invoke(DelegatingMethodAccessorImpl.java:43)
[junit4:junit4]    > 	at java.lang.reflect.Method.invoke(Method.java:474)
[junit4:junit4]    > 	at com.carrotsearch.randomizedtesting.RandomizedRunner.invoke(RandomizedRunner.java:1995)
[junit4:junit4]    > 	at com.carrotsearch.randomizedtesting.RandomizedRunner.access$1100(RandomizedRunner.java:132)
[junit4:junit4]    > 	at com.carrotsearch.randomizedtesting.RandomizedRunner$6.evaluate(RandomizedRunner.java:818)
[junit4:junit4]    > 	at com.carrotsearch.randomizedtesting.RandomizedRunner$7.evaluate(RandomizedRunner.java:877)
[junit4:junit4]    > 	at com.carrotsearch.randomizedtesting.RandomizedRunner$8.evaluate(RandomizedRunner.java:891)
[junit4:junit4]    > 	at com.carrotsearch.randomizedtesting.rules.SystemPropertiesRestoreRule$1.evaluate(SystemPropertiesRestoreRule.java:53)
[junit4:junit4]    > 	at org.apache.lucene.util.TestRuleSetupTeardownChained$1.evaluate(TestRuleSetupTeardownChained.java:50)
[junit4:junit4]    > 	at org.apache.lucene.util.TestRuleFieldCacheSanity$1.evaluate(TestRuleFieldCacheSanity.java:32)
[junit4:junit4]    > 	at org.apache.lucene.util.AbstractBeforeAfterRule$1.evaluate(AbstractBeforeAfterRule.java:45)
[junit4:junit4]    > 	at com.carrotsearch.randomizedtesting.rules.SystemPropertiesInvariantRule$1.evaluate(SystemPropertiesInvariantRule.java:55)
[junit4:junit4]    > 	at org.apache.lucene.util.TestRuleReportUncaughtExceptions$1.evaluate(TestRuleReportUncaughtExceptions.java:68)
[junit4:junit4]    > 	at org.apache.lucene.util.TestRuleThreadAndTestName$1.evaluate(TestRuleThreadAndTestName.java:48)
[junit4:junit4]    > 	at org.apache.lucene.util.TestRuleIgnoreAfterMaxFailures$1.evaluate(TestRuleIgnoreAfterMaxFailures.java:70)
[junit4:junit4]    > 	at org.apache.lucene.util.TestRuleMarkFailure$1.evaluate(TestRuleMarkFailure.java:48)
[junit4:junit4]    > 	at com.carrotsearch.randomizedtesting.RandomizedRunner.runSingleTest(RandomizedRunner.java:825)
[junit4:junit4]    > 	at com.carrotsearch.randomizedtesting.RandomizedRunner.access$700(RandomizedRunner.java:132)
[junit4:junit4]    > 	at com.carrotsearch.randomizedtesting.RandomizedRunner$3$1.run(RandomizedRunner.java:671)
[junit4:junit4]    > 	at com.carrotsearch.randomizedtesting.RandomizedRunner$3.evaluate(RandomizedRunner.java:697)
[junit4:junit4]    > 	at com.carrotsearch.randomizedtesting.RandomizedRunner$4.evaluate(RandomizedRunner.java:736)
[junit4:junit4]    > 	at com.carrotsearch.randomizedtesting.RandomizedRunner$5.evaluate(RandomizedRunner.java:747)
[junit4:junit4]    > 	at com.carrotsearch.randomizedtesting.rules.SystemPropertiesRestoreRule$1.evaluate(SystemPropertiesRestoreRule.java:53)
[junit4:junit4]    > 	at org.apache.lucene.util.AbstractBeforeAfterRule$1.evaluate(AbstractBeforeAfterRule.java:45)
[junit4:junit4]    > 	at org.apache.lucene.util.TestRuleReportUncaughtExceptions$1.evaluate(TestRuleReportUncaughtExceptions.java:68)
[junit4:junit4]    > 	at org.apache.lucene.util.TestRuleStoreClassName$1.evaluate(TestRuleStoreClassName.java:38)
[junit4:junit4]    > 	at com.carrotsearch.randomizedtesting.rules.SystemPropertiesInvariantRule$1.evaluate(SystemPropertiesInvariantRule.java:55)
[junit4:junit4]    > 	at org.apache.lucene.util.TestRuleNoInstanceHooksOverrides$1.evaluate(TestRuleNoInstanceHooksOverrides.java:53)
[junit4:junit4]    > 	at org.apache.lucene.util.TestRuleNoStaticHooksShadowing$1.evaluate(TestRuleNoStaticHooksShadowing.java:52)
[junit4:junit4]    > 	at org.apache.lucene.util.TestRuleAssertionsRequired$1.evaluate(TestRuleAssertionsRequired.java:36)
[junit4:junit4]    > 	at org.apache.lucene.util.TestRuleMarkFailure$1.evaluate(TestRuleMarkFailure.java:48)
[junit4:junit4]    > 	at org.apache.lucene.util.TestRuleIgnoreAfterMaxFailures$1.evaluate(TestRuleIgnoreAfterMaxFailures.java:70)
[junit4:junit4]    > 	at org.apache.lucene.util.TestRuleIgnoreTestSuites$1.evaluate(TestRuleIgnoreTestSuites.java:55)
[junit4:junit4]    > 	at com.carrotsearch.randomizedtesting.RandomizedRunner.runSuite(RandomizedRunner.java:605)
[junit4:junit4]    > 	at com.carrotsearch.randomizedtesting.RandomizedRunner.access$400(RandomizedRunner.java:132)
[junit4:junit4]    > 	at com.carrotsearch.randomizedtesting.RandomizedRunner$2.run(RandomizedRunner.java:551)
[junit4:junit4]    > 
[junit4:junit4]   2> 1 T940 oas.SolrTestCaseJ4.setUp ###Starting testDistribSearch
[junit4:junit4]   2> 2 T940 oejs.Server.doStart jetty-8.1.2.v20120308
[junit4:junit4]   2> 6 T940 oejs.AbstractConnector.doStart Started SocketConnector@0.0.0.0:37968
[junit4:junit4]   2> 6 T940 oasc.SolrResourceLoader.locateSolrHome JNDI not configured for solr (NoInitialContextEx)
[junit4:junit4]   2> 7 T940 oasc.SolrResourceLoader.locateSolrHome using system property solr.solr.home: /mnt/ssd/jenkins/workspace/Lucene-Solr-4.x-Linux/checkout/solr/build/solr-core/test-files/solr
[junit4:junit4]   2> 7 T940 oasc.SolrResourceLoader.<init> new SolrResourceLoader for deduced Solr Home: '/mnt/ssd/jenkins/workspace/Lucene-Solr-4.x-Linux/checkout/solr/build/solr-core/test-files/solr/'
[junit4:junit4]   2> 13 T940 oass.SolrDispatchFilter.init SolrDispatchFilter.init()
[junit4:junit4]   2> 13 T940 oasc.SolrResourceLoader.locateSolrHome JNDI not configured for solr (NoInitialContextEx)
[junit4:junit4]   2> 13 T940 oasc.SolrResourceLoader.locateSolrHome using system property solr.solr.home: /mnt/ssd/jenkins/workspace/Lucene-Solr-4.x-Linux/checkout/solr/build/solr-core/test-files/solr
[junit4:junit4]   2> 13 T940 oasc.CoreContainer$Initializer.initialize looking for solr.xml: /mnt/ssd/jenkins/workspace/Lucene-Solr-4.x-Linux/checkout/solr/build/solr-core/test-files/solr/solr.xml
[junit4:junit4]   2> 13 T940 oasc.CoreContainer.<init> New CoreContainer 14192831
[junit4:junit4]   2> 14 T940 oasc.CoreContainer.load Loading CoreContainer using Solr Home: '/mnt/ssd/jenkins/workspace/Lucene-Solr-4.x-Linux/checkout/solr/build/solr-core/test-files/solr/'
[junit4:junit4]   2> 14 T940 oasc.SolrResourceLoader.<init> new SolrResourceLoader for directory: '/mnt/ssd/jenkins/workspace/Lucene-Solr-4.x-Linux/checkout/solr/build/solr-core/test-files/solr/'
[junit4:junit4]   2> 22 T940 oasc.CoreContainer.load Registering Log Listener
[junit4:junit4]   2> 41 T940 oasc.CoreContainer.create Creating SolrCore 'collection1' using instanceDir: /mnt/ssd/jenkins/workspace/Lucene-Solr-4.x-Linux/checkout/solr/build/solr-core/test-files/solr/collection1
[junit4:junit4]   2> 41 T940 oasc.SolrResourceLoader.<init> new SolrResourceLoader for directory: '/mnt/ssd/jenkins/workspace/Lucene-Solr-4.x-Linux/checkout/solr/build/solr-core/test-files/solr/collection1/'
[junit4:junit4]   2> 42 T940 oasc.SolrResourceLoader.replaceClassLoader Adding 'file:/mnt/ssd/jenkins/workspace/Lucene-Solr-4.x-Linux/checkout/solr/build/solr-core/test-files/solr/collection1/lib/README' to classloader
[junit4:junit4]   2> 42 T940 oasc.SolrResourceLoader.replaceClassLoader Adding 'file:/mnt/ssd/jenkins/workspace/Lucene-Solr-4.x-Linux/checkout/solr/build/solr-core/test-files/solr/collection1/lib/classes/' to classloader
[junit4:junit4]   2> 59 T940 oasc.SolrConfig.<init> Using Lucene MatchVersion: LUCENE_40
[junit4:junit4]   2> 108 T940 oasc.SolrConfig.<init> Loaded SolrConfig: solrconfig-elevate.xml
[junit4:junit4]   2> 108 T940 oass.IndexSchema.readSchema Reading Solr Schema
[junit4:junit4]   2> 111 T940 oass.IndexSchema.readSchema Schema name=example
[junit4:junit4]   2> 281 T940 oass.IndexSchema.readSchema default search field in schema is text
[junit4:junit4]   2> 283 T940 oass.IndexSchema.readSchema unique key field: id
[junit4:junit4]   2> 302 T940 oasc.SolrCore.<init> [collection1] Opening new SolrCore at /mnt/ssd/jenkins/workspace/Lucene-Solr-4.x-Linux/checkout/solr/build/solr-core/test-files/solr/collection1/, dataDir=./org.apache.solr.handler.component.DistributedQueryElevationComponentTest-1343983313757/control/data/
[junit4:junit4]   2> 302 T940 oasc.JmxMonitoredMap.<init> JMX monitoring is enabled. Adding Solr mbeans to JMX Server: com.sun.jmx.mbeanserver.JmxMBeanServer@1eefc33
[junit4:junit4]   2> 302 T940 oasc.SolrCore.getNewIndexDir WARNING New index directory detected: old=null new=./org.apache.solr.handler.component.DistributedQueryElevationComponentTest-1343983313757/control/data/index/
[junit4:junit4]   2> 303 T940 oasc.SolrCore.initIndex WARNING [collection1] Solr index directory './org.apache.solr.handler.component.DistributedQueryElevationComponentTest-1343983313757/control/data/index' doesn't exist. Creating new index...
[junit4:junit4]   2> 305 T940 oasc.SolrDeletionPolicy.onCommit SolrDeletionPolicy.onCommit: commits:num=1
[junit4:junit4]   2> 		commit{dir=MockDirWrapper(org.apache.lucene.store.RAMDirectory@1d2bafa lockFactory=org.apache.lucene.store.SingleInstanceLockFactory@62c4d8),segFN=segments_1,generation=1,filenames=[segments_1]
[junit4:junit4]   2> 305 T940 oasc.SolrDeletionPolicy.updateCommits newest commit = 1
[junit4:junit4]   2> 309 T940 oasc.RequestHandlers.initHandlersFromConfig created /update: solr.UpdateRequestHandler
[junit4:junit4]   2> 309 T940 oasc.RequestHandlers.initHandlersFromConfig created /elevate: org.apache.solr.handler.component.SearchHandler
[junit4:junit4]   2> 310 T940 oasc.RequestHandlers.initHandlersFromConfig created /dataElevate: org.apache.solr.handler.component.SearchHandler
[junit4:junit4]   2> 311 T940 oashl.XMLLoader.init xsltCacheLifetimeSeconds=60
[junit4:junit4]   2> 311 T940 oasc.RequestHandlers.initHandlersFromConfig WARNING no default request handler is registered (either '/select' or 'standard')
[junit4:junit4]   2> 312 T940 oasc.SolrCore.initDeprecatedSupport WARNING solrconfig.xml uses deprecated <admin/gettableFiles>, Please update your config to use the ShowFileRequestHandler.
[junit4:junit4]   2> 313 T940 oasc.SolrCore.initDeprecatedSupport WARNING adding ShowFileRequestHandler with hidden files: [SOLRCONFIG-REPEATER.XML, SCHEMA-SIM.XML, BAD-SCHEMA-UNIQUEKEY-MULTIVALUED.XML, STEMDICT.TXT, MAPPING-ISOLATIN1ACCENT.TXT, BAD-SCHEMA-NOT-INDEXED-BUT-TF.XML, CONDITIONAL.UPDATEPROCESSOR.JS, SCHEMA-COLLATEFILTER.XML, SCHEMA-IB.XML, SOLRCONFIG-ENABLEPLUGIN.XML, SOLRCONFIG_CODEC.XML, BAD-SCHEMA-EXTERNAL-FILEFIELD.XML, SOLRCONFIG-ALTDIRECTORY.XML, SCHEMA12.XML, OPEN-EXCHANGE-RATES.JSON, SOLRCONFIG-LAZYWRITER.XML, SCHEMA-DFR.XML, STOPWORDS.TXT, BAD-SCHEMA-DUP-FIELDTYPE.XML, BAD-SCHEMA-NONTEXT-ANALYZER.XML, BAD-SCHEMA-NOT-INDEXED-BUT-POS.XML, SOLRCONFIG-BASIC.XML, STOP-SNOWBALL.TXT, SCHEMASURROUND.XML, DA_UTF8.XML, SCHEMA-PHRASESUGGEST.XML, STOP-2.TXT, WDFTYPES.TXT, SOLRCONFIG-XINCLUDE.XML, BAD-SCHEMA-NOT-INDEXED-BUT-NORMS.XML, SCHEMA-TFIDF.XML, SYNONYMS.TXT, SCHEMA-COPYFIELD-TEST.XML, SOLRCONFIG-MASTER3.XML, STOPTYPES-2.TXT, KEEP-2.TXT, SOLRCONFIG-SCRIPT-UPDATEPROCESSOR.XML, SOLRCONFIG-CACHING.XML, BAD-SOLRCONFIG-INVALID-SCRIPTFILE.XML, OLD_SYNONYMS.TXT, SCHEMA-REPLICATION1.XML, SOLRCONFIG-TRANSFORMERS.XML, BAD-SCHEMA-DUP-DYNAMICFIELD.XML, SOLRCONFIG-DELPOLICY1.XML, HUNSPELL-TEST.AFF, SOLRCONFIG-TERMINDEX.XML, SCHEMA-COLLATE.XML, SOLRCONFIG-MASTER1-KEEPONEBACKUP.XML, KEEP-1.TXT, SCHEMA_CODEC.XML, HYPHENATION.DTD, THROW.ERROR.ON.ADD.UPDATEPROCESSOR.JS, MISSLEADING.EXTENSION.UPDATEPROCESSOR.JS.TXT, SOLRCONFIG-UPDATE-PROCESSOR-CHAINS.XML, SCHEMA-MINIMAL.XML, SOLRCONFIG-PROPINJECT.XML, COMPOUNDDICTIONARY.TXT, SOLRCONFIG-FUNCTIONQUERY.XML, SOLRCONFIG-MASTER2.XML, SOLRCONFIG-QUERYSENDER.XML, BAD-SCHEMA-SIM-GLOBAL-VS-FT-MISMATCH.XML, TRIVIAL.UPDATEPROCESSOR1.JS, BAD-SCHEMA-UNIQUEKEY-USES-DEFAULT.XML, SCHEMA-NUMERIC.XML, HUNSPELL-TEST.DIC, SCHEMA-TRIE.XML, BAD-SCHEMA-CODEC-GLOBAL-VS-FT-MISMATCH.XML, SOLRCONFIG-SPELLCHECKER.XML, SOLRCONFIG-SLAVE.XML, BAD-SCHEMA-DUP-FIELD.XML, BAD-SCHEMA-OMIT-TF-BUT-NOT-POS.XML, SOLRCONFIG-MASTER.XML, SCHEMA-CHARFILTERS.XML, SOLRCONFIG-PHRASESUGGEST.XML, SOLRCONFIG-SOLR-749.XML, SCHEMA-LMJELINEKMERCER.XML, BAD-SCHEMA-UNIQUEKEY-IS-COPYFIELD-DEST.XML, SCHEMA-SPELLCHECKER.XML, SOLRCONFIG-QUERYSENDER-NOQUERY.XML, SOLRCONFIG-MASTER1.XML, STOP-1.TXT, SOLRCONFIG-SOLCOREPROPERTIES.XML, SOLRCONFIG-REQHANDLER.INCL, MISSING.FUNCTIONS.UPDATEPROCESSOR.JS, TRIVIAL.UPDATEPROCESSOR0.JS, SCHEMA-FOLDING.XML, SOLRCONFIG-DELPOLICY2.XML, SCHEMA-LMDIRICHLET.XML, BAD_SOLRCONFIG.XML, BAD-SOLRCONFIG-MISSING-SCRIPTFILE.XML, SOLRCONFIG-MERGEPOLICY.XML, SCHEMA15.XML, SOLRCONFIG-NATIVELOCK.XML, ADDFIELDS.UPDATEPROCESSOR.JS, SOLRCONFIG-TLOG.XML, SCHEMA-STOP-KEEP.XML, CURRENCY.XML, SCHEMA-REVERSED.XML, BAD-SOLRCONFIG-BOGUS-SCRIPTENGINE-NAME.XML, SCHEMA-BM25.XML, PROTWORDS.TXT, SCHEMA-LUCENEMATCHVERSION.XML, BAD-SCHEMA-ANALYZER-CLASS-AND-NESTED.XML, SOLRCONFIG-PROPINJECT-INDEXDEFAULT.XML, SOLRCONFIG_PERF.XML, SCHEMA11.XML, ELEVATE.XML, SOLRCONFIG-HIGHLIGHT.XML, SOLRCONFIG-SLAVE1.XML, SCHEMA-REPLICATION2.XML, DA_COMPOUNDDICTIONARY.TXT, PHRASESUGGEST.TXT, SOLRCONFIG-ELEVATE.XML, XSLT, SOLRCONFIG-NOCACHE.XML, SCHEMA-NOT-REQUIRED-UNIQUE-KEY.XML, SCHEMA.XML, FRENCHARTICLES.TXT, SOLRCONFIG-SIMPLELOCK.XML, STOPWITHBOM.TXT, SCHEMA-REQUIRED-FIELDS.XML, SCHEMA-BINARYFIELD.XML, STOPTYPES-1.TXT, SOLRCONFIG-SPELLCHECKCOMPONENT.XML, SOLRCONFIG-BASIC-LUCENEVERSION31.XML, BAD-MP-SOLRCONFIG.XML, STOPWORDSWRONGENCODING.TXT]
[junit4:junit4]   2> 316 T940 oass.SolrIndexSearcher.<init> Opening Searcher@17dd39 main
[junit4:junit4]   2> 316 T940 oass.SolrIndexSearcher.getIndexDir WARNING WARNING: Directory impl does not support setting indexDir: org.apache.lucene.store.MockDirectoryWrapper
[junit4:junit4]   2> 316 T940 oasu.CommitTracker.<init> Hard AutoCommit: disabled
[junit4:junit4]   2> 317 T940 oasu.CommitTracker.<init> Soft AutoCommit: disabled
[junit4:junit4]   2> 318 T940 oashc.QueryElevationComponent.inform Loading QueryElevation from: /mnt/ssd/jenkins/workspace/Lucene-Solr-4.x-Linux/checkout/solr/build/solr-core/test-files/solr/collection1/conf/elevate.xml
[junit4:junit4]   2> 327 T940 oashc.QueryElevationComponent.inform Loading QueryElevation from: /mnt/ssd/jenkins/workspace/Lucene-Solr-4.x-Linux/checkout/solr/build/solr-core/test-files/solr/collection1/conf/elevate.xml
[junit4:junit4]   2> 334 T940 oashc.HttpShardHandlerFactory.getParameter Setting socketTimeout to: 0
[junit4:junit4]   2> 334 T940 oashc.HttpShardHandlerFactory.getParameter Setting urlScheme to: http://
[junit4:junit4]   2> 335 T940 oashc.HttpShardHandlerFactory.getParameter Setting connTimeout to: 0
[junit4:junit4]   2> 335 T940 oashc.HttpShardHandlerFactory.getParameter Setting maxConnectionsPerHost to: 20
[junit4:junit4]   2> 335 T940 oashc.HttpShardHandlerFactory.getParameter Setting corePoolSize to: 0
[junit4:junit4]   2> 335 T940 oashc.HttpShardHandlerFactory.getParameter Setting maximumPoolSize to: 2147483647
[junit4:junit4]   2> 336 T940 oashc.HttpShardHandlerFactory.getParameter Setting maxThreadIdleTime to: 5
[junit4:junit4]   2> 336 T940 oashc.HttpShardHandlerFactory.getParameter Setting sizeOfQueue to: -1
[junit4:junit4]   2> 336 T940 oashc.HttpShardHandlerFactory.getParameter Setting fairnessPolicy to: false
[junit4:junit4]   2> 337 T940 oascsi.HttpClientUtil.createClient Creating new http client, config:maxConnectionsPerHost=20&maxConnections=10000&socketTimeout=0&connTimeout=0&retry=false
[junit4:junit4]   2> 340 T950 oasc.SolrCore.registerSearcher [collection1] Registered new searcher Searcher@17dd39 main{StandardDirectoryReader(segments_1:1)}
[junit4:junit4]   2> 340 T940 oasc.CoreContainer.register registering core: collection1
[junit4:junit4]   2> 341 T940 oass.SolrDispatchFilter.init user.dir=/mnt/ssd/jenkins/workspace/Lucene-Solr-4.x-Linux/checkout/solr/build/solr-core/test/J1
[junit4:junit4]   2> 341 T940 oass.SolrDispatchFilter.init SolrDispatchFilter.init() done
[junit4:junit4]   2> 342 T940 oascsi.HttpClientUtil.createClient Creating new http client, config:maxConnections=128&maxConnectionsPerHost=32&followRedirects=false
[junit4:junit4]   2> 345 T940 oejs.Server.doStart jetty-8.1.2.v20120308
[junit4:junit4]   2> 347 T940 oejs.AbstractConnector.doStart Started SocketConnector@0.0.0.0:50485
[junit4:junit4]   2> 347 T940 oasc.SolrResourceLoader.locateSolrHome JNDI not configured for solr (NoInitialContextEx)
[junit4:junit4]   2> 347 T940 oasc.SolrResourceLoader.locateSolrHome using system property solr.solr.home: /mnt/ssd/jenkins/workspace/Lucene-Solr-4.x-Linux/checkout/solr/build/solr-core/test-files/solr
[junit4:junit4]   2> 348 T940 oasc.SolrResourceLoader.<init> new SolrResourceLoader for deduced Solr Home: '/mnt/ssd/jenkins/workspace/Lucene-Solr-4.x-Linux/checkout/solr/build/solr-core/test-files/solr/'
[junit4:junit4]   2> 367 T940 oass.SolrDispatchFilter.init SolrDispatchFilter.init()
[junit4:junit4]   2> 367 T940 oasc.SolrResourceLoader.locateSolrHome JNDI not configured for solr (NoInitialContextEx)
[junit4:junit4]   2> 367 T940 oasc.SolrResourceLoader.locateSolrHome using system property solr.solr.home: /mnt/ssd/jenkins/workspace/Lucene-Solr-4.x-Linux/checkout/solr/build/solr-core/test-files/solr
[junit4:junit4]   2> 367 T940 oasc.CoreContainer$Initializer.initialize looking for solr.xml: /mnt/ssd/jenkins/workspace/Lucene-Solr-4.x-Linux/checkout/solr/build/solr-core/test-files/solr/solr.xml
[junit4:junit4]   2> 368 T940 oasc.CoreContainer.<init> New CoreContainer 19081523
[junit4:junit4]   2> 368 T940 oasc.CoreContainer.load Loading CoreContainer using Solr Home: '/mnt/ssd/jenkins/workspace/Lucene-Solr-4.x-Linux/checkout/solr/build/solr-core/test-files/solr/'
[junit4:junit4]   2> 368 T940 oasc.SolrResourceLoader.<init> new SolrResourceLoader for directory: '/mnt/ssd/jenkins/workspace/Lucene-Solr-4.x-Linux/checkout/solr/build/solr-core/test-files/solr/'
[junit4:junit4]   2> 376 T940 oasc.CoreContainer.load Registering Log Listener
[junit4:junit4]   2> 385 T940 oasc.CoreContainer.create Creating SolrCore 'collection1' using instanceDir: /mnt/ssd/jenkins/workspace/Lucene-Solr-4.x-Linux/checkout/solr/build/solr-core/test-files/solr/collection1
[junit4:junit4]   2> 385 T940 oasc.SolrResourceLoader.<init> new SolrResourceLoader for directory: '/mnt/ssd/jenkins/workspace/Lucene-Solr-4.x-Linux/checkout/solr/build/solr-core/test-files/solr/collection1/'
[junit4:junit4]   2> 385 T940 oasc.SolrResourceLoader.replaceClassLoader Adding 'file:/mnt/ssd/jenkins/workspace/Lucene-Solr-4.x-Linux/checkout/solr/build/solr-core/test-files/solr/collection1/lib/README' to classloader
[junit4:junit4]   2> 386 T940 oasc.SolrResourceLoader.replaceClassLoader Adding 'file:/mnt/ssd/jenkins/workspace/Lucene-Solr-4.x-Linux/checkout/solr/build/solr-core/test-files/solr/collection1/lib/classes/' to classloader
[junit4:junit4]   2> 413 T940 oasc.SolrConfig.<init> Using Lucene MatchVersion: LUCENE_40
[junit4:junit4]   2> 456 T940 oasc.SolrConfig.<init> Loaded SolrConfig: solrconfig-elevate.xml
[junit4:junit4]   2> 456 T940 oass.IndexSchema.readSchema Reading Solr Schema
[junit4:junit4]   2> 458 T940 oass.IndexSchema.readSchema Schema name=example
[junit4:junit4]   2> 620 T940 oass.IndexSchema.readSchema default search field in schema is text
[junit4:junit4]   2> 622 T940 oass.IndexSchema.readSchema unique key field: id
[junit4:junit4]   2> 624 T940 oasc.SolrCore.<init> [collection1] Opening new SolrCore at /mnt/ssd/jenkins/workspace/Lucene-Solr-4.x-Linux/checkout/solr/build/solr-core/test-files/solr/collection1/, dataDir=./org.apache.solr.handler.component.DistributedQueryElevationComponentTest-1343983313757/shard0/data/
[junit4:junit4]   2> 624 T940 oasc.JmxMonitoredMap.<init> JMX monitoring is enabled. Adding Solr mbeans to JMX Server: com.sun.jmx.mbeanserver.JmxMBeanServer@1eefc33
[junit4:junit4]   2> 624 T940 oasc.SolrCore.getNewIndexDir WARNING New index directory detected: old=null new=./org.apache.solr.handler.component.DistributedQueryElevationComponentTest-1343983313757/shard0/data/index/
[junit4:junit4]   2> 625 T940 oasc.SolrCore.initIndex WARNING [collection1] Solr index directory './org.apache.solr.handler.component.DistributedQueryElevationComponentTest-1343983313757/shard0/data/index' doesn't exist. Creating new index...
[junit4:junit4]   2> 626 T940 oasc.SolrDeletionPolicy.onCommit SolrDeletionPolicy.onCommit: commits:num=1
[junit4:junit4]   2> 		commit{dir=MockDirWrapper(org.apache.lucene.store.RAMDirectory@210787 lockFactory=org.apache.lucene.store.SingleInstanceLockFactory@31b627),segFN=segments_1,generation=1,filenames=[segments_1]
[junit4:junit4]   2> 626 T940 oasc.SolrDeletionPolicy.updateCommits newest commit = 1
[junit4:junit4]   2> 626 T940 oasc.RequestHandlers.initHandlersFromConfig created /update: solr.UpdateRequestHandler
[junit4:junit4]   2> 627 T940 oasc.RequestHandlers.initHandlersFromConfig created /elevate: org.apache.solr.handler.component.SearchHandler
[junit4:junit4]   2> 627 T940 oasc.RequestHandlers.initHandlersFromConfig created /dataElevate: org.apache.solr.handler.component.SearchHandler
[junit4:junit4]   2> 627 T940 oashl.XMLLoader.init xsltCacheLifetimeSeconds=60
[junit4:junit4]   2> 628 T940 oasc.RequestHandlers.initHandlersFromConfig WARNING no default request handler is registered (either '/select' or 'standard')
[junit4:junit4]   2> 628 T940 oasc.SolrCore.initDeprecatedSupport WARNING solrconfig.xml uses deprecated <admin/gettableFiles>, Please update your config to use the ShowFileRequestHandler.
[junit4:junit4]   2> 629 T940 oasc.SolrCore.initDeprecatedSupport WARNING adding ShowFileRequestHandler with hidden files: [SOLRCONFIG-REPEATER.XML, SCHEMA-SIM.XML, BAD-SCHEMA-UNIQUEKEY-MULTIVALUED.XML, STEMDICT.TXT, MAPPING-ISOLATIN1ACCENT.TXT, BAD-SCHEMA-NOT-INDEXED-BUT-TF.XML, CONDITIONAL.UPDATEPROCESSOR.JS, SCHEMA-COLLATEFILTER.XML, SCHEMA-IB.XML, SOLRCONFIG-ENABLEPLUGIN.XML, SOLRCONFIG_CODEC.XML, BAD-SCHEMA-EXTERNAL-FILEFIELD.XML, SOLRCONFIG-ALTDIRECTORY.XML, SCHEMA12.XML, OPEN-EXCHANGE-RATES.JSON, SOLRCONFIG-LAZYWRITER.XML, SCHEMA-DFR.XML, STOPWORDS.TXT, BAD-SCHEMA-DUP-FIELDTYPE.XML, BAD-SCHEMA-NONTEXT-ANALYZER.XML, BAD-SCHEMA-NOT-INDEXED-BUT-POS.XML, SOLRCONFIG-BASIC.XML, STOP-SNOWBALL.TXT, SCHEMASURROUND.XML, DA_UTF8.XML, SCHEMA-PHRASESUGGEST.XML, STOP-2.TXT, WDFTYPES.TXT, SOLRCONFIG-XINCLUDE.XML, BAD-SCHEMA-NOT-INDEXED-BUT-NORMS.XML, SCHEMA-TFIDF.XML, SYNONYMS.TXT, SCHEMA-COPYFIELD-TEST.XML, SOLRCONFIG-MASTER3.XML, STOPTYPES-2.TXT, KEEP-2.TXT, SOLRCONFIG-SCRIPT-UPDATEPROCESSOR.XML, SOLRCONFIG-CACHING.XML, BAD-SOLRCONFIG-INVALID-SCRIPTFILE.XML, OLD_SYNONYMS.TXT, SCHEMA-REPLICATION1.XML, SOLRCONFIG-TRANSFORMERS.XML, BAD-SCHEMA-DUP-DYNAMICFIELD.XML, SOLRCONFIG-DELPOLICY1.XML, HUNSPELL-TEST.AFF, SOLRCONFIG-TERMINDEX.XML, SCHEMA-COLLATE.XML, SOLRCONFIG-MASTER1-KEEPONEBACKUP.XML, KEEP-1.TXT, SCHEMA_CODEC.XML, HYPHENATION.DTD, THROW.ERROR.ON.ADD.UPDATEPROCESSOR.JS, MISSLEADING.EXTENSION.UPDATEPROCESSOR.JS.TXT, SOLRCONFIG-UPDATE-PROCESSOR-CHAINS.XML, SCHEMA-MINIMAL.XML, SOLRCONFIG-PROPINJECT.XML, COMPOUNDDICTIONARY.TXT, SOLRCONFIG-FUNCTIONQUERY.XML, SOLRCONFIG-MASTER2.XML, SOLRCONFIG-QUERYSENDER.XML, BAD-SCHEMA-SIM-GLOBAL-VS-FT-MISMATCH.XML, TRIVIAL.UPDATEPROCESSOR1.JS, BAD-SCHEMA-UNIQUEKEY-USES-DEFAULT.XML, SCHEMA-NUMERIC.XML, HUNSPELL-TEST.DIC, SCHEMA-TRIE.XML, BAD-SCHEMA-CODEC-GLOBAL-VS-FT-MISMATCH.XML, SOLRCONFIG-SPELLCHECKER.XML, SOLRCONFIG-SLAVE.XML, BAD-SCHEMA-DUP-FIELD.XML, BAD-SCHEMA-OMIT-TF-BUT-NOT-POS.XML, SOLRCONFIG-MASTER.XML, SCHEMA-CHARFILTERS.XML, SOLRCONFIG-PHRASESUGGEST.XML, SOLRCONFIG-SOLR-749.XML, SCHEMA-LMJELINEKMERCER.XML, BAD-SCHEMA-UNIQUEKEY-IS-COPYFIELD-DEST.XML, SCHEMA-SPELLCHECKER.XML, SOLRCONFIG-QUERYSENDER-NOQUERY.XML, SOLRCONFIG-MASTER1.XML, STOP-1.TXT, SOLRCONFIG-SOLCOREPROPERTIES.XML, SOLRCONFIG-REQHANDLER.INCL, MISSING.FUNCTIONS.UPDATEPROCESSOR.JS, TRIVIAL.UPDATEPROCESSOR0.JS, SCHEMA-FOLDING.XML, SOLRCONFIG-DELPOLICY2.XML, SCHEMA-LMDIRICHLET.XML, BAD_SOLRCONFIG.XML, BAD-SOLRCONFIG-MISSING-SCRIPTFILE.XML, SOLRCONFIG-MERGEPOLICY.XML, SCHEMA15.XML, SOLRCONFIG-NATIVELOCK.XML, ADDFIELDS.UPDATEPROCESSOR.JS, SOLRCONFIG-TLOG.XML, SCHEMA-STOP-KEEP.XML, CURRENCY.XML, SCHEMA-REVERSED.XML, BAD-SOLRCONFIG-BOGUS-SCRIPTENGINE-NAME.XML, SCHEMA-BM25.XML, PROTWORDS.TXT, SCHEMA-LUCENEMATCHVERSION.XML, BAD-SCHEMA-ANALYZER-CLASS-AND-NESTED.XML, SOLRCONFIG-PROPINJECT-INDEXDEFAULT.XML, SOLRCONFIG_PERF.XML, SCHEMA11.XML, ELEVATE.XML, SOLRCONFIG-HIGHLIGHT.XML, SOLRCONFIG-SLAVE1.XML, SCHEMA-REPLICATION2.XML, DA_COMPOUNDDICTIONARY.TXT, PHRASESUGGEST.TXT, SOLRCONFIG-ELEVATE.XML, XSLT, SOLRCONFIG-NOCACHE.XML, SCHEMA-NOT-REQUIRED-UNIQUE-KEY.XML, SCHEMA.XML, FRENCHARTICLES.TXT, SOLRCONFIG-SIMPLELOCK.XML, STOPWITHBOM.TXT, SCHEMA-REQUIRED-FIELDS.XML, SCHEMA-BINARYFIELD.XML, STOPTYPES-1.TXT, SOLRCONFIG-SPELLCHECKCOMPONENT.XML, SOLRCONFIG-BASIC-LUCENEVERSION31.XML, BAD-MP-SOLRCONFIG.XML, STOPWORDSWRONGENCODING.TXT]
[junit4:junit4]   2> 630 T940 oass.SolrIndexSearcher.<init> Opening Searcher@1c228d5 main
[junit4:junit4]   2> 631 T940 oass.SolrIndexSearcher.getIndexDir WARNING WARNING: Directory impl does not support setting indexDir: org.apache.lucene.store.MockDirectoryWrapper
[junit4:junit4]   2> 631 T940 oasu.CommitTracker.<init> Hard AutoCommit: disabled
[junit4:junit4]   2> 631 T940 oasu.CommitTracker.<init> Soft AutoCommit: disabled
[junit4:junit4]   2> 631 T940 oashc.QueryElevationComponent.inform Loading QueryElevation from: /mnt/ssd/jenkins/workspace/Lucene-Solr-4.x-Linux/checkout/solr/build/solr-core/test-files/solr/collection1/conf/elevate.xml
[junit4:junit4]   2> 636 T940 oashc.QueryElevationComponent.inform Loading QueryElevation from: /mnt/ssd/jenkins/workspace/Lucene-Solr-4.x-Linux/checkout/solr/build/solr-core/test-files/solr/collection1/conf/elevate.xml
[junit4:junit4]   2> 656 T940 oashc.HttpShardHandlerFactory.getParameter Setting socketTimeout to: 0
[junit4:junit4]   2> 656 T940 oashc.HttpShardHandlerFactory.getParameter Setting urlScheme to: http://
[junit4:junit4]   2> 656 T940 oashc.HttpShardHandlerFactory.getParameter Setting connTimeout to: 0
[junit4:junit4]   2> 656 T940 oashc.HttpShardHandlerFactory.getParameter Setting maxConnectionsPerHost to: 20
[junit4:junit4]   2> 657 T940 oashc.HttpShardHandlerFactory.getParameter Setting corePoolSize to: 0
[junit4:junit4]   2> 657 T940 oashc.HttpShardHandlerFactory.getParameter Setting maximumPoolSize to: 2147483647
[junit4:junit4]   2> 657 T940 oashc.HttpShardHandlerFactory.getParameter Setting maxThreadIdleTime to: 5
[junit4:junit4]   2> 657 T940 oashc.HttpShardHandlerFactory.getParameter Setting sizeOfQueue to: -1
[junit4:junit4]   2> 657 T940 oashc.HttpShardHandlerFactory.getParameter Setting fairnessPolicy to: false
[junit4:junit4]   2> 658 T940 oascsi.HttpClientUtil.createClient Creating new http client, config:maxConnectionsPerHost=20&maxConnections=10000&socketTimeout=0&connTimeout=0&retry=false
[junit4:junit4]   2> 660 T960 oasc.SolrCore.registerSearcher [collection1] Registered new searcher Searcher@1c228d5 main{StandardDirectoryReader(segments_1:1)}
[junit4:junit4]   2> 660 T940 oasc.CoreContainer.register registering core: collection1
[junit4:junit4]   2> 660 T940 oass.SolrDispatchFilter.init user.dir=/mnt/ssd/jenkins/workspace/Lucene-Solr-4.x-Linux/checkout/solr/build/solr-core/test/J1
[junit4:junit4]   2> 660 T940 oass.SolrDispatchFilter.init SolrDispatchFilter.init() done
[junit4:junit4]   2> 660 T940 oascsi.HttpClientUtil.createClient Creating new http client, config:maxConnections=128&maxConnectionsPerHost=32&followRedirects=false
[junit4:junit4]   2> 663 T940 oejs.Server.doStart jetty-8.1.2.v20120308
[junit4:junit4]   2> 664 T940 oejs.AbstractConnector.doStart Started SocketConnector@0.0.0.0:59725
[junit4:junit4]   2> 665 T940 oasc.SolrResourceLoader.locateSolrHome JNDI not configured for solr (NoInitialContextEx)
[junit4:junit4]   2> 665 T940 oasc.SolrResourceLoader.locateSolrHome using system property solr.solr.home: /mnt/ssd/jenkins/workspace/Lucene-Solr-4.x-Linux/checkout/solr/build/solr-core/test-files/solr
[junit4:junit4]   2> 665 T940 oasc.SolrResourceLoader.<init> new SolrResourceLoader for deduced Solr Home: '/mnt/ssd/jenkins/workspace/Lucene-Solr-4.x-Linux/checkout/solr/build/solr-core/test-files/solr/'
[junit4:junit4]   2> 671 T940 oass.SolrDispatchFilter.init SolrDispatchFilter.init()
[junit4:junit4]   2> 671 T940 oasc.SolrResourceLoader.locateSolrHome JNDI not configured for solr (NoInitialContextEx)
[junit4:junit4]   2> 671 T940 oasc.SolrResourceLoader.locateSolrHome using system property solr.solr.home: /mnt/ssd/jenkins/workspace/Lucene-Solr-4.x-Linux/checkout/solr/build/solr-core/test-files/solr
[junit4:junit4]   2> 671 T940 oasc.CoreContainer$Initializer.initialize looking for solr.xml: /mnt/ssd/jenkins/workspace/Lucene-Solr-4.x-Linux/checkout/solr/build/solr-core/test-files/solr/solr.xml
[junit4:junit4]   2> 672 T940 oasc.CoreContainer.<init> New CoreContainer 28878894
[junit4:junit4]   2> 672 T940 oasc.CoreContainer.load Loading CoreContainer using Solr Home: '/mnt/ssd/jenkins/workspace/Lucene-Solr-4.x-Linux/checkout/solr/build/solr-core/test-files/solr/'
[junit4:junit4]   2> 672 T940 oasc.SolrResourceLoader.<init> new SolrResourceLoader for directory: '/mnt/ssd/jenkins/workspace/Lucene-Solr-4.x-Linux/checkout/solr/build/solr-core/test-files/solr/'
[junit4:junit4]   2> 680 T940 oasc.CoreContainer.load Registering Log Listener
[junit4:junit4]   2> 697 T940 oasc.CoreContainer.create Creating SolrCore 'collection1' using instanceDir: /mnt/ssd/jenkins/workspace/Lucene-Solr-4.x-Linux/checkout/solr/build/solr-core/test-files/solr/collection1
[junit4:junit4]   2> 697 T940 oasc.SolrResourceLoader.<init> new SolrResourceLoader for directory: '/mnt/ssd/jenkins/workspace/Lucene-Solr-4.x-Linux/checkout/solr/build/solr-core/test-files/solr/collection1/'
[junit4:junit4]   2> 698 T940 oasc.SolrResourceLoader.replaceClassLoader Adding 'file:/mnt/ssd/jenkins/workspace/Lucene-Solr-4.x-Linux/checkout/solr/build/solr-core/test-files/solr/collection1/lib/README' to classloader
[junit4:junit4]   2> 698 T940 oasc.SolrResourceLoader.replaceClassLoader Adding 'file:/mnt/ssd/jenkins/workspace/Lucene-Solr-4.x-Linux/checkout/solr/build/solr-core/test-files/solr/collection1/lib/classes/' to classloader
[junit4:junit4]   2> 714 T940 oasc.SolrConfig.<init> Using Lucene MatchVersion: LUCENE_40
[junit4:junit4]   2> 765 T940 oasc.SolrConfig.<init> Loaded SolrConfig: solrconfig-elevate.xml
[junit4:junit4]   2> 766 T940 oass.IndexSchema.readSchema Reading Solr Schema
[junit4:junit4]   2> 768 T940 oass.IndexSchema.readSchema Schema name=example
[junit4:junit4]   2> 853 T933 oasc.OverseerCollectionProcessor.run WARNING Overseer cannot talk to ZK
[junit4:junit4]   2> 853 T932 oasc.Overseer$CloudStateUpdater.amILeader WARNING  org.apache.zookeeper.KeeperException$SessionExpiredException: KeeperErrorCode = Session expired for /overseer_elect/leader
[junit4:junit4]   2> 	at org.apache.zookeeper.KeeperException.create(KeeperException.java:118)
[junit4:junit4]   2> 	at org.apache.zookeeper.KeeperException.create(KeeperException.java:42)
[junit4:junit4]   2> 	at org.apache.zookeeper.ZooKeeper.getData(ZooKeeper.java:927)
[junit4:junit4]   2> 	at org.apache.solr.common.cloud.SolrZkClient$7.execute(SolrZkClient.java:289)
[junit4:junit4]   2> 	at org.apache.solr.common.cloud.SolrZkClient$7.execute(SolrZkClient.java:286)
[junit4:junit4]   2> 	at org.apache.solr.common.cloud.ZkCmdExecutor.retryOperation(ZkCmdExecutor.java:67)
[junit4:junit4]   2> 	at org.apache.solr.common.cloud.SolrZkClient.getData(SolrZkClient.java:286)
[junit4:junit4]   2> 	at org.apache.solr.cloud.Overseer$CloudStateUpdater.amILeader(Overseer.java:187)
[junit4:junit4]   2> 	at org.apache.solr.cloud.Overseer$CloudStateUpdater.run(Overseer.java:113)
[junit4:junit4]   2> 	at java.lang.Thread.run(Thread.java:722)
[junit4:junit4]   2> 
[junit4:junit4]   2> 854 T932 oasc.Overseer$CloudStateUpdater.amILeader According to ZK I (id=88079289985662978-serv1:null_solr-n_0000000000) am no longer a leader.
[junit4:junit4]   2> 918 T940 oass.IndexSchema.readSchema default search field in schema is text
[junit4:junit4]   2> 920 T940 oass.IndexSchema.readSchema unique key field: id
[junit4:junit4]   2> 922 T940 oasc.SolrCore.<init> [collection1] Opening new SolrCore at /mnt/ssd/jenkins/workspace/Lucene-Solr-4.x-Linux/checkout/solr/build/solr-core/test-files/solr/collection1/, dataDir=./org.apache.solr.handler.component.DistributedQueryElevationComponentTest-1343983313757/shard1/data/
[junit4:junit4]   2> 922 T940 oasc.JmxMonitoredMap.<init> JMX monitoring is enabled. Adding Solr mbeans to JMX Server: com.sun.jmx.mbeanserver.JmxMBeanServer@1eefc33
[junit4:junit4]   2> 922 T940 oasc.SolrCore.getNewIndexDir WARNING New index directory detected: old=null new=./org.apache.solr.handler.component.DistributedQueryElevationComponentTest-1343983313757/shard1/data/index/
[junit4:junit4]   2> 923 T940 oasc.SolrCore.initIndex WARNING [collection1] Solr index directory './org.apache.solr.handler.component.DistributedQueryElevationComponentTest-1343983313757/shard1/data/index' doesn't exist. Creating new index...
[junit4:junit4]   2> 924 T940 oasc.SolrDeletionPolicy.onCommit SolrDeletionPolicy.onCommit: commits:num=1
[junit4:junit4]   2> 		commit{dir=MockDirWrapper(org.apache.lucene.store.RAMDirectory@693607 lockFactory=org.apache.lucene.store.SingleInstanceLockFactory@813908),segFN=segments_1,generation=1,filenames=[segments_1]
[junit4:junit4]   2> 924 T940 oasc.SolrDeletionPolicy.updateCommits newest commit = 1
[junit4:junit4]   2> 925 T940 oasc.RequestHandlers.initHandlersFromConfig created /update: solr.UpdateRequestHandler
[junit4:junit4]   2> 925 T940 oasc.RequestHandlers.initHandlersFromConfig created /elevate: org.apache.solr.handler.component.SearchHandler
[junit4:junit4]   2> 925 T940 oasc.RequestHandlers.initHandlersFromConfig created /dataElevate: org.apache.solr.handler.component.SearchHandler
[junit4:junit4]   2> 925 T940 oashl.XMLLoader.init xsltCacheLifetimeSeconds=60
[junit4:junit4]   2> 926 T940 oasc.RequestHandlers.initHandlersFromConfig WARNING no default request handler is registered (either '/select' or 'standard')
[junit4:junit4]   2> 926 T940 oasc.SolrCore.initDeprecatedSupport WARNING solrconfig.xml uses deprecated <admin/gettableFiles>, Please update your config to use the ShowFileRequestHandler.
[junit4:junit4]   2> 927 T940 oasc.SolrCore.initDeprecatedSupport WARNING adding ShowFileRequestHandler with hidden files: [SOLRCONFIG-REPEATER.XML, SCHEMA-SIM.XML, BAD-SCHEMA-UNIQUEKEY-MULTIVALUED.XML, STEMDICT.TXT, MAPPING-ISOLATIN1ACCENT.TXT, BAD-SCHEMA-NOT-INDEXED-BUT-TF.XML, CONDITIONAL.UPDATEPROCESSOR.JS, SCHEMA-COLLATEFILTER.XML, SCHEMA-IB.XML, SOLRCONFIG-ENABLEPLUGIN.XML, SOLRCONFIG_CODEC.XML, BAD-SCHEMA-EXTERNAL-FILEFIELD.XML, SOLRCONFIG-ALTDIRECTORY.XML, SCHEMA12.XML, OPEN-EXCHANGE-RATES.JSON, SOLRCONFIG-LAZYWRITER.XML, SCHEMA-DFR.XML, STOPWORDS.TXT, BAD-SCHEMA-DUP-FIELDTYPE.XML, BAD-SCHEMA-NONTEXT-ANALYZER.XML, BAD-SCHEMA-NOT-INDEXED-BUT-POS.XML, SOLRCONFIG-BASIC.XML, STOP-SNOWBALL.TXT, SCHEMASURROUND.XML, DA_UTF8.XML, SCHEMA-PHRASESUGGEST.XML, STOP-2.TXT, WDFTYPES.TXT, SOLRCONFIG-XINCLUDE.XML, BAD-SCHEMA-NOT-INDEXED-BUT-NORMS.XML, SCHEMA-TFIDF.XML, SYNONYMS.TXT, SCHEMA-COPYFIELD-TEST.XML, SOLRCONFIG-MASTER3.XML, STOPTYPES-2.TXT, KEEP-2.TXT, SOLRCONFIG-SCRIPT-UPDATEPROCESSOR.XML, SOLRCONFIG-CACHING.XML, BAD-SOLRCONFIG-INVALID-SCRIPTFILE.XML, OLD_SYNONYMS.TXT, SCHEMA-REPLICATION1.XML, SOLRCONFIG-TRANSFORMERS.XML, BAD-SCHEMA-DUP-DYNAMICFIELD.XML, SOLRCONFIG-DELPOLICY1.XML, HUNSPELL-TEST.AFF, SOLRCONFIG-TERMINDEX.XML, SCHEMA-COLLATE.XML, SOLRCONFIG-MASTER1-KEEPONEBACKUP.XML, KEEP-1.TXT, SCHEMA_CODEC.XML, HYPHENATION.DTD, THROW.ERROR.ON.ADD.UPDATEPROCESSOR.JS, MISSLEADING.EXTENSION.UPDATEPROCESSOR.JS.TXT, SOLRCONFIG-UPDATE-PROCESSOR-CHAINS.XML, SCHEMA-MINIMAL.XML, SOLRCONFIG-PROPINJECT.XML, COMPOUNDDICTIONARY.TXT, SOLRCONFIG-FUNCTIONQUERY.XML, SOLRCONFIG-MASTER2.XML, SOLRCONFIG-QUERYSENDER.XML, BAD-SCHEMA-SIM-GLOBAL-VS-FT-MISMATCH.XML, TRIVIAL.UPDATEPROCESSOR1.JS, BAD-SCHEMA-UNIQUEKEY-USES-DEFAULT.XML, SCHEMA-NUMERIC.XML, HUNSPELL-TEST.DIC, SCHEMA-TRIE.XML, BAD-SCHEMA-CODEC-GLOBAL-VS-FT-MISMATCH.XML, SOLRCONFIG-SPELLCHECKER.XML, SOLRCONFIG-SLAVE.XML, BAD-SCHEMA-DUP-FIELD.XML, BAD-SCHEMA-OMIT-TF-BUT-NOT-POS.XML, SOLRCONFIG-MASTER.XML, SCHEMA-CHARFILTERS.XML, SOLRCONFIG-PHRASESUGGEST.XML, SOLRCONFIG-SOLR-749.XML, SCHEMA-LMJELINEKMERCER.XML, BAD-SCHEMA-UNIQUEKEY-IS-COPYFIELD-DEST.XML, SCHEMA-SPELLCHECKER.XML, SOLRCONFIG-QUERYSENDER-NOQUERY.XML, SOLRCONFIG-MASTER1.XML, STOP-1.TXT, SOLRCONFIG-SOLCOREPROPERTIES.XML, SOLRCONFIG-REQHANDLER.INCL, MISSING.FUNCTIONS.UPDATEPROCESSOR.JS, TRIVIAL.UPDATEPROCESSOR0.JS, SCHEMA-FOLDING.XML, SOLRCONFIG-DELPOLICY2.XML, SCHEMA-LMDIRICHLET.XML, BAD_SOLRCONFIG.XML, BAD-SOLRCONFIG-MISSING-SCRIPTFILE.XML, SOLRCONFIG-MERGEPOLICY.XML, SCHEMA15.XML, SOLRCONFIG-NATIVELOCK.XML, ADDFIELDS.UPDATEPROCESSOR.JS, SOLRCONFIG-TLOG.XML, SCHEMA-STOP-KEEP.XML, CURRENCY.XML, SCHEMA-REVERSED.XML, BAD-SOLRCONFIG-BOGUS-SCRIPTENGINE-NAME.XML, SCHEMA-BM25.XML, PROTWORDS.TXT, SCHEMA-LUCENEMATCHVERSION.XML, BAD-SCHEMA-ANALYZER-CLASS-AND-NESTED.XML, SOLRCONFIG-PROPINJECT-INDEXDEFAULT.XML, SOLRCONFIG_PERF.XML, SCHEMA11.XML, ELEVATE.XML, SOLRCONFIG-HIGHLIGHT.XML, SOLRCONFIG-SLAVE1.XML, SCHEMA-REPLICATION2.XML, DA_COMPOUNDDICTIONARY.TXT, PHRASESUGGEST.TXT, SOLRCONFIG-ELEVATE.XML, XSLT, SOLRCONFIG-NOCACHE.XML, SCHEMA-NOT-REQUIRED-UNIQUE-KEY.XML, SCHEMA.XML, FRENCHARTICLES.TXT, SOLRCONFIG-SIMPLELOCK.XML, STOPWITHBOM.TXT, SCHEMA-REQUIRED-FIELDS.XML, SCHEMA-BINARYFIELD.XML, STOPTYPES-1.TXT, SOLRCONFIG-SPELLCHECKCOMPONENT.XML, SOLRCONFIG-BASIC-LUCENEVERSION31.XML, BAD-MP-SOLRCONFIG.XML, STOPWORDSWRONGENCODING.TXT]
[junit4:junit4]   2> 940 T940 oass.SolrIndexSearcher.<init> Opening Searcher@965ae5 main
[junit4:junit4]   2> 940 T940 oass.SolrIndexSearcher.getIndexDir WARNING WARNING: Directory impl does not support setting indexDir: org.apache.lucene.store.MockDirectoryWrapper
[junit4:junit4]   2> 940 T940 oasu.CommitTracker.<init> Hard AutoCommit: disabled
[junit4:junit4]   2> 940 T940 oasu.CommitTracker.<init> Soft AutoCommit: disabled
[junit4:junit4]   2> 941 T940 oashc.QueryElevationComponent.inform Loading QueryElevation from: /mnt/ssd/jenkins/workspace/Lucene-Solr-4.x-Linux/checkout/solr/build/solr-core/test-files/solr/collection1/conf/elevate.xml
[junit4:junit4]   2> 946 T940 oashc.QueryElevationComponent.inform Loading QueryElevation from: /mnt/ssd/jenkins/workspace/Lucene-Solr-4.x-Linux/checkout/solr/build/solr-core/test-files/solr/collection1/conf/elevate.xml
[junit4:junit4]   2> 951 T940 oashc.HttpShardHandlerFactory.getParameter Setting socketTimeout to: 0
[junit4:junit4]   2> 951 T940 oashc.HttpShardHandlerFactory.getParameter Setting urlScheme to: http://
[junit4:junit4]   2> 951 T940 oashc.HttpShardHandlerFactory.getParameter Setting connTimeout to: 0
[junit4:junit4]   2> 951 T940 oashc.HttpShardHandlerFactory.getParameter Setting maxConnectionsPerHost to: 20
[junit4:junit4]   2> 952 T940 oashc.HttpShardHandlerFactory.getParameter Setting corePoolSize to: 0
[junit4:junit4]   2> 952 T940 oashc.HttpShardHandlerFactory.getParameter Setting maximumPoolSize to: 2147483647
[junit4:junit4]   2> 952 T940 oashc.HttpShardHandlerFactory.getParameter Setting maxThreadIdleTime to: 5
[junit4:junit4]   2> 952 T940 oashc.HttpShardHandlerFactory.getParameter Setting sizeOfQueue to: -1
[junit4:junit4]   2> 952 T940 oashc.HttpShardHandlerFactory.getParameter Setting fairnessPolicy to: false
[junit4:junit4]   2> 952 T940 oascsi.HttpClientUtil.createClient Creating new http client, config:maxConnectionsPerHost=20&maxConnections=10000&socketTimeout=0&connTimeout=0&retry=false
[junit4:junit4]   2> 955 T970 oasc.SolrCore.registerSearcher [collection1] Registered new searcher Searcher@965ae5 main{StandardDirectoryReader(segments_1:1)}
[junit4:junit4]   2> 955 T940 oasc.CoreContainer.register registering core: collection1
[junit4:junit4]   2> 955 T940 oass.SolrDispatchFilter.init user.dir=/mnt/ssd/jenkins/workspace/Lucene-Solr-4.x-Linux/checkout/solr/build/solr-core/test/J1
[junit4:junit4]   2> 955 T940 oass.SolrDispatchFilter.init SolrDispatchFilter.init() done
[junit4:junit4]   2> 955 T940 oascsi.HttpClientUtil.createClient Creating new http client, config:maxConnections=128&maxConnectionsPerHost=32&followRedirects=false
[junit4:junit4]   2> 957 T940 oejs.Server.doStart jetty-8.1.2.v20120308
[junit4:junit4]   2> 959 T940 oejs.AbstractConnector.doStart Started SocketConnector@0.0.0.0:46834
[junit4:junit4]   2> 959 T940 oasc.SolrResourceLoader.locateSolrHome JNDI not configured for solr (NoInitialContextEx)
[junit4:junit4]   2> 959 T940 oasc.SolrResourceLoader.locateSolrHome using system property solr.solr.home: /mnt/ssd/jenkins/workspace/Lucene-Solr-4.x-Linux/checkout/solr/build/solr-core/test-files/solr
[junit4:junit4]   2> 959 T940 oasc.SolrResourceLoader.<init> new SolrResourceLoader for deduced Solr Home: '/mnt/ssd/jenkins/workspace/Lucene-Solr-4.x-Linux/checkout/solr/build/solr-core/test-files/solr/'
[junit4:junit4]   2> 965 T940 oass.SolrDispatchFilter.init SolrDispatchFilter.init()
[junit4:junit4]   2> 966 T940 oasc.SolrResourceLoader.locateSolrHome JNDI not configured for solr (NoInitialContextEx)
[junit4:junit4]   2> 966 T940 oasc.SolrResourceLoader.locateSolrHome using system property solr.solr.home: /mnt/ssd/jenkins/workspace/Lucene-Solr-4.x-Linux/checkout/solr/build/solr-core/test-files/solr
[junit4:junit4]   2> 966 T940 oasc.CoreContainer$Initializer.initialize looking for solr.xml: /mnt/ssd/jenkins/workspace/Lucene-Solr-4.x-Linux/checkout/solr/build/solr-core/test-files/solr/solr.xml
[junit4:junit4]   2> 966 T940 oasc.CoreContainer.<init> New CoreContainer 13571352
[junit4:junit4]   2> 966 T940 oasc.CoreContainer.load Loading CoreContainer using Solr Home: '/mnt/ssd/jenkins/workspace/Lucene-Solr-4.x-Linux/checkout/solr/build/solr-core/test-files/solr/'
[junit4:junit4]   2> 967 T940 oasc.SolrResourceLoader.<init> new SolrResourceLoader for directory: '/mnt/ssd/jenkins/workspace/Lucene-Solr-4.x-Linux/checkout/solr/build/solr-core/test-files/solr/'
[junit4:junit4]   2> 987 T940 oasc.CoreContainer.load Registering Log Listener
[junit4:junit4]   2> 996 T940 oasc.CoreContainer.create Creating SolrCore 'collection1' using instanceDir: /mnt/ssd/jenkins/workspace/Lucene-Solr-4.x-Linux/checkout/solr/build/solr-core/test-files/solr/collection1
[junit4:junit4]   2> 996 T940 oasc.SolrResourceLoader.<init> new SolrResourceLoader for directory: '/mnt/ssd/jenkins/workspace/Lucene-Solr-4.x-Linux/checkout/solr/build/solr-core/test-files/solr/collection1/'
[junit4:junit4]   2> 997 T940 oasc.SolrResourceLoader.replaceClassLoader Adding 'file:/mnt/ssd/jenkins/workspace/Lucene-Solr-4.x-Linux/checkout/solr/build/solr-core/test-files/solr/collection1/lib/README' to classloader
[junit4:junit4]   2> 997 T940 oasc.SolrResourceLoader.replaceClassLoader Adding 'file:/mnt/ssd/jenkins/workspace/Lucene-Solr-4.x-Linux/checkout/solr/build/solr-core/test-files/solr/collection1/lib/classes/' to classloader
[junit4:junit4]   2> 1025 T940 oasc.SolrConfig.<init> Using Lucene MatchVersion: LUCENE_40
[junit4:junit4]   2> 1058 T940 oasc.SolrConfig.<init> Loaded SolrConfig: solrconfig-elevate.xml
[junit4:junit4]   2> 1058 T940 oass.IndexSchema.readSchema Reading Solr Schema
[junit4:junit4]   2> 1060 T940 oass.IndexSchema.readSchema Schema name=example
[junit4:junit4]   2> 1224 T940 oass.IndexSchema.readSchema default search field in schema is text
[junit4:junit4]   2> 1225 T940 oass.IndexSchema.readSchema unique key field: id
[junit4:junit4]   2> 1227 T940 oasc.SolrCore.<init> [collection1] Opening new SolrCore at /mnt/ssd/jenkins/workspace/Lucene-Solr-4.x-Linux/checkout/solr/build/solr-core/test-files/solr/collection1/, dataDir=./org.apache.solr.handler.component.DistributedQueryElevationComponentTest-1343983313757/shard2/data/
[junit4:junit4]   2> 1227 T940 oasc.JmxMonitoredMap.<init> JMX monitoring is enabled. Adding Solr mbeans to JMX Server: com.sun.jmx.mbeanserver.JmxMBeanServer@1eefc33
[junit4:junit4]   2> 1227 T940 oasc.SolrCore.getNewIndexDir WARNING New index directory detected: old=null new=./org.apache.solr.handler.component.DistributedQueryElevationComponentTest-1343983313757/shard2/data/index/
[junit4:junit4]   2> 1228 T940 oasc.SolrCore.initIndex WARNING [collection1] Solr index directory './org.apache.solr.handler.component.DistributedQueryElevationComponentTest-1343983313757/shard2/data/index' doesn't exist. Creating new index...
[junit4:junit4]   2> 1229 T940 oasc.SolrDeletionPolicy.onCommit SolrDeletionPolicy.onCommit: commits:num=1
[junit4:junit4]   2> 		commit{dir=MockDirWrapper(NRTCachingDirectory(org.apache.lucene.store.RAMDirectory@13df08a lockFactory=org.apache.lucene.store.SingleInstanceLockFactory@1aadf6e; maxCacheMB=0.8125 maxMergeSizeMB=0.1025390625)),segFN=segments_1,generation=1,filenames=[segments_1]
[junit4:junit4]   2> 1229 T940 oasc.SolrDeletionPolicy.updateCommits newest commit = 1
[junit4:junit4]   2> 1230 T940 oasc.RequestHandlers.initHandlersFromConfig created /update: solr.UpdateRequestHandler
[junit4:junit4]   2> 1230 T940 oasc.RequestHandlers.initHandlersFromConfig created /elevate: org.apache.solr.handler.component.SearchHandler
[junit4:junit4]   2> 1231 T940 oasc.RequestHandlers.initHandlersFromConfig created /dataElevate: org.apache.solr.handler.component.SearchHandler
[junit4:junit4]   2> 1231 T940 oashl.XMLLoader.init xsltCacheLifetimeSeconds=60
[junit4:junit4]   2> 1231 T940 oasc.RequestHandlers.initHandlersFromConfig WARNING no default request handler is registered (either '/select' or 'standard')
[junit4:junit4]   2> 1233 T940 oasc.SolrCore.initDeprecatedSupport WARNING solrconfig.xml uses deprecated <admin/gettableFiles>, Please update your config to use the ShowFileRequestHandler.
[junit4:junit4]   2> 1234 T940 oasc.SolrCore.initDeprecatedSupport WARNING adding ShowFileRequestHandler with hidden files: [SOLRCONFIG-REPEATER.XML, SCHEMA-SIM.XML, BAD-SCHEMA-UNIQUEKEY-MULTIVALUED.XML, STEMDICT.TXT, MAPPING-ISOLATIN1ACCENT.TXT, BAD-SCHEMA-NOT-INDEXED-BUT-TF.XML, CONDITIONAL.UPDATEPROCESSOR.JS, SCHEMA-COLLATEFILTER.XML, SCHEMA-IB.XML, SOLRCONFIG-ENABLEPLUGIN.XML, SOLRCONFIG_CODEC.XML, BAD-SCHEMA-EXTERNAL-FILEFIELD.XML, SOLRCONFIG-ALTDIRECTORY.XML, SCHEMA12.XML, OPEN-EXCHANGE-RATES.JSON, SOLRCONFIG-LAZYWRITER.XML, SCHEMA-DFR.XML, STOPWORDS.TXT, BAD-SCHEMA-DUP-FIELDTYPE.XML, BAD-SCHEMA-NONTEXT-ANALYZER.XML, BAD-SCHEMA-NOT-INDEXED-BUT-POS.XML, SOLRCONFIG-BASIC.XML, STOP-SNOWBALL.TXT, SCHEMASURROUND.XML, DA_UTF8.XML, SCHEMA-PHRASESUGGEST.XML, STOP-2.TXT, WDFTYPES.TXT, SOLRCONFIG-XINCLUDE.XML, BAD-SCHEMA-NOT-INDEXED-BUT-NORMS.XML, SCHEMA-TFIDF.XML, SYNONYMS.TXT, SCHEMA-COPYFIELD-TEST.XML, SOLRCONFIG-MASTER3.XML, STOPTYPES-2.TXT, KEEP-2.TXT, SOLRCONFIG-SCRIPT-UPDATEPROCESSOR.XML, SOLRCONFIG-CACHING.XML, BAD-SOLRCONFIG-INVALID-SCRIPTFILE.XML, OLD_SYNONYMS.TXT, SCHEMA-REPLICATION1.XML, SOLRCONFIG-TRANSFORMERS.XML, BAD-SCHEMA-DUP-DYNAMICFIELD.XML, SOLRCONFIG-DELPOLICY1.XML, HUNSPELL-TEST.AFF, SOLRCONFIG-TERMINDEX.XML, SCHEMA-COLLATE.XML, SOLRCONFIG-MASTER1-KEEPONEBACKUP.XML, KEEP-1.TXT, SCHEMA_CODEC.XML, HYPHENATION.DTD, THROW.ERROR.ON.ADD.UPDATEPROCESSOR.JS, MISSLEADING.EXTENSION.UPDATEPROCESSOR.JS.TXT, SOLRCONFIG-UPDATE-PROCESSOR-CHAINS.XML, SCHEMA-MINIMAL.XML, SOLRCONFIG-PROPINJECT.XML, COMPOUNDDICTIONARY.TXT, SOLRCONFIG-FUNCTIONQUERY.XML, SOLRCONFIG-MASTER2.XML, SOLRCONFIG-QUERYSENDER.XML, BAD-SCHEMA-SIM-GLOBAL-VS-FT-MISMATCH.XML, TRIVIAL.UPDATEPROCESSOR1.JS, BAD-SCHEMA-UNIQUEKEY-USES-DEFAULT.XML, SCHEMA-NUMERIC.XML, HUNSPELL-TEST.DIC, SCHEMA-TRIE.XML, BAD-SCHEMA-CODEC-GLOBAL-VS-FT-MISMATCH.XML, SOLRCONFIG-SPELLCHECKER.XML, SOLRCONFIG-SLAVE.XML, BAD-SCHEMA-DUP-FIELD.XML, BAD-SCHEMA-OMIT-TF-BUT-NOT-POS.XML, SOLRCONFIG-MASTER.XML, SCHEMA-CHARFILTERS.XML, SOLRCONFIG-PHRASESUGGEST.XML, SOLRCONFIG-SOLR-749.XML, SCHEMA-LMJELINEKMERCER.XML, BAD-SCHEMA-UNIQUEKEY-IS-COPYFIELD-DEST.XML, SCHEMA-SPELLCHECKER.XML, SOLRCONFIG-QUERYSENDER-NOQUERY.XML, SOLRCONFIG-MASTER1.XML, STOP-1.TXT, SOLRCONFIG-SOLCOREPROPERTIES.XML, SOLRCONFIG-REQHANDLER.INCL, MISSING.FUNCTIONS.UPDATEPROCESSOR.JS, TRIVIAL.UPDATEPROCESSOR0.JS, SCHEMA-FOLDING.XML, SOLRCONFIG-DELPOLICY2.XML, SCHEMA-LMDIRICHLET.XML, BAD_SOLRCONFIG.XML, BAD-SOLRCONFIG-MISSING-SCRIPTFILE.XML, SOLRCONFIG-MERGEPOLICY.XML, SCHEMA15.XML, SOLRCONFIG-NATIVELOCK.XML, ADDFIELDS.UPDATEPROCESSOR.JS, SOLRCONFIG-TLOG.XML, SCHEMA-STOP-KEEP.XML, CURRENCY.XML, SCHEMA-REVERSED.XML, BAD-SOLRCONFIG-BOGUS-SCRIPTENGINE-NAME.XML, SCHEMA-BM25.XML, PROTWORDS.TXT, SCHEMA-LUCENEMATCHVERSION.XML, BAD-SCHEMA-ANALYZER-CLASS-AND-NESTED.XML, SOLRCONFIG-PROPINJECT-INDEXDEFAULT.XML, SOLRCONFIG_PERF.XML, SCHEMA11.XML, ELEVATE.XML, SOLRCONFIG-HIGHLIGHT.XML, SOLRCONFIG-SLAVE1.XML, SCHEMA-REPLICATION2.XML, DA_COMPOUNDDICTIONARY.TXT, PHRASESUGGEST.TXT, SOLRCONFIG-ELEVATE.XML, XSLT, SOLRCONFIG-NOCACHE.XML, SCHEMA-NOT-REQUIRED-UNIQUE-KEY.XML, SCHEMA.XML, FRENCHARTICLES.TXT, SOLRCONFIG-SIMPLELOCK.XML, STOPWITHBOM.TXT, SCHEMA-REQUIRED-FIELDS.XML, SCHEMA-BINARYFIELD.XML, STOPTYPES-1.TXT, SOLRCONFIG-SPELLCHECKCOMPONENT.XML, SOLRCONFIG-BASIC-LUCENEVERSION31.XML, BAD-MP-SOLRCONFIG.XML, STOPWORDSWRONGENCODING.TXT]
[junit4:junit4]   2> 1236 T940 oass.SolrIndexSearcher.<init> Opening Searcher@273cba main
[junit4:junit4]   2> 1236 T940 oass.SolrIndexSearcher.getIndexDir WARNING WARNING: Directory impl does not support setting indexDir: org.apache.lucene.store.MockDirectoryWrapper
[junit4:junit4]   2> 1237 T940 oasu.CommitTracker.<init> Hard AutoCommit: disabled
[junit4:junit4]   2> 1237 T940 oasu.CommitTracker.<init> Soft AutoCommit: disabled
[junit4:junit4]   2> 1238 T940 oashc.QueryElevationComponent.inform Loading QueryElevation from: /mnt/ssd/jenkins/workspace/Lucene-Solr-4.x-Linux/checkout/solr/build/solr-core/test-files/solr/collection1/conf/elevate.xml
[junit4:junit4]   2> 1245 T940 oashc.QueryElevationComponent.inform Loading QueryElevation from: /mnt/ssd/jenkins/workspace/Lucene-Solr-4.x-Linux/checkout/solr/build/solr-core/test-files/solr/collection1/conf/elevate.xml
[junit4:junit4]   2> 1253 T940 oashc.HttpShardHandlerFactory.getParameter Setting socketTimeout to: 0
[junit4:junit4]   2> 1253 T940 oashc.HttpShardHandlerFactory.getParameter Setting urlScheme to: http://
[junit4:junit4]   2> 1253 T940 oashc.HttpShardHandlerFactory.getParameter Setting connTimeout to: 0
[junit4:junit4]   2> 1254 T940 oashc.HttpShardHandlerFactory.getParameter Setting maxConnectionsPerHost to: 20
[junit4:junit4]   2> 1254 T940 oashc.HttpShardHandlerFactory.getParameter Setting corePoolSize to: 0
[junit4:junit4]   2> 1254 T940 oashc.HttpShardHandlerFactory.getParameter Setting maximumPoolSize to: 2147483647
[junit4:junit4]   2> 1255 T940 oashc.HttpShardHandlerFactory.getParameter Setting maxThreadIdleTime to: 5
[junit4:junit4]   2> 1255 T940 oashc.HttpShardHandlerFactory.getParameter Setting sizeOfQueue to: -1
[junit4:junit4]   2> 1255 T940 oashc.HttpShardHandlerFactory.getParameter Setting fairnessPolicy to: false
[junit4:junit4]   2> 1255 T940 oascsi.HttpClientUtil.createClient Creating new http client, config:maxConnectionsPerHost=20&maxConnections=10000&socketTimeout=0&connTimeout=0&retry=false
[junit4:junit4]   2> 1259 T980 oasc.SolrCore.registerSearcher [collection1] Registered new searcher Searcher@273cba main{StandardDirectoryReader(segments_1:1)}
[junit4:junit4]   2> 1270 T940 oasc.CoreContainer.register registering core: collection1
[junit4:junit4]   2> 1271 T940 oass.SolrDispatchFilter.init user.dir=/mnt/ssd/jenkins/workspace/Lucene-Solr-4.x-Linux/checkout/solr/build/solr-core/test/J1
[junit4:junit4]   2> 1271 T940 oass.SolrDispatchFilter.init SolrDispatchFilter.init() done
[junit4:junit4]   2> 1271 T940 oascsi.HttpClientUtil.createClient Creating new http client, config:maxConnections=128&maxConnectionsPerHost=32&followRedirects=false
[junit4:junit4]   2> ASYNC  NEW_CORE C49 name=collection1 org.apache.solr.core.SolrCore@1d109bd
[junit4:junit4]   2> 1283 T942 C49 oasu.DirectUpdateHandler2.deleteAll [collection1] REMOVING ALL DOCUMENTS FROM INDEX
[junit4:junit4]   2> 1294 T942 C49 oasc.SolrDeletionPolicy.onInit SolrDeletionPolicy.onInit: commits:num=1
[junit4:junit4]   2> 		commit{dir=MockDirWrapper(org.apache.lucene.store.RAMDirectory@1d2bafa lockFactory=org.apache.lucene.store.SingleInstanceLockFactory@62c4d8),segFN=segments_1,generation=1,filenames=[segments_1]
[junit4:junit4]   2> 1295 T942 C49 oasc.SolrDeletionPolicy.updateCommits newest commit = 1
[junit4:junit4]   2> 1295 T942 C49 UPDATE [collection1] webapp=/solr path=/update params={wt=javabin&version=2} {deleteByQuery=*:*} 0 14
[junit4:junit4]   2> ASYNC  NEW_CORE C50 name=collection1 org.apache.solr.core.SolrCore@12a1e24
[junit4:junit4]   2> 1303 T953 C50 oasu.DirectUpdateHandler2.deleteAll [collection1] REMOVING ALL DOCUMENTS FROM INDEX
[junit4:junit4]   2> 1304 T953 C50 oasc.SolrDeletionPolicy.onInit SolrDeletionPolicy.onInit: commits:num=1
[junit4:junit4]   2> 		commit{dir=MockDirWrapper(org.apache.lucene.store.RAMDirectory@210787 lockFactory=org.apache.lucene.store.SingleInstanceLockFactory@31b627),segFN=segments_1,generation=1,filenames=[segments_1]
[junit4:junit4]   2> 1304 T953 C50 oasc.SolrDeletionPolicy.updateCommits newest commit = 1
[junit4:junit4]   2> 1305 T953 C50 UPDATE [collection1] webapp=/solr path=/update params={wt=javabin&version=2} {deleteByQuery=*:*} 0 2
[junit4:junit4]   2> ASYNC  NEW_CORE C51 name=collection1 org.apache.solr.core.SolrCore@19bc806
[junit4:junit4]   2> 1308 T963 C51 oasu.DirectUpdateHandler2.deleteAll [collection1] REMOVING ALL DOCUMENTS FROM INDEX
[junit4:junit4]   2> 1309 T963 C51 oasc.SolrDeletionPolicy.onInit SolrDeletionPolicy.onInit: commits:num=1
[junit4:junit4]   2> 		commit{dir=MockDirWrapper(org.apache.lucene.store.RAMDirectory@693607 lockFactory=org.apache.lucene.store.SingleInstanceLockFactory@813908),segFN=segments_1,generation=1,filenames=[segments_1]
[junit4:junit4]   2> 1310 T963 C51 oasc.SolrDeletionPolicy.updateCommits newest commit = 1
[junit4:junit4]   2> 1310 T963 C51 UPDATE [collection1] webapp=/solr path=/update params={wt=javabin&version=2} {deleteByQuery=*:*} 0 2
[junit4:junit4]   2> ASYNC  NEW_CORE C52 name=collection1 org.apache.solr.core.SolrCore@4b4b51
[junit4:junit4]   2> 1314 T973 C52 oasu.DirectUpdateHandler2.deleteAll [collection1] REMOVING ALL DOCUMENTS FROM INDEX
[junit4:junit4]   2> 1315 T973 C52 oasc.SolrDeletionPolicy.onInit SolrDeletionPolicy.onInit: commits:num=1
[junit4:junit4]   2> 		commit{dir=MockDirWrapper(NRTCachingDirectory(org.apache.lucene.store.RAMDirectory@13df08a lockFactory=org.apache.lucene.store.SingleInstanceLockFactory@1aadf6e; maxCacheMB=0.8125 maxMergeSizeMB=0.1025390625)),segFN=segments_1,generation=1,filenames=[segments_1]
[junit4:junit4]   2> 1316 T973 C52 oasc.SolrDeletionPolicy.updateCommits newest commit = 1
[junit4:junit4]   2> 1316 T973 C52 UPDATE [collection1] webapp=/solr path=/update params={wt=javabin&version=2} {deleteByQuery=*:*} 0 3
[junit4:junit4]   2> 1335 T942 C49 UPDATE [collection1] webapp=/solr path=/update params={wt=javabin&version=2} {add=[1]} 0 12
[junit4:junit4]   2> 1338 T953 C50 UPDATE [collection1] webapp=/solr path=/update params={wt=javabin&version=2} {add=[1]} 0 1
[junit4:junit4]   2> 1340 T942 C49 UPDATE [collection1] webapp=/solr path=/update params={wt=javabin&version=2} {add=[2]} 0 1
[junit4:junit4]   2> 1341 T963 C51 UPDATE [collection1] webapp=/solr path=/update params={wt=javabin&version=2} {add=[2]} 0 0
[junit4:junit4]   2> 1343 T942 C49 UPDATE [collection1] webapp=/solr path=/update params={wt=javabin&version=2} {add=[3]} 0 0
[junit4:junit4]   2> 1345 T973 C52 UPDATE [collection1] webapp=/solr path=/update params={wt=javabin&version=2} {add=[3]} 0 0
[junit4:junit4]   2> 1347 T942 C49 UPDATE [collection1] webapp=/solr path=/update params={wt=javabin&version=2} {add=[4]} 0 0
[junit4:junit4]   2> 1349 T953 C50 UPDATE [collection1] webapp=/solr path=/update params={wt=javabin&version=2} {add=[4]} 0 1
[junit4:junit4]   2> 1350 T942 C49 UPDATE [collection1] webapp=/solr path=/update params={wt=javabin&version=2} {add=[5]} 0 0
[junit4:junit4]   2> 1352 T963 C51 UPDATE [collection1] webapp=/solr path=/update params={wt=javabin&version=2} {add=[5]} 0 0
[junit4:junit4]   2> 1353 T942 C49 UPDATE [collection1] webapp=/solr path=/update params={wt=javabin&version=2} {add=[6]} 0 0
[junit4:junit4]   2> 1355 T973 C52 UPDATE [collection1] webapp=/solr path=/update params={wt=javabin&version=2} {add=[6]} 0 0
[junit4:junit4]   2> 1357 T942 C49 UPDATE [collection1] webapp=/solr path=/update params={wt=javabin&version=2} {add=[7]} 0 0
[junit4:junit4]   2> 1358 T973 C52 UPDATE [collection1] webapp=/solr path=/update params={wt=javabin&version=2} {add=[7]} 0 0
[junit4:junit4]   2> 1360 T942 C49 oasu.DirectUpdateHandler2.commit start commit{flags=0,_version_=0,optimize=false,openSearcher=true,waitSearcher=true,expungeDeletes=false,softCommit=false}
[junit4:junit4]   2> 1362 T942 C49 oasc.SolrDeletionPolicy.onCommit SolrDeletionPolicy.onCommit: commits:num=2
[junit4:junit4]   2> 		commit{dir=MockDirWrapper(org.apache.lucene.store.RAMDirectory@1d2bafa lockFactory=org.apache.lucene.store.SingleInstanceLockFactory@62c4d8),segFN=segments_1,generation=1,filenames=[segments_1]
[junit4:junit4]   2> 		commit{dir=MockDirWrapper(org.apache.lucene.store.RAMDirectory@1d2bafa lockFactory=org.apache.lucene.store.SingleInstanceLockFactory@62c4d8),segFN=segments_2,generation=2,filenames=[_0_nrm.cfs, _0_Pulsing40_0.prx, _0.fnm, _0_Lucene40WithOrds_0.tib, _0.fdt, _0_Lucene40WithOrds_0.prx, _0_Lucene40WithOrds_0.frq, segments_2, _0_Pulsing40_0.tip, _0_nrm.cfe, _0.si, _0.fdx, _0_Pulsing40_0.frq, _0_Lucene40WithOrds_0.tii, _0_Pulsing40_0.tim]
[junit4:junit4]   2> 1362 T942 C49 oasc.SolrDeletionPolicy.updateCommits newest commit = 2
[junit4:junit4]   2> 1363 T942 C49 oass.SolrIndexSearcher.<init> Opening Searcher@244671 main
[junit4:junit4]   2> 1363 T942 C49 oass.SolrIndexSearcher.getIndexDir WARNING WARNING: Directory impl does not support setting indexDir: org.apache.lucene.store.MockDirectoryWrapper
[junit4:junit4]   2> 1364 T942 C49 oasu.DirectUpdateHandler2.commit end_commit_flush
[junit4:junit4]   2> 1364 T950 oasc.SolrCore.registerSearcher [collection1] Registered new searcher Searcher@244671 main{StandardDirectoryReader(segments_2:4 _0(4.0.0.1):C7)}
[junit4:junit4]   2> 1365 T942 C49 UPDATE [collection1] webapp=/solr path=/update params={softCommit=false&wt=javabin&commit=true&version=2&waitSearcher=true} {commit=} 0 5
[junit4:junit4]   2> 1367 T953 C50 oasu.DirectUpdateHandler2.commit start commit{flags=0,_version_=0,optimize=false,openSearcher=true,waitSearcher=true,expungeDeletes=false,softCommit=false}
[junit4:junit4]   2> 1369 T953 C50 oasc.SolrDeletionPolicy.onCommit SolrDeletionPolicy.onCommit: commits:num=2
[junit4:junit4]   2> 		commit{dir=MockDirWrapper(org.apache.lucene.store.RAMDirectory@210787 lockFactory=org.apache.lucene.store.SingleInstanceLockFactory@31b627),segFN=segments_1,generation=1,filenames=[segments_1]
[junit4:junit4]   2> 		commit{dir=MockDirWrapper(org.apache.lucene.store.RAMDirectory@210787 lockFactory=org.apache.lucene.store.SingleInstanceLockFactory@31b627),segFN=segments_2,generation=2,filenames=[_0_nrm.cfs, _0_Pulsing40_0.prx, _0.fnm, _0_Lucene40WithOrds_0.tib, _0.fdt, _0_Lucene40WithOrds_0.prx, _0_Lucene40WithOrds_0.frq, segments_2, _0_Pulsing40_0.tip, _0_nrm.cfe, _0.si, _0.fdx, _0_Pulsing40_0.frq, _0_Lucene40WithOrds_0.tii, _0_Pulsing40_0.tim]
[junit4:junit4]   2> 1369 T953 C50 oasc.SolrDeletionPolicy.updateCommits newest commit = 2
[junit4:junit4]   2> 1369 T953 C50 oass.SolrIndexSearcher.<init> Opening Searcher@1ff3b0c main
[junit4:junit4]   2> 1370 T953 C50 oass.SolrIndexSearcher.getIndexDir WARNING WARNING: Directory impl does not support setting indexDir: org.apache.lucene.store.MockDirectoryWrapper
[junit4:junit4]   2> 1370 T953 C50 oasu.DirectUpdateHandler2.commit end_commit_flush
[junit4:junit4]   2> 1370 T960 oasc.SolrCore.registerSearcher [collection1] Registered new searcher Searcher@1ff3b0c main{StandardDirectoryReader(segments_2:4 _0(4.0.0.1):C2)}
[junit4:junit4]   2> 1371 T953 C50 UPDATE [collection1] webapp=/solr path=/update params={softCommit=false&wt=javabin&commit=true&version=2&waitSearcher=true} {commit=} 0 4
[junit4:junit4]   2> 1372 T963 C51 oasu.DirectUpdateHandler2.commit start commit{flags=0,_version_=0,optimize=false,openSearcher=true,waitSearcher=true,expungeDeletes=false,softCommit=false}
[junit4:junit4]   2> 1374 T963 C51 oasc.SolrDeletionPolicy.onCommit SolrDeletionPolicy.onCommit: commits:num=2
[junit4:junit4]   2> 		commit{dir=MockDirWrapper(org.apache.lucene.store.RAMDirectory@693607 lockFactory=org.apache.lucene.store.SingleInstanceLockFactory@813908),segFN=segments_1,generation=1,filenames=[segments_1]
[junit4:junit4]   2> 		commit{dir=MockDirWrapper(org.apache.lucene.store.RAMDirectory@693607 lockFactory=org.apache.lucene.store.SingleInstanceLockFactory@813908),segFN=segments_2,generation=2,filenames=[_0_nrm.cfs, _0_Pulsing40_0.prx, _0.fnm, _0_Lucene40WithOrds_0.tib, _0.fdt, _0_Lucene40WithOrds_0.prx, _0_Lucene40WithOrds_0.frq, segments_2, _0_Pulsing40_0.tip, _0_nrm.cfe, _0.si, _0.fdx, _0_Pulsing40_0.frq, _0_Lucene40WithOrds_0.tii, _0_Pulsing40_0.tim]
[junit4:junit4]   2> 1374 T963 C51 oasc.SolrDeletionPolicy.updateCommits newest commit = 2
[junit4:junit4]   2> 1375 T963 C51 oass.SolrIndexSearcher.<init> Opening Searcher@1882be6 main
[junit4:junit4]   2> 1375 T963 C51 oass.SolrIndexSearcher.getIndexDir WARNING WARNING: Directory impl does not support setting indexDir: org.apache.lucene.store.MockDirectoryWrapper
[junit4:junit4]   2> 1375 T963 C51 oasu.DirectUpdateHandler2.commit end_commit_flush
[junit4:junit4]   2> 1376 T970 oasc.SolrCore.registerSearcher [collection1] Registered new searcher Searcher@1882be6 main{StandardDirectoryReader(segments_2:4 _0(4.0.0.1):C2)}
[junit4:junit4]   2> 1376 T963 C51 UPDATE [collection1] webapp=/solr path=/update params={softCommit=false&wt=javabin&commit=true&version=2&waitSearcher=true} {commit=} 0 4
[junit4:junit4]   2> 1378 T973 C52 oasu.DirectUpdateHandler2.commit start commit{flags=0,_version_=0,optimize=false,openSearcher=true,waitSearcher=true,expungeDeletes=false,softCommit=false}
[junit4:junit4]   2> 1379 T973 C52 oasc.SolrDeletionPolicy.onCommit SolrDeletionPolicy.onCommit: commits:num=2
[junit4:junit4]   2> 		commit{dir=MockDirWrapper(NRTCachingDirectory(org.apache.lucene.store.RAMDirectory@13df08a lockFactory=org.apache.lucene.store.SingleInstanceLockFactory@1aadf6e; maxCacheMB=0.8125 maxMergeSizeMB=0.1025390625)),segFN=segments_1,generation=1,filenames=[segments_1]
[junit4:junit4]   2> 		commit{dir=MockDirWrapper(NRTCachingDirectory(org.apache.lucene.store.RAMDirectory@13df08a lockFactory=org.apache.lucene.store.SingleInstanceLockFactory@1aadf6e; maxCacheMB=0.8125 maxMergeSizeMB=0.1025390625)),segFN=segments_2,generation=2,filenames=[_0_nrm.cfs, _0_Pulsing40_0.prx, _0.fnm, _0_Lucene40WithOrds_0.tib, _0.fdt, _0_Lucene40WithOrds_0.prx, _0_Lucene40WithOrds_0.frq, segments_2, _0_Pulsing40_0.tip, _0_nrm.cfe, _0.si, _0.fdx, _0_Pulsing40_0.frq, _0_Lucene40WithOrds_0.tii, _0_Pulsing40_0.tim]
[junit4:junit4]   2> 1379 T973 C52 oasc.SolrDeletionPolicy.updateCommits newest commit = 2
[junit4:junit4]   2> 1380 T973 C52 oass.SolrIndexSearcher.<init> Opening Searcher@11ac6c3 main
[junit4:junit4]   2> 1380 T973 C52 oass.SolrIndexSearcher.getIndexDir WARNING WARNING: Directory impl does not support setting indexDir: org.apache.lucene.store.MockDirectoryWrapper
[junit4:junit4]   2> 1380 T973 C52 oasu.DirectUpdateHandler2.commit end_commit_flush
[junit4:junit4]   2> 1381 T980 oasc.SolrCore.registerSearcher [collection1] Registered new searcher Searcher@11ac6c3 main{StandardDirectoryReader(segments_2:4 _0(4.0.0.1):C3)}
[junit4:junit4]   2> 1381 T973 C52 UPDATE [collection1] webapp=/solr path=/update params={softCommit=false&wt=javabin&commit=true&version=2&waitSearcher=true} {commit=} 0 3
[junit4:junit4]   2> 1386 T942 C49 REQ [collection1] webapp=/solr path=/elevate params={shards.qt=/elevate&fl=id,+score,+[elevated]&q=*:*&distrib=false&qt=/elevate&rows=500&sort=id+desc&wt=javabin&version=2} hits=7 status=0 QTime=3 
[junit4:junit4]   2> 1398 T964 C51 REQ [collection1] webapp=/solr path=/elevate params={shards.qt=/elevate&fl=id,score&NOW=1343983315143&q=*:*&isShard=true&qt=/elevate&sort=id+desc&fsv=true&version=2&start=0&shard.url=localhost:59725/solr&distrib=false&rows=500&wt=javabin} hits=2 status=0 QTime=2 
[junit4:junit4]   2> 1398 T954 C50 REQ [collection1] webapp=/solr path=/elevate params={shards.qt=/elevate&fl=id,score&NOW=1343983315143&q=*:*&isShard=true&qt=/elevate&sort=id+desc&fsv=true&version=2&start=0&shard.url=localhost:50485/solr&distrib=false&rows=500&wt=javabin} hits=2 status=0 QTime=2 
[junit4:junit4]   2> 1398 T974 C52 REQ [collection1] webapp=/solr path=/elevate params={shards.qt=/elevate&fl=id,score&NOW=1343983315143&q=*:*&isShard=true&qt=/elevate&sort=id+desc&fsv=true&version=2&start=0&shard.url=localhost:46834/solr&distrib=false&rows=500&wt=javabin} hits=3 status=0 QTime=1 
[junit4:junit4]   2> 1404 T954 C50 REQ [collection1] webapp=/solr path=/elevate params={shards.qt=/elevate&fl=id,+score,+[elevated]&q=*:*&NOW=1343983315143&isShard=true&qt=/elevate&version=2&shard.url=localhost:50485/solr&distrib=false&rows=500&ids=4.0,1.0&wt=javabin} status=0 QTime=0 
[junit4:junit4]   2> 1404 T964 C51 REQ [collection1] webapp=/solr path=/elevate params={shards.qt=/elevate&fl=id,+score,+[elevated]&q=*:*&NOW=1343983315143&isShard=true&qt=/elevate&version=2&shard.url=localhost:59725/solr&distrib=false&rows=500&ids=2.0,5.0&wt=javabin} status=0 QTime=0 
[junit4:junit4]   2> 1404 T974 C52 REQ [collection1] webapp=/solr path=/elevate params={shards.qt=/elevate&fl=id,+score,+[elevated]&q=*:*&NOW=1343983315143&isShard=true&qt=/elevate&version=2&shard.url=localhost:46834/solr&distrib=false&rows=500&ids=7.0,6.0,3.0&wt=javabin} status=0 QTime=0 
[junit4:junit4]   2> 1405 T973 C52 REQ [collection1] webapp=/solr path=/elevate params={shards.qt=/elevate&fl=id,+score,+[elevated]&q=*:*&qt=/elevate&rows=500&sort=id+desc&wt=javabin&version=2&shards=localhost:50485/solr,localhost:59725/solr,localhost:46834/solr} status=0 QTime=17 
[junit4:junit4]   2> 1406 T940 oas.BaseDistributedSearchTestCase.compareResponses SEVERE Mismatched responses:
[junit4:junit4]   2> 	{responseHeader={status=0,QTime=17,params={shards.qt=/elevate,fl=id, score, [elevated],q=*:*,qt=/elevate,rows=500,sort=id desc,wt=javabin,version=2,shards=localhost:50485/solr,localhost:59725/solr,localhost:46834/solr}},response={numFound=7,start=0,maxScore=1.0,docs=[SolrDocument{id=7.0, [elevated]=false, score=1.0}, SolrDocument{id=6.0, [elevated]=false, score=1.0}, SolrDocument{id=5.0, [elevated]=false, score=1.0}, SolrDocument{id=4.0, [elevated]=false, score=1.0}, SolrDocument{id=3.0, [elevated]=false, score=1.0}, SolrDocument{id=2.0, [elevated]=false, score=1.0}, SolrDocument{id=1.0, [elevated]=false, score=1.0}]}}
[junit4:junit4]   2> 	{responseHeader={status=0,QTime=3,params={shards.qt=/elevate,fl=id, score, [elevated],q=*:*,distrib=false,qt=/elevate,rows=500,sort=id desc,wt=javabin,version=2}},response={numFound=7,start=0,maxScore=1.0,docs=[SolrDocument{id=7.0, score=1.0, [elevated]=false}, SolrDocument{id=6.0, score=1.0, [elevated]=false}, SolrDocument{id=5.0, score=1.0, [elevated]=false}, SolrDocument{id=4.0, score=1.0, [elevated]=false}, SolrDocument{id=3.0, score=1.0, [elevated]=false}, SolrDocument{id=2.0, score=1.0, [elevated]=false}, SolrDocument{id=1.0, score=1.0, [elevated]=false}]}}
[junit4:junit4]   2> 1407 T940 oasc.CoreContainer.shutdown Shutting down CoreContainer instance=14192831
[junit4:junit4]   2> 1407 T940 oasc.SolrCore.close [collection1]  CLOSING SolrCore org.apache.solr.core.SolrCore@1d109bd
[junit4:junit4]   2> 1408 T940 oasc.SolrCore.closeSearcher [collection1] Closing main searcher on request.
[junit4:junit4]   2> 1409 T940 oasu.DirectUpdateHandler2.close closing DirectUpdateHandler2{commits=1,autocommits=0,soft autocommits=0,optimizes=0,rollbacks=0,expungeDeletes=0,docsPending=0,adds=0,deletesById=0,deletesByQuery=0,errors=0,cumulative_adds=7,cumulative_deletesById=0,cumulative_deletesByQuery=1,cumulative_errors=0}
[junit4:junit4]   2> 1412 T940 oejsh.ContextHandler.doStop stopped o.e.j.s.ServletContextHandler{/solr,null}
[junit4:junit4]   2> 1465 T940 oasc.CoreContainer.shutdown Shutting down CoreContainer instance=19081523
[junit4:junit4]   2> 1466 T940 oasc.SolrCore.close [collection1]  CLOSING SolrCore org.apache.solr.core.SolrCore@12a1e24
[junit4:junit4]   2> 1467 T940 oasc.SolrCore.closeSearcher [collection1] Closing main searcher on request.
[junit4:junit4]   2> 1467 T940 oasu.DirectUpdateHandler2.close closing DirectUpdateHandler2{commits=1,autocommits=0,soft autocommits=0,optimizes=0,rollbacks=0,expungeDeletes=0,docsPending=0,adds=0,deletesById=0,deletesByQuery=0,errors=0,cumulative_adds=2,cumulative_deletesById=0,cumulative_deletesByQuery=1,cumulative_errors=0}
[junit4:junit4]   2> 1489 T940 oejsh.ContextHandler.doStop stopped o.e.j.s.ServletContextHandler{/solr,null}
[junit4:junit4]   2> 1541 T940 oasc.CoreContainer.shutdown Shutting down CoreContainer instance=28878894
[junit4:junit4]   2> 1542 T940 oasc.SolrCore.close [collection1]  CLOSING SolrCore org.apache.solr.core.SolrCore@19bc806
[junit4:junit4]   2> 1542 T940 oasc.SolrCore.closeSearcher [collection1] Closing main searcher on request.
[junit4:junit4]   2> 1542 T940 oasu.DirectUpdateHandler2.close closing DirectUpdateHandler2{commits=1,autocommits=0,soft autocommits=0,optimizes=0,rollbacks=0,expungeDeletes=0,docsPending=0,adds=0,deletesById=0,deletesByQuery=0,errors=0,cumulative_adds=2,cumulative_deletesById=0,cumulative_deletesByQuery=1,cumulative_errors=0}
[junit4:junit4]   2> 1549 T940 oejsh.ContextHandler.doStop stopped o.e.j.s.ServletContextHandler{/solr,null}
[junit4:junit4]   2> 1601 T940 oasc.CoreContainer.shutdown Shutting down CoreContainer instance=13571352
[junit4:junit4]   2> 1601 T940 oasc.SolrCore.close [collection1]  CLOSING SolrCore org.apache.solr.core.SolrCore@4b4b51
[junit4:junit4]   2> 1602 T940 oasc.SolrCore.closeSearcher [collection1] Closing main searcher on request.
[junit4:junit4]   2> 1602 T940 oasu.DirectUpdateHandler2.close closing DirectUpdateHandler2{commits=1,autocommits=0,soft autocommits=0,optimizes=0,rollbacks=0,expungeDeletes=0,docsPending=0,adds=0,deletesById=0,deletesByQuery=0,errors=0,cumulative_adds=3,cumulative_deletesById=0,cumulative_deletesByQuery=1,cumulative_errors=0}
[junit4:junit4]   2> 1606 T940 oejsh.ContextHandler.doStop stopped o.e.j.s.ServletContextHandler{/solr,null}
[junit4:junit4]   2> 1659 T940 oas.SolrTestCaseJ4.tearDown ###Ending testDistribSearch
[junit4:junit4]   2> NOTE: reproduce with: ant test  -Dtestcase=DistributedQueryElevationComponentTest -Dtests.method=testDistribSearch -Dtests.seed=1041E7DA96564794 -Dtests.multiplier=3 -Dtests.slow=true -Dtests.locale=it_IT -Dtests.timezone=CST -Dtests.file.encoding=US-ASCII
[junit4:junit4]   2>
[junit4:junit4]    > (@AfterClass output)
[junit4:junit4]   2> 1703 T940 oas.SolrTestCaseJ4.deleteCore ###deleteCore
[junit4:junit4]   2> NOTE: test params are: codec=Lucene40: {plow_t=PostingsFormat(name=Lucene40WithOrds), text=PostingsFormat(name=Lucene40WithOrds), int_i=PostingsFormat(name=Lucene40WithOrds), id=Pulsing40(freqCutoff=8 minBlockSize=65 maxBlockSize=155), field_t=Pulsing40(freqCutoff=8 minBlockSize=65 maxBlockSize=155)}, sim=DefaultSimilarity, locale=it_IT, timezone=CST
[junit4:junit4]   2> NOTE: Linux 3.2.0-27-generic i386/Oracle Corporation 1.8.0-ea (32-bit)/cpus=8,threads=1,free=64797408,total=110215168
[junit4:junit4]   2> NOTE: All tests run in this JVM: [TestSuggestSpellingConverter, SimpleFacetsTest, SpellingQueryConverterTest, TestFoldingMultitermQuery, DisMaxRequestHandlerTest, TestBinaryResponseWriter, HighlighterTest, TestFunctionQuery, TestDocSet, TestQueryUtils, ReturnFieldsTest, IndexReaderFactoryTest, TestFaceting, PrimUtilsTest, UUIDFieldTest, TestSolrXMLSerializer, SystemInfoHandlerTest, TestReplicationHandler, TestTrie, TestUpdate, SoftAutoCommitTest, TimeZoneUtilsTest, TestQueryTypes, PrimitiveFieldTypeTest, URLClassifyProcessorTest, TestRealTimeGet, TestJoin, QueryEqualityTest, TestCharFilters, OverseerTest, XsltUpdateRequestHandlerTest, TestSolrDeletionPolicy1, SuggesterWFSTTest, ZkControllerTest, ScriptEngineTest, TestFiltering, SolrPluginUtilsTest, SuggesterTSTTest, SampleTest, TestBM25SimilarityFactory, FieldAnalysisRequestHandlerTest, DirectUpdateHandlerTest, BasicZkTest, DistributedQueryElevationComponentTest]
[junit4:junit4]   2> 
[junit4:junit4] Completed on J1 in 1.71s, 1 test, 1 failure <<< FAILURES!

[...truncated 430 lines...]
BUILD FAILED
/mnt/ssd/jenkins/workspace/Lucene-Solr-4.x-Linux/checkout/build.xml:29: The following error occurred while executing this line:
/mnt/ssd/jenkins/workspace/Lucene-Solr-4.x-Linux/checkout/solr/build.xml:144: The following error occurred while executing this line:
/mnt/ssd/jenkins/workspace/Lucene-Solr-4.x-Linux/checkout/lucene/module-build.xml:62: The following error occurred while executing this line:
/mnt/ssd/jenkins/workspace/Lucene-Solr-4.x-Linux/checkout/lucene/common-build.xml:1095: The following error occurred while executing this line:
/mnt/ssd/jenkins/workspace/Lucene-Solr-4.x-Linux/checkout/lucene/common-build.xml:790: There were test failures: 224 suites, 903 tests, 1 failure, 5 ignored

Total time: 25 minutes 45 seconds
Build step 'Execute shell' marked build as failure
Archiving artifacts
Recording test results
Email was triggered for: Failure
Sending email for trigger: Failure



Mime
View raw message