lucene-dev mailing list archives

Site index · List index
Message view « Date » · « Thread »
Top « Date » · « Thread »
From Policeman Jenkins Server <jenk...@sd-datasolutions.de>
Subject [JENKINS] Lucene-Solr-trunk-Linux (32bit/ibm-j9-jdk7) - Build # 158 - Failure!
Date Sat, 04 Aug 2012 05:27:28 GMT
Build: http://jenkins.sd-datasolutions.de/job/Lucene-Solr-trunk-Linux/158/
Java: 32bit/ibm-j9-jdk7 

1 tests failed.
REGRESSION:  org.apache.lucene.analysis.pattern.TestPatternReplaceCharFilter.testRandomStrings

Error Message:


Stack Trace:
java.lang.AssertionError
	at __randomizedtesting.SeedInfo.seed([54B3B539510C9F35:DC3AB587F208C800]:0)
	at org.apache.lucene.util.packed.GrowableWriter.ensureCapacity(GrowableWriter.java:70)
	at org.apache.lucene.util.packed.GrowableWriter.set(GrowableWriter.java:83)
	at org.apache.lucene.util.fst.FST.pack(FST.java:1505)
	at org.apache.lucene.codecs.memory.MemoryPostingsFormat$TermsWriter.finish(MemoryPostingsFormat.java:273)
	at org.apache.lucene.index.FreqProxTermsWriterPerField.flush(FreqProxTermsWriterPerField.java:550)
	at org.apache.lucene.index.FreqProxTermsWriter.flush(FreqProxTermsWriter.java:85)
	at org.apache.lucene.index.TermsHash.flush(TermsHash.java:117)
	at org.apache.lucene.index.DocInverter.flush(DocInverter.java:53)
	at org.apache.lucene.index.DocFieldProcessor.flush(DocFieldProcessor.java:82)
	at org.apache.lucene.index.DocumentsWriterPerThread.flush(DocumentsWriterPerThread.java:481)
	at org.apache.lucene.index.DocumentsWriter.doFlush(DocumentsWriter.java:419)
	at org.apache.lucene.index.DocumentsWriter.flushAllThreads(DocumentsWriter.java:551)
	at org.apache.lucene.index.IndexWriter.doFlush(IndexWriter.java:2863)
	at org.apache.lucene.index.IndexWriter.flush(IndexWriter.java:2839)
	at org.apache.lucene.index.IndexWriter.closeInternal(IndexWriter.java:890)
	at org.apache.lucene.index.IndexWriter.close(IndexWriter.java:845)
	at org.apache.lucene.index.IndexWriter.close(IndexWriter.java:807)
	at org.apache.lucene.index.RandomIndexWriter.close(RandomIndexWriter.java:438)
	at org.apache.lucene.util.IOUtils.close(IOUtils.java:144)
	at org.apache.lucene.analysis.BaseTokenStreamTestCase.checkRandomData(BaseTokenStreamTestCase.java:469)
	at org.apache.lucene.analysis.BaseTokenStreamTestCase.checkRandomData(BaseTokenStreamTestCase.java:425)
	at org.apache.lucene.analysis.pattern.TestPatternReplaceCharFilter.testRandomStrings(TestPatternReplaceCharFilter.java:326)
	at sun.reflect.NativeMethodAccessorImpl.invoke0(Native Method)
	at sun.reflect.NativeMethodAccessorImpl.invoke(NativeMethodAccessorImpl.java:88)
	at sun.reflect.DelegatingMethodAccessorImpl.invoke(DelegatingMethodAccessorImpl.java:55)
	at java.lang.reflect.Method.invoke(Method.java:613)
	at com.carrotsearch.randomizedtesting.RandomizedRunner.invoke(RandomizedRunner.java:1995)
	at com.carrotsearch.randomizedtesting.RandomizedRunner.access$1100(RandomizedRunner.java:132)
	at com.carrotsearch.randomizedtesting.RandomizedRunner$6.evaluate(RandomizedRunner.java:818)
	at com.carrotsearch.randomizedtesting.RandomizedRunner$7.evaluate(RandomizedRunner.java:877)
	at com.carrotsearch.randomizedtesting.RandomizedRunner$8.evaluate(RandomizedRunner.java:891)
	at org.apache.lucene.util.TestRuleSetupTeardownChained$1.evaluate(TestRuleSetupTeardownChained.java:50)
	at org.apache.lucene.util.TestRuleFieldCacheSanity$1.evaluate(TestRuleFieldCacheSanity.java:32)
	at org.apache.lucene.util.AbstractBeforeAfterRule$1.evaluate(AbstractBeforeAfterRule.java:45)
	at com.carrotsearch.randomizedtesting.rules.SystemPropertiesInvariantRule$1.evaluate(SystemPropertiesInvariantRule.java:55)
	at org.apache.lucene.util.TestRuleReportUncaughtExceptions$1.evaluate(TestRuleReportUncaughtExceptions.java:68)
	at org.apache.lucene.util.TestRuleThreadAndTestName$1.evaluate(TestRuleThreadAndTestName.java:48)
	at org.apache.lucene.util.TestRuleIgnoreAfterMaxFailures$1.evaluate(TestRuleIgnoreAfterMaxFailures.java:70)
	at org.apache.lucene.util.TestRuleMarkFailure$1.evaluate(TestRuleMarkFailure.java:48)
	at com.carrotsearch.randomizedtesting.RandomizedRunner.runSingleTest(RandomizedRunner.java:825)
	at com.carrotsearch.randomizedtesting.RandomizedRunner.access$700(RandomizedRunner.java:132)
	at com.carrotsearch.randomizedtesting.RandomizedRunner$3$1.run(RandomizedRunner.java:671)
	at com.carrotsearch.randomizedtesting.RandomizedRunner$3.evaluate(RandomizedRunner.java:697)
	at com.carrotsearch.randomizedtesting.RandomizedRunner$4.evaluate(RandomizedRunner.java:736)
	at com.carrotsearch.randomizedtesting.RandomizedRunner$5.evaluate(RandomizedRunner.java:747)
	at org.apache.lucene.util.AbstractBeforeAfterRule$1.evaluate(AbstractBeforeAfterRule.java:45)
	at org.apache.lucene.util.TestRuleReportUncaughtExceptions$1.evaluate(TestRuleReportUncaughtExceptions.java:68)
	at org.apache.lucene.util.TestRuleStoreClassName$1.evaluate(TestRuleStoreClassName.java:38)
	at com.carrotsearch.randomizedtesting.rules.SystemPropertiesInvariantRule$1.evaluate(SystemPropertiesInvariantRule.java:55)
	at org.apache.lucene.util.TestRuleNoInstanceHooksOverrides$1.evaluate(TestRuleNoInstanceHooksOverrides.java:53)
	at org.apache.lucene.util.TestRuleNoStaticHooksShadowing$1.evaluate(TestRuleNoStaticHooksShadowing.java:52)
	at org.apache.lucene.util.TestRuleAssertionsRequired$1.evaluate(TestRuleAssertionsRequired.java:36)
	at org.apache.lucene.util.TestRuleMarkFailure$1.evaluate(TestRuleMarkFailure.java:48)
	at org.apache.lucene.util.TestRuleIgnoreAfterMaxFailures$1.evaluate(TestRuleIgnoreAfterMaxFailures.java:70)
	at org.apache.lucene.util.TestRuleIgnoreTestSuites$1.evaluate(TestRuleIgnoreTestSuites.java:55)
	at com.carrotsearch.randomizedtesting.RandomizedRunner.runSuite(RandomizedRunner.java:605)
	at com.carrotsearch.randomizedtesting.RandomizedRunner.access$400(RandomizedRunner.java:132)
	at com.carrotsearch.randomizedtesting.RandomizedRunner$2.run(RandomizedRunner.java:551)
	Suppressed: java.lang.RuntimeException: MockDirectoryWrapper: cannot close: there are still
open locks: [write.lock]
		at org.apache.lucene.store.MockDirectoryWrapper.close(MockDirectoryWrapper.java:552)
		... 40 more




Build Log:
[...truncated 3762 lines...]
[junit4:junit4] Suite: org.apache.lucene.analysis.pattern.TestPatternReplaceCharFilter
[junit4:junit4] FAILURE 2.30s J0 | TestPatternReplaceCharFilter.testRandomStrings
[junit4:junit4]    > Throwable #1: java.lang.AssertionError
[junit4:junit4]    > 	at __randomizedtesting.SeedInfo.seed([54B3B539510C9F35:DC3AB587F208C800]:0)
[junit4:junit4]    > 	at org.apache.lucene.util.packed.GrowableWriter.ensureCapacity(GrowableWriter.java:70)
[junit4:junit4]    > 	at org.apache.lucene.util.packed.GrowableWriter.set(GrowableWriter.java:83)
[junit4:junit4]    > 	at org.apache.lucene.util.fst.FST.pack(FST.java:1505)
[junit4:junit4]    > 	at org.apache.lucene.codecs.memory.MemoryPostingsFormat$TermsWriter.finish(MemoryPostingsFormat.java:273)
[junit4:junit4]    > 	at org.apache.lucene.index.FreqProxTermsWriterPerField.flush(FreqProxTermsWriterPerField.java:550)
[junit4:junit4]    > 	at org.apache.lucene.index.FreqProxTermsWriter.flush(FreqProxTermsWriter.java:85)
[junit4:junit4]    > 	at org.apache.lucene.index.TermsHash.flush(TermsHash.java:117)
[junit4:junit4]    > 	at org.apache.lucene.index.DocInverter.flush(DocInverter.java:53)
[junit4:junit4]    > 	at org.apache.lucene.index.DocFieldProcessor.flush(DocFieldProcessor.java:82)
[junit4:junit4]    > 	at org.apache.lucene.index.DocumentsWriterPerThread.flush(DocumentsWriterPerThread.java:481)
[junit4:junit4]    > 	at org.apache.lucene.index.DocumentsWriter.doFlush(DocumentsWriter.java:419)
[junit4:junit4]    > 	at org.apache.lucene.index.DocumentsWriter.flushAllThreads(DocumentsWriter.java:551)
[junit4:junit4]    > 	at org.apache.lucene.index.IndexWriter.doFlush(IndexWriter.java:2863)
[junit4:junit4]    > 	at org.apache.lucene.index.IndexWriter.flush(IndexWriter.java:2839)
[junit4:junit4]    > 	at org.apache.lucene.index.IndexWriter.closeInternal(IndexWriter.java:890)
[junit4:junit4]    > 	at org.apache.lucene.index.IndexWriter.close(IndexWriter.java:845)
[junit4:junit4]    > 	at org.apache.lucene.index.IndexWriter.close(IndexWriter.java:807)
[junit4:junit4]    > 	at org.apache.lucene.index.RandomIndexWriter.close(RandomIndexWriter.java:438)
[junit4:junit4]    > 	at org.apache.lucene.util.IOUtils.close(IOUtils.java:144)
[junit4:junit4]    > 	at org.apache.lucene.analysis.BaseTokenStreamTestCase.checkRandomData(BaseTokenStreamTestCase.java:469)
[junit4:junit4]    > 	at org.apache.lucene.analysis.BaseTokenStreamTestCase.checkRandomData(BaseTokenStreamTestCase.java:425)
[junit4:junit4]    > 	at org.apache.lucene.analysis.pattern.TestPatternReplaceCharFilter.testRandomStrings(TestPatternReplaceCharFilter.java:326)
[junit4:junit4]    > 	at sun.reflect.NativeMethodAccessorImpl.invoke0(Native Method)
[junit4:junit4]    > 	at sun.reflect.NativeMethodAccessorImpl.invoke(NativeMethodAccessorImpl.java:88)
[junit4:junit4]    > 	at sun.reflect.DelegatingMethodAccessorImpl.invoke(DelegatingMethodAccessorImpl.java:55)
[junit4:junit4]    > 	at java.lang.reflect.Method.invoke(Method.java:613)
[junit4:junit4]    > 	at com.carrotsearch.randomizedtesting.RandomizedRunner.invoke(RandomizedRunner.java:1995)
[junit4:junit4]    > 	at com.carrotsearch.randomizedtesting.RandomizedRunner.access$1100(RandomizedRunner.java:132)
[junit4:junit4]    > 	at com.carrotsearch.randomizedtesting.RandomizedRunner$6.evaluate(RandomizedRunner.java:818)
[junit4:junit4]    > 	at com.carrotsearch.randomizedtesting.RandomizedRunner$7.evaluate(RandomizedRunner.java:877)
[junit4:junit4]    > 	at com.carrotsearch.randomizedtesting.RandomizedRunner$8.evaluate(RandomizedRunner.java:891)
[junit4:junit4]    > 	at org.apache.lucene.util.TestRuleSetupTeardownChained$1.evaluate(TestRuleSetupTeardownChained.java:50)
[junit4:junit4]    > 	at org.apache.lucene.util.TestRuleFieldCacheSanity$1.evaluate(TestRuleFieldCacheSanity.java:32)
[junit4:junit4]    > 	at org.apache.lucene.util.AbstractBeforeAfterRule$1.evaluate(AbstractBeforeAfterRule.java:45)
[junit4:junit4]    > 	at com.carrotsearch.randomizedtesting.rules.SystemPropertiesInvariantRule$1.evaluate(SystemPropertiesInvariantRule.java:55)
[junit4:junit4]    > 	at org.apache.lucene.util.TestRuleReportUncaughtExceptions$1.evaluate(TestRuleReportUncaughtExceptions.java:68)
[junit4:junit4]    > 	at org.apache.lucene.util.TestRuleThreadAndTestName$1.evaluate(TestRuleThreadAndTestName.java:48)
[junit4:junit4]    > 	at org.apache.lucene.util.TestRuleIgnoreAfterMaxFailures$1.evaluate(TestRuleIgnoreAfterMaxFailures.java:70)
[junit4:junit4]    > 	at org.apache.lucene.util.TestRuleMarkFailure$1.evaluate(TestRuleMarkFailure.java:48)
[junit4:junit4]    > 	at com.carrotsearch.randomizedtesting.RandomizedRunner.runSingleTest(RandomizedRunner.java:825)
[junit4:junit4]    > 	at com.carrotsearch.randomizedtesting.RandomizedRunner.access$700(RandomizedRunner.java:132)
[junit4:junit4]    > 	at com.carrotsearch.randomizedtesting.RandomizedRunner$3$1.run(RandomizedRunner.java:671)
[junit4:junit4]    > 	at com.carrotsearch.randomizedtesting.RandomizedRunner$3.evaluate(RandomizedRunner.java:697)
[junit4:junit4]    > 	at com.carrotsearch.randomizedtesting.RandomizedRunner$4.evaluate(RandomizedRunner.java:736)
[junit4:junit4]    > 	at com.carrotsearch.randomizedtesting.RandomizedRunner$5.evaluate(RandomizedRunner.java:747)
[junit4:junit4]    > 	at org.apache.lucene.util.AbstractBeforeAfterRule$1.evaluate(AbstractBeforeAfterRule.java:45)
[junit4:junit4]    > 	at org.apache.lucene.util.TestRuleReportUncaughtExceptions$1.evaluate(TestRuleReportUncaughtExceptions.java:68)
[junit4:junit4]    > 	at org.apache.lucene.util.TestRuleStoreClassName$1.evaluate(TestRuleStoreClassName.java:38)
[junit4:junit4]    > 	at com.carrotsearch.randomizedtesting.rules.SystemPropertiesInvariantRule$1.evaluate(SystemPropertiesInvariantRule.java:55)
[junit4:junit4]    > 	at org.apache.lucene.util.TestRuleNoInstanceHooksOverrides$1.evaluate(TestRuleNoInstanceHooksOverrides.java:53)
[junit4:junit4]    > 	at org.apache.lucene.util.TestRuleNoStaticHooksShadowing$1.evaluate(TestRuleNoStaticHooksShadowing.java:52)
[junit4:junit4]    > 	at org.apache.lucene.util.TestRuleAssertionsRequired$1.evaluate(TestRuleAssertionsRequired.java:36)
[junit4:junit4]    > 	at org.apache.lucene.util.TestRuleMarkFailure$1.evaluate(TestRuleMarkFailure.java:48)
[junit4:junit4]    > 	at org.apache.lucene.util.TestRuleIgnoreAfterMaxFailures$1.evaluate(TestRuleIgnoreAfterMaxFailures.java:70)
[junit4:junit4]    > 	at org.apache.lucene.util.TestRuleIgnoreTestSuites$1.evaluate(TestRuleIgnoreTestSuites.java:55)
[junit4:junit4]    > 	at com.carrotsearch.randomizedtesting.RandomizedRunner.runSuite(RandomizedRunner.java:605)
[junit4:junit4]    > 	at com.carrotsearch.randomizedtesting.RandomizedRunner.access$400(RandomizedRunner.java:132)
[junit4:junit4]    > 	at com.carrotsearch.randomizedtesting.RandomizedRunner$2.run(RandomizedRunner.java:551)
[junit4:junit4]    > 	Suppressed: java.lang.RuntimeException: MockDirectoryWrapper: cannot
close: there are still open locks: [write.lock]
[junit4:junit4]    > 		at org.apache.lucene.store.MockDirectoryWrapper.close(MockDirectoryWrapper.java:552)
[junit4:junit4]    > 		... 40 more
[junit4:junit4]    > 
[junit4:junit4]   2> NOTE: reproduce with: ant test  -Dtestcase=TestPatternReplaceCharFilter
-Dtests.method=testRandomStrings -Dtests.seed=54B3B539510C9F35 -Dtests.multiplier=3 -Dtests.slow=true
-Dtests.locale=sh -Dtests.timezone=Africa/Addis_Ababa -Dtests.file.encoding=UTF-8
[junit4:junit4]   2>
[junit4:junit4] IGNORED 0.00s J0 | TestPatternReplaceCharFilter.testNastyPattern
[junit4:junit4]    > Cause: Annotated @Ignore()
[junit4:junit4]    > (@AfterClass output)
[junit4:junit4]   2> NOTE: test params are: codec=Lucene40: {dummy=PostingsFormat(name=Memory
doPackFST= true)}, sim=RandomSimilarityProvider(queryNorm=false,coord=false): {dummy=DFR I(ne)B2},
locale=sh, timezone=Africa/Addis_Ababa
[junit4:junit4]   2> NOTE: Linux 3.2.0-27-generic x86/IBM Corporation 1.7.0 (32-bit)/cpus=8,threads=1,free=7178872,total=23920640
[junit4:junit4]   2> NOTE: All tests run in this JVM: [TestPerFieldAnalyzerWrapper, TestNorwegianMinimalStemFilterFactory,
TestWordDelimiterFilter, TestStopFilterFactory, GreekAnalyzerTest, TestNorwegianMinimalStemFilter,
TestFrenchMinimalStemFilterFactory, TestStemmerOverrideFilterFactory, TokenTypeSinkTokenizerTest,
TestPatternReplaceCharFilter]
[junit4:junit4]   2> 
[junit4:junit4] Completed on J0 in 2.42s, 14 tests, 1 failure, 1 skipped <<< FAILURES!

[...truncated 551 lines...]
BUILD FAILED
/mnt/ssd/jenkins/workspace/Lucene-Solr-trunk-Linux/checkout/build.xml:29: The following error
occurred while executing this line:
/mnt/ssd/jenkins/workspace/Lucene-Solr-trunk-Linux/checkout/lucene/build.xml:502: The following
error occurred while executing this line:
/mnt/ssd/jenkins/workspace/Lucene-Solr-trunk-Linux/checkout/lucene/common-build.xml:1497:
The following error occurred while executing this line:
/mnt/ssd/jenkins/workspace/Lucene-Solr-trunk-Linux/checkout/lucene/analysis/build.xml:101:
The following error occurred while executing this line:
/mnt/ssd/jenkins/workspace/Lucene-Solr-trunk-Linux/checkout/lucene/analysis/build.xml:38:
The following error occurred while executing this line:
/mnt/ssd/jenkins/workspace/Lucene-Solr-trunk-Linux/checkout/lucene/module-build.xml:62: The
following error occurred while executing this line:
/mnt/ssd/jenkins/workspace/Lucene-Solr-trunk-Linux/checkout/lucene/common-build.xml:1095:
The following error occurred while executing this line:
/mnt/ssd/jenkins/workspace/Lucene-Solr-trunk-Linux/checkout/lucene/common-build.xml:790: There
were test failures: 210 suites, 1063 tests, 1 failure, 1 ignored

Total time: 8 minutes 35 seconds
Build step 'Execute shell' marked build as failure
Archiving artifacts
Recording test results
Email was triggered for: Failure
Sending email for trigger: Failure



Mime
View raw message