lucene-dev mailing list archives

Site index · List index
Message view « Date » · « Thread »
Top « Date » · « Thread »
From Policeman Jenkins Server <jenk...@sd-datasolutions.de>
Subject [JENKINS] Lucene-Solr-4.x-Windows (64bit/jdk1.6.0_33) - Build # 261 - Still Failing!
Date Wed, 15 Aug 2012 10:13:58 GMT
Build: http://jenkins.sd-datasolutions.de/job/Lucene-Solr-4.x-Windows/261/
Java: 64bit/jdk1.6.0_33 -XX:+UseConcMarkSweepGC

1 tests failed.
FAILED:  org.apache.solr.spelling.suggest.SuggesterTSTTest.testSuggestions

Error Message:
Exception during query

Stack Trace:
java.lang.RuntimeException: Exception during query
	at __randomizedtesting.SeedInfo.seed([A517ACFF9883BFE:AC8D433A37BC6C00]:0)
	at org.apache.solr.SolrTestCaseJ4.assertQ(SolrTestCaseJ4.java:493)
	at org.apache.solr.SolrTestCaseJ4.assertQ(SolrTestCaseJ4.java:460)
	at org.apache.solr.spelling.suggest.SuggesterTest.testSuggestions(SuggesterTest.java:71)
	at sun.reflect.NativeMethodAccessorImpl.invoke0(Native Method)
	at sun.reflect.NativeMethodAccessorImpl.invoke(NativeMethodAccessorImpl.java:39)
	at sun.reflect.DelegatingMethodAccessorImpl.invoke(DelegatingMethodAccessorImpl.java:25)
	at java.lang.reflect.Method.invoke(Method.java:597)
	at com.carrotsearch.randomizedtesting.RandomizedRunner.invoke(RandomizedRunner.java:1559)
	at com.carrotsearch.randomizedtesting.RandomizedRunner.access$600(RandomizedRunner.java:79)
	at com.carrotsearch.randomizedtesting.RandomizedRunner$6.evaluate(RandomizedRunner.java:737)
	at com.carrotsearch.randomizedtesting.RandomizedRunner$7.evaluate(RandomizedRunner.java:773)
	at com.carrotsearch.randomizedtesting.RandomizedRunner$8.evaluate(RandomizedRunner.java:787)
	at com.carrotsearch.randomizedtesting.rules.SystemPropertiesRestoreRule$1.evaluate(SystemPropertiesRestoreRule.java:53)
	at org.apache.lucene.util.TestRuleSetupTeardownChained$1.evaluate(TestRuleSetupTeardownChained.java:50)
	at org.apache.lucene.util.TestRuleFieldCacheSanity$1.evaluate(TestRuleFieldCacheSanity.java:32)
	at org.apache.lucene.util.AbstractBeforeAfterRule$1.evaluate(AbstractBeforeAfterRule.java:45)
	at com.carrotsearch.randomizedtesting.rules.SystemPropertiesInvariantRule$1.evaluate(SystemPropertiesInvariantRule.java:55)
	at org.apache.lucene.util.TestRuleThreadAndTestName$1.evaluate(TestRuleThreadAndTestName.java:48)
	at org.apache.lucene.util.TestRuleIgnoreAfterMaxFailures$1.evaluate(TestRuleIgnoreAfterMaxFailures.java:70)
	at org.apache.lucene.util.TestRuleMarkFailure$1.evaluate(TestRuleMarkFailure.java:48)
	at com.carrotsearch.randomizedtesting.rules.StatementAdapter.evaluate(StatementAdapter.java:36)
	at com.carrotsearch.randomizedtesting.ThreadLeakControl$StatementRunner.run(ThreadLeakControl.java:345)
	at com.carrotsearch.randomizedtesting.ThreadLeakControl.forkTimeoutingTask(ThreadLeakControl.java:769)
	at com.carrotsearch.randomizedtesting.ThreadLeakControl$3.evaluate(ThreadLeakControl.java:429)
	at com.carrotsearch.randomizedtesting.RandomizedRunner.runSingleTest(RandomizedRunner.java:746)
	at com.carrotsearch.randomizedtesting.RandomizedRunner$3.evaluate(RandomizedRunner.java:648)
	at com.carrotsearch.randomizedtesting.RandomizedRunner$4.evaluate(RandomizedRunner.java:682)
	at com.carrotsearch.randomizedtesting.RandomizedRunner$5.evaluate(RandomizedRunner.java:693)
	at com.carrotsearch.randomizedtesting.rules.StatementAdapter.evaluate(StatementAdapter.java:36)
	at com.carrotsearch.randomizedtesting.rules.SystemPropertiesRestoreRule$1.evaluate(SystemPropertiesRestoreRule.java:53)
	at org.apache.lucene.util.AbstractBeforeAfterRule$1.evaluate(AbstractBeforeAfterRule.java:45)
	at org.apache.lucene.util.TestRuleStoreClassName$1.evaluate(TestRuleStoreClassName.java:38)
	at com.carrotsearch.randomizedtesting.rules.SystemPropertiesInvariantRule$1.evaluate(SystemPropertiesInvariantRule.java:55)
	at com.carrotsearch.randomizedtesting.rules.NoShadowingOrOverridesOnMethodsRule$1.evaluate(NoShadowingOrOverridesOnMethodsRule.java:39)
	at com.carrotsearch.randomizedtesting.rules.NoShadowingOrOverridesOnMethodsRule$1.evaluate(NoShadowingOrOverridesOnMethodsRule.java:39)
	at org.apache.lucene.util.TestRuleAssertionsRequired$1.evaluate(TestRuleAssertionsRequired.java:40)
	at org.apache.lucene.util.TestRuleMarkFailure$1.evaluate(TestRuleMarkFailure.java:48)
	at org.apache.lucene.util.TestRuleIgnoreAfterMaxFailures$1.evaluate(TestRuleIgnoreAfterMaxFailures.java:70)
	at org.apache.lucene.util.TestRuleIgnoreTestSuites$1.evaluate(TestRuleIgnoreTestSuites.java:55)
	at com.carrotsearch.randomizedtesting.rules.StatementAdapter.evaluate(StatementAdapter.java:36)
	at com.carrotsearch.randomizedtesting.ThreadLeakControl$StatementRunner.run(ThreadLeakControl.java:345)
	at java.lang.Thread.run(Thread.java:662)
Caused by: java.lang.RuntimeException: REQUEST FAILED: xpath=//lst[@name='spellcheck']/lst[@name='suggestions']/lst[@name='ac']/int[@name='numFound'][.='2']
	xml response was: <?xml version="1.0" encoding="UTF-8"?>
<response>
<lst name="responseHeader"><int name="status">0</int><int name="QTime">1</int></lst><lst name="spellcheck"><lst name="suggestions"/></lst>
</response>

	request was:q=ac&spellcheck.count=2&qt=/suggest_tst&spellcheck.onlyMorePopular=true
	at org.apache.solr.SolrTestCaseJ4.assertQ(SolrTestCaseJ4.java:486)
	... 41 more




Build Log:
[...truncated 6695 lines...]
[junit4:junit4] Suite: org.apache.solr.spelling.suggest.SuggesterTSTTest
[junit4:junit4]   2> 0 T3232 oas.SolrTestCaseJ4.initCore ####initCore
[junit4:junit4]   2> Creating dataDir: C:\Jenkins\workspace\Lucene-Solr-4.x-Windows\solr\build\solr-core\test\J0\.\solrtest-SuggesterTSTTest-1345025509928
[junit4:junit4]   2> 1 T3232 oasc.SolrResourceLoader.<init> new SolrResourceLoader for directory: 'C:\Jenkins\workspace\Lucene-Solr-4.x-Windows\solr\build\solr-core\test-files\solr\collection1\'
[junit4:junit4]   2> 1 T3232 oasc.SolrResourceLoader.replaceClassLoader Adding 'file:/C:/Jenkins/workspace/Lucene-Solr-4.x-Windows/solr/build/solr-core/test-files/solr/collection1/lib/classes/' to classloader
[junit4:junit4]   2> 1 T3232 oasc.SolrResourceLoader.replaceClassLoader Adding 'file:/C:/Jenkins/workspace/Lucene-Solr-4.x-Windows/solr/build/solr-core/test-files/solr/collection1/lib/README' to classloader
[junit4:junit4]   2> 49 T3232 oasc.SolrConfig.<init> Using Lucene MatchVersion: LUCENE_40
[junit4:junit4]   2> 159 T3232 oasc.SolrConfig.<init> Loaded SolrConfig: solrconfig-spellchecker.xml
[junit4:junit4]   2> 159 T3232 oass.IndexSchema.readSchema Reading Solr Schema
[junit4:junit4]   2> 164 T3232 oass.IndexSchema.readSchema Schema name=Solr SpellCheck Test
[junit4:junit4]   2> 266 T3232 oass.IndexSchema.readSchema default search field in schema is text
[junit4:junit4]   2> 268 T3232 oass.IndexSchema.readSchema query parser default operator is OR
[junit4:junit4]   2> 269 T3232 oass.IndexSchema.readSchema unique key field: id
[junit4:junit4]   2> 272 T3232 oasc.SolrResourceLoader.locateSolrHome JNDI not configured for solr (NoInitialContextEx)
[junit4:junit4]   2> 273 T3232 oasc.SolrResourceLoader.locateSolrHome using system property solr.solr.home: C:\Jenkins\workspace\Lucene-Solr-4.x-Windows\solr\build\solr-core\test-files\solr
[junit4:junit4]   2> 273 T3232 oasc.SolrResourceLoader.<init> new SolrResourceLoader for directory: 'C:\Jenkins\workspace\Lucene-Solr-4.x-Windows\solr\build\solr-core\test-files\solr\'
[junit4:junit4]   2> 283 T3232 oasc.CoreContainer.<init> New CoreContainer 97034063
[junit4:junit4]   2> 283 T3232 oasc.SolrCore.<init> [collection1] Opening new SolrCore at C:\Jenkins\workspace\Lucene-Solr-4.x-Windows\solr\build\solr-core\test-files\solr\collection1\, dataDir=C:\Jenkins\workspace\Lucene-Solr-4.x-Windows\solr\build\solr-core\test\J0\.\solrtest-SuggesterTSTTest-1345025509928\
[junit4:junit4]   2> 284 T3232 oasc.SolrCore.<init> JMX monitoring not detected for core: collection1
[junit4:junit4]   2> 285 T3232 oasc.SolrCore.getNewIndexDir WARNING New index directory detected: old=null new=C:\Jenkins\workspace\Lucene-Solr-4.x-Windows\solr\build\solr-core\test\J0\.\solrtest-SuggesterTSTTest-1345025509928\index/
[junit4:junit4]   2> 285 T3232 oasc.SolrCore.initIndex WARNING [collection1] Solr index directory 'C:\Jenkins\workspace\Lucene-Solr-4.x-Windows\solr\build\solr-core\test\J0\.\solrtest-SuggesterTSTTest-1345025509928\index' doesn't exist. Creating new index...
[junit4:junit4]   2> 288 T3232 oasc.SolrDeletionPolicy.onCommit SolrDeletionPolicy.onCommit: commits:num=1
[junit4:junit4]   2> 		commit{dir=MockDirWrapper(org.apache.lucene.store.NIOFSDirectory@C:\Jenkins\workspace\Lucene-Solr-4.x-Windows\solr\build\solr-core\test\J0\solrtest-SuggesterTSTTest-1345025509928\index lockFactory=org.apache.lucene.store.NativeFSLockFactory@2c2a15d),segFN=segments_1,generation=1,filenames=[segments_1]
[junit4:junit4]   2> 289 T3232 oasc.SolrDeletionPolicy.updateCommits newest commit = 1
[junit4:junit4]   2> 290 T3232 oasc.RequestHandlers.initHandlersFromConfig created standard: solr.StandardRequestHandler
[junit4:junit4]   2> 290 T3232 oasc.RequestHandlers.initHandlersFromConfig created /suggest: org.apache.solr.handler.component.SearchHandler
[junit4:junit4]   2> 290 T3232 oasc.RequestHandlers.initHandlersFromConfig created /suggest_tst: org.apache.solr.handler.component.SearchHandler
[junit4:junit4]   2> 290 T3232 oasc.RequestHandlers.initHandlersFromConfig created /suggest_fst: org.apache.solr.handler.component.SearchHandler
[junit4:junit4]   2> 290 T3232 oasc.RequestHandlers.initHandlersFromConfig created /suggest_wfst: org.apache.solr.handler.component.SearchHandler
[junit4:junit4]   2> 294 T3232 oass.SolrIndexSearcher.<init> Opening Searcher@54dcf84c main
[junit4:junit4]   2> 295 T3232 oass.SolrIndexSearcher.getIndexDir WARNING WARNING: Directory impl does not support setting indexDir: org.apache.lucene.store.MockDirectoryWrapper
[junit4:junit4]   2> 295 T3232 oasu.CommitTracker.<init> Hard AutoCommit: disabled
[junit4:junit4]   2> 296 T3232 oasu.CommitTracker.<init> Soft AutoCommit: disabled
[junit4:junit4]   2> 296 T3232 oashc.SpellCheckComponent.inform Initializing spell checkers
[junit4:junit4]   2> 296 T3232 oasss.Suggester.init init: {name=suggest,classname=org.apache.solr.spelling.suggest.Suggester,lookupImpl=org.apache.solr.spelling.suggest.jaspell.JaspellLookup,field=suggest,storeDir=suggest,buildOnCommit=true,threshold=0.0}
[junit4:junit4]   2> 296 T3232 oasssj.JaspellLookupFactory.create init: {name=suggest,classname=org.apache.solr.spelling.suggest.Suggester,lookupImpl=org.apache.solr.spelling.suggest.jaspell.JaspellLookup,field=suggest,storeDir=suggest,buildOnCommit=true,threshold=0.0}
[junit4:junit4]   2> 300 T3232 oashc.SpellCheckComponent.inform Registering newSearcher listener for spellchecker: suggest
[junit4:junit4]   2> 301 T3232 oashc.SpellCheckComponent.inform No queryConverter defined, using default converter
[junit4:junit4]   2> 301 T3232 oashc.SpellCheckComponent.inform Initializing spell checkers
[junit4:junit4]   2> 301 T3232 oasss.Suggester.init init: {name=suggest_tst,classname=org.apache.solr.spelling.suggest.Suggester,lookupImpl=org.apache.solr.spelling.suggest.tst.TSTLookup,field=suggest,storeDir=suggest_tst,buildOnCommit=true,threshold=0.0}
[junit4:junit4]   2> 302 T3232 oashc.SpellCheckComponent.inform Registering newSearcher listener for spellchecker: suggest_tst
[junit4:junit4]   2> 302 T3232 oashc.SpellCheckComponent.inform No queryConverter defined, using default converter
[junit4:junit4]   2> 302 T3232 oashc.SpellCheckComponent.inform Initializing spell checkers
[junit4:junit4]   2> 302 T3232 oasss.Suggester.init init: {name=suggest_fst,classname=org.apache.solr.spelling.suggest.Suggester,lookupImpl=org.apache.solr.spelling.suggest.fst.FSTLookup,field=suggest,storeDir=suggest_fst,buildOnCommit=true,weightBuckets=5,exactMatchFirst=true}
[junit4:junit4]   2> 304 T3232 oashc.SpellCheckComponent.inform Registering newSearcher listener for spellchecker: suggest_fst
[junit4:junit4]   2> 304 T3232 oashc.SpellCheckComponent.inform No queryConverter defined, using default converter
[junit4:junit4]   2> 304 T3232 oashc.SpellCheckComponent.inform Initializing spell checkers
[junit4:junit4]   2> 304 T3232 oasss.Suggester.init init: {name=suggest_wfst,classname=org.apache.solr.spelling.suggest.Suggester,lookupImpl=org.apache.solr.spelling.suggest.fst.WFSTLookupFactory,field=suggest,storeDir=suggest_wfst,buildOnCommit=true,exactMatchFirst=true}
[junit4:junit4]   2> 305 T3232 oashc.SpellCheckComponent.inform Registering newSearcher listener for spellchecker: suggest_wfst
[junit4:junit4]   2> 305 T3232 oashc.SpellCheckComponent.inform No queryConverter defined, using default converter
[junit4:junit4]   2> 305 T3232 oashc.HttpShardHandlerFactory.getParameter Setting socketTimeout to: 0
[junit4:junit4]   2> 305 T3232 oashc.HttpShardHandlerFactory.getParameter Setting urlScheme to: http://
[junit4:junit4]   2> 305 T3232 oashc.HttpShardHandlerFactory.getParameter Setting connTimeout to: 0
[junit4:junit4]   2> 305 T3232 oashc.HttpShardHandlerFactory.getParameter Setting maxConnectionsPerHost to: 20
[junit4:junit4]   2> 305 T3232 oashc.HttpShardHandlerFactory.getParameter Setting corePoolSize to: 0
[junit4:junit4]   2> 306 T3232 oashc.HttpShardHandlerFactory.getParameter Setting maximumPoolSize to: 2147483647
[junit4:junit4]   2> 306 T3232 oashc.HttpShardHandlerFactory.getParameter Setting maxThreadIdleTime to: 5
[junit4:junit4]   2> 306 T3232 oashc.HttpShardHandlerFactory.getParameter Setting sizeOfQueue to: -1
[junit4:junit4]   2> 306 T3232 oashc.HttpShardHandlerFactory.getParameter Setting fairnessPolicy to: false
[junit4:junit4]   2> 307 T3232 oascsi.HttpClientUtil.createClient Creating new http client, config:maxConnectionsPerHost=20&maxConnections=10000&socketTimeout=0&connTimeout=0&retry=false
[junit4:junit4]   2> 311 T3232 oasc.CoreContainer.register registering core: collection1
[junit4:junit4]   2> 312 T3232 oas.SolrTestCaseJ4.initCore ####initCore end
[junit4:junit4]   2> 319 T3232 oas.SolrTestCaseJ4.setUp ###Starting testSuggestions
[junit4:junit4]   2> ASYNC  NEW_CORE C250 name=collection1 org.apache.solr.core.SolrCore@4e8302a7
[junit4:junit4]   2> 326 T3232 C250 oasc.SolrDeletionPolicy.onInit SolrDeletionPolicy.onInit: commits:num=1
[junit4:junit4]   2> 		commit{dir=MockDirWrapper(org.apache.lucene.store.NIOFSDirectory@C:\Jenkins\workspace\Lucene-Solr-4.x-Windows\solr\build\solr-core\test\J0\solrtest-SuggesterTSTTest-1345025509928\index lockFactory=org.apache.lucene.store.NativeFSLockFactory@2c2a15d),segFN=segments_1,generation=1,filenames=[segments_1]
[junit4:junit4]   2> 326 T3232 C250 oasc.SolrDeletionPolicy.updateCommits newest commit = 1
[junit4:junit4]   2> 328 T3232 C250 UPDATE [collection1] webapp=null path=null params={} {add=[1]} 0 5
[junit4:junit4]   2> 354 T3232 C250 UPDATE [collection1] webapp=null path=null params={} {add=[2]} 0 0
[junit4:junit4]   2> 361 T3232 C250 UPDATE [collection1] webapp=null path=null params={} {add=[3]} 0 0
[junit4:junit4]   2> 368 T3232 C250 oasu.DirectUpdateHandler2.commit start commit{flags=0,_version_=0,optimize=false,openSearcher=true,waitSearcher=true,expungeDeletes=false,softCommit=false}
[junit4:junit4]   2> 380 T3232 C250 oasc.SolrDeletionPolicy.onCommit SolrDeletionPolicy.onCommit: commits:num=2
[junit4:junit4]   2> 		commit{dir=MockDirWrapper(org.apache.lucene.store.NIOFSDirectory@C:\Jenkins\workspace\Lucene-Solr-4.x-Windows\solr\build\solr-core\test\J0\solrtest-SuggesterTSTTest-1345025509928\index lockFactory=org.apache.lucene.store.NativeFSLockFactory@2c2a15d),segFN=segments_1,generation=1,filenames=[segments_1]
[junit4:junit4]   2> 		commit{dir=MockDirWrapper(org.apache.lucene.store.NIOFSDirectory@C:\Jenkins\workspace\Lucene-Solr-4.x-Windows\solr\build\solr-core\test\J0\solrtest-SuggesterTSTTest-1345025509928\index lockFactory=org.apache.lucene.store.NativeFSLockFactory@2c2a15d),segFN=segments_2,generation=2,filenames=[_0_TestBloomFilteredLucene40Postings_0.tim, _0_TestBloomFilteredLucene40Postings_0.blm, _0_TestBloomFilteredLucene40Postings_0.tip, _0.fnm, _0_Memory_0.ram, _0_MockVariableIntBlock_0.doc, _0_TestBloomFilteredLucene40Postings_0.prx, _0_nrm.cfs, _0_MockVariableIntBlock_0.skp, _0_MockVariableIntBlock_0.pyl, _0_MockVariableIntBlock_0.tib, _0_MockVariableIntBlock_0.frq, _0_nrm.cfe, _0_MockVariableIntBlock_0.pos, segments_2, _0_TestBloomFilteredLucene40Postings_0.frq, _0.fdx, _0.si, _0_MockVariableIntBlock_0.tii, _0.fdt]
[junit4:junit4]   2> 380 T3232 C250 oasc.SolrDeletionPolicy.updateCommits newest commit = 2
[junit4:junit4]   2> 380 T3232 C250 oasc.SolrCore.getSearcher WARNING [collection1] PERFORMANCE WARNING: Overlapping onDeckSearchers=2
[junit4:junit4]   2> 388 T3232 C250 oass.SolrIndexSearcher.<init> Opening Searcher@39af8a83 main
[junit4:junit4]   2> 389 T3232 C250 oass.SolrIndexSearcher.getIndexDir WARNING WARNING: Directory impl does not support setting indexDir: org.apache.lucene.store.MockDirectoryWrapper
[junit4:junit4]   2> 389 T3232 C250 oasu.DirectUpdateHandler2.commit end_commit_flush
[junit4:junit4]   2> 390 T3233 oasc.SolrCore.registerSearcher [collection1] Registered new searcher Searcher@54dcf84c main{StandardDirectoryReader(segments_1:1)}
[junit4:junit4]   2> 390 T3233 oashc.SpellCheckComponent$SpellCheckerListener.newSearcher Loading spell index for spellchecker: suggest
[junit4:junit4]   2> 390 T3233 oasss.Suggester.reload reload()
[junit4:junit4]   2> 390 T3233 oashc.SpellCheckComponent$SpellCheckerListener.newSearcher SEVERE Exception in reloading spell check index for spellchecker: suggest java.io.FileNotFoundException: C:\Jenkins\workspace\Lucene-Solr-4.x-Windows\solr\build\solr-core\test\J0\.\solrtest-SuggesterTSTTest-1345025509928\suggest\jaspell.dat (The system cannot find the file specified)
[junit4:junit4]   2> 	at java.io.FileInputStream.open(Native Method)
[junit4:junit4]   2> 	at java.io.FileInputStream.<init>(FileInputStream.java:120)
[junit4:junit4]   2> 	at org.apache.solr.spelling.suggest.Suggester.reload(Suggester.java:161)
[junit4:junit4]   2> 	at org.apache.solr.handler.component.SpellCheckComponent$SpellCheckerListener.newSearcher(SpellCheckComponent.java:673)
[junit4:junit4]   2> 	at org.apache.solr.core.SolrCore$5.call(SolrCore.java:1438)
[junit4:junit4]   2> 	at java.util.concurrent.FutureTask$Sync.innerRun(FutureTask.java:303)
[junit4:junit4]   2> 	at java.util.concurrent.FutureTask.run(FutureTask.java:138)
[junit4:junit4]   2> 	at java.util.concurrent.ThreadPoolExecutor$Worker.runTask(ThreadPoolExecutor.java:886)
[junit4:junit4]   2> 	at java.util.concurrent.ThreadPoolExecutor$Worker.run(ThreadPoolExecutor.java:908)
[junit4:junit4]   2> 	at java.lang.Thread.run(Thread.java:662)
[junit4:junit4]   2> 
[junit4:junit4]   2> 390 T3233 oashc.SpellCheckComponent$SpellCheckerListener.newSearcher Loading spell index for spellchecker: suggest_tst
[junit4:junit4]   2> 390 T3233 oasss.Suggester.reload reload()
[junit4:junit4]   2> 390 T3233 oashc.SpellCheckComponent$SpellCheckerListener.newSearcher SEVERE Exception in reloading spell check index for spellchecker: suggest_tst java.io.FileNotFoundException: C:\Jenkins\workspace\Lucene-Solr-4.x-Windows\solr\build\solr-core\test\J0\.\solrtest-SuggesterTSTTest-1345025509928\suggest_tst\tst.dat (The system cannot find the file specified)
[junit4:junit4]   2> 	at java.io.FileInputStream.open(Native Method)
[junit4:junit4]   2> 	at java.io.FileInputStream.<init>(FileInputStream.java:120)
[junit4:junit4]   2> 	at org.apache.solr.spelling.suggest.Suggester.reload(Suggester.java:161)
[junit4:junit4]   2> 	at org.apache.solr.handler.component.SpellCheckComponent$SpellCheckerListener.newSearcher(SpellCheckComponent.java:673)
[junit4:junit4]   2> 	at org.apache.solr.core.SolrCore$5.call(SolrCore.java:1438)
[junit4:junit4]   2> 	at java.util.concurrent.FutureTask$Sync.innerRun(FutureTask.java:303)
[junit4:junit4]   2> 	at java.util.concurrent.FutureTask.run(FutureTask.java:138)
[junit4:junit4]   2> 	at java.util.concurrent.ThreadPoolExecutor$Worker.runTask(ThreadPoolExecutor.java:886)
[junit4:junit4]   2> 	at java.util.concurrent.ThreadPoolExecutor$Worker.run(ThreadPoolExecutor.java:908)
[junit4:junit4]   2> 	at java.lang.Thread.run(Thread.java:662)
[junit4:junit4]   2> 
[junit4:junit4]   2> 391 T3233 oashc.SpellCheckComponent$SpellCheckerListener.newSearcher Loading spell index for spellchecker: suggest_fst
[junit4:junit4]   2> 391 T3233 oasss.Suggester.reload reload()
[junit4:junit4]   2> 391 T3233 oashc.SpellCheckComponent$SpellCheckerListener.newSearcher SEVERE Exception in reloading spell check index for spellchecker: suggest_fst java.io.FileNotFoundException: C:\Jenkins\workspace\Lucene-Solr-4.x-Windows\solr\build\solr-core\test\J0\.\solrtest-SuggesterTSTTest-1345025509928\suggest_fst\fst.bin (The system cannot find the file specified)
[junit4:junit4]   2> 	at java.io.FileInputStream.open(Native Method)
[junit4:junit4]   2> 	at java.io.FileInputStream.<init>(FileInputStream.java:120)
[junit4:junit4]   2> 	at org.apache.solr.spelling.suggest.Suggester.reload(Suggester.java:161)
[junit4:junit4]   2> 	at org.apache.solr.handler.component.SpellCheckComponent$SpellCheckerListener.newSearcher(SpellCheckComponent.java:673)
[junit4:junit4]   2> 	at org.apache.solr.core.SolrCore$5.call(SolrCore.java:1438)
[junit4:junit4]   2> 	at java.util.concurrent.FutureTask$Sync.innerRun(FutureTask.java:303)
[junit4:junit4]   2> 	at java.util.concurrent.FutureTask.run(FutureTask.java:138)
[junit4:junit4]   2> 	at java.util.concurrent.ThreadPoolExecutor$Worker.runTask(ThreadPoolExecutor.java:886)
[junit4:junit4]   2> 	at java.util.concurrent.ThreadPoolExecutor$Worker.run(ThreadPoolExecutor.java:908)
[junit4:junit4]   2> 	at java.lang.Thread.run(Thread.java:662)
[junit4:junit4]   2> 
[junit4:junit4]   2> 392 T3233 oashc.SpellCheckComponent$SpellCheckerListener.newSearcher Loading spell index for spellchecker: suggest_wfst
[junit4:junit4]   2> 392 T3233 oasss.Suggester.reload reload()
[junit4:junit4]   2> 392 T3233 oashc.SpellCheckComponent$SpellCheckerListener.newSearcher SEVERE Exception in reloading spell check index for spellchecker: suggest_wfst java.io.FileNotFoundException: C:\Jenkins\workspace\Lucene-Solr-4.x-Windows\solr\build\solr-core\test\J0\.\solrtest-SuggesterTSTTest-1345025509928\suggest_wfst\wfst.bin (The system cannot find the file specified)
[junit4:junit4]   2> 	at java.io.FileInputStream.open(Native Method)
[junit4:junit4]   2> 	at java.io.FileInputStream.<init>(FileInputStream.java:120)
[junit4:junit4]   2> 	at org.apache.solr.spelling.suggest.Suggester.reload(Suggester.java:161)
[junit4:junit4]   2> 	at org.apache.solr.handler.component.SpellCheckComponent$SpellCheckerListener.newSearcher(SpellCheckComponent.java:673)
[junit4:junit4]   2> 	at org.apache.solr.core.SolrCore$5.call(SolrCore.java:1438)
[junit4:junit4]   2> 	at java.util.concurrent.FutureTask$Sync.innerRun(FutureTask.java:303)
[junit4:junit4]   2> 	at java.util.concurrent.FutureTask.run(FutureTask.java:138)
[junit4:junit4]   2> 	at java.util.concurrent.ThreadPoolExecutor$Worker.runTask(ThreadPoolExecutor.java:886)
[junit4:junit4]   2> 	at java.util.concurrent.ThreadPoolExecutor$Worker.run(ThreadPoolExecutor.java:908)
[junit4:junit4]   2> 	at java.lang.Thread.run(Thread.java:662)
[junit4:junit4]   2> 
[junit4:junit4]   2> 394 T3233 oasc.SolrCore.registerSearcher [collection1] Registered new searcher Searcher@39af8a83 main{StandardDirectoryReader(segments_2:3 _0(4.0.0.2):C3)}
[junit4:junit4]   2> 395 T3232 C250 UPDATE [collection1] webapp=null path=null params={} {commit=} 0 27
[junit4:junit4]   2> 412 T3232 C250 REQ [collection1] webapp=null path=null params={q=ac&spellcheck.count=2&qt=/suggest_tst&spellcheck.onlyMorePopular=true} status=0 QTime=1 
[junit4:junit4]   2> 414 T3232 oas.SolrTestCaseJ4.assertQ SEVERE REQUEST FAILED: xpath=//lst[@name='spellcheck']/lst[@name='suggestions']/lst[@name='ac']/int[@name='numFound'][.='2']
[junit4:junit4]   2> 		xml response was: <?xml version="1.0" encoding="UTF-8"?>
[junit4:junit4]   2> 	<response>
[junit4:junit4]   2> 	<lst name="responseHeader"><int name="status">0</int><int name="QTime">1</int></lst><lst name="spellcheck"><lst name="suggestions"/></lst>
[junit4:junit4]   2> 	</response>
[junit4:junit4]   2> 	
[junit4:junit4]   2> 		request was:q=ac&spellcheck.count=2&qt=/suggest_tst&spellcheck.onlyMorePopular=true
[junit4:junit4]   2> 415 T3232 oasc.SolrException.log SEVERE REQUEST FAILED: q=ac&spellcheck.count=2&qt=/suggest_tst&spellcheck.onlyMorePopular=true:java.lang.RuntimeException: REQUEST FAILED: xpath=//lst[@name='spellcheck']/lst[@name='suggestions']/lst[@name='ac']/int[@name='numFound'][.='2']
[junit4:junit4]   2> 		xml response was: <?xml version="1.0" encoding="UTF-8"?>
[junit4:junit4]   2> 	<response>
[junit4:junit4]   2> 	<lst name="responseHeader"><int name="status">0</int><int name="QTime">1</int></lst><lst name="spellcheck"><lst name="suggestions"/></lst>
[junit4:junit4]   2> 	</response>
[junit4:junit4]   2> 	
[junit4:junit4]   2> 		request was:q=ac&spellcheck.count=2&qt=/suggest_tst&spellcheck.onlyMorePopular=true
[junit4:junit4]   2> 		at org.apache.solr.SolrTestCaseJ4.assertQ(SolrTestCaseJ4.java:486)
[junit4:junit4]   2> 		at org.apache.solr.SolrTestCaseJ4.assertQ(SolrTestCaseJ4.java:460)
[junit4:junit4]   2> 		at org.apache.solr.spelling.suggest.SuggesterTest.testSuggestions(SuggesterTest.java:71)
[junit4:junit4]   2> 		at sun.reflect.NativeMethodAccessorImpl.invoke0(Native Method)
[junit4:junit4]   2> 		at sun.reflect.NativeMethodAccessorImpl.invoke(NativeMethodAccessorImpl.java:39)
[junit4:junit4]   2> 		at sun.reflect.DelegatingMethodAccessorImpl.invoke(DelegatingMethodAccessorImpl.java:25)
[junit4:junit4]   2> 		at java.lang.reflect.Method.invoke(Method.java:597)
[junit4:junit4]   2> 		at com.carrotsearch.randomizedtesting.RandomizedRunner.invoke(RandomizedRunner.java:1559)
[junit4:junit4]   2> 		at com.carrotsearch.randomizedtesting.RandomizedRunner.access$600(RandomizedRunner.java:79)
[junit4:junit4]   2> 		at com.carrotsearch.randomizedtesting.RandomizedRunner$6.evaluate(RandomizedRunner.java:737)
[junit4:junit4]   2> 		at com.carrotsearch.randomizedtesting.RandomizedRunner$7.evaluate(RandomizedRunner.java:773)
[junit4:junit4]   2> 		at com.carrotsearch.randomizedtesting.RandomizedRunner$8.evaluate(RandomizedRunner.java:787)
[junit4:junit4]   2> 		at com.carrotsearch.randomizedtesting.rules.SystemPropertiesRestoreRule$1.evaluate(SystemPropertiesRestoreRule.java:53)
[junit4:junit4]   2> 		at org.apache.lucene.util.TestRuleSetupTeardownChained$1.evaluate(TestRuleSetupTeardownChained.java:50)
[junit4:junit4]   2> 		at org.apache.lucene.util.TestRuleFieldCacheSanity$1.evaluate(TestRuleFieldCacheSanity.java:32)
[junit4:junit4]   2> 		at org.apache.lucene.util.AbstractBeforeAfterRule$1.evaluate(AbstractBeforeAfterRule.java:45)
[junit4:junit4]   2> 		at com.carrotsearch.randomizedtesting.rules.SystemPropertiesInvariantRule$1.evaluate(SystemPropertiesInvariantRule.java:55)
[junit4:junit4]   2> 		at org.apache.lucene.util.TestRuleThreadAndTestName$1.evaluate(TestRuleThreadAndTestName.java:48)
[junit4:junit4]   2> 		at org.apache.lucene.util.TestRuleIgnoreAfterMaxFailures$1.evaluate(TestRuleIgnoreAfterMaxFailures.java:70)
[junit4:junit4]   2> 		at org.apache.lucene.util.TestRuleMarkFailure$1.evaluate(TestRuleMarkFailure.java:48)
[junit4:junit4]   2> 		at com.carrotsearch.randomizedtesting.rules.StatementAdapter.evaluate(StatementAdapter.java:36)
[junit4:junit4]   2> 		at com.carrotsearch.randomizedtesting.ThreadLeakControl$StatementRunner.run(ThreadLeakControl.java:345)
[junit4:junit4]   2> 		at com.carrotsearch.randomizedtesting.ThreadLeakControl.forkTimeoutingTask(ThreadLeakControl.java:769)
[junit4:junit4]   2> 		at com.carrotsearch.randomizedtesting.ThreadLeakControl$3.evaluate(ThreadLeakControl.java:429)
[junit4:junit4]   2> 		at com.carrotsearch.randomizedtesting.RandomizedRunner.runSingleTest(RandomizedRunner.java:746)
[junit4:junit4]   2> 		at com.carrotsearch.randomizedtesting.RandomizedRunner$3.evaluate(RandomizedRunner.java:648)
[junit4:junit4]   2> 		at com.carrotsearch.randomizedtesting.RandomizedRunner$4.evaluate(RandomizedRunner.java:682)
[junit4:junit4]   2> 		at com.carrotsearch.randomizedtesting.RandomizedRunner$5.evaluate(RandomizedRunner.java:693)
[junit4:junit4]   2> 		at com.carrotsearch.randomizedtesting.rules.StatementAdapter.evaluate(StatementAdapter.java:36)
[junit4:junit4]   2> 		at com.carrotsearch.randomizedtesting.rules.SystemPropertiesRestoreRule$1.evaluate(SystemPropertiesRestoreRule.java:53)
[junit4:junit4]   2> 		at org.apache.lucene.util.AbstractBeforeAfterRule$1.evaluate(AbstractBeforeAfterRule.java:45)
[junit4:junit4]   2> 		at org.apache.lucene.util.TestRuleStoreClassName$1.evaluate(TestRuleStoreClassName.java:38)
[junit4:junit4]   2> 		at com.carrotsearch.randomizedtesting.rules.SystemPropertiesInvariantRule$1.evaluate(SystemPropertiesInvariantRule.java:55)
[junit4:junit4]   2> 		at com.carrotsearch.randomizedtesting.rules.NoShadowingOrOverridesOnMethodsRule$1.evaluate(NoShadowingOrOverridesOnMethodsRule.java:39)
[junit4:junit4]   2> 		at com.carrotsearch.randomizedtesting.rules.NoShadowingOrOverridesOnMethodsRule$1.evaluate(NoShadowingOrOverridesOnMethodsRule.java:39)
[junit4:junit4]   2> 		at org.apache.lucene.util.TestRuleAssertionsRequired$1.evaluate(TestRuleAssertionsRequired.java:40)
[junit4:junit4]   2> 		at org.apache.lucene.util.TestRuleMarkFailure$1.evaluate(TestRuleMarkFailure.java:48)
[junit4:junit4]   2> 		at org.apache.lucene.util.TestRuleIgnoreAfterMaxFailures$1.evaluate(TestRuleIgnoreAfterMaxFailures.java:70)
[junit4:junit4]   2> 		at org.apache.lucene.util.TestRuleIgnoreTestSuites$1.evaluate(TestRuleIgnoreTestSuites.java:55)
[junit4:junit4]   2> 		at com.carrotsearch.randomizedtesting.rules.StatementAdapter.evaluate(StatementAdapter.java:36)
[junit4:junit4]   2> 		at com.carrotsearch.randomizedtesting.ThreadLeakControl$StatementRunner.run(ThreadLeakControl.java:345)
[junit4:junit4]   2> 		at java.lang.Thread.run(Thread.java:662)
[junit4:junit4]   2> 	
[junit4:junit4]   2> 415 T3232 oas.SolrTestCaseJ4.tearDown ###Ending testSuggestions
[junit4:junit4]   2> NOTE: reproduce with: ant test  -Dtestcase=SuggesterTSTTest -Dtests.method=testSuggestions -Dtests.seed=A517ACFF9883BFE -Dtests.slow=true -Dtests.locale=es_DO -Dtests.timezone=Europe/Nicosia -Dtests.file.encoding=ISO-8859-1
[junit4:junit4] ERROR   0.12s | SuggesterTSTTest.testSuggestions <<<
[junit4:junit4]    > Throwable #1: java.lang.RuntimeException: Exception during query
[junit4:junit4]    > 	at __randomizedtesting.SeedInfo.seed([A517ACFF9883BFE:AC8D433A37BC6C00]:0)
[junit4:junit4]    > 	at org.apache.solr.SolrTestCaseJ4.assertQ(SolrTestCaseJ4.java:493)
[junit4:junit4]    > 	at org.apache.solr.SolrTestCaseJ4.assertQ(SolrTestCaseJ4.java:460)
[junit4:junit4]    > 	at org.apache.solr.spelling.suggest.SuggesterTest.testSuggestions(SuggesterTest.java:71)
[junit4:junit4]    > 	at sun.reflect.NativeMethodAccessorImpl.invoke0(Native Method)
[junit4:junit4]    > 	at sun.reflect.NativeMethodAccessorImpl.invoke(NativeMethodAccessorImpl.java:39)
[junit4:junit4]    > 	at sun.reflect.DelegatingMethodAccessorImpl.invoke(DelegatingMethodAccessorImpl.java:25)
[junit4:junit4]    > 	at java.lang.reflect.Method.invoke(Method.java:597)
[junit4:junit4]    > 	at com.carrotsearch.randomizedtesting.RandomizedRunner.invoke(RandomizedRunner.java:1559)
[junit4:junit4]    > 	at com.carrotsearch.randomizedtesting.RandomizedRunner.access$600(RandomizedRunner.java:79)
[junit4:junit4]    > 	at com.carrotsearch.randomizedtesting.RandomizedRunner$6.evaluate(RandomizedRunner.java:737)
[junit4:junit4]    > 	at com.carrotsearch.randomizedtesting.RandomizedRunner$7.evaluate(RandomizedRunner.java:773)
[junit4:junit4]    > 	at com.carrotsearch.randomizedtesting.RandomizedRunner$8.evaluate(RandomizedRunner.java:787)
[junit4:junit4]    > 	at com.carrotsearch.randomizedtesting.rules.SystemPropertiesRestoreRule$1.evaluate(SystemPropertiesRestoreRule.java:53)
[junit4:junit4]    > 	at org.apache.lucene.util.TestRuleSetupTeardownChained$1.evaluate(TestRuleSetupTeardownChained.java:50)
[junit4:junit4]    > 	at org.apache.lucene.util.TestRuleFieldCacheSanity$1.evaluate(TestRuleFieldCacheSanity.java:32)
[junit4:junit4]    > 	at org.apache.lucene.util.AbstractBeforeAfterRule$1.evaluate(AbstractBeforeAfterRule.java:45)
[junit4:junit4]    > 	at com.carrotsearch.randomizedtesting.rules.SystemPropertiesInvariantRule$1.evaluate(SystemPropertiesInvariantRule.java:55)
[junit4:junit4]    > 	at org.apache.lucene.util.TestRuleThreadAndTestName$1.evaluate(TestRuleThreadAndTestName.java:48)
[junit4:junit4]    > 	at org.apache.lucene.util.TestRuleIgnoreAfterMaxFailures$1.evaluate(TestRuleIgnoreAfterMaxFailures.java:70)
[junit4:junit4]    > 	at org.apache.lucene.util.TestRuleMarkFailure$1.evaluate(TestRuleMarkFailure.java:48)
[junit4:junit4]    > 	at com.carrotsearch.randomizedtesting.rules.StatementAdapter.evaluate(StatementAdapter.java:36)
[junit4:junit4]    > 	at com.carrotsearch.randomizedtesting.ThreadLeakControl$StatementRunner.run(ThreadLeakControl.java:345)
[junit4:junit4]    > 	at com.carrotsearch.randomizedtesting.ThreadLeakControl.forkTimeoutingTask(ThreadLeakControl.java:769)
[junit4:junit4]    > 	at com.carrotsearch.randomizedtesting.ThreadLeakControl$3.evaluate(ThreadLeakControl.java:429)
[junit4:junit4]    > 	at com.carrotsearch.randomizedtesting.RandomizedRunner.runSingleTest(RandomizedRunner.java:746)
[junit4:junit4]    > 	at com.carrotsearch.randomizedtesting.RandomizedRunner$3.evaluate(RandomizedRunner.java:648)
[junit4:junit4]    > 	at com.carrotsearch.randomizedtesting.RandomizedRunner$4.evaluate(RandomizedRunner.java:682)
[junit4:junit4]    > 	at com.carrotsearch.randomizedtesting.RandomizedRunner$5.evaluate(RandomizedRunner.java:693)
[junit4:junit4]    > 	at com.carrotsearch.randomizedtesting.rules.StatementAdapter.evaluate(StatementAdapter.java:36)
[junit4:junit4]    > 	at com.carrotsearch.randomizedtesting.rules.SystemPropertiesRestoreRule$1.evaluate(SystemPropertiesRestoreRule.java:53)
[junit4:junit4]    > 	at org.apache.lucene.util.AbstractBeforeAfterRule$1.evaluate(AbstractBeforeAfterRule.java:45)
[junit4:junit4]    > 	at org.apache.lucene.util.TestRuleStoreClassName$1.evaluate(TestRuleStoreClassName.java:38)
[junit4:junit4]    > 	at com.carrotsearch.randomizedtesting.rules.SystemPropertiesInvariantRule$1.evaluate(SystemPropertiesInvariantRule.java:55)
[junit4:junit4]    > 	at com.carrotsearch.randomizedtesting.rules.NoShadowingOrOverridesOnMethodsRule$1.evaluate(NoShadowingOrOverridesOnMethodsRule.java:39)
[junit4:junit4]    > 	at com.carrotsearch.randomizedtesting.rules.NoShadowingOrOverridesOnMethodsRule$1.evaluate(NoShadowingOrOverridesOnMethodsRule.java:39)
[junit4:junit4]    > 	at org.apache.lucene.util.TestRuleAssertionsRequired$1.evaluate(TestRuleAssertionsRequired.java:40)
[junit4:junit4]    > 	at org.apache.lucene.util.TestRuleMarkFailure$1.evaluate(TestRuleMarkFailure.java:48)
[junit4:junit4]    > 	at org.apache.lucene.util.TestRuleIgnoreAfterMaxFailures$1.evaluate(TestRuleIgnoreAfterMaxFailures.java:70)
[junit4:junit4]    > 	at org.apache.lucene.util.TestRuleIgnoreTestSuites$1.evaluate(TestRuleIgnoreTestSuites.java:55)
[junit4:junit4]    > 	at com.carrotsearch.randomizedtesting.rules.StatementAdapter.evaluate(StatementAdapter.java:36)
[junit4:junit4]    > 	at com.carrotsearch.randomizedtesting.ThreadLeakControl$StatementRunner.run(ThreadLeakControl.java:345)
[junit4:junit4]    > 	at java.lang.Thread.run(Thread.java:662)
[junit4:junit4]    > Caused by: java.lang.RuntimeException: REQUEST FAILED: xpath=//lst[@name='spellcheck']/lst[@name='suggestions']/lst[@name='ac']/int[@name='numFound'][.='2']
[junit4:junit4]    > 	xml response was: <?xml version="1.0" encoding="UTF-8"?>
[junit4:junit4]    > <response>
[junit4:junit4]    > <lst name="responseHeader"><int name="status">0</int><int name="QTime">1</int></lst><lst name="spellcheck"><lst name="suggestions"/></lst>
[junit4:junit4]    > </response>
[junit4:junit4]    > 
[junit4:junit4]    > 	request was:q=ac&spellcheck.count=2&qt=/suggest_tst&spellcheck.onlyMorePopular=true
[junit4:junit4]    > 	at org.apache.solr.SolrTestCaseJ4.assertQ(SolrTestCaseJ4.java:486)
[junit4:junit4]    > 	... 41 more
[junit4:junit4]   2> 431 T3232 oas.SolrTestCaseJ4.setUp ###Starting testReload
[junit4:junit4]   2> 436 T3232 C250 UPDATE [collection1] webapp=null path=null params={} {add=[1]} 0 0
[junit4:junit4]   2> 442 T3232 C250 UPDATE [collection1] webapp=null path=null params={} {add=[2]} 0 1
[junit4:junit4]   2> 448 T3232 C250 UPDATE [collection1] webapp=null path=null params={} {add=[3]} 0 0
[junit4:junit4]   2> 456 T3232 C250 oasu.DirectUpdateHandler2.commit start commit{flags=0,_version_=0,optimize=false,openSearcher=true,waitSearcher=true,expungeDeletes=false,softCommit=false}
[junit4:junit4]   2> 475 T3232 C250 oasc.SolrDeletionPolicy.onCommit SolrDeletionPolicy.onCommit: commits:num=2
[junit4:junit4]   2> 		commit{dir=MockDirWrapper(org.apache.lucene.store.NIOFSDirectory@C:\Jenkins\workspace\Lucene-Solr-4.x-Windows\solr\build\solr-core\test\J0\solrtest-SuggesterTSTTest-1345025509928\index lockFactory=org.apache.lucene.store.NativeFSLockFactory@2c2a15d),segFN=segments_2,generation=2,filenames=[_0_TestBloomFilteredLucene40Postings_0.tim, _0_TestBloomFilteredLucene40Postings_0.blm, _0_TestBloomFilteredLucene40Postings_0.tip, _0.fnm, _0_Memory_0.ram, _0_MockVariableIntBlock_0.doc, _0_TestBloomFilteredLucene40Postings_0.prx, _0_nrm.cfs, _0_MockVariableIntBlock_0.skp, _0_MockVariableIntBlock_0.pyl, _0_MockVariableIntBlock_0.tib, _0_MockVariableIntBlock_0.frq, _0_nrm.cfe, _0_MockVariableIntBlock_0.pos, segments_2, _0_TestBloomFilteredLucene40Postings_0.frq, _0.fdx, _0.si, _0_MockVariableIntBlock_0.tii, _0.fdt]
[junit4:junit4]   2> 		commit{dir=MockDirWrapper(org.apache.lucene.store.NIOFSDirectory@C:\Jenkins\workspace\Lucene-Solr-4.x-Windows\solr\build\solr-core\test\J0\solrtest-SuggesterTSTTest-1345025509928\index lockFactory=org.apache.lucene.store.NativeFSLockFactory@2c2a15d),segFN=segments_3,generation=3,filenames=[_1_MockVariableIntBlock_0.skp, _1_nrm.cfs, _1_TestBloomFilteredLucene40Postings_0.prx, _1_MockVariableIntBlock_0.tii, _1_MockVariableIntBlock_0.pos, _1_TestBloomFilteredLucene40Postings_0.blm, _1_MockVariableIntBlock_0.pyl, _1.fnm, _1_TestBloomFilteredLucene40Postings_0.frq, _1_nrm.cfe, _1_MockVariableIntBlock_0.tib, _1_MockVariableIntBlock_0.frq, _1_TestBloomFilteredLucene40Postings_0.tip, _1.fdx, _1_Memory_0.ram, _1.fdt, _1.si, _1_MockVariableIntBlock_0.doc, _1_TestBloomFilteredLucene40Postings_0.tim, segments_3]
[junit4:junit4]   2> 476 T3232 C250 oasc.SolrDeletionPolicy.updateCommits newest commit = 3
[junit4:junit4]   2> 489 T3232 C250 oass.SolrIndexSearcher.<init> Opening Searcher@3696d09c main
[junit4:junit4]   2> 490 T3232 C250 oass.SolrIndexSearcher.getIndexDir WARNING WARNING: Directory impl does not support setting indexDir: org.apache.lucene.store.MockDirectoryWrapper
[junit4:junit4]   2> 490 T3232 C250 oasu.DirectUpdateHandler2.commit end_commit_flush
[junit4:junit4]   2> 492 T3233 oashc.SpellCheckComponent$SpellCheckerListener.buildSpellIndex Building spell index for spell checker: suggest
[junit4:junit4]   2> 492 T3233 oasss.Suggester.build build()
[junit4:junit4]   2> 496 T3233 oasss.Suggester.build Stored suggest data to: C:\Jenkins\workspace\Lucene-Solr-4.x-Windows\solr\build\solr-core\test\J0\.\solrtest-SuggesterTSTTest-1345025509928\suggest\jaspell.dat
[junit4:junit4]   2> 496 T3233 oashc.SpellCheckComponent$SpellCheckerListener.buildSpellIndex Building spell index for spell checker: suggest_tst
[junit4:junit4]   2> 496 T3233 oasss.Suggester.build build()
[junit4:junit4]   2> 504 T3233 oasss.Suggester.build Stored suggest data to: C:\Jenkins\workspace\Lucene-Solr-4.x-Windows\solr\build\solr-core\test\J0\.\solrtest-SuggesterTSTTest-1345025509928\suggest_tst\tst.dat
[junit4:junit4]   2> 505 T3233 oashc.SpellCheckComponent$SpellCheckerListener.buildSpellIndex Building spell index for spell checker: suggest_fst
[junit4:junit4]   2> 505 T3233 oasss.Suggester.build build()
[junit4:junit4]   2> 522 T3233 oasss.Suggester.build Stored suggest data to: C:\Jenkins\workspace\Lucene-Solr-4.x-Windows\solr\build\solr-core\test\J0\.\solrtest-SuggesterTSTTest-1345025509928\suggest_fst\fst.bin
[junit4:junit4]   2> 523 T3233 oashc.SpellCheckComponent$SpellCheckerListener.buildSpellIndex Building spell index for spell checker: suggest_wfst
[junit4:junit4]   2> 523 T3233 oasss.Suggester.build build()
[junit4:junit4]   2> 527 T3233 oasss.Suggester.build Stored suggest data to: C:\Jenkins\workspace\Lucene-Solr-4.x-Windows\solr\build\solr-core\test\J0\.\solrtest-SuggesterTSTTest-1345025509928\suggest_wfst\wfst.bin
[junit4:junit4]   2> 527 T3233 oasc.SolrCore.registerSearcher [collection1] Registered new searcher Searcher@3696d09c main{StandardDirectoryReader(segments_3:7 _1(4.0.0.2):C3)}
[junit4:junit4]   2> 550 T3232 C250 UPDATE [collection1] webapp=null path=null params={} {commit=} 0 94
[junit4:junit4]   2> 560 T3232 oas.SolrTestCaseJ4.deleteCore ###deleteCore
[junit4:junit4]   2> 561 T3232 oasc.CoreContainer.shutdown Shutting down CoreContainer instance=97034063
[junit4:junit4]   2> 561 T3232 oasc.SolrCore.close [collection1]  CLOSING SolrCore org.apache.solr.core.SolrCore@4e8302a7
[junit4:junit4]   2> 562 T3232 oasc.SolrCore.closeSearcher [collection1] Closing main searcher on request.
[junit4:junit4]   2> 563 T3232 oasu.DirectUpdateHandler2.close closing DirectUpdateHandler2{commits=2,autocommits=0,soft autocommits=0,optimizes=0,rollbacks=0,expungeDeletes=0,docsPending=0,adds=0,deletesById=0,deletesByQuery=0,errors=0,cumulative_adds=6,cumulative_deletesById=0,cumulative_deletesByQuery=0,cumulative_errors=0}
[junit4:junit4]   2> 564 T3232 oasu.DefaultSolrCoreState.decref SolrCoreState ref count has reached 0 - closing IndexWriter
[junit4:junit4]   2> NOTE: per solr.test.leavedatadir, dataDir will not be removed: C:\Jenkins\workspace\Lucene-Solr-4.x-Windows\solr\build\solr-core\test\J0\.\solrtest-SuggesterTSTTest-1345025509928
[junit4:junit4]   2> 578 T3232 oas.SolrTestCaseJ4.initCore ####initCore
[junit4:junit4]   2> 579 T3232 oasc.SolrResourceLoader.<init> new SolrResourceLoader for directory: 'C:\Jenkins\workspace\Lucene-Solr-4.x-Windows\solr\build\solr-core\test-files\solr\collection1\'
[junit4:junit4]   2> 579 T3232 oasc.SolrResourceLoader.replaceClassLoader Adding 'file:/C:/Jenkins/workspace/Lucene-Solr-4.x-Windows/solr/build/solr-core/test-files/solr/collection1/lib/classes/' to classloader
[junit4:junit4]   2> 579 T3232 oasc.SolrResourceLoader.replaceClassLoader Adding 'file:/C:/Jenkins/workspace/Lucene-Solr-4.x-Windows/solr/build/solr-core/test-files/solr/collection1/lib/README' to classloader
[junit4:junit4]   2> 656 T3232 oasc.SolrConfig.<init> Using Lucene MatchVersion: LUCENE_40
[junit4:junit4]   2> 752 T3232 oasc.SolrConfig.<init> Loaded SolrConfig: solrconfig-spellchecker.xml
[junit4:junit4]   2> 752 T3232 oass.IndexSchema.readSchema Reading Solr Schema
[junit4:junit4]   2> 757 T3232 oass.IndexSchema.readSchema Schema name=test
[junit4:junit4]   2> 1721 T3232 oass.OpenExchangeRatesOrgProvider.init Initialized with rates=open-exchange-rates.json, refreshInterval=1440.
[junit4:junit4]   2> 1730 T3232 oass.IndexSchema.readSchema default search field in schema is text
[junit4:junit4]   2> 1736 T3232 oass.IndexSchema.readSchema unique key field: id
[junit4:junit4]   2> 1755 T3232 oass.FileExchangeRateProvider.reload Reloading exchange rates from file currency.xml
[junit4:junit4]   2> 1760 T3232 oass.FileExchangeRateProvider.reload Reloading exchange rates from file currency.xml
[junit4:junit4]   2> 1764 T3232 oass.OpenExchangeRatesOrgProvider.reload Reloading exchange rates from open-exchange-rates.json
[junit4:junit4]   2> 1765 T3232 oass.OpenExchangeRatesOrgProvider.reload Reloading exchange rates from open-exchange-rates.json
[junit4:junit4]   2> 1766 T3232 oasc.SolrResourceLoader.locateSolrHome JNDI not configured for solr (NoInitialContextEx)
[junit4:junit4]   2> 1766 T3232 oasc.SolrResourceLoader.locateSolrHome using system property solr.solr.home: C:\Jenkins\workspace\Lucene-Solr-4.x-Windows\solr\build\solr-core\test-files\solr
[junit4:junit4]   2> 1766 T3232 oasc.SolrResourceLoader.<init> new SolrResourceLoader for directory: 'C:\Jenkins\workspace\Lucene-Solr-4.x-Windows\solr\build\solr-core\test-files\solr\'
[junit4:junit4]   2> 1777 T3232 oasc.CoreContainer.<init> New CoreContainer 232055810
[junit4:junit4]   2> 1778 T3232 oasc.SolrCore.<init> [collection1] Opening new SolrCore at C:\Jenkins\workspace\Lucene-Solr-4.x-Windows\solr\build\solr-core\test-files\solr\collection1\, dataDir=C:\Jenkins\workspace\Lucene-Solr-4.x-Windows\solr\build\solr-core\test\J0\.\solrtest-SuggesterTSTTest-1345025509928\
[junit4:junit4]   2> 1778 T3232 oasc.SolrCore.<init> JMX monitoring not detected for core: collection1
[junit4:junit4]   2> 1778 T3232 oasc.SolrCore.getNewIndexDir WARNING New index directory detected: old=null new=C:\Jenkins\workspace\Lucene-Solr-4.x-Windows\solr\build\solr-core\test\J0\.\solrtest-SuggesterTSTTest-1345025509928\index/
[junit4:junit4]   2> 1780 T3232 oasc.RequestHandlers.initHandlersFromConfig created standard: solr.StandardRequestHandler
[junit4:junit4]   2> 1780 T3232 oasc.RequestHandlers.initHandlersFromConfig created /suggest: org.apache.solr.handler.component.SearchHandler
[junit4:junit4]   2> 1780 T3232 oasc.RequestHandlers.initHandlersFromConfig created /suggest_tst: org.apache.solr.handler.component.SearchHandler
[junit4:junit4]   2> 1780 T3232 oasc.RequestHandlers.initHandlersFromConfig created /suggest_fst: org.apache.solr.handler.component.SearchHandler
[junit4:junit4]   2> 1780 T3232 oasc.RequestHandlers.initHandlersFromConfig created /suggest_wfst: org.apache.solr.handler.component.SearchHandler
[junit4:junit4]   2> 1791 T3232 oass.SolrIndexSearcher.<init> Opening Searcher@27792085 main
[junit4:junit4]   2> 1791 T3232 oass.SolrIndexSearcher.getIndexDir WARNING WARNING: Directory impl does not support setting indexDir: org.apache.lucene.store.MockDirectoryWrapper
[junit4:junit4]   2> 1792 T3232 oasu.CommitTracker.<init> Hard AutoCommit: disabled
[junit4:junit4]   2> 1793 T3232 oasu.CommitTracker.<init> Soft AutoCommit: disabled
[junit4:junit4]   2> 1793 T3232 oashc.SpellCheckComponent.inform Initializing spell checkers
[junit4:junit4]   2> 1793 T3232 oasss.Suggester.init init: {name=suggest,classname=org.apache.solr.spelling.suggest.Suggester,lookupImpl=org.apache.solr.spelling.suggest.jaspell.JaspellLookup,field=suggest,storeDir=suggest,buildOnCommit=true,threshold=0.0}
[junit4:junit4]   2> 1794 T3232 oasssj.JaspellLookupFactory.create init: {name=suggest,classname=org.apache.solr.spelling.suggest.Suggester,lookupImpl=org.apache.solr.spelling.suggest.jaspell.JaspellLookup,field=suggest,storeDir=suggest,buildOnCommit=true,threshold=0.0}
[junit4:junit4]   2> 1795 T3232 oashc.SpellCheckComponent.inform Registering newSearcher listener for spellchecker: suggest
[junit4:junit4]   2> 1795 T3232 oashc.SpellCheckComponent.inform No queryConverter defined, using default converter
[junit4:junit4]   2> 1795 T3232 oashc.SpellCheckComponent.inform Initializing spell checkers
[junit4:junit4]   2> 1796 T3232 oasss.Suggester.init init: {name=suggest_tst,classname=org.apache.solr.spelling.suggest.Suggester,lookupImpl=org.apache.solr.spelling.suggest.tst.TSTLookup,field=suggest,storeDir=suggest_tst,buildOnCommit=true,threshold=0.0}
[junit4:junit4]   2> 1797 T3232 oashc.SpellCheckComponent.inform Registering newSearcher listener for spellchecker: suggest_tst
[junit4:junit4]   2> 1797 T3232 oashc.SpellCheckComponent.inform No queryConverter defined, using default converter
[junit4:junit4]   2> 1798 T3232 oashc.SpellCheckComponent.inform Initializing spell checkers
[junit4:junit4]   2> 1798 T3232 oasss.Suggester.init init: {name=suggest_fst,classname=org.apache.solr.spelling.suggest.Suggester,lookupImpl=org.apache.solr.spelling.suggest.fst.FSTLookup,field=suggest,storeDir=suggest_fst,buildOnCommit=true,weightBuckets=5,exactMatchFirst=true}
[junit4:junit4]   2> 1799 T3232 oashc.SpellCheckComponent.inform Registering newSearcher listener for spellchecker: suggest_fst
[junit4:junit4]   2> 1799 T3232 oashc.SpellCheckComponent.inform No queryConverter defined, using default converter
[junit4:junit4]   2> 1799 T3232 oashc.SpellCheckComponent.inform Initializing spell checkers
[junit4:junit4]   2> 1799 T3232 oasss.Suggester.init init: {name=suggest_wfst,classname=org.apache.solr.spelling.suggest.Suggester,lookupImpl=org.apache.solr.spelling.suggest.fst.WFSTLookupFactory,field=suggest,storeDir=suggest_wfst,buildOnCommit=true,exactMatchFirst=true}
[junit4:junit4]   2> 1800 T3232 oashc.SpellCheckComponent.inform Registering newSearcher listener for spellchecker: suggest_wfst
[junit4:junit4]   2> 1800 T3232 oashc.SpellCheckComponent.inform No queryConverter defined, using default converter
[junit4:junit4]   2> 1801 T3232 oashc.HttpShardHandlerFactory.getParameter Setting socketTimeout to: 0
[junit4:junit4]   2> 1801 T3232 oashc.HttpShardHandlerFactory.getParameter Setting urlScheme to: http://
[junit4:junit4]   2> 1801 T3232 oashc.HttpShardHandlerFactory.getParameter Setting connTimeout to: 0
[junit4:junit4]   2> 1802 T3232 oashc.HttpShardHandlerFactory.getParameter Setting maxConnectionsPerHost to: 20
[junit4:junit4]   2> 1802 T3232 oashc.HttpShardHandlerFactory.getParameter Setting corePoolSize to: 0
[junit4:junit4]   2> 1802 T3232 oashc.HttpShardHandlerFactory.getParameter Setting maximumPoolSize to: 2147483647
[junit4:junit4]   2> 1802 T3232 oashc.HttpShardHandlerFactory.getParameter Setting maxThreadIdleTime to: 5
[junit4:junit4]   2> 1803 T3232 oashc.HttpShardHandlerFactory.getParameter Setting sizeOfQueue to: -1
[junit4:junit4]   2> 1803 T3232 oashc.HttpShardHandlerFactory.getParameter Setting fairnessPolicy to: false
[junit4:junit4]   2> 1803 T3232 oascsi.HttpClientUtil.createClient Creating new http client, config:maxConnectionsPerHost=20&maxConnections=10000&socketTimeout=0&connTimeout=0&retry=false
[junit4:junit4]   2> 1807 T3234 oasc.SolrCore.registerSearcher [collection1] Registered new searcher Searcher@27792085 main{StandardDirectoryReader(segments_3:7 _1(4.0.0.2):C3)}
[junit4:junit4]   2> 1807 T3232 oasc.CoreContainer.register registering core: collection1
[junit4:junit4]   2> 1807 T3232 oas.SolrTestCaseJ4.initCore ####initCore end
[junit4:junit4]   2> ASYNC  NEW_CORE C251 name=collection1 org.apache.solr.core.SolrCore@1da52564
[junit4:junit4]   2> 1809 T3232 C251 REQ [collection1] webapp=null path=null params={q=ac&spellcheck.count=2&qt=/suggest_tst&spellcheck.onlyMorePopular=true} status=0 QTime=1 
[junit4:junit4]   2> 1816 T3232 oas.SolrTestCaseJ4.tearDown ###Ending testReload
[junit4:junit4]   2> 1821 T3232 oas.SolrTestCaseJ4.setUp ###Starting testRebuild
[junit4:junit4]   2> 1838 T3232 C251 oasc.SolrDeletionPolicy.onInit SolrDeletionPolicy.onInit: commits:num=1
[junit4:junit4]   2> 		commit{dir=MockDirWrapper(org.apache.lucene.store.NIOFSDirectory@C:\Jenkins\workspace\Lucene-Solr-4.x-Windows\solr\build\solr-core\test\J0\solrtest-SuggesterTSTTest-1345025509928\index lockFactory=org.apache.lucene.store.NativeFSLockFactory@b07546e),segFN=segments_3,generation=3,filenames=[_1_MockVariableIntBlock_0.skp, _1_nrm.cfs, _1_TestBloomFilteredLucene40Postings_0.prx, _1_MockVariableIntBlock_0.tii, _1_MockVariableIntBlock_0.pos, _1_TestBloomFilteredLucene40Postings_0.blm, _1_MockVariableIntBlock_0.pyl, _1.fnm, _1_TestBloomFilteredLucene40Postings_0.frq, _1_nrm.cfe, _1_MockVariableIntBlock_0.tib, _1.fdx, _1_MockVariableIntBlock_0.frq, _1_TestBloomFilteredLucene40Postings_0.tip, _1_Memory_0.ram, _1.fdt, _1_MockVariableIntBlock_0.doc, _1.si, _1_TestBloomFilteredLucene40Postings_0.tim, segments_3]
[junit4:junit4]   2> 1840 T3232 C251 oasc.SolrDeletionPolicy.updateCommits newest commit = 3
[junit4:junit4]   2> 1841 T3232 C251 UPDATE [collection1] webapp=null path=null params={} {add=[1]} 0 14
[junit4:junit4]   2> 1851 T3232 C251 UPDATE [collection1] webapp=null path=null params={} {add=[2]} 0 1
[junit4:junit4]   2> 1861 T3232 C251 UPDATE [collection1] webapp=null path=null params={} {add=[3]} 0 1
[junit4:junit4]   2> 1868 T3232 C251 oasu.DirectUpdateHandler2.commit start commit{flags=0,_version_=0,optimize=false,openSearcher=true,waitSearcher=true,expungeDeletes=false,softCommit=false}
[junit4:junit4]   2> 1890 T3232 C251 oasc.SolrDeletionPolicy.onCommit SolrDeletionPolicy.onCommit: commits:num=2
[junit4:junit4]   2> 		commit{dir=MockDirWrapper(org.apache.lucene.store.NIOFSDirectory@C:\Jenkins\workspace\Lucene-Solr-4.x-Windows\solr\build\solr-core\test\J0\solrtest-SuggesterTSTTest-1345025509928\index lockFactory=org.apache.lucene.store.NativeFSLockFactory@b07546e),segFN=segments_3,generation=3,filenames=[_1_MockVariableIntBlock_0.skp, _1_nrm.cfs, _1_TestBloomFilteredLucene40Postings_0.prx, _1_MockVariableIntBlock_0.tii, _1_MockVariableIntBlock_0.pos, _1_TestBloomFilteredLucene40Postings_0.blm, _1_MockVariableIntBlock_0.pyl, _1.fnm, _1_TestBloomFilteredLucene40Postings_0.frq, _1_nrm.cfe, _1_MockVariableIntBlock_0.tib, _1.fdx, _1_MockVariableIntBlock_0.frq, _1_TestBloomFilteredLucene40Postings_0.tip, _1_Memory_0.ram, _1.fdt, _1_MockVariableIntBlock_0.doc, _1.si, _1_TestBloomFilteredLucene40Postings_0.tim, segments_3]
[junit4:junit4]   2> 		commit{dir=MockDirWrapper(org.apache.lucene.store.NIOFSDirectory@C:\Jenkins\workspace\Lucene-Solr-4.x-Windows\solr\build\solr-core\test\J0\solrtest-SuggesterTSTTest-1345025509928\index lockFactory=org.apache.lucene.store.NativeFSLockFactory@b07546e),segFN=segments_4,generation=4,filenames=[_1_MockVariableIntBlock_0.skp, _2_Direct_0.tip, _2.si, _2_Direct_0.tim, _2_TestBloomFilteredLucene40Postings_0.prx, _2_MockVariableIntBlock_0.pyl, _2_TestBloomFilteredLucene40Postings_0.blm, _2_MockVariableIntBlock_0.frq, _1_MockVariableIntBlock_0.pyl, _1_TestBloomFilteredLucene40Postings_0.blm, _1.fnm, _2_MockVariableIntBlock_0.doc, _1_TestBloomFilteredLucene40Postings_0.tip, _2_nrm.cfe, _1_Memory_0.ram, _1_MockVariableIntBlock_0.doc, _2_Memory_0.ram, _2_nrm.cfs, _1_TestBloomFilteredLucene40Postings_0.tim, _2_MockVariableIntBlock_0.pos, _2_TestBloomFilteredLucene40Postings_0.frq, _1_nrm.cfs, _2_MockVariableIntBlock_0.tii, _2_TestBloomFilteredLucene40Postings_0.tim, _1_TestBloomFilteredLucene40Postings_0.prx, _2_MockVariableIntBlock_0.tib, _1_MockVariableIntBlock_0.tii, _1_MockVariableIntBlock_0.pos, _2.fdt, _2.fdx, _2_TestBloomFilteredLucene40Postings_0.tip, _1_TestBloomFilteredLucene40Postings_0.frq, _2.fnm, _1_MockVariableIntBlock_0.tib, _1_nrm.cfe, _2_Direct_0.prx, _1_MockVariableIntBlock_0.frq, _1.fdx, _1.fdt, _1.si, _2_Direct_0.frq, _2_MockVariableIntBlock_0.skp, segments_4]
[junit4:junit4]   2> 1890 T3232 C251 oasc.SolrDeletionPolicy.updateCommits newest commit = 4
[junit4:junit4]   2> 1900 T3232 C251 oass.SolrIndexSearcher.<init> Opening Searcher@7c42b573 main
[junit4:junit4]   2> 1901 T3232 C251 oass.SolrIndexSearcher.getIndexDir WARNING WARNING: Directory impl does not support setting indexDir: org.apache.lucene.store.MockDirectoryWrapper
[junit4:junit4]   2> 1902 T3234 oashc.SpellCheckComponent$SpellCheckerListener.buildSpellIndex Building spell index for spell checker: suggest
[junit4:junit4]   2> 1901 T3232 C251 oasu.DirectUpdateHandler2.commit end_commit_flush
[junit4:junit4]   2> 1902 T3234 oasss.Suggester.build build()
[junit4:junit4]   2> 1905 T3234 oasss.Suggester.build Stored suggest data to: C:\Jenkins\workspace\Lucene-Solr-4.x-Windows\solr\build\solr-core\test\J0\.\solrtest-SuggesterTSTTest-1345025509928\suggest\jaspell.dat
[junit4:junit4]   2> 1905 T3234 oashc.SpellCheckComponent$SpellCheckerListener.buildSpellIndex Building spell index for spell checker: suggest_tst
[junit4:junit4]   2> 1905 T3234 oasss.Suggester.build build()
[junit4:junit4]   2> 1912 T3234 oasss.Suggester.build Stored suggest data to: C:\Jenkins\workspace\Lucene-Solr-4.x-Windows\solr\build\solr-core\test\J0\.\solrtest-SuggesterTSTTest-1345025509928\suggest_tst\tst.dat
[junit4:junit4]   2> 1912 T3234 oashc.SpellCheckComponent$SpellCheckerListener.buildSpellIndex Building spell index for spell checker: suggest_fst
[junit4:junit4]   2> 1912 T3234 oasss.Suggester.build build()
[junit4:junit4]   2> 1919 T3234 oasss.Suggester.build Stored suggest data to: C:\Jenkins\workspace\Lucene-Solr-4.x-Windows\solr\build\solr-core\test\J0\.\solrtest-SuggesterTSTTest-1345025509928\suggest_fst\fst.bin
[junit4:junit4]   2> 1920 T3234 oashc.SpellCheckComponent$SpellCheckerListener.buildSpellIndex Building spell index for spell checker: suggest_wfst
[junit4:junit4]   2> 1920 T3234 oasss.Suggester.build build()
[junit4:junit4]   2> 1923 T3234 oasss.Suggester.build Stored suggest data to: C:\Jenkins\workspace\Lucene-Solr-4.x-Windows\solr\build\solr-core\test\J0\.\solrtest-SuggesterTSTTest-1345025509928\suggest_wfst\wfst.bin
[junit4:junit4]   2> 1923 T3234 oasc.SolrCore.registerSearcher [collection1] Registered new searcher Searcher@7c42b573 main{StandardDirectoryReader(segments_4:9 _1(4.0.0.2):C3 _2(4.0.0.2):C3)}
[junit4:junit4]   2> 1923 T3232 C251 UPDATE [collection1] webapp=null path=null params={} {commit=} 0 56
[junit4:junit4]   2> 1926 T3232 C251 REQ [collection1] webapp=null path=null params={q=ac&spellcheck.count=2&qt=/suggest_tst&spellcheck.onlyMorePopular=true} status=0 QTime=1 
[junit4:junit4]   2> 1945 T3232 C251 UPDATE [collection1] webapp=null path=null params={} {add=[4]} 0 1
[junit4:junit4]   2> 1955 T3232 C251 oasu.DirectUpdateHandler2.commit start commit{flags=0,_version_=0,optimize=false,openSearcher=true,waitSearcher=true,expungeDeletes=false,softCommit=false}
[junit4:junit4]   2> 1981 T3232 C251 oasc.SolrDeletionPolicy.onCommit SolrDeletionPolicy.onCommit: commits:num=2
[junit4:junit4]   2> 		commit{dir=MockDirWrapper(org.apache.lucene.store.NIOFSDirectory@C:\Jenkins\workspace\Lucene-Solr-4.x-Windows\solr\build\solr-core\test\J0\solrtest-SuggesterTSTTest-1345025509928\index lockFactory=org.apache.lucene.store.NativeFSLockFactory@b07546e),segFN=segments_4,generation=4,filenames=[_1_MockVariableIntBlock_0.skp, _2_Direct_0.tip, _2.si, _2_Direct_0.tim, _2_TestBloomFilteredLucene40Postings_0.prx, _2_MockVariableIntBlock_0.pyl, _2_TestBloomFilteredLucene40Postings_0.blm, _2_MockVariableIntBlock_0.frq, _1_MockVariableIntBlock_0.pyl, _1_TestBloomFilteredLucene40Postings_0.blm, _1.fnm, _2_MockVariableIntBlock_0.doc, _1_TestBloomFilteredLucene40Postings_0.tip, _2_nrm.cfe, _1_Memory_0.ram, _1_MockVariableIntBlock_0.doc, _2_Memory_0.ram, _2_nrm.cfs, _1_TestBloomFilteredLucene40Postings_0.tim, _2_MockVariableIntBlock_0.pos, _2_TestBloomFilteredLucene40Postings_0.frq, _1_nrm.cfs, _2_MockVariableIntBlock_0.tii, _2_TestBloomFilteredLucene40Postings_0.tim, _1_TestBloomFilteredLucene40Postings_0.prx, _2_MockVariableIntBlock_0.tib, _1_MockVariableIntBlock_0.tii, _1_MockVariableIntBlock_0.pos, _2.fdt, _2.fdx, _2_TestBloomFilteredLucene40Postings_0.tip, _1_TestBloomFilteredLucene40Postings_0.frq, _2.fnm, _1_MockVariableIntBlock_0.tib, _1_nrm.cfe, _2_Direct_0.prx, _1_MockVariableIntBlock_0.frq, _1.fdx, _1.fdt, _1.si, _2_Direct_0.frq, _2_MockVariableIntBlock_0.skp, segments_4]
[junit4:junit4]   2> 		commit{dir=MockDirWrapper(org.apache.lucene.store.NIOFSDirectory@C:\Jenkins\workspace\Lucene-Solr-4.x-Windows\solr\build\solr-core\test\J0\solrtest-SuggesterTSTTest-1345025509928\index lockFactory=org.apache.lucene.store.NativeFSLockFactory@b07546e),segFN=segments_5,generation=5,filenames=[_2_Direct_0.tip, _3_nrm.cfe, _3_Direct_0.frq, _2_Direct_0.tim, _2_TestBloomFilteredLucene40Postings_0.prx, _3_TestBloomFilteredLucene40Postings_0.prx, _3_MockVariableIntBlock_0.frq, _2_TestBloomFilteredLucene40Postings_0.blm, _3.fdt, _1.fnm, _3_Direct_0.prx, _3_TestBloomFilteredLucene40Postings_0.frq, _2_MockVariableIntBlock_0.pos, _2_TestBloomFilteredLucene40Postings_0.tim, _3_TestBloomFilteredLucene40Postings_0.tim, _3_Direct_0.tip, _1_MockVariableIntBlock_0.tii, _3_MockVariableIntBlock_0.doc, _2.fdt, _3_TestBloomFilteredLucene40Postings_0.tip, _2.fdx, _1_TestBloomFilteredLucene40Postings_0.frq, _2_TestBloomFilteredLucene40Postings_0.tip, _1_MockVariableIntBlock_0.tib, _3_nrm.cfs, _1.fdx, _1.fdt, _3_MockVariableIntBlock_0.tib, _3.si, _3_TestBloomFilteredLucene40Postings_0.blm, _2_MockVariableIntBlock_0.skp, _3_Direct_0.tim, _2.si, _1_MockVariableIntBlock_0.skp, _2_MockVariableIntBlock_0.pyl, _1_TestBloomFilteredLucene40Postings_0.blm, _1_MockVariableIntBlock_0.pyl, _2_MockVariableIntBlock_0.frq, _3.fnm, _3_MockVariableIntBlock_0.tii, _2_MockVariableIntBlock_0.doc, _1_TestBloomFilteredLucene40Postings_0.tip, _1_Memory_0.ram, _2_nrm.cfe, _1_MockVariableIntBlock_0.doc, _2_Memory_0.ram, _3_Memory_0.ram, _1_TestBloomFilteredLucene40Postings_0.tim, _2_nrm.cfs, _2_TestBloomFilteredLucene40Postings_0.frq, _2_MockVariableIntBlock_0.tii, _1_nrm.cfs, _1_TestBloomFilteredLucene40Postings_0.prx, _2_MockVariableIntBlock_0.tib, _1_MockVariableIntBlock_0.pos, _1_nrm.cfe, _2.fnm, _3.fdx, _1_MockVariableIntBlock_0.frq, _2_Direct_0.prx, _1.si, _3_MockVariableIntBlock_0.pyl, _2_Direct_0.frq, segments_5, _3_MockVariableIntBlock_0.skp, _3_MockVariableIntBlock_0.pos]
[junit4:junit4]   2> 1981 T3232 C251 oasc.SolrDeletionPolicy.updateCommits newest commit = 5
[junit4:junit4]   2> 1993 T3232 C251 oass.SolrIndexSearcher.<init> Opening Searcher@488c36a1 main
[junit4:junit4]   2> 1994 T3232 C251 oass.SolrIndexSearcher.getIndexDir WARNING WARNING: Directory impl does not support setting indexDir: org.apache.lucene.store.MockDirectoryWrapper
[junit4:junit4]   2> 1994 T3234 oashc.SpellCheckComponent$SpellCheckerListener.buildSpellIndex Building spell index for spell checker: suggest
[junit4:junit4]   2> 1994 T3232 C251 oasu.DirectUpdateHandler2.commit end_commit_flush
[junit4:junit4]   2> 1994 T3234 oasss.Suggester.build build()
[junit4:junit4]   2> 1997 T3234 oasss.Suggester.build Stored suggest data to: C:\Jenkins\workspace\Lucene-Solr-4.x-Windows\solr\build\solr-core\test\J0\.\solrtest-SuggesterTSTTest-1345025509928\suggest\jaspell.dat
[junit4:junit4]   2> 1997 T3234 oashc.SpellCheckComponent$SpellCheckerListener.buildSpellIndex Building spell index for spell checker: suggest_tst
[junit4:junit4]   2> 1997 T3234 oasss.Suggester.build build()
[junit4:junit4]   2> 2004 T3234 oasss.Suggester.build Stored suggest data to: C:\Jenkins\workspace\Lucene-Solr-4.x-Windows\solr\build\solr-core\test\J0\.\solrtest-SuggesterTSTTest-1345025509928\suggest_tst\tst.dat
[junit4:junit4]   2> 2005 T3234 oashc.SpellCheckComponent$SpellCheckerListener.buildSpellIndex Building spell index for spell checker: suggest_fst
[junit4:junit4]   2> 2005 T3234 oasss.Suggester.build build()
[junit4:junit4]   2> 2012 T3234 oasss.Suggester.build Stored suggest data to: C:\Jenkins\workspace\Lucene-Solr-4.x-Windows\solr\build\solr-core\test\J0\.\solrtest-SuggesterTSTTest-1345025509928\suggest_fst\fst.bin
[junit4:junit4]   2> 2012 T3234 oashc.SpellCheckComponent$SpellCheckerListener.buildSpellIndex Building spell index for spell checker: suggest_wfst
[junit4:junit4]   2> 2012 T3234 oasss.Suggester.build build()
[junit4:junit4]   2> 2016 T3234 oasss.Suggester.build Stored suggest data to: C:\Jenkins\workspace\Lucene-Solr-4.x-Windows\solr\build\solr-core\test\J0\.\solrtest-SuggesterTSTTest-1345025509928\suggest_wfst\wfst.bin
[junit4:junit4]   2> 2016 T3234 oasc.SolrCore.registerSearcher [collection1] Registered new searcher Searcher@488c36a1 main{StandardDirectoryReader(segments_5:11 _1(4.0.0.2):C3 _2(4.0.0.2):C3 _3(4.0.0.2):C1)}
[junit4:junit4]   2> 2016 T3232 C251 UPDATE [collection1] webapp=null path=null params={} {commit=} 0 61
[junit4:junit4]   2> 2019 T3232 C251 REQ [collection1] webapp=null path=null params={q=ac&spellcheck.count=2&qt=/suggest_tst&spellcheck.onlyMorePopular=true} status=0 QTime=0 
[junit4:junit4]   2> 2021 T3232 oas.SolrTestCaseJ4.tearDown ###Ending testRebuild
[junit4:junit4]   2> 2025 T3232 oas.SolrTestCaseJ4.setUp ###Starting testAnalyzer
[junit4:junit4]   2> 2025 T3232 oasss.Suggester.init init: {lookupImpl=org.apache.solr.spelling.suggest.tst.TSTLookupFactory}
[junit4:junit4]   2> 2025 T3232 oas.SolrTestCaseJ4.tearDown ###Ending testAnalyzer
[junit4:junit4]   2> 2026 T3232 oas.SolrTestCaseJ4.deleteCore ###deleteCore
[junit4:junit4]   2> 2026 T3232 oasc.CoreContainer.shutdown Shutting down CoreContainer instance=232055810
[junit4:junit4]   2> 2026 T3232 oasc.SolrCore.close [collection1]  CLOSING SolrCore org.apache.solr.core.SolrCore@1da52564
[junit4:junit4]   2> 2027 T3232 oasc.SolrCore.closeSearcher [collection1] Closing main searcher on request.
[junit4:junit4]   2> 2029 T3232 oasu.DirectUpdateHandler2.close closing DirectUpdateHandler2{commits=2,autocommits=0,soft autocommits=0,optimizes=0,rollbacks=0,expungeDeletes=0,docsPending=0,adds=0,deletesById=0,deletesByQuery=0,errors=0,cumulative_adds=4,cumulative_deletesById=0,cumulative_deletesByQuery=0,cumulative_errors=0}
[junit4:junit4]   2> 2029 T3232 oasu.DefaultSolrCoreState.decref SolrCoreState ref count has reached 0 - closing IndexWriter
[junit4:junit4]   2> NOTE: test params are: codec=Lucene40: {timestamp=PostingsFormat(name=Direct), range_facet_l=PostingsFormat(name=Direct), id=PostingsFormat(name=TestBloomFilteredLucene40Postings), range_facet_sl=MockVariableIntBlock(baseBlockSize=4), range_facet_si=PostingsFormat(name=Memory doPackFST= false), text=MockVariableIntBlock(baseBlockSize=4), multiDefault=PostingsFormat(name=Memory doPackFST= false), suggest=PostingsFormat(name=Memory doPackFST= false), intDefault=PostingsFormat(name=Direct), spell=PostingsFormat(name=Memory doPackFST= false)}, sim=RandomSimilarityProvider(queryNorm=false,coord=yes): {}, locale=es_DO, timezone=Europe/Nicosia
[junit4:junit4]   2> NOTE: Windows 7 6.1 amd64/Sun Microsystems Inc. 1.6.0_33 (64-bit)/cpus=2,threads=1,free=67657224,total=190119936
[junit4:junit4]   2> NOTE: All tests run in this JVM: [TestJmxMonitoredMap, LeaderElectionIntegrationTest, ShowFileRequestHandlerTest, TestJoin, CacheHeaderTest, TestStressVersions, SignatureUpdateProcessorFactoryTest, TestHashPartitioner, SuggesterWFSTTest, TestValueSourceCache, TestSolrDeletionPolicy2, SortByFunctionTest, TestDFRSimilarityFactory, TestBinaryField, PrimUtilsTest, SearchHandlerTest, TestWordDelimiterFilterFactory, TestReplicationHandler, ClusterStateTest, TestConfig, JsonLoaderTest, NumericFieldsTest, LukeRequestHandlerTest, TestCSVResponseWriter, SolrRequestParserTest, CSVRequestHandlerTest, TestUpdate, TestDocumentBuilder, CoreContainerCoreInitFailuresTest, FieldAnalysisRequestHandlerTest, LegacyHTMLStripCharFilterTest, ResourceLoaderTest, HighlighterTest, TestFiltering, BadComponentTest, PreAnalyzedFieldTest, EchoParamsTest, ClusterStateUpdateTest, RequestHandlersTest, BasicDistributedZkTest, FieldMutatingUpdateProcessorTest, FastVectorHighlighterTest, TermVectorComponentTest, TestSolrXMLSerializer, DistributedTermsComponentTest, ZkControllerTest, RAMDirectoryFactoryTest, QueryParsingTest, TestMultiCoreConfBootstrap, TestRandomFaceting, TestDistributedGrouping, DistributedQueryElevationComponentTest, TestFunctionQuery, AnalysisAfterCoreReloadTest, IndexSchemaTest, TestTrie, SystemInfoHandlerTest, StatelessScriptUpdateProcessorFactoryTest, SimpleFacetsTest, DirectSolrConnectionTest, SuggesterFSTTest, RecoveryZkTest, TimeZoneUtilsTest, SyncSliceTest, TestLMJelinekMercerSimilarityFactory, SolrCoreTest, TestCodecSupport, HighlighterConfigTest, TestReversedWildcardFilterFactory, ScriptEngineTest, ConvertedLegacyTest, CopyFieldTest, ZkSolrClientTest, DisMaxRequestHandlerTest, BasicZkTest, PeerSyncTest, DateFieldTest, TestFastLRUCache, TestRecovery, TestBadConfig, TestRemoteStreaming, DebugComponentTest, SolrInfoMBeanTest, TestCharFilters, TestCollationKeyRangeQueries, SolrPluginUtilsTest, ZkNodePropsTest, NotRequiredUniqueKeyTest, IndexBasedSpellCheckerTest, DocumentAnalysisRequestHandlerTest, TestLMDirichletSimilarityFactory, TestBM25SimilarityFactory, SpellingQueryConverterTest, MinimalSchemaTest, SampleTest, TestQuerySenderNoQuery, DirectUpdateHandlerOptimizeTest, MoreLikeThisHandlerTest, TestRealTimeGet, TestPluginEnable, PluginInfoTest, TestGroupingSearch, LoggingHandlerTest, MultiTermTest, CurrencyFieldTest, PathHierarchyTokenizerFactoryTest, BasicDistributedZk2Test, SpellPossibilityIteratorTest, OverseerTest, SpellCheckComponentTest, FullSolrCloudDistribCmdsTest, LeaderElectionTest, DistributedSpellCheckComponentTest, TestDistributedSearch, SpellCheckCollatorTest, TestExtendedDismaxParser, SoftAutoCommitTest, AutoCommitTest, TestFaceting, WordBreakSolrSpellCheckerTest, StatsComponentTest, TestRangeQuery, DirectUpdateHandlerTest, TestCoreContainer, TestSort, DirectSolrSpellCheckerTest, FileBasedSpellCheckerTest, QueryElevationComponentTest, BasicFunctionalityTest, TestBinaryResponseWriter, TestJmxIntegration, TestIndexSearcher, CoreAdminHandlerTest, QueryEqualityTest, TestCSVLoader, PolyFieldTest, SpatialFilterTest, DocumentBuilderTest, MBeansHandlerTest, TestPseudoReturnFields, BinaryUpdateRequestHandlerTest, TermsComponentTest, DistanceFunctionTest, XsltUpdateRequestHandlerTest, StandardRequestHandlerTest, TestQueryTypes, TestPHPSerializedResponseWriter, XmlUpdateRequestHandlerTest, PingRequestHandlerTest, TestSurroundQueryParser, IndexSchemaRuntimeFieldTest, TestSolrQueryParser, JSONWriterTest, ReturnFieldsTest, RequiredFieldsTest, TestOmitPositions, TestArbitraryIndexDir, TestQueryUtils, SuggesterTSTTest]
[junit4:junit4] Completed in 2.11s, 4 tests, 1 error <<< FAILURES!

[...truncated 191 lines...]
BUILD FAILED
C:\Jenkins\workspace\Lucene-Solr-4.x-Windows\build.xml:29: The following error occurred while executing this line:
C:\Jenkins\workspace\Lucene-Solr-4.x-Windows\solr\build.xml:144: The following error occurred while executing this line:
C:\Jenkins\workspace\Lucene-Solr-4.x-Windows\lucene\module-build.xml:62: The following error occurred while executing this line:
C:\Jenkins\workspace\Lucene-Solr-4.x-Windows\lucene\common-build.xml:1105: The following error occurred while executing this line:
C:\Jenkins\workspace\Lucene-Solr-4.x-Windows\lucene\common-build.xml:797: There were test failures: 225 suites, 906 tests, 1 error, 11 ignored (6 assumptions)

Total time: 37 minutes 19 seconds
Build step 'Invoke Ant' marked build as failure
Recording test results
Description set: Java: 64bit/jdk1.6.0_33 -XX:+UseConcMarkSweepGC
Email was triggered for: Failure
Sending email for trigger: Failure



Mime
View raw message