lucene-dev mailing list archives

Site index · List index
Message view « Date » · « Thread »
Top « Date » · « Thread »
From Apache Jenkins Server <jenk...@builds.apache.org>
Subject [JENKINS] Lucene-Solr-NightlyTests-4.x - Build # 18 - Failure
Date Thu, 30 Aug 2012 17:45:59 GMT
Build: https://builds.apache.org/job/Lucene-Solr-NightlyTests-4.x/18/

3 tests failed.
REGRESSION:  org.apache.solr.cloud.BasicDistributedZkTest.testDistribSearch

Error Message:


Stack Trace:
java.lang.RuntimeException
	at org.apache.solr.common.cloud.SolrZkClient.<init>(SolrZkClient.java:156)
	at org.apache.solr.common.cloud.SolrZkClient.<init>(SolrZkClient.java:104)
	at org.apache.solr.common.cloud.SolrZkClient.<init>(SolrZkClient.java:86)
	at org.apache.solr.cloud.AbstractZkTestCase.buildZooKeeper(AbstractZkTestCase.java:90)
	at org.apache.solr.cloud.AbstractZkTestCase.buildZooKeeper(AbstractZkTestCase.java:84)
	at org.apache.solr.cloud.AbstractDistribZkTestBase.setUp(AbstractDistribZkTestBase.java:68)
	at sun.reflect.NativeMethodAccessorImpl.invoke0(Native Method)
	at sun.reflect.NativeMethodAccessorImpl.invoke(NativeMethodAccessorImpl.java:57)
	at sun.reflect.DelegatingMethodAccessorImpl.invoke(DelegatingMethodAccessorImpl.java:43)
	at java.lang.reflect.Method.invoke(Method.java:616)
	at com.carrotsearch.randomizedtesting.RandomizedRunner.invoke(RandomizedRunner.java:1559)
	at com.carrotsearch.randomizedtesting.RandomizedRunner.access$600(RandomizedRunner.java:79)
	at com.carrotsearch.randomizedtesting.RandomizedRunner$7.evaluate(RandomizedRunner.java:771)
	at com.carrotsearch.randomizedtesting.RandomizedRunner$8.evaluate(RandomizedRunner.java:787)
	at com.carrotsearch.randomizedtesting.rules.SystemPropertiesRestoreRule$1.evaluate(SystemPropertiesRestoreRule.java:53)
	at org.apache.lucene.util.TestRuleSetupTeardownChained$1.evaluate(TestRuleSetupTeardownChained.java:50)
	at org.apache.lucene.util.TestRuleFieldCacheSanity$1.evaluate(TestRuleFieldCacheSanity.java:51)
	at org.apache.lucene.util.AbstractBeforeAfterRule$1.evaluate(AbstractBeforeAfterRule.java:45)
	at com.carrotsearch.randomizedtesting.rules.SystemPropertiesInvariantRule$1.evaluate(SystemPropertiesInvariantRule.java:55)
	at org.apache.lucene.util.TestRuleThreadAndTestName$1.evaluate(TestRuleThreadAndTestName.java:48)
	at org.apache.lucene.util.TestRuleIgnoreAfterMaxFailures$1.evaluate(TestRuleIgnoreAfterMaxFailures.java:70)
	at org.apache.lucene.util.TestRuleMarkFailure$1.evaluate(TestRuleMarkFailure.java:48)
	at com.carrotsearch.randomizedtesting.rules.StatementAdapter.evaluate(StatementAdapter.java:36)
	at com.carrotsearch.randomizedtesting.ThreadLeakControl$StatementRunner.run(ThreadLeakControl.java:345)
	at com.carrotsearch.randomizedtesting.ThreadLeakControl.forkTimeoutingTask(ThreadLeakControl.java:769)
	at com.carrotsearch.randomizedtesting.ThreadLeakControl$3.evaluate(ThreadLeakControl.java:429)
	at com.carrotsearch.randomizedtesting.RandomizedRunner.runSingleTest(RandomizedRunner.java:746)
	at com.carrotsearch.randomizedtesting.RandomizedRunner$3.evaluate(RandomizedRunner.java:648)
	at com.carrotsearch.randomizedtesting.RandomizedRunner$4.evaluate(RandomizedRunner.java:682)
	at com.carrotsearch.randomizedtesting.RandomizedRunner$5.evaluate(RandomizedRunner.java:693)
	at com.carrotsearch.randomizedtesting.rules.StatementAdapter.evaluate(StatementAdapter.java:36)
	at com.carrotsearch.randomizedtesting.rules.SystemPropertiesRestoreRule$1.evaluate(SystemPropertiesRestoreRule.java:53)
	at org.apache.lucene.util.AbstractBeforeAfterRule$1.evaluate(AbstractBeforeAfterRule.java:45)
	at org.apache.lucene.util.TestRuleStoreClassName$1.evaluate(TestRuleStoreClassName.java:42)
	at com.carrotsearch.randomizedtesting.rules.SystemPropertiesInvariantRule$1.evaluate(SystemPropertiesInvariantRule.java:55)
	at com.carrotsearch.randomizedtesting.rules.NoShadowingOrOverridesOnMethodsRule$1.evaluate(NoShadowingOrOverridesOnMethodsRule.java:39)
	at com.carrotsearch.randomizedtesting.rules.NoShadowingOrOverridesOnMethodsRule$1.evaluate(NoShadowingOrOverridesOnMethodsRule.java:39)
	at org.apache.lucene.util.TestRuleAssertionsRequired$1.evaluate(TestRuleAssertionsRequired.java:40)
	at org.apache.lucene.util.TestRuleMarkFailure$1.evaluate(TestRuleMarkFailure.java:48)
	at org.apache.lucene.util.TestRuleIgnoreAfterMaxFailures$1.evaluate(TestRuleIgnoreAfterMaxFailures.java:70)
	at org.apache.lucene.util.TestRuleIgnoreTestSuites$1.evaluate(TestRuleIgnoreTestSuites.java:55)
	at com.carrotsearch.randomizedtesting.rules.StatementAdapter.evaluate(StatementAdapter.java:36)
	at com.carrotsearch.randomizedtesting.ThreadLeakControl$StatementRunner.run(ThreadLeakControl.java:345)
	at java.lang.Thread.run(Thread.java:679)


FAILED:  junit.framework.TestSuite.org.apache.solr.cloud.BasicDistributedZkTest

Error Message:
2 threads leaked from SUITE scope at org.apache.solr.cloud.BasicDistributedZkTest:     1) Thread[id=462, name=TEST-BasicDistributedZkTest.testDistribSearch-seed#[E5FA13A11BAAB45]-EventThread, state=WAITING, group=TGRP-BasicDistributedZkTest]         at sun.misc.Unsafe.park(Native Method)         at java.util.concurrent.locks.LockSupport.park(LockSupport.java:186)         at java.util.concurrent.locks.AbstractQueuedSynchronizer$ConditionObject.await(AbstractQueuedSynchronizer.java:2043)         at java.util.concurrent.LinkedBlockingQueue.take(LinkedBlockingQueue.java:386)         at org.apache.zookeeper.ClientCnxn$EventThread.run(ClientCnxn.java:498)    2) Thread[id=461, name=TEST-BasicDistributedZkTest.testDistribSearch-seed#[E5FA13A11BAAB45]-SendThread(localhost:24656), state=TIMED_WAITING, group=TGRP-BasicDistributedZkTest]         at java.lang.Thread.sleep(Native Method)         at org.apache.zookeeper.ClientCnxn$SendThread.startConnect(ClientCnxn.java:1045)         at org.apache.zookeeper.ClientCnxn$SendThread.run(ClientCnxn.java:1101)

Stack Trace:
com.carrotsearch.randomizedtesting.ThreadLeakError: 2 threads leaked from SUITE scope at org.apache.solr.cloud.BasicDistributedZkTest: 
   1) Thread[id=462, name=TEST-BasicDistributedZkTest.testDistribSearch-seed#[E5FA13A11BAAB45]-EventThread, state=WAITING, group=TGRP-BasicDistributedZkTest]
        at sun.misc.Unsafe.park(Native Method)
        at java.util.concurrent.locks.LockSupport.park(LockSupport.java:186)
        at java.util.concurrent.locks.AbstractQueuedSynchronizer$ConditionObject.await(AbstractQueuedSynchronizer.java:2043)
        at java.util.concurrent.LinkedBlockingQueue.take(LinkedBlockingQueue.java:386)
        at org.apache.zookeeper.ClientCnxn$EventThread.run(ClientCnxn.java:498)
   2) Thread[id=461, name=TEST-BasicDistributedZkTest.testDistribSearch-seed#[E5FA13A11BAAB45]-SendThread(localhost:24656), state=TIMED_WAITING, group=TGRP-BasicDistributedZkTest]
        at java.lang.Thread.sleep(Native Method)
        at org.apache.zookeeper.ClientCnxn$SendThread.startConnect(ClientCnxn.java:1045)
        at org.apache.zookeeper.ClientCnxn$SendThread.run(ClientCnxn.java:1101)
	at __randomizedtesting.SeedInfo.seed([E5FA13A11BAAB45]:0)


FAILED:  junit.framework.TestSuite.org.apache.solr.cloud.BasicDistributedZkTest

Error Message:
There are still zombie threads that couldn't be terminated:    1) Thread[id=461, name=TEST-BasicDistributedZkTest.testDistribSearch-seed#[E5FA13A11BAAB45]-SendThread(localhost:24656), state=RUNNABLE, group=TGRP-BasicDistributedZkTest]         at sun.nio.ch.KqueueArrayWrapper.interrupt(Native Method)         at sun.nio.ch.KqueueArrayWrapper.interrupt(KqueueArrayWrapper.java:206)         at sun.nio.ch.KqueueSelectorImpl.wakeup(KqueueSelectorImpl.java:194)         at java.nio.channels.spi.AbstractSelector$1.interrupt(AbstractSelector.java:210)         at java.nio.channels.spi.AbstractSelector.begin(AbstractSelector.java:215)         at sun.nio.ch.KqueueSelectorImpl.doSelect(KqueueSelectorImpl.java:68)         at sun.nio.ch.SelectorImpl.lockAndDoSelect(SelectorImpl.java:87)         at sun.nio.ch.SelectorImpl.select(SelectorImpl.java:98)         at org.apache.zookeeper.ClientCnxn$SendThread.run(ClientCnxn.java:1131)

Stack Trace:
com.carrotsearch.randomizedtesting.ThreadLeakError: There are still zombie threads that couldn't be terminated:
   1) Thread[id=461, name=TEST-BasicDistributedZkTest.testDistribSearch-seed#[E5FA13A11BAAB45]-SendThread(localhost:24656), state=RUNNABLE, group=TGRP-BasicDistributedZkTest]
        at sun.nio.ch.KqueueArrayWrapper.interrupt(Native Method)
        at sun.nio.ch.KqueueArrayWrapper.interrupt(KqueueArrayWrapper.java:206)
        at sun.nio.ch.KqueueSelectorImpl.wakeup(KqueueSelectorImpl.java:194)
        at java.nio.channels.spi.AbstractSelector$1.interrupt(AbstractSelector.java:210)
        at java.nio.channels.spi.AbstractSelector.begin(AbstractSelector.java:215)
        at sun.nio.ch.KqueueSelectorImpl.doSelect(KqueueSelectorImpl.java:68)
        at sun.nio.ch.SelectorImpl.lockAndDoSelect(SelectorImpl.java:87)
        at sun.nio.ch.SelectorImpl.select(SelectorImpl.java:98)
        at org.apache.zookeeper.ClientCnxn$SendThread.run(ClientCnxn.java:1131)
	at __randomizedtesting.SeedInfo.seed([E5FA13A11BAAB45]:0)




Build Log:
[...truncated 6148 lines...]
[junit4:junit4] Suite: org.apache.solr.cloud.BasicDistributedZkTest
[junit4:junit4]   2> 4 T455 oas.SolrTestCaseJ4.setUp ###Starting testDistribSearch
[junit4:junit4]   2> Creating dataDir: /usr/home/hudson/hudson-slave/workspace/Lucene-Solr-NightlyTests-4.x/solr/build/solr-core/test/J0/./solrtest-BasicDistributedZkTest-1346348668890
[junit4:junit4]   2> 13 T455 oasc.ZkTestServer.run STARTING ZK TEST SERVER
[junit4:junit4]   2> 82 T456 oaz.Environment.logEnv Server environment:zookeeper.version=3.3.6-1366786, built on 07/29/2012 06:22 GMT
[junit4:junit4]   2> 83 T456 oaz.Environment.logEnv Server environment:host.name=lucene.zones.apache.org
[junit4:junit4]   2> 83 T456 oaz.Environment.logEnv Server environment:java.version=1.6.0_32
[junit4:junit4]   2> 83 T456 oaz.Environment.logEnv Server environment:java.vendor=Sun Microsystems Inc.
[junit4:junit4]   2> 83 T456 oaz.Environment.logEnv Server environment:java.home=/usr/local/openjdk6/jre
[junit4:junit4]   2> 83 T456 oaz.Environment.logEnv Server environment:java.class.path=/usr/home/hudson/hudson-slave/workspace/Lucene-Solr-NightlyTests-4.x/solr/build/solr-core/classes/test:/usr/home/hudson/hudson-slave/workspace/Lucene-Solr-NightlyTests-4.x/solr/build/solr-test-framework/classes/java:/usr/home/hudson/hudson-slave/workspace/Lucene-Solr-NightlyTests-4.x/solr/build/solr-core/test-files:/usr/home/hudson/hudson-slave/workspace/Lucene-Solr-NightlyTests-4.x/lucene/build/test-framework/classes/java:/usr/home/hudson/hudson-slave/workspace/Lucene-Solr-NightlyTests-4.x/solr/build/solr-solrj/classes/java:/usr/home/hudson/hudson-slave/workspace/Lucene-Solr-NightlyTests-4.x/solr/build/solr-core/classes/java:/usr/home/hudson/hudson-slave/workspace/Lucene-Solr-NightlyTests-4.x/lucene/build/analysis/common/lucene-analyzers-common-4.0-SNAPSHOT.jar:/usr/home/hudson/hudson-slave/workspace/Lucene-Solr-NightlyTests-4.x/lucene/build/analysis/kuromoji/lucene-analyzers-kuromoji-4.0-SNAPSHOT.jar:/usr/home/hudson/hudson-slave/workspace/Lucene-Solr-NightlyTests-4.x/lucene/build/analysis/phonetic/lucene-analyzers-phonetic-4.0-SNAPSHOT.jar:/usr/home/hudson/hudson-slave/workspace/Lucene-Solr-NightlyTests-4.x/lucene/build/highlighter/lucene-highlighter-4.0-SNAPSHOT.jar:/usr/home/hudson/hudson-slave/workspace/Lucene-Solr-NightlyTests-4.x/lucene/build/memory/lucene-memory-4.0-SNAPSHOT.jar:/usr/home/hudson/hudson-slave/workspace/Lucene-Solr-NightlyTests-4.x/lucene/build/misc/lucene-misc-4.0-SNAPSHOT.jar:/usr/home/hudson/hudson-slave/workspace/Lucene-Solr-NightlyTests-4.x/lucene/build/spatial/lucene-spatial-4.0-SNAPSHOT.jar:/usr/home/hudson/hudson-slave/workspace/Lucene-Solr-NightlyTests-4.x/lucene/build/suggest/lucene-suggest-4.0-SNAPSHOT.jar:/usr/home/hudson/hudson-slave/workspace/Lucene-Solr-NightlyTests-4.x/lucene/build/grouping/lucene-grouping-4.0-SNAPSHOT.jar:/usr/home/hudson/hudson-slave/workspace/Lucene-Solr-NightlyTests-4.x/lucene/build/queries/lucene-queries-4.0-SNAPSHOT.jar:/usr/home/hudson/hudson-slave/workspace/Lucene-Solr-NightlyTests-4.x/lucene/build/queryparser/lucene-queryparser-4.0-SNAPSHOT.jar:/usr/home/hudson/hudson-slave/workspace/Lucene-Solr-NightlyTests-4.x/solr/lib/commons-cli-1.2.jar:/usr/home/hudson/hudson-slave/workspace/Lucene-Solr-NightlyTests-4.x/solr/lib/commons-codec-1.6.jar:/usr/home/hudson/hudson-slave/workspace/Lucene-Solr-NightlyTests-4.x/solr/lib/commons-fileupload-1.2.1.jar:/usr/home/hudson/hudson-slave/workspace/Lucene-Solr-NightlyTests-4.x/solr/lib/commons-io-2.1.jar:/usr/home/hudson/hudson-slave/workspace/Lucene-Solr-NightlyTests-4.x/solr/lib/commons-lang-2.6.jar:/usr/home/hudson/hudson-slave/workspace/Lucene-Solr-NightlyTests-4.x/solr/lib/easymock-2.2.jar:/usr/home/hudson/hudson-slave/workspace/Lucene-Solr-NightlyTests-4.x/solr/lib/guava-r05.jar:/usr/home/hudson/hudson-slave/workspace/Lucene-Solr-NightlyTests-4.x/solr/lib/httpclient-4.1.3.jar:/usr/home/hudson/hudson-slave/workspace/Lucene-Solr-NightlyTests-4.x/solr/lib/httpcore-4.1.4.jar:/usr/home/hudson/hudson-slave/workspace/Lucene-Solr-NightlyTests-4.x/solr/lib/httpmime-4.1.3.jar:/usr/home/hudson/hudson-slave/workspace/Lucene-Solr-NightlyTests-4.x/solr/lib/javax.servlet-api-3.0.1.jar:/usr/home/hudson/hudson-slave/workspace/Lucene-Solr-NightlyTests-4.x/solr/lib/jcl-over-slf4j-1.6.4.jar:/usr/home/hudson/hudson-slave/workspace/Lucene-Solr-NightlyTests-4.x/solr/lib/log4j-over-slf4j-1.6.4.jar:/usr/home/hudson/hudson-slave/workspace/Lucene-Solr-NightlyTests-4.x/solr/lib/slf4j-api-1.6.4.jar:/usr/home/hudson/hudson-slave/workspace/Lucene-Solr-NightlyTests-4.x/solr/lib/slf4j-jdk14-1.6.4.jar:/usr/home/hudson/hudson-slave/workspace/Lucene-Solr-NightlyTests-4.x/solr/lib/spatial4j-0.2.jar:/usr/home/hudson/hudson-slave/workspace/Lucene-Solr-NightlyTests-4.x/solr/lib/wstx-asl-3.2.7.jar:/usr/home/hudson/hudson-slave/workspace/Lucene-Solr-NightlyTests-4.x/solr/lib/zookeeper-3.3.6.jar:/usr/home/hudson/hudson-slave/workspace/Lucene-Solr-NightlyTests-4.x/solr/example/lib/jetty-continuation-8.1.2.v20120308.jar:/usr/home/hudson/hudson-slave/workspace/Lucene-Solr-NightlyTests-4.x/solr/example/lib/jetty-deploy-8.1.2.v20120308.jar:/usr/home/hudson/hudson-slave/workspace/Lucene-Solr-NightlyTests-4.x/solr/example/lib/jetty-http-8.1.2.v20120308.jar:/usr/home/hudson/hudson-slave/workspace/Lucene-Solr-NightlyTests-4.x/solr/example/lib/jetty-io-8.1.2.v20120308.jar:/usr/home/hudson/hudson-slave/workspace/Lucene-Solr-NightlyTests-4.x/solr/example/lib/jetty-jmx-8.1.2.v20120308.jar:/usr/home/hudson/hudson-slave/workspace/Lucene-Solr-NightlyTests-4.x/solr/example/lib/jetty-security-8.1.2.v20120308.jar:/usr/home/hudson/hudson-slave/workspace/Lucene-Solr-NightlyTests-4.x/solr/example/lib/jetty-server-8.1.2.v20120308.jar:/usr/home/hudson/hudson-slave/workspace/Lucene-Solr-NightlyTests-4.x/solr/example/lib/jetty-servlet-8.1.2.v20120308.jar:/usr/home/hudson/hudson-slave/workspace/Lucene-Solr-NightlyTests-4.x/solr/example/lib/jetty-util-8.1.2.v20120308.jar:/usr/home/hudson/hudson-slave/workspace/Lucene-Solr-NightlyTests-4.x/solr/example/lib/jetty-webapp-8.1.2.v20120308.jar:/usr/home/hudson/hudson-slave/workspace/Lucene-Solr-NightlyTests-4.x/solr/example/lib/jetty-xml-8.1.2.v20120308.jar:/usr/home/hudson/hudson-slave/workspace/Lucene-Solr-NightlyTests-4.x/solr/example/lib/servlet-api-3.0.jar:/usr/home/hudson/hudson-slave/workspace/Lucene-Solr-NightlyTests-4.x/solr/example/example-DIH/solr/db/lib/hsqldb-1.8.0.10.jar:/usr/home/hudson/hudson-slave/workspace/Lucene-Solr-NightlyTests-4.x/lucene/build/core/classes/java:/usr/home/hudson/hudson-slave/workspace/Lucene-Solr-NightlyTests-4.x/lucene/test-framework/lib/junit-4.10.jar:/usr/home/hudson/hudson-slave/workspace/Lucene-Solr-NightlyTests-4.x/lucene/test-framework/lib/randomizedtesting-runner-2.0.0.rc5.jar:/home/hudson/hudson-slave/tools/Ant/ant-1.8.2/lib/ant-launcher.jar:/home/hudson/.ant/lib/ivy-2.2.0.jar:/home/hudson/hudson-slave/tools/Ant/ant-1.8.2/lib/ant-apache-regexp.jar:/home/hudson/hudson-slave/tools/Ant/ant-1.8.2/lib/ant-junit.jar:/home/hudson/hudson-slave/tools/Ant/ant-1.8.2/lib/ant-apache-bsf.jar:/home/hudson/hudson-slave/tools/Ant/ant-1.8.2/lib/ant-commons-net.jar:/home/hudson/hudson-slave/tools/Ant/ant-1.8.2/lib/ant-antlr.jar:/home/hudson/hudson-slave/tools/Ant/ant-1.8.2/lib/ant-apache-log4j.jar:/home/hudson/hudson-slave/tools/Ant/ant-1.8.2/lib/ant-commons-logging.jar:/home/hudson/hudson-slave/tools/Ant/ant-1.8.2/lib/ant-apache-xalan2.jar:/home/hudson/hudson-slave/tools/Ant/ant-1.8.2/lib/ant-apache-oro.jar:/home/hudson/hudson-slave/tools/Ant/ant-1.8.2/lib/ant-junit4.jar:/home/hudson/hudson-slave/tools/Ant/ant-1.8.2/lib/ant-netrexx.jar:/home/hudson/hudson-slave/tools/Ant/ant-1.8.2/lib/ant-swing.jar:/home/hudson/hudson-slave/tools/Ant/ant-1.8.2/lib/ant-javamail.jar:/home/hudson/hudson-slave/tools/Ant/ant-1.8.2/lib/ant-jsch.jar:/home/hudson/hudson-slave/tools/Ant/ant-1.8.2/lib/ant-jmf.jar:/home/hudson/hudson-slave/tools/Ant/ant-1.8.2/lib/ant.jar:/home/hudson/hudson-slave/tools/Ant/ant-1.8.2/lib/ant-apache-bcel.jar:/home/hudson/hudson-slave/tools/Ant/ant-1.8.2/lib/ant-jai.jar:/home/hudson/hudson-slave/tools/Ant/ant-1.8.2/lib/ant-testutil.jar:/home/hudson/hudson-slave/tools/Ant/ant-1.8.2/lib/ant-apache-resolver.jar:/home/hudson/hudson-slave/tools/Ant/ant-1.8.2/lib/ant-jdepend.jar:/usr/local/openjdk6/lib/tools.jar:/home/hudson/.ivy2/cache/com.carrotsearch.randomizedtesting/junit4-ant/jars/junit4-ant-2.0.0.rc5.jar
[junit4:junit4]   2> 84 T456 oaz.Environment.logEnv Server environment:java.library.path=/usr/local/openjdk6/jre/lib/amd64/server:/usr/local/openjdk6/jre/lib/amd64:/usr/local/openjdk6/jre/../lib/amd64:/usr/java/packages/lib/amd64:/lib:/usr/lib:/usr/local/lib
[junit4:junit4]   2> 84 T456 oaz.Environment.logEnv Server environment:java.io.tmpdir=.
[junit4:junit4]   2> 84 T456 oaz.Environment.logEnv Server environment:java.compiler=<NA>
[junit4:junit4]   2> 84 T456 oaz.Environment.logEnv Server environment:os.name=FreeBSD
[junit4:junit4]   2> 84 T456 oaz.Environment.logEnv Server environment:os.arch=amd64
[junit4:junit4]   2> 84 T456 oaz.Environment.logEnv Server environment:os.version=9.0-RELEASE
[junit4:junit4]   2> 85 T456 oaz.Environment.logEnv Server environment:user.name=hudson
[junit4:junit4]   2> 85 T456 oaz.Environment.logEnv Server environment:user.home=/home/hudson
[junit4:junit4]   2> 85 T456 oaz.Environment.logEnv Server environment:user.dir=/usr/home/hudson/hudson-slave/workspace/Lucene-Solr-NightlyTests-4.x/solr/build/solr-core/test/J0
[junit4:junit4]   2> 113 T456 oazs.ZooKeeperServer.setTickTime tickTime set to 3000
[junit4:junit4]   2> 138 T456 oazs.NIOServerCnxn$Factory.<init> binding to port 0.0.0.0/0.0.0.0:0
[junit4:junit4]   2> 183 T456 oazsp.FileTxnSnapLog.save Snapshotting: 0
[junit4:junit4]   2> 221 T455 oasc.ZkTestServer.run start zk server on port:24656
[junit4:junit4]   2> 304 T455 oaz.Environment.logEnv Client environment:zookeeper.version=3.3.6-1366786, built on 07/29/2012 06:22 GMT
[junit4:junit4]   2> 305 T455 oaz.Environment.logEnv Client environment:host.name=lucene.zones.apache.org
[junit4:junit4]   2> 305 T455 oaz.Environment.logEnv Client environment:java.version=1.6.0_32
[junit4:junit4]   2> 305 T455 oaz.Environment.logEnv Client environment:java.vendor=Sun Microsystems Inc.
[junit4:junit4]   2> 306 T455 oaz.Environment.logEnv Client environment:java.home=/usr/local/openjdk6/jre
[junit4:junit4]   2> 306 T455 oaz.Environment.logEnv Client environment:java.class.path=/usr/home/hudson/hudson-slave/workspace/Lucene-Solr-NightlyTests-4.x/solr/build/solr-core/classes/test:/usr/home/hudson/hudson-slave/workspace/Lucene-Solr-NightlyTests-4.x/solr/build/solr-test-framework/classes/java:/usr/home/hudson/hudson-slave/workspace/Lucene-Solr-NightlyTests-4.x/solr/build/solr-core/test-files:/usr/home/hudson/hudson-slave/workspace/Lucene-Solr-NightlyTests-4.x/lucene/build/test-framework/classes/java:/usr/home/hudson/hudson-slave/workspace/Lucene-Solr-NightlyTests-4.x/solr/build/solr-solrj/classes/java:/usr/home/hudson/hudson-slave/workspace/Lucene-Solr-NightlyTests-4.x/solr/build/solr-core/classes/java:/usr/home/hudson/hudson-slave/workspace/Lucene-Solr-NightlyTests-4.x/lucene/build/analysis/common/lucene-analyzers-common-4.0-SNAPSHOT.jar:/usr/home/hudson/hudson-slave/workspace/Lucene-Solr-NightlyTests-4.x/lucene/build/analysis/kuromoji/lucene-analyzers-kuromoji-4.0-SNAPSHOT.jar:/usr/home/hudson/hudson-slave/workspace/Lucene-Solr-NightlyTests-4.x/lucene/build/analysis/phonetic/lucene-analyzers-phonetic-4.0-SNAPSHOT.jar:/usr/home/hudson/hudson-slave/workspace/Lucene-Solr-NightlyTests-4.x/lucene/build/highlighter/lucene-highlighter-4.0-SNAPSHOT.jar:/usr/home/hudson/hudson-slave/workspace/Lucene-Solr-NightlyTests-4.x/lucene/build/memory/lucene-memory-4.0-SNAPSHOT.jar:/usr/home/hudson/hudson-slave/workspace/Lucene-Solr-NightlyTests-4.x/lucene/build/misc/lucene-misc-4.0-SNAPSHOT.jar:/usr/home/hudson/hudson-slave/workspace/Lucene-Solr-NightlyTests-4.x/lucene/build/spatial/lucene-spatial-4.0-SNAPSHOT.jar:/usr/home/hudson/hudson-slave/workspace/Lucene-Solr-NightlyTests-4.x/lucene/build/suggest/lucene-suggest-4.0-SNAPSHOT.jar:/usr/home/hudson/hudson-slave/workspace/Lucene-Solr-NightlyTests-4.x/lucene/build/grouping/lucene-grouping-4.0-SNAPSHOT.jar:/usr/home/hudson/hudson-slave/workspace/Lucene-Solr-NightlyTests-4.x/lucene/build/queries/lucene-queries-4.0-SNAPSHOT.jar:/usr/home/hudson/hudson-slave/workspace/Lucene-Solr-NightlyTests-4.x/lucene/build/queryparser/lucene-queryparser-4.0-SNAPSHOT.jar:/usr/home/hudson/hudson-slave/workspace/Lucene-Solr-NightlyTests-4.x/solr/lib/commons-cli-1.2.jar:/usr/home/hudson/hudson-slave/workspace/Lucene-Solr-NightlyTests-4.x/solr/lib/commons-codec-1.6.jar:/usr/home/hudson/hudson-slave/workspace/Lucene-Solr-NightlyTests-4.x/solr/lib/commons-fileupload-1.2.1.jar:/usr/home/hudson/hudson-slave/workspace/Lucene-Solr-NightlyTests-4.x/solr/lib/commons-io-2.1.jar:/usr/home/hudson/hudson-slave/workspace/Lucene-Solr-NightlyTests-4.x/solr/lib/commons-lang-2.6.jar:/usr/home/hudson/hudson-slave/workspace/Lucene-Solr-NightlyTests-4.x/solr/lib/easymock-2.2.jar:/usr/home/hudson/hudson-slave/workspace/Lucene-Solr-NightlyTests-4.x/solr/lib/guava-r05.jar:/usr/home/hudson/hudson-slave/workspace/Lucene-Solr-NightlyTests-4.x/solr/lib/httpclient-4.1.3.jar:/usr/home/hudson/hudson-slave/workspace/Lucene-Solr-NightlyTests-4.x/solr/lib/httpcore-4.1.4.jar:/usr/home/hudson/hudson-slave/workspace/Lucene-Solr-NightlyTests-4.x/solr/lib/httpmime-4.1.3.jar:/usr/home/hudson/hudson-slave/workspace/Lucene-Solr-NightlyTests-4.x/solr/lib/javax.servlet-api-3.0.1.jar:/usr/home/hudson/hudson-slave/workspace/Lucene-Solr-NightlyTests-4.x/solr/lib/jcl-over-slf4j-1.6.4.jar:/usr/home/hudson/hudson-slave/workspace/Lucene-Solr-NightlyTests-4.x/solr/lib/log4j-over-slf4j-1.6.4.jar:/usr/home/hudson/hudson-slave/workspace/Lucene-Solr-NightlyTests-4.x/solr/lib/slf4j-api-1.6.4.jar:/usr/home/hudson/hudson-slave/workspace/Lucene-Solr-NightlyTests-4.x/solr/lib/slf4j-jdk14-1.6.4.jar:/usr/home/hudson/hudson-slave/workspace/Lucene-Solr-NightlyTests-4.x/solr/lib/spatial4j-0.2.jar:/usr/home/hudson/hudson-slave/workspace/Lucene-Solr-NightlyTests-4.x/solr/lib/wstx-asl-3.2.7.jar:/usr/home/hudson/hudson-slave/workspace/Lucene-Solr-NightlyTests-4.x/solr/lib/zookeeper-3.3.6.jar:/usr/home/hudson/hudson-slave/workspace/Lucene-Solr-NightlyTests-4.x/solr/example/lib/jetty-continuation-8.1.2.v20120308.jar:/usr/home/hudson/hudson-slave/workspace/Lucene-Solr-NightlyTests-4.x/solr/example/lib/jetty-deploy-8.1.2.v20120308.jar:/usr/home/hudson/hudson-slave/workspace/Lucene-Solr-NightlyTests-4.x/solr/example/lib/jetty-http-8.1.2.v20120308.jar:/usr/home/hudson/hudson-slave/workspace/Lucene-Solr-NightlyTests-4.x/solr/example/lib/jetty-io-8.1.2.v20120308.jar:/usr/home/hudson/hudson-slave/workspace/Lucene-Solr-NightlyTests-4.x/solr/example/lib/jetty-jmx-8.1.2.v20120308.jar:/usr/home/hudson/hudson-slave/workspace/Lucene-Solr-NightlyTests-4.x/solr/example/lib/jetty-security-8.1.2.v20120308.jar:/usr/home/hudson/hudson-slave/workspace/Lucene-Solr-NightlyTests-4.x/solr/example/lib/jetty-server-8.1.2.v20120308.jar:/usr/home/hudson/hudson-slave/workspace/Lucene-Solr-NightlyTests-4.x/solr/example/lib/jetty-servlet-8.1.2.v20120308.jar:/usr/home/hudson/hudson-slave/workspace/Lucene-Solr-NightlyTests-4.x/solr/example/lib/jetty-util-8.1.2.v20120308.jar:/usr/home/hudson/hudson-slave/workspace/Lucene-Solr-NightlyTests-4.x/solr/example/lib/jetty-webapp-8.1.2.v20120308.jar:/usr/home/hudson/hudson-slave/workspace/Lucene-Solr-NightlyTests-4.x/solr/example/lib/jetty-xml-8.1.2.v20120308.jar:/usr/home/hudson/hudson-slave/workspace/Lucene-Solr-NightlyTests-4.x/solr/example/lib/servlet-api-3.0.jar:/usr/home/hudson/hudson-slave/workspace/Lucene-Solr-NightlyTests-4.x/solr/example/example-DIH/solr/db/lib/hsqldb-1.8.0.10.jar:/usr/home/hudson/hudson-slave/workspace/Lucene-Solr-NightlyTests-4.x/lucene/build/core/classes/java:/usr/home/hudson/hudson-slave/workspace/Lucene-Solr-NightlyTests-4.x/lucene/test-framework/lib/junit-4.10.jar:/usr/home/hudson/hudson-slave/workspace/Lucene-Solr-NightlyTests-4.x/lucene/test-framework/lib/randomizedtesting-runner-2.0.0.rc5.jar:/home/hudson/hudson-slave/tools/Ant/ant-1.8.2/lib/ant-launcher.jar:/home/hudson/.ant/lib/ivy-2.2.0.jar:/home/hudson/hudson-slave/tools/Ant/ant-1.8.2/lib/ant-apache-regexp.jar:/home/hudson/hudson-slave/tools/Ant/ant-1.8.2/lib/ant-junit.jar:/home/hudson/hudson-slave/tools/Ant/ant-1.8.2/lib/ant-apache-bsf.jar:/home/hudson/hudson-slave/tools/Ant/ant-1.8.2/lib/ant-commons-net.jar:/home/hudson/hudson-slave/tools/Ant/ant-1.8.2/lib/ant-antlr.jar:/home/hudson/hudson-slave/tools/Ant/ant-1.8.2/lib/ant-apache-log4j.jar:/home/hudson/hudson-slave/tools/Ant/ant-1.8.2/lib/ant-commons-logging.jar:/home/hudson/hudson-slave/tools/Ant/ant-1.8.2/lib/ant-apache-xalan2.jar:/home/hudson/hudson-slave/tools/Ant/ant-1.8.2/lib/ant-apache-oro.jar:/home/hudson/hudson-slave/tools/Ant/ant-1.8.2/lib/ant-junit4.jar:/home/hudson/hudson-slave/tools/Ant/ant-1.8.2/lib/ant-netrexx.jar:/home/hudson/hudson-slave/tools/Ant/ant-1.8.2/lib/ant-swing.jar:/home/hudson/hudson-slave/tools/Ant/ant-1.8.2/lib/ant-javamail.jar:/home/hudson/hudson-slave/tools/Ant/ant-1.8.2/lib/ant-jsch.jar:/home/hudson/hudson-slave/tools/Ant/ant-1.8.2/lib/ant-jmf.jar:/home/hudson/hudson-slave/tools/Ant/ant-1.8.2/lib/ant.jar:/home/hudson/hudson-slave/tools/Ant/ant-1.8.2/lib/ant-apache-bcel.jar:/home/hudson/hudson-slave/tools/Ant/ant-1.8.2/lib/ant-jai.jar:/home/hudson/hudson-slave/tools/Ant/ant-1.8.2/lib/ant-testutil.jar:/home/hudson/hudson-slave/tools/Ant/ant-1.8.2/lib/ant-apache-resolver.jar:/home/hudson/hudson-slave/tools/Ant/ant-1.8.2/lib/ant-jdepend.jar:/usr/local/openjdk6/lib/tools.jar:/home/hudson/.ivy2/cache/com.carrotsearch.randomizedtesting/junit4-ant/jars/junit4-ant-2.0.0.rc5.jar
[junit4:junit4]   2> 307 T455 oaz.Environment.logEnv Client environment:java.library.path=/usr/local/openjdk6/jre/lib/amd64/server:/usr/local/openjdk6/jre/lib/amd64:/usr/local/openjdk6/jre/../lib/amd64:/usr/java/packages/lib/amd64:/lib:/usr/lib:/usr/local/lib
[junit4:junit4]   2> 308 T455 oaz.Environment.logEnv Client environment:java.io.tmpdir=.
[junit4:junit4]   2> 308 T455 oaz.Environment.logEnv Client environment:java.compiler=<NA>
[junit4:junit4]   2> 308 T455 oaz.Environment.logEnv Client environment:os.name=FreeBSD
[junit4:junit4]   2> 309 T455 oaz.Environment.logEnv Client environment:os.arch=amd64
[junit4:junit4]   2> 309 T455 oaz.Environment.logEnv Client environment:os.version=9.0-RELEASE
[junit4:junit4]   2> 309 T455 oaz.Environment.logEnv Client environment:user.name=hudson
[junit4:junit4]   2> 310 T455 oaz.Environment.logEnv Client environment:user.home=/home/hudson
[junit4:junit4]   2> 310 T455 oaz.Environment.logEnv Client environment:user.dir=/usr/home/hudson/hudson-slave/workspace/Lucene-Solr-NightlyTests-4.x/solr/build/solr-core/test/J0
[junit4:junit4]   2> 314 T455 oaz.ZooKeeper.<init> Initiating client connection, connectString=127.0.0.1:24656 sessionTimeout=10000 watcher=org.apache.solr.common.cloud.ConnectionManager@55785458
[junit4:junit4]   2> 356 T461 oaz.ClientCnxn$SendThread.startConnect Opening socket connection to server /127.0.0.1:24656
[junit4:junit4]   2> 360 T461 oaz.ClientCnxn$SendThread.primeConnection Socket connection established to localhost/127.0.0.1:24656, initiating session
[junit4:junit4]   2> 362 T457 oazs.NIOServerCnxn$Factory.run WARNING Ignoring unexpected runtime exception java.security.AccessControlException: access denied (java.net.SocketPermission 140.211.11.196:24660 accept,resolve)
[junit4:junit4]   2> 	at java.security.AccessControlContext.checkPermission(AccessControlContext.java:393)
[junit4:junit4]   2> 	at java.security.AccessController.checkPermission(AccessController.java:553)
[junit4:junit4]   2> 	at java.lang.SecurityManager.checkPermission(SecurityManager.java:549)
[junit4:junit4]   2> 	at java.lang.SecurityManager.checkAccept(SecurityManager.java:1174)
[junit4:junit4]   2> 	at sun.nio.ch.ServerSocketChannelImpl.accept(ServerSocketChannelImpl.java:183)
[junit4:junit4]   2> 	at org.apache.zookeeper.server.NIOServerCnxn$Factory.run(NIOServerCnxn.java:242)
[junit4:junit4]   2> 
[junit4:junit4]   2> 365 T461 oaz.ClientCnxn$SendThread.run Unable to read additional data from server sessionid 0x0, likely server has closed socket, closing socket connection and attempting reconnect
[junit4:junit4]   2> 1366 T457 oazs.NIOServerCnxn$Factory.run WARNING Ignoring unexpected runtime exception java.lang.NullPointerException
[junit4:junit4]   2> 	at org.apache.zookeeper.server.NIOServerCnxn$Factory.run(NIOServerCnxn.java:244)
[junit4:junit4]   2> 
[junit4:junit4]   2> 2044 T461 oaz.ClientCnxn$SendThread.startConnect Opening socket connection to server localhost/127.0.0.1:24656
[junit4:junit4]   2> 2045 T461 oaz.ClientCnxn$SendThread.primeConnection Socket connection established to localhost/127.0.0.1:24656, initiating session
[junit4:junit4]   2> 2045 T457 oazs.NIOServerCnxn$Factory.run WARNING Ignoring unexpected runtime exception java.security.AccessControlException: access denied (java.net.SocketPermission 140.211.11.196:24663 accept,resolve)
[junit4:junit4]   2> 	at java.security.AccessControlContext.checkPermission(AccessControlContext.java:393)
[junit4:junit4]   2> 	at java.security.AccessController.checkPermission(AccessController.java:553)
[junit4:junit4]   2> 	at java.lang.SecurityManager.checkPermission(SecurityManager.java:549)
[junit4:junit4]   2> 	at java.lang.SecurityManager.checkAccept(SecurityManager.java:1174)
[junit4:junit4]   2> 	at sun.nio.ch.ServerSocketChannelImpl.accept(ServerSocketChannelImpl.java:183)
[junit4:junit4]   2> 	at org.apache.zookeeper.server.NIOServerCnxn$Factory.run(NIOServerCnxn.java:242)
[junit4:junit4]   2> 
[junit4:junit4]   2> 2045 T461 oaz.ClientCnxn$SendThread.run Unable to read additional data from server sessionid 0x0, likely server has closed socket, closing socket connection and attempting reconnect
[junit4:junit4]   2> 3047 T457 oazs.NIOServerCnxn$Factory.run WARNING Ignoring unexpected runtime exception java.lang.NullPointerException
[junit4:junit4]   2> 	at org.apache.zookeeper.server.NIOServerCnxn$Factory.run(NIOServerCnxn.java:244)
[junit4:junit4]   2> 
[junit4:junit4]   2> 4047 T461 oaz.ClientCnxn$SendThread.startConnect Opening socket connection to server localhost/127.0.0.1:24656
[junit4:junit4]   2> 4047 T461 oaz.ClientCnxn$SendThread.primeConnection Socket connection established to localhost/127.0.0.1:24656, initiating session
[junit4:junit4]   2> 4048 T457 oazs.NIOServerCnxn$Factory.run WARNING Ignoring unexpected runtime exception java.security.AccessControlException: access denied (java.net.SocketPermission 140.211.11.196:24669 accept,resolve)
[junit4:junit4]   2> 	at java.security.AccessControlContext.checkPermission(AccessControlContext.java:393)
[junit4:junit4]   2> 	at java.security.AccessController.checkPermission(AccessController.java:553)
[junit4:junit4]   2> 	at java.lang.SecurityManager.checkPermission(SecurityManager.java:549)
[junit4:junit4]   2> 	at java.lang.SecurityManager.checkAccept(SecurityManager.java:1174)
[junit4:junit4]   2> 	at sun.nio.ch.ServerSocketChannelImpl.accept(ServerSocketChannelImpl.java:183)
[junit4:junit4]   2> 	at org.apache.zookeeper.server.NIOServerCnxn$Factory.run(NIOServerCnxn.java:242)
[junit4:junit4]   2> 
[junit4:junit4]   2> 4048 T461 oaz.ClientCnxn$SendThread.run Unable to read additional data from server sessionid 0x0, likely server has closed socket, closing socket connection and attempting reconnect
[junit4:junit4]   2> 5049 T457 oazs.NIOServerCnxn$Factory.run WARNING Ignoring unexpected runtime exception java.lang.NullPointerException
[junit4:junit4]   2> 	at org.apache.zookeeper.server.NIOServerCnxn$Factory.run(NIOServerCnxn.java:244)
[junit4:junit4]   2> 
[junit4:junit4]   2> 5504 T461 oaz.ClientCnxn$SendThread.startConnect Opening socket connection to server localhost/127.0.0.1:24656
[junit4:junit4]   2> 5505 T461 oaz.ClientCnxn$SendThread.primeConnection Socket connection established to localhost/127.0.0.1:24656, initiating session
[junit4:junit4]   2> 5505 T457 oazs.NIOServerCnxn$Factory.run WARNING Ignoring unexpected runtime exception java.security.AccessControlException: access denied (java.net.SocketPermission 140.211.11.196:24675 accept,resolve)
[junit4:junit4]   2> 	at java.security.AccessControlContext.checkPermission(AccessControlContext.java:393)
[junit4:junit4]   2> 	at java.security.AccessController.checkPermission(AccessController.java:553)
[junit4:junit4]   2> 	at java.lang.SecurityManager.checkPermission(SecurityManager.java:549)
[junit4:junit4]   2> 	at java.lang.SecurityManager.checkAccept(SecurityManager.java:1174)
[junit4:junit4]   2> 	at sun.nio.ch.ServerSocketChannelImpl.accept(ServerSocketChannelImpl.java:183)
[junit4:junit4]   2> 	at org.apache.zookeeper.server.NIOServerCnxn$Factory.run(NIOServerCnxn.java:242)
[junit4:junit4]   2> 
[junit4:junit4]   2> 5505 T461 oaz.ClientCnxn$SendThread.run Unable to read additional data from server sessionid 0x0, likely server has closed socket, closing socket connection and attempting reconnect
[junit4:junit4]   2> 6506 T457 oazs.NIOServerCnxn$Factory.run WARNING Ignoring unexpected runtime exception java.lang.NullPointerException
[junit4:junit4]   2> 	at org.apache.zookeeper.server.NIOServerCnxn$Factory.run(NIOServerCnxn.java:244)
[junit4:junit4]   2> 
[junit4:junit4]   2> 7081 T461 oaz.ClientCnxn$SendThread.startConnect Opening socket connection to server localhost/127.0.0.1:24656
[junit4:junit4]   2> 7082 T461 oaz.ClientCnxn$SendThread.primeConnection Socket connection established to localhost/127.0.0.1:24656, initiating session
[junit4:junit4]   2> 7082 T457 oazs.NIOServerCnxn$Factory.run WARNING Ignoring unexpected runtime exception java.security.AccessControlException: access denied (java.net.SocketPermission 140.211.11.196:24690 accept,resolve)
[junit4:junit4]   2> 	at java.security.AccessControlContext.checkPermission(AccessControlContext.java:393)
[junit4:junit4]   2> 	at java.security.AccessController.checkPermission(AccessController.java:553)
[junit4:junit4]   2> 	at java.lang.SecurityManager.checkPermission(SecurityManager.java:549)
[junit4:junit4]   2> 	at java.lang.SecurityManager.checkAccept(SecurityManager.java:1174)
[junit4:junit4]   2> 	at sun.nio.ch.ServerSocketChannelImpl.accept(ServerSocketChannelImpl.java:183)
[junit4:junit4]   2> 	at org.apache.zookeeper.server.NIOServerCnxn$Factory.run(NIOServerCnxn.java:242)
[junit4:junit4]   2> 
[junit4:junit4]   2> 7082 T461 oaz.ClientCnxn$SendThread.run Unable to read additional data from server sessionid 0x0, likely server has closed socket, closing socket connection and attempting reconnect
[junit4:junit4]   2> 8083 T457 oazs.NIOServerCnxn$Factory.run WARNING Ignoring unexpected runtime exception java.lang.NullPointerException
[junit4:junit4]   2> 	at org.apache.zookeeper.server.NIOServerCnxn$Factory.run(NIOServerCnxn.java:244)
[junit4:junit4]   2> 
[junit4:junit4]   2> 9084 T457 oazs.NIOServerCnxn$Factory.run WARNING Ignoring unexpected runtime exception java.lang.NullPointerException
[junit4:junit4]   2> 	at org.apache.zookeeper.server.NIOServerCnxn$Factory.run(NIOServerCnxn.java:244)
[junit4:junit4]   2> 
[junit4:junit4]   2> 9098 T461 oaz.ClientCnxn$SendThread.startConnect Opening socket connection to server localhost/127.0.0.1:24656
[junit4:junit4]   2> 9098 T461 oaz.ClientCnxn$SendThread.primeConnection Socket connection established to localhost/127.0.0.1:24656, initiating session
[junit4:junit4]   2> 9099 T457 oazs.NIOServerCnxn$Factory.run WARNING Ignoring unexpected runtime exception java.security.AccessControlException: access denied (java.net.SocketPermission 140.211.11.196:24691 accept,resolve)
[junit4:junit4]   2> 	at java.security.AccessControlContext.checkPermission(AccessControlContext.java:393)
[junit4:junit4]   2> 	at java.security.AccessController.checkPermission(AccessController.java:553)
[junit4:junit4]   2> 	at java.lang.SecurityManager.checkPermission(SecurityManager.java:549)
[junit4:junit4]   2> 	at java.lang.SecurityManager.checkAccept(SecurityManager.java:1174)
[junit4:junit4]   2> 	at sun.nio.ch.ServerSocketChannelImpl.accept(ServerSocketChannelImpl.java:183)
[junit4:junit4]   2> 	at org.apache.zookeeper.server.NIOServerCnxn$Factory.run(NIOServerCnxn.java:242)
[junit4:junit4]   2> 
[junit4:junit4]   2> 9099 T461 oaz.ClientCnxn$SendThread.run Unable to read additional data from server sessionid 0x0, likely server has closed socket, closing socket connection and attempting reconnect
[junit4:junit4]   2> 10100 T457 oazs.NIOServerCnxn$Factory.run WARNING Ignoring unexpected runtime exception java.lang.NullPointerException
[junit4:junit4]   2> 	at org.apache.zookeeper.server.NIOServerCnxn$Factory.run(NIOServerCnxn.java:244)
[junit4:junit4]   2> 
[junit4:junit4]   2> 10514 T461 oaz.ClientCnxn$SendThread.startConnect Opening socket connection to server localhost/127.0.0.1:24656
[junit4:junit4]   2> 10514 T461 oaz.ClientCnxn$SendThread.primeConnection Socket connection established to localhost/127.0.0.1:24656, initiating session
[junit4:junit4]   2> 10515 T457 oazs.NIOServerCnxn$Factory.run WARNING Ignoring unexpected runtime exception java.security.AccessControlException: access denied (java.net.SocketPermission 140.211.11.196:24692 accept,resolve)
[junit4:junit4]   2> 	at java.security.AccessControlContext.checkPermission(AccessControlContext.java:393)
[junit4:junit4]   2> 	at java.security.AccessController.checkPermission(AccessController.java:553)
[junit4:junit4]   2> 	at java.lang.SecurityManager.checkPermission(SecurityManager.java:549)
[junit4:junit4]   2> 	at java.lang.SecurityManager.checkAccept(SecurityManager.java:1174)
[junit4:junit4]   2> 	at sun.nio.ch.ServerSocketChannelImpl.accept(ServerSocketChannelImpl.java:183)
[junit4:junit4]   2> 	at org.apache.zookeeper.server.NIOServerCnxn$Factory.run(NIOServerCnxn.java:242)
[junit4:junit4]   2> 
[junit4:junit4]   2> 10515 T461 oaz.ClientCnxn$SendThread.run Unable to read additional data from server sessionid 0x0, likely server has closed socket, closing socket connection and attempting reconnect
[junit4:junit4]   2> 11516 T457 oazs.NIOServerCnxn$Factory.run WARNING Ignoring unexpected runtime exception java.lang.NullPointerException
[junit4:junit4]   2> 	at org.apache.zookeeper.server.NIOServerCnxn$Factory.run(NIOServerCnxn.java:244)
[junit4:junit4]   2> 
[junit4:junit4]   2> 11898 T461 oaz.ClientCnxn$SendThread.startConnect Opening socket connection to server localhost/127.0.0.1:24656
[junit4:junit4]   2> 11898 T461 oaz.ClientCnxn$SendThread.primeConnection Socket connection established to localhost/127.0.0.1:24656, initiating session
[junit4:junit4]   2> 11899 T457 oazs.NIOServerCnxn$Factory.run WARNING Ignoring unexpected runtime exception java.security.AccessControlException: access denied (java.net.SocketPermission 140.211.11.196:24696 accept,resolve)
[junit4:junit4]   2> 	at java.security.AccessControlContext.checkPermission(AccessControlContext.java:393)
[junit4:junit4]   2> 	at java.security.AccessController.checkPermission(AccessController.java:553)
[junit4:junit4]   2> 	at java.lang.SecurityManager.checkPermission(SecurityManager.java:549)
[junit4:junit4]   2> 	at java.lang.SecurityManager.checkAccept(SecurityManager.java:1174)
[junit4:junit4]   2> 	at sun.nio.ch.ServerSocketChannelImpl.accept(ServerSocketChannelImpl.java:183)
[junit4:junit4]   2> 	at org.apache.zookeeper.server.NIOServerCnxn$Factory.run(NIOServerCnxn.java:242)
[junit4:junit4]   2> 
[junit4:junit4]   2> 11899 T461 oaz.ClientCnxn$SendThread.run Unable to read additional data from server sessionid 0x0, likely server has closed socket, closing socket connection and attempting reconnect
[junit4:junit4]   2> 12900 T457 oazs.NIOServerCnxn$Factory.run WARNING Ignoring unexpected runtime exception java.lang.NullPointerException
[junit4:junit4]   2> 	at org.apache.zookeeper.server.NIOServerCnxn$Factory.run(NIOServerCnxn.java:244)
[junit4:junit4]   2> 
[junit4:junit4]   2> 13135 T461 oaz.ClientCnxn$SendThread.startConnect Opening socket connection to server localhost/127.0.0.1:24656
[junit4:junit4]   2> 13136 T461 oaz.ClientCnxn$SendThread.primeConnection Socket connection established to localhost/127.0.0.1:24656, initiating session
[junit4:junit4]   2> 13136 T457 oazs.NIOServerCnxn$Factory.run WARNING Ignoring unexpected runtime exception java.security.AccessControlException: access denied (java.net.SocketPermission 140.211.11.196:24699 accept,resolve)
[junit4:junit4]   2> 	at java.security.AccessControlContext.checkPermission(AccessControlContext.java:393)
[junit4:junit4]   2> 	at java.security.AccessController.checkPermission(AccessController.java:553)
[junit4:junit4]   2> 	at java.lang.SecurityManager.checkPermission(SecurityManager.java:549)
[junit4:junit4]   2> 	at java.lang.SecurityManager.checkAccept(SecurityManager.java:1174)
[junit4:junit4]   2> 	at sun.nio.ch.ServerSocketChannelImpl.accept(ServerSocketChannelImpl.java:183)
[junit4:junit4]   2> 	at org.apache.zookeeper.server.NIOServerCnxn$Factory.run(NIOServerCnxn.java:242)
[junit4:junit4]   2> 
[junit4:junit4]   2> 13136 T461 oaz.ClientCnxn$SendThread.run Unable to read additional data from server sessionid 0x0, likely server has closed socket, closing socket connection and attempting reconnect
[junit4:junit4]   2> 14137 T457 oazs.NIOServerCnxn$Factory.run WARNING Ignoring unexpected runtime exception java.lang.NullPointerException
[junit4:junit4]   2> 	at org.apache.zookeeper.server.NIOServerCnxn$Factory.run(NIOServerCnxn.java:244)
[junit4:junit4]   2> 
[junit4:junit4]   2> 15138 T457 oazs.NIOServerCnxn$Factory.run WARNING Ignoring unexpected runtime exception java.lang.NullPointerException
[junit4:junit4]   2> 	at org.apache.zookeeper.server.NIOServerCnxn$Factory.run(NIOServerCnxn.java:244)
[junit4:junit4]   2> 
[junit4:junit4]   2> 15174 T461 oaz.ClientCnxn$SendThread.startConnect Opening socket connection to server localhost/127.0.0.1:24656
[junit4:junit4]   2> 15174 T461 oaz.ClientCnxn$SendThread.primeConnection Socket connection established to localhost/127.0.0.1:24656, initiating session
[junit4:junit4]   2> 15175 T457 oazs.NIOServerCnxn$Factory.run WARNING Ignoring unexpected runtime exception java.security.AccessControlException: access denied (java.net.SocketPermission 140.211.11.196:24708 accept,resolve)
[junit4:junit4]   2> 	at java.security.AccessControlContext.checkPermission(AccessControlContext.java:393)
[junit4:junit4]   2> 	at java.security.AccessController.checkPermission(AccessController.java:553)
[junit4:junit4]   2> 	at java.lang.SecurityManager.checkPermission(SecurityManager.java:549)
[junit4:junit4]   2> 	at java.lang.SecurityManager.checkAccept(SecurityManager.java:1174)
[junit4:junit4]   2> 	at sun.nio.ch.ServerSocketChannelImpl.accept(ServerSocketChannelImpl.java:183)
[junit4:junit4]   2> 	at org.apache.zookeeper.server.NIOServerCnxn$Factory.run(NIOServerCnxn.java:242)
[junit4:junit4]   2> 
[junit4:junit4]   2> 15175 T461 oaz.ClientCnxn$SendThread.run Unable to read additional data from server sessionid 0x0, likely server has closed socket, closing socket connection and attempting reconnect
[junit4:junit4]   2> 16176 T457 oazs.NIOServerCnxn$Factory.run WARNING Ignoring unexpected runtime exception java.lang.NullPointerException
[junit4:junit4]   2> 	at org.apache.zookeeper.server.NIOServerCnxn$Factory.run(NIOServerCnxn.java:244)
[junit4:junit4]   2> 
[junit4:junit4]   2> 16722 T461 oaz.ClientCnxn$SendThread.startConnect Opening socket connection to server localhost/127.0.0.1:24656
[junit4:junit4]   2> 16723 T461 oaz.ClientCnxn$SendThread.primeConnection Socket connection established to localhost/127.0.0.1:24656, initiating session
[junit4:junit4]   2> 16723 T457 oazs.NIOServerCnxn$Factory.run WARNING Ignoring unexpected runtime exception java.security.AccessControlException: access denied (java.net.SocketPermission 140.211.11.196:24713 accept,resolve)
[junit4:junit4]   2> 	at java.security.AccessControlContext.checkPermission(AccessControlContext.java:393)
[junit4:junit4]   2> 	at java.security.AccessController.checkPermission(AccessController.java:553)
[junit4:junit4]   2> 	at java.lang.SecurityManager.checkPermission(SecurityManager.java:549)
[junit4:junit4]   2> 	at java.lang.SecurityManager.checkAccept(SecurityManager.java:1174)
[junit4:junit4]   2> 	at sun.nio.ch.ServerSocketChannelImpl.accept(ServerSocketChannelImpl.java:183)
[junit4:junit4]   2> 	at org.apache.zookeeper.server.NIOServerCnxn$Factory.run(NIOServerCnxn.java:242)
[junit4:junit4]   2> 
[junit4:junit4]   2> 16723 T461 oaz.ClientCnxn$SendThread.run Unable to read additional data from server sessionid 0x0, likely server has closed socket, closing socket connection and attempting reconnect
[junit4:junit4]   2> 17725 T457 oazs.NIOServerCnxn$Factory.run WARNING Ignoring unexpected runtime exception java.lang.NullPointerException
[junit4:junit4]   2> 	at org.apache.zookeeper.server.NIOServerCnxn$Factory.run(NIOServerCnxn.java:244)
[junit4:junit4]   2> 
[junit4:junit4]   2> 18618 T461 oaz.ClientCnxn$SendThread.startConnect Opening socket connection to server localhost/127.0.0.1:24656
[junit4:junit4]   2> 18618 T461 oaz.ClientCnxn$SendThread.primeConnection Socket connection established to localhost/127.0.0.1:24656, initiating session
[junit4:junit4]   2> 18619 T457 oazs.NIOServerCnxn$Factory.run WARNING Ignoring unexpected runtime exception java.security.AccessControlException: access denied (java.net.SocketPermission 140.211.11.196:24721 accept,resolve)
[junit4:junit4]   2> 	at java.security.AccessControlContext.checkPermission(AccessControlContext.java:393)
[junit4:junit4]   2> 	at java.security.AccessController.checkPermission(AccessController.java:553)
[junit4:junit4]   2> 	at java.lang.SecurityManager.checkPermission(SecurityManager.java:549)
[junit4:junit4]   2> 	at java.lang.SecurityManager.checkAccept(SecurityManager.java:1174)
[junit4:junit4]   2> 	at sun.nio.ch.ServerSocketChannelImpl.accept(ServerSocketChannelImpl.java:183)
[junit4:junit4]   2> 	at org.apache.zookeeper.server.NIOServerCnxn$Factory.run(NIOServerCnxn.java:242)
[junit4:junit4]   2> 
[junit4:junit4]   2> 18619 T461 oaz.ClientCnxn$SendThread.run Unable to read additional data from server sessionid 0x0, likely server has closed socket, closing socket connection and attempting reconnect
[junit4:junit4]   2> 19620 T457 oazs.NIOServerCnxn$Factory.run WARNING Ignoring unexpected runtime exception java.lang.NullPointerException
[junit4:junit4]   2> 	at org.apache.zookeeper.server.NIOServerCnxn$Factory.run(NIOServerCnxn.java:244)
[junit4:junit4]   2> 
[junit4:junit4]   2> 20621 T457 oazs.NIOServerCnxn$Factory.run WARNING Ignoring unexpected runtime exception java.lang.NullPointerException
[junit4:junit4]   2> 	at org.apache.zookeeper.server.NIOServerCnxn$Factory.run(NIOServerCnxn.java:244)
[junit4:junit4]   2> 
[junit4:junit4]   2> 20671 T461 oaz.ClientCnxn$SendThread.startConnect Opening socket connection to server localhost/127.0.0.1:24656
[junit4:junit4]   2> 20671 T461 oaz.ClientCnxn$SendThread.primeConnection Socket connection established to localhost/127.0.0.1:24656, initiating session
[junit4:junit4]   2> 20672 T457 oazs.NIOServerCnxn$Factory.run WARNING Ignoring unexpected runtime exception java.security.AccessControlException: access denied (java.net.SocketPermission 140.211.11.196:24732 accept,resolve)
[junit4:junit4]   2> 	at java.security.AccessControlContext.checkPermission(AccessControlContext.java:393)
[junit4:junit4]   2> 	at java.security.AccessController.checkPermission(AccessController.java:553)
[junit4:junit4]   2> 	at java.lang.SecurityManager.checkPermission(SecurityManager.java:549)
[junit4:junit4]   2> 	at java.lang.SecurityManager.checkAccept(SecurityManager.java:1174)
[junit4:junit4]   2> 	at sun.nio.ch.ServerSocketChannelImpl.accept(ServerSocketChannelImpl.java:183)
[junit4:junit4]   2> 	at org.apache.zookeeper.server.NIOServerCnxn$Factory.run(NIOServerCnxn.java:242)
[junit4:junit4]   2> 
[junit4:junit4]   2> 20672 T461 oaz.ClientCnxn$SendThread.run Unable to read additional data from server sessionid 0x0, likely server has closed socket, closing socket connection and attempting reconnect
[junit4:junit4]   2> 21673 T457 oazs.NIOServerCnxn$Factory.run WARNING Ignoring unexpected runtime exception java.lang.NullPointerException
[junit4:junit4]   2> 	at org.apache.zookeeper.server.NIOServerCnxn$Factory.run(NIOServerCnxn.java:244)
[junit4:junit4]   2> 
[junit4:junit4]   2> 21879 T461 oaz.ClientCnxn$SendThread.startConnect Opening socket connection to server localhost/127.0.0.1:24656
[junit4:junit4]   2> 21879 T461 oaz.ClientCnxn$SendThread.primeConnection Socket connection established to localhost/127.0.0.1:24656, initiating session
[junit4:junit4]   2> 21880 T457 oazs.NIOServerCnxn$Factory.run WARNING Ignoring unexpected runtime exception java.security.AccessControlException: access denied (java.net.SocketPermission 140.211.11.196:24742 accept,resolve)
[junit4:junit4]   2> 	at java.security.AccessControlContext.checkPermission(AccessControlContext.java:393)
[junit4:junit4]   2> 	at java.security.AccessController.checkPermission(AccessController.java:553)
[junit4:junit4]   2> 	at java.lang.SecurityManager.checkPermission(SecurityManager.java:549)
[junit4:junit4]   2> 	at java.lang.SecurityManager.checkAccept(SecurityManager.java:1174)
[junit4:junit4]   2> 	at sun.nio.ch.ServerSocketChannelImpl.accept(ServerSocketChannelImpl.java:183)
[junit4:junit4]   2> 	at org.apache.zookeeper.server.NIOServerCnxn$Factory.run(NIOServerCnxn.java:242)
[junit4:junit4]   2> 
[junit4:junit4]   2> 21880 T461 oaz.ClientCnxn$SendThread.run Unable to read additional data from server sessionid 0x0, likely server has closed socket, closing socket connection and attempting reconnect
[junit4:junit4]   2> 22881 T457 oazs.NIOServerCnxn$Factory.run WARNING Ignoring unexpected runtime exception java.lang.NullPointerException
[junit4:junit4]   2> 	at org.apache.zookeeper.server.NIOServerCnxn$Factory.run(NIOServerCnxn.java:244)
[junit4:junit4]   2> 
[junit4:junit4]   2> 23882 T457 oazs.NIOServerCnxn$Factory.run WARNING Ignoring unexpected runtime exception java.lang.NullPointerException
[junit4:junit4]   2> 	at org.apache.zookeeper.server.NIOServerCnxn$Factory.run(NIOServerCnxn.java:244)
[junit4:junit4]   2> 
[junit4:junit4]   2> 23963 T461 oaz.ClientCnxn$SendThread.startConnect Opening socket connection to server localhost/127.0.0.1:24656
[junit4:junit4]   2> 23963 T461 oaz.ClientCnxn$SendThread.primeConnection Socket connection established to localhost/127.0.0.1:24656, initiating session
[junit4:junit4]   2> 23964 T457 oazs.NIOServerCnxn$Factory.run WARNING Ignoring unexpected runtime exception java.security.AccessControlException: access denied (java.net.SocketPermission 140.211.11.196:24746 accept,resolve)
[junit4:junit4]   2> 	at java.security.AccessControlContext.checkPermission(AccessControlContext.java:393)
[junit4:junit4]   2> 	at java.security.AccessController.checkPermission(AccessController.java:553)
[junit4:junit4]   2> 	at java.lang.SecurityManager.checkPermission(SecurityManager.java:549)
[junit4:junit4]   2> 	at java.lang.SecurityManager.checkAccept(SecurityManager.java:1174)
[junit4:junit4]   2> 	at sun.nio.ch.ServerSocketChannelImpl.accept(ServerSocketChannelImpl.java:183)
[junit4:junit4]   2> 	at org.apache.zookeeper.server.NIOServerCnxn$Factory.run(NIOServerCnxn.java:242)
[junit4:junit4]   2> 
[junit4:junit4]   2> 23964 T461 oaz.ClientCnxn$SendThread.run WARNING Session 0x0 for server localhost/127.0.0.1:24656, unexpected error, closing socket connection and attempting reconnect java.io.IOException: Connection reset by peer
[junit4:junit4]   2> 	at sun.nio.ch.FileDispatcher.read0(Native Method)
[junit4:junit4]   2> 	at sun.nio.ch.SocketDispatcher.read(SocketDispatcher.java:39)
[junit4:junit4]   2> 	at sun.nio.ch.IOUtil.readIntoNativeBuffer(IOUtil.java:251)
[junit4:junit4]   2> 	at sun.nio.ch.IOUtil.read(IOUtil.java:218)
[junit4:junit4]   2> 	at sun.nio.ch.SocketChannelImpl.read(SocketChannelImpl.java:254)
[junit4:junit4]   2> 	at org.apache.zookeeper.ClientCnxn$SendThread.doIO(ClientCnxn.java:856)
[junit4:junit4]   2> 	at org.apache.zookeeper.ClientCnxn$SendThread.run(ClientCnxn.java:1154)
[junit4:junit4]   2> 
[junit4:junit4]   2> 24965 T457 oazs.NIOServerCnxn$Factory.run WARNING Ignoring unexpected runtime exception java.lang.NullPointerException
[junit4:junit4]   2> 	at org.apache.zookeeper.server.NIOServerCnxn$Factory.run(NIOServerCnxn.java:244)
[junit4:junit4]   2> 
[junit4:junit4]   2> 25154 T461 oaz.ClientCnxn$SendThread.startConnect Opening socket connection to server localhost/127.0.0.1:24656
[junit4:junit4]   2> 25154 T461 oaz.ClientCnxn$SendThread.primeConnection Socket connection established to localhost/127.0.0.1:24656, initiating session
[junit4:junit4]   2> 25155 T457 oazs.NIOServerCnxn$Factory.run WARNING Ignoring unexpected runtime exception java.security.AccessControlException: access denied (java.net.SocketPermission 140.211.11.196:24754 accept,resolve)
[junit4:junit4]   2> 	at java.security.AccessControlContext.checkPermission(AccessControlContext.java:393)
[junit4:junit4]   2> 	at java.security.AccessController.checkPermission(AccessController.java:553)
[junit4:junit4]   2> 	at java.lang.SecurityManager.checkPermission(SecurityManager.java:549)
[junit4:junit4]   2> 	at java.lang.SecurityManager.checkAccept(SecurityManager.java:1174)
[junit4:junit4]   2> 	at sun.nio.ch.ServerSocketChannelImpl.accept(ServerSocketChannelImpl.java:183)
[junit4:junit4]   2> 	at org.apache.zookeeper.server.NIOServerCnxn$Factory.run(NIOServerCnxn.java:242)
[junit4:junit4]   2> 
[junit4:junit4]   2> 25155 T461 oaz.ClientCnxn$SendThread.run Unable to read additional data from server sessionid 0x0, likely server has closed socket, closing socket connection and attempting reconnect
[junit4:junit4]   2> 26156 T457 oazs.NIOServerCnxn$Factory.run WARNING Ignoring unexpected runtime exception java.lang.NullPointerException
[junit4:junit4]   2> 	at org.apache.zookeeper.server.NIOServerCnxn$Factory.run(NIOServerCnxn.java:244)
[junit4:junit4]   2> 
[junit4:junit4]   2> 26594 T461 oaz.ClientCnxn$SendThread.startConnect Opening socket connection to server localhost/127.0.0.1:24656
[junit4:junit4]   2> 26594 T461 oaz.ClientCnxn$SendThread.primeConnection Socket connection established to localhost/127.0.0.1:24656, initiating session
[junit4:junit4]   2> 26595 T457 oazs.NIOServerCnxn$Factory.run WARNING Ignoring unexpected runtime exception java.security.AccessControlException: access denied (java.net.SocketPermission 140.211.11.196:24755 accept,resolve)
[junit4:junit4]   2> 	at java.security.AccessControlContext.checkPermission(AccessControlContext.java:393)
[junit4:junit4]   2> 	at java.security.AccessController.checkPermission(AccessController.java:553)
[junit4:junit4]   2> 	at java.lang.SecurityManager.checkPermission(SecurityManager.java:549)
[junit4:junit4]   2> 	at java.lang.SecurityManager.checkAccept(SecurityManager.java:1174)
[junit4:junit4]   2> 	at sun.nio.ch.ServerSocketChannelImpl.accept(ServerSocketChannelImpl.java:183)
[junit4:junit4]   2> 	at org.apache.zookeeper.server.NIOServerCnxn$Factory.run(NIOServerCnxn.java:242)
[junit4:junit4]   2> 
[junit4:junit4]   2> 26595 T461 oaz.ClientCnxn$SendThread.run Unable to read additional data from server sessionid 0x0, likely server has closed socket, closing socket connection and attempting reconnect
[junit4:junit4]   2> 27596 T457 oazs.NIOServerCnxn$Factory.run WARNING Ignoring unexpected runtime exception java.lang.NullPointerException
[junit4:junit4]   2> 	at org.apache.zookeeper.server.NIOServerCnxn$Factory.run(NIOServerCnxn.java:244)
[junit4:junit4]   2> 
[junit4:junit4]   2> 28124 T461 oaz.ClientCnxn$SendThread.startConnect Opening socket connection to server localhost/127.0.0.1:24656
[junit4:junit4]   2> 28124 T461 oaz.ClientCnxn$SendThread.primeConnection Socket connection established to localhost/127.0.0.1:24656, initiating session
[junit4:junit4]   2> 28125 T457 oazs.NIOServerCnxn$Factory.run WARNING Ignoring unexpected runtime exception java.security.AccessControlException: access denied (java.net.SocketPermission 140.211.11.196:24756 accept,resolve)
[junit4:junit4]   2> 	at java.security.AccessControlContext.checkPermission(AccessControlContext.java:393)
[junit4:junit4]   2> 	at java.security.AccessController.checkPermission(AccessController.java:553)
[junit4:junit4]   2> 	at java.lang.SecurityManager.checkPermission(SecurityManager.java:549)
[junit4:junit4]   2> 	at java.lang.SecurityManager.checkAccept(SecurityManager.java:1174)
[junit4:junit4]   2> 	at sun.nio.ch.ServerSocketChannelImpl.accept(ServerSocketChannelImpl.java:183)
[junit4:junit4]   2> 	at org.apache.zookeeper.server.NIOServerCnxn$Factory.run(NIOServerCnxn.java:242)
[junit4:junit4]   2> 
[junit4:junit4]   2> 28125 T461 oaz.ClientCnxn$SendThread.run Unable to read additional data from server sessionid 0x0, likely server has closed socket, closing socket connection and attempting reconnect
[junit4:junit4]   2> 29126 T457 oazs.NIOServerCnxn$Factory.run WARNING Ignoring unexpected runtime exception java.lang.NullPointerException
[junit4:junit4]   2> 	at org.apache.zookeeper.server.NIOServerCnxn$Factory.run(NIOServerCnxn.java:244)
[junit4:junit4]   2> 
[junit4:junit4]   2> 29643 T461 oaz.ClientCnxn$SendThread.startConnect Opening socket connection to server localhost/127.0.0.1:24656
[junit4:junit4]   2> 29643 T461 oaz.ClientCnxn$SendThread.primeConnection Socket connection established to localhost/127.0.0.1:24656, initiating session
[junit4:junit4]   2> 29644 T457 oazs.NIOServerCnxn$Factory.run WARNING Ignoring unexpected runtime exception java.security.AccessControlException: access denied (java.net.SocketPermission 140.211.11.196:24758 accept,resolve)
[junit4:junit4]   2> 	at java.security.AccessControlContext.checkPermission(AccessControlContext.java:393)
[junit4:junit4]   2> 	at java.security.AccessController.checkPermission(AccessController.java:553)
[junit4:junit4]   2> 	at java.lang.SecurityManager.checkPermission(SecurityManager.java:549)
[junit4:junit4]   2> 	at java.lang.SecurityManager.checkAccept(SecurityManager.java:1174)
[junit4:junit4]   2> 	at sun.nio.ch.ServerSocketChannelImpl.accept(ServerSocketChannelImpl.java:183)
[junit4:junit4]   2> 	at org.apache.zookeeper.server.NIOServerCnxn$Factory.run(NIOServerCnxn.java:242)
[junit4:junit4]   2> 
[junit4:junit4]   2> 29644 T461 oaz.ClientCnxn$SendThread.run Unable to read additional data from server sessionid 0x0, likely server has closed socket, closing socket connection and attempting reconnect
[junit4:junit4]   2> 30417 T459 oazs.SyncRequestProcessor.run SyncRequestProcessor exited!
[junit4:junit4]   2> 30417 T460 oazs.PrepRequestProcessor.run PrepRequestProcessor exited loop!
[junit4:junit4]   2> 30417 T455 oazs.FinalRequestProcessor.shutdown shutdown of request processor complete
[junit4:junit4]   2> 30646 T457 oazs.NIOServerCnxn$Factory.run WARNING Ignoring unexpected runtime exception java.lang.NullPointerException
[junit4:junit4]   2> 	at org.apache.zookeeper.server.NIOServerCnxn$Factory.run(NIOServerCnxn.java:244)
[junit4:junit4]   2> 
[junit4:junit4]   2> 30652 T457 oazs.NIOServerCnxn$Factory.run NIOServerCnxn factory exited run method
[junit4:junit4]   2> 30652 T455 oazs.FinalRequestProcessor.shutdown shutdown of request processor complete
[junit4:junit4]   2> NOTE: download the large Jenkins line-docs file by running 'ant get-jenkins-line-docs' in the lucene directory.
[junit4:junit4]   2> NOTE: reproduce with: ant test  -Dtestcase=BasicDistributedZkTest -Dtests.method=testDistribSearch -Dtests.seed=E5FA13A11BAAB45 -Dtests.multiplier=3 -Dtests.nightly=true -Dtests.slow=true -Dtests.linedocsfile=/home/hudson/lucene-data/enwiki.random.lines.txt -Dtests.locale=ar_EG -Dtests.timezone=Canada/Central -Dtests.file.encoding=ISO8859-1
[junit4:junit4] ERROR   30.7s J0 | BasicDistributedZkTest.testDistribSearch <<<
[junit4:junit4]    > Throwable #1: java.lang.RuntimeException
[junit4:junit4]    > 	at org.apache.solr.common.cloud.SolrZkClient.<init>(SolrZkClient.java:156)
[junit4:junit4]    > 	at org.apache.solr.common.cloud.SolrZkClient.<init>(SolrZkClient.java:104)
[junit4:junit4]    > 	at org.apache.solr.common.cloud.SolrZkClient.<init>(SolrZkClient.java:86)
[junit4:junit4]    > 	at org.apache.solr.cloud.AbstractZkTestCase.buildZooKeeper(AbstractZkTestCase.java:90)
[junit4:junit4]    > 	at org.apache.solr.cloud.AbstractZkTestCase.buildZooKeeper(AbstractZkTestCase.java:84)
[junit4:junit4]    > 	at org.apache.solr.cloud.AbstractDistribZkTestBase.setUp(AbstractDistribZkTestBase.java:68)
[junit4:junit4]    > 	at sun.reflect.NativeMethodAccessorImpl.invoke0(Native Method)
[junit4:junit4]    > 	at sun.reflect.NativeMethodAccessorImpl.invoke(NativeMethodAccessorImpl.java:57)
[junit4:junit4]    > 	at sun.reflect.DelegatingMethodAccessorImpl.invoke(DelegatingMethodAccessorImpl.java:43)
[junit4:junit4]    > 	at java.lang.reflect.Method.invoke(Method.java:616)
[junit4:junit4]    > 	at com.carrotsearch.randomizedtesting.RandomizedRunner.invoke(RandomizedRunner.java:1559)
[junit4:junit4]    > 	at com.carrotsearch.randomizedtesting.RandomizedRunner.access$600(RandomizedRunner.java:79)
[junit4:junit4]    > 	at com.carrotsearch.randomizedtesting.RandomizedRunner$7.evaluate(RandomizedRunner.java:771)
[junit4:junit4]    > 	at com.carrotsearch.randomizedtesting.RandomizedRunner$8.evaluate(RandomizedRunner.java:787)
[junit4:junit4]    > 	at com.carrotsearch.randomizedtesting.rules.SystemPropertiesRestoreRule$1.evaluate(SystemPropertiesRestoreRule.java:53)
[junit4:junit4]    > 	at org.apache.lucene.util.TestRuleSetupTeardownChained$1.evaluate(TestRuleSetupTeardownChained.java:50)
[junit4:junit4]    > 	at org.apache.lucene.util.TestRuleFieldCacheSanity$1.evaluate(TestRuleFieldCacheSanity.java:51)
[junit4:junit4]    > 	at org.apache.lucene.util.AbstractBeforeAfterRule$1.evaluate(AbstractBeforeAfterRule.java:45)
[junit4:junit4]    > 	at com.carrotsearch.randomizedtesting.rules.SystemPropertiesInvariantRule$1.evaluate(SystemPropertiesInvariantRule.java:55)
[junit4:junit4]    > 	at org.apache.lucene.util.TestRuleThreadAndTestName$1.evaluate(TestRuleThreadAndTestName.java:48)
[junit4:junit4]    > 	at org.apache.lucene.util.TestRuleIgnoreAfterMaxFailures$1.evaluate(TestRuleIgnoreAfterMaxFailures.java:70)
[junit4:junit4]    > 	at org.apache.lucene.util.TestRuleMarkFailure$1.evaluate(TestRuleMarkFailure.java:48)
[junit4:junit4]    > 	at com.carrotsearch.randomizedtesting.rules.StatementAdapter.evaluate(StatementAdapter.java:36)
[junit4:junit4]    > 	at com.carrotsearch.randomizedtesting.ThreadLeakControl$StatementRunner.run(ThreadLeakControl.java:345)
[junit4:junit4]    > 	at com.carrotsearch.randomizedtesting.ThreadLeakControl.forkTimeoutingTask(ThreadLeakControl.java:769)
[junit4:junit4]    > 	at com.carrotsearch.randomizedtesting.ThreadLeakControl$3.evaluate(ThreadLeakControl.java:429)
[junit4:junit4]    > 	at com.carrotsearch.randomizedtesting.RandomizedRunner.runSingleTest(RandomizedRunner.java:746)
[junit4:junit4]    > 	at com.carrotsearch.randomizedtesting.RandomizedRunner$3.evaluate(RandomizedRunner.java:648)
[junit4:junit4]    > 	at com.carrotsearch.randomizedtesting.RandomizedRunner$4.evaluate(RandomizedRunner.java:682)
[junit4:junit4]    > 	at com.carrotsearch.randomizedtesting.RandomizedRunner$5.evaluate(RandomizedRunner.java:693)
[junit4:junit4]    > 	at com.carrotsearch.randomizedtesting.rules.StatementAdapter.evaluate(StatementAdapter.java:36)
[junit4:junit4]    > 	at com.carrotsearch.randomizedtesting.rules.SystemPropertiesRestoreRule$1.evaluate(SystemPropertiesRestoreRule.java:53)
[junit4:junit4]    > 	at org.apache.lucene.util.AbstractBeforeAfterRule$1.evaluate(AbstractBeforeAfterRule.java:45)
[junit4:junit4]    > 	at org.apache.lucene.util.TestRuleStoreClassName$1.evaluate(TestRuleStoreClassName.java:42)
[junit4:junit4]    > 	at com.carrotsearch.randomizedtesting.rules.SystemPropertiesInvariantRule$1.evaluate(SystemPropertiesInvariantRule.java:55)
[junit4:junit4]    > 	at com.carrotsearch.randomizedtesting.rules.NoShadowingOrOverridesOnMethodsRule$1.evaluate(NoShadowingOrOverridesOnMethodsRule.java:39)
[junit4:junit4]    > 	at com.carrotsearch.randomizedtesting.rules.NoShadowingOrOverridesOnMethodsRule$1.evaluate(NoShadowingOrOverridesOnMethodsRule.java:39)
[junit4:junit4]    > 	at org.apache.lucene.util.TestRuleAssertionsRequired$1.evaluate(TestRuleAssertionsRequired.java:40)
[junit4:junit4]    > 	at org.apache.lucene.util.TestRuleMarkFailure$1.evaluate(TestRuleMarkFailure.java:48)
[junit4:junit4]    > 	at org.apache.lucene.util.TestRuleIgnoreAfterMaxFailures$1.evaluate(TestRuleIgnoreAfterMaxFailures.java:70)
[junit4:junit4]    > 	at org.apache.lucene.util.TestRuleIgnoreTestSuites$1.evaluate(TestRuleIgnoreTestSuites.java:55)
[junit4:junit4]    > 	at com.carrotsearch.randomizedtesting.rules.StatementAdapter.evaluate(StatementAdapter.java:36)
[junit4:junit4]    > 	at com.carrotsearch.randomizedtesting.ThreadLeakControl$StatementRunner.run(ThreadLeakControl.java:345)
[junit4:junit4]    > 	at java.lang.Thread.run(Thread.java:679)
[junit4:junit4]    > Throwable #2: java.lang.NullPointerException
[junit4:junit4]    > 	at org.apache.solr.BaseDistributedSearchTestCase.destroyServers(BaseDistributedSearchTestCase.java:241)
[junit4:junit4]    > 	at org.apache.solr.BaseDistributedSearchTestCase.tearDown(BaseDistributedSearchTestCase.java:182)
[junit4:junit4]    > 	at org.apache.solr.cloud.AbstractDistribZkTestBase.tearDown(AbstractDistribZkTestBase.java:205)
[junit4:junit4]    > 	at org.apache.solr.cloud.BasicDistributedZkTest.tearDown(BasicDistributedZkTest.java:1041)
[junit4:junit4]    > 	at sun.reflect.NativeMethodAccessorImpl.invoke0(Native Method)
[junit4:junit4]    > 	at sun.reflect.NativeMethodAccessorImpl.invoke(NativeMethodAccessorImpl.java:57)
[junit4:junit4]    > 	at sun.reflect.DelegatingMethodAccessorImpl.invoke(DelegatingMethodAccessorImpl.java:43)
[junit4:junit4]    > 	at java.lang.reflect.Method.invoke(Method.java:616)
[junit4:junit4]    > 	at com.carrotsearch.randomizedtesting.RandomizedRunner.invoke(RandomizedRunner.java:1559)
[junit4:junit4]    > 	at com.carrotsearch.randomizedtesting.RandomizedRunner.access$600(RandomizedRunner.java:79)
[junit4:junit4]    > 	at com.carrotsearch.randomizedtesting.RandomizedRunner$8.evaluate(RandomizedRunner.java:795)
[junit4:junit4]    > 	at com.carrotsearch.randomizedtesting.rules.SystemPropertiesRestoreRule$1.evaluate(SystemPropertiesRestoreRule.java:53)
[junit4:junit4]    > 	at org.apache.lucene.util.TestRuleSetupTeardownChained$1.evaluate(TestRuleSetupTeardownChained.java:50)
[junit4:junit4]    > 	at org.apache.lucene.util.TestRuleFieldCacheSanity$1.evaluate(TestRuleFieldCacheSanity.java:51)
[junit4:junit4]    > 	at org.apache.lucene.util.AbstractBeforeAfterRule$1.evaluate(AbstractBeforeAfterRule.java:45)
[junit4:junit4]    > 	at com.carrotsearch.randomizedtesting.rules.SystemPropertiesInvariantRule$1.evaluate(SystemPropertiesInvariantRule.java:55)
[junit4:junit4]    > 	at org.apache.lucene.util.TestRuleThreadAndTestName$1.evaluate(TestRuleThreadAndTestName.java:48)
[junit4:junit4]    > 	at org.apache.lucene.util.TestRuleIgnoreAfterMaxFailures$1.evaluate(TestRuleIgnoreAfterMaxFailures.java:70)
[junit4:junit4]    > 	at org.apache.lucene.util.TestRuleMarkFailure$1.evaluate(TestRuleMarkFailure.java:48)
[junit4:junit4]    > 	at com.carrotsearch.randomizedtesting.rules.StatementAdapter.evaluate(StatementAdapter.java:36)
[junit4:junit4]    > 	at com.carrotsearch.randomizedtesting.ThreadLeakControl$StatementRunner.run(ThreadLeakControl.java:345)
[junit4:junit4]    > 	at com.carrotsearch.randomizedtesting.ThreadLeakControl.forkTimeoutingTask(ThreadLeakControl.java:769)
[junit4:junit4]    > 	at com.carrotsearch.randomizedtesting.ThreadLeakControl$3.evaluate(ThreadLeakControl.java:429)
[junit4:junit4]    > 	at com.carrotsearch.randomizedtesting.RandomizedRunner.runSingleTest(RandomizedRunner.java:746)
[junit4:junit4]    > 	at com.carrotsearch.randomizedtesting.RandomizedRunner$3.evaluate(RandomizedRunner.java:648)
[junit4:junit4]    > 	at com.carrotsearch.randomizedtesting.RandomizedRunner$4.evaluate(RandomizedRunner.java:682)
[junit4:junit4]    > 	at com.carrotsearch.randomizedtesting.RandomizedRunner$5.evaluate(RandomizedRunner.java:693)
[junit4:junit4]    > 	at com.carrotsearch.randomizedtesting.rules.StatementAdapter.evaluate(StatementAdapter.java:36)
[junit4:junit4]    > 	at com.carrotsearch.randomizedtesting.rules.SystemPropertiesRestoreRule$1.evaluate(SystemPropertiesRestoreRule.java:53)
[junit4:junit4]    > 	at org.apache.lucene.util.AbstractBeforeAfterRule$1.evaluate(AbstractBeforeAfterRule.java:45)
[junit4:junit4]    > 	at org.apache.lucene.util.TestRuleStoreClassName$1.evaluate(TestRuleStoreClassName.java:42)
[junit4:junit4]    > 	at com.carrotsearch.randomizedtesting.rules.SystemPropertiesInvariantRule$1.evaluate(SystemPropertiesInvariantRule.java:55)
[junit4:junit4]    > 	at com.carrotsearch.randomizedtesting.rules.NoShadowingOrOverridesOnMethodsRule$1.evaluate(NoShadowingOrOverridesOnMethodsRule.java:39)
[junit4:junit4]    > 	at com.carrotsearch.randomizedtesting.rules.NoShadowingOrOverridesOnMethodsRule$1.evaluate(NoShadowingOrOverridesOnMethodsRule.java:39)
[junit4:junit4]    > 	at org.apache.lucene.util.TestRuleAssertionsRequired$1.evaluate(TestRuleAssertionsRequired.java:40)
[junit4:junit4]    > 	at org.apache.lucene.util.TestRuleMarkFailure$1.evaluate(TestRuleMarkFailure.java:48)
[junit4:junit4]    > 	at org.apache.lucene.util.TestRuleIgnoreAfterMaxFailures$1.evaluate(TestRuleIgnoreAfterMaxFailures.java:70)
[junit4:junit4]    > 	at org.apache.lucene.util.TestRuleIgnoreTestSuites$1.evaluate(TestRuleIgnoreTestSuites.java:55)
[junit4:junit4]    > 	at com.carrotsearch.randomizedtesting.rules.StatementAdapter.evaluate(StatementAdapter.java:36)
[junit4:junit4]    > 	at com.carrotsearch.randomizedtesting.ThreadLeakControl$StatementRunner.run(ThreadLeakControl.java:345)
[junit4:junit4]    > 	at java.lang.Thread.run(Thread.java:679)
[junit4:junit4]   2> 30679 T455 oas.SolrTestCaseJ4.deleteCore ###deleteCore
[junit4:junit4]   2> 30685 T454 ccr.ThreadLeakControl.checkThreadLeaks WARNING Will linger awaiting termination of 3 leaked thread(s).
[junit4:junit4]   2> 31116 T458 oazs.SessionTrackerImpl.run SessionTrackerImpl exited loop!
[junit4:junit4]   2> 31462 T461 oaz.ClientCnxn$SendThread.startConnect Opening socket connection to server localhost/127.0.0.1:24656
[junit4:junit4]   2> 39747 T461 oaz.ClientCnxn$SendThread.run Client session timed out, have not heard from server in 10001ms for sessionid 0x0, closing socket connection and attempting reconnect
[junit4:junit4]   2> 41687 T461 oaz.ClientCnxn$SendThread.startConnect Opening socket connection to server localhost/127.0.0.1:24656
[junit4:junit4]   2> 49849 T461 oaz.ClientCnxn$SendThread.run Client session timed out, have not heard from server in 10001ms for sessionid 0x0, closing socket connection and attempting reconnect
[junit4:junit4]   2> 50803 T454 ccr.ThreadLeakControl.checkThreadLeaks SEVERE 2 threads leaked from SUITE scope at org.apache.solr.cloud.BasicDistributedZkTest: 
[junit4:junit4]   2> 	   1) Thread[id=462, name=TEST-BasicDistributedZkTest.testDistribSearch-seed#[E5FA13A11BAAB45]-EventThread, state=WAITING, group=TGRP-BasicDistributedZkTest]
[junit4:junit4]   2> 	        at sun.misc.Unsafe.park(Native Method)
[junit4:junit4]   2> 	        at java.util.concurrent.locks.LockSupport.park(LockSupport.java:186)
[junit4:junit4]   2> 	        at java.util.concurrent.locks.AbstractQueuedSynchronizer$ConditionObject.await(AbstractQueuedSynchronizer.java:2043)
[junit4:junit4]   2> 	        at java.util.concurrent.LinkedBlockingQueue.take(LinkedBlockingQueue.java:386)
[junit4:junit4]   2> 	        at org.apache.zookeeper.ClientCnxn$EventThread.run(ClientCnxn.java:498)
[junit4:junit4]   2> 	   2) Thread[id=461, name=TEST-BasicDistributedZkTest.testDistribSearch-seed#[E5FA13A11BAAB45]-SendThread(localhost:24656), state=TIMED_WAITING, group=TGRP-BasicDistributedZkTest]
[junit4:junit4]   2> 	        at java.lang.Thread.sleep(Native Method)
[junit4:junit4]   2> 	        at org.apache.zookeeper.ClientCnxn$SendThread.startConnect(ClientCnxn.java:1045)
[junit4:junit4]   2> 	        at org.apache.zookeeper.ClientCnxn$SendThread.run(ClientCnxn.java:1101)
[junit4:junit4]   2> 50804 T454 ccr.ThreadLeakControl.tryToInterruptAll Starting to interrupt leaked threads:
[junit4:junit4]   2> 	   1) Thread[id=462, name=TEST-BasicDistributedZkTest.testDistribSearch-seed#[E5FA13A11BAAB45]-EventThread, state=WAITING, group=TGRP-BasicDistributedZkTest]
[junit4:junit4]   2> 	   2) Thread[id=461, name=TEST-BasicDistributedZkTest.testDistribSearch-seed#[E5FA13A11BAAB45]-SendThread(localhost:24656), state=TIMED_WAITING, group=TGRP-BasicDistributedZkTest]
[junit4:junit4]   2> 50804 T461 oaz.ClientCnxn$SendThread.startConnect WARNING Unexpected exception java.lang.InterruptedException: sleep interrupted
[junit4:junit4]   2> 	at java.lang.Thread.sleep(Native Method)
[junit4:junit4]   2> 	at org.apache.zookeeper.ClientCnxn$SendThread.startConnect(ClientCnxn.java:1045)
[junit4:junit4]   2> 	at org.apache.zookeeper.ClientCnxn$SendThread.run(ClientCnxn.java:1101)
[junit4:junit4]   2> 
[junit4:junit4]   2> 50804 T462 oaz.ClientCnxn$EventThread.run SEVERE Event thread exiting due to interruption java.lang.InterruptedException
[junit4:junit4]   2> 	at java.util.concurrent.locks.AbstractQueuedSynchronizer$ConditionObject.reportInterruptAfterWait(AbstractQueuedSynchronizer.java:2017)
[junit4:junit4]   2> 	at java.util.concurrent.locks.AbstractQueuedSynchronizer$ConditionObject.await(AbstractQueuedSynchronizer.java:2052)
[junit4:junit4]   2> 	at java.util.concurrent.LinkedBlockingQueue.take(LinkedBlockingQueue.java:386)
[junit4:junit4]   2> 	at org.apache.zookeeper.ClientCnxn$EventThread.run(ClientCnxn.java:498)
[junit4:junit4]   2> 
[junit4:junit4]   2> 50805 T462 oaz.ClientCnxn$EventThread.run EventThread shut down
[junit4:junit4]   2> 50805 T461 oaz.ClientCnxn$SendThread.startConnect Opening socket connection to server localhost/127.0.0.1:24656
[junit4:junit4]   2> 53810 T454 ccr.ThreadLeakControl.tryToInterruptAll SEVERE There are still zombie threads that couldn't be terminated:
[junit4:junit4]   2> 	   1) Thread[id=461, name=TEST-BasicDistributedZkTest.testDistribSearch-seed#[E5FA13A11BAAB45]-SendThread(localhost:24656), state=RUNNABLE, group=TGRP-BasicDistributedZkTest]
[junit4:junit4]   2> 	        at sun.nio.ch.KqueueArrayWrapper.interrupt(Native Method)
[junit4:junit4]   2> 	        at sun.nio.ch.KqueueArrayWrapper.interrupt(KqueueArrayWrapper.java:206)
[junit4:junit4]   2> 	        at sun.nio.ch.KqueueSelectorImpl.wakeup(KqueueSelectorImpl.java:194)
[junit4:junit4]   2> 	        at java.nio.channels.spi.AbstractSelector$1.interrupt(AbstractSelector.java:210)
[junit4:junit4]   2> 	        at java.nio.channels.spi.AbstractSelector.begin(AbstractSelector.java:215)
[junit4:junit4]   2> 	        at sun.nio.ch.KqueueSelectorImpl.doSelect(KqueueSelectorImpl.java:68)
[junit4:junit4]   2> 	        at sun.nio.ch.SelectorImpl.lockAndDoSelect(SelectorImpl.java:87)
[junit4:junit4]   2> 	        at sun.nio.ch.SelectorImpl.select(SelectorImpl.java:98)
[junit4:junit4]   2> 	        at org.apache.zookeeper.ClientCnxn$SendThread.run(ClientCnxn.java:1131)
[junit4:junit4]   2> NOTE: test params are: codec=Appending, sim=DefaultSimilarity, locale=ar_EG, timezone=Canada/Central
[junit4:junit4]   2> NOTE: FreeBSD 9.0-RELEASE amd64/Sun Microsystems Inc. 1.6.0_32 (64-bit)/cpus=16,threads=2,free=75717112,total=332398592
[junit4:junit4]   2> NOTE: All tests run in this JVM: [CopyFieldTest, TestFiltering, TestDefaultSimilarityFactory, HighlighterConfigTest, ScriptEngineTest, ResourceLoaderTest, TestStressReorder, TestRandomFaceting, JSONWriterTest, TestPerFieldSimilarity, TestRangeQuery, TestPHPSerializedResponseWriter, TestQueryTypes, MinimalSchemaTest, DefaultValueUpdateProcessorTest, RequestHandlersTest, BasicDistributedZkTest]
[junit4:junit4]   2> NOTE: download the large Jenkins line-docs file by running 'ant get-jenkins-line-docs' in the lucene directory.
[junit4:junit4]   2> NOTE: reproduce with: ant test  -Dtestcase=BasicDistributedZkTest -Dtests.seed=E5FA13A11BAAB45 -Dtests.multiplier=3 -Dtests.nightly=true -Dtests.slow=true -Dtests.linedocsfile=/home/hudson/lucene-data/enwiki.random.lines.txt -Dtests.locale=ar_EG -Dtests.timezone=Canada/Central -Dtests.file.encoding=ISO8859-1
[junit4:junit4] ERROR   0.00s J0 | BasicDistributedZkTest (suite) <<<
[junit4:junit4]    > Throwable #1: com.carrotsearch.randomizedtesting.ThreadLeakError: 2 threads leaked from SUITE scope at org.apache.solr.cloud.BasicDistributedZkTest: 
[junit4:junit4]    >    1) Thread[id=462, name=TEST-BasicDistributedZkTest.testDistribSearch-seed#[E5FA13A11BAAB45]-EventThread, state=WAITING, group=TGRP-BasicDistributedZkTest]
[junit4:junit4]    >         at sun.misc.Unsafe.park(Native Method)
[junit4:junit4]    >         at java.util.concurrent.locks.LockSupport.park(LockSupport.java:186)
[junit4:junit4]    >         at java.util.concurrent.locks.AbstractQueuedSynchronizer$ConditionObject.await(AbstractQueuedSynchronizer.java:2043)
[junit4:junit4]    >         at java.util.concurrent.LinkedBlockingQueue.take(LinkedBlockingQueue.java:386)
[junit4:junit4]    >         at org.apache.zookeeper.ClientCnxn$EventThread.run(ClientCnxn.java:498)
[junit4:junit4]    >    2) Thread[id=461, name=TEST-BasicDistributedZkTest.testDistribSearch-seed#[E5FA13A11BAAB45]-SendThread(localhost:24656), state=TIMED_WAITING, group=TGRP-BasicDistributedZkTest]
[junit4:junit4]    >         at java.lang.Thread.sleep(Native Method)
[junit4:junit4]    >         at org.apache.zookeeper.ClientCnxn$SendThread.startConnect(ClientCnxn.java:1045)
[junit4:junit4]    >         at org.apache.zookeeper.ClientCnxn$SendThread.run(ClientCnxn.java:1101)
[junit4:junit4]    > 	at __randomizedtesting.SeedInfo.seed([E5FA13A11BAAB45]:0)
[junit4:junit4]    > Throwable #2: com.carrotsearch.randomizedtesting.ThreadLeakError: There are still zombie threads that couldn't be terminated:
[junit4:junit4]    >    1) Thread[id=461, name=TEST-BasicDistributedZkTest.testDistribSearch-seed#[E5FA13A11BAAB45]-SendThread(localhost:24656), state=RUNNABLE, group=TGRP-BasicDistributedZkTest]
[junit4:junit4]    >         at sun.nio.ch.KqueueArrayWrapper.interrupt(Native Method)
[junit4:junit4]    >         at sun.nio.ch.KqueueArrayWrapper.interrupt(KqueueArrayWrapper.java:206)
[junit4:junit4]    >         at sun.nio.ch.KqueueSelectorImpl.wakeup(KqueueSelectorImpl.java:194)
[junit4:junit4]    >         at java.nio.channels.spi.AbstractSelector$1.interrupt(AbstractSelector.java:210)
[junit4:junit4]    >         at java.nio.channels.spi.AbstractSelector.begin(AbstractSelector.java:215)
[junit4:junit4]    >         at sun.nio.ch.KqueueSelectorImpl.doSelect(KqueueSelectorImpl.java:68)
[junit4:junit4]    >         at sun.nio.ch.SelectorImpl.lockAndDoSelect(SelectorImpl.java:87)
[junit4:junit4]    >         at sun.nio.ch.SelectorImpl.select(SelectorImpl.java:98)
[junit4:junit4]    >         at org.apache.zookeeper.ClientCnxn$SendThread.run(ClientCnxn.java:1131)
[junit4:junit4]    > 	at __randomizedtesting.SeedInfo.seed([E5FA13A11BAAB45]:0)
[junit4:junit4] Completed on J0 in 53.85s, 1 test, 3 errors <<< FAILURES!

[...truncated 459 lines...]
[junit4:junit4] ERROR: JVM J1 ended with an exception, command line: /usr/local/openjdk6/jre/bin/java -Dtests.prefix=tests -Dtests.seed=E5FA13A11BAAB45 -Xmx512M -Dtests.iters= -Dtests.verbose=false -Dtests.infostream=false -Dtests.lockdir=/usr/home/hudson/hudson-slave/workspace/Lucene-Solr-NightlyTests-4.x/lucene/build -Dtests.codec=random -Dtests.postingsformat=random -Dtests.locale=random -Dtests.timezone=random -Dtests.directory=random -Dtests.linedocsfile=/home/hudson/lucene-data/enwiki.random.lines.txt -Dtests.luceneMatchVersion=4.0 -Dtests.cleanthreads=perClass -Djava.util.logging.config.file=/usr/home/hudson/hudson-slave/workspace/Lucene-Solr-NightlyTests-4.x/solr/testlogging.properties -Dtests.nightly=true -Dtests.weekly=false -Dtests.slow=true -Dtests.asserts.gracious=false -Dtests.multiplier=3 -DtempDir=. -Djava.io.tmpdir=. -Dtests.sandbox.dir=/usr/home/hudson/hudson-slave/workspace/Lucene-Solr-NightlyTests-4.x/solr/build/solr-core -Djava.security.manager=java.lang.SecurityManager -Djava.security.policy=/usr/home/hudson/hudson-slave/workspace/Lucene-Solr-NightlyTests-4.x/lucene/tools/junit4/tests.policy -Dlucene.version=4.0-SNAPSHOT -Djetty.testMode=1 -Djetty.insecurerandom=1 -Dsolr.directoryFactory=org.apache.solr.core.MockDirectoryFactory -classpath /usr/home/hudson/hudson-slave/workspace/Lucene-Solr-NightlyTests-4.x/solr/build/solr-core/classes/test:/usr/home/hudson/hudson-slave/workspace/Lucene-Solr-NightlyTests-4.x/solr/build/solr-test-framework/classes/java:/usr/home/hudson/hudson-slave/workspace/Lucene-Solr-NightlyTests-4.x/solr/build/solr-core/test-files:/usr/home/hudson/hudson-slave/workspace/Lucene-Solr-NightlyTests-4.x/lucene/build/test-framework/classes/java:/usr/home/hudson/hudson-slave/workspace/Lucene-Solr-NightlyTests-4.x/solr/build/solr-solrj/classes/java:/usr/home/hudson/hudson-slave/workspace/Lucene-Solr-NightlyTests-4.x/solr/build/solr-core/classes/java:/usr/home/hudson/hudson-slave/workspace/Lucene-Solr-NightlyTests-4.x/lucene/build/analysis/common/lucene-analyzers-common-4.0-SNAPSHOT.jar:/usr/home/hudson/hudson-slave/workspace/Lucene-Solr-NightlyTests-4.x/lucene/build/analysis/kuromoji/lucene-analyzers-kuromoji-4.0-SNAPSHOT.jar:/usr/home/hudson/hudson-slave/workspace/Lucene-Solr-NightlyTests-4.x/lucene/build/analysis/phonetic/lucene-analyzers-phonetic-4.0-SNAPSHOT.jar:/usr/home/hudson/hudson-slave/workspace/Lucene-Solr-NightlyTests-4.x/lucene/build/highlighter/lucene-highlighter-4.0-SNAPSHOT.jar:/usr/home/hudson/hudson-slave/workspace/Lucene-Solr-NightlyTests-4.x/lucene/build/memory/lucene-memory-4.0-SNAPSHOT.jar:/usr/home/hudson/hudson-slave/workspace/Lucene-Solr-NightlyTests-4.x/lucene/build/misc/lucene-misc-4.0-SNAPSHOT.jar:/usr/home/hudson/hudson-slave/workspace/Lucene-Solr-NightlyTests-4.x/lucene/build/spatial/lucene-spatial-4.0-SNAPSHOT.jar:/usr/home/hudson/hudson-slave/workspace/Lucene-Solr-NightlyTests-4.x/lucene/build/suggest/lucene-suggest-4.0-SNAPSHOT.jar:/usr/home/hudson/hudson-slave/workspace/Lucene-Solr-NightlyTests-4.x/lucene/build/grouping/lucene-grouping-4.0-SNAPSHOT.jar:/usr/home/hudson/hudson-slave/workspace/Lucene-Solr-NightlyTests-4.x/lucene/build/queries/lucene-queries-4.0-SNAPSHOT.jar:/usr/home/hudson/hudson-slave/workspace/Lucene-Solr-NightlyTests-4.x/lucene/build/queryparser/lucene-queryparser-4.0-SNAPSHOT.jar:/usr/home/hudson/hudson-slave/workspace/Lucene-Solr-NightlyTests-4.x/solr/lib/commons-cli-1.2.jar:/usr/home/hudson/hudson-slave/workspace/Lucene-Solr-NightlyTests-4.x/solr/lib/commons-codec-1.6.jar:/usr/home/hudson/hudson-slave/workspace/Lucene-Solr-NightlyTests-4.x/solr/lib/commons-fileupload-1.2.1.jar:/usr/home/hudson/hudson-slave/workspace/Lucene-Solr-NightlyTests-4.x/solr/lib/commons-io-2.1.jar:/usr/home/hudson/hudson-slave/workspace/Lucene-Solr-NightlyTests-4.x/solr/lib/commons-lang-2.6.jar:/usr/home/hudson/hudson-slave/workspace/Lucene-Solr-NightlyTests-4.x/solr/lib/easymock-2.2.jar:/usr/home/hudson/hudson-slave/workspace/Lucene-Solr-NightlyTests-4.x/solr/lib/guava-r05.jar:/usr/home/hudson/hudson-slave/workspace/Lucene-Solr-NightlyTests-4.x/solr/lib/httpclient-4.1.3.jar:/usr/home/hudson/hudson-slave/workspace/Lucene-Solr-NightlyTests-4.x/solr/lib/httpcore-4.1.4.jar:/usr/home/hudson/hudson-slave/workspace/Lucene-Solr-NightlyTests-4.x/solr/lib/httpmime-4.1.3.jar:/usr/home/hudson/hudson-slave/workspace/Lucene-Solr-NightlyTests-4.x/solr/lib/javax.servlet-api-3.0.1.jar:/usr/home/hudson/hudson-slave/workspace/Lucene-Solr-NightlyTests-4.x/solr/lib/jcl-over-slf4j-1.6.4.jar:/usr/home/hudson/hudson-slave/workspace/Lucene-Solr-NightlyTests-4.x/solr/lib/log4j-over-slf4j-1.6.4.jar:/usr/home/hudson/hudson-slave/workspace/Lucene-Solr-NightlyTests-4.x/solr/lib/slf4j-api-1.6.4.jar:/usr/home/hudson/hudson-slave/workspace/Lucene-Solr-NightlyTests-4.x/solr/lib/slf4j-jdk14-1.6.4.jar:/usr/home/hudson/hudson-slave/workspace/Lucene-Solr-NightlyTests-4.x/solr/lib/spatial4j-0.2.jar:/usr/home/hudson/hudson-slave/workspace/Lucene-Solr-NightlyTests-4.x/solr/lib/wstx-asl-3.2.7.jar:/usr/home/hudson/hudson-slave/workspace/Lucene-Solr-NightlyTests-4.x/solr/lib/zookeeper-3.3.6.jar:/usr/home/hudson/hudson-slave/workspace/Lucene-Solr-NightlyTests-4.x/solr/example/lib/jetty-continuation-8.1.2.v20120308.jar:/usr/home/hudson/hudson-slave/workspace/Lucene-Solr-NightlyTests-4.x/solr/example/lib/jetty-deploy-8.1.2.v20120308.jar:/usr/home/hudson/hudson-slave/workspace/Lucene-Solr-NightlyTests-4.x/solr/example/lib/jetty-http-8.1.2.v20120308.jar:/usr/home/hudson/hudson-slave/workspace/Lucene-Solr-NightlyTests-4.x/solr/example/lib/jetty-io-8.1.2.v20120308.jar:/usr/home/hudson/hudson-slave/workspace/Lucene-Solr-NightlyTests-4.x/solr/example/lib/jetty-jmx-8.1.2.v20120308.jar:/usr/home/hudson/hudson-slave/workspace/Lucene-Solr-NightlyTests-4.x/solr/example/lib/jetty-security-8.1.2.v20120308.jar:/usr/home/hudson/hudson-slave/workspace/Lucene-Solr-NightlyTests-4.x/solr/example/lib/jetty-server-8.1.2.v20120308.jar:/usr/home/hudson/hudson-slave/workspace/Lucene-Solr-NightlyTests-4.x/solr/example/lib/jetty-servlet-8.1.2.v20120308.jar:/usr/home/hudson/hudson-slave/workspace/Lucene-Solr-NightlyTests-4.x/solr/example/lib/jetty-util-8.1.2.v20120308.jar:/usr/home/hudson/hudson-slave/workspace/Lucene-Solr-NightlyTests-4.x/solr/example/lib/jetty-webapp-8.1.2.v20120308.jar:/usr/home/hudson/hudson-slave/workspace/Lucene-Solr-NightlyTests-4.x/solr/example/lib/jetty-xml-8.1.2.v20120308.jar:/usr/home/hudson/hudson-slave/workspace/Lucene-Solr-NightlyTests-4.x/solr/example/lib/servlet-api-3.0.jar:/usr/home/hudson/hudson-slave/workspace/Lucene-Solr-NightlyTests-4.x/solr/example/example-DIH/solr/db/lib/hsqldb-1.8.0.10.jar:/usr/home/hudson/hudson-slave/workspace/Lucene-Solr-NightlyTests-4.x/lucene/build/core/classes/java:/usr/home/hudson/hudson-slave/workspace/Lucene-Solr-NightlyTests-4.x/lucene/test-framework/lib/junit-4.10.jar:/usr/home/hudson/hudson-slave/workspace/Lucene-Solr-NightlyTests-4.x/lucene/test-framework/lib/randomizedtesting-runner-2.0.0.rc5.jar:/home/hudson/hudson-slave/tools/Ant/ant-1.8.2/lib/ant-launcher.jar:/home/hudson/.ant/lib/ivy-2.2.0.jar:/home/hudson/hudson-slave/tools/Ant/ant-1.8.2/lib/ant-apache-regexp.jar:/home/hudson/hudson-slave/tools/Ant/ant-1.8.2/lib/ant-junit.jar:/home/hudson/hudson-slave/tools/Ant/ant-1.8.2/lib/ant-apache-bsf.jar:/home/hudson/hudson-slave/tools/Ant/ant-1.8.2/lib/ant-commons-net.jar:/home/hudson/hudson-slave/tools/Ant/ant-1.8.2/lib/ant-antlr.jar:/home/hudson/hudson-slave/tools/Ant/ant-1.8.2/lib/ant-apache-log4j.jar:/home/hudson/hudson-slave/tools/Ant/ant-1.8.2/lib/ant-commons-logging.jar:/home/hudson/hudson-slave/tools/Ant/ant-1.8.2/lib/ant-apache-xalan2.jar:/home/hudson/hudson-slave/tools/Ant/ant-1.8.2/lib/ant-apache-oro.jar:/home/hudson/hudson-slave/tools/Ant/ant-1.8.2/lib/ant-junit4.jar:/home/hudson/hudson-slave/tools/Ant/ant-1.8.2/lib/ant-netrexx.jar:/home/hudson/hudson-slave/tools/Ant/ant-1.8.2/lib/ant-swing.jar:/home/hudson/hudson-slave/tools/Ant/ant-1.8.2/lib/ant-javamail.jar:/home/hudson/hudson-slave/tools/Ant/ant-1.8.2/lib/ant-jsch.jar:/home/hudson/hudson-slave/tools/Ant/ant-1.8.2/lib/ant-jmf.jar:/home/hudson/hudson-slave/tools/Ant/ant-1.8.2/lib/ant.jar:/home/hudson/hudson-slave/tools/Ant/ant-1.8.2/lib/ant-apache-bcel.jar:/home/hudson/hudson-slave/tools/Ant/ant-1.8.2/lib/ant-jai.jar:/home/hudson/hudson-slave/tools/Ant/ant-1.8.2/lib/ant-testutil.jar:/home/hudson/hudson-slave/tools/Ant/ant-1.8.2/lib/ant-apache-resolver.jar:/home/hudson/hudson-slave/tools/Ant/ant-1.8.2/lib/ant-jdepend.jar:/usr/local/openjdk6/lib/tools.jar:/home/hudson/.ivy2/cache/com.carrotsearch.randomizedtesting/junit4-ant/jars/junit4-ant-2.0.0.rc5.jar -ea:org.apache.lucene... -ea:org.apache.solr... com.carrotsearch.ant.tasks.junit4.slave.SlaveMainSafe -eventsfile /usr/home/hudson/hudson-slave/workspace/Lucene-Solr-NightlyTests-4.x/solr/build/solr-core/test/junit4-J1-20120830_174108_459.events @/usr/home/hudson/hudson-slave/workspace/Lucene-Solr-NightlyTests-4.x/solr/build/solr-core/test/junit4-J1-20120830_174108_459.suites
[junit4:junit4] ERROR: JVM J1 ended with an exception: Forked process exited with an error code: 11
[junit4:junit4] 	at com.carrotsearch.ant.tasks.junit4.JUnit4.forkProcess(JUnit4.java:1312)
[junit4:junit4] 	at com.carrotsearch.ant.tasks.junit4.JUnit4.executeSlave(JUnit4.java:1178)
[junit4:junit4] 	at com.carrotsearch.ant.tasks.junit4.JUnit4.access$000(JUnit4.java:65)
[junit4:junit4] 	at com.carrotsearch.ant.tasks.junit4.JUnit4$2.call(JUnit4.java:813)
[junit4:junit4] 	at com.carrotsearch.ant.tasks.junit4.JUnit4$2.call(JUnit4.java:810)
[junit4:junit4] 	at java.util.concurrent.FutureTask$Sync.innerRun(FutureTask.java:334)
[junit4:junit4] 	at java.util.concurrent.FutureTask.run(FutureTask.java:166)
[junit4:junit4] 	at java.util.concurrent.ThreadPoolExecutor.runWorker(ThreadPoolExecutor.java:1110)
[junit4:junit4] 	at java.util.concurrent.ThreadPoolExecutor$Worker.run(ThreadPoolExecutor.java:603)
[junit4:junit4] 	at java.lang.Thread.run(Thread.java:679)

BUILD FAILED
/usr/home/hudson/hudson-slave/workspace/Lucene-Solr-NightlyTests-4.x/build.xml:29: The following error occurred while executing this line:
/usr/home/hudson/hudson-slave/workspace/Lucene-Solr-NightlyTests-4.x/solr/build.xml:144: The following error occurred while executing this line:
/usr/home/hudson/hudson-slave/workspace/Lucene-Solr-NightlyTests-4.x/lucene/module-build.xml:62: The following error occurred while executing this line:
/usr/home/hudson/hudson-slave/workspace/Lucene-Solr-NightlyTests-4.x/lucene/common-build.xml:1055: The following error occurred while executing this line:
/usr/home/hudson/hudson-slave/workspace/Lucene-Solr-NightlyTests-4.x/lucene/common-build.xml:741: At least one slave process threw an unexpected exception, first: Forked process exited with an error code: 11

Total time: 84 minutes 8 seconds
Build step 'Invoke Ant' marked build as failure
Recording test results
Email was triggered for: Failure
Sending email for trigger: Failure



Mime
View raw message