lucene-dev mailing list archives

Site index · List index
Message view « Date » · « Thread »
Top « Date » · « Thread »
From Policeman Jenkins Server <jenk...@sd-datasolutions.de>
Subject [JENKINS] Lucene-Solr-4.x-Linux (32bit/jdk1.8.0-ea-b49) - Build # 100 - Failure!
Date Thu, 02 Aug 2012 08:05:00 GMT
Build: http://jenkins.sd-datasolutions.de/job/Lucene-Solr-4.x-Linux/100/
Java: 32bit/jdk1.8.0-ea-b49 -client -XX:+UseSerialGC

1 tests failed.
REGRESSION:  org.apache.solr.handler.component.DistributedQueryElevationComponentTest.testDistribSearch

Error Message:
.responseHeader.params.size()==9,9skipped=4,5

Stack Trace:
junit.framework.AssertionFailedError: .responseHeader.params.size()==9,9skipped=4,5
	at __randomizedtesting.SeedInfo.seed([1CC6DA9ED6913F9A:9D205486A1CE5FA6]:0)
	at junit.framework.Assert.fail(Assert.java:50)
	at org.apache.solr.BaseDistributedSearchTestCase.compareResponses(BaseDistributedSearchTestCase.java:670)
	at org.apache.solr.BaseDistributedSearchTestCase.query(BaseDistributedSearchTestCase.java:392)
	at org.apache.solr.handler.component.DistributedQueryElevationComponentTest.doTest(DistributedQueryElevationComponentTest.java:81)
	at org.apache.solr.BaseDistributedSearchTestCase.testDistribSearch(BaseDistributedSearchTestCase.java:679)
	at sun.reflect.NativeMethodAccessorImpl.invoke0(Native Method)
	at sun.reflect.NativeMethodAccessorImpl.invoke(NativeMethodAccessorImpl.java:57)
	at sun.reflect.DelegatingMethodAccessorImpl.invoke(DelegatingMethodAccessorImpl.java:43)
	at java.lang.reflect.Method.invoke(Method.java:474)
	at com.carrotsearch.randomizedtesting.RandomizedRunner.invoke(RandomizedRunner.java:1995)
	at com.carrotsearch.randomizedtesting.RandomizedRunner.access$1100(RandomizedRunner.java:132)
	at com.carrotsearch.randomizedtesting.RandomizedRunner$6.evaluate(RandomizedRunner.java:818)
	at com.carrotsearch.randomizedtesting.RandomizedRunner$7.evaluate(RandomizedRunner.java:877)
	at com.carrotsearch.randomizedtesting.RandomizedRunner$8.evaluate(RandomizedRunner.java:891)
	at com.carrotsearch.randomizedtesting.rules.SystemPropertiesRestoreRule$1.evaluate(SystemPropertiesRestoreRule.java:53)
	at org.apache.lucene.util.TestRuleSetupTeardownChained$1.evaluate(TestRuleSetupTeardownChained.java:50)
	at org.apache.lucene.util.TestRuleFieldCacheSanity$1.evaluate(TestRuleFieldCacheSanity.java:32)
	at org.apache.lucene.util.AbstractBeforeAfterRule$1.evaluate(AbstractBeforeAfterRule.java:45)
	at com.carrotsearch.randomizedtesting.rules.SystemPropertiesInvariantRule$1.evaluate(SystemPropertiesInvariantRule.java:55)
	at org.apache.lucene.util.TestRuleReportUncaughtExceptions$1.evaluate(TestRuleReportUncaughtExceptions.java:68)
	at org.apache.lucene.util.TestRuleThreadAndTestName$1.evaluate(TestRuleThreadAndTestName.java:48)
	at org.apache.lucene.util.TestRuleIgnoreAfterMaxFailures$1.evaluate(TestRuleIgnoreAfterMaxFailures.java:70)
	at org.apache.lucene.util.TestRuleMarkFailure$1.evaluate(TestRuleMarkFailure.java:48)
	at com.carrotsearch.randomizedtesting.RandomizedRunner.runSingleTest(RandomizedRunner.java:825)
	at com.carrotsearch.randomizedtesting.RandomizedRunner.access$700(RandomizedRunner.java:132)
	at com.carrotsearch.randomizedtesting.RandomizedRunner$3$1.run(RandomizedRunner.java:671)
	at com.carrotsearch.randomizedtesting.RandomizedRunner$3.evaluate(RandomizedRunner.java:697)
	at com.carrotsearch.randomizedtesting.RandomizedRunner$4.evaluate(RandomizedRunner.java:736)
	at com.carrotsearch.randomizedtesting.RandomizedRunner$5.evaluate(RandomizedRunner.java:747)
	at com.carrotsearch.randomizedtesting.rules.SystemPropertiesRestoreRule$1.evaluate(SystemPropertiesRestoreRule.java:53)
	at org.apache.lucene.util.AbstractBeforeAfterRule$1.evaluate(AbstractBeforeAfterRule.java:45)
	at org.apache.lucene.util.TestRuleReportUncaughtExceptions$1.evaluate(TestRuleReportUncaughtExceptions.java:68)
	at org.apache.lucene.util.TestRuleStoreClassName$1.evaluate(TestRuleStoreClassName.java:38)
	at com.carrotsearch.randomizedtesting.rules.SystemPropertiesInvariantRule$1.evaluate(SystemPropertiesInvariantRule.java:55)
	at org.apache.lucene.util.TestRuleNoInstanceHooksOverrides$1.evaluate(TestRuleNoInstanceHooksOverrides.java:53)
	at org.apache.lucene.util.TestRuleNoStaticHooksShadowing$1.evaluate(TestRuleNoStaticHooksShadowing.java:52)
	at org.apache.lucene.util.TestRuleAssertionsRequired$1.evaluate(TestRuleAssertionsRequired.java:36)
	at org.apache.lucene.util.TestRuleMarkFailure$1.evaluate(TestRuleMarkFailure.java:48)
	at org.apache.lucene.util.TestRuleIgnoreAfterMaxFailures$1.evaluate(TestRuleIgnoreAfterMaxFailures.java:70)
	at org.apache.lucene.util.TestRuleIgnoreTestSuites$1.evaluate(TestRuleIgnoreTestSuites.java:55)
	at com.carrotsearch.randomizedtesting.RandomizedRunner.runSuite(RandomizedRunner.java:605)
	at com.carrotsearch.randomizedtesting.RandomizedRunner.access$400(RandomizedRunner.java:132)
	at com.carrotsearch.randomizedtesting.RandomizedRunner$2.run(RandomizedRunner.java:551)




Build Log:
[...truncated 7300 lines...]
[junit4:junit4] Suite: org.apache.solr.handler.component.DistributedQueryElevationComponentTest
[junit4:junit4] FAILURE 2.00s J1 | DistributedQueryElevationComponentTest.testDistribSearch
[junit4:junit4]    > Throwable #1: junit.framework.AssertionFailedError: .responseHeader.params.size()==9,9skipped=4,5
[junit4:junit4]    > 	at __randomizedtesting.SeedInfo.seed([1CC6DA9ED6913F9A:9D205486A1CE5FA6]:0)
[junit4:junit4]    > 	at junit.framework.Assert.fail(Assert.java:50)
[junit4:junit4]    > 	at org.apache.solr.BaseDistributedSearchTestCase.compareResponses(BaseDistributedSearchTestCase.java:670)
[junit4:junit4]    > 	at org.apache.solr.BaseDistributedSearchTestCase.query(BaseDistributedSearchTestCase.java:392)
[junit4:junit4]    > 	at org.apache.solr.handler.component.DistributedQueryElevationComponentTest.doTest(DistributedQueryElevationComponentTest.java:81)
[junit4:junit4]    > 	at org.apache.solr.BaseDistributedSearchTestCase.testDistribSearch(BaseDistributedSearchTestCase.java:679)
[junit4:junit4]    > 	at sun.reflect.NativeMethodAccessorImpl.invoke0(Native Method)
[junit4:junit4]    > 	at sun.reflect.NativeMethodAccessorImpl.invoke(NativeMethodAccessorImpl.java:57)
[junit4:junit4]    > 	at sun.reflect.DelegatingMethodAccessorImpl.invoke(DelegatingMethodAccessorImpl.java:43)
[junit4:junit4]    > 	at java.lang.reflect.Method.invoke(Method.java:474)
[junit4:junit4]    > 	at com.carrotsearch.randomizedtesting.RandomizedRunner.invoke(RandomizedRunner.java:1995)
[junit4:junit4]    > 	at com.carrotsearch.randomizedtesting.RandomizedRunner.access$1100(RandomizedRunner.java:132)
[junit4:junit4]    > 	at com.carrotsearch.randomizedtesting.RandomizedRunner$6.evaluate(RandomizedRunner.java:818)
[junit4:junit4]    > 	at com.carrotsearch.randomizedtesting.RandomizedRunner$7.evaluate(RandomizedRunner.java:877)
[junit4:junit4]    > 	at com.carrotsearch.randomizedtesting.RandomizedRunner$8.evaluate(RandomizedRunner.java:891)
[junit4:junit4]    > 	at com.carrotsearch.randomizedtesting.rules.SystemPropertiesRestoreRule$1.evaluate(SystemPropertiesRestoreRule.java:53)
[junit4:junit4]    > 	at org.apache.lucene.util.TestRuleSetupTeardownChained$1.evaluate(TestRuleSetupTeardownChained.java:50)
[junit4:junit4]    > 	at org.apache.lucene.util.TestRuleFieldCacheSanity$1.evaluate(TestRuleFieldCacheSanity.java:32)
[junit4:junit4]    > 	at org.apache.lucene.util.AbstractBeforeAfterRule$1.evaluate(AbstractBeforeAfterRule.java:45)
[junit4:junit4]    > 	at com.carrotsearch.randomizedtesting.rules.SystemPropertiesInvariantRule$1.evaluate(SystemPropertiesInvariantRule.java:55)
[junit4:junit4]    > 	at org.apache.lucene.util.TestRuleReportUncaughtExceptions$1.evaluate(TestRuleReportUncaughtExceptions.java:68)
[junit4:junit4]    > 	at org.apache.lucene.util.TestRuleThreadAndTestName$1.evaluate(TestRuleThreadAndTestName.java:48)
[junit4:junit4]    > 	at org.apache.lucene.util.TestRuleIgnoreAfterMaxFailures$1.evaluate(TestRuleIgnoreAfterMaxFailures.java:70)
[junit4:junit4]    > 	at org.apache.lucene.util.TestRuleMarkFailure$1.evaluate(TestRuleMarkFailure.java:48)
[junit4:junit4]    > 	at com.carrotsearch.randomizedtesting.RandomizedRunner.runSingleTest(RandomizedRunner.java:825)
[junit4:junit4]    > 	at com.carrotsearch.randomizedtesting.RandomizedRunner.access$700(RandomizedRunner.java:132)
[junit4:junit4]    > 	at com.carrotsearch.randomizedtesting.RandomizedRunner$3$1.run(RandomizedRunner.java:671)
[junit4:junit4]    > 	at com.carrotsearch.randomizedtesting.RandomizedRunner$3.evaluate(RandomizedRunner.java:697)
[junit4:junit4]    > 	at com.carrotsearch.randomizedtesting.RandomizedRunner$4.evaluate(RandomizedRunner.java:736)
[junit4:junit4]    > 	at com.carrotsearch.randomizedtesting.RandomizedRunner$5.evaluate(RandomizedRunner.java:747)
[junit4:junit4]    > 	at com.carrotsearch.randomizedtesting.rules.SystemPropertiesRestoreRule$1.evaluate(SystemPropertiesRestoreRule.java:53)
[junit4:junit4]    > 	at org.apache.lucene.util.AbstractBeforeAfterRule$1.evaluate(AbstractBeforeAfterRule.java:45)
[junit4:junit4]    > 	at org.apache.lucene.util.TestRuleReportUncaughtExceptions$1.evaluate(TestRuleReportUncaughtExceptions.java:68)
[junit4:junit4]    > 	at org.apache.lucene.util.TestRuleStoreClassName$1.evaluate(TestRuleStoreClassName.java:38)
[junit4:junit4]    > 	at com.carrotsearch.randomizedtesting.rules.SystemPropertiesInvariantRule$1.evaluate(SystemPropertiesInvariantRule.java:55)
[junit4:junit4]    > 	at org.apache.lucene.util.TestRuleNoInstanceHooksOverrides$1.evaluate(TestRuleNoInstanceHooksOverrides.java:53)
[junit4:junit4]    > 	at org.apache.lucene.util.TestRuleNoStaticHooksShadowing$1.evaluate(TestRuleNoStaticHooksShadowing.java:52)
[junit4:junit4]    > 	at org.apache.lucene.util.TestRuleAssertionsRequired$1.evaluate(TestRuleAssertionsRequired.java:36)
[junit4:junit4]    > 	at org.apache.lucene.util.TestRuleMarkFailure$1.evaluate(TestRuleMarkFailure.java:48)
[junit4:junit4]    > 	at org.apache.lucene.util.TestRuleIgnoreAfterMaxFailures$1.evaluate(TestRuleIgnoreAfterMaxFailures.java:70)
[junit4:junit4]    > 	at org.apache.lucene.util.TestRuleIgnoreTestSuites$1.evaluate(TestRuleIgnoreTestSuites.java:55)
[junit4:junit4]    > 	at com.carrotsearch.randomizedtesting.RandomizedRunner.runSuite(RandomizedRunner.java:605)
[junit4:junit4]    > 	at com.carrotsearch.randomizedtesting.RandomizedRunner.access$400(RandomizedRunner.java:132)
[junit4:junit4]    > 	at com.carrotsearch.randomizedtesting.RandomizedRunner$2.run(RandomizedRunner.java:551)
[junit4:junit4]    > 
[junit4:junit4]   2> 3 T381 oas.SolrTestCaseJ4.setUp ###Starting testDistribSearch
[junit4:junit4]   2> 4 T381 oejs.Server.doStart jetty-8.1.2.v20120308
[junit4:junit4]   2> 8 T381 oejs.AbstractConnector.doStart Started SocketConnector@0.0.0.0:50558
[junit4:junit4]   2> 9 T381 oasc.SolrResourceLoader.locateSolrHome JNDI not configured for solr (NoInitialContextEx)
[junit4:junit4]   2> 10 T381 oasc.SolrResourceLoader.locateSolrHome using system property solr.solr.home: /mnt/ssd/jenkins/workspace/Lucene-Solr-4.x-Linux/checkout/solr/build/solr-core/test-files/solr
[junit4:junit4]   2> 10 T381 oasc.SolrResourceLoader.<init> new SolrResourceLoader for deduced Solr Home: '/mnt/ssd/jenkins/workspace/Lucene-Solr-4.x-Linux/checkout/solr/build/solr-core/test-files/solr/'
[junit4:junit4]   2> 24 T381 oass.SolrDispatchFilter.init SolrDispatchFilter.init()
[junit4:junit4]   2> 24 T381 oasc.SolrResourceLoader.locateSolrHome JNDI not configured for solr (NoInitialContextEx)
[junit4:junit4]   2> 24 T381 oasc.SolrResourceLoader.locateSolrHome using system property solr.solr.home: /mnt/ssd/jenkins/workspace/Lucene-Solr-4.x-Linux/checkout/solr/build/solr-core/test-files/solr
[junit4:junit4]   2> 25 T381 oasc.CoreContainer$Initializer.initialize looking for solr.xml: /mnt/ssd/jenkins/workspace/Lucene-Solr-4.x-Linux/checkout/solr/build/solr-core/test-files/solr/solr.xml
[junit4:junit4]   2> 25 T381 oasc.CoreContainer.<init> New CoreContainer 30836045
[junit4:junit4]   2> 26 T381 oasc.CoreContainer.load Loading CoreContainer using Solr Home: '/mnt/ssd/jenkins/workspace/Lucene-Solr-4.x-Linux/checkout/solr/build/solr-core/test-files/solr/'
[junit4:junit4]   2> 26 T381 oasc.SolrResourceLoader.<init> new SolrResourceLoader for directory: '/mnt/ssd/jenkins/workspace/Lucene-Solr-4.x-Linux/checkout/solr/build/solr-core/test-files/solr/'
[junit4:junit4]   2> 37 T381 oasc.CoreContainer.load Registering Log Listener
[junit4:junit4]   2> 47 T381 oasc.CoreContainer.create Creating SolrCore 'collection1' using instanceDir: /mnt/ssd/jenkins/workspace/Lucene-Solr-4.x-Linux/checkout/solr/build/solr-core/test-files/solr/collection1
[junit4:junit4]   2> 48 T381 oasc.SolrResourceLoader.<init> new SolrResourceLoader for directory: '/mnt/ssd/jenkins/workspace/Lucene-Solr-4.x-Linux/checkout/solr/build/solr-core/test-files/solr/collection1/'
[junit4:junit4]   2> 48 T381 oasc.SolrResourceLoader.replaceClassLoader Adding 'file:/mnt/ssd/jenkins/workspace/Lucene-Solr-4.x-Linux/checkout/solr/build/solr-core/test-files/solr/collection1/lib/README' to classloader
[junit4:junit4]   2> 48 T381 oasc.SolrResourceLoader.replaceClassLoader Adding 'file:/mnt/ssd/jenkins/workspace/Lucene-Solr-4.x-Linux/checkout/solr/build/solr-core/test-files/solr/collection1/lib/classes/' to classloader
[junit4:junit4]   2> 72 T381 oasc.SolrConfig.<init> Using Lucene MatchVersion: LUCENE_40
[junit4:junit4]   2> 117 T381 oasc.SolrConfig.<init> Loaded SolrConfig: solrconfig-elevate.xml
[junit4:junit4]   2> 118 T381 oass.IndexSchema.readSchema Reading Solr Schema
[junit4:junit4]   2> 129 T381 oass.IndexSchema.readSchema Schema name=example
[junit4:junit4]   2> 317 T381 oass.IndexSchema.readSchema default search field in schema is text
[junit4:junit4]   2> 321 T381 oass.IndexSchema.readSchema unique key field: id
[junit4:junit4]   2> 324 T381 oasc.SolrCore.<init> [collection1] Opening new SolrCore at /mnt/ssd/jenkins/workspace/Lucene-Solr-4.x-Linux/checkout/solr/build/solr-core/test-files/solr/collection1/, dataDir=./org.apache.solr.handler.component.DistributedQueryElevationComponentTest-1343894326301/control/data/
[junit4:junit4]   2> 325 T381 oasc.JmxMonitoredMap.<init> JMX monitoring is enabled. Adding Solr mbeans to JMX Server: com.sun.jmx.mbeanserver.JmxMBeanServer@664140
[junit4:junit4]   2> 326 T381 oasc.SolrCore.getNewIndexDir WARNING New index directory detected: old=null new=./org.apache.solr.handler.component.DistributedQueryElevationComponentTest-1343894326301/control/data/index/
[junit4:junit4]   2> 326 T381 oasc.SolrCore.initIndex WARNING [collection1] Solr index directory './org.apache.solr.handler.component.DistributedQueryElevationComponentTest-1343894326301/control/data/index' doesn't exist. Creating new index...
[junit4:junit4]   2> 328 T381 oasc.SolrDeletionPolicy.onCommit SolrDeletionPolicy.onCommit: commits:num=1
[junit4:junit4]   2> 		commit{dir=BaseDirectoryWrapper(org.apache.lucene.store.RAMDirectory@6431a2 lockFactory=org.apache.lucene.store.SingleInstanceLockFactory@1f68a0f),segFN=segments_1,generation=1,filenames=[segments_1]
[junit4:junit4]   2> 328 T381 oasc.SolrDeletionPolicy.updateCommits newest commit = 1
[junit4:junit4]   2> 330 T381 oasc.RequestHandlers.initHandlersFromConfig created /update: solr.UpdateRequestHandler
[junit4:junit4]   2> 330 T381 oasc.RequestHandlers.initHandlersFromConfig created /elevate: org.apache.solr.handler.component.SearchHandler
[junit4:junit4]   2> 331 T381 oasc.RequestHandlers.initHandlersFromConfig created /dataElevate: org.apache.solr.handler.component.SearchHandler
[junit4:junit4]   2> 331 T381 oashl.XMLLoader.init xsltCacheLifetimeSeconds=60
[junit4:junit4]   2> 331 T381 oasc.RequestHandlers.initHandlersFromConfig WARNING no default request handler is registered (either '/select' or 'standard')
[junit4:junit4]   2> 333 T381 oasc.SolrCore.initDeprecatedSupport WARNING solrconfig.xml uses deprecated <admin/gettableFiles>, Please update your config to use the ShowFileRequestHandler.
[junit4:junit4]   2> 333 T381 oasc.SolrCore.initDeprecatedSupport WARNING adding ShowFileRequestHandler with hidden files: [DA_UTF8.XML, SCHEMA_CODEC.XML, STOP-2.TXT, SOLRCONFIG-SCRIPT-UPDATEPROCESSOR.XML, BAD-SOLRCONFIG-MISSING-SCRIPTFILE.XML, SOLRCONFIG-DELPOLICY1.XML, BAD-SCHEMA-NOT-INDEXED-BUT-NORMS.XML, SOLRCONFIG-SOLCOREPROPERTIES.XML, HYPHENATION.DTD, SOLRCONFIG-QUERYSENDER.XML, SOLRCONFIG-QUERYSENDER-NOQUERY.XML, SOLRCONFIG-TRANSFORMERS.XML, KEEP-2.TXT, COMPOUNDDICTIONARY.TXT, SCHEMA-TFIDF.XML, SCHEMA-NUMERIC.XML, SOLRCONFIG-PROPINJECT.XML, SOLRCONFIG-MASTER3.XML, BAD-SCHEMA-SIM-GLOBAL-VS-FT-MISMATCH.XML, SCHEMA11.XML, SCHEMA-LUCENEMATCHVERSION.XML, HUNSPELL-TEST.AFF, SOLRCONFIG-PHRASESUGGEST.XML, SCHEMA-TRIE.XML, TRIVIAL.UPDATEPROCESSOR0.JS, BAD-SCHEMA-DUP-DYNAMICFIELD.XML, SOLRCONFIG-REQHANDLER.INCL, SOLRCONFIG_PERF.XML, SOLRCONFIG-ALTDIRECTORY.XML, SCHEMA-REVERSED.XML, BAD-SCHEMA-NOT-INDEXED-BUT-POS.XML, SCHEMA-REQUIRED-FIELDS.XML, BAD-SCHEMA-DUP-FIELDTYPE.XML, STOPTYPES-1.TXT, SOLRCONFIG-LAZYWRITER.XML, SOLRCONFIG-MASTER2.XML, SOLRCONFIG-NOCACHE.XML, SOLRCONFIG-TLOG.XML, STOP-1.TXT, CURRENCY.XML, OLD_SYNONYMS.TXT, SOLRCONFIG-REPEATER.XML, BAD-SCHEMA-CODEC-GLOBAL-VS-FT-MISMATCH.XML, BAD-SCHEMA-NOT-INDEXED-BUT-TF.XML, SCHEMA.XML, SCHEMA-SPELLCHECKER.XML, SCHEMA-CHARFILTERS.XML, SCHEMA-BINARYFIELD.XML, BAD-SCHEMA-UNIQUEKEY-MULTIVALUED.XML, SOLRCONFIG-SLAVE1.XML, BAD-SOLRCONFIG-INVALID-SCRIPTFILE.XML, PHRASESUGGEST.TXT, SCHEMA-STOP-KEEP.XML, SOLRCONFIG-UPDATE-PROCESSOR-CHAINS.XML, SOLRCONFIG-PROPINJECT-INDEXDEFAULT.XML, SOLRCONFIG-SOLR-749.XML, ADDFIELDS.UPDATEPROCESSOR.JS, STOP-SNOWBALL.TXT, ELEVATE.XML, BAD-SCHEMA-UNIQUEKEY-IS-COPYFIELD-DEST.XML, OPEN-EXCHANGE-RATES.JSON, SOLRCONFIG-NATIVELOCK.XML, STEMDICT.TXT, BAD-SCHEMA-DUP-FIELD.XML, SOLRCONFIG-BASIC.XML, SCHEMA-REPLICATION2.XML, MAPPING-ISOLATIN1ACCENT.TXT, SOLRCONFIG-SIMPLELOCK.XML, SCHEMA-FOLDING.XML, SCHEMA-REPLICATION1.XML, STOPWITHBOM.TXT, SOLRCONFIG-ELEVATE.XML, WDFTYPES.TXT, BAD-SCHEMA-EXTERNAL-FILEFIELD.XML, STOPWORDS.TXT, SOLRCONFIG-FUNCTIONQUERY.XML, SCHEMA-BM25.XML, SCHEMA-DFR.XML, SOLRCONFIG-ENABLEPLUGIN.XML, STOPWORDSWRONGENCODING.TXT, SOLRCONFIG-MERGEPOLICY.XML, SYNONYMS.TXT, DA_COMPOUNDDICTIONARY.TXT, BAD-MP-SOLRCONFIG.XML, SCHEMA-IB.XML, SOLRCONFIG-MASTER.XML, BAD-SCHEMA-ANALYZER-CLASS-AND-NESTED.XML, MISSLEADING.EXTENSION.UPDATEPROCESSOR.JS.TXT, SCHEMA-COLLATEFILTER.XML, PROTWORDS.TXT, SCHEMA-COLLATE.XML, SOLRCONFIG-SPELLCHECKER.XML, SOLRCONFIG-SLAVE.XML, SCHEMA-LMJELINEKMERCER.XML, SCHEMA-PHRASESUGGEST.XML, SOLRCONFIG-SPELLCHECKCOMPONENT.XML, BAD_SOLRCONFIG.XML, XSLT, HUNSPELL-TEST.DIC, MISSING.FUNCTIONS.UPDATEPROCESSOR.JS, SCHEMA-SIM.XML, TRIVIAL.UPDATEPROCESSOR1.JS, SOLRCONFIG-HIGHLIGHT.XML, THROW.ERROR.ON.ADD.UPDATEPROCESSOR.JS, SCHEMASURROUND.XML, SOLRCONFIG_CODEC.XML, SOLRCONFIG-TERMINDEX.XML, SCHEMA-LMDIRICHLET.XML, BAD-SCHEMA-NONTEXT-ANALYZER.XML, SCHEMA-COPYFIELD-TEST.XML, SOLRCONFIG-XINCLUDE.XML, KEEP-1.TXT, BAD-SOLRCONFIG-BOGUS-SCRIPTENGINE-NAME.XML, BAD-SCHEMA-OMIT-TF-BUT-NOT-POS.XML, SOLRCONFIG-MASTER1.XML, BAD-SCHEMA-UNIQUEKEY-USES-DEFAULT.XML, FRENCHARTICLES.TXT, SCHEMA12.XML, SCHEMA15.XML, SCHEMA-MINIMAL.XML, SOLRCONFIG-DELPOLICY2.XML, SOLRCONFIG-CACHING.XML, STOPTYPES-2.TXT, SOLRCONFIG-BASIC-LUCENEVERSION31.XML, CONDITIONAL.UPDATEPROCESSOR.JS, SOLRCONFIG-MASTER1-KEEPONEBACKUP.XML, SCHEMA-NOT-REQUIRED-UNIQUE-KEY.XML]
[junit4:junit4]   2> 336 T381 oass.SolrIndexSearcher.<init> Opening Searcher@1c0c5d3 main
[junit4:junit4]   2> 336 T381 oass.SolrIndexSearcher.getIndexDir WARNING WARNING: Directory impl does not support setting indexDir: org.apache.lucene.store.BaseDirectoryWrapper
[junit4:junit4]   2> 336 T381 oasu.CommitTracker.<init> Hard AutoCommit: disabled
[junit4:junit4]   2> 336 T381 oasu.CommitTracker.<init> Soft AutoCommit: disabled
[junit4:junit4]   2> 337 T381 oashc.QueryElevationComponent.inform Loading QueryElevation from: /mnt/ssd/jenkins/workspace/Lucene-Solr-4.x-Linux/checkout/solr/build/solr-core/test-files/solr/collection1/conf/elevate.xml
[junit4:junit4]   2> 348 T381 oashc.QueryElevationComponent.inform Loading QueryElevation from: /mnt/ssd/jenkins/workspace/Lucene-Solr-4.x-Linux/checkout/solr/build/solr-core/test-files/solr/collection1/conf/elevate.xml
[junit4:junit4]   2> 355 T381 oashc.HttpShardHandlerFactory.getParameter Setting socketTimeout to: 0
[junit4:junit4]   2> 356 T381 oashc.HttpShardHandlerFactory.getParameter Setting urlScheme to: http://
[junit4:junit4]   2> 356 T381 oashc.HttpShardHandlerFactory.getParameter Setting connTimeout to: 0
[junit4:junit4]   2> 356 T381 oashc.HttpShardHandlerFactory.getParameter Setting maxConnectionsPerHost to: 20
[junit4:junit4]   2> 357 T381 oashc.HttpShardHandlerFactory.getParameter Setting corePoolSize to: 0
[junit4:junit4]   2> 357 T381 oashc.HttpShardHandlerFactory.getParameter Setting maximumPoolSize to: 2147483647
[junit4:junit4]   2> 357 T381 oashc.HttpShardHandlerFactory.getParameter Setting maxThreadIdleTime to: 5
[junit4:junit4]   2> 358 T381 oashc.HttpShardHandlerFactory.getParameter Setting sizeOfQueue to: -1
[junit4:junit4]   2> 358 T381 oashc.HttpShardHandlerFactory.getParameter Setting fairnessPolicy to: false
[junit4:junit4]   2> 358 T381 oascsi.HttpClientUtil.createClient Creating new http client, config:maxConnectionsPerHost=20&maxConnections=10000&socketTimeout=0&connTimeout=0&retry=false
[junit4:junit4]   2> 363 T391 oasc.SolrCore.registerSearcher [collection1] Registered new searcher Searcher@1c0c5d3 main{StandardDirectoryReader(segments_1:1)}
[junit4:junit4]   2> 363 T381 oasc.CoreContainer.register registering core: collection1
[junit4:junit4]   2> 363 T381 oass.SolrDispatchFilter.init user.dir=/mnt/ssd/jenkins/workspace/Lucene-Solr-4.x-Linux/checkout/solr/build/solr-core/test/J1
[junit4:junit4]   2> 364 T381 oass.SolrDispatchFilter.init SolrDispatchFilter.init() done
[junit4:junit4]   2> 364 T381 oascsi.HttpClientUtil.createClient Creating new http client, config:maxConnections=128&maxConnectionsPerHost=32&followRedirects=false
[junit4:junit4]   2> 367 T381 oejs.Server.doStart jetty-8.1.2.v20120308
[junit4:junit4]   2> 368 T381 oejs.AbstractConnector.doStart Started SocketConnector@0.0.0.0:43280
[junit4:junit4]   2> 369 T381 oasc.SolrResourceLoader.locateSolrHome JNDI not configured for solr (NoInitialContextEx)
[junit4:junit4]   2> 369 T381 oasc.SolrResourceLoader.locateSolrHome using system property solr.solr.home: /mnt/ssd/jenkins/workspace/Lucene-Solr-4.x-Linux/checkout/solr/build/solr-core/test-files/solr
[junit4:junit4]   2> 369 T381 oasc.SolrResourceLoader.<init> new SolrResourceLoader for deduced Solr Home: '/mnt/ssd/jenkins/workspace/Lucene-Solr-4.x-Linux/checkout/solr/build/solr-core/test-files/solr/'
[junit4:junit4]   2> 380 T381 oass.SolrDispatchFilter.init SolrDispatchFilter.init()
[junit4:junit4]   2> 380 T381 oasc.SolrResourceLoader.locateSolrHome JNDI not configured for solr (NoInitialContextEx)
[junit4:junit4]   2> 380 T381 oasc.SolrResourceLoader.locateSolrHome using system property solr.solr.home: /mnt/ssd/jenkins/workspace/Lucene-Solr-4.x-Linux/checkout/solr/build/solr-core/test-files/solr
[junit4:junit4]   2> 381 T381 oasc.CoreContainer$Initializer.initialize looking for solr.xml: /mnt/ssd/jenkins/workspace/Lucene-Solr-4.x-Linux/checkout/solr/build/solr-core/test-files/solr/solr.xml
[junit4:junit4]   2> 381 T381 oasc.CoreContainer.<init> New CoreContainer 11572657
[junit4:junit4]   2> 381 T381 oasc.CoreContainer.load Loading CoreContainer using Solr Home: '/mnt/ssd/jenkins/workspace/Lucene-Solr-4.x-Linux/checkout/solr/build/solr-core/test-files/solr/'
[junit4:junit4]   2> 382 T381 oasc.SolrResourceLoader.<init> new SolrResourceLoader for directory: '/mnt/ssd/jenkins/workspace/Lucene-Solr-4.x-Linux/checkout/solr/build/solr-core/test-files/solr/'
[junit4:junit4]   2> 399 T381 oasc.CoreContainer.load Registering Log Listener
[junit4:junit4]   2> 416 T381 oasc.CoreContainer.create Creating SolrCore 'collection1' using instanceDir: /mnt/ssd/jenkins/workspace/Lucene-Solr-4.x-Linux/checkout/solr/build/solr-core/test-files/solr/collection1
[junit4:junit4]   2> 416 T381 oasc.SolrResourceLoader.<init> new SolrResourceLoader for directory: '/mnt/ssd/jenkins/workspace/Lucene-Solr-4.x-Linux/checkout/solr/build/solr-core/test-files/solr/collection1/'
[junit4:junit4]   2> 417 T381 oasc.SolrResourceLoader.replaceClassLoader Adding 'file:/mnt/ssd/jenkins/workspace/Lucene-Solr-4.x-Linux/checkout/solr/build/solr-core/test-files/solr/collection1/lib/README' to classloader
[junit4:junit4]   2> 417 T381 oasc.SolrResourceLoader.replaceClassLoader Adding 'file:/mnt/ssd/jenkins/workspace/Lucene-Solr-4.x-Linux/checkout/solr/build/solr-core/test-files/solr/collection1/lib/classes/' to classloader
[junit4:junit4]   2> 447 T381 oasc.SolrConfig.<init> Using Lucene MatchVersion: LUCENE_40
[junit4:junit4]   2> 487 T381 oasc.SolrConfig.<init> Loaded SolrConfig: solrconfig-elevate.xml
[junit4:junit4]   2> 487 T381 oass.IndexSchema.readSchema Reading Solr Schema
[junit4:junit4]   2> 490 T381 oass.IndexSchema.readSchema Schema name=example
[junit4:junit4]   2> 684 T381 oass.IndexSchema.readSchema default search field in schema is text
[junit4:junit4]   2> 687 T381 oass.IndexSchema.readSchema unique key field: id
[junit4:junit4]   2> 690 T381 oasc.SolrCore.<init> [collection1] Opening new SolrCore at /mnt/ssd/jenkins/workspace/Lucene-Solr-4.x-Linux/checkout/solr/build/solr-core/test-files/solr/collection1/, dataDir=./org.apache.solr.handler.component.DistributedQueryElevationComponentTest-1343894326301/shard0/data/
[junit4:junit4]   2> 690 T381 oasc.JmxMonitoredMap.<init> JMX monitoring is enabled. Adding Solr mbeans to JMX Server: com.sun.jmx.mbeanserver.JmxMBeanServer@664140
[junit4:junit4]   2> 690 T381 oasc.SolrCore.getNewIndexDir WARNING New index directory detected: old=null new=./org.apache.solr.handler.component.DistributedQueryElevationComponentTest-1343894326301/shard0/data/index/
[junit4:junit4]   2> 691 T381 oasc.SolrCore.initIndex WARNING [collection1] Solr index directory './org.apache.solr.handler.component.DistributedQueryElevationComponentTest-1343894326301/shard0/data/index' doesn't exist. Creating new index...
[junit4:junit4]   2> 692 T381 oasc.SolrDeletionPolicy.onCommit SolrDeletionPolicy.onCommit: commits:num=1
[junit4:junit4]   2> 		commit{dir=MockDirWrapper(org.apache.lucene.store.RAMDirectory@1f9e533 lockFactory=org.apache.lucene.store.SingleInstanceLockFactory@1dce920),segFN=segments_1,generation=1,filenames=[segments_1]
[junit4:junit4]   2> 692 T381 oasc.SolrDeletionPolicy.updateCommits newest commit = 1
[junit4:junit4]   2> 693 T381 oasc.RequestHandlers.initHandlersFromConfig created /update: solr.UpdateRequestHandler
[junit4:junit4]   2> 693 T381 oasc.RequestHandlers.initHandlersFromConfig created /elevate: org.apache.solr.handler.component.SearchHandler
[junit4:junit4]   2> 694 T381 oasc.RequestHandlers.initHandlersFromConfig created /dataElevate: org.apache.solr.handler.component.SearchHandler
[junit4:junit4]   2> 694 T381 oashl.XMLLoader.init xsltCacheLifetimeSeconds=60
[junit4:junit4]   2> 694 T381 oasc.RequestHandlers.initHandlersFromConfig WARNING no default request handler is registered (either '/select' or 'standard')
[junit4:junit4]   2> 695 T381 oasc.SolrCore.initDeprecatedSupport WARNING solrconfig.xml uses deprecated <admin/gettableFiles>, Please update your config to use the ShowFileRequestHandler.
[junit4:junit4]   2> 696 T381 oasc.SolrCore.initDeprecatedSupport WARNING adding ShowFileRequestHandler with hidden files: [DA_UTF8.XML, SCHEMA_CODEC.XML, STOP-2.TXT, SOLRCONFIG-SCRIPT-UPDATEPROCESSOR.XML, BAD-SOLRCONFIG-MISSING-SCRIPTFILE.XML, SOLRCONFIG-DELPOLICY1.XML, BAD-SCHEMA-NOT-INDEXED-BUT-NORMS.XML, SOLRCONFIG-SOLCOREPROPERTIES.XML, HYPHENATION.DTD, SOLRCONFIG-QUERYSENDER.XML, SOLRCONFIG-QUERYSENDER-NOQUERY.XML, SOLRCONFIG-TRANSFORMERS.XML, KEEP-2.TXT, COMPOUNDDICTIONARY.TXT, SCHEMA-TFIDF.XML, SCHEMA-NUMERIC.XML, SOLRCONFIG-PROPINJECT.XML, SOLRCONFIG-MASTER3.XML, BAD-SCHEMA-SIM-GLOBAL-VS-FT-MISMATCH.XML, SCHEMA11.XML, SCHEMA-LUCENEMATCHVERSION.XML, HUNSPELL-TEST.AFF, SOLRCONFIG-PHRASESUGGEST.XML, SCHEMA-TRIE.XML, TRIVIAL.UPDATEPROCESSOR0.JS, BAD-SCHEMA-DUP-DYNAMICFIELD.XML, SOLRCONFIG-REQHANDLER.INCL, SOLRCONFIG_PERF.XML, SOLRCONFIG-ALTDIRECTORY.XML, SCHEMA-REVERSED.XML, BAD-SCHEMA-NOT-INDEXED-BUT-POS.XML, SCHEMA-REQUIRED-FIELDS.XML, BAD-SCHEMA-DUP-FIELDTYPE.XML, STOPTYPES-1.TXT, SOLRCONFIG-LAZYWRITER.XML, SOLRCONFIG-MASTER2.XML, SOLRCONFIG-NOCACHE.XML, SOLRCONFIG-TLOG.XML, STOP-1.TXT, CURRENCY.XML, OLD_SYNONYMS.TXT, SOLRCONFIG-REPEATER.XML, BAD-SCHEMA-CODEC-GLOBAL-VS-FT-MISMATCH.XML, BAD-SCHEMA-NOT-INDEXED-BUT-TF.XML, SCHEMA.XML, SCHEMA-SPELLCHECKER.XML, SCHEMA-CHARFILTERS.XML, SCHEMA-BINARYFIELD.XML, BAD-SCHEMA-UNIQUEKEY-MULTIVALUED.XML, SOLRCONFIG-SLAVE1.XML, BAD-SOLRCONFIG-INVALID-SCRIPTFILE.XML, PHRASESUGGEST.TXT, SCHEMA-STOP-KEEP.XML, SOLRCONFIG-UPDATE-PROCESSOR-CHAINS.XML, SOLRCONFIG-PROPINJECT-INDEXDEFAULT.XML, SOLRCONFIG-SOLR-749.XML, ADDFIELDS.UPDATEPROCESSOR.JS, STOP-SNOWBALL.TXT, ELEVATE.XML, BAD-SCHEMA-UNIQUEKEY-IS-COPYFIELD-DEST.XML, OPEN-EXCHANGE-RATES.JSON, SOLRCONFIG-NATIVELOCK.XML, STEMDICT.TXT, BAD-SCHEMA-DUP-FIELD.XML, SOLRCONFIG-BASIC.XML, SCHEMA-REPLICATION2.XML, MAPPING-ISOLATIN1ACCENT.TXT, SOLRCONFIG-SIMPLELOCK.XML, SCHEMA-FOLDING.XML, SCHEMA-REPLICATION1.XML, STOPWITHBOM.TXT, SOLRCONFIG-ELEVATE.XML, WDFTYPES.TXT, BAD-SCHEMA-EXTERNAL-FILEFIELD.XML, STOPWORDS.TXT, SOLRCONFIG-FUNCTIONQUERY.XML, SCHEMA-BM25.XML, SCHEMA-DFR.XML, SOLRCONFIG-ENABLEPLUGIN.XML, STOPWORDSWRONGENCODING.TXT, SOLRCONFIG-MERGEPOLICY.XML, SYNONYMS.TXT, DA_COMPOUNDDICTIONARY.TXT, BAD-MP-SOLRCONFIG.XML, SCHEMA-IB.XML, SOLRCONFIG-MASTER.XML, BAD-SCHEMA-ANALYZER-CLASS-AND-NESTED.XML, MISSLEADING.EXTENSION.UPDATEPROCESSOR.JS.TXT, SCHEMA-COLLATEFILTER.XML, PROTWORDS.TXT, SCHEMA-COLLATE.XML, SOLRCONFIG-SPELLCHECKER.XML, SOLRCONFIG-SLAVE.XML, SCHEMA-LMJELINEKMERCER.XML, SCHEMA-PHRASESUGGEST.XML, SOLRCONFIG-SPELLCHECKCOMPONENT.XML, BAD_SOLRCONFIG.XML, XSLT, HUNSPELL-TEST.DIC, MISSING.FUNCTIONS.UPDATEPROCESSOR.JS, SCHEMA-SIM.XML, TRIVIAL.UPDATEPROCESSOR1.JS, SOLRCONFIG-HIGHLIGHT.XML, THROW.ERROR.ON.ADD.UPDATEPROCESSOR.JS, SCHEMASURROUND.XML, SOLRCONFIG_CODEC.XML, SOLRCONFIG-TERMINDEX.XML, SCHEMA-LMDIRICHLET.XML, BAD-SCHEMA-NONTEXT-ANALYZER.XML, SCHEMA-COPYFIELD-TEST.XML, SOLRCONFIG-XINCLUDE.XML, KEEP-1.TXT, BAD-SOLRCONFIG-BOGUS-SCRIPTENGINE-NAME.XML, BAD-SCHEMA-OMIT-TF-BUT-NOT-POS.XML, SOLRCONFIG-MASTER1.XML, BAD-SCHEMA-UNIQUEKEY-USES-DEFAULT.XML, FRENCHARTICLES.TXT, SCHEMA12.XML, SCHEMA15.XML, SCHEMA-MINIMAL.XML, SOLRCONFIG-DELPOLICY2.XML, SOLRCONFIG-CACHING.XML, STOPTYPES-2.TXT, SOLRCONFIG-BASIC-LUCENEVERSION31.XML, CONDITIONAL.UPDATEPROCESSOR.JS, SOLRCONFIG-MASTER1-KEEPONEBACKUP.XML, SCHEMA-NOT-REQUIRED-UNIQUE-KEY.XML]
[junit4:junit4]   2> 699 T381 oass.SolrIndexSearcher.<init> Opening Searcher@e5d47 main
[junit4:junit4]   2> 699 T381 oass.SolrIndexSearcher.getIndexDir WARNING WARNING: Directory impl does not support setting indexDir: org.apache.lucene.store.MockDirectoryWrapper
[junit4:junit4]   2> 699 T381 oasu.CommitTracker.<init> Hard AutoCommit: disabled
[junit4:junit4]   2> 699 T381 oasu.CommitTracker.<init> Soft AutoCommit: disabled
[junit4:junit4]   2> 700 T381 oashc.QueryElevationComponent.inform Loading QueryElevation from: /mnt/ssd/jenkins/workspace/Lucene-Solr-4.x-Linux/checkout/solr/build/solr-core/test-files/solr/collection1/conf/elevate.xml
[junit4:junit4]   2> 713 T381 oashc.QueryElevationComponent.inform Loading QueryElevation from: /mnt/ssd/jenkins/workspace/Lucene-Solr-4.x-Linux/checkout/solr/build/solr-core/test-files/solr/collection1/conf/elevate.xml
[junit4:junit4]   2> 720 T381 oashc.HttpShardHandlerFactory.getParameter Setting socketTimeout to: 0
[junit4:junit4]   2> 720 T381 oashc.HttpShardHandlerFactory.getParameter Setting urlScheme to: http://
[junit4:junit4]   2> 720 T381 oashc.HttpShardHandlerFactory.getParameter Setting connTimeout to: 0
[junit4:junit4]   2> 720 T381 oashc.HttpShardHandlerFactory.getParameter Setting maxConnectionsPerHost to: 20
[junit4:junit4]   2> 721 T381 oashc.HttpShardHandlerFactory.getParameter Setting corePoolSize to: 0
[junit4:junit4]   2> 721 T381 oashc.HttpShardHandlerFactory.getParameter Setting maximumPoolSize to: 2147483647
[junit4:junit4]   2> 721 T381 oashc.HttpShardHandlerFactory.getParameter Setting maxThreadIdleTime to: 5
[junit4:junit4]   2> 721 T381 oashc.HttpShardHandlerFactory.getParameter Setting sizeOfQueue to: -1
[junit4:junit4]   2> 722 T381 oashc.HttpShardHandlerFactory.getParameter Setting fairnessPolicy to: false
[junit4:junit4]   2> 722 T381 oascsi.HttpClientUtil.createClient Creating new http client, config:maxConnectionsPerHost=20&maxConnections=10000&socketTimeout=0&connTimeout=0&retry=false
[junit4:junit4]   2> 725 T401 oasc.SolrCore.registerSearcher [collection1] Registered new searcher Searcher@e5d47 main{StandardDirectoryReader(segments_1:1)}
[junit4:junit4]   2> 725 T381 oasc.CoreContainer.register registering core: collection1
[junit4:junit4]   2> 725 T381 oass.SolrDispatchFilter.init user.dir=/mnt/ssd/jenkins/workspace/Lucene-Solr-4.x-Linux/checkout/solr/build/solr-core/test/J1
[junit4:junit4]   2> 725 T381 oass.SolrDispatchFilter.init SolrDispatchFilter.init() done
[junit4:junit4]   2> 726 T381 oascsi.HttpClientUtil.createClient Creating new http client, config:maxConnections=128&maxConnectionsPerHost=32&followRedirects=false
[junit4:junit4]   2> 728 T381 oejs.Server.doStart jetty-8.1.2.v20120308
[junit4:junit4]   2> 730 T381 oejs.AbstractConnector.doStart Started SocketConnector@0.0.0.0:46378
[junit4:junit4]   2> 730 T381 oasc.SolrResourceLoader.locateSolrHome JNDI not configured for solr (NoInitialContextEx)
[junit4:junit4]   2> 731 T381 oasc.SolrResourceLoader.locateSolrHome using system property solr.solr.home: /mnt/ssd/jenkins/workspace/Lucene-Solr-4.x-Linux/checkout/solr/build/solr-core/test-files/solr
[junit4:junit4]   2> 731 T381 oasc.SolrResourceLoader.<init> new SolrResourceLoader for deduced Solr Home: '/mnt/ssd/jenkins/workspace/Lucene-Solr-4.x-Linux/checkout/solr/build/solr-core/test-files/solr/'
[junit4:junit4]   2> 742 T381 oass.SolrDispatchFilter.init SolrDispatchFilter.init()
[junit4:junit4]   2> 742 T381 oasc.SolrResourceLoader.locateSolrHome JNDI not configured for solr (NoInitialContextEx)
[junit4:junit4]   2> 743 T381 oasc.SolrResourceLoader.locateSolrHome using system property solr.solr.home: /mnt/ssd/jenkins/workspace/Lucene-Solr-4.x-Linux/checkout/solr/build/solr-core/test-files/solr
[junit4:junit4]   2> 743 T381 oasc.CoreContainer$Initializer.initialize looking for solr.xml: /mnt/ssd/jenkins/workspace/Lucene-Solr-4.x-Linux/checkout/solr/build/solr-core/test-files/solr/solr.xml
[junit4:junit4]   2> 743 T381 oasc.CoreContainer.<init> New CoreContainer 20931858
[junit4:junit4]   2> 744 T381 oasc.CoreContainer.load Loading CoreContainer using Solr Home: '/mnt/ssd/jenkins/workspace/Lucene-Solr-4.x-Linux/checkout/solr/build/solr-core/test-files/solr/'
[junit4:junit4]   2> 744 T381 oasc.SolrResourceLoader.<init> new SolrResourceLoader for directory: '/mnt/ssd/jenkins/workspace/Lucene-Solr-4.x-Linux/checkout/solr/build/solr-core/test-files/solr/'
[junit4:junit4]   2> 758 T381 oasc.CoreContainer.load Registering Log Listener
[junit4:junit4]   2> 778 T381 oasc.CoreContainer.create Creating SolrCore 'collection1' using instanceDir: /mnt/ssd/jenkins/workspace/Lucene-Solr-4.x-Linux/checkout/solr/build/solr-core/test-files/solr/collection1
[junit4:junit4]   2> 779 T381 oasc.SolrResourceLoader.<init> new SolrResourceLoader for directory: '/mnt/ssd/jenkins/workspace/Lucene-Solr-4.x-Linux/checkout/solr/build/solr-core/test-files/solr/collection1/'
[junit4:junit4]   2> 780 T381 oasc.SolrResourceLoader.replaceClassLoader Adding 'file:/mnt/ssd/jenkins/workspace/Lucene-Solr-4.x-Linux/checkout/solr/build/solr-core/test-files/solr/collection1/lib/README' to classloader
[junit4:junit4]   2> 780 T381 oasc.SolrResourceLoader.replaceClassLoader Adding 'file:/mnt/ssd/jenkins/workspace/Lucene-Solr-4.x-Linux/checkout/solr/build/solr-core/test-files/solr/collection1/lib/classes/' to classloader
[junit4:junit4]   2> 809 T381 oasc.SolrConfig.<init> Using Lucene MatchVersion: LUCENE_40
[junit4:junit4]   2> 868 T381 oasc.SolrConfig.<init> Loaded SolrConfig: solrconfig-elevate.xml
[junit4:junit4]   2> 869 T381 oass.IndexSchema.readSchema Reading Solr Schema
[junit4:junit4]   2> 873 T381 oass.IndexSchema.readSchema Schema name=example
[junit4:junit4]   2> 1114 T381 oass.IndexSchema.readSchema default search field in schema is text
[junit4:junit4]   2> 1117 T381 oass.IndexSchema.readSchema unique key field: id
[junit4:junit4]   2> 1120 T381 oasc.SolrCore.<init> [collection1] Opening new SolrCore at /mnt/ssd/jenkins/workspace/Lucene-Solr-4.x-Linux/checkout/solr/build/solr-core/test-files/solr/collection1/, dataDir=./org.apache.solr.handler.component.DistributedQueryElevationComponentTest-1343894326301/shard1/data/
[junit4:junit4]   2> 1120 T381 oasc.JmxMonitoredMap.<init> JMX monitoring is enabled. Adding Solr mbeans to JMX Server: com.sun.jmx.mbeanserver.JmxMBeanServer@664140
[junit4:junit4]   2> 1121 T381 oasc.SolrCore.getNewIndexDir WARNING New index directory detected: old=null new=./org.apache.solr.handler.component.DistributedQueryElevationComponentTest-1343894326301/shard1/data/index/
[junit4:junit4]   2> 1121 T381 oasc.SolrCore.initIndex WARNING [collection1] Solr index directory './org.apache.solr.handler.component.DistributedQueryElevationComponentTest-1343894326301/shard1/data/index' doesn't exist. Creating new index...
[junit4:junit4]   2> 1123 T381 oasc.SolrDeletionPolicy.onCommit SolrDeletionPolicy.onCommit: commits:num=1
[junit4:junit4]   2> 		commit{dir=MockDirWrapper(org.apache.lucene.store.RAMDirectory@aebd86 lockFactory=org.apache.lucene.store.SingleInstanceLockFactory@16331be),segFN=segments_1,generation=1,filenames=[segments_1]
[junit4:junit4]   2> 1123 T381 oasc.SolrDeletionPolicy.updateCommits newest commit = 1
[junit4:junit4]   2> 1125 T381 oasc.RequestHandlers.initHandlersFromConfig created /update: solr.UpdateRequestHandler
[junit4:junit4]   2> 1125 T381 oasc.RequestHandlers.initHandlersFromConfig created /elevate: org.apache.solr.handler.component.SearchHandler
[junit4:junit4]   2> 1125 T381 oasc.RequestHandlers.initHandlersFromConfig created /dataElevate: org.apache.solr.handler.component.SearchHandler
[junit4:junit4]   2> 1126 T381 oashl.XMLLoader.init xsltCacheLifetimeSeconds=60
[junit4:junit4]   2> 1127 T381 oasc.RequestHandlers.initHandlersFromConfig WARNING no default request handler is registered (either '/select' or 'standard')
[junit4:junit4]   2> 1128 T381 oasc.SolrCore.initDeprecatedSupport WARNING solrconfig.xml uses deprecated <admin/gettableFiles>, Please update your config to use the ShowFileRequestHandler.
[junit4:junit4]   2> 1130 T381 oasc.SolrCore.initDeprecatedSupport WARNING adding ShowFileRequestHandler with hidden files: [DA_UTF8.XML, SCHEMA_CODEC.XML, STOP-2.TXT, SOLRCONFIG-SCRIPT-UPDATEPROCESSOR.XML, BAD-SOLRCONFIG-MISSING-SCRIPTFILE.XML, SOLRCONFIG-DELPOLICY1.XML, BAD-SCHEMA-NOT-INDEXED-BUT-NORMS.XML, SOLRCONFIG-SOLCOREPROPERTIES.XML, HYPHENATION.DTD, SOLRCONFIG-QUERYSENDER.XML, SOLRCONFIG-QUERYSENDER-NOQUERY.XML, SOLRCONFIG-TRANSFORMERS.XML, KEEP-2.TXT, COMPOUNDDICTIONARY.TXT, SCHEMA-TFIDF.XML, SCHEMA-NUMERIC.XML, SOLRCONFIG-PROPINJECT.XML, SOLRCONFIG-MASTER3.XML, BAD-SCHEMA-SIM-GLOBAL-VS-FT-MISMATCH.XML, SCHEMA11.XML, SCHEMA-LUCENEMATCHVERSION.XML, HUNSPELL-TEST.AFF, SOLRCONFIG-PHRASESUGGEST.XML, SCHEMA-TRIE.XML, TRIVIAL.UPDATEPROCESSOR0.JS, BAD-SCHEMA-DUP-DYNAMICFIELD.XML, SOLRCONFIG-REQHANDLER.INCL, SOLRCONFIG_PERF.XML, SOLRCONFIG-ALTDIRECTORY.XML, SCHEMA-REVERSED.XML, BAD-SCHEMA-NOT-INDEXED-BUT-POS.XML, SCHEMA-REQUIRED-FIELDS.XML, BAD-SCHEMA-DUP-FIELDTYPE.XML, STOPTYPES-1.TXT, SOLRCONFIG-LAZYWRITER.XML, SOLRCONFIG-MASTER2.XML, SOLRCONFIG-NOCACHE.XML, SOLRCONFIG-TLOG.XML, STOP-1.TXT, CURRENCY.XML, OLD_SYNONYMS.TXT, SOLRCONFIG-REPEATER.XML, BAD-SCHEMA-CODEC-GLOBAL-VS-FT-MISMATCH.XML, BAD-SCHEMA-NOT-INDEXED-BUT-TF.XML, SCHEMA.XML, SCHEMA-SPELLCHECKER.XML, SCHEMA-CHARFILTERS.XML, SCHEMA-BINARYFIELD.XML, BAD-SCHEMA-UNIQUEKEY-MULTIVALUED.XML, SOLRCONFIG-SLAVE1.XML, BAD-SOLRCONFIG-INVALID-SCRIPTFILE.XML, PHRASESUGGEST.TXT, SCHEMA-STOP-KEEP.XML, SOLRCONFIG-UPDATE-PROCESSOR-CHAINS.XML, SOLRCONFIG-PROPINJECT-INDEXDEFAULT.XML, SOLRCONFIG-SOLR-749.XML, ADDFIELDS.UPDATEPROCESSOR.JS, STOP-SNOWBALL.TXT, ELEVATE.XML, BAD-SCHEMA-UNIQUEKEY-IS-COPYFIELD-DEST.XML, OPEN-EXCHANGE-RATES.JSON, SOLRCONFIG-NATIVELOCK.XML, STEMDICT.TXT, BAD-SCHEMA-DUP-FIELD.XML, SOLRCONFIG-BASIC.XML, SCHEMA-REPLICATION2.XML, MAPPING-ISOLATIN1ACCENT.TXT, SOLRCONFIG-SIMPLELOCK.XML, SCHEMA-FOLDING.XML, SCHEMA-REPLICATION1.XML, STOPWITHBOM.TXT, SOLRCONFIG-ELEVATE.XML, WDFTYPES.TXT, BAD-SCHEMA-EXTERNAL-FILEFIELD.XML, STOPWORDS.TXT, SOLRCONFIG-FUNCTIONQUERY.XML, SCHEMA-BM25.XML, SCHEMA-DFR.XML, SOLRCONFIG-ENABLEPLUGIN.XML, STOPWORDSWRONGENCODING.TXT, SOLRCONFIG-MERGEPOLICY.XML, SYNONYMS.TXT, DA_COMPOUNDDICTIONARY.TXT, BAD-MP-SOLRCONFIG.XML, SCHEMA-IB.XML, SOLRCONFIG-MASTER.XML, BAD-SCHEMA-ANALYZER-CLASS-AND-NESTED.XML, MISSLEADING.EXTENSION.UPDATEPROCESSOR.JS.TXT, SCHEMA-COLLATEFILTER.XML, PROTWORDS.TXT, SCHEMA-COLLATE.XML, SOLRCONFIG-SPELLCHECKER.XML, SOLRCONFIG-SLAVE.XML, SCHEMA-LMJELINEKMERCER.XML, SCHEMA-PHRASESUGGEST.XML, SOLRCONFIG-SPELLCHECKCOMPONENT.XML, BAD_SOLRCONFIG.XML, XSLT, HUNSPELL-TEST.DIC, MISSING.FUNCTIONS.UPDATEPROCESSOR.JS, SCHEMA-SIM.XML, TRIVIAL.UPDATEPROCESSOR1.JS, SOLRCONFIG-HIGHLIGHT.XML, THROW.ERROR.ON.ADD.UPDATEPROCESSOR.JS, SCHEMASURROUND.XML, SOLRCONFIG_CODEC.XML, SOLRCONFIG-TERMINDEX.XML, SCHEMA-LMDIRICHLET.XML, BAD-SCHEMA-NONTEXT-ANALYZER.XML, SCHEMA-COPYFIELD-TEST.XML, SOLRCONFIG-XINCLUDE.XML, KEEP-1.TXT, BAD-SOLRCONFIG-BOGUS-SCRIPTENGINE-NAME.XML, BAD-SCHEMA-OMIT-TF-BUT-NOT-POS.XML, SOLRCONFIG-MASTER1.XML, BAD-SCHEMA-UNIQUEKEY-USES-DEFAULT.XML, FRENCHARTICLES.TXT, SCHEMA12.XML, SCHEMA15.XML, SCHEMA-MINIMAL.XML, SOLRCONFIG-DELPOLICY2.XML, SOLRCONFIG-CACHING.XML, STOPTYPES-2.TXT, SOLRCONFIG-BASIC-LUCENEVERSION31.XML, CONDITIONAL.UPDATEPROCESSOR.JS, SOLRCONFIG-MASTER1-KEEPONEBACKUP.XML, SCHEMA-NOT-REQUIRED-UNIQUE-KEY.XML]
[junit4:junit4]   2> 1133 T381 oass.SolrIndexSearcher.<init> Opening Searcher@1308a29 main
[junit4:junit4]   2> 1133 T381 oass.SolrIndexSearcher.getIndexDir WARNING WARNING: Directory impl does not support setting indexDir: org.apache.lucene.store.MockDirectoryWrapper
[junit4:junit4]   2> 1134 T381 oasu.CommitTracker.<init> Hard AutoCommit: disabled
[junit4:junit4]   2> 1134 T381 oasu.CommitTracker.<init> Soft AutoCommit: disabled
[junit4:junit4]   2> 1135 T381 oashc.QueryElevationComponent.inform Loading QueryElevation from: /mnt/ssd/jenkins/workspace/Lucene-Solr-4.x-Linux/checkout/solr/build/solr-core/test-files/solr/collection1/conf/elevate.xml
[junit4:junit4]   2> 1143 T381 oashc.QueryElevationComponent.inform Loading QueryElevation from: /mnt/ssd/jenkins/workspace/Lucene-Solr-4.x-Linux/checkout/solr/build/solr-core/test-files/solr/collection1/conf/elevate.xml
[junit4:junit4]   2> 1159 T381 oashc.HttpShardHandlerFactory.getParameter Setting socketTimeout to: 0
[junit4:junit4]   2> 1159 T381 oashc.HttpShardHandlerFactory.getParameter Setting urlScheme to: http://
[junit4:junit4]   2> 1159 T381 oashc.HttpShardHandlerFactory.getParameter Setting connTimeout to: 0
[junit4:junit4]   2> 1159 T381 oashc.HttpShardHandlerFactory.getParameter Setting maxConnectionsPerHost to: 20
[junit4:junit4]   2> 1160 T381 oashc.HttpShardHandlerFactory.getParameter Setting corePoolSize to: 0
[junit4:junit4]   2> 1160 T381 oashc.HttpShardHandlerFactory.getParameter Setting maximumPoolSize to: 2147483647
[junit4:junit4]   2> 1160 T381 oashc.HttpShardHandlerFactory.getParameter Setting maxThreadIdleTime to: 5
[junit4:junit4]   2> 1160 T381 oashc.HttpShardHandlerFactory.getParameter Setting sizeOfQueue to: -1
[junit4:junit4]   2> 1160 T381 oashc.HttpShardHandlerFactory.getParameter Setting fairnessPolicy to: false
[junit4:junit4]   2> 1161 T381 oascsi.HttpClientUtil.createClient Creating new http client, config:maxConnectionsPerHost=20&maxConnections=10000&socketTimeout=0&connTimeout=0&retry=false
[junit4:junit4]   2> 1165 T411 oasc.SolrCore.registerSearcher [collection1] Registered new searcher Searcher@1308a29 main{StandardDirectoryReader(segments_1:1)}
[junit4:junit4]   2> 1165 T381 oasc.CoreContainer.register registering core: collection1
[junit4:junit4]   2> 1165 T381 oass.SolrDispatchFilter.init user.dir=/mnt/ssd/jenkins/workspace/Lucene-Solr-4.x-Linux/checkout/solr/build/solr-core/test/J1
[junit4:junit4]   2> 1165 T381 oass.SolrDispatchFilter.init SolrDispatchFilter.init() done
[junit4:junit4]   2> 1166 T381 oascsi.HttpClientUtil.createClient Creating new http client, config:maxConnections=128&maxConnectionsPerHost=32&followRedirects=false
[junit4:junit4]   2> 1169 T381 oejs.Server.doStart jetty-8.1.2.v20120308
[junit4:junit4]   2> 1171 T381 oejs.AbstractConnector.doStart Started SocketConnector@0.0.0.0:34075
[junit4:junit4]   2> 1172 T381 oasc.SolrResourceLoader.locateSolrHome JNDI not configured for solr (NoInitialContextEx)
[junit4:junit4]   2> 1172 T381 oasc.SolrResourceLoader.locateSolrHome using system property solr.solr.home: /mnt/ssd/jenkins/workspace/Lucene-Solr-4.x-Linux/checkout/solr/build/solr-core/test-files/solr
[junit4:junit4]   2> 1172 T381 oasc.SolrResourceLoader.<init> new SolrResourceLoader for deduced Solr Home: '/mnt/ssd/jenkins/workspace/Lucene-Solr-4.x-Linux/checkout/solr/build/solr-core/test-files/solr/'
[junit4:junit4]   2> 1183 T381 oass.SolrDispatchFilter.init SolrDispatchFilter.init()
[junit4:junit4]   2> 1183 T381 oasc.SolrResourceLoader.locateSolrHome JNDI not configured for solr (NoInitialContextEx)
[junit4:junit4]   2> 1183 T381 oasc.SolrResourceLoader.locateSolrHome using system property solr.solr.home: /mnt/ssd/jenkins/workspace/Lucene-Solr-4.x-Linux/checkout/solr/build/solr-core/test-files/solr
[junit4:junit4]   2> 1183 T381 oasc.CoreContainer$Initializer.initialize looking for solr.xml: /mnt/ssd/jenkins/workspace/Lucene-Solr-4.x-Linux/checkout/solr/build/solr-core/test-files/solr/solr.xml
[junit4:junit4]   2> 1184 T381 oasc.CoreContainer.<init> New CoreContainer 21045912
[junit4:junit4]   2> 1184 T381 oasc.CoreContainer.load Loading CoreContainer using Solr Home: '/mnt/ssd/jenkins/workspace/Lucene-Solr-4.x-Linux/checkout/solr/build/solr-core/test-files/solr/'
[junit4:junit4]   2> 1184 T381 oasc.SolrResourceLoader.<init> new SolrResourceLoader for directory: '/mnt/ssd/jenkins/workspace/Lucene-Solr-4.x-Linux/checkout/solr/build/solr-core/test-files/solr/'
[junit4:junit4]   2> 1198 T381 oasc.CoreContainer.load Registering Log Listener
[junit4:junit4]   2> 1214 T381 oasc.CoreContainer.create Creating SolrCore 'collection1' using instanceDir: /mnt/ssd/jenkins/workspace/Lucene-Solr-4.x-Linux/checkout/solr/build/solr-core/test-files/solr/collection1
[junit4:junit4]   2> 1215 T381 oasc.SolrResourceLoader.<init> new SolrResourceLoader for directory: '/mnt/ssd/jenkins/workspace/Lucene-Solr-4.x-Linux/checkout/solr/build/solr-core/test-files/solr/collection1/'
[junit4:junit4]   2> 1215 T381 oasc.SolrResourceLoader.replaceClassLoader Adding 'file:/mnt/ssd/jenkins/workspace/Lucene-Solr-4.x-Linux/checkout/solr/build/solr-core/test-files/solr/collection1/lib/README' to classloader
[junit4:junit4]   2> 1215 T381 oasc.SolrResourceLoader.replaceClassLoader Adding 'file:/mnt/ssd/jenkins/workspace/Lucene-Solr-4.x-Linux/checkout/solr/build/solr-core/test-files/solr/collection1/lib/classes/' to classloader
[junit4:junit4]   2> 1247 T381 oasc.SolrConfig.<init> Using Lucene MatchVersion: LUCENE_40
[junit4:junit4]   2> 1289 T381 oasc.SolrConfig.<init> Loaded SolrConfig: solrconfig-elevate.xml
[junit4:junit4]   2> 1290 T381 oass.IndexSchema.readSchema Reading Solr Schema
[junit4:junit4]   2> 1293 T381 oass.IndexSchema.readSchema Schema name=example
[junit4:junit4]   2> 1478 T381 oass.IndexSchema.readSchema default search field in schema is text
[junit4:junit4]   2> 1480 T381 oass.IndexSchema.readSchema unique key field: id
[junit4:junit4]   2> 1483 T381 oasc.SolrCore.<init> [collection1] Opening new SolrCore at /mnt/ssd/jenkins/workspace/Lucene-Solr-4.x-Linux/checkout/solr/build/solr-core/test-files/solr/collection1/, dataDir=./org.apache.solr.handler.component.DistributedQueryElevationComponentTest-1343894326301/shard2/data/
[junit4:junit4]   2> 1483 T381 oasc.JmxMonitoredMap.<init> JMX monitoring is enabled. Adding Solr mbeans to JMX Server: com.sun.jmx.mbeanserver.JmxMBeanServer@664140
[junit4:junit4]   2> 1483 T381 oasc.SolrCore.getNewIndexDir WARNING New index directory detected: old=null new=./org.apache.solr.handler.component.DistributedQueryElevationComponentTest-1343894326301/shard2/data/index/
[junit4:junit4]   2> 1484 T381 oasc.SolrCore.initIndex WARNING [collection1] Solr index directory './org.apache.solr.handler.component.DistributedQueryElevationComponentTest-1343894326301/shard2/data/index' doesn't exist. Creating new index...
[junit4:junit4]   2> 1485 T381 oasc.SolrDeletionPolicy.onCommit SolrDeletionPolicy.onCommit: commits:num=1
[junit4:junit4]   2> 		commit{dir=MockDirWrapper(org.apache.lucene.store.RAMDirectory@1e7616c lockFactory=org.apache.lucene.store.SingleInstanceLockFactory@136eed3),segFN=segments_1,generation=1,filenames=[segments_1]
[junit4:junit4]   2> 1485 T381 oasc.SolrDeletionPolicy.updateCommits newest commit = 1
[junit4:junit4]   2> 1486 T381 oasc.RequestHandlers.initHandlersFromConfig created /update: solr.UpdateRequestHandler
[junit4:junit4]   2> 1486 T381 oasc.RequestHandlers.initHandlersFromConfig created /elevate: org.apache.solr.handler.component.SearchHandler
[junit4:junit4]   2> 1487 T381 oasc.RequestHandlers.initHandlersFromConfig created /dataElevate: org.apache.solr.handler.component.SearchHandler
[junit4:junit4]   2> 1487 T381 oashl.XMLLoader.init xsltCacheLifetimeSeconds=60
[junit4:junit4]   2> 1487 T381 oasc.RequestHandlers.initHandlersFromConfig WARNING no default request handler is registered (either '/select' or 'standard')
[junit4:junit4]   2> 1488 T381 oasc.SolrCore.initDeprecatedSupport WARNING solrconfig.xml uses deprecated <admin/gettableFiles>, Please update your config to use the ShowFileRequestHandler.
[junit4:junit4]   2> 1489 T381 oasc.SolrCore.initDeprecatedSupport WARNING adding ShowFileRequestHandler with hidden files: [DA_UTF8.XML, SCHEMA_CODEC.XML, STOP-2.TXT, SOLRCONFIG-SCRIPT-UPDATEPROCESSOR.XML, BAD-SOLRCONFIG-MISSING-SCRIPTFILE.XML, SOLRCONFIG-DELPOLICY1.XML, BAD-SCHEMA-NOT-INDEXED-BUT-NORMS.XML, SOLRCONFIG-SOLCOREPROPERTIES.XML, HYPHENATION.DTD, SOLRCONFIG-QUERYSENDER.XML, SOLRCONFIG-QUERYSENDER-NOQUERY.XML, SOLRCONFIG-TRANSFORMERS.XML, KEEP-2.TXT, COMPOUNDDICTIONARY.TXT, SCHEMA-TFIDF.XML, SCHEMA-NUMERIC.XML, SOLRCONFIG-PROPINJECT.XML, SOLRCONFIG-MASTER3.XML, BAD-SCHEMA-SIM-GLOBAL-VS-FT-MISMATCH.XML, SCHEMA11.XML, SCHEMA-LUCENEMATCHVERSION.XML, HUNSPELL-TEST.AFF, SOLRCONFIG-PHRASESUGGEST.XML, SCHEMA-TRIE.XML, TRIVIAL.UPDATEPROCESSOR0.JS, BAD-SCHEMA-DUP-DYNAMICFIELD.XML, SOLRCONFIG-REQHANDLER.INCL, SOLRCONFIG_PERF.XML, SOLRCONFIG-ALTDIRECTORY.XML, SCHEMA-REVERSED.XML, BAD-SCHEMA-NOT-INDEXED-BUT-POS.XML, SCHEMA-REQUIRED-FIELDS.XML, BAD-SCHEMA-DUP-FIELDTYPE.XML, STOPTYPES-1.TXT, SOLRCONFIG-LAZYWRITER.XML, SOLRCONFIG-MASTER2.XML, SOLRCONFIG-NOCACHE.XML, SOLRCONFIG-TLOG.XML, STOP-1.TXT, CURRENCY.XML, OLD_SYNONYMS.TXT, SOLRCONFIG-REPEATER.XML, BAD-SCHEMA-CODEC-GLOBAL-VS-FT-MISMATCH.XML, BAD-SCHEMA-NOT-INDEXED-BUT-TF.XML, SCHEMA.XML, SCHEMA-SPELLCHECKER.XML, SCHEMA-CHARFILTERS.XML, SCHEMA-BINARYFIELD.XML, BAD-SCHEMA-UNIQUEKEY-MULTIVALUED.XML, SOLRCONFIG-SLAVE1.XML, BAD-SOLRCONFIG-INVALID-SCRIPTFILE.XML, PHRASESUGGEST.TXT, SCHEMA-STOP-KEEP.XML, SOLRCONFIG-UPDATE-PROCESSOR-CHAINS.XML, SOLRCONFIG-PROPINJECT-INDEXDEFAULT.XML, SOLRCONFIG-SOLR-749.XML, ADDFIELDS.UPDATEPROCESSOR.JS, STOP-SNOWBALL.TXT, ELEVATE.XML, BAD-SCHEMA-UNIQUEKEY-IS-COPYFIELD-DEST.XML, OPEN-EXCHANGE-RATES.JSON, SOLRCONFIG-NATIVELOCK.XML, STEMDICT.TXT, BAD-SCHEMA-DUP-FIELD.XML, SOLRCONFIG-BASIC.XML, SCHEMA-REPLICATION2.XML, MAPPING-ISOLATIN1ACCENT.TXT, SOLRCONFIG-SIMPLELOCK.XML, SCHEMA-FOLDING.XML, SCHEMA-REPLICATION1.XML, STOPWITHBOM.TXT, SOLRCONFIG-ELEVATE.XML, WDFTYPES.TXT, BAD-SCHEMA-EXTERNAL-FILEFIELD.XML, STOPWORDS.TXT, SOLRCONFIG-FUNCTIONQUERY.XML, SCHEMA-BM25.XML, SCHEMA-DFR.XML, SOLRCONFIG-ENABLEPLUGIN.XML, STOPWORDSWRONGENCODING.TXT, SOLRCONFIG-MERGEPOLICY.XML, SYNONYMS.TXT, DA_COMPOUNDDICTIONARY.TXT, BAD-MP-SOLRCONFIG.XML, SCHEMA-IB.XML, SOLRCONFIG-MASTER.XML, BAD-SCHEMA-ANALYZER-CLASS-AND-NESTED.XML, MISSLEADING.EXTENSION.UPDATEPROCESSOR.JS.TXT, SCHEMA-COLLATEFILTER.XML, PROTWORDS.TXT, SCHEMA-COLLATE.XML, SOLRCONFIG-SPELLCHECKER.XML, SOLRCONFIG-SLAVE.XML, SCHEMA-LMJELINEKMERCER.XML, SCHEMA-PHRASESUGGEST.XML, SOLRCONFIG-SPELLCHECKCOMPONENT.XML, BAD_SOLRCONFIG.XML, XSLT, HUNSPELL-TEST.DIC, MISSING.FUNCTIONS.UPDATEPROCESSOR.JS, SCHEMA-SIM.XML, TRIVIAL.UPDATEPROCESSOR1.JS, SOLRCONFIG-HIGHLIGHT.XML, THROW.ERROR.ON.ADD.UPDATEPROCESSOR.JS, SCHEMASURROUND.XML, SOLRCONFIG_CODEC.XML, SOLRCONFIG-TERMINDEX.XML, SCHEMA-LMDIRICHLET.XML, BAD-SCHEMA-NONTEXT-ANALYZER.XML, SCHEMA-COPYFIELD-TEST.XML, SOLRCONFIG-XINCLUDE.XML, KEEP-1.TXT, BAD-SOLRCONFIG-BOGUS-SCRIPTENGINE-NAME.XML, BAD-SCHEMA-OMIT-TF-BUT-NOT-POS.XML, SOLRCONFIG-MASTER1.XML, BAD-SCHEMA-UNIQUEKEY-USES-DEFAULT.XML, FRENCHARTICLES.TXT, SCHEMA12.XML, SCHEMA15.XML, SCHEMA-MINIMAL.XML, SOLRCONFIG-DELPOLICY2.XML, SOLRCONFIG-CACHING.XML, STOPTYPES-2.TXT, SOLRCONFIG-BASIC-LUCENEVERSION31.XML, CONDITIONAL.UPDATEPROCESSOR.JS, SOLRCONFIG-MASTER1-KEEPONEBACKUP.XML, SCHEMA-NOT-REQUIRED-UNIQUE-KEY.XML]
[junit4:junit4]   2> 1491 T381 oass.SolrIndexSearcher.<init> Opening Searcher@129bb3f main
[junit4:junit4]   2> 1492 T381 oass.SolrIndexSearcher.getIndexDir WARNING WARNING: Directory impl does not support setting indexDir: org.apache.lucene.store.MockDirectoryWrapper
[junit4:junit4]   2> 1492 T381 oasu.CommitTracker.<init> Hard AutoCommit: disabled
[junit4:junit4]   2> 1492 T381 oasu.CommitTracker.<init> Soft AutoCommit: disabled
[junit4:junit4]   2> 1493 T381 oashc.QueryElevationComponent.inform Loading QueryElevation from: /mnt/ssd/jenkins/workspace/Lucene-Solr-4.x-Linux/checkout/solr/build/solr-core/test-files/solr/collection1/conf/elevate.xml
[junit4:junit4]   2> 1500 T381 oashc.QueryElevationComponent.inform Loading QueryElevation from: /mnt/ssd/jenkins/workspace/Lucene-Solr-4.x-Linux/checkout/solr/build/solr-core/test-files/solr/collection1/conf/elevate.xml
[junit4:junit4]   2> 1506 T381 oashc.HttpShardHandlerFactory.getParameter Setting socketTimeout to: 0
[junit4:junit4]   2> 1507 T381 oashc.HttpShardHandlerFactory.getParameter Setting urlScheme to: http://
[junit4:junit4]   2> 1507 T381 oashc.HttpShardHandlerFactory.getParameter Setting connTimeout to: 0
[junit4:junit4]   2> 1507 T381 oashc.HttpShardHandlerFactory.getParameter Setting maxConnectionsPerHost to: 20
[junit4:junit4]   2> 1507 T381 oashc.HttpShardHandlerFactory.getParameter Setting corePoolSize to: 0
[junit4:junit4]   2> 1508 T381 oashc.HttpShardHandlerFactory.getParameter Setting maximumPoolSize to: 2147483647
[junit4:junit4]   2> 1508 T381 oashc.HttpShardHandlerFactory.getParameter Setting maxThreadIdleTime to: 5
[junit4:junit4]   2> 1508 T381 oashc.HttpShardHandlerFactory.getParameter Setting sizeOfQueue to: -1
[junit4:junit4]   2> 1508 T381 oashc.HttpShardHandlerFactory.getParameter Setting fairnessPolicy to: false
[junit4:junit4]   2> 1509 T381 oascsi.HttpClientUtil.createClient Creating new http client, config:maxConnectionsPerHost=20&maxConnections=10000&socketTimeout=0&connTimeout=0&retry=false
[junit4:junit4]   2> 1511 T421 oasc.SolrCore.registerSearcher [collection1] Registered new searcher Searcher@129bb3f main{StandardDirectoryReader(segments_1:1)}
[junit4:junit4]   2> 1511 T381 oasc.CoreContainer.register registering core: collection1
[junit4:junit4]   2> 1512 T381 oass.SolrDispatchFilter.init user.dir=/mnt/ssd/jenkins/workspace/Lucene-Solr-4.x-Linux/checkout/solr/build/solr-core/test/J1
[junit4:junit4]   2> 1512 T381 oass.SolrDispatchFilter.init SolrDispatchFilter.init() done
[junit4:junit4]   2> 1512 T381 oascsi.HttpClientUtil.createClient Creating new http client, config:maxConnections=128&maxConnectionsPerHost=32&followRedirects=false
[junit4:junit4]   2> ASYNC  NEW_CORE C29 name=collection1 org.apache.solr.core.SolrCore@130b7a0
[junit4:junit4]   2> 1519 T384 C29 oasu.DirectUpdateHandler2.deleteAll [collection1] REMOVING ALL DOCUMENTS FROM INDEX
[junit4:junit4]   2> 1521 T384 C29 oasc.SolrDeletionPolicy.onInit SolrDeletionPolicy.onInit: commits:num=1
[junit4:junit4]   2> 		commit{dir=BaseDirectoryWrapper(org.apache.lucene.store.RAMDirectory@6431a2 lockFactory=org.apache.lucene.store.SingleInstanceLockFactory@1f68a0f),segFN=segments_1,generation=1,filenames=[segments_1]
[junit4:junit4]   2> 1521 T384 C29 oasc.SolrDeletionPolicy.updateCommits newest commit = 1
[junit4:junit4]   2> 1521 T384 C29 UPDATE [collection1] webapp=/solr path=/update params={version=2&wt=javabin} {deleteByQuery=*:*} 0 2
[junit4:junit4]   2> ASYNC  NEW_CORE C30 name=collection1 org.apache.solr.core.SolrCore@198a311
[junit4:junit4]   2> 1546 T394 C30 oasu.DirectUpdateHandler2.deleteAll [collection1] REMOVING ALL DOCUMENTS FROM INDEX
[junit4:junit4]   2> 1548 T394 C30 oasc.SolrDeletionPolicy.onInit SolrDeletionPolicy.onInit: commits:num=1
[junit4:junit4]   2> 		commit{dir=MockDirWrapper(org.apache.lucene.store.RAMDirectory@1f9e533 lockFactory=org.apache.lucene.store.SingleInstanceLockFactory@1dce920),segFN=segments_1,generation=1,filenames=[segments_1]
[junit4:junit4]   2> 1549 T394 C30 oasc.SolrDeletionPolicy.updateCommits newest commit = 1
[junit4:junit4]   2> 1550 T394 C30 UPDATE [collection1] webapp=/solr path=/update params={version=2&wt=javabin} {deleteByQuery=*:*} 0 21
[junit4:junit4]   2> ASYNC  NEW_CORE C31 name=collection1 org.apache.solr.core.SolrCore@114d50a
[junit4:junit4]   2> 1561 T404 C31 oasu.DirectUpdateHandler2.deleteAll [collection1] REMOVING ALL DOCUMENTS FROM INDEX
[junit4:junit4]   2> 1564 T404 C31 oasc.SolrDeletionPolicy.onInit SolrDeletionPolicy.onInit: commits:num=1
[junit4:junit4]   2> 		commit{dir=MockDirWrapper(org.apache.lucene.store.RAMDirectory@aebd86 lockFactory=org.apache.lucene.store.SingleInstanceLockFactory@16331be),segFN=segments_1,generation=1,filenames=[segments_1]
[junit4:junit4]   2> 1565 T404 C31 oasc.SolrDeletionPolicy.updateCommits newest commit = 1
[junit4:junit4]   2> 1565 T404 C31 UPDATE [collection1] webapp=/solr path=/update params={version=2&wt=javabin} {deleteByQuery=*:*} 0 4
[junit4:junit4]   2> ASYNC  NEW_CORE C32 name=collection1 org.apache.solr.core.SolrCore@1008819
[junit4:junit4]   2> 1572 T414 C32 oasu.DirectUpdateHandler2.deleteAll [collection1] REMOVING ALL DOCUMENTS FROM INDEX
[junit4:junit4]   2> 1574 T414 C32 oasc.SolrDeletionPolicy.onInit SolrDeletionPolicy.onInit: commits:num=1
[junit4:junit4]   2> 		commit{dir=MockDirWrapper(org.apache.lucene.store.RAMDirectory@1e7616c lockFactory=org.apache.lucene.store.SingleInstanceLockFactory@136eed3),segFN=segments_1,generation=1,filenames=[segments_1]
[junit4:junit4]   2> 1575 T414 C32 oasc.SolrDeletionPolicy.updateCommits newest commit = 1
[junit4:junit4]   2> 1576 T414 C32 UPDATE [collection1] webapp=/solr path=/update params={version=2&wt=javabin} {deleteByQuery=*:*} 0 4
[junit4:junit4]   2> 1580 T384 C29 UPDATE [collection1] webapp=/solr path=/update params={version=2&wt=javabin} {add=[1]} 0 1
[junit4:junit4]   2> 1585 T394 C30 UPDATE [collection1] webapp=/solr path=/update params={version=2&wt=javabin} {add=[1]} 0 2
[junit4:junit4]   2> 1588 T384 C29 UPDATE [collection1] webapp=/solr path=/update params={version=2&wt=javabin} {add=[2]} 0 0
[junit4:junit4]   2> 1592 T404 C31 UPDATE [collection1] webapp=/solr path=/update params={version=2&wt=javabin} {add=[2]} 0 1
[junit4:junit4]   2> 1594 T384 C29 UPDATE [collection1] webapp=/solr path=/update params={version=2&wt=javabin} {add=[3]} 0 0
[junit4:junit4]   2> 1598 T414 C32 UPDATE [collection1] webapp=/solr path=/update params={version=2&wt=javabin} {add=[3]} 0 1
[junit4:junit4]   2> 1601 T384 C29 UPDATE [collection1] webapp=/solr path=/update params={version=2&wt=javabin} {add=[4]} 0 0
[junit4:junit4]   2> 1604 T394 C30 UPDATE [collection1] webapp=/solr path=/update params={version=2&wt=javabin} {add=[4]} 0 0
[junit4:junit4]   2> 1607 T384 C29 UPDATE [collection1] webapp=/solr path=/update params={version=2&wt=javabin} {add=[5]} 0 0
[junit4:junit4]   2> 1611 T404 C31 UPDATE [collection1] webapp=/solr path=/update params={version=2&wt=javabin} {add=[5]} 0 1
[junit4:junit4]   2> 1614 T384 C29 UPDATE [collection1] webapp=/solr path=/update params={version=2&wt=javabin} {add=[6]} 0 1
[junit4:junit4]   2> 1617 T414 C32 UPDATE [collection1] webapp=/solr path=/update params={version=2&wt=javabin} {add=[6]} 0 0
[junit4:junit4]   2> 1620 T384 C29 UPDATE [collection1] webapp=/solr path=/update params={version=2&wt=javabin} {add=[7]} 0 0
[junit4:junit4]   2> 1623 T414 C32 UPDATE [collection1] webapp=/solr path=/update params={version=2&wt=javabin} {add=[7]} 0 0
[junit4:junit4]   2> 1626 T384 C29 oasu.DirectUpdateHandler2.commit start commit{flags=0,_version_=0,optimize=false,openSearcher=true,waitSearcher=true,expungeDeletes=false,softCommit=false}
[junit4:junit4]   2> 1628 T384 C29 oasc.SolrDeletionPolicy.onCommit SolrDeletionPolicy.onCommit: commits:num=2
[junit4:junit4]   2> 		commit{dir=BaseDirectoryWrapper(org.apache.lucene.store.RAMDirectory@6431a2 lockFactory=org.apache.lucene.store.SingleInstanceLockFactory@1f68a0f),segFN=segments_1,generation=1,filenames=[segments_1]
[junit4:junit4]   2> 		commit{dir=BaseDirectoryWrapper(org.apache.lucene.store.RAMDirectory@6431a2 lockFactory=org.apache.lucene.store.SingleInstanceLockFactory@1f68a0f),segFN=segments_2,generation=2,filenames=[_0.fnm, _0.fdt, _0.si, _0.fdx, _0_Lucene40WithOrds_0.frq, _0_nrm.cfe, _0_MockFixedIntBlock_0.doc, _0_MockFixedIntBlock_0.pyl, _0_MockFixedIntBlock_0.skp, _0_MockFixedIntBlock_0.tib, _0_Lucene40WithOrds_0.prx, _0_MockFixedIntBlock_0.pos, _0_Lucene40WithOrds_0.tii, _0_Lucene40WithOrds_0.tib, _0_MockFixedIntBlock_0.tii, _0_nrm.cfs, _0_MockFixedIntBlock_0.frq, segments_2]
[junit4:junit4]   2> 1629 T384 C29 oasc.SolrDeletionPolicy.updateCommits newest commit = 2
[junit4:junit4]   2> 1630 T384 C29 oass.SolrIndexSearcher.<init> Opening Searcher@2d0aca main
[junit4:junit4]   2> 1631 T384 C29 oass.SolrIndexSearcher.getIndexDir WARNING WARNING: Directory impl does not support setting indexDir: org.apache.lucene.store.BaseDirectoryWrapper
[junit4:junit4]   2> 1632 T384 C29 oasu.DirectUpdateHandler2.commit end_commit_flush
[junit4:junit4]   2> 1633 T391 oasc.SolrCore.registerSearcher [collection1] Registered new searcher Searcher@2d0aca main{StandardDirectoryReader(segments_2:4 _0(4.0.0.1):C7)}
[junit4:junit4]   2> 1633 T384 C29 UPDATE [collection1] webapp=/solr path=/update params={wt=javabin&version=2&commit=true&softCommit=false&waitSearcher=true} {commit=} 0 7
[junit4:junit4]   2> 1636 T394 C30 oasu.DirectUpdateHandler2.commit start commit{flags=0,_version_=0,optimize=false,openSearcher=true,waitSearcher=true,expungeDeletes=false,softCommit=false}
[junit4:junit4]   2> 1639 T394 C30 oasc.SolrDeletionPolicy.onCommit SolrDeletionPolicy.onCommit: commits:num=2
[junit4:junit4]   2> 		commit{dir=MockDirWrapper(org.apache.lucene.store.RAMDirectory@1f9e533 lockFactory=org.apache.lucene.store.SingleInstanceLockFactory@1dce920),segFN=segments_1,generation=1,filenames=[segments_1]
[junit4:junit4]   2> 		commit{dir=MockDirWrapper(org.apache.lucene.store.RAMDirectory@1f9e533 lockFactory=org.apache.lucene.store.SingleInstanceLockFactory@1dce920),segFN=segments_2,generation=2,filenames=[_0.fnm, _0.fdt, _0.si, _0.fdx, _0_Lucene40WithOrds_0.frq, _0_nrm.cfe, _0_MockFixedIntBlock_0.doc, _0_MockFixedIntBlock_0.pyl, _0_MockFixedIntBlock_0.skp, _0_MockFixedIntBlock_0.tib, _0_Lucene40WithOrds_0.prx, _0_MockFixedIntBlock_0.pos, _0_Lucene40WithOrds_0.tii, _0_Lucene40WithOrds_0.tib, _0_MockFixedIntBlock_0.tii, _0_nrm.cfs, _0_MockFixedIntBlock_0.frq, segments_2]
[junit4:junit4]   2> 1640 T394 C30 oasc.SolrDeletionPolicy.updateCommits newest commit = 2
[junit4:junit4]   2> 1641 T394 C30 oass.SolrIndexSearcher.<init> Opening Searcher@1120f67 main
[junit4:junit4]   2> 1641 T394 C30 oass.SolrIndexSearcher.getIndexDir WARNING WARNING: Directory impl does not support setting indexDir: org.apache.lucene.store.MockDirectoryWrapper
[junit4:junit4]   2> 1642 T394 C30 oasu.DirectUpdateHandler2.commit end_commit_flush
[junit4:junit4]   2> 1643 T401 oasc.SolrCore.registerSearcher [collection1] Registered new searcher Searcher@1120f67 main{StandardDirectoryReader(segments_2:4 _0(4.0.0.1):C2)}
[junit4:junit4]   2> 1643 T394 C30 UPDATE [collection1] webapp=/solr path=/update params={wt=javabin&version=2&commit=true&softCommit=false&waitSearcher=true} {commit=} 0 7
[junit4:junit4]   2> 1646 T404 C31 oasu.DirectUpdateHandler2.commit start commit{flags=0,_version_=0,optimize=false,openSearcher=true,waitSearcher=true,expungeDeletes=false,softCommit=false}
[junit4:junit4]   2> 1649 T404 C31 oasc.SolrDeletionPolicy.onCommit SolrDeletionPolicy.onCommit: commits:num=2
[junit4:junit4]   2> 		commit{dir=MockDirWrapper(org.apache.lucene.store.RAMDirectory@aebd86 lockFactory=org.apache.lucene.store.SingleInstanceLockFactory@16331be),segFN=segments_1,generation=1,filenames=[segments_1]
[junit4:junit4]   2> 		commit{dir=MockDirWrapper(org.apache.lucene.store.RAMDirectory@aebd86 lockFactory=org.apache.lucene.store.SingleInstanceLockFactory@16331be),segFN=segments_2,generation=2,filenames=[_0.fnm, _0.fdt, _0.si, _0.fdx, _0_Lucene40WithOrds_0.frq, _0_nrm.cfe, _0_MockFixedIntBlock_0.doc, _0_MockFixedIntBlock_0.pyl, _0_MockFixedIntBlock_0.skp, _0_MockFixedIntBlock_0.tib, _0_Lucene40WithOrds_0.prx, _0_MockFixedIntBlock_0.pos, _0_Lucene40WithOrds_0.tii, _0_Lucene40WithOrds_0.tib, _0_MockFixedIntBlock_0.tii, _0_nrm.cfs, _0_MockFixedIntBlock_0.frq, segments_2]
[junit4:junit4]   2> 1650 T404 C31 oasc.SolrDeletionPolicy.updateCommits newest commit = 2
[junit4:junit4]   2> 1651 T404 C31 oass.SolrIndexSearcher.<init> Opening Searcher@1115667 main
[junit4:junit4]   2> 1652 T404 C31 oass.SolrIndexSearcher.getIndexDir WARNING WARNING: Directory impl does not support setting indexDir: org.apache.lucene.store.MockDirectoryWrapper
[junit4:junit4]   2> 1652 T404 C31 oasu.DirectUpdateHandler2.commit end_commit_flush
[junit4:junit4]   2> 1653 T411 oasc.SolrCore.registerSearcher [collection1] Registered new searcher Searcher@1115667 main{StandardDirectoryReader(segments_2:4 _0(4.0.0.1):C2)}
[junit4:junit4]   2> 1653 T404 C31 UPDATE [collection1] webapp=/solr path=/update params={wt=javabin&version=2&commit=true&softCommit=false&waitSearcher=true} {commit=} 0 7
[junit4:junit4]   2> 1657 T414 C32 oasu.DirectUpdateHandler2.commit start commit{flags=0,_version_=0,optimize=false,openSearcher=true,waitSearcher=true,expungeDeletes=false,softCommit=false}
[junit4:junit4]   2> 1659 T414 C32 oasc.SolrDeletionPolicy.onCommit SolrDeletionPolicy.onCommit: commits:num=2
[junit4:junit4]   2> 		commit{dir=MockDirWrapper(org.apache.lucene.store.RAMDirectory@1e7616c lockFactory=org.apache.lucene.store.SingleInstanceLockFactory@136eed3),segFN=segments_1,generation=1,filenames=[segments_1]
[junit4:junit4]   2> 		commit{dir=MockDirWrapper(org.apache.lucene.store.RAMDirectory@1e7616c lockFactory=org.apache.lucene.store.SingleInstanceLockFactory@136eed3),segFN=segments_2,generation=2,filenames=[_0.fnm, _0.fdt, _0.si, _0.fdx, _0_Lucene40WithOrds_0.frq, _0_nrm.cfe, _0_MockFixedIntBlock_0.doc, _0_MockFixedIntBlock_0.pyl, _0_MockFixedIntBlock_0.skp, _0_MockFixedIntBlock_0.tib, _0_Lucene40WithOrds_0.prx, _0_MockFixedIntBlock_0.pos, _0_Lucene40WithOrds_0.tii, _0_Lucene40WithOrds_0.tib, _0_MockFixedIntBlock_0.tii, _0_nrm.cfs, _0_MockFixedIntBlock_0.frq, segments_2]
[junit4:junit4]   2> 1660 T414 C32 oasc.SolrDeletionPolicy.updateCommits newest commit = 2
[junit4:junit4]   2> 1662 T414 C32 oass.SolrIndexSearcher.<init> Opening Searcher@1332d58 main
[junit4:junit4]   2> 1662 T414 C32 oass.SolrIndexSearcher.getIndexDir WARNING WARNING: Directory impl does not support setting indexDir: org.apache.lucene.store.MockDirectoryWrapper
[junit4:junit4]   2> 1663 T414 C32 oasu.DirectUpdateHandler2.commit end_commit_flush
[junit4:junit4]   2> 1663 T421 oasc.SolrCore.registerSearcher [collection1] Registered new searcher Searcher@1332d58 main{StandardDirectoryReader(segments_2:4 _0(4.0.0.1):C3)}
[junit4:junit4]   2> 1664 T414 C32 UPDATE [collection1] webapp=/solr path=/update params={wt=javabin&version=2&commit=true&softCommit=false&waitSearcher=true} {commit=} 0 7
[junit4:junit4]   2> 1673 T384 C29 REQ [collection1] webapp=/solr path=/elevate params={version=2&shards.qt=/elevate&distrib=false&rows=500&fl=id,+score,+[elevated]&qt=/elevate&wt=javabin&q=*:*&sort=id+desc} hits=7 status=0 QTime=6 
[junit4:junit4]   2> 1688 T395 C30 REQ [collection1] webapp=/solr path=/elevate params={version=2&distrib=false&NOW=1343894327973&isShard=true&sort=id+desc&shards.qt=/elevate&rows=500&fl=id,score&qt=/elevate&fsv=true&wt=javabin&start=0&shard.url=localhost:43280/solr&q=*:*} hits=2 status=0 QTime=1 
[junit4:junit4]   2> 1688 T405 C31 REQ [collection1] webapp=/solr path=/elevate params={version=2&distrib=false&NOW=1343894327973&isShard=true&sort=id+desc&shards.qt=/elevate&rows=500&fl=id,score&qt=/elevate&fsv=true&wt=javabin&start=0&shard.url=localhost:46378/solr&q=*:*} hits=2 status=0 QTime=1 
[junit4:junit4]   2> 1688 T415 C32 REQ [collection1] webapp=/solr path=/elevate params={version=2&distrib=false&NOW=1343894327973&isShard=true&sort=id+desc&shards.qt=/elevate&rows=500&fl=id,score&qt=/elevate&fsv=true&wt=javabin&start=0&shard.url=localhost:34075/solr&q=*:*} hits=3 status=0 QTime=1 
[junit4:junit4]   2> 1698 T395 C30 REQ [collection1] webapp=/solr path=/elevate params={version=2&distrib=false&ids=1.0,4.0&NOW=1343894327973&isShard=true&shards.qt=/elevate&rows=500&fl=id,+score,+[elevated]&qt=/elevate&wt=javabin&shard.url=localhost:43280/solr&q=*:*} status=0 QTime=0 
[junit4:junit4]   2> 1698 T405 C31 REQ [collection1] webapp=/solr path=/elevate params={version=2&distrib=false&ids=5.0,2.0&NOW=1343894327973&isShard=true&shards.qt=/elevate&rows=500&fl=id,+score,+[elevated]&qt=/elevate&wt=javabin&shard.url=localhost:46378/solr&q=*:*} status=0 QTime=0 
[junit4:junit4]   2> 1698 T415 C32 REQ [collection1] webapp=/solr path=/elevate params={version=2&distrib=false&ids=3.0,6.0,7.0&NOW=1343894327973&isShard=true&shards.qt=/elevate&rows=500&fl=id,+score,+[elevated]&qt=/elevate&wt=javabin&shard.url=localhost:34075/solr&q=*:*} status=0 QTime=0 
[junit4:junit4]   2> 1700 T394 C30 REQ [collection1] webapp=/solr path=/elevate params={version=2&shards.qt=/elevate&rows=500&fl=id,+score,+[elevated]&qt=/elevate&wt=javabin&q=*:*&sort=id+desc&shards=localhost:43280/solr,localhost:46378/solr,localhost:34075/solr} status=0 QTime=24 
[junit4:junit4]   2> 1702 T381 oas.BaseDistributedSearchTestCase.compareResponses SEVERE Mismatched responses:
[junit4:junit4]   2> 	{responseHeader={status=0,QTime=24,params={version=2,shards.qt=/elevate,rows=500,fl=id, score, [elevated],qt=/elevate,wt=javabin,q=*:*,sort=id desc,shards=localhost:43280/solr,localhost:46378/solr,localhost:34075/solr}},response={numFound=7,start=0,maxScore=1.0,docs=[SolrDocument{id=7.0, [elevated]=false, score=1.0}, SolrDocument{id=6.0, [elevated]=false, score=1.0}, SolrDocument{id=5.0, [elevated]=false, score=1.0}, SolrDocument{id=4.0, [elevated]=false, score=1.0}, SolrDocument{id=3.0, [elevated]=false, score=1.0}, SolrDocument{id=2.0, [elevated]=false, score=1.0}, SolrDocument{id=1.0, [elevated]=false, score=1.0}]}}
[junit4:junit4]   2> 	{responseHeader={status=0,QTime=6,params={version=2,shards.qt=/elevate,distrib=false,rows=500,fl=id, score, [elevated],qt=/elevate,wt=javabin,q=*:*,sort=id desc}},response={numFound=7,start=0,maxScore=1.0,docs=[SolrDocument{id=7.0, score=1.0, [elevated]=false}, SolrDocument{id=6.0, score=1.0, [elevated]=false}, SolrDocument{id=5.0, score=1.0, [elevated]=false}, SolrDocument{id=4.0, score=1.0, [elevated]=false}, SolrDocument{id=3.0, score=1.0, [elevated]=false}, SolrDocument{id=2.0, score=1.0, [elevated]=false}, SolrDocument{id=1.0, score=1.0, [elevated]=false}]}}
[junit4:junit4]   2> 1707 T381 oasc.CoreContainer.shutdown Shutting down CoreContainer instance=30836045
[junit4:junit4]   2> 1708 T381 oasc.SolrCore.close [collection1]  CLOSING SolrCore org.apache.solr.core.SolrCore@130b7a0
[junit4:junit4]   2> 1709 T381 oasc.SolrCore.closeSearcher [collection1] Closing main searcher on request.
[junit4:junit4]   2> 1710 T381 oasu.DirectUpdateHandler2.close closing DirectUpdateHandler2{commits=1,autocommits=0,soft autocommits=0,optimizes=0,rollbacks=0,expungeDeletes=0,docsPending=0,adds=0,deletesById=0,deletesByQuery=0,errors=0,cumulative_adds=7,cumulative_deletesById=0,cumulative_deletesByQuery=1,cumulative_errors=0}
[junit4:junit4]   2> 1713 T381 oejsh.ContextHandler.doStop stopped o.e.j.s.ServletContextHandler{/solr,null}
[junit4:junit4]   2> 1766 T381 oasc.CoreContainer.shutdown Shutting down CoreContainer instance=11572657
[junit4:junit4]   2> 1767 T381 oasc.SolrCore.close [collection1]  CLOSING SolrCore org.apache.solr.core.SolrCore@198a311
[junit4:junit4]   2> 1768 T381 oasc.SolrCore.closeSearcher [collection1] Closing main searcher on request.
[junit4:junit4]   2> 1768 T381 oasu.DirectUpdateHandler2.close closing DirectUpdateHandler2{commits=1,autocommits=0,soft autocommits=0,optimizes=0,rollbacks=0,expungeDeletes=0,docsPending=0,adds=0,deletesById=0,deletesByQuery=0,errors=0,cumulative_adds=2,cumulative_deletesById=0,cumulative_deletesByQuery=1,cumulative_errors=0}
[junit4:junit4]   2> 1773 T381 oejsh.ContextHandler.doStop stopped o.e.j.s.ServletContextHandler{/solr,null}
[junit4:junit4]   2> 1825 T381 oasc.CoreContainer.shutdown Shutting down CoreContainer instance=20931858
[junit4:junit4]   2> 1825 T381 oasc.SolrCore.close [collection1]  CLOSING SolrCore org.apache.solr.core.SolrCore@114d50a
[junit4:junit4]   2> 1826 T381 oasc.SolrCore.closeSearcher [collection1] Closing main searcher on request.
[junit4:junit4]   2> 1827 T381 oasu.DirectUpdateHandler2.close closing DirectUpdateHandler2{commits=1,autocommits=0,soft autocommits=0,optimizes=0,rollbacks=0,expungeDeletes=0,docsPending=0,adds=0,deletesById=0,deletesByQuery=0,errors=0,cumulative_adds=2,cumulative_deletesById=0,cumulative_deletesByQuery=1,cumulative_errors=0}
[junit4:junit4]   2> 1831 T381 oejsh.ContextHandler.doStop stopped o.e.j.s.ServletContextHandler{/solr,null}
[junit4:junit4]   2> 1883 T381 oasc.CoreContainer.shutdown Shutting down CoreContainer instance=21045912
[junit4:junit4]   2> 1884 T381 oasc.SolrCore.close [collection1]  CLOSING SolrCore org.apache.solr.core.SolrCore@1008819
[junit4:junit4]   2> 1885 T381 oasc.SolrCore.closeSearcher [collection1] Closing main searcher on request.
[junit4:junit4]   2> 1885 T381 oasu.DirectUpdateHandler2.close closing DirectUpdateHandler2{commits=1,autocommits=0,soft autocommits=0,optimizes=0,rollbacks=0,expungeDeletes=0,docsPending=0,adds=0,deletesById=0,deletesByQuery=0,errors=0,cumulative_adds=3,cumulative_deletesById=0,cumulative_deletesByQuery=1,cumulative_errors=0}
[junit4:junit4]   2> 1889 T381 oejsh.ContextHandler.doStop stopped o.e.j.s.ServletContextHandler{/solr,null}
[junit4:junit4]   2> 1942 T381 oas.SolrTestCaseJ4.tearDown ###Ending testDistribSearch
[junit4:junit4]   2> NOTE: reproduce with: ant test  -Dtestcase=DistributedQueryElevationComponentTest -Dtests.method=testDistribSearch -Dtests.seed=1CC6DA9ED6913F9A -Dtests.multiplier=3 -Dtests.slow=true -Dtests.locale=sr_ME -Dtests.timezone=Asia/Saigon -Dtests.file.encoding=US-ASCII
[junit4:junit4]   2>
[junit4:junit4]    > (@AfterClass output)
[junit4:junit4]   2> 1996 T381 oas.SolrTestCaseJ4.deleteCore ###deleteCore
[junit4:junit4]   2> NOTE: test params are: codec=Lucene40: {text=PostingsFormat(name=Lucene40WithOrds), plow_t=PostingsFormat(name=Lucene40WithOrds), field_t=MockFixedIntBlock(blockSize=704), int_i=PostingsFormat(name=Lucene40WithOrds), id=MockFixedIntBlock(blockSize=704)}, sim=RandomSimilarityProvider(queryNorm=true,coord=true): {}, locale=sr_ME, timezone=Asia/Saigon
[junit4:junit4]   2> NOTE: Linux 3.2.0-27-generic i386/Oracle Corporation 1.8.0-ea (32-bit)/cpus=8,threads=1,free=24461352,total=71974912
[junit4:junit4]   2> NOTE: All tests run in this JVM: [SimpleFacetsTest, SolrIndexConfigTest, BasicFunctionalityTest, CoreContainerCoreInitFailuresTest, TestSolrDeletionPolicy1, TestBinaryResponseWriter, RequiredFieldsTest, TestWriterPerf, TestReversedWildcardFilterFactory, TestPropInjectDefaults, EchoParamsTest, TestBinaryField, LeaderElectionTest, DocumentBuilderTest, IndexBasedSpellCheckerTest, TestStressLucene, IndexSchemaTest, TestTrie, ScriptEngineTest, TestQueryTypes, DirectUpdateHandlerOptimizeTest, TestFiltering, TestBM25SimilarityFactory, FieldMutatingUpdateProcessorTest, SuggesterWFSTTest, TestJoin, QueryElevationComponentTest, TestFoldingMultitermQuery, SpellingQueryConverterTest, TestHashPartitioner, SuggesterTest, DistributedQueryElevationComponentTest]
[junit4:junit4]   2> 
[junit4:junit4] Completed on J1 in 2.01s, 1 test, 1 failure <<< FAILURES!

[...truncated 512 lines...]
BUILD FAILED
/mnt/ssd/jenkins/workspace/Lucene-Solr-4.x-Linux/checkout/build.xml:29: The following error occurred while executing this line:
/mnt/ssd/jenkins/workspace/Lucene-Solr-4.x-Linux/checkout/solr/build.xml:144: The following error occurred while executing this line:
/mnt/ssd/jenkins/workspace/Lucene-Solr-4.x-Linux/checkout/lucene/module-build.xml:62: The following error occurred while executing this line:
/mnt/ssd/jenkins/workspace/Lucene-Solr-4.x-Linux/checkout/lucene/common-build.xml:1095: The following error occurred while executing this line:
/mnt/ssd/jenkins/workspace/Lucene-Solr-4.x-Linux/checkout/lucene/common-build.xml:790: There were test failures: 224 suites, 903 tests, 1 failure, 5 ignored

Total time: 21 minutes 22 seconds
Build step 'Execute shell' marked build as failure
Archiving artifacts
Recording test results
Email was triggered for: Failure
Sending email for trigger: Failure



Mime
View raw message