lucene-dev mailing list archives

Site index · List index
Message view « Date » · « Thread »
Top « Date » · « Thread »
From Apache Jenkins Server <jenk...@builds.apache.org>
Subject [JENKINS] Lucene-Solr-Clover-4.x - Build # 14 - Still Failing
Date Thu, 30 Aug 2012 22:29:22 GMT
Build: https://builds.apache.org/job/Lucene-Solr-Clover-4.x/14/

2 tests failed.
FAILED:  org.apache.solr.cloud.LeaderElectionTest.testStressElection

Error Message:
Could not get leader props

Stack Trace:
java.lang.RuntimeException: Could not get leader props
	at __randomizedtesting.SeedInfo.seed([7C03BF02E275C295:83556BAC853BD386]:0)
	at org.apache.solr.cloud.LeaderElectionTest.getLeaderUrl(LeaderElectionTest.java:226)
	at org.apache.solr.cloud.LeaderElectionTest.getLeaderThread(LeaderElectionTest.java:326)
	at org.apache.solr.cloud.LeaderElectionTest.__CLR2_6_3h468oq6sfk(LeaderElectionTest.java:435)
	at org.apache.solr.cloud.LeaderElectionTest.testStressElection(LeaderElectionTest.java:331)
	at sun.reflect.NativeMethodAccessorImpl.invoke0(Native Method)
	at sun.reflect.NativeMethodAccessorImpl.invoke(NativeMethodAccessorImpl.java:57)
	at sun.reflect.DelegatingMethodAccessorImpl.invoke(DelegatingMethodAccessorImpl.java:43)
	at java.lang.reflect.Method.invoke(Method.java:616)
	at com.carrotsearch.randomizedtesting.RandomizedRunner.invoke(RandomizedRunner.java:1559)
	at com.carrotsearch.randomizedtesting.RandomizedRunner.access$600(RandomizedRunner.java:79)
	at com.carrotsearch.randomizedtesting.RandomizedRunner$6.evaluate(RandomizedRunner.java:737)
	at com.carrotsearch.randomizedtesting.RandomizedRunner$7.evaluate(RandomizedRunner.java:773)
	at com.carrotsearch.randomizedtesting.RandomizedRunner$8.evaluate(RandomizedRunner.java:787)
	at com.carrotsearch.randomizedtesting.rules.SystemPropertiesRestoreRule$1.evaluate(SystemPropertiesRestoreRule.java:53)
	at org.apache.lucene.util.TestRuleSetupTeardownChained$1.evaluate(TestRuleSetupTeardownChained.java:50)
	at org.apache.lucene.util.TestRuleFieldCacheSanity$1.evaluate(TestRuleFieldCacheSanity.java:51)
	at org.apache.lucene.util.AbstractBeforeAfterRule$1.evaluate(AbstractBeforeAfterRule.java:45)
	at com.carrotsearch.randomizedtesting.rules.SystemPropertiesInvariantRule$1.evaluate(SystemPropertiesInvariantRule.java:55)
	at org.apache.lucene.util.TestRuleThreadAndTestName$1.evaluate(TestRuleThreadAndTestName.java:48)
	at org.apache.lucene.util.TestRuleIgnoreAfterMaxFailures$1.evaluate(TestRuleIgnoreAfterMaxFailures.java:70)
	at org.apache.lucene.util.TestRuleMarkFailure$1.evaluate(TestRuleMarkFailure.java:48)
	at com.carrotsearch.randomizedtesting.rules.StatementAdapter.evaluate(StatementAdapter.java:36)
	at com.carrotsearch.randomizedtesting.ThreadLeakControl$StatementRunner.run(ThreadLeakControl.java:345)
	at com.carrotsearch.randomizedtesting.ThreadLeakControl.forkTimeoutingTask(ThreadLeakControl.java:769)
	at com.carrotsearch.randomizedtesting.ThreadLeakControl$3.evaluate(ThreadLeakControl.java:429)
	at com.carrotsearch.randomizedtesting.RandomizedRunner.runSingleTest(RandomizedRunner.java:746)
	at com.carrotsearch.randomizedtesting.RandomizedRunner$3.evaluate(RandomizedRunner.java:648)
	at com.carrotsearch.randomizedtesting.RandomizedRunner$4.evaluate(RandomizedRunner.java:682)
	at com.carrotsearch.randomizedtesting.RandomizedRunner$5.evaluate(RandomizedRunner.java:693)
	at com.carrotsearch.randomizedtesting.rules.StatementAdapter.evaluate(StatementAdapter.java:36)
	at com.carrotsearch.randomizedtesting.rules.SystemPropertiesRestoreRule$1.evaluate(SystemPropertiesRestoreRule.java:53)
	at org.apache.lucene.util.AbstractBeforeAfterRule$1.evaluate(AbstractBeforeAfterRule.java:45)
	at org.apache.lucene.util.TestRuleStoreClassName$1.evaluate(TestRuleStoreClassName.java:42)
	at com.carrotsearch.randomizedtesting.rules.SystemPropertiesInvariantRule$1.evaluate(SystemPropertiesInvariantRule.java:55)
	at com.carrotsearch.randomizedtesting.rules.NoShadowingOrOverridesOnMethodsRule$1.evaluate(NoShadowingOrOverridesOnMethodsRule.java:39)
	at com.carrotsearch.randomizedtesting.rules.NoShadowingOrOverridesOnMethodsRule$1.evaluate(NoShadowingOrOverridesOnMethodsRule.java:39)
	at org.apache.lucene.util.TestRuleAssertionsRequired$1.evaluate(TestRuleAssertionsRequired.java:40)
	at org.apache.lucene.util.TestRuleMarkFailure$1.evaluate(TestRuleMarkFailure.java:48)
	at org.apache.lucene.util.TestRuleIgnoreAfterMaxFailures$1.evaluate(TestRuleIgnoreAfterMaxFailures.java:70)
	at org.apache.lucene.util.TestRuleIgnoreTestSuites$1.evaluate(TestRuleIgnoreTestSuites.java:55)
	at com.carrotsearch.randomizedtesting.rules.StatementAdapter.evaluate(StatementAdapter.java:36)
	at com.carrotsearch.randomizedtesting.ThreadLeakControl$StatementRunner.run(ThreadLeakControl.java:345)
	at java.lang.Thread.run(Thread.java:679)


FAILED:  junit.framework.TestSuite.org.apache.solr.cloud.LeaderElectionTest

Error Message:
6 threads leaked from SUITE scope at org.apache.solr.cloud.LeaderElectionTest:     1) Thread[id=1541, name=Thread-560, state=TIMED_WAITING, group=TGRP-LeaderElectionTest]         at java.lang.Thread.sleep(Native Method)         at org.apache.zookeeper.SolrZooKeeper$1.run(SolrZooKeeper.java:64)    2) Thread[id=1543, name=Thread-562, state=TIMED_WAITING, group=TGRP-LeaderElectionTest]         at java.lang.Thread.sleep(Native Method)         at org.apache.zookeeper.SolrZooKeeper$1.run(SolrZooKeeper.java:64)    3) Thread[id=1539, name=Thread-558, state=TIMED_WAITING, group=TGRP-LeaderElectionTest]         at java.lang.Thread.sleep(Native Method)         at org.apache.zookeeper.SolrZooKeeper$1.run(SolrZooKeeper.java:64)    4) Thread[id=1540, name=Thread-559, state=TIMED_WAITING, group=TGRP-LeaderElectionTest]         at java.lang.Thread.sleep(Native Method)         at org.apache.zookeeper.SolrZooKeeper$1.run(SolrZooKeeper.java:64)    5) Thread[id=1542, name=Thread-561, state=TIMED_WAITING, group=TGRP-LeaderElectionTest]         at java.lang.Thread.sleep(Native Method)         at org.apache.zookeeper.SolrZooKeeper$1.run(SolrZooKeeper.java:64)    6) Thread[id=1538, name=Thread-557, state=TIMED_WAITING, group=TGRP-LeaderElectionTest]         at java.lang.Thread.sleep(Native Method)         at org.apache.zookeeper.SolrZooKeeper$1.run(SolrZooKeeper.java:64)

Stack Trace:
com.carrotsearch.randomizedtesting.ThreadLeakError: 6 threads leaked from SUITE scope at org.apache.solr.cloud.LeaderElectionTest: 
   1) Thread[id=1541, name=Thread-560, state=TIMED_WAITING, group=TGRP-LeaderElectionTest]
        at java.lang.Thread.sleep(Native Method)
        at org.apache.zookeeper.SolrZooKeeper$1.run(SolrZooKeeper.java:64)
   2) Thread[id=1543, name=Thread-562, state=TIMED_WAITING, group=TGRP-LeaderElectionTest]
        at java.lang.Thread.sleep(Native Method)
        at org.apache.zookeeper.SolrZooKeeper$1.run(SolrZooKeeper.java:64)
   3) Thread[id=1539, name=Thread-558, state=TIMED_WAITING, group=TGRP-LeaderElectionTest]
        at java.lang.Thread.sleep(Native Method)
        at org.apache.zookeeper.SolrZooKeeper$1.run(SolrZooKeeper.java:64)
   4) Thread[id=1540, name=Thread-559, state=TIMED_WAITING, group=TGRP-LeaderElectionTest]
        at java.lang.Thread.sleep(Native Method)
        at org.apache.zookeeper.SolrZooKeeper$1.run(SolrZooKeeper.java:64)
   5) Thread[id=1542, name=Thread-561, state=TIMED_WAITING, group=TGRP-LeaderElectionTest]
        at java.lang.Thread.sleep(Native Method)
        at org.apache.zookeeper.SolrZooKeeper$1.run(SolrZooKeeper.java:64)
   6) Thread[id=1538, name=Thread-557, state=TIMED_WAITING, group=TGRP-LeaderElectionTest]
        at java.lang.Thread.sleep(Native Method)
        at org.apache.zookeeper.SolrZooKeeper$1.run(SolrZooKeeper.java:64)
	at __randomizedtesting.SeedInfo.seed([7C03BF02E275C295]:0)




Build Log:
[...truncated 2332 lines...]
    [javac] public class GroupQueryNodeProcessor implements QueryNodeProcessor {public static class __CLR2_6_33wq03wq0h6idu0m0{public static final com_cenqua_clover.CoverageRecorder R;static{com_cenqua_clover.CoverageRecorder _R=null;try{com_cenqua_clover.CloverVersionInfo.An_old_version_of_clover_is_on_your_compilation_classpath___Please_remove___Required_version_is___2_6_3();if(20091120171610861L!=com_cenqua_clover.CloverVersionInfo.getBuildStamp()){com_cenqua_clover.Clover.l("[CLOVER] WARNING: The Clover version used in instrumentation does not match the runtime version. You need to run instrumented classes against the same version of Clover that you instrumented with.");com_cenqua_clover.Clover.l("[CLOVER] WARNING: Instr=2.6.3#20091120171610861,Runtime="+com_cenqua_clover.CloverVersionInfo.getReleaseNum()+"#"+com_cenqua_clover.CloverVersionInfo.getBuildStamp());}_R=com_cenqua_clover.Clover.getNullRecorder();_R=com_cenqua_clover.Clover.getRecorder(new char[]{47,117,115,114,47,104,111,109,101,47,104,117,100,115,111,110,47,104,117,100,115,111,110,45,115,108,97,118,101,47,119,111,114,107,115,112,97,99,101,47,76,117,99,101,110,101,45,83,111,108,114,45,67,108,111,118,101,114,45,52,46,120,47,108,117,99,101,110,101,47,98,117,105,108,100,47,99,108,111,118,101,114,47,100,98,47,99,111,118,101,114,97,103,101,46,100,98},null,1346363109861L,0L,182478);}catch(java.lang.SecurityException e){java.lang.System.err.println("[CLOVER] FATAL ERROR: Clover could not be initialised because it has insufficient security privileges. Please consult the Clover documentation on the security policy file changes required. ("+e.getClass()+":"+e.getMessage()+")");}catch(java.lang.NoClassDefFoundError e){java.lang.System.err.println("[CLOVER] FATAL ERROR: Clover could not be initialised. Are you sure you have Clover in the runtime classpath? ("+e.getClass()+":"+e.getMessage()+")");}catch(java.lang.Throwable t){java.lang.System.err.println("[CLOVER] FATAL ERROR: Clover could not be initialised because of an unexpected error. ("+t.getClass()+":"+t.getMessage()+")");}R=_R;}}
    [javac]        ^
    [javac] Note: Some input files use or override a deprecated API.
    [javac] Note: Recompile with -Xlint:deprecation for details.
    [javac] 12 warnings
     [copy] Copying 3 files to /usr/home/hudson/hudson-slave/workspace/Lucene-Solr-Clover-4.x/lucene/build/queryparser/classes/java

compile-core:

jar-core:
     [exec] Result: 1
      [jar] Building jar: /usr/home/hudson/hudson-slave/workspace/Lucene-Solr-Clover-4.x/lucene/build/queryparser/lucene-queryparser-4.0-2012-08-30_21-02-01.jar

ivy-availability-check:

ivy-fail:

ivy-configure:
[ivy:configure] :: loading settings :: file = /usr/home/hudson/hudson-slave/workspace/Lucene-Solr-Clover-4.x/lucene/ivy-settings.xml

resolve:

common.init:

compile-lucene-core:

init:

-clover.disable:

-clover.setup:
     [echo] Code coverage with Atlassian Clover enabled.
[ivy:cachepath] :: resolving dependencies :: com.cenqua.clover#clover-caller;working
[ivy:cachepath] 	confs: [master]
[ivy:cachepath] 	found com.cenqua.clover#clover;2.6.3 in public
[ivy:cachepath] :: resolution report :: resolve 17ms :: artifacts dl 1ms
	---------------------------------------------------------------------
	|                  |            modules            ||   artifacts   |
	|       conf       | number| search|dwnlded|evicted|| number|dwnlded|
	---------------------------------------------------------------------
	|      master      |   1   |   0   |   0   |   0   ||   1   |   0   |
	---------------------------------------------------------------------
[clover-setup] Clover Version 2.6.3, built on November 20 2009 (build-778)
[clover-setup] Loaded from: /home/hudson/.ivy2/cache/com.cenqua.clover/clover/jars/clover-2.6.3.jar
[clover-setup] Clover: Open Source License registered to Apache.
[clover-setup] Clover is enabled with initstring '/usr/home/hudson/hudson-slave/workspace/Lucene-Solr-Clover-4.x/lucene/build/clover/db/coverage.db'

clover:

common.compile-core:
    [mkdir] Created dir: /usr/home/hudson/hudson-slave/workspace/Lucene-Solr-Clover-4.x/lucene/build/memory/classes/java
    [javac] Compiling 2 source files to /usr/home/hudson/hudson-slave/workspace/Lucene-Solr-Clover-4.x/lucene/build/memory/classes/java
   [clover] Clover Version 2.6.3, built on November 20 2009 (build-778)
   [clover] Loaded from: /home/hudson/.ivy2/cache/com.cenqua.clover/clover/jars/clover-2.6.3.jar
   [clover] Clover: Open Source License registered to Apache.
   [clover] Updating existing database at '/usr/home/hudson/hudson-slave/workspace/Lucene-Solr-Clover-4.x/lucene/build/clover/db/coverage.db'.
   [clover] Processing files at 1.6 source level.
   [clover] Clover all over. Instrumented 2 files (1 package).
   [clover] Elapsed time = 0.046 secs. (43.478 files/sec, 27,217.391 srclines/sec)

compile-core:

jar-core:
     [exec] Result: 1
      [jar] Building jar: /usr/home/hudson/hudson-slave/workspace/Lucene-Solr-Clover-4.x/lucene/build/memory/lucene-memory-4.0-2012-08-30_21-02-01.jar

check-highlighter-uptodate:

jar-highlighter:
     [echo] Building highlighter...

check-memory-uptodate:

jar-memory:

ivy-availability-check:

ivy-fail:

ivy-configure:
[ivy:configure] :: loading settings :: file = /usr/home/hudson/hudson-slave/workspace/Lucene-Solr-Clover-4.x/lucene/ivy-settings.xml

resolve:

common.init:

compile-lucene-core:

init:

-clover.disable:

-clover.setup:
     [echo] Code coverage with Atlassian Clover enabled.
[ivy:cachepath] :: resolving dependencies :: com.cenqua.clover#clover-caller;working
[ivy:cachepath] 	confs: [master]
[ivy:cachepath] 	found com.cenqua.clover#clover;2.6.3 in public
[ivy:cachepath] :: resolution report :: resolve 8ms :: artifacts dl 1ms
	---------------------------------------------------------------------
	|                  |            modules            ||   artifacts   |
	|       conf       | number| search|dwnlded|evicted|| number|dwnlded|
	---------------------------------------------------------------------
	|      master      |   1   |   0   |   0   |   0   ||   1   |   0   |
	---------------------------------------------------------------------
[clover-setup] Clover Version 2.6.3, built on November 20 2009 (build-778)
[clover-setup] Loaded from: /home/hudson/.ivy2/cache/com.cenqua.clover/clover/jars/clover-2.6.3.jar
[clover-setup] Clover: Open Source License registered to Apache.
[clover-setup] Clover is enabled with initstring '/usr/home/hudson/hudson-slave/workspace/Lucene-Solr-Clover-4.x/lucene/build/clover/db/coverage.db'

clover:

common.compile-core:
    [mkdir] Created dir: /usr/home/hudson/hudson-slave/workspace/Lucene-Solr-Clover-4.x/lucene/build/highlighter/classes/java
    [javac] Compiling 45 source files to /usr/home/hudson/hudson-slave/workspace/Lucene-Solr-Clover-4.x/lucene/build/highlighter/classes/java
   [clover] Clover Version 2.6.3, built on November 20 2009 (build-778)
   [clover] Loaded from: /home/hudson/.ivy2/cache/com.cenqua.clover/clover/jars/clover-2.6.3.jar
   [clover] Clover: Open Source License registered to Apache.
   [clover] Updating existing database at '/usr/home/hudson/hudson-slave/workspace/Lucene-Solr-Clover-4.x/lucene/build/clover/db/coverage.db'.
   [clover] Processing files at 1.6 source level.
   [clover] Clover all over. Instrumented 45 files (2 packages).
   [clover] Elapsed time = 0.165 secs. (272.727 files/sec, 35,866.664 srclines/sec)

compile-core:

jar-core:
     [exec] Result: 1
      [jar] Building jar: /usr/home/hudson/hudson-slave/workspace/Lucene-Solr-Clover-4.x/lucene/build/highlighter/lucene-highlighter-4.0-2012-08-30_21-02-01.jar

check-analyzers-common-uptodate:

jar-analyzers-common:

check-queryparser-uptodate:

jar-queryparser:

check-facet-uptodate:

jar-facet:
     [echo] Building facet...

check-analyzers-common-uptodate:

jar-analyzers-common:

ivy-availability-check:

ivy-fail:

ivy-configure:
[ivy:configure] :: loading settings :: file = /usr/home/hudson/hudson-slave/workspace/Lucene-Solr-Clover-4.x/lucene/ivy-settings.xml

resolve:

common.init:

compile-lucene-core:

init:

-clover.disable:

-clover.setup:
     [echo] Code coverage with Atlassian Clover enabled.
[ivy:cachepath] :: resolving dependencies :: com.cenqua.clover#clover-caller;working
[ivy:cachepath] 	confs: [master]
[ivy:cachepath] 	found com.cenqua.clover#clover;2.6.3 in public
[ivy:cachepath] :: resolution report :: resolve 8ms :: artifacts dl 0ms
	---------------------------------------------------------------------
	|                  |            modules            ||   artifacts   |
	|       conf       | number| search|dwnlded|evicted|| number|dwnlded|
	---------------------------------------------------------------------
	|      master      |   1   |   0   |   0   |   0   ||   1   |   0   |
	---------------------------------------------------------------------
[clover-setup] Clover Version 2.6.3, built on November 20 2009 (build-778)
[clover-setup] Loaded from: /home/hudson/.ivy2/cache/com.cenqua.clover/clover/jars/clover-2.6.3.jar
[clover-setup] Clover: Open Source License registered to Apache.
[clover-setup] Clover is enabled with initstring '/usr/home/hudson/hudson-slave/workspace/Lucene-Solr-Clover-4.x/lucene/build/clover/db/coverage.db'

clover:

common.compile-core:
    [mkdir] Created dir: /usr/home/hudson/hudson-slave/workspace/Lucene-Solr-Clover-4.x/lucene/build/facet/classes/java
    [javac] Compiling 141 source files to /usr/home/hudson/hudson-slave/workspace/Lucene-Solr-Clover-4.x/lucene/build/facet/classes/java
   [clover] Clover Version 2.6.3, built on November 20 2009 (build-778)
   [clover] Loaded from: /home/hudson/.ivy2/cache/com.cenqua.clover/clover/jars/clover-2.6.3.jar
   [clover] Clover: Open Source License registered to Apache.
   [clover] Updating existing database at '/usr/home/hudson/hudson-slave/workspace/Lucene-Solr-Clover-4.x/lucene/build/clover/db/coverage.db'.
   [clover] Processing files at 1.6 source level.
   [clover] Clover all over. Instrumented 141 files (26 packages).
   [clover] Elapsed time = 0.54 secs. (261.111 files/sec, 44,829.629 srclines/sec)

compile-examples:
    [mkdir] Created dir: /usr/home/hudson/hudson-slave/workspace/Lucene-Solr-Clover-4.x/lucene/build/facet/classes/examples
    [javac] Compiling 16 source files to /usr/home/hudson/hudson-slave/workspace/Lucene-Solr-Clover-4.x/lucene/build/facet/classes/examples
   [clover] Clover Version 2.6.3, built on November 20 2009 (build-778)
   [clover] Loaded from: /home/hudson/.ivy2/cache/com.cenqua.clover/clover/jars/clover-2.6.3.jar
   [clover] Clover: Open Source License registered to Apache.
   [clover] Updating existing database at '/usr/home/hudson/hudson-slave/workspace/Lucene-Solr-Clover-4.x/lucene/build/clover/db/coverage.db'.
   [clover] Processing files at 1.6 source level.
   [clover] Clover all over. Instrumented 0 files (0 packages).
   [clover] Elapsed time = 0 secs.

compile-core:

common.jar-core:
     [exec] Result: 1
      [jar] Building jar: /usr/home/hudson/hudson-slave/workspace/Lucene-Solr-Clover-4.x/lucene/build/facet/lucene-facet-4.0-2012-08-30_21-02-01.jar

jar-examples:
     [exec] Result: 1
      [jar] Building jar: /usr/home/hudson/hudson-slave/workspace/Lucene-Solr-Clover-4.x/lucene/build/facet/lucene-facet-4.0-2012-08-30_21-02-01-examples.jar

jar-core:

init:

module-build.compile-test:
     [echo] Building benchmark...

ivy-availability-check:

ivy-fail:

ivy-configure:
[ivy:configure] :: loading settings :: file = /usr/home/hudson/hudson-slave/workspace/Lucene-Solr-Clover-4.x/lucene/ivy-settings.xml

resolve:

common.init:

compile-lucene-core:

module-build.init:

resolve-icu:
     [echo] Building analyzers-icu...

ivy-availability-check:

ivy-fail:

ivy-configure:
[ivy:configure] :: loading settings :: file = /usr/home/hudson/hudson-slave/workspace/Lucene-Solr-Clover-4.x/lucene/ivy-settings.xml

resolve:

check-memory-uptodate:

jar-memory:

check-highlighter-uptodate:

jar-highlighter:

check-analyzers-common-uptodate:

jar-analyzers-common:

check-queryparser-uptodate:

jar-queryparser:

check-facet-uptodate:

jar-facet:

init:

-clover.disable:

-clover.setup:
     [echo] Code coverage with Atlassian Clover enabled.
[ivy:cachepath] :: resolving dependencies :: com.cenqua.clover#clover-caller;working
[ivy:cachepath] 	confs: [master]
[ivy:cachepath] 	found com.cenqua.clover#clover;2.6.3 in public
[ivy:cachepath] :: resolution report :: resolve 12ms :: artifacts dl 1ms
	---------------------------------------------------------------------
	|                  |            modules            ||   artifacts   |
	|       conf       | number| search|dwnlded|evicted|| number|dwnlded|
	---------------------------------------------------------------------
	|      master      |   1   |   0   |   0   |   0   ||   1   |   0   |
	---------------------------------------------------------------------
[clover-setup] Clover Version 2.6.3, built on November 20 2009 (build-778)
[clover-setup] Loaded from: /home/hudson/.ivy2/cache/com.cenqua.clover/clover/jars/clover-2.6.3.jar
[clover-setup] Clover: Open Source License registered to Apache.
[clover-setup] Clover is enabled with initstring '/usr/home/hudson/hudson-slave/workspace/Lucene-Solr-Clover-4.x/lucene/build/clover/db/coverage.db'

clover:

compile-core:
    [mkdir] Created dir: /usr/home/hudson/hudson-slave/workspace/Lucene-Solr-Clover-4.x/lucene/build/benchmark/classes/java
    [javac] Compiling 115 source files to /usr/home/hudson/hudson-slave/workspace/Lucene-Solr-Clover-4.x/lucene/build/benchmark/classes/java
   [clover] Clover Version 2.6.3, built on November 20 2009 (build-778)
   [clover] Loaded from: /home/hudson/.ivy2/cache/com.cenqua.clover/clover/jars/clover-2.6.3.jar
   [clover] Clover: Open Source License registered to Apache.
   [clover] Updating existing database at '/usr/home/hudson/hudson-slave/workspace/Lucene-Solr-Clover-4.x/lucene/build/clover/db/coverage.db'.
   [clover] Processing files at 1.6 source level.
   [clover] Clover all over. Instrumented 115 files (11 packages).
   [clover] Elapsed time = 0.337 secs. (341.246 files/sec, 39,795.25 srclines/sec)
    [javac] Note: Some input files use or override a deprecated API.
    [javac] Note: Recompile with -Xlint:deprecation for details.

compile-test-framework:

ivy-availability-check:

ivy-fail:

ivy-configure:
[ivy:configure] :: loading settings :: file = /usr/home/hudson/hudson-slave/workspace/Lucene-Solr-Clover-4.x/lucene/ivy-settings.xml

resolve:

init:

compile-lucene-core:

compile-core:

common.compile-test:
    [javac] Compiling 20 source files to /usr/home/hudson/hudson-slave/workspace/Lucene-Solr-Clover-4.x/lucene/build/benchmark/classes/test
   [clover] Clover Version 2.6.3, built on November 20 2009 (build-778)
   [clover] Loaded from: /home/hudson/.ivy2/cache/com.cenqua.clover/clover/jars/clover-2.6.3.jar
   [clover] Clover: Open Source License registered to Apache.
   [clover] Updating existing database at '/usr/home/hudson/hudson-slave/workspace/Lucene-Solr-Clover-4.x/lucene/build/clover/db/coverage.db'.
   [clover] Processing files at 1.6 source level.
   [clover] Clover all over. Instrumented 19 files (7 packages).
   [clover] 86 test methods detected.
   [clover] Elapsed time = 0.13 secs. (146.154 files/sec, 28,023.078 srclines/sec)
     [copy] Copying 5 files to /usr/home/hudson/hudson-slave/workspace/Lucene-Solr-Clover-4.x/lucene/build/benchmark/classes/test

compile-test:
     [echo] Building demo...

ivy-availability-check:

ivy-fail:

ivy-configure:
[ivy:configure] :: loading settings :: file = /usr/home/hudson/hudson-slave/workspace/Lucene-Solr-Clover-4.x/lucene/ivy-settings.xml

resolve:

common.init:

compile-lucene-core:

ivy-availability-check:

ivy-fail:

ivy-configure:
[ivy:configure] :: loading settings :: file = /usr/home/hudson/hudson-slave/workspace/Lucene-Solr-Clover-4.x/lucene/ivy-settings.xml

resolve:

init:

-clover.disable:

-clover.setup:
     [echo] Code coverage with Atlassian Clover enabled.
[ivy:cachepath] :: resolving dependencies :: com.cenqua.clover#clover-caller;working
[ivy:cachepath] 	confs: [master]
[ivy:cachepath] 	found com.cenqua.clover#clover;2.6.3 in public
[ivy:cachepath] :: resolution report :: resolve 8ms :: artifacts dl 1ms
	---------------------------------------------------------------------
	|                  |            modules            ||   artifacts   |
	|       conf       | number| search|dwnlded|evicted|| number|dwnlded|
	---------------------------------------------------------------------
	|      master      |   1   |   0   |   0   |   0   ||   1   |   0   |
	---------------------------------------------------------------------
[clover-setup] Clover Version 2.6.3, built on November 20 2009 (build-778)
[clover-setup] Loaded from: /home/hudson/.ivy2/cache/com.cenqua.clover/clover/jars/clover-2.6.3.jar
[clover-setup] Clover: Open Source License registered to Apache.
[clover-setup] Clover is enabled with initstring '/usr/home/hudson/hudson-slave/workspace/Lucene-Solr-Clover-4.x/lucene/build/clover/db/coverage.db'

clover:

compile-core:

module-build.init:

check-lucene-core-uptodate:

jar-lucene-core:

ivy-availability-check:

ivy-fail:

ivy-configure:
[ivy:configure] :: loading settings :: file = /usr/home/hudson/hudson-slave/workspace/Lucene-Solr-Clover-4.x/lucene/ivy-settings.xml

resolve:

init:

-clover.disable:

-clover.setup:
     [echo] Code coverage with Atlassian Clover enabled.
[ivy:cachepath] :: resolving dependencies :: com.cenqua.clover#clover-caller;working
[ivy:cachepath] 	confs: [master]
[ivy:cachepath] 	found com.cenqua.clover#clover;2.6.3 in public
[ivy:cachepath] :: resolution report :: resolve 7ms :: artifacts dl 1ms
	---------------------------------------------------------------------
	|                  |            modules            ||   artifacts   |
	|       conf       | number| search|dwnlded|evicted|| number|dwnlded|
	---------------------------------------------------------------------
	|      master      |   1   |   0   |   0   |   0   ||   1   |   0   |
	---------------------------------------------------------------------
[clover-setup] Clover Version 2.6.3, built on November 20 2009 (build-778)
[clover-setup] Loaded from: /home/hudson/.ivy2/cache/com.cenqua.clover/clover/jars/clover-2.6.3.jar
[clover-setup] Clover: Open Source License registered to Apache.
[clover-setup] Clover is enabled with initstring '/usr/home/hudson/hudson-slave/workspace/Lucene-Solr-Clover-4.x/lucene/build/clover/db/coverage.db'

clover:

compile-core:

jar-core:
     [exec] Result: 1
      [jar] Building jar: /usr/home/hudson/hudson-slave/workspace/Lucene-Solr-Clover-4.x/lucene/build/core/lucene-core-4.0-2012-08-30_21-02-01.jar

init:

compile-test:
     [echo] Building demo...

check-analyzers-common-uptodate:

jar-analyzers-common:

check-queryparser-uptodate:

jar-queryparser:

ivy-availability-check:

ivy-fail:

ivy-configure:
[ivy:configure] :: loading settings :: file = /usr/home/hudson/hudson-slave/workspace/Lucene-Solr-Clover-4.x/lucene/ivy-settings.xml

resolve:

common.init:

compile-lucene-core:

module-build.init:

check-lucene-core-uptodate:

jar-lucene-core:

init:

-clover.disable:

-clover.setup:
     [echo] Code coverage with Atlassian Clover enabled.
[ivy:cachepath] :: resolving dependencies :: com.cenqua.clover#clover-caller;working
[ivy:cachepath] 	confs: [master]
[ivy:cachepath] 	found com.cenqua.clover#clover;2.6.3 in public
[ivy:cachepath] :: resolution report :: resolve 9ms :: artifacts dl 0ms
	---------------------------------------------------------------------
	|                  |            modules            ||   artifacts   |
	|       conf       | number| search|dwnlded|evicted|| number|dwnlded|
	---------------------------------------------------------------------
	|      master      |   1   |   0   |   0   |   0   ||   1   |   0   |
	---------------------------------------------------------------------
[clover-setup] Clover Version 2.6.3, built on November 20 2009 (build-778)
[clover-setup] Loaded from: /home/hudson/.ivy2/cache/com.cenqua.clover/clover/jars/clover-2.6.3.jar
[clover-setup] Clover: Open Source License registered to Apache.
[clover-setup] Clover is enabled with initstring '/usr/home/hudson/hudson-slave/workspace/Lucene-Solr-Clover-4.x/lucene/build/clover/db/coverage.db'

clover:

common.compile-core:
    [mkdir] Created dir: /usr/home/hudson/hudson-slave/workspace/Lucene-Solr-Clover-4.x/lucene/build/demo/classes/java
    [javac] Compiling 3 source files to /usr/home/hudson/hudson-slave/workspace/Lucene-Solr-Clover-4.x/lucene/build/demo/classes/java
   [clover] Clover Version 2.6.3, built on November 20 2009 (build-778)
   [clover] Loaded from: /home/hudson/.ivy2/cache/com.cenqua.clover/clover/jars/clover-2.6.3.jar
   [clover] Clover: Open Source License registered to Apache.
   [clover] Updating existing database at '/usr/home/hudson/hudson-slave/workspace/Lucene-Solr-Clover-4.x/lucene/build/clover/db/coverage.db'.
   [clover] Processing files at 1.6 source level.
   [clover] Clover all over. Instrumented 3 files (2 packages).
   [clover] Elapsed time = 0.016 secs. (187.5 files/sec, 38,250 srclines/sec)
    [javac] Note: /var/tmp/clover8943278135815307679.tmp/org/apache/lucene/demo/xmlparser/FormBasedXmlQueryDemo.java uses or overrides a deprecated API.
    [javac] Note: Recompile with -Xlint:deprecation for details.
     [copy] Copying 6 files to /usr/home/hudson/hudson-slave/workspace/Lucene-Solr-Clover-4.x/lucene/build/demo/classes/java

compile-core:

compile-test-framework:

ivy-availability-check:

ivy-fail:

ivy-configure:
[ivy:configure] :: loading settings :: file = /usr/home/hudson/hudson-slave/workspace/Lucene-Solr-Clover-4.x/lucene/ivy-settings.xml

resolve:

init:

compile-lucene-core:

compile-core:

common.compile-test:
    [mkdir] Created dir: /usr/home/hudson/hudson-slave/workspace/Lucene-Solr-Clover-4.x/lucene/build/demo/classes/test
    [javac] Compiling 1 source file to /usr/home/hudson/hudson-slave/workspace/Lucene-Solr-Clover-4.x/lucene/build/demo/classes/test
   [clover] Clover Version 2.6.3, built on November 20 2009 (build-778)
   [clover] Loaded from: /home/hudson/.ivy2/cache/com.cenqua.clover/clover/jars/clover-2.6.3.jar
   [clover] Clover: Open Source License registered to Apache.
   [clover] Updating existing database at '/usr/home/hudson/hudson-slave/workspace/Lucene-Solr-Clover-4.x/lucene/build/clover/db/coverage.db'.
   [clover] Processing files at 1.6 source level.
   [clover] Clover all over. Instrumented 1 file (1 package).
   [clover] 1 test method detected.
   [clover] Elapsed time = 0.003 secs. (333.333 files/sec, 18,666.666 srclines/sec)
     [copy] Copying 16 files to /usr/home/hudson/hudson-slave/workspace/Lucene-Solr-Clover-4.x/lucene/build/demo/classes/test
     [echo] Building facet...

ivy-availability-check:

ivy-fail:

ivy-configure:
[ivy:configure] :: loading settings :: file = /usr/home/hudson/hudson-slave/workspace/Lucene-Solr-Clover-4.x/lucene/ivy-settings.xml

resolve:

common.init:

compile-lucene-core:

ivy-availability-check:

ivy-fail:

ivy-configure:
[ivy:configure] :: loading settings :: file = /usr/home/hudson/hudson-slave/workspace/Lucene-Solr-Clover-4.x/lucene/ivy-settings.xml

resolve:

init:

-clover.disable:

-clover.setup:
     [echo] Code coverage with Atlassian Clover enabled.
[ivy:cachepath] :: resolving dependencies :: com.cenqua.clover#clover-caller;working
[ivy:cachepath] 	confs: [master]
[ivy:cachepath] 	found com.cenqua.clover#clover;2.6.3 in public
[ivy:cachepath] :: resolution report :: resolve 7ms :: artifacts dl 1ms
	---------------------------------------------------------------------
	|                  |            modules            ||   artifacts   |
	|       conf       | number| search|dwnlded|evicted|| number|dwnlded|
	---------------------------------------------------------------------
	|      master      |   1   |   0   |   0   |   0   ||   1   |   0   |
	---------------------------------------------------------------------
[clover-setup] Clover Version 2.6.3, built on November 20 2009 (build-778)
[clover-setup] Loaded from: /home/hudson/.ivy2/cache/com.cenqua.clover/clover/jars/clover-2.6.3.jar
[clover-setup] Clover: Open Source License registered to Apache.
[clover-setup] Clover is enabled with initstring '/usr/home/hudson/hudson-slave/workspace/Lucene-Solr-Clover-4.x/lucene/build/clover/db/coverage.db'

clover:

compile-core:

init:

compile-test:
     [echo] Building facet...

check-analyzers-common-uptodate:

jar-analyzers-common:

ivy-availability-check:

ivy-fail:

ivy-configure:
[ivy:configure] :: loading settings :: file = /usr/home/hudson/hudson-slave/workspace/Lucene-Solr-Clover-4.x/lucene/ivy-settings.xml

resolve:

common.init:

compile-lucene-core:

init:

-clover.disable:

-clover.setup:
     [echo] Code coverage with Atlassian Clover enabled.
[ivy:cachepath] :: resolving dependencies :: com.cenqua.clover#clover-caller;working
[ivy:cachepath] 	confs: [master]
[ivy:cachepath] 	found com.cenqua.clover#clover;2.6.3 in public
[ivy:cachepath] :: resolution report :: resolve 8ms :: artifacts dl 1ms
	---------------------------------------------------------------------
	|                  |            modules            ||   artifacts   |
	|       conf       | number| search|dwnlded|evicted|| number|dwnlded|
	---------------------------------------------------------------------
	|      master      |   1   |   0   |   0   |   0   ||   1   |   0   |
	---------------------------------------------------------------------
[clover-setup] Clover Version 2.6.3, built on November 20 2009 (build-778)
[clover-setup] Loaded from: /home/hudson/.ivy2/cache/com.cenqua.clover/clover/jars/clover-2.6.3.jar
[clover-setup] Clover: Open Source License registered to Apache.
[clover-setup] Clover is enabled with initstring '/usr/home/hudson/hudson-slave/workspace/Lucene-Solr-Clover-4.x/lucene/build/clover/db/coverage.db'

clover:

common.compile-core:

compile-examples:

compile-core:

compile-test-framework:

ivy-availability-check:

ivy-fail:

ivy-configure:
[ivy:configure] :: loading settings :: file = /usr/home/hudson/hudson-slave/workspace/Lucene-Solr-Clover-4.x/lucene/ivy-settings.xml

resolve:

init:

compile-lucene-core:

compile-core:

common.compile-test:
    [mkdir] Created dir: /usr/home/hudson/hudson-slave/workspace/Lucene-Solr-Clover-4.x/lucene/build/facet/classes/test
    [javac] Compiling 75 source files to /usr/home/hudson/hudson-slave/workspace/Lucene-Solr-Clover-4.x/lucene/build/facet/classes/test
   [clover] Clover Version 2.6.3, built on November 20 2009 (build-778)
   [clover] Loaded from: /home/hudson/.ivy2/cache/com.cenqua.clover/clover/jars/clover-2.6.3.jar
   [clover] Clover: Open Source License registered to Apache.
   [clover] Updating existing database at '/usr/home/hudson/hudson-slave/workspace/Lucene-Solr-Clover-4.x/lucene/build/clover/db/coverage.db'.
   [clover] Processing files at 1.6 source level.
   [clover] Clover all over. Instrumented 75 files (21 packages).
   [clover] 261 test methods detected.
   [clover] Elapsed time = 1.17 secs. (64.103 files/sec, 12,033.334 srclines/sec)
     [echo] Building grouping...

ivy-availability-check:

ivy-fail:

ivy-configure:
[ivy:configure] :: loading settings :: file = /usr/home/hudson/hudson-slave/workspace/Lucene-Solr-Clover-4.x/lucene/ivy-settings.xml

resolve:

common.init:

compile-lucene-core:

ivy-availability-check:

ivy-fail:

ivy-configure:
[ivy:configure] :: loading settings :: file = /usr/home/hudson/hudson-slave/workspace/Lucene-Solr-Clover-4.x/lucene/ivy-settings.xml

resolve:

init:

-clover.disable:

-clover.setup:
     [echo] Code coverage with Atlassian Clover enabled.
[ivy:cachepath] :: resolving dependencies :: com.cenqua.clover#clover-caller;working
[ivy:cachepath] 	confs: [master]
[ivy:cachepath] 	found com.cenqua.clover#clover;2.6.3 in public
[ivy:cachepath] :: resolution report :: resolve 7ms :: artifacts dl 1ms
	---------------------------------------------------------------------
	|                  |            modules            ||   artifacts   |
	|       conf       | number| search|dwnlded|evicted|| number|dwnlded|
	---------------------------------------------------------------------
	|      master      |   1   |   0   |   0   |   0   ||   1   |   0   |
	---------------------------------------------------------------------
[clover-setup] Clover Version 2.6.3, built on November 20 2009 (build-778)
[clover-setup] Loaded from: /home/hudson/.ivy2/cache/com.cenqua.clover/clover/jars/clover-2.6.3.jar
[clover-setup] Clover: Open Source License registered to Apache.
[clover-setup] Clover is enabled with initstring '/usr/home/hudson/hudson-slave/workspace/Lucene-Solr-Clover-4.x/lucene/build/clover/db/coverage.db'

clover:

compile-core:

module-build.init:

check-queries-uptodate:

jar-queries:

init:

compile-test:
     [echo] Building grouping...

ivy-availability-check:

ivy-fail:

ivy-configure:
[ivy:configure] :: loading settings :: file = /usr/home/hudson/hudson-slave/workspace/Lucene-Solr-Clover-4.x/lucene/ivy-settings.xml

resolve:

common.init:

compile-lucene-core:

module-build.init:

check-queries-uptodate:

jar-queries:

init:

-clover.disable:

-clover.setup:
     [echo] Code coverage with Atlassian Clover enabled.
[ivy:cachepath] :: resolving dependencies :: com.cenqua.clover#clover-caller;working
[ivy:cachepath] 	confs: [master]
[ivy:cachepath] 	found com.cenqua.clover#clover;2.6.3 in public
[ivy:cachepath] :: resolution report :: resolve 8ms :: artifacts dl 1ms
	---------------------------------------------------------------------
	|                  |            modules            ||   artifacts   |
	|       conf       | number| search|dwnlded|evicted|| number|dwnlded|
	---------------------------------------------------------------------
	|      master      |   1   |   0   |   0   |   0   ||   1   |   0   |
	---------------------------------------------------------------------
[clover-setup] Clover Version 2.6.3, built on November 20 2009 (build-778)
[clover-setup] Loaded from: /home/hudson/.ivy2/cache/com.cenqua.clover/clover/jars/clover-2.6.3.jar
[clover-setup] Clover: Open Source License registered to Apache.
[clover-setup] Clover is enabled with initstring '/usr/home/hudson/hudson-slave/workspace/Lucene-Solr-Clover-4.x/lucene/build/clover/db/coverage.db'

clover:

compile-core:
    [mkdir] Created dir: /usr/home/hudson/hudson-slave/workspace/Lucene-Solr-Clover-4.x/lucene/build/grouping/classes/java
    [javac] Compiling 29 source files to /usr/home/hudson/hudson-slave/workspace/Lucene-Solr-Clover-4.x/lucene/build/grouping/classes/java
   [clover] Clover Version 2.6.3, built on November 20 2009 (build-778)
   [clover] Loaded from: /home/hudson/.ivy2/cache/com.cenqua.clover/clover/jars/clover-2.6.3.jar
   [clover] Clover: Open Source License registered to Apache.
   [clover] Updating existing database at '/usr/home/hudson/hudson-slave/workspace/Lucene-Solr-Clover-4.x/lucene/build/clover/db/coverage.db'.
   [clover] Processing files at 1.6 source level.
   [clover] Clover all over. Instrumented 29 files (4 packages).
   [clover] Elapsed time = 0.159 secs. (182.39 files/sec, 38,855.348 srclines/sec)

compile-test-framework:

ivy-availability-check:

ivy-fail:

ivy-configure:
[ivy:configure] :: loading settings :: file = /usr/home/hudson/hudson-slave/workspace/Lucene-Solr-Clover-4.x/lucene/ivy-settings.xml

resolve:

init:

compile-lucene-core:

compile-core:

common.compile-test:
    [mkdir] Created dir: /usr/home/hudson/hudson-slave/workspace/Lucene-Solr-Clover-4.x/lucene/build/grouping/classes/test
    [javac] Compiling 7 source files to /usr/home/hudson/hudson-slave/workspace/Lucene-Solr-Clover-4.x/lucene/build/grouping/classes/test
   [clover] Clover Version 2.6.3, built on November 20 2009 (build-778)
   [clover] Loaded from: /home/hudson/.ivy2/cache/com.cenqua.clover/clover/jars/clover-2.6.3.jar
   [clover] Clover: Open Source License registered to Apache.
   [clover] Updating existing database at '/usr/home/hudson/hudson-slave/workspace/Lucene-Solr-Clover-4.x/lucene/build/clover/db/coverage.db'.
   [clover] Processing files at 1.6 source level.
   [clover] Clover all over. Instrumented 7 files (1 package).
   [clover] 11 test methods detected.
   [clover] Elapsed time = 0.095 secs. (73.684 files/sec, 37,578.949 srclines/sec)
     [echo] Building highlighter...

ivy-availability-check:

ivy-fail:

ivy-configure:
[ivy:configure] :: loading settings :: file = /usr/home/hudson/hudson-slave/workspace/Lucene-Solr-Clover-4.x/lucene/ivy-settings.xml

resolve:

common.init:

compile-lucene-core:

ivy-availability-check:

ivy-fail:

ivy-configure:
[ivy:configure] :: loading settings :: file = /usr/home/hudson/hudson-slave/workspace/Lucene-Solr-Clover-4.x/lucene/ivy-settings.xml

resolve:

init:

-clover.disable:

-clover.setup:
     [echo] Code coverage with Atlassian Clover enabled.
[ivy:cachepath] :: resolving dependencies :: com.cenqua.clover#clover-caller;working
[ivy:cachepath] 	confs: [master]
[ivy:cachepath] 	found com.cenqua.clover#clover;2.6.3 in public
[ivy:cachepath] :: resolution report :: resolve 7ms :: artifacts dl 1ms
	---------------------------------------------------------------------
	|                  |            modules            ||   artifacts   |
	|       conf       | number| search|dwnlded|evicted|| number|dwnlded|
	---------------------------------------------------------------------
	|      master      |   1   |   0   |   0   |   0   ||   1   |   0   |
	---------------------------------------------------------------------
[clover-setup] Clover Version 2.6.3, built on November 20 2009 (build-778)
[clover-setup] Loaded from: /home/hudson/.ivy2/cache/com.cenqua.clover/clover/jars/clover-2.6.3.jar
[clover-setup] Clover: Open Source License registered to Apache.
[clover-setup] Clover is enabled with initstring '/usr/home/hudson/hudson-slave/workspace/Lucene-Solr-Clover-4.x/lucene/build/clover/db/coverage.db'

clover:

compile-core:

init:

compile-test:
     [echo] Building highlighter...

check-memory-uptodate:

jar-memory:

ivy-availability-check:

ivy-fail:

ivy-configure:
[ivy:configure] :: loading settings :: file = /usr/home/hudson/hudson-slave/workspace/Lucene-Solr-Clover-4.x/lucene/ivy-settings.xml

resolve:

common.init:

compile-lucene-core:

init:

-clover.disable:

-clover.setup:
     [echo] Code coverage with Atlassian Clover enabled.
[ivy:cachepath] :: resolving dependencies :: com.cenqua.clover#clover-caller;working
[ivy:cachepath] 	confs: [master]
[ivy:cachepath] 	found com.cenqua.clover#clover;2.6.3 in public
[ivy:cachepath] :: resolution report :: resolve 7ms :: artifacts dl 1ms
	---------------------------------------------------------------------
	|                  |            modules            ||   artifacts   |
	|       conf       | number| search|dwnlded|evicted|| number|dwnlded|
	---------------------------------------------------------------------
	|      master      |   1   |   0   |   0   |   0   ||   1   |   0   |
	---------------------------------------------------------------------
[clover-setup] Clover Version 2.6.3, built on November 20 2009 (build-778)
[clover-setup] Loaded from: /home/hudson/.ivy2/cache/com.cenqua.clover/clover/jars/clover-2.6.3.jar
[clover-setup] Clover: Open Source License registered to Apache.
[clover-setup] Clover is enabled with initstring '/usr/home/hudson/hudson-slave/workspace/Lucene-Solr-Clover-4.x/lucene/build/clover/db/coverage.db'

clover:

common.compile-core:

compile-core:

compile-test-framework:

ivy-availability-check:

ivy-fail:

ivy-configure:
[ivy:configure] :: loading settings :: file = /usr/home/hudson/hudson-slave/workspace/Lucene-Solr-Clover-4.x/lucene/ivy-settings.xml

resolve:

init:

compile-lucene-core:

compile-core:

common.compile-test:
    [mkdir] Created dir: /usr/home/hudson/hudson-slave/workspace/Lucene-Solr-Clover-4.x/lucene/build/highlighter/classes/test
    [javac] Compiling 17 source files to /usr/home/hudson/hudson-slave/workspace/Lucene-Solr-Clover-4.x/lucene/build/highlighter/classes/test
   [clover] Clover Version 2.6.3, built on November 20 2009 (build-778)
   [clover] Loaded from: /home/hudson/.ivy2/cache/com.cenqua.clover/clover/jars/clover-2.6.3.jar
   [clover] Clover: Open Source License registered to Apache.
   [clover] Updating existing database at '/usr/home/hudson/hudson-slave/workspace/Lucene-Solr-Clover-4.x/lucene/build/clover/db/coverage.db'.
   [clover] Processing files at 1.6 source level.
   [clover] Clover all over. Instrumented 17 files (3 packages).
   [clover] 159 test methods detected.
   [clover] Elapsed time = 0.175 secs. (97.143 files/sec, 33,022.859 srclines/sec)
     [echo] Building join...

ivy-availability-check:

ivy-fail:

ivy-configure:
[ivy:configure] :: loading settings :: file = /usr/home/hudson/hudson-slave/workspace/Lucene-Solr-Clover-4.x/lucene/ivy-settings.xml

resolve:

common.init:

compile-lucene-core:

ivy-availability-check:

ivy-fail:

ivy-configure:
[ivy:configure] :: loading settings :: file = /usr/home/hudson/hudson-slave/workspace/Lucene-Solr-Clover-4.x/lucene/ivy-settings.xml

resolve:

init:

-clover.disable:

-clover.setup:
     [echo] Code coverage with Atlassian Clover enabled.
[ivy:cachepath] :: resolving dependencies :: com.cenqua.clover#clover-caller;working
[ivy:cachepath] 	confs: [master]
[ivy:cachepath] 	found com.cenqua.clover#clover;2.6.3 in public
[ivy:cachepath] :: resolution report :: resolve 7ms :: artifacts dl 1ms
	---------------------------------------------------------------------
	|                  |            modules            ||   artifacts   |
	|       conf       | number| search|dwnlded|evicted|| number|dwnlded|
	---------------------------------------------------------------------
	|      master      |   1   |   0   |   0   |   0   ||   1   |   0   |
	---------------------------------------------------------------------
[clover-setup] Clover Version 2.6.3, built on November 20 2009 (build-778)
[clover-setup] Loaded from: /home/hudson/.ivy2/cache/com.cenqua.clover/clover/jars/clover-2.6.3.jar
[clover-setup] Clover: Open Source License registered to Apache.
[clover-setup] Clover is enabled with initstring '/usr/home/hudson/hudson-slave/workspace/Lucene-Solr-Clover-4.x/lucene/build/clover/db/coverage.db'

clover:

compile-core:

module-build.init:

check-grouping-uptodate:

jar-grouping:
     [echo] Building grouping...

ivy-availability-check:

ivy-fail:

ivy-configure:
[ivy:configure] :: loading settings :: file = /usr/home/hudson/hudson-slave/workspace/Lucene-Solr-Clover-4.x/lucene/ivy-settings.xml

resolve:

common.init:

compile-lucene-core:

module-build.init:

check-queries-uptodate:

jar-queries:

init:

-clover.disable:

-clover.setup:
     [echo] Code coverage with Atlassian Clover enabled.
[ivy:cachepath] :: resolving dependencies :: com.cenqua.clover#clover-caller;working
[ivy:cachepath] 	confs: [master]
[ivy:cachepath] 	found com.cenqua.clover#clover;2.6.3 in public
[ivy:cachepath] :: resolution report :: resolve 7ms :: artifacts dl 1ms
	---------------------------------------------------------------------
	|                  |            modules            ||   artifacts   |
	|       conf       | number| search|dwnlded|evicted|| number|dwnlded|
	---------------------------------------------------------------------
	|      master      |   1   |   0   |   0   |   0   ||   1   |   0   |
	---------------------------------------------------------------------
[clover-setup] Clover Version 2.6.3, built on November 20 2009 (build-778)
[clover-setup] Loaded from: /home/hudson/.ivy2/cache/com.cenqua.clover/clover/jars/clover-2.6.3.jar
[clover-setup] Clover: Open Source License registered to Apache.
[clover-setup] Clover is enabled with initstring '/usr/home/hudson/hudson-slave/workspace/Lucene-Solr-Clover-4.x/lucene/build/clover/db/coverage.db'

clover:

compile-core:

jar-core:
     [exec] Result: 1
      [jar] Building jar: /usr/home/hudson/hudson-slave/workspace/Lucene-Solr-Clover-4.x/lucene/build/grouping/lucene-grouping-4.0-2012-08-30_21-02-01.jar

init:

compile-test:
     [echo] Building join...

ivy-availability-check:

ivy-fail:

ivy-configure:
[ivy:configure] :: loading settings :: file = /usr/home/hudson/hudson-slave/workspace/Lucene-Solr-Clover-4.x/lucene/ivy-settings.xml

resolve:

common.init:

compile-lucene-core:

module-build.init:

check-grouping-uptodate:

jar-grouping:

init:

-clover.disable:

-clover.setup:
     [echo] Code coverage with Atlassian Clover enabled.
[ivy:cachepath] :: resolving dependencies :: com.cenqua.clover#clover-caller;working
[ivy:cachepath] 	confs: [master]
[ivy:cachepath] 	found com.cenqua.clover#clover;2.6.3 in public
[ivy:cachepath] :: resolution report :: resolve 14ms :: artifacts dl 2ms
	---------------------------------------------------------------------
	|                  |            modules            ||   artifacts   |
	|       conf       | number| search|dwnlded|evicted|| number|dwnlded|
	---------------------------------------------------------------------
	|      master      |   1   |   0   |   0   |   0   ||   1   |   0   |
	---------------------------------------------------------------------
[clover-setup] Clover Version 2.6.3, built on November 20 2009 (build-778)
[clover-setup] Loaded from: /home/hudson/.ivy2/cache/com.cenqua.clover/clover/jars/clover-2.6.3.jar
[clover-setup] Clover: Open Source License registered to Apache.
[clover-setup] Clover is enabled with initstring '/usr/home/hudson/hudson-slave/workspace/Lucene-Solr-Clover-4.x/lucene/build/clover/db/coverage.db'

clover:

compile-core:
    [mkdir] Created dir: /usr/home/hudson/hudson-slave/workspace/Lucene-Solr-Clover-4.x/lucene/build/join/classes/java
    [javac] Compiling 9 source files to /usr/home/hudson/hudson-slave/workspace/Lucene-Solr-Clover-4.x/lucene/build/join/classes/java
   [clover] Clover Version 2.6.3, built on November 20 2009 (build-778)
   [clover] Loaded from: /home/hudson/.ivy2/cache/com.cenqua.clover/clover/jars/clover-2.6.3.jar
   [clover] Clover: Open Source License registered to Apache.
   [clover] Updating existing database at '/usr/home/hudson/hudson-slave/workspace/Lucene-Solr-Clover-4.x/lucene/build/clover/db/coverage.db'.
   [clover] Processing files at 1.6 source level.
   [clover] Clover all over. Instrumented 9 files (1 package).
   [clover] Elapsed time = 0.099 secs. (90.909 files/sec, 23,696.971 srclines/sec)

compile-test-framework:

ivy-availability-check:

ivy-fail:

ivy-configure:
[ivy:configure] :: loading settings :: file = /usr/home/hudson/hudson-slave/workspace/Lucene-Solr-Clover-4.x/lucene/ivy-settings.xml

resolve:

init:

compile-lucene-core:

compile-core:

common.compile-test:
    [mkdir] Created dir: /usr/home/hudson/hudson-slave/workspace/Lucene-Solr-Clover-4.x/lucene/build/join/classes/test
    [javac] Compiling 2 source files to /usr/home/hudson/hudson-slave/workspace/Lucene-Solr-Clover-4.x/lucene/build/join/classes/test
   [clover] Clover Version 2.6.3, built on November 20 2009 (build-778)
   [clover] Loaded from: /home/hudson/.ivy2/cache/com.cenqua.clover/clover/jars/clover-2.6.3.jar
   [clover] Clover: Open Source License registered to Apache.
   [clover] Updating existing database at '/usr/home/hudson/hudson-slave/workspace/Lucene-Solr-Clover-4.x/lucene/build/clover/db/coverage.db'.
   [clover] Processing files at 1.6 source level.
   [clover] Clover all over. Instrumented 2 files (1 package).
   [clover] 11 test methods detected.
   [clover] Elapsed time = 0.062 secs. (32.258 files/sec, 28,870.969 srclines/sec)
     [echo] Building memory...

ivy-availability-check:

ivy-fail:

ivy-configure:
[ivy:configure] :: loading settings :: file = /usr/home/hudson/hudson-slave/workspace/Lucene-Solr-Clover-4.x/lucene/ivy-settings.xml

resolve:

common.init:

compile-lucene-core:

ivy-availability-check:

ivy-fail:

ivy-configure:
[ivy:configure] :: loading settings :: file = /usr/home/hudson/hudson-slave/workspace/Lucene-Solr-Clover-4.x/lucene/ivy-settings.xml

resolve:

init:

-clover.disable:

-clover.setup:
     [echo] Code coverage with Atlassian Clover enabled.
[ivy:cachepath] :: resolving dependencies :: com.cenqua.clover#clover-caller;working
[ivy:cachepath] 	confs: [master]
[ivy:cachepath] 	found com.cenqua.clover#clover;2.6.3 in public
[ivy:cachepath] :: resolution report :: resolve 8ms :: artifacts dl 0ms
	---------------------------------------------------------------------
	|                  |            modules            ||   artifacts   |
	|       conf       | number| search|dwnlded|evicted|| number|dwnlded|
	---------------------------------------------------------------------
	|      master      |   1   |   0   |   0   |   0   ||   1   |   0   |
	---------------------------------------------------------------------
[clover-setup] Clover Version 2.6.3, built on November 20 2009 (build-778)
[clover-setup] Loaded from: /home/hudson/.ivy2/cache/com.cenqua.clover/clover/jars/clover-2.6.3.jar
[clover-setup] Clover: Open Source License registered to Apache.
[clover-setup] Clover is enabled with initstring '/usr/home/hudson/hudson-slave/workspace/Lucene-Solr-Clover-4.x/lucene/build/clover/db/coverage.db'

clover:

compile-core:

init:

compile-test:
     [echo] Building memory...

check-queryparser-uptodate:

jar-queryparser:

ivy-availability-check:

ivy-fail:

ivy-configure:
[ivy:configure] :: loading settings :: file = /usr/home/hudson/hudson-slave/workspace/Lucene-Solr-Clover-4.x/lucene/ivy-settings.xml

resolve:

common.init:

compile-lucene-core:

init:

-clover.disable:

-clover.setup:
     [echo] Code coverage with Atlassian Clover enabled.
[ivy:cachepath] :: resolving dependencies :: com.cenqua.clover#clover-caller;working
[ivy:cachepath] 	confs: [master]
[ivy:cachepath] 	found com.cenqua.clover#clover;2.6.3 in public
[ivy:cachepath] :: resolution report :: resolve 8ms :: artifacts dl 1ms
	---------------------------------------------------------------------
	|                  |            modules            ||   artifacts   |
	|       conf       | number| search|dwnlded|evicted|| number|dwnlded|
	---------------------------------------------------------------------
	|      master      |   1   |   0   |   0   |   0   ||   1   |   0   |
	---------------------------------------------------------------------
[clover-setup] Clover Version 2.6.3, built on November 20 2009 (build-778)
[clover-setup] Loaded from: /home/hudson/.ivy2/cache/com.cenqua.clover/clover/jars/clover-2.6.3.jar
[clover-setup] Clover: Open Source License registered to Apache.
[clover-setup] Clover is enabled with initstring '/usr/home/hudson/hudson-slave/workspace/Lucene-Solr-Clover-4.x/lucene/build/clover/db/coverage.db'

clover:

common.compile-core:

compile-core:

compile-test-framework:

ivy-availability-check:

ivy-fail:

ivy-configure:
[ivy:configure] :: loading settings :: file = /usr/home/hudson/hudson-slave/workspace/Lucene-Solr-Clover-4.x/lucene/ivy-settings.xml

resolve:

init:

compile-lucene-core:

compile-core:

common.compile-test:
    [mkdir] Created dir: /usr/home/hudson/hudson-slave/workspace/Lucene-Solr-Clover-4.x/lucene/build/memory/classes/test
    [javac] Compiling 1 source file to /usr/home/hudson/hudson-slave/workspace/Lucene-Solr-Clover-4.x/lucene/build/memory/classes/test
   [clover] Clover Version 2.6.3, built on November 20 2009 (build-778)
   [clover] Loaded from: /home/hudson/.ivy2/cache/com.cenqua.clover/clover/jars/clover-2.6.3.jar
   [clover] Clover: Open Source License registered to Apache.
   [clover] Updating existing database at '/usr/home/hudson/hudson-slave/workspace/Lucene-Solr-Clover-4.x/lucene/build/clover/db/coverage.db'.
   [clover] Processing files at 1.6 source level.
   [clover] Clover all over. Instrumented 1 file (1 package).
   [clover] 5 test methods detected.
   [clover] Elapsed time = 0.008 secs. (125 files/sec, 33,625 srclines/sec)
     [copy] Copying 2 files to /usr/home/hudson/hudson-slave/workspace/Lucene-Solr-Clover-4.x/lucene/build/memory/classes/test
     [echo] Building misc...

ivy-availability-check:

ivy-fail:

ivy-configure:
[ivy:configure] :: loading settings :: file = /usr/home/hudson/hudson-slave/workspace/Lucene-Solr-Clover-4.x/lucene/ivy-settings.xml

resolve:

common.init:

compile-lucene-core:

ivy-availability-check:

ivy-fail:

ivy-configure:
[ivy:configure] :: loading settings :: file = /usr/home/hudson/hudson-slave/workspace/Lucene-Solr-Clover-4.x/lucene/ivy-settings.xml

resolve:

init:

-clover.disable:

-clover.setup:
     [echo] Code coverage with Atlassian Clover enabled.
[ivy:cachepath] :: resolving dependencies :: com.cenqua.clover#clover-caller;working
[ivy:cachepath] 	confs: [master]
[ivy:cachepath] 	found com.cenqua.clover#clover;2.6.3 in public
[ivy:cachepath] :: resolution report :: resolve 8ms :: artifacts dl 0ms
	---------------------------------------------------------------------
	|                  |            modules            ||   artifacts   |
	|       conf       | number| search|dwnlded|evicted|| number|dwnlded|
	---------------------------------------------------------------------
	|      master      |   1   |   0   |   0   |   0   ||   1   |   0   |
	---------------------------------------------------------------------
[clover-setup] Clover Version 2.6.3, built on November 20 2009 (build-778)
[clover-setup] Loaded from: /home/hudson/.ivy2/cache/com.cenqua.clover/clover/jars/clover-2.6.3.jar
[clover-setup] Clover: Open Source License registered to Apache.
[clover-setup] Clover is enabled with initstring '/usr/home/hudson/hudson-slave/workspace/Lucene-Solr-Clover-4.x/lucene/build/clover/db/coverage.db'

clover:

compile-core:

init:

compile-test:
     [echo] Building misc...

ivy-availability-check:

ivy-fail:

ivy-configure:
[ivy:configure] :: loading settings :: file = /usr/home/hudson/hudson-slave/workspace/Lucene-Solr-Clover-4.x/lucene/ivy-settings.xml

resolve:

common.init:

compile-lucene-core:

init:

-clover.disable:

-clover.setup:
     [echo] Code coverage with Atlassian Clover enabled.
[ivy:cachepath] :: resolving dependencies :: com.cenqua.clover#clover-caller;working
[ivy:cachepath] 	confs: [master]
[ivy:cachepath] 	found com.cenqua.clover#clover;2.6.3 in public
[ivy:cachepath] :: resolution report :: resolve 8ms :: artifacts dl 1ms
	---------------------------------------------------------------------
	|                  |            modules            ||   artifacts   |
	|       conf       | number| search|dwnlded|evicted|| number|dwnlded|
	---------------------------------------------------------------------
	|      master      |   1   |   0   |   0   |   0   ||   1   |   0   |
	---------------------------------------------------------------------
[clover-setup] Clover Version 2.6.3, built on November 20 2009 (build-778)
[clover-setup] Loaded from: /home/hudson/.ivy2/cache/com.cenqua.clover/clover/jars/clover-2.6.3.jar
[clover-setup] Clover: Open Source License registered to Apache.
[clover-setup] Clover is enabled with initstring '/usr/home/hudson/hudson-slave/workspace/Lucene-Solr-Clover-4.x/lucene/build/clover/db/coverage.db'

clover:

compile-core:
    [mkdir] Created dir: /usr/home/hudson/hudson-slave/workspace/Lucene-Solr-Clover-4.x/lucene/build/misc/classes/java
    [javac] Compiling 13 source files to /usr/home/hudson/hudson-slave/workspace/Lucene-Solr-Clover-4.x/lucene/build/misc/classes/java
   [clover] Clover Version 2.6.3, built on November 20 2009 (build-778)
   [clover] Loaded from: /home/hudson/.ivy2/cache/com.cenqua.clover/clover/jars/clover-2.6.3.jar
   [clover] Clover: Open Source License registered to Apache.
   [clover] Updating existing database at '/usr/home/hudson/hudson-slave/workspace/Lucene-Solr-Clover-4.x/lucene/build/clover/db/coverage.db'.
   [clover] Processing files at 1.6 source level.
   [clover] Clover all over. Instrumented 13 files (4 packages).
   [clover] Elapsed time = 0.066 secs. (196.97 files/sec, 32,848.484 srclines/sec)
    [javac] Note: /var/tmp/clover788890234513649261.tmp/org/apache/lucene/misc/IndexMergeTool.java uses or overrides a deprecated API.
    [javac] Note: Recompile with -Xlint:deprecation for details.

compile-test-framework:

ivy-availability-check:

ivy-fail:

ivy-configure:
[ivy:configure] :: loading settings :: file = /usr/home/hudson/hudson-slave/workspace/Lucene-Solr-Clover-4.x/lucene/ivy-settings.xml

resolve:

init:

compile-lucene-core:

compile-core:

common.compile-test:
    [mkdir] Created dir: /usr/home/hudson/hudson-slave/workspace/Lucene-Solr-Clover-4.x/lucene/build/misc/classes/test
    [javac] Compiling 5 source files to /usr/home/hudson/hudson-slave/workspace/Lucene-Solr-Clover-4.x/lucene/build/misc/classes/test
   [clover] Clover Version 2.6.3, built on November 20 2009 (build-778)
   [clover] Loaded from: /home/hudson/.ivy2/cache/com.cenqua.clover/clover/jars/clover-2.6.3.jar
   [clover] Clover: Open Source License registered to Apache.
   [clover] Updating existing database at '/usr/home/hudson/hudson-slave/workspace/Lucene-Solr-Clover-4.x/lucene/build/clover/db/coverage.db'.
   [clover] Processing files at 1.6 source level.
   [clover] Clover all over. Instrumented 5 files (2 packages).
   [clover] 18 test methods detected.
   [clover] Elapsed time = 0.031 secs. (161.29 files/sec, 29,548.387 srclines/sec)
     [copy] Copied 2 empty directories to 2 empty directories under /usr/home/hudson/hudson-slave/workspace/Lucene-Solr-Clover-4.x/lucene/build/misc/classes/test
     [echo] Building queries...

ivy-availability-check:

ivy-fail:

ivy-configure:
[ivy:configure] :: loading settings :: file = /usr/home/hudson/hudson-slave/workspace/Lucene-Solr-Clover-4.x/lucene/ivy-settings.xml

resolve:

common.init:

compile-lucene-core:

ivy-availability-check:

ivy-fail:

ivy-configure:
[ivy:configure] :: loading settings :: file = /usr/home/hudson/hudson-slave/workspace/Lucene-Solr-Clover-4.x/lucene/ivy-settings.xml

resolve:

init:

-clover.disable:

-clover.setup:
     [echo] Code coverage with Atlassian Clover enabled.
[ivy:cachepath] :: resolving dependencies :: com.cenqua.clover#clover-caller;working
[ivy:cachepath] 	confs: [master]
[ivy:cachepath] 	found com.cenqua.clover#clover;2.6.3 in public
[ivy:cachepath] :: resolution report :: resolve 7ms :: artifacts dl 1ms
	---------------------------------------------------------------------
	|                  |            modules            ||   artifacts   |
	|       conf       | number| search|dwnlded|evicted|| number|dwnlded|
	---------------------------------------------------------------------
	|      master      |   1   |   0   |   0   |   0   ||   1   |   0   |
	---------------------------------------------------------------------
[clover-setup] Clover Version 2.6.3, built on November 20 2009 (build-778)
[clover-setup] Loaded from: /home/hudson/.ivy2/cache/com.cenqua.clover/clover/jars/clover-2.6.3.jar
[clover-setup] Clover: Open Source License registered to Apache.
[clover-setup] Clover is enabled with initstring '/usr/home/hudson/hudson-slave/workspace/Lucene-Solr-Clover-4.x/lucene/build/clover/db/coverage.db'

clover:

compile-core:

init:

compile-test:
     [echo] Building queries...

ivy-availability-check:

ivy-fail:

ivy-configure:
[ivy:configure] :: loading settings :: file = /usr/home/hudson/hudson-slave/workspace/Lucene-Solr-Clover-4.x/lucene/ivy-settings.xml

resolve:

common.init:

compile-lucene-core:

init:

-clover.disable:

-clover.setup:
     [echo] Code coverage with Atlassian Clover enabled.
[ivy:cachepath] :: resolving dependencies :: com.cenqua.clover#clover-caller;working
[ivy:cachepath] 	confs: [master]
[ivy:cachepath] 	found com.cenqua.clover#clover;2.6.3 in public
[ivy:cachepath] :: resolution report :: resolve 7ms :: artifacts dl 1ms
	---------------------------------------------------------------------
	|                  |            modules            ||   artifacts   |
	|       conf       | number| search|dwnlded|evicted|| number|dwnlded|
	---------------------------------------------------------------------
	|      master      |   1   |   0   |   0   |   0   ||   1   |   0   |
	---------------------------------------------------------------------
[clover-setup] Clover Version 2.6.3, built on November 20 2009 (build-778)
[clover-setup] Loaded from: /home/hudson/.ivy2/cache/com.cenqua.clover/clover/jars/clover-2.6.3.jar
[clover-setup] Clover: Open Source License registered to Apache.
[clover-setup] Clover is enabled with initstring '/usr/home/hudson/hudson-slave/workspace/Lucene-Solr-Clover-4.x/lucene/build/clover/db/coverage.db'

clover:

compile-core:

compile-test-framework:

ivy-availability-check:

ivy-fail:

ivy-configure:
[ivy:configure] :: loading settings :: file = /usr/home/hudson/hudson-slave/workspace/Lucene-Solr-Clover-4.x/lucene/ivy-settings.xml

resolve:

init:

compile-lucene-core:

compile-core:

common.compile-test:
    [mkdir] Created dir: /usr/home/hudson/hudson-slave/workspace/Lucene-Solr-Clover-4.x/lucene/build/queries/classes/test
    [javac] Compiling 11 source files to /usr/home/hudson/hudson-slave/workspace/Lucene-Solr-Clover-4.x/lucene/build/queries/classes/test
   [clover] Clover Version 2.6.3, built on November 20 2009 (build-778)
   [clover] Loaded from: /home/hudson/.ivy2/cache/com.cenqua.clover/clover/jars/clover-2.6.3.jar
   [clover] Clover: Open Source License registered to Apache.
   [clover] Updating existing database at '/usr/home/hudson/hudson-slave/workspace/Lucene-Solr-Clover-4.x/lucene/build/clover/db/coverage.db'.
   [clover] Processing files at 1.6 source level.
   [clover] Clover all over. Instrumented 11 files (3 packages).
   [clover] 75 test methods detected.
   [clover] Elapsed time = 0.096 secs. (114.583 files/sec, 22,614.584 srclines/sec)
     [echo] Building queryparser...

ivy-availability-check:

ivy-fail:

ivy-configure:
[ivy:configure] :: loading settings :: file = /usr/home/hudson/hudson-slave/workspace/Lucene-Solr-Clover-4.x/lucene/ivy-settings.xml

resolve:

common.init:

compile-lucene-core:

ivy-availability-check:

ivy-fail:

ivy-configure:
[ivy:configure] :: loading settings :: file = /usr/home/hudson/hudson-slave/workspace/Lucene-Solr-Clover-4.x/lucene/ivy-settings.xml

resolve:

init:

-clover.disable:

-clover.setup:
     [echo] Code coverage with Atlassian Clover enabled.
[ivy:cachepath] :: resolving dependencies :: com.cenqua.clover#clover-caller;working
[ivy:cachepath] 	confs: [master]
[ivy:cachepath] 	found com.cenqua.clover#clover;2.6.3 in public
[ivy:cachepath] :: resolution report :: resolve 7ms :: artifacts dl 0ms
	---------------------------------------------------------------------
	|                  |            modules            ||   artifacts   |
	|       conf       | number| search|dwnlded|evicted|| number|dwnlded|
	---------------------------------------------------------------------
	|      master      |   1   |   0   |   0   |   0   ||   1   |   0   |
	---------------------------------------------------------------------
[clover-setup] Clover Version 2.6.3, built on November 20 2009 (build-778)
[clover-setup] Loaded from: /home/hudson/.ivy2/cache/com.cenqua.clover/clover/jars/clover-2.6.3.jar
[clover-setup] Clover: Open Source License registered to Apache.
[clover-setup] Clover is enabled with initstring '/usr/home/hudson/hudson-slave/workspace/Lucene-Solr-Clover-4.x/lucene/build/clover/db/coverage.db'

clover:

compile-core:

init:

compile-test:
     [echo] Building queryparser...

check-queries-uptodate:

jar-queries:

check-sandbox-uptodate:

jar-sandbox:

ivy-availability-check:

ivy-fail:

ivy-configure:
[ivy:configure] :: loading settings :: file = /usr/home/hudson/hudson-slave/workspace/Lucene-Solr-Clover-4.x/lucene/ivy-settings.xml

resolve:

common.init:

compile-lucene-core:

init:

-clover.disable:

-clover.setup:
     [echo] Code coverage with Atlassian Clover enabled.
[ivy:cachepath] :: resolving dependencies :: com.cenqua.clover#clover-caller;working
[ivy:cachepath] 	confs: [master]
[ivy:cachepath] 	found com.cenqua.clover#clover;2.6.3 in public
[ivy:cachepath] :: resolution report :: resolve 7ms :: artifacts dl 0ms
	---------------------------------------------------------------------
	|                  |            modules            ||   artifacts   |
	|       conf       | number| search|dwnlded|evicted|| number|dwnlded|
	---------------------------------------------------------------------
	|      master      |   1   |   0   |   0   |   0   ||   1   |   0   |
	---------------------------------------------------------------------
[clover-setup] Clover Version 2.6.3, built on November 20 2009 (build-778)
[clover-setup] Loaded from: /home/hudson/.ivy2/cache/com.cenqua.clover/clover/jars/clover-2.6.3.jar
[clover-setup] Clover: Open Source License registered to Apache.
[clover-setup] Clover is enabled with initstring '/usr/home/hudson/hudson-slave/workspace/Lucene-Solr-Clover-4.x/lucene/build/clover/db/coverage.db'

clover:

common.compile-core:

compile-core:

compile-test-framework:

ivy-availability-check:

ivy-fail:

ivy-configure:
[ivy:configure] :: loading settings :: file = /usr/home/hudson/hudson-slave/workspace/Lucene-Solr-Clover-4.x/lucene/ivy-settings.xml

resolve:

init:

compile-lucene-core:

compile-core:

common.compile-test:
    [mkdir] Created dir: /usr/home/hudson/hudson-slave/workspace/Lucene-Solr-Clover-4.x/lucene/build/queryparser/classes/test
    [javac] Compiling 41 source files to /usr/home/hudson/hudson-slave/workspace/Lucene-Solr-Clover-4.x/lucene/build/queryparser/classes/test
   [clover] Clover Version 2.6.3, built on November 20 2009 (build-778)
   [clover] Loaded from: /home/hudson/.ivy2/cache/com.cenqua.clover/clover/jars/clover-2.6.3.jar
   [clover] Clover: Open Source License registered to Apache.
   [clover] Updating existing database at '/usr/home/hudson/hudson-slave/workspace/Lucene-Solr-Clover-4.x/lucene/build/clover/db/coverage.db'.
   [clover] Processing files at 1.6 source level.
   [clover] Clover all over. Instrumented 41 files (14 packages).
   [clover] 267 test methods detected.
   [clover] Elapsed time = 0.222 secs. (184.685 files/sec, 39,837.836 srclines/sec)
    [javac] /var/tmp/clover8885458579099833463.tmp/org/apache/lucene/queryparser/xml/builders/TestNumericRangeQueryBuilder.java:58: warning: [unchecked] unchecked cast
    [javac] found   : org.apache.lucene.search.Query
    [javac] required: org.apache.lucene.search.NumericRangeQuery<java.lang.Integer>
    [javac]     __CLR2_6_34w3f4w3fh6idvbqk.R.inc(228233);NumericRangeQuery<Integer> numRangeFilter = (NumericRangeQuery<Integer>) filter;
    [javac]                                                                                                                       ^
    [javac] /var/tmp/clover8885458579099833463.tmp/org/apache/lucene/queryparser/xml/builders/TestNumericRangeQueryBuilder.java:70: warning: [unchecked] unchecked conversion
    [javac] found   : org.apache.lucene.search.NumericRangeQuery
    [javac] required: org.apache.lucene.search.NumericRangeQuery<java.lang.Integer>
    [javac]     __CLR2_6_34w3f4w3fh6idvbqk.R.inc(228243);NumericRangeQuery<Integer> numRangeFilter2 = (NumericRangeQuery) filter2;
    [javac]                                                                                           ^
    [javac] /var/tmp/clover8885458579099833463.tmp/org/apache/lucene/queryparser/xml/builders/TestNumericRangeQueryBuilder.java:86: warning: [unchecked] unchecked conversion
    [javac] found   : org.apache.lucene.search.NumericRangeQuery
    [javac] required: org.apache.lucene.search.NumericRangeQuery<java.lang.Long>
    [javac]     __CLR2_6_34w3f4w3fh6idvbqk.R.inc(228255);NumericRangeQuery<Long> numRangeFilter = (NumericRangeQuery) filter;
    [javac]                                                                                       ^
    [javac] /var/tmp/clover8885458579099833463.tmp/org/apache/lucene/queryparser/xml/builders/TestNumericRangeQueryBuilder.java:98: warning: [unchecked] unchecked conversion
    [javac] found   : org.apache.lucene.search.NumericRangeQuery
    [javac] required: org.apache.lucene.search.NumericRangeQuery<java.lang.Long>
    [javac]     __CLR2_6_34w3f4w3fh6idvbqk.R.inc(228265);NumericRangeQuery<Long> numRangeFilter2 = (NumericRangeQuery) filter2;
    [javac]                                                                                        ^
    [javac] /var/tmp/clover8885458579099833463.tmp/org/apache/lucene/queryparser/xml/builders/TestNumericRangeQueryBuilder.java:116: warning: [unchecked] unchecked conversion
    [javac] found   : org.apache.lucene.search.NumericRangeQuery
    [javac] required: org.apache.lucene.search.NumericRangeQuery<java.lang.Double>
    [javac]     __CLR2_6_34w3f4w3fh6idvbqk.R.inc(228277);NumericRangeQuery<Double> numRangeFilter = (NumericRangeQuery) filter;
    [javac]                                                                                         ^
    [javac] /var/tmp/clover8885458579099833463.tmp/org/apache/lucene/queryparser/xml/builders/TestNumericRangeQueryBuilder.java:128: warning: [unchecked] unchecked conversion
    [javac] found   : org.apache.lucene.search.NumericRangeQuery
    [javac] required: org.apache.lucene.search.NumericRangeQuery<java.lang.Double>
    [javac]     __CLR2_6_34w3f4w3fh6idvbqk.R.inc(228287);NumericRangeQuery<Double> numRangeFilter2 = (NumericRangeQuery) filter2;
    [javac]                                                                                          ^
    [javac] /var/tmp/clover8885458579099833463.tmp/org/apache/lucene/queryparser/xml/builders/TestNumericRangeQueryBuilder.java:146: warning: [unchecked] unchecked conversion
    [javac] found   : org.apache.lucene.search.NumericRangeQuery
    [javac] required: org.apache.lucene.search.NumericRangeQuery<java.lang.Float>
    [javac]     __CLR2_6_34w3f4w3fh6idvbqk.R.inc(228299);NumericRangeQuery<Float> numRangeFilter = (NumericRangeQuery) filter;
    [javac]                                                                                        ^
    [javac] /var/tmp/clover8885458579099833463.tmp/org/apache/lucene/queryparser/xml/builders/TestNumericRangeQueryBuilder.java:159: warning: [unchecked] unchecked conversion
    [javac] found   : org.apache.lucene.search.NumericRangeQuery
    [javac] required: org.apache.lucene.search.NumericRangeQuery<java.lang.Float>
    [javac]     __CLR2_6_34w3f4w3fh6idvbqk.R.inc(228309);NumericRangeQuery<Float> numRangeFilter2 = (NumericRangeQuery) filter2;
    [javac]                                                                                         ^
    [javac] /var/tmp/clover8885458579099833463.tmp/org/apache/lucene/queryparser/xml/builders/TestNumericRangeFilterBuilder.java:92: warning: [unchecked] unchecked cast
    [javac] found   : org.apache.lucene.search.Filter
    [javac] required: org.apache.lucene.search.NumericRangeFilter<java.lang.Integer>
    [javac]     __CLR2_6_34wvs4wvsh6idvbse.R.inc(229273);NumericRangeFilter<Integer> numRangeFilter = (NumericRangeFilter<Integer>) filter;
    [javac]                                                                                                                         ^
    [javac] /var/tmp/clover8885458579099833463.tmp/org/apache/lucene/queryparser/xml/builders/TestNumericRangeFilterBuilder.java:104: warning: [unchecked] unchecked conversion
    [javac] found   : org.apache.lucene.search.NumericRangeFilter
    [javac] required: org.apache.lucene.search.NumericRangeFilter<java.lang.Integer>
    [javac]     __CLR2_6_34wvs4wvsh6idvbse.R.inc(229283);NumericRangeFilter<Integer> numRangeFilter2 = (NumericRangeFilter) filter2;
    [javac]                                                                                            ^
    [javac] /var/tmp/clover8885458579099833463.tmp/org/apache/lucene/queryparser/xml/builders/TestNumericRangeFilterBuilder.java:122: warning: [unchecked] unchecked conversion
    [javac] found   : org.apache.lucene.search.NumericRangeFilter
    [javac] required: org.apache.lucene.search.NumericRangeFilter<java.lang.Long>
    [javac]     __CLR2_6_34wvs4wvsh6idvbse.R.inc(229296);NumericRangeFilter<Long> numRangeFilter = (NumericRangeFilter) filter;
    [javac]                                                                                        ^
    [javac] /var/tmp/clover8885458579099833463.tmp/org/apache/lucene/queryparser/xml/builders/TestNumericRangeFilterBuilder.java:133: warning: [unchecked] unchecked conversion
    [javac] found   : org.apache.lucene.search.NumericRangeFilter
    [javac] required: org.apache.lucene.search.NumericRangeFilter<java.lang.Long>
    [javac]     __CLR2_6_34wvs4wvsh6idvbse.R.inc(229306);NumericRangeFilter<Long> numRangeFilter2 = (NumericRangeFilter) filter2;
    [javac]                                                                                         ^
    [javac] /var/tmp/clover8885458579099833463.tmp/org/apache/lucene/queryparser/xml/builders/TestNumericRangeFilterBuilder.java:152: warning: [unchecked] unchecked conversion
    [javac] found   : org.apache.lucene.search.NumericRangeFilter
    [javac] required: org.apache.lucene.search.NumericRangeFilter<java.lang.Double>
    [javac]     __CLR2_6_34wvs4wvsh6idvbse.R.inc(229319);NumericRangeFilter<Double> numRangeFilter = (NumericRangeFilter) filter;
    [javac]                                                                                          ^
    [javac] /var/tmp/clover8885458579099833463.tmp/org/apache/lucene/queryparser/xml/builders/TestNumericRangeFilterBuilder.java:164: warning: [unchecked] unchecked conversion
    [javac] found   : org.apache.lucene.search.NumericRangeFilter
    [javac] required: org.apache.lucene.search.NumericRangeFilter<java.lang.Double>
    [javac]     __CLR2_6_34wvs4wvsh6idvbse.R.inc(229329);NumericRangeFilter<Double> numRangeFilter2 = (NumericRangeFilter) filter2;
    [javac]                                                                                           ^
    [javac] /var/tmp/clover8885458579099833463.tmp/org/apache/lucene/queryparser/xml/builders/TestNumericRangeFilterBuilder.java:183: warning: [unchecked] unchecked conversion
    [javac] found   : org.apache.lucene.search.NumericRangeFilter
    [javac] required: org.apache.lucene.search.NumericRangeFilter<java.lang.Float>
    [javac]     __CLR2_6_34wvs4wvsh6idvbse.R.inc(229342);NumericRangeFilter<Float> numRangeFilter = (NumericRangeFilter) filter;
    [javac]                                                                                         ^
    [javac] /var/tmp/clover8885458579099833463.tmp/org/apache/lucene/queryparser/xml/builders/TestNumericRangeFilterBuilder.java:196: warning: [unchecked] unchecked conversion
    [javac] found   : org.apache.lucene.search.NumericRangeFilter
    [javac] required: org.apache.lucene.search.NumericRangeFilter<java.lang.Float>
    [javac]     __CLR2_6_34wvs4wvsh6idvbse.R.inc(229352);NumericRangeFilter<Float> numRangeFilter2 = (NumericRangeFilter) filter2;
    [javac]                                                                                          ^
    [javac] Note: Some input files use or override a deprecated API.
    [javac] Note: Recompile with -Xlint:deprecation for details.
    [javac] 16 warnings
     [copy] Copying 27 files to /usr/home/hudson/hudson-slave/workspace/Lucene-Solr-Clover-4.x/lucene/build/queryparser/classes/test
     [copy] Copied 1 empty directory to 1 empty directory under /usr/home/hudson/hudson-slave/workspace/Lucene-Solr-Clover-4.x/lucene/build/queryparser/classes/test
     [echo] Building sandbox...

ivy-availability-check:

ivy-fail:

ivy-configure:
[ivy:configure] :: loading settings :: file = /usr/home/hudson/hudson-slave/workspace/Lucene-Solr-Clover-4.x/lucene/ivy-settings.xml

resolve:

common.init:

compile-lucene-core:

ivy-availability-check:

ivy-fail:

ivy-configure:
[ivy:configure] :: loading settings :: file = /usr/home/hudson/hudson-slave/workspace/Lucene-Solr-Clover-4.x/lucene/ivy-settings.xml

resolve:

init:

-clover.disable:

-clover.setup:
     [echo] Code coverage with Atlassian Clover enabled.
[ivy:cachepath] :: resolving dependencies :: com.cenqua.clover#clover-caller;working
[ivy:cachepath] 	confs: [master]
[ivy:cachepath] 	found com.cenqua.clover#clover;2.6.3 in public
[ivy:cachepath] :: resolution report :: resolve 6ms :: artifacts dl 1ms
	---------------------------------------------------------------------
	|                  |            modules            ||   artifacts   |
	|       conf       | number| search|dwnlded|evicted|| number|dwnlded|
	---------------------------------------------------------------------
	|      master      |   1   |   0   |   0   |   0   ||   1   |   0   |
	---------------------------------------------------------------------
[clover-setup] Clover Version 2.6.3, built on November 20 2009 (build-778)
[clover-setup] Loaded from: /home/hudson/.ivy2/cache/com.cenqua.clover/clover/jars/clover-2.6.3.jar
[clover-setup] Clover: Open Source License registered to Apache.
[clover-setup] Clover is enabled with initstring '/usr/home/hudson/hudson-slave/workspace/Lucene-Solr-Clover-4.x/lucene/build/clover/db/coverage.db'

clover:

compile-core:

init:

compile-test:
     [echo] Building sandbox...

ivy-availability-check:

ivy-fail:

ivy-configure:
[ivy:configure] :: loading settings :: file = /usr/home/hudson/hudson-slave/workspace/Lucene-Solr-Clover-4.x/lucene/ivy-settings.xml

resolve:

common.init:

compile-lucene-core:

init:

-clover.disable:

-clover.setup:
     [echo] Code coverage with Atlassian Clover enabled.
[ivy:cachepath] :: resolving dependencies :: com.cenqua.clover#clover-caller;working
[ivy:cachepath] 	confs: [master]
[ivy:cachepath] 	found com.cenqua.clover#clover;2.6.3 in public
[ivy:cachepath] :: resolution report :: resolve 7ms :: artifacts dl 1ms
	---------------------------------------------------------------------
	|                  |            modules            ||   artifacts   |
	|       conf       | number| search|dwnlded|evicted|| number|dwnlded|
	---------------------------------------------------------------------
	|      master      |   1   |   0   |   0   |   0   ||   1   |   0   |
	---------------------------------------------------------------------
[clover-setup] Clover Version 2.6.3, built on November 20 2009 (build-778)
[clover-setup] Loaded from: /home/hudson/.ivy2/cache/com.cenqua.clover/clover/jars/clover-2.6.3.jar
[clover-setup] Clover: Open Source License registered to Apache.
[clover-setup] Clover is enabled with initstring '/usr/home/hudson/hudson-slave/workspace/Lucene-Solr-Clover-4.x/lucene/build/clover/db/coverage.db'

clover:

compile-core:

compile-test-framework:

ivy-availability-check:

ivy-fail:

ivy-configure:
[ivy:configure] :: loading settings :: file = /usr/home/hudson/hudson-slave/workspace/Lucene-Solr-Clover-4.x/lucene/ivy-settings.xml

resolve:

init:

compile-lucene-core:

compile-core:

common.compile-test:
    [mkdir] Created dir: /usr/home/hudson/hudson-slave/workspace/Lucene-Solr-Clover-4.x/lucene/build/sandbox/classes/test
    [javac] Compiling 8 source files to /usr/home/hudson/hudson-slave/workspace/Lucene-Solr-Clover-4.x/lucene/build/sandbox/classes/test
   [clover] Clover Version 2.6.3, built on November 20 2009 (build-778)
   [clover] Loaded from: /home/hudson/.ivy2/cache/com.cenqua.clover/clover/jars/clover-2.6.3.jar
   [clover] Clover: Open Source License registered to Apache.
   [clover] Updating existing database at '/usr/home/hudson/hudson-slave/workspace/Lucene-Solr-Clover-4.x/lucene/build/clover/db/coverage.db'.
   [clover] Processing files at 1.6 source level.
   [clover] Clover all over. Instrumented 8 files (2 packages).
   [clover] 35 test methods detected.
   [clover] Elapsed time = 0.047 secs. (170.213 files/sec, 29,468.086 srclines/sec)
    [javac] Note: Some input files use or override a deprecated API.
    [javac] Note: Recompile with -Xlint:deprecation for details.
     [copy] Copying 1 file to /usr/home/hudson/hudson-slave/workspace/Lucene-Solr-Clover-4.x/lucene/build/sandbox/classes/test
     [copy] Copied 1 empty directory to 1 empty directory under /usr/home/hudson/hudson-slave/workspace/Lucene-Solr-Clover-4.x/lucene/build/sandbox/classes/test
     [echo] Building spatial...

ivy-availability-check:

ivy-fail:

ivy-configure:
[ivy:configure] :: loading settings :: file = /usr/home/hudson/hudson-slave/workspace/Lucene-Solr-Clover-4.x/lucene/ivy-settings.xml

resolve:

common.init:

compile-lucene-core:

ivy-availability-check:

ivy-fail:

ivy-configure:
[ivy:configure] :: loading settings :: file = /usr/home/hudson/hudson-slave/workspace/Lucene-Solr-Clover-4.x/lucene/ivy-settings.xml

resolve:

init:

-clover.disable:

-clover.setup:
     [echo] Code coverage with Atlassian Clover enabled.
[ivy:cachepath] :: resolving dependencies :: com.cenqua.clover#clover-caller;working
[ivy:cachepath] 	confs: [master]
[ivy:cachepath] 	found com.cenqua.clover#clover;2.6.3 in public
[ivy:cachepath] :: resolution report :: resolve 7ms :: artifacts dl 1ms
	---------------------------------------------------------------------
	|                  |            modules            ||   artifacts   |
	|       conf       | number| search|dwnlded|evicted|| number|dwnlded|
	---------------------------------------------------------------------
	|      master      |   1   |   0   |   0   |   0   ||   1   |   0   |
	---------------------------------------------------------------------
[clover-setup] Clover Version 2.6.3, built on November 20 2009 (build-778)
[clover-setup] Loaded from: /home/hudson/.ivy2/cache/com.cenqua.clover/clover/jars/clover-2.6.3.jar
[clover-setup] Clover: Open Source License registered to Apache.
[clover-setup] Clover is enabled with initstring '/usr/home/hudson/hudson-slave/workspace/Lucene-Solr-Clover-4.x/lucene/build/clover/db/coverage.db'

clover:

compile-core:

init:

compile-test:
     [echo] Building spatial...

check-queries-uptodate:

jar-queries:

ivy-availability-check:

ivy-fail:

ivy-configure:
[ivy:configure] :: loading settings :: file = /usr/home/hudson/hudson-slave/workspace/Lucene-Solr-Clover-4.x/lucene/ivy-settings.xml

resolve:

common.init:

compile-lucene-core:

init:

-clover.disable:

-clover.setup:
     [echo] Code coverage with Atlassian Clover enabled.
[ivy:cachepath] :: resolving dependencies :: com.cenqua.clover#clover-caller;working
[ivy:cachepath] 	confs: [master]
[ivy:cachepath] 	found com.cenqua.clover#clover;2.6.3 in public
[ivy:cachepath] :: resolution report :: resolve 7ms :: artifacts dl 1ms
	---------------------------------------------------------------------
	|                  |            modules            ||   artifacts   |
	|       conf       | number| search|dwnlded|evicted|| number|dwnlded|
	---------------------------------------------------------------------
	|      master      |   1   |   0   |   0   |   0   ||   1   |   0   |
	---------------------------------------------------------------------
[clover-setup] Clover Version 2.6.3, built on November 20 2009 (build-778)
[clover-setup] Loaded from: /home/hudson/.ivy2/cache/com.cenqua.clover/clover/jars/clover-2.6.3.jar
[clover-setup] Clover: Open Source License registered to Apache.
[clover-setup] Clover is enabled with initstring '/usr/home/hudson/hudson-slave/workspace/Lucene-Solr-Clover-4.x/lucene/build/clover/db/coverage.db'

clover:

common.compile-core:
    [mkdir] Created dir: /usr/home/hudson/hudson-slave/workspace/Lucene-Solr-Clover-4.x/lucene/build/spatial/classes/java
    [javac] Compiling 27 source files to /usr/home/hudson/hudson-slave/workspace/Lucene-Solr-Clover-4.x/lucene/build/spatial/classes/java
   [clover] Clover Version 2.6.3, built on November 20 2009 (build-778)
   [clover] Loaded from: /home/hudson/.ivy2/cache/com.cenqua.clover/clover/jars/clover-2.6.3.jar
   [clover] Clover: Open Source License registered to Apache.
   [clover] Updating existing database at '/usr/home/hudson/hudson-slave/workspace/Lucene-Solr-Clover-4.x/lucene/build/clover/db/coverage.db'.
   [clover] Processing files at 1.6 source level.
   [clover] Clover all over. Instrumented 27 files (6 packages).
   [clover] Elapsed time = 0.104 secs. (259.615 files/sec, 28,461.537 srclines/sec)
    [javac] Creating empty /usr/home/hudson/hudson-slave/workspace/Lucene-Solr-Clover-4.x/lucene/build/spatial/classes/java/org/apache/lucene/spatial/package-info.class
    [javac] Creating empty /usr/home/hudson/hudson-slave/workspace/Lucene-Solr-Clover-4.x/lucene/build/spatial/classes/java/org/apache/lucene/spatial/prefix/package-info.class
    [javac] Creating empty /usr/home/hudson/hudson-slave/workspace/Lucene-Solr-Clover-4.x/lucene/build/spatial/classes/java/org/apache/lucene/spatial/prefix/tree/package-info.class
    [javac] Creating empty /usr/home/hudson/hudson-slave/workspace/Lucene-Solr-Clover-4.x/lucene/build/spatial/classes/java/org/apache/lucene/spatial/query/package-info.class

compile-core:

compile-test-framework:

ivy-availability-check:

ivy-fail:

ivy-configure:
[ivy:configure] :: loading settings :: file = /usr/home/hudson/hudson-slave/workspace/Lucene-Solr-Clover-4.x/lucene/ivy-settings.xml

resolve:

init:

compile-lucene-core:

compile-core:

common.compile-test:
    [mkdir] Created dir: /usr/home/hudson/hudson-slave/workspace/Lucene-Solr-Clover-4.x/lucene/build/spatial/classes/test
    [javac] Compiling 12 source files to /usr/home/hudson/hudson-slave/workspace/Lucene-Solr-Clover-4.x/lucene/build/spatial/classes/test
   [clover] Clover Version 2.6.3, built on November 20 2009 (build-778)
   [clover] Loaded from: /home/hudson/.ivy2/cache/com.cenqua.clover/clover/jars/clover-2.6.3.jar
   [clover] Clover: Open Source License registered to Apache.
   [clover] Updating existing database at '/usr/home/hudson/hudson-slave/workspace/Lucene-Solr-Clover-4.x/lucene/build/clover/db/coverage.db'.
   [clover] Processing files at 1.6 source level.
   [clover] Clover all over. Instrumented 12 files (5 packages).
   [clover] 11 test methods detected.
   [clover] Elapsed time = 0.063 secs. (190.476 files/sec, 21,126.984 srclines/sec)
     [echo] Building suggest...

ivy-availability-check:

ivy-fail:

ivy-configure:
[ivy:configure] :: loading settings :: file = /usr/home/hudson/hudson-slave/workspace/Lucene-Solr-Clover-4.x/lucene/ivy-settings.xml

resolve:

common.init:

compile-lucene-core:

ivy-availability-check:

ivy-fail:

ivy-configure:
[ivy:configure] :: loading settings :: file = /usr/home/hudson/hudson-slave/workspace/Lucene-Solr-Clover-4.x/lucene/ivy-settings.xml

resolve:

init:

-clover.disable:

-clover.setup:
     [echo] Code coverage with Atlassian Clover enabled.
[ivy:cachepath] :: resolving dependencies :: com.cenqua.clover#clover-caller;working
[ivy:cachepath] 	confs: [master]
[ivy:cachepath] 	found com.cenqua.clover#clover;2.6.3 in public
[ivy:cachepath] :: resolution report :: resolve 7ms :: artifacts dl 1ms
	---------------------------------------------------------------------
	|                  |            modules            ||   artifacts   |
	|       conf       | number| search|dwnlded|evicted|| number|dwnlded|
	---------------------------------------------------------------------
	|      master      |   1   |   0   |   0   |   0   ||   1   |   0   |
	---------------------------------------------------------------------
[clover-setup] Clover Version 2.6.3, built on November 20 2009 (build-778)
[clover-setup] Loaded from: /home/hudson/.ivy2/cache/com.cenqua.clover/clover/jars/clover-2.6.3.jar
[clover-setup] Clover: Open Source License registered to Apache.
[clover-setup] Clover is enabled with initstring '/usr/home/hudson/hudson-slave/workspace/Lucene-Solr-Clover-4.x/lucene/build/clover/db/coverage.db'

clover:

compile-core:

init:

compile-test:
     [echo] Building suggest...

ivy-availability-check:

ivy-fail:

ivy-configure:
[ivy:configure] :: loading settings :: file = /usr/home/hudson/hudson-slave/workspace/Lucene-Solr-Clover-4.x/lucene/ivy-settings.xml

resolve:

common.init:

compile-lucene-core:

init:

-clover.disable:

-clover.setup:
     [echo] Code coverage with Atlassian Clover enabled.
[ivy:cachepath] :: resolving dependencies :: com.cenqua.clover#clover-caller;working
[ivy:cachepath] 	confs: [master]
[ivy:cachepath] 	found com.cenqua.clover#clover;2.6.3 in public
[ivy:cachepath] :: resolution report :: resolve 7ms :: artifacts dl 1ms
	---------------------------------------------------------------------
	|                  |            modules            ||   artifacts   |
	|       conf       | number| search|dwnlded|evicted|| number|dwnlded|
	---------------------------------------------------------------------
	|      master      |   1   |   0   |   0   |   0   ||   1   |   0   |
	---------------------------------------------------------------------
[clover-setup] Clover Version 2.6.3, built on November 20 2009 (build-778)
[clover-setup] Loaded from: /home/hudson/.ivy2/cache/com.cenqua.clover/clover/jars/clover-2.6.3.jar
[clover-setup] Clover: Open Source License registered to Apache.
[clover-setup] Clover is enabled with initstring '/usr/home/hudson/hudson-slave/workspace/Lucene-Solr-Clover-4.x/lucene/build/clover/db/coverage.db'

clover:

compile-core:
    [mkdir] Created dir: /usr/home/hudson/hudson-slave/workspace/Lucene-Solr-Clover-4.x/lucene/build/suggest/classes/java
    [javac] Compiling 38 source files to /usr/home/hudson/hudson-slave/workspace/Lucene-Solr-Clover-4.x/lucene/build/suggest/classes/java
   [clover] Clover Version 2.6.3, built on November 20 2009 (build-778)
   [clover] Loaded from: /home/hudson/.ivy2/cache/com.cenqua.clover/clover/jars/clover-2.6.3.jar
   [clover] Clover: Open Source License registered to Apache.
   [clover] Updating existing database at '/usr/home/hudson/hudson-slave/workspace/Lucene-Solr-Clover-4.x/lucene/build/clover/db/coverage.db'.
   [clover] Processing files at 1.6 source level.
   [clover] Clover all over. Instrumented 38 files (5 packages).
   [clover] Elapsed time = 0.169 secs. (224.852 files/sec, 42,094.676 srclines/sec)
    [javac] /var/tmp/clover2111111061735151362.tmp/org/apache/lucene/search/suggest/fst/FSTCompletion.java:147: warning: [unchecked] unchecked conversion
    [javac] found   : org.apache.lucene.util.fst.FST.Arc[]
    [javac] required: org.apache.lucene.util.fst.FST.Arc<java.lang.Object>[]
    [javac]       __CLR2_6_350y350y3h6idvkcz.R.inc(234539);return rootArcs.toArray(new Arc[rootArcs.size()]);
    [javac]                                                                       ^
    [javac] Note: Some input files use or override a deprecated API.
    [javac] Note: Recompile with -Xlint:deprecation for details.
    [javac] 1 warning

compile-test-framework:

ivy-availability-check:

ivy-fail:

ivy-configure:
[ivy:configure] :: loading settings :: file = /usr/home/hudson/hudson-slave/workspace/Lucene-Solr-Clover-4.x/lucene/ivy-settings.xml

resolve:

init:

compile-lucene-core:

compile-core:

common.compile-test:
    [mkdir] Created dir: /usr/home/hudson/hudson-slave/workspace/Lucene-Solr-Clover-4.x/lucene/build/suggest/classes/test
    [javac] Compiling 21 source files to /usr/home/hudson/hudson-slave/workspace/Lucene-Solr-Clover-4.x/lucene/build/suggest/classes/test
   [clover] Clover Version 2.6.3, built on November 20 2009 (build-778)
   [clover] Loaded from: /home/hudson/.ivy2/cache/com.cenqua.clover/clover/jars/clover-2.6.3.jar
   [clover] Clover: Open Source License registered to Apache.
   [clover] Updating existing database at '/usr/home/hudson/hudson-slave/workspace/Lucene-Solr-Clover-4.x/lucene/build/clover/db/coverage.db'.
   [clover] Processing files at 1.6 source level.
   [clover] Clover all over. Instrumented 21 files (3 packages).
   [clover] 64 test methods detected.
   [clover] Elapsed time = 0.094 secs. (223.404 files/sec, 32,361.703 srclines/sec)
    [javac] Note: Some input files use or override a deprecated API.
    [javac] Note: Recompile with -Xlint:deprecation for details.
     [copy] Copying 1 file to /usr/home/hudson/hudson-slave/workspace/Lucene-Solr-Clover-4.x/lucene/build/suggest/classes/test

test-modules:

test:
     [echo] Building analyzers-common...

ivy-availability-check:

ivy-fail:

ivy-configure:
[ivy:configure] :: loading settings :: file = /usr/home/hudson/hudson-slave/workspace/Lucene-Solr-Clover-4.x/lucene/ivy-settings.xml

resolve:

common.init:

compile-lucene-core:

ivy-availability-check:

ivy-fail:

ivy-configure:
[ivy:configure] :: loading settings :: file = /usr/home/hudson/hudson-slave/workspace/Lucene-Solr-Clover-4.x/lucene/ivy-settings.xml

resolve:

init:

-clover.disable:

-clover.setup:
     [echo] Code coverage with Atlassian Clover enabled.
[ivy:cachepath] :: resolving dependencies :: com.cenqua.clover#clover-caller;working
[ivy:cachepath] 	confs: [master]
[ivy:cachepath] 	found com.cenqua.clover#clover;2.6.3 in public
[ivy:cachepath] :: resolution report :: resolve 6ms :: artifacts dl 1ms
	---------------------------------------------------------------------
	|                  |            modules            ||   artifacts   |
	|       conf       | number| search|dwnlded|evicted|| number|dwnlded|
	---------------------------------------------------------------------
	|      master      |   1   |   0   |   0   |   0   ||   1   |   0   |
	---------------------------------------------------------------------
[clover-setup] Clover Version 2.6.3, built on November 20 2009 (build-778)
[clover-setup] Loaded from: /home/hudson/.ivy2/cache/com.cenqua.clover/clover/jars/clover-2.6.3.jar
[clover-setup] Clover: Open Source License registered to Apache.
[clover-setup] Clover is enabled with initstring '/usr/home/hudson/hudson-slave/workspace/Lucene-Solr-Clover-4.x/lucene/build/clover/db/coverage.db'

clover:

compile-core:

init:

test:
     [echo] Building analyzers-common...

ivy-availability-check:

ivy-fail:

ivy-configure:
[ivy:configure] :: loading settings :: file = /usr/home/hudson/hudson-slave/workspace/Lucene-Solr-Clover-4.x/lucene/ivy-settings.xml

resolve:

common.init:

compile-lucene-core:

init:

compile-test:
     [echo] Building analyzers-common...

jflex-uptodate-check:

jflex-notice:
     [echo] 
     [echo]       One or more of the JFlex .jflex files is newer than its corresponding
     [echo]       .java file.  Run the "jflex" target to regenerate the artifacts.
     [echo]     

ivy-availability-check:

ivy-fail:

ivy-configure:
[ivy:configure] :: loading settings :: file = /usr/home/hudson/hudson-slave/workspace/Lucene-Solr-Clover-4.x/lucene/ivy-settings.xml

resolve:

common.init:

compile-lucene-core:

init:

-clover.disable:

-clover.setup:
     [echo] Code coverage with Atlassian Clover enabled.
[ivy:cachepath] :: resolving dependencies :: com.cenqua.clover#clover-caller;working
[ivy:cachepath] 	confs: [master]
[ivy:cachepath] 	found com.cenqua.clover#clover;2.6.3 in public
[ivy:cachepath] :: resolution report :: resolve 7ms :: artifacts dl 1ms
	---------------------------------------------------------------------
	|                  |            modules            ||   artifacts   |
	|       conf       | number| search|dwnlded|evicted|| number|dwnlded|
	---------------------------------------------------------------------
	|      master      |   1   |   0   |   0   |   0   ||   1   |   0   |
	---------------------------------------------------------------------
[clover-setup] Clover Version 2.6.3, built on November 20 2009 (build-778)
[clover-setup] Loaded from: /home/hudson/.ivy2/cache/com.cenqua.clover/clover/jars/clover-2.6.3.jar
[clover-setup] Clover: Open Source License registered to Apache.
[clover-setup] Clover is enabled with initstring '/usr/home/hudson/hudson-slave/workspace/Lucene-Solr-Clover-4.x/lucene/build/clover/db/coverage.db'

clover:

common.compile-core:

compile-core:

compile-test-framework:

ivy-availability-check:

ivy-fail:

ivy-configure:
[ivy:configure] :: loading settings :: file = /usr/home/hudson/hudson-slave/workspace/Lucene-Solr-Clover-4.x/lucene/ivy-settings.xml

resolve:

init:

compile-lucene-core:

compile-core:

common.compile-test:

install-junit4-taskdef:

-clover.disable:

-clover.setup:
     [echo] Code coverage with Atlassian Clover enabled.
[ivy:cachepath] :: resolving dependencies :: com.cenqua.clover#clover-caller;working
[ivy:cachepath] 	confs: [master]
[ivy:cachepath] 	found com.cenqua.clover#clover;2.6.3 in public
[ivy:cachepath] :: resolution report :: resolve 7ms :: artifacts dl 1ms
	---------------------------------------------------------------------
	|                  |            modules            ||   artifacts   |
	|       conf       | number| search|dwnlded|evicted|| number|dwnlded|
	---------------------------------------------------------------------
	|      master      |   1   |   0   |   0   |   0   ||   1   |   0   |
	---------------------------------------------------------------------
[clover-setup] Clover Version 2.6.3, built on November 20 2009 (build-778)
[clover-setup] Loaded from: /home/hudson/.ivy2/cache/com.cenqua.clover/clover/jars/clover-2.6.3.jar
[clover-setup] Clover: Open Source License registered to Apache.
[clover-setup] Clover is enabled with initstring '/usr/home/hudson/hudson-slave/workspace/Lucene-Solr-Clover-4.x/lucene/build/clover/db/coverage.db'

clover:

validate:

common.test:
    [mkdir] Created dir: /usr/home/hudson/hudson-slave/workspace/Lucene-Solr-Clover-4.x/lucene/build/analysis/common/test
[junit4:junit4] <JUnit4> says g'day! Master seed: 1B476CACA0D422CA
[junit4:junit4] Your default console's encoding may not display certain unicode glyphs: ISO-8859-1
[junit4:junit4] Executing 224 suites with 1 JVM.
[junit4:junit4] 
[junit4:junit4] Suite: org.apache.lucene.analysis.en.TestPorterStemFilter
[junit4:junit4] Completed in 6.24s, 4 tests
[junit4:junit4] 
[junit4:junit4] Suite: org.apache.lucene.analysis.hi.TestHindiStemmer
[junit4:junit4] Completed in 0.08s, 5 tests
[junit4:junit4] 
[junit4:junit4] Suite: org.apache.lucene.analysis.it.TestItalianLightStemFilterFactory
[junit4:junit4] Completed in 0.17s, 1 test
[junit4:junit4] 
[junit4:junit4] Suite: org.apache.lucene.analysis.miscellaneous.TestStemmerOverrideFilterFactory
[junit4:junit4] Completed in 0.05s, 2 tests
[junit4:junit4] 
[junit4:junit4] Suite: org.apache.lucene.analysis.snowball.TestSnowballPorterFilterFactory
[junit4:junit4] Completed in 0.06s, 2 tests
[junit4:junit4] 
[junit4:junit4] Suite: org.apache.lucene.analysis.ngram.EdgeNGramTokenizerTest
[junit4:junit4] Completed in 2.97s, 10 tests
[junit4:junit4] 
[junit4:junit4] Suite: org.apache.lucene.analysis.hi.TestHindiAnalyzer
[junit4:junit4] Completed in 2.75s, 4 tests
[junit4:junit4] 
[junit4:junit4] Suite: org.apache.lucene.analysis.hy.TestArmenianAnalyzer
[junit4:junit4] Completed in 4.96s, 4 tests
[junit4:junit4] 
[junit4:junit4] Suite: org.apache.lucene.analysis.compound.TestHyphenationCompoundWordTokenFilterFactory
[junit4:junit4] Completed in 0.58s, 2 tests
[junit4:junit4] 
[junit4:junit4] Suite: org.apache.lucene.analysis.pattern.TestPatternReplaceCharFilterFactory
[junit4:junit4] Completed in 0.06s, 3 tests
[junit4:junit4] 
[junit4:junit4] Suite: org.apache.lucene.analysis.cn.TestChineseTokenizerFactory
[junit4:junit4] Completed in 0.05s, 1 test
[junit4:junit4] 
[junit4:junit4] Suite: org.apache.lucene.analysis.cn.TestChineseFilterFactory
[junit4:junit4] Completed in 0.02s, 1 test
[junit4:junit4] 
[junit4:junit4] Suite: org.apache.lucene.analysis.core.TestFactories
[junit4:junit4] Completed in 25.81s, 1 test
[junit4:junit4] 
[junit4:junit4] Suite: org.apache.lucene.analysis.core.TestUAX29URLEmailAnalyzer
[junit4:junit4] Completed in 1.86s, 32 tests
[junit4:junit4] 
[junit4:junit4] Suite: org.apache.lucene.analysis.shingle.TestShingleFilterFactory
[junit4:junit4] Completed in 0.11s, 13 tests
[junit4:junit4] 
[junit4:junit4] Suite: org.apache.lucene.analysis.charfilter.TestMappingCharFilterFactory
[junit4:junit4] Completed in 0.03s, 1 test
[junit4:junit4] 
[junit4:junit4] Suite: org.apache.lucene.analysis.en.TestEnglishMinimalStemFilterFactory
[junit4:junit4] Completed in 0.03s, 1 test
[junit4:junit4] 
[junit4:junit4] Suite: org.apache.lucene.analysis.synonym.TestSynonymFilterFactory
[junit4:junit4] Completed in 0.10s, 4 tests
[junit4:junit4] 
[junit4:junit4] Suite: org.apache.lucene.analysis.core.TestStopAnalyzer
[junit4:junit4] Completed in 0.04s, 3 tests
[junit4:junit4] 
[junit4:junit4] Suite: org.apache.lucene.analysis.snowball.TestSnowball
[junit4:junit4] Completed in 10.68s, 9 tests
[junit4:junit4] 
[junit4:junit4] Suite: org.apache.lucene.analysis.el.TestGreekStemmer
[junit4:junit4] Completed in 0.13s, 7 tests
[junit4:junit4] 
[junit4:junit4] Suite: org.apache.lucene.analysis.query.QueryAutoStopWordAnalyzerTest
[junit4:junit4] Completed in 0.58s, 7 tests
[junit4:junit4] 
[junit4:junit4] Suite: org.apache.lucene.analysis.miscellaneous.TestLengthFilterFactory
[junit4:junit4] Completed in 0.03s, 1 test
[junit4:junit4] 
[junit4:junit4] Suite: org.apache.lucene.analysis.cjk.TestCJKWidthFilter
[junit4:junit4] Completed in 0.78s, 4 tests
[junit4:junit4] 
[junit4:junit4] Suite: org.apache.lucene.analysis.ru.TestRussianLightStemFilterFactory
[junit4:junit4] Completed in 0.02s, 1 test
[junit4:junit4] 
[junit4:junit4] Suite: org.apache.lucene.analysis.gl.TestGalicianMinimalStemFilterFactory
[junit4:junit4] Completed in 0.02s, 1 test
[junit4:junit4] 
[junit4:junit4] Suite: org.apache.lucene.analysis.shingle.ShingleFilterTest
[junit4:junit4] Completed in 7.34s, 39 tests
[junit4:junit4] 
[junit4:junit4] Suite: org.apache.lucene.analysis.commongrams.TestCommonGramsQueryFilterFactory
[junit4:junit4] Completed in 0.03s, 2 tests
[junit4:junit4] 
[junit4:junit4] Suite: org.apache.lucene.analysis.hu.TestHungarianLightStemFilter
[junit4:junit4] Completed in 0.62s, 3 tests
[junit4:junit4] 
[junit4:junit4] Suite: org.apache.lucene.analysis.standard.TestUAX29URLEmailTokenizerFactory
[junit4:junit4] Completed in 0.06s, 9 tests
[junit4:junit4] 
[junit4:junit4] Suite: org.apache.lucene.analysis.synonym.TestSlowSynonymFilter
[junit4:junit4] Completed in 0.07s, 7 tests
[junit4:junit4] 
[junit4:junit4] Suite: org.apache.lucene.analysis.no.TestNorwegianLightStemFilter
[junit4:junit4] Completed in 0.95s, 4 tests
[junit4:junit4] 
[junit4:junit4] Suite: org.apache.lucene.analysis.fr.TestFrenchMinimalStemFilter
[junit4:junit4] Completed in 1.45s, 5 tests
[junit4:junit4] 
[junit4:junit4] Suite: org.apache.lucene.analysis.pattern.TestPatternTokenizer
[junit4:junit4] Completed in 1.05s, 3 tests
[junit4:junit4] 
[junit4:junit4] Suite: org.apache.lucene.analysis.wikipedia.WikipediaTokenizerTest
[junit4:junit4] Completed in 2.80s, 8 tests
[junit4:junit4] 
[junit4:junit4] Suite: org.apache.lucene.analysis.cjk.TestCJKTokenizer
[junit4:junit4] Completed in 6.78s, 13 tests
[junit4:junit4] 
[junit4:junit4] Suite: org.apache.lucene.analysis.da.TestDanishAnalyzer
[junit4:junit4] Completed in 1.25s, 4 tests
[junit4:junit4] 
[junit4:junit4] Suite: org.apache.lucene.analysis.ru.TestRussianLetterTokenizer
[junit4:junit4] Completed in 0.04s, 2 tests
[junit4:junit4] 
[junit4:junit4] Suite: org.apache.lucene.analysis.de.TestGermanMinimalStemFilter
[junit4:junit4] Completed in 2.39s, 5 tests
[junit4:junit4] 
[junit4:junit4] Suite: org.apache.lucene.analysis.miscellaneous.PatternAnalyzerTest
[junit4:junit4] Completed in 4.76s, 5 tests
[junit4:junit4] 
[junit4:junit4] Suite: org.apache.lucene.analysis.eu.TestBasqueAnalyzer
[junit4:junit4] Completed in 0.79s, 4 tests
[junit4:junit4] 
[junit4:junit4] Suite: org.apache.lucene.analysis.br.TestBrazilianStemmer
[junit4:junit4] Completed in 1.75s, 7 tests
[junit4:junit4] 
[junit4:junit4] Suite: org.apache.lucene.analysis.payloads.TokenOffsetPayloadTokenFilterTest
[junit4:junit4] Completed in 0.02s, 1 test
[junit4:junit4] 
[junit4:junit4] Suite: org.apache.lucene.analysis.core.TestClassicAnalyzer
[junit4:junit4] Completed in 3.66s, 29 tests
[junit4:junit4] 
[junit4:junit4] Suite: org.apache.lucene.analysis.fr.TestFrenchMinimalStemFilterFactory
[junit4:junit4] Completed in 0.02s, 1 test
[junit4:junit4] 
[junit4:junit4] Suite: org.apache.lucene.analysis.miscellaneous.TestWordDelimiterFilter
[junit4:junit4] Completed in 2.36s, 10 tests
[junit4:junit4] 
[junit4:junit4] Suite: org.apache.lucene.analysis.gl.TestGalicianStemFilter
[junit4:junit4] Completed in 0.59s, 2 tests
[junit4:junit4] 
[junit4:junit4] Suite: org.apache.lucene.analysis.compound.TestDictionaryCompoundWordTokenFilterFactory
[junit4:junit4] Completed in 0.04s, 1 test
[junit4:junit4] 
[junit4:junit4] Suite: org.apache.lucene.analysis.pt.TestPortugueseStemFilterFactory
[junit4:junit4] Completed in 0.01s, 1 test
[junit4:junit4] 
[junit4:junit4] Suite: org.apache.lucene.analysis.br.TestBrazilianStemFilterFactory
[junit4:junit4] Completed in 0.04s, 1 test
[junit4:junit4] 
[junit4:junit4] Suite: org.apache.lucene.analysis.ga.TestIrishLowerCaseFilter
[junit4:junit4] Completed in 0.03s, 2 tests
[junit4:junit4] 
[junit4:junit4] Suite: org.apache.lucene.analysis.miscellaneous.TestLimitTokenCountAnalyzer
[junit4:junit4] Completed in 0.18s, 2 tests
[junit4:junit4] 
[junit4:junit4] Suite: org.apache.lucene.analysis.core.TestStandardAnalyzer
[junit4:junit4] Completed in 5.67s, 32 tests
[junit4:junit4] 
[junit4:junit4] Suite: org.apache.lucene.analysis.miscellaneous.TestPrefixAwareTokenFilter
[junit4:junit4] Completed in 0.02s, 1 test
[junit4:junit4] 
[junit4:junit4] Suite: org.apache.lucene.analysis.lv.TestLatvianStemFilterFactory
[junit4:junit4] Completed in 0.03s, 1 test
[junit4:junit4] 
[junit4:junit4] Suite: org.apache.lucene.analysis.en.TestEnglishAnalyzer
[junit4:junit4] Completed in 1.00s, 4 tests
[junit4:junit4] 
[junit4:junit4] Suite: org.apache.lucene.analysis.core.TestRandomChains
[junit4:junit4] Completed in 6.69s, 1 test
[junit4:junit4] 
[junit4:junit4] Suite: org.apache.lucene.analysis.util.TestElisionFilterFactory
[junit4:junit4] Completed in 0.03s, 3 tests
[junit4:junit4] 
[junit4:junit4] Suite: org.apache.lucene.analysis.core.TestAnalyzers
[junit4:junit4] Completed in 6.54s, 12 tests
[junit4:junit4] 
[junit4:junit4] Suite: org.apache.lucene.analysis.path.TestPathHierarchyTokenizer
[junit4:junit4] Completed in 0.92s, 17 tests
[junit4:junit4] 
[junit4:junit4] Suite: org.apache.lucene.analysis.charfilter.TestHTMLStripCharFilterFactory
[junit4:junit4] Completed in 0.06s, 6 tests
[junit4:junit4] 
[junit4:junit4] Suite: org.apache.lucene.analysis.lv.TestLatvianStemmer
[junit4:junit4] Completed in 0.12s, 10 tests
[junit4:junit4] 
[junit4:junit4] Suite: org.apache.lucene.analysis.sinks.TestTeeSinkTokenFilter
[junit4:junit4] Completed in 0.07s, 3 tests
[junit4:junit4] 
[junit4:junit4] Suite: org.apache.lucene.analysis.th.TestThaiWordFilterFactory
[junit4:junit4] Completed in 0.02s, 1 test
[junit4:junit4] 
[junit4:junit4] Suite: org.apache.lucene.analysis.el.GreekAnalyzerTest
[junit4:junit4] Completed in 1.37s, 4 tests
[junit4:junit4] 
[junit4:junit4] Suite: org.apache.lucene.analysis.gl.TestGalicianMinimalStemFilter
[junit4:junit4] Completed in 0.96s, 5 tests
[junit4:junit4] 
[junit4:junit4] Suite: org.apache.lucene.analysis.core.TestStopFilterFactory
[junit4:junit4] Completed in 0.02s, 1 test
[junit4:junit4] 
[junit4:junit4] Suite: org.apache.lucene.analysis.ar.TestArabicFilters
[junit4:junit4] Completed in 0.04s, 4 tests
[junit4:junit4] 
[junit4:junit4] Suite: org.apache.lucene.analysis.no.TestNorwegianMinimalStemFilter
[junit4:junit4] Completed in 1.16s, 4 tests
[junit4:junit4] 
[junit4:junit4] Suite: org.apache.lucene.analysis.util.TestElision
[junit4:junit4] Completed in 0.03s, 2 tests
[junit4:junit4] 
[junit4:junit4] Suite: org.apache.lucene.analysis.es.TestSpanishLightStemFilter
[junit4:junit4] Completed in 1.56s, 3 tests
[junit4:junit4] 
[junit4:junit4] Suite: org.apache.lucene.analysis.ar.TestArabicStemFilter
[junit4:junit4] Completed in 0.11s, 23 tests
[junit4:junit4] 
[junit4:junit4] Suite: org.apache.lucene.analysis.fi.TestFinnishLightStemFilter
[junit4:junit4] Completed in 1.59s, 4 tests
[junit4:junit4] 
[junit4:junit4] Suite: org.apache.lucene.collation.TestCollationKeyAnalyzer
[junit4:junit4] Completed in 0.94s, 5 tests
[junit4:junit4] 
[junit4:junit4] Suite: org.apache.lucene.analysis.shingle.ShingleAnalyzerWrapperTest
[junit4:junit4] Completed in 0.35s, 9 tests
[junit4:junit4] 
[junit4:junit4] Suite: org.apache.lucene.analysis.ga.TestIrishLowerCaseFilterFactory
[junit4:junit4] Completed in 0.02s, 1 test
[junit4:junit4] 
[junit4:junit4] Suite: org.apache.lucene.analysis.no.TestNorwegianMinimalStemFilterFactory
[junit4:junit4] Completed in 0.02s, 1 test
[junit4:junit4] 
[junit4:junit4] Suite: org.apache.lucene.analysis.reverse.TestReverseStringFilterFactory
[junit4:junit4] Completed in 0.02s, 1 test
[junit4:junit4] 
[junit4:junit4] Suite: org.apache.lucene.analysis.util.TestCharArrayIterator
[junit4:junit4] Completed in 0.84s, 4 tests
[junit4:junit4] 
[junit4:junit4] Suite: org.apache.lucene.analysis.miscellaneous.TestStemmerOverrideFilter
[junit4:junit4] Completed in 0.02s, 1 test
[junit4:junit4] 
[junit4:junit4] Suite: org.apache.lucene.analysis.miscellaneous.TestCapitalizationFilterFactory
[junit4:junit4] Completed in 0.04s, 7 tests
[junit4:junit4] 
[junit4:junit4] Suite: org.apache.lucene.analysis.hi.TestHindiFilters
[junit4:junit4] Completed in 0.05s, 3 tests
[junit4:junit4] 
[junit4:junit4] Suite: org.apache.lucene.analysis.id.TestIndonesianStemFilterFactory
[junit4:junit4] Completed in 0.02s, 2 tests
[junit4:junit4] 
[junit4:junit4] Suite: org.apache.lucene.analysis.cjk.TestCJKTokenizerFactory
[junit4:junit4] Completed in 0.01s, 1 test
[junit4:junit4] 
[junit4:junit4] Suite: org.apache.lucene.analysis.core.TestBugInSomething
[junit4:junit4] Completed in 0.03s, 2 tests
[junit4:junit4] 
[junit4:junit4] Suite: org.apache.lucene.analysis.compound.TestCompoundWordTokenFilter
[junit4:junit4] Completed in 1.97s, 12 tests
[junit4:junit4] 
[junit4:junit4] Suite: org.apache.lucene.analysis.miscellaneous.TestPrefixAndSuffixAwareTokenFilter
[junit4:junit4] Completed in 0.03s, 1 test
[junit4:junit4] 
[junit4:junit4] Suite: org.apache.lucene.analysis.de.TestGermanLightStemFilterFactory
[junit4:junit4] Completed in 0.01s, 1 test
[junit4:junit4] 
[junit4:junit4] Suite: org.apache.lucene.analysis.gl.TestGalicianStemFilterFactory
[junit4:junit4] Completed in 0.01s, 1 test
[junit4:junit4] 
[junit4:junit4] Suite: org.apache.lucene.analysis.sinks.TokenTypeSinkTokenizerTest
[junit4:junit4] Completed in 0.02s, 1 test
[junit4:junit4] 
[junit4:junit4] Suite: org.apache.lucene.analysis.pt.TestPortugueseMinimalStemFilterFactory
[junit4:junit4] Completed in 0.04s, 1 test
[junit4:junit4] 
[junit4:junit4] Suite: org.apache.lucene.analysis.miscellaneous.TestCapitalizationFilter
[junit4:junit4] Completed in 0.32s, 3 tests
[junit4:junit4] 
[junit4:junit4] Suite: org.apache.lucene.analysis.en.TestKStemmer
[junit4:junit4] Completed in 1.15s, 3 tests
[junit4:junit4] 
[junit4:junit4] Suite: org.apache.lucene.analysis.fa.TestPersianNormalizationFilter
[junit4:junit4] Completed in 0.10s, 7 tests
[junit4:junit4] 
[junit4:junit4] Suite: org.apache.lucene.analysis.util.TestFilesystemResourceLoader
[junit4:junit4] Completed in 0.04s, 2 tests
[junit4:junit4] 
[junit4:junit4] Suite: org.apache.lucene.analysis.hunspell.HunspellStemmerTest
[junit4:junit4] Completed in 0.06s, 5 tests
[junit4:junit4] 
[junit4:junit4] Suite: org.apache.lucene.analysis.core.TestAllAnalyzersHaveFactories
[junit4:junit4] Completed in 1.13s, 1 test
[junit4:junit4] 
[junit4:junit4] Suite: org.apache.lucene.analysis.commongrams.CommonGramsFilterTest
[junit4:junit4] Completed in 1.95s, 10 tests
[junit4:junit4] 
[junit4:junit4] Suite: org.apache.lucene.analysis.de.TestGermanNormalizationFilterFactory
[junit4:junit4] Completed in 0.01s, 1 test
[junit4:junit4] 
[junit4:junit4] Suite: org.apache.lucene.analysis.core.TestTypeTokenFilterFactory
[junit4:junit4] Completed in 0.03s, 4 tests
[junit4:junit4] 
[junit4:junit4] Suite: org.apache.lucene.analysis.de.TestGermanAnalyzer
[junit4:junit4] Completed in 1.43s, 5 tests
[junit4:junit4] 
[junit4:junit4] Suite: org.apache.lucene.collation.TestCollationKeyFilter
[junit4:junit4] Completed in 0.20s, 4 tests
[junit4:junit4] 
[junit4:junit4] Suite: org.apache.lucene.analysis.position.PositionFilterTest
[junit4:junit4] Completed in 0.04s, 4 tests
[junit4:junit4] 
[junit4:junit4] Suite: org.apache.lucene.analysis.pt.TestPortugueseLightStemFilter
[junit4:junit4] Completed in 1.61s, 6 tests
[junit4:junit4] 
[junit4:junit4] Suite: org.apache.lucene.analysis.en.TestPorterStemFilterFactory
[junit4:junit4] Completed in 0.06s, 1 test
[junit4:junit4] 
[junit4:junit4] Suite: org.apache.lucene.analysis.path.TestReversePathHierarchyTokenizer
[junit4:junit4] Completed in 1.49s, 14 tests
[junit4:junit4] 
[junit4:junit4] Suite: org.apache.lucene.analysis.miscellaneous.TestSingleTokenTokenFilter
[junit4:junit4] Completed in 0.02s, 1 test
[junit4:junit4] 
[junit4:junit4] Suite: org.apache.lucene.analysis.tr.TestTurkishLowerCaseFilterFactory
[junit4:junit4] Completed in 0.02s, 1 test
[junit4:junit4] 
[junit4:junit4] Suite: org.apache.lucene.analysis.hu.TestHungarianLightStemFilterFactory
[junit4:junit4] Completed in 0.02s, 1 test
[junit4:junit4] 
[junit4:junit4] Suite: org.apache.lucene.analysis.es.TestSpanishAnalyzer
[junit4:junit4] Completed in 0.99s, 4 tests
[junit4:junit4] 
[junit4:junit4] Suite: org.apache.lucene.analysis.ngram.NGramTokenFilterTest
[junit4:junit4] Completed in 0.54s, 11 tests
[junit4:junit4] 
[junit4:junit4] Suite: org.apache.lucene.analysis.cjk.TestCJKWidthFilterFactory
[junit4:junit4] Completed in 0.05s, 1 test
[junit4:junit4] 
[junit4:junit4] Suite: org.apache.lucene.analysis.core.TestDuelingAnalyzers
[junit4:junit4] Completed in 3.85s, 6 tests
[junit4:junit4] 
[junit4:junit4] Suite: org.apache.lucene.analysis.synonym.TestSynonymMapFilter
[junit4:junit4] Completed in 4.64s, 18 tests
[junit4:junit4] 
[junit4:junit4] Suite: org.apache.lucene.analysis.ngram.NGramTokenizerTest
[junit4:junit4] Completed in 4.32s, 8 tests
[junit4:junit4] 
[junit4:junit4] Suite: org.apache.lucene.analysis.pattern.TestPatternReplaceCharFilter
[junit4:junit4] Completed in 5.81s, 14 tests, 1 skipped
[junit4:junit4] 
[junit4:junit4] Suite: org.apache.lucene.analysis.charfilter.TestMappingCharFilter
[junit4:junit4] Completed in 3.92s, 18 tests
[junit4:junit4] 
[junit4:junit4] Suite: org.apache.lucene.analysis.snowball.TestSnowballVocab
[junit4:junit4] Completed in 4.29s, 1 test
[junit4:junit4] 
[junit4:junit4] Suite: org.apache.lucene.analysis.charfilter.HTMLStripCharFilterTest
[junit4:junit4] Completed in 8.16s, 30 tests
[junit4:junit4] 
[junit4:junit4] Suite: org.apache.lucene.analysis.cjk.TestCJKAnalyzer
[junit4:junit4] Completed in 4.96s, 17 tests
[junit4:junit4] 
[junit4:junit4] Suite: org.apache.lucene.analysis.miscellaneous.TestRemoveDuplicatesTokenFilter
[junit4:junit4] Completed in 4.11s, 5 tests
[junit4:junit4] 
[junit4:junit4] Suite: org.apache.lucene.analysis.core.TestUAX29URLEmailTokenizer
[junit4:junit4] Completed in 2.79s, 36 tests
[junit4:junit4] 
[junit4:junit4] Suite: org.apache.lucene.analysis.th.TestThaiAnalyzer
[junit4:junit4] Completed in 3.24s, 13 tests
[junit4:junit4] 
[junit4:junit4] Suite: org.apache.lucene.analysis.util.TestCharTokenizers
[junit4:junit4] Completed in 0.52s, 6 tests
[junit4:junit4] 
[junit4:junit4] Suite: org.apache.lucene.analysis.ngram.EdgeNGramTokenFilterTest
[junit4:junit4] Completed in 0.88s, 13 tests
[junit4:junit4] 
[junit4:junit4] Suite: org.apache.lucene.analysis.pattern.TestPatternReplaceFilter
[junit4:junit4] Completed in 1.32s, 7 tests
[junit4:junit4] 
[junit4:junit4] Suite: org.apache.lucene.analysis.pt.TestPortugueseStemFilter
[junit4:junit4] Completed in 2.48s, 5 tests
[junit4:junit4] 
[junit4:junit4] Suite: org.apache.lucene.analysis.miscellaneous.TestTrimFilter
[junit4:junit4] Completed in 1.00s, 3 tests
[junit4:junit4] 
[junit4:junit4] Suite: org.apache.lucene.analysis.gl.TestGalicianAnalyzer
[junit4:junit4] Completed in 1.21s, 4 tests
[junit4:junit4] 
[junit4:junit4] Suite: org.apache.lucene.analysis.nl.TestDutchStemmer
[junit4:junit4] Completed in 0.98s, 11 tests
[junit4:junit4] 
[junit4:junit4] Suite: org.apache.lucene.analysis.fr.TestFrenchLightStemFilter
[junit4:junit4] Completed in 1.65s, 5 tests
[junit4:junit4] 
[junit4:junit4] Suite: org.apache.lucene.analysis.hunspell.HunspellStemFilterTest
[junit4:junit4] Completed in 1.46s, 3 tests
[junit4:junit4] 
[junit4:junit4] Suite: org.apache.lucene.analysis.ru.TestRussianLightStemFilter
[junit4:junit4] Completed in 1.79s, 4 tests
[junit4:junit4] 
[junit4:junit4] Suite: org.apache.lucene.analysis.pt.TestPortugueseMinimalStemFilter
[junit4:junit4] Completed in 1.11s, 5 tests
[junit4:junit4] 
[junit4:junit4] Suite: org.apache.lucene.analysis.ga.TestIrishAnalyzer
[junit4:junit4] Completed in 1.06s, 6 tests
[junit4:junit4] 
[junit4:junit4] Suite: org.apache.lucene.analysis.sv.TestSwedishLightStemFilter
[junit4:junit4] Completed in 1.54s, 4 tests
[junit4:junit4] 
[junit4:junit4] Suite: org.apache.lucene.analysis.tr.TestTurkishAnalyzer
[junit4:junit4] Completed in 1.12s, 4 tests
[junit4:junit4] 
[junit4:junit4] Suite: org.apache.lucene.analysis.bg.TestBulgarianAnalyzer
[junit4:junit4] Completed in 1.15s, 7 tests
[junit4:junit4] 
[junit4:junit4] Suite: org.apache.lucene.analysis.hu.TestHungarianAnalyzer
[junit4:junit4] Completed in 0.92s, 4 tests
[junit4:junit4] 
[junit4:junit4] Suite: org.apache.lucene.analysis.cz.TestCzechAnalyzer
[junit4:junit4] Completed in 1.59s, 6 tests
[junit4:junit4] 
[junit4:junit4] Suite: org.apache.lucene.analysis.de.TestGermanLightStemFilter
[junit4:junit4] Completed in 1.52s, 4 tests
[junit4:junit4] 
[junit4:junit4] Suite: org.apache.lucene.analysis.fr.TestFrenchAnalyzer
[junit4:junit4] Completed in 0.71s, 9 tests
[junit4:junit4] 
[junit4:junit4] Suite: org.apache.lucene.analysis.fa.TestPersianAnalyzer
[junit4:junit4] Completed in 1.42s, 8 tests
[junit4:junit4] 
[junit4:junit4] Suite: org.apache.lucene.analysis.ro.TestRomanianAnalyzer
[junit4:junit4] Completed in 1.18s, 4 tests
[junit4:junit4] 
[junit4:junit4] Suite: org.apache.lucene.analysis.fi.TestFinnishAnalyzer
[junit4:junit4] Completed in 1.60s, 4 tests
[junit4:junit4] 
[junit4:junit4] Suite: org.apache.lucene.analysis.ar.TestArabicAnalyzer
[junit4:junit4] Completed in 0.96s, 7 tests
[junit4:junit4] 
[junit4:junit4] Suite: org.apache.lucene.analysis.it.TestItalianLightStemFilter
[junit4:junit4] Completed in 1.41s, 3 tests
[junit4:junit4] 
[junit4:junit4] Suite: org.apache.lucene.analysis.ru.TestRussianAnalyzer
[junit4:junit4] Completed in 0.82s, 5 tests
[junit4:junit4] 
[junit4:junit4] Suite: org.apache.lucene.analysis.de.TestGermanNormalizationFilter
[junit4:junit4] Completed in 1.25s, 5 tests
[junit4:junit4] 
[junit4:junit4] Suite: org.apache.lucene.analysis.sv.TestSwedishAnalyzer
[junit4:junit4] Completed in 0.98s, 4 tests
[junit4:junit4] 
[junit4:junit4] Suite: org.apache.lucene.analysis.ca.TestCatalanAnalyzer
[junit4:junit4] Completed in 0.98s, 5 tests
[junit4:junit4] 
[junit4:junit4] Suite: org.apache.lucene.analysis.reverse.TestReverseStringFilter
[junit4:junit4] Completed in 0.92s, 9 tests
[junit4:junit4] 
[junit4:junit4] Suite: org.apache.lucene.analysis.id.TestIndonesianAnalyzer
[junit4:junit4] Completed in 1.00s, 4 tests
[junit4:junit4] 
[junit4:junit4] Suite: org.apache.lucene.analysis.miscellaneous.TestASCIIFoldingFilter
[junit4:junit4] Completed in 1.21s, 4 tests
[junit4:junit4] 
[junit4:junit4] Suite: org.apache.lucene.analysis.no.TestNorwegianAnalyzer
[junit4:junit4] Completed in 0.94s, 4 tests
[junit4:junit4] 
[junit4:junit4] Suite: org.apache.lucene.analysis.lv.TestLatvianAnalyzer
[junit4:junit4] Completed in 1.06s, 4 tests
[junit4:junit4] 
[junit4:junit4] Suite: org.apache.lucene.analysis.core.TestKeywordAnalyzer
[junit4:junit4] Completed in 0.45s, 3 tests
[junit4:junit4] 
[junit4:junit4] Suite: org.apache.lucene.analysis.pt.TestPortugueseAnalyzer
[junit4:junit4] Completed in 1.14s, 4 tests
[junit4:junit4] 
[junit4:junit4] Suite: org.apache.lucene.analysis.de.TestGermanStemFilter
[junit4:junit4] Completed in 0.86s, 5 tests
[junit4:junit4] 
[junit4:junit4] Suite: org.apache.lucene.analysis.it.TestItalianAnalyzer
[junit4:junit4] Completed in 0.82s, 6 tests
[junit4:junit4] 
[junit4:junit4] Suite: org.apache.lucene.analysis.en.TestEnglishMinimalStemFilter
[junit4:junit4] Completed in 1.43s, 3 tests
[junit4:junit4] 
[junit4:junit4] Suite: org.apache.lucene.analysis.miscellaneous.TestHyphenatedWordsFilter
[junit4:junit4] Completed in 0.27s, 5 tests
[junit4:junit4] 
[junit4:junit4] Suite: org.apache.lucene.analysis.miscellaneous.TestKeepWordFilter
[junit4:junit4] Completed in 0.54s, 2 tests
[junit4:junit4] 
[junit4:junit4] Suite: org.apache.lucene.analysis.util.TestCharArrayMap
[junit4:junit4] Completed in 0.19s, 4 tests
[junit4:junit4] 
[junit4:junit4] Suite: org.apache.lucene.analysis.ar.TestArabicNormalizationFilter
[junit4:junit4] Completed in 0.28s, 15 tests
[junit4:junit4] 
[junit4:junit4] Suite: org.apache.lucene.analysis.util.TestCharArraySet
[junit4:junit4] Completed in 0.13s, 17 tests
[junit4:junit4] 
[junit4:junit4] Suite: org.apache.lucene.analysis.cz.TestCzechStemmer
[junit4:junit4] Completed in 0.08s, 9 tests
[junit4:junit4] 
[junit4:junit4] Suite: org.apache.lucene.analysis.synonym.TestSolrSynonymParser
[junit4:junit4] Completed in 0.06s, 7 tests
[junit4:junit4] 
[junit4:junit4] Suite: org.apache.lucene.analysis.hunspell.HunspellDictionaryTest
[junit4:junit4] Completed in 0.04s, 4 tests
[junit4:junit4] 
[junit4:junit4] Suite: org.apache.lucene.analysis.bg.TestBulgarianStemmer
[junit4:junit4] Completed in 0.06s, 7 tests
[junit4:junit4] 
[junit4:junit4] Suite: org.apache.lucene.analysis.core.TestStopFilter
[junit4:junit4] Completed in 0.04s, 4 tests
[junit4:junit4] 
[junit4:junit4] Suite: org.apache.lucene.analysis.in.TestIndicNormalizer
[junit4:junit4] Completed in 0.06s, 2 tests
[junit4:junit4] 
[junit4:junit4] Suite: org.apache.lucene.analysis.payloads.DelimitedPayloadTokenFilterTest
[junit4:junit4] Completed in 0.04s, 4 tests
[junit4:junit4] 
[junit4:junit4] Suite: org.apache.lucene.analysis.id.TestIndonesianStemmer
[junit4:junit4] Completed in 0.12s, 5 tests
[junit4:junit4] 
[junit4:junit4] Suite: org.apache.lucene.analysis.util.TestCharacterUtils
[junit4:junit4] Completed in 0.05s, 7 tests
[junit4:junit4] 
[junit4:junit4] Suite: org.apache.lucene.analysis.core.TestTypeTokenFilter
[junit4:junit4] Completed in 0.03s, 3 tests
[junit4:junit4] 
[junit4:junit4] Suite: org.apache.lucene.analysis.miscellaneous.TestKeywordMarkerFilter
[junit4:junit4] Completed in 0.03s, 2 tests
[junit4:junit4] 
[junit4:junit4] Suite: org.apache.lucene.analysis.miscellaneous.TestLengthFilter
[junit4:junit4] Completed in 0.03s, 3 tests
[junit4:junit4] 
[junit4:junit4] Suite: org.apache.lucene.analysis.util.TestWordlistLoader
[junit4:junit4] Completed in 0.03s, 3 tests
[junit4:junit4] 
[junit4:junit4] Suite: org.apache.lucene.analysis.hi.TestHindiNormalizer
[junit4:junit4] Completed in 0.04s, 3 tests
[junit4:junit4] 
[junit4:junit4] Suite: org.apache.lucene.analysis.payloads.TypeAsPayloadTokenFilterTest
[junit4:junit4] Completed in 0.02s, 1 test
[junit4:junit4] 
[junit4:junit4] Suite: org.apache.lucene.analysis.sinks.DateRecognizerSinkTokenizerTest
[junit4:junit4] Completed in 0.02s, 1 test
[junit4:junit4] 
[junit4:junit4] Suite: org.apache.lucene.analysis.synonym.TestWordnetSynonymParser
[junit4:junit4] Completed in 0.02s, 1 test
[junit4:junit4] 
[junit4:junit4] Suite: org.apache.lucene.analysis.tr.TestTurkishLowerCaseFilter
[junit4:junit4] Completed in 0.06s, 5 tests
[junit4:junit4] 
[junit4:junit4] Suite: org.apache.lucene.analysis.payloads.NumericPayloadTokenFilterTest
[junit4:junit4] Completed in 0.09s, 1 test
[junit4:junit4] 
[junit4:junit4] Suite: org.apache.lucene.analysis.sinks.TokenRangeSinkTokenizerTest
[junit4:junit4] Completed in 0.02s, 1 test
[junit4:junit4] 
[junit4:junit4] Suite: org.apache.lucene.analysis.miscellaneous.TestEmptyTokenStream
[junit4:junit4] Completed in 0.02s, 1 test
[junit4:junit4] 
[junit4:junit4] Suite: org.apache.lucene.analysis.ar.TestArabicLetterTokenizer
[junit4:junit4] Completed in 0.03s, 2 tests
[junit4:junit4] 
[junit4:junit4] Suite: org.apache.lucene.analysis.bg.TestBulgarianStemFilterFactory
[junit4:junit4] Completed in 0.02s, 1 test
[junit4:junit4] 
[junit4:junit4] Suite: org.apache.lucene.analysis.cjk.TestCJKBigramFilter
[junit4:junit4] Completed in 3.66s, 8 tests
[junit4:junit4] 
[junit4:junit4] Suite: org.apache.lucene.analysis.cjk.TestCJKBigramFilterFactory
[junit4:junit4] Completed in 0.03s, 3 tests
[junit4:junit4] 
[junit4:junit4] Suite: org.apache.lucene.analysis.cn.TestChineseTokenizer
[junit4:junit4] Completed in 4.88s, 5 tests
[junit4:junit4] 
[junit4:junit4] Suite: org.apache.lucene.analysis.commongrams.TestCommonGramsFilterFactory
[junit4:junit4] Completed in 0.02s, 2 tests
[junit4:junit4] 
[junit4:junit4] Suite: org.apache.lucene.analysis.cz.TestCzechStemFilterFactory
[junit4:junit4] Completed in 0.01s, 1 test
[junit4:junit4] 
[junit4:junit4] Suite: org.apache.lucene.analysis.de.TestGermanMinimalStemFilterFactory
[junit4:junit4] Completed in 0.02s, 1 test
[junit4:junit4] 
[junit4:junit4] Suite: org.apache.lucene.analysis.de.TestGermanStemFilterFactory
[junit4:junit4] Completed in 0.02s, 1 test
[junit4:junit4] 
[junit4:junit4] Suite: org.apache.lucene.analysis.el.TestGreekLowerCaseFilterFactory
[junit4:junit4] Completed in 0.02s, 1 test
[junit4:junit4] 
[junit4:junit4] Suite: org.apache.lucene.analysis.el.TestGreekStemFilterFactory
[junit4:junit4] Completed in 0.02s, 1 test
[junit4:junit4] 
[junit4:junit4] Suite: org.apache.lucene.analysis.en.TestKStemFilterFactory
[junit4:junit4] Completed in 0.02s, 1 test
[junit4:junit4] 
[junit4:junit4] Suite: org.apache.lucene.analysis.es.TestSpanishLightStemFilterFactory
[junit4:junit4] Completed in 0.02s, 1 test
[junit4:junit4] 
[junit4:junit4] Suite: org.apache.lucene.analysis.fa.TestPersianCharFilter
[junit4:junit4] Completed in 0.86s, 2 tests
[junit4:junit4] 
[junit4:junit4] Suite: org.apache.lucene.analysis.fa.TestPersianNormalizationFilterFactory
[junit4:junit4] Completed in 0.02s, 1 test
[junit4:junit4] 
[junit4:junit4] Suite: org.apache.lucene.analysis.fi.TestFinnishLightStemFilterFactory
[junit4:junit4] Completed in 0.02s, 1 test
[junit4:junit4] 
[junit4:junit4] Suite: org.apache.lucene.analysis.fr.TestFrenchLightStemFilterFactory
[junit4:junit4] Completed in 0.02s, 1 test
[junit4:junit4] 
[junit4:junit4] Suite: org.apache.lucene.analysis.hunspell.TestHunspellStemFilterFactory
[junit4:junit4] Completed in 0.03s, 1 test
[junit4:junit4] 
[junit4:junit4] Suite: org.apache.lucene.analysis.miscellaneous.TestKeepFilterFactory
[junit4:junit4] Completed in 0.02s, 1 test
[junit4:junit4] 
[junit4:junit4] Suite: org.apache.lucene.analysis.miscellaneous.TestKeywordMarkerFilterFactory
[junit4:junit4] Completed in 0.04s, 2 tests
[junit4:junit4] 
[junit4:junit4] Suite: org.apache.lucene.analysis.miscellaneous.TestPerFieldAnalyzerWrapper
[junit4:junit4] Completed in 0.02s, 2 tests
[junit4:junit4] 
[junit4:junit4] Suite: org.apache.lucene.analysis.miscellaneous.TestRemoveDuplicatesTokenFilterFactory
[junit4:junit4] Completed in 0.02s, 1 test
[junit4:junit4] 
[junit4:junit4] Suite: org.apache.lucene.analysis.miscellaneous.TestTrimFilterFactory
[junit4:junit4] Completed in 0.02s, 1 test
[junit4:junit4] 
[junit4:junit4] Suite: org.apache.lucene.analysis.ngram.TestNGramFilters
[junit4:junit4] Completed in 0.11s, 10 tests
[junit4:junit4] 
[junit4:junit4] Suite: org.apache.lucene.analysis.no.TestNorwegianLightStemFilterFactory
[junit4:junit4] Completed in 0.03s, 1 test
[junit4:junit4] 
[junit4:junit4] Suite: org.apache.lucene.analysis.pattern.TestPatternReplaceFilterFactory
[junit4:junit4] Completed in 0.03s, 1 test
[junit4:junit4] 
[junit4:junit4] Suite: org.apache.lucene.analysis.pattern.TestPatternTokenizerFactory
[junit4:junit4] Completed in 0.02s, 1 test
[junit4:junit4] 
[junit4:junit4] Suite: org.apache.lucene.analysis.payloads.TestDelimitedPayloadTokenFilterFactory
[junit4:junit4] Completed in 0.02s, 2 tests
[junit4:junit4] 
[junit4:junit4] Suite: org.apache.lucene.analysis.pt.TestPortugueseLightStemFilterFactory
[junit4:junit4] Completed in 0.02s, 1 test
[junit4:junit4] 
[junit4:junit4] Suite: org.apache.lucene.analysis.ru.TestRussianFilters
[junit4:junit4] Completed in 0.02s, 1 test
[junit4:junit4] 
[junit4:junit4] Suite: org.apache.lucene.analysis.standard.TestStandardFactories
[junit4:junit4] Completed in 0.07s, 10 tests
[junit4:junit4] 
[junit4:junit4] Suite: org.apache.lucene.analysis.sv.TestSwedishLightStemFilterFactory
[junit4:junit4] Completed in 0.02s, 1 test
[junit4:junit4] 
[junit4:junit4] Suite: org.apache.lucene.analysis.synonym.TestMultiWordSynonyms
[junit4:junit4] Completed in 0.03s, 2 tests
[junit4:junit4] 
[junit4:junit4] Suite: org.apache.lucene.analysis.synonym.TestSynonymMap
[junit4:junit4] Completed in 0.05s, 6 tests
[junit4:junit4] 
[junit4:junit4] Suite: org.apache.lucene.analysis.util.TestAnalysisSPILoader
[junit4:junit4] Completed in 0.10s, 15 tests
[junit4:junit4] 
[junit4:junit4] Suite: org.apache.lucene.analysis.wikipedia.TestWikipediaTokenizerFactory
[junit4:junit4] Completed in 0.02s, 1 test
[junit4:junit4] 
[junit4:junit4] Suite: org.apache.lucene.collation.TestCollationKeyFilterFactory
[junit4:junit4] Completed in 0.19s, 5 tests
[junit4:junit4] 
[junit4:junit4] JVM J0:     1.26 ..   271.81 =   270.55s
[junit4:junit4] Execution time total: 4 minutes 31 seconds
[junit4:junit4] Tests summary: 224 suites, 1160 tests, 1 ignored
     [echo] 5 slowest tests:
[junit4:tophints]  25.81s | org.apache.lucene.analysis.core.TestFactories
[junit4:tophints]  10.68s | org.apache.lucene.analysis.snowball.TestSnowball
[junit4:tophints]   8.16s | org.apache.lucene.analysis.charfilter.HTMLStripCharFilterTest
[junit4:tophints]   7.34s | org.apache.lucene.analysis.shingle.ShingleFilterTest
[junit4:tophints]   6.78s | org.apache.lucene.analysis.cjk.TestCJKTokenizer
     [echo] Building analyzers-icu...

ivy-availability-check:

ivy-fail:

ivy-configure:
[ivy:configure] :: loading settings :: file = /usr/home/hudson/hudson-slave/workspace/Lucene-Solr-Clover-4.x/lucene/ivy-settings.xml

resolve:

common.init:

compile-lucene-core:

ivy-availability-check:

ivy-fail:

ivy-configure:
[ivy:configure] :: loading settings :: file = /usr/home/hudson/hudson-slave/workspace/Lucene-Solr-Clover-4.x/lucene/ivy-settings.xml

resolve:

init:

-clover.disable:

-clover.setup:
     [echo] Code coverage with Atlassian Clover enabled.
[ivy:cachepath] :: resolving dependencies :: com.cenqua.clover#clover-caller;working
[ivy:cachepath] 	confs: [master]
[ivy:cachepath] 	found com.cenqua.clover#clover;2.6.3 in public
[ivy:cachepath] :: resolution report :: resolve 11ms :: artifacts dl 1ms
	---------------------------------------------------------------------
	|                  |            modules            ||   artifacts   |
	|       conf       | number| search|dwnlded|evicted|| number|dwnlded|
	---------------------------------------------------------------------
	|      master      |   1   |   0   |   0   |   0   ||   1   |   0   |
	---------------------------------------------------------------------
[clover-setup] Clover Version 2.6.3, built on November 20 2009 (build-778)
[clover-setup] Loaded from: /home/hudson/.ivy2/cache/com.cenqua.clover/clover/jars/clover-2.6.3.jar
[clover-setup] Clover: Open Source License registered to Apache.
[clover-setup] Clover is enabled with initstring '/usr/home/hudson/hudson-slave/workspace/Lucene-Solr-Clover-4.x/lucene/build/clover/db/coverage.db'

clover:

compile-core:

init:

test:
     [echo] Building analyzers-icu...

ivy-availability-check:

ivy-fail:

ivy-configure:
[ivy:configure] :: loading settings :: file = /usr/home/hudson/hudson-slave/workspace/Lucene-Solr-Clover-4.x/lucene/ivy-settings.xml

resolve:

common.init:

compile-lucene-core:

init:

compile-test:
     [echo] Building analyzers-icu...

check-analyzers-common-uptodate:

jar-analyzers-common:

ivy-availability-check:

ivy-fail:

ivy-configure:
[ivy:configure] :: loading settings :: file = /usr/home/hudson/hudson-slave/workspace/Lucene-Solr-Clover-4.x/lucene/ivy-settings.xml

resolve:

common.init:

compile-lucene-core:

init:

-clover.disable:

-clover.setup:
     [echo] Code coverage with Atlassian Clover enabled.
[ivy:cachepath] :: resolving dependencies :: com.cenqua.clover#clover-caller;working
[ivy:cachepath] 	confs: [master]
[ivy:cachepath] 	found com.cenqua.clover#clover;2.6.3 in public
[ivy:cachepath] :: resolution report :: resolve 7ms :: artifacts dl 1ms
	---------------------------------------------------------------------
	|                  |            modules            ||   artifacts   |
	|       conf       | number| search|dwnlded|evicted|| number|dwnlded|
	---------------------------------------------------------------------
	|      master      |   1   |   0   |   0   |   0   ||   1   |   0   |
	---------------------------------------------------------------------
[clover-setup] Clover Version 2.6.3, built on November 20 2009 (build-778)
[clover-setup] Loaded from: /home/hudson/.ivy2/cache/com.cenqua.clover/clover/jars/clover-2.6.3.jar
[clover-setup] Clover: Open Source License registered to Apache.
[clover-setup] Clover is enabled with initstring '/usr/home/hudson/hudson-slave/workspace/Lucene-Solr-Clover-4.x/lucene/build/clover/db/coverage.db'

clover:

common.compile-core:

compile-core:

compile-test-framework:

ivy-availability-check:

ivy-fail:

ivy-configure:
[ivy:configure] :: loading settings :: file = /usr/home/hudson/hudson-slave/workspace/Lucene-Solr-Clover-4.x/lucene/ivy-settings.xml

resolve:

init:

compile-lucene-core:

compile-core:

common.compile-test:

install-junit4-taskdef:

-clover.disable:

-clover.setup:
     [echo] Code coverage with Atlassian Clover enabled.
[ivy:cachepath] :: resolving dependencies :: com.cenqua.clover#clover-caller;working
[ivy:cachepath] 	confs: [master]
[ivy:cachepath] 	found com.cenqua.clover#clover;2.6.3 in public
[ivy:cachepath] :: resolution report :: resolve 7ms :: artifacts dl 0ms
	---------------------------------------------------------------------
	|                  |            modules            ||   artifacts   |
	|       conf       | number| search|dwnlded|evicted|| number|dwnlded|
	---------------------------------------------------------------------
	|      master      |   1   |   0   |   0   |   0   ||   1   |   0   |
	---------------------------------------------------------------------
[clover-setup] Clover Version 2.6.3, built on November 20 2009 (build-778)
[clover-setup] Loaded from: /home/hudson/.ivy2/cache/com.cenqua.clover/clover/jars/clover-2.6.3.jar
[clover-setup] Clover: Open Source License registered to Apache.
[clover-setup] Clover is enabled with initstring '/usr/home/hudson/hudson-slave/workspace/Lucene-Solr-Clover-4.x/lucene/build/clover/db/coverage.db'

clover:

validate:

common.test:
    [mkdir] Created dir: /usr/home/hudson/hudson-slave/workspace/Lucene-Solr-Clover-4.x/lucene/build/analysis/icu/test
[junit4:junit4] <JUnit4> says salut! Master seed: F488F20269F58CAB
[junit4:junit4] Your default console's encoding may not display certain unicode glyphs: ISO-8859-1
[junit4:junit4] Executing 14 suites with 1 JVM.
[junit4:junit4] 
[junit4:junit4] Suite: org.apache.lucene.analysis.icu.TestICUFoldingFilterFactory
[junit4:junit4] Completed in 1.22s, 1 test
[junit4:junit4] 
[junit4:junit4] Suite: org.apache.lucene.collation.TestICUCollationKeyFilterFactory
[junit4:junit4] Completed in 1.03s, 9 tests
[junit4:junit4] 
[junit4:junit4] Suite: org.apache.lucene.analysis.icu.segmentation.TestWithCJKBigramFilter
[junit4:junit4] Completed in 0.60s, 12 tests
[junit4:junit4] 
[junit4:junit4] Suite: org.apache.lucene.analysis.icu.segmentation.TestLaoBreakIterator
[junit4:junit4] Completed in 0.06s, 3 tests
[junit4:junit4] 
[junit4:junit4] Suite: org.apache.lucene.collation.TestICUCollationKeyAnalyzer
[junit4:junit4] Completed in 1.68s, 5 tests
[junit4:junit4] 
[junit4:junit4] Suite: org.apache.lucene.analysis.icu.segmentation.TestICUTokenizer
[junit4:junit4] Completed in 5.38s, 30 tests
[junit4:junit4] 
[junit4:junit4] Suite: org.apache.lucene.analysis.icu.segmentation.TestICUTokenizerFactory
[junit4:junit4] Completed in 0.05s, 1 test
[junit4:junit4] 
[junit4:junit4] Suite: org.apache.lucene.analysis.icu.TestICUTransformFilter
[junit4:junit4] Completed in 2.59s, 8 tests
[junit4:junit4] 
[junit4:junit4] Suite: org.apache.lucene.analysis.icu.TestICUFoldingFilter
[junit4:junit4] Completed in 0.62s, 3 tests
[junit4:junit4] 
[junit4:junit4] Suite: org.apache.lucene.analysis.icu.TestICUNormalizer2Filter
[junit4:junit4] Completed in 0.47s, 4 tests
[junit4:junit4] 
[junit4:junit4] Suite: org.apache.lucene.analysis.icu.segmentation.TestCharArrayIterator
[junit4:junit4] Completed in 0.06s, 7 tests
[junit4:junit4] 
[junit4:junit4] Suite: org.apache.lucene.analysis.icu.TestICUNormalizer2FilterFactory
[junit4:junit4] Completed in 0.03s, 1 test
[junit4:junit4] 
[junit4:junit4] Suite: org.apache.lucene.analysis.icu.TestICUTransformFilterFactory
[junit4:junit4] Completed in 0.22s, 2 tests
[junit4:junit4] 
[junit4:junit4] Suite: org.apache.lucene.collation.TestICUCollationKeyFilter
[junit4:junit4] Completed in 0.22s, 4 tests
[junit4:junit4] 
[junit4:junit4] JVM J0:     1.50 ..    17.32 =    15.82s
[junit4:junit4] Execution time total: 17 seconds
[junit4:junit4] Tests summary: 14 suites, 90 tests
     [echo] 5 slowest tests:
[junit4:tophints]   5.38s | org.apache.lucene.analysis.icu.segmentation.TestICUTokenizer
[junit4:tophints]   2.59s | org.apache.lucene.analysis.icu.TestICUTransformFilter
[junit4:tophints]   1.68s | org.apache.lucene.collation.TestICUCollationKeyAnalyzer
[junit4:tophints]   1.22s | org.apache.lucene.analysis.icu.TestICUFoldingFilterFactory
[junit4:tophints]   1.03s | org.apache.lucene.collation.TestICUCollationKeyFilterFactory
     [echo] Building analyzers-kuromoji...

ivy-availability-check:

ivy-fail:

ivy-configure:
[ivy:configure] :: loading settings :: file = /usr/home/hudson/hudson-slave/workspace/Lucene-Solr-Clover-4.x/lucene/ivy-settings.xml

resolve:

common.init:

compile-lucene-core:

ivy-availability-check:

ivy-fail:

ivy-configure:
[ivy:configure] :: loading settings :: file = /usr/home/hudson/hudson-slave/workspace/Lucene-Solr-Clover-4.x/lucene/ivy-settings.xml

resolve:

init:

-clover.disable:

-clover.setup:
     [echo] Code coverage with Atlassian Clover enabled.
[ivy:cachepath] :: resolving dependencies :: com.cenqua.clover#clover-caller;working
[ivy:cachepath] 	confs: [master]
[ivy:cachepath] 	found com.cenqua.clover#clover;2.6.3 in public
[ivy:cachepath] :: resolution report :: resolve 11ms :: artifacts dl 1ms
	---------------------------------------------------------------------
	|                  |            modules            ||   artifacts   |
	|       conf       | number| search|dwnlded|evicted|| number|dwnlded|
	---------------------------------------------------------------------
	|      master      |   1   |   0   |   0   |   0   ||   1   |   0   |
	---------------------------------------------------------------------
[clover-setup] Clover Version 2.6.3, built on November 20 2009 (build-778)
[clover-setup] Loaded from: /home/hudson/.ivy2/cache/com.cenqua.clover/clover/jars/clover-2.6.3.jar
[clover-setup] Clover: Open Source License registered to Apache.
[clover-setup] Clover is enabled with initstring '/usr/home/hudson/hudson-slave/workspace/Lucene-Solr-Clover-4.x/lucene/build/clover/db/coverage.db'

clover:

compile-core:

init:

test:
     [echo] Building analyzers-kuromoji...

ivy-availability-check:

ivy-fail:

ivy-configure:
[ivy:configure] :: loading settings :: file = /usr/home/hudson/hudson-slave/workspace/Lucene-Solr-Clover-4.x/lucene/ivy-settings.xml

resolve:

common.init:

compile-lucene-core:

init:

module-build.compile-test:
     [echo] Building analyzers-kuromoji...

check-analyzers-common-uptodate:

jar-analyzers-common:

ivy-availability-check:

ivy-fail:

ivy-configure:
[ivy:configure] :: loading settings :: file = /usr/home/hudson/hudson-slave/workspace/Lucene-Solr-Clover-4.x/lucene/ivy-settings.xml

resolve:

common.init:

compile-lucene-core:

init:

-clover.disable:

-clover.setup:
     [echo] Code coverage with Atlassian Clover enabled.
[ivy:cachepath] :: resolving dependencies :: com.cenqua.clover#clover-caller;working
[ivy:cachepath] 	confs: [master]
[ivy:cachepath] 	found com.cenqua.clover#clover;2.6.3 in public
[ivy:cachepath] :: resolution report :: resolve 8ms :: artifacts dl 0ms
	---------------------------------------------------------------------
	|                  |            modules            ||   artifacts   |
	|       conf       | number| search|dwnlded|evicted|| number|dwnlded|
	---------------------------------------------------------------------
	|      master      |   1   |   0   |   0   |   0   ||   1   |   0   |
	---------------------------------------------------------------------
[clover-setup] Clover Version 2.6.3, built on November 20 2009 (build-778)
[clover-setup] Loaded from: /home/hudson/.ivy2/cache/com.cenqua.clover/clover/jars/clover-2.6.3.jar
[clover-setup] Clover: Open Source License registered to Apache.
[clover-setup] Clover is enabled with initstring '/usr/home/hudson/hudson-slave/workspace/Lucene-Solr-Clover-4.x/lucene/build/clover/db/coverage.db'

clover:

common.compile-core:

compile-core:

compile-test-framework:

ivy-availability-check:

ivy-fail:

ivy-configure:
[ivy:configure] :: loading settings :: file = /usr/home/hudson/hudson-slave/workspace/Lucene-Solr-Clover-4.x/lucene/ivy-settings.xml

resolve:

init:

compile-lucene-core:

compile-core:

common.compile-test:

resolve-icu:
     [echo] Building analyzers-icu...

ivy-availability-check:

ivy-fail:

ivy-configure:
[ivy:configure] :: loading settings :: file = /usr/home/hudson/hudson-slave/workspace/Lucene-Solr-Clover-4.x/lucene/ivy-settings.xml

resolve:

check-analyzers-common-uptodate:

jar-analyzers-common:

-clover.disable:

-clover.setup:
     [echo] Code coverage with Atlassian Clover enabled.
[ivy:cachepath] :: resolving dependencies :: com.cenqua.clover#clover-caller;working
[ivy:cachepath] 	confs: [master]
[ivy:cachepath] 	found com.cenqua.clover#clover;2.6.3 in public
[ivy:cachepath] :: resolution report :: resolve 9ms :: artifacts dl 1ms
	---------------------------------------------------------------------
	|                  |            modules            ||   artifacts   |
	|       conf       | number| search|dwnlded|evicted|| number|dwnlded|
	---------------------------------------------------------------------
	|      master      |   1   |   0   |   0   |   0   ||   1   |   0   |
	---------------------------------------------------------------------
[clover-setup] Clover Version 2.6.3, built on November 20 2009 (build-778)
[clover-setup] Loaded from: /home/hudson/.ivy2/cache/com.cenqua.clover/clover/jars/clover-2.6.3.jar
[clover-setup] Clover: Open Source License registered to Apache.
[clover-setup] Clover is enabled with initstring '/usr/home/hudson/hudson-slave/workspace/Lucene-Solr-Clover-4.x/lucene/build/clover/db/coverage.db'

clover:

common.compile-core:

compile-core:

common.compile-tools:

ivy-availability-check:

ivy-fail:

ivy-configure:
[ivy:configure] :: loading settings :: file = /usr/home/hudson/hudson-slave/workspace/Lucene-Solr-Clover-4.x/lucene/ivy-settings.xml

resolve:

init:

compile-core:

compile-tools:

compile-tools-tests:

compile-test:

install-junit4-taskdef:

validate:

common.test:
    [mkdir] Created dir: /usr/home/hudson/hudson-slave/workspace/Lucene-Solr-Clover-4.x/lucene/build/analysis/kuromoji/test
[junit4:junit4] <JUnit4> says �Hola! Master seed: D90EB228D10889E5
[junit4:junit4] Your default console's encoding may not display certain unicode glyphs: ISO-8859-1
[junit4:junit4] Executing 17 suites with 1 JVM.
[junit4:junit4] 
[junit4:junit4] Suite: org.apache.lucene.analysis.ja.util.TestToStringUtil
[junit4:junit4] Completed in 1.01s, 3 tests
[junit4:junit4] 
[junit4:junit4] Suite: org.apache.lucene.analysis.ja.TestSearchMode
[junit4:junit4] Completed in 1.48s, 1 test
[junit4:junit4] 
[junit4:junit4] Suite: org.apache.lucene.analysis.ja.dict.TestTokenInfoDictionary
[junit4:junit4] Completed in 2.94s, 1 test
[junit4:junit4] 
[junit4:junit4] Suite: org.apache.lucene.analysis.ja.TestJapaneseKatakanaStemFilter
[junit4:junit4] Completed in 0.87s, 5 tests
[junit4:junit4] 
[junit4:junit4] Suite: org.apache.lucene.analysis.ja.TestJapaneseBaseFormFilter
[junit4:junit4] Completed in 2.90s, 5 tests
[junit4:junit4] 
[junit4:junit4] Suite: org.apache.lucene.analysis.ja.TestJapaneseBaseFormFilterFactory
[junit4:junit4] Completed in 0.16s, 1 test
[junit4:junit4] 
[junit4:junit4] Suite: org.apache.lucene.analysis.ja.TestJapanesePartOfSpeechStopFilterFactory
[junit4:junit4] Completed in 0.04s, 1 test
[junit4:junit4] 
[junit4:junit4] Suite: org.apache.lucene.analysis.ja.TestExtendedMode
[junit4:junit4] Completed in 14.23s, 4 tests
[junit4:junit4] 
[junit4:junit4] Suite: org.apache.lucene.analysis.ja.TestJapaneseTokenizerFactory
[junit4:junit4] Completed in 0.11s, 5 tests
[junit4:junit4] 
[junit4:junit4] Suite: org.apache.lucene.analysis.ja.TestJapaneseTokenizer
[junit4:junit4] IGNOR/A 0.10s | TestJapaneseTokenizer.testBocchanBig
[junit4:junit4]    > Assumption #1: 'nightly' test group is disabled (@Nightly)
[junit4:junit4] Completed in 46.64s, 35 tests, 1 skipped
[junit4:junit4] 
[junit4:junit4] Suite: org.apache.lucene.analysis.ja.TestJapaneseAnalyzer
[junit4:junit4] Completed in 13.90s, 11 tests
[junit4:junit4] 
[junit4:junit4] Suite: org.apache.lucene.analysis.ja.TestJapaneseReadingFormFilter
[junit4:junit4] Completed in 1.12s, 4 tests
[junit4:junit4] 
[junit4:junit4] Suite: org.apache.lucene.analysis.ja.dict.UserDictionaryTest
[junit4:junit4] Completed in 0.07s, 4 tests
[junit4:junit4] 
[junit4:junit4] Suite: org.apache.lucene.analysis.ja.TestJapaneseIterationMarkCharFilter
[junit4:junit4] Completed in 2.63s, 14 tests
[junit4:junit4] 
[junit4:junit4] Suite: org.apache.lucene.analysis.ja.TestJapaneseIterationMarkCharFilterFactory
[junit4:junit4] Completed in 0.05s, 4 tests
[junit4:junit4] 
[junit4:junit4] Suite: org.apache.lucene.analysis.ja.TestJapaneseKatakanaStemFilterFactory
[junit4:junit4] Completed in 0.03s, 1 test
[junit4:junit4] 
[junit4:junit4] Suite: org.apache.lucene.analysis.ja.TestJapaneseReadingFormFilterFactory
[junit4:junit4] Completed in 0.03s, 1 test
[junit4:junit4] 
[junit4:junit4] JVM J0:     1.47 ..    92.15 =    90.68s
[junit4:junit4] Execution time total: 1 minute 32 seconds
[junit4:junit4] Tests summary: 17 suites, 100 tests, 1 ignored (1 assumption)
     [echo] 5 slowest tests:
[junit4:tophints]  46.64s | org.apache.lucene.analysis.ja.TestJapaneseTokenizer
[junit4:tophints]  14.23s | org.apache.lucene.analysis.ja.TestExtendedMode
[junit4:tophints]  13.90s | org.apache.lucene.analysis.ja.TestJapaneseAnalyzer
[junit4:tophints]   2.94s | org.apache.lucene.analysis.ja.dict.TestTokenInfoDictionary
[junit4:tophints]   2.90s | org.apache.lucene.analysis.ja.TestJapaneseBaseFormFilter
     [echo] Building analyzers-morfologik...

ivy-availability-check:

ivy-fail:

ivy-configure:
[ivy:configure] :: loading settings :: file = /usr/home/hudson/hudson-slave/workspace/Lucene-Solr-Clover-4.x/lucene/ivy-settings.xml

resolve:

common.init:

compile-lucene-core:

ivy-availability-check:

ivy-fail:

ivy-configure:
[ivy:configure] :: loading settings :: file = /usr/home/hudson/hudson-slave/workspace/Lucene-Solr-Clover-4.x/lucene/ivy-settings.xml

resolve:

init:

-clover.disable:

-clover.setup:
     [echo] Code coverage with Atlassian Clover enabled.
[ivy:cachepath] :: resolving dependencies :: com.cenqua.clover#clover-caller;working
[ivy:cachepath] 	confs: [master]
[ivy:cachepath] 	found com.cenqua.clover#clover;2.6.3 in public
[ivy:cachepath] :: resolution report :: resolve 10ms :: artifacts dl 1ms
	---------------------------------------------------------------------
	|                  |            modules            ||   artifacts   |
	|       conf       | number| search|dwnlded|evicted|| number|dwnlded|
	---------------------------------------------------------------------
	|      master      |   1   |   0   |   0   |   0   ||   1   |   0   |
	---------------------------------------------------------------------
[clover-setup] Clover Version 2.6.3, built on November 20 2009 (build-778)
[clover-setup] Loaded from: /home/hudson/.ivy2/cache/com.cenqua.clover/clover/jars/clover-2.6.3.jar
[clover-setup] Clover: Open Source License registered to Apache.
[clover-setup] Clover is enabled with initstring '/usr/home/hudson/hudson-slave/workspace/Lucene-Solr-Clover-4.x/lucene/build/clover/db/coverage.db'

clover:

compile-core:

init:

test:
     [echo] Building analyzers-morfologik...

ivy-availability-check:

ivy-fail:

ivy-configure:
[ivy:configure] :: loading settings :: file = /usr/home/hudson/hudson-slave/workspace/Lucene-Solr-Clover-4.x/lucene/ivy-settings.xml

resolve:

common.init:

compile-lucene-core:

init:

compile-test:
     [echo] Building analyzers-morfologik...

check-analyzers-common-uptodate:

jar-analyzers-common:

ivy-availability-check:

ivy-fail:

ivy-configure:
[ivy:configure] :: loading settings :: file = /usr/home/hudson/hudson-slave/workspace/Lucene-Solr-Clover-4.x/lucene/ivy-settings.xml

resolve:

common.init:

compile-lucene-core:

init:

-clover.disable:

-clover.setup:
     [echo] Code coverage with Atlassian Clover enabled.
[ivy:cachepath] :: resolving dependencies :: com.cenqua.clover#clover-caller;working
[ivy:cachepath] 	confs: [master]
[ivy:cachepath] 	found com.cenqua.clover#clover;2.6.3 in public
[ivy:cachepath] :: resolution report :: resolve 8ms :: artifacts dl 0ms
	---------------------------------------------------------------------
	|                  |            modules            ||   artifacts   |
	|       conf       | number| search|dwnlded|evicted|| number|dwnlded|
	---------------------------------------------------------------------
	|      master      |   1   |   0   |   0   |   0   ||   1   |   0   |
	---------------------------------------------------------------------
[clover-setup] Clover Version 2.6.3, built on November 20 2009 (build-778)
[clover-setup] Loaded from: /home/hudson/.ivy2/cache/com.cenqua.clover/clover/jars/clover-2.6.3.jar
[clover-setup] Clover: Open Source License registered to Apache.
[clover-setup] Clover is enabled with initstring '/usr/home/hudson/hudson-slave/workspace/Lucene-Solr-Clover-4.x/lucene/build/clover/db/coverage.db'

clover:

common.compile-core:

compile-core:

compile-test-framework:

ivy-availability-check:

ivy-fail:

ivy-configure:
[ivy:configure] :: loading settings :: file = /usr/home/hudson/hudson-slave/workspace/Lucene-Solr-Clover-4.x/lucene/ivy-settings.xml

resolve:

init:

compile-lucene-core:

compile-core:

common.compile-test:

install-junit4-taskdef:

-clover.disable:

-clover.setup:
     [echo] Code coverage with Atlassian Clover enabled.
[ivy:cachepath] :: resolving dependencies :: com.cenqua.clover#clover-caller;working
[ivy:cachepath] 	confs: [master]
[ivy:cachepath] 	found com.cenqua.clover#clover;2.6.3 in public
[ivy:cachepath] :: resolution report :: resolve 8ms :: artifacts dl 0ms
	---------------------------------------------------------------------
	|                  |            modules            ||   artifacts   |
	|       conf       | number| search|dwnlded|evicted|| number|dwnlded|
	---------------------------------------------------------------------
	|      master      |   1   |   0   |   0   |   0   ||   1   |   0   |
	---------------------------------------------------------------------
[clover-setup] Clover Version 2.6.3, built on November 20 2009 (build-778)
[clover-setup] Loaded from: /home/hudson/.ivy2/cache/com.cenqua.clover/clover/jars/clover-2.6.3.jar
[clover-setup] Clover: Open Source License registered to Apache.
[clover-setup] Clover is enabled with initstring '/usr/home/hudson/hudson-slave/workspace/Lucene-Solr-Clover-4.x/lucene/build/clover/db/coverage.db'

clover:

validate:

common.test:
    [mkdir] Created dir: /usr/home/hudson/hudson-slave/workspace/Lucene-Solr-Clover-4.x/lucene/build/analysis/morfologik/test
[junit4:junit4] <JUnit4> says ahoj! Master seed: A8A097BADD03A944
[junit4:junit4] Your default console's encoding may not display certain unicode glyphs: ISO-8859-1
[junit4:junit4] Executing 2 suites with 1 JVM.
[junit4:junit4] 
[junit4:junit4] Suite: org.apache.lucene.analysis.morfologik.TestMorfologikAnalyzer
[junit4:junit4] Completed in 2.30s, 6 tests
[junit4:junit4] 
[junit4:junit4] Suite: org.apache.lucene.analysis.morfologik.TestMorfologikFilterFactory
[junit4:junit4] Completed in 0.21s, 1 test
[junit4:junit4] 
[junit4:junit4] JVM J0:     1.26 ..     4.78 =     3.53s
[junit4:junit4] Execution time total: 4.79 sec.
[junit4:junit4] Tests summary: 2 suites, 7 tests
     [echo] 5 slowest tests:
[junit4:tophints]   2.30s | org.apache.lucene.analysis.morfologik.TestMorfologikAnalyzer
[junit4:tophints]   0.21s | org.apache.lucene.analysis.morfologik.TestMorfologikFilterFactory
     [echo] Building analyzers-phonetic...

ivy-availability-check:

ivy-fail:

ivy-configure:
[ivy:configure] :: loading settings :: file = /usr/home/hudson/hudson-slave/workspace/Lucene-Solr-Clover-4.x/lucene/ivy-settings.xml

resolve:

common.init:

compile-lucene-core:

ivy-availability-check:

ivy-fail:

ivy-configure:
[ivy:configure] :: loading settings :: file = /usr/home/hudson/hudson-slave/workspace/Lucene-Solr-Clover-4.x/lucene/ivy-settings.xml

resolve:

init:

-clover.disable:

-clover.setup:
     [echo] Code coverage with Atlassian Clover enabled.
[ivy:cachepath] :: resolving dependencies :: com.cenqua.clover#clover-caller;working
[ivy:cachepath] 	confs: [master]
[ivy:cachepath] 	found com.cenqua.clover#clover;2.6.3 in public
[ivy:cachepath] :: resolution report :: resolve 11ms :: artifacts dl 1ms
	---------------------------------------------------------------------
	|                  |            modules            ||   artifacts   |
	|       conf       | number| search|dwnlded|evicted|| number|dwnlded|
	---------------------------------------------------------------------
	|      master      |   1   |   0   |   0   |   0   ||   1   |   0   |
	---------------------------------------------------------------------
[clover-setup] Clover Version 2.6.3, built on November 20 2009 (build-778)
[clover-setup] Loaded from: /home/hudson/.ivy2/cache/com.cenqua.clover/clover/jars/clover-2.6.3.jar
[clover-setup] Clover: Open Source License registered to Apache.
[clover-setup] Clover is enabled with initstring '/usr/home/hudson/hudson-slave/workspace/Lucene-Solr-Clover-4.x/lucene/build/clover/db/coverage.db'

clover:

compile-core:

init:

test:
     [echo] Building analyzers-phonetic...

ivy-availability-check:

ivy-fail:

ivy-configure:
[ivy:configure] :: loading settings :: file = /usr/home/hudson/hudson-slave/workspace/Lucene-Solr-Clover-4.x/lucene/ivy-settings.xml

resolve:

common.init:

compile-lucene-core:

init:

compile-test:
     [echo] Building analyzers-phonetic...

check-analyzers-common-uptodate:

jar-analyzers-common:

ivy-availability-check:

ivy-fail:

ivy-configure:
[ivy:configure] :: loading settings :: file = /usr/home/hudson/hudson-slave/workspace/Lucene-Solr-Clover-4.x/lucene/ivy-settings.xml

resolve:

common.init:

compile-lucene-core:

init:

-clover.disable:

-clover.setup:
     [echo] Code coverage with Atlassian Clover enabled.
[ivy:cachepath] :: resolving dependencies :: com.cenqua.clover#clover-caller;working
[ivy:cachepath] 	confs: [master]
[ivy:cachepath] 	found com.cenqua.clover#clover;2.6.3 in public
[ivy:cachepath] :: resolution report :: resolve 7ms :: artifacts dl 1ms
	---------------------------------------------------------------------
	|                  |            modules            ||   artifacts   |
	|       conf       | number| search|dwnlded|evicted|| number|dwnlded|
	---------------------------------------------------------------------
	|      master      |   1   |   0   |   0   |   0   ||   1   |   0   |
	---------------------------------------------------------------------
[clover-setup] Clover Version 2.6.3, built on November 20 2009 (build-778)
[clover-setup] Loaded from: /home/hudson/.ivy2/cache/com.cenqua.clover/clover/jars/clover-2.6.3.jar
[clover-setup] Clover: Open Source License registered to Apache.
[clover-setup] Clover is enabled with initstring '/usr/home/hudson/hudson-slave/workspace/Lucene-Solr-Clover-4.x/lucene/build/clover/db/coverage.db'

clover:

common.compile-core:

compile-core:

compile-test-framework:

ivy-availability-check:

ivy-fail:

ivy-configure:
[ivy:configure] :: loading settings :: file = /usr/home/hudson/hudson-slave/workspace/Lucene-Solr-Clover-4.x/lucene/ivy-settings.xml

resolve:

init:

compile-lucene-core:

compile-core:

common.compile-test:

install-junit4-taskdef:

-clover.disable:

-clover.setup:
     [echo] Code coverage with Atlassian Clover enabled.
[ivy:cachepath] :: resolving dependencies :: com.cenqua.clover#clover-caller;working
[ivy:cachepath] 	confs: [master]
[ivy:cachepath] 	found com.cenqua.clover#clover;2.6.3 in public
[ivy:cachepath] :: resolution report :: resolve 9ms :: artifacts dl 0ms
	---------------------------------------------------------------------
	|                  |            modules            ||   artifacts   |
	|       conf       | number| search|dwnlded|evicted|| number|dwnlded|
	---------------------------------------------------------------------
	|      master      |   1   |   0   |   0   |   0   ||   1   |   0   |
	---------------------------------------------------------------------
[clover-setup] Clover Version 2.6.3, built on November 20 2009 (build-778)
[clover-setup] Loaded from: /home/hudson/.ivy2/cache/com.cenqua.clover/clover/jars/clover-2.6.3.jar
[clover-setup] Clover: Open Source License registered to Apache.
[clover-setup] Clover is enabled with initstring '/usr/home/hudson/hudson-slave/workspace/Lucene-Solr-Clover-4.x/lucene/build/clover/db/coverage.db'

clover:

validate:

common.test:
    [mkdir] Created dir: /usr/home/hudson/hudson-slave/workspace/Lucene-Solr-Clover-4.x/lucene/build/analysis/phonetic/test
[junit4:junit4] <JUnit4> says kaixo! Master seed: 3C72AEDCA4AA2440
[junit4:junit4] Your default console's encoding may not display certain unicode glyphs: ISO-8859-1
[junit4:junit4] Executing 6 suites with 1 JVM.
[junit4:junit4] 
[junit4:junit4] Suite: org.apache.lucene.analysis.phonetic.TestBeiderMorseFilter
[junit4:junit4] Completed in 2.10s, 5 tests, 1 skipped
[junit4:junit4] 
[junit4:junit4] Suite: org.apache.lucene.analysis.phonetic.TestDoubleMetaphoneFilterFactory
[junit4:junit4] Completed in 0.17s, 3 tests
[junit4:junit4] 
[junit4:junit4] Suite: org.apache.lucene.analysis.phonetic.TestPhoneticFilterFactory
[junit4:junit4] Completed in 16.27s, 5 tests
[junit4:junit4] 
[junit4:junit4] Suite: org.apache.lucene.analysis.phonetic.TestPhoneticFilter
[junit4:junit4] Completed in 12.44s, 3 tests
[junit4:junit4] 
[junit4:junit4] Suite: org.apache.lucene.analysis.phonetic.DoubleMetaphoneFilterTest
[junit4:junit4] Completed in 0.83s, 8 tests
[junit4:junit4] 
[junit4:junit4] Suite: org.apache.lucene.analysis.phonetic.TestBeiderMorseFilterFactory
[junit4:junit4] Completed in 0.05s, 3 tests
[junit4:junit4] 
[junit4:junit4] JVM J0:     1.48 ..    34.61 =    33.13s
[junit4:junit4] Execution time total: 34 seconds
[junit4:junit4] Tests summary: 6 suites, 27 tests, 1 ignored
     [echo] 5 slowest tests:
[junit4:tophints]  16.27s | org.apache.lucene.analysis.phonetic.TestPhoneticFilterFactory
[junit4:tophints]  12.44s | org.apache.lucene.analysis.phonetic.TestPhoneticFilter
[junit4:tophints]   2.10s | org.apache.lucene.analysis.phonetic.TestBeiderMorseFilter
[junit4:tophints]   0.83s | org.apache.lucene.analysis.phonetic.DoubleMetaphoneFilterTest
[junit4:tophints]   0.17s | org.apache.lucene.analysis.phonetic.TestDoubleMetaphoneFilterFactory
     [echo] Building analyzers-smartcn...

ivy-availability-check:

ivy-fail:

ivy-configure:
[ivy:configure] :: loading settings :: file = /usr/home/hudson/hudson-slave/workspace/Lucene-Solr-Clover-4.x/lucene/ivy-settings.xml

resolve:

common.init:

compile-lucene-core:

ivy-availability-check:

ivy-fail:

ivy-configure:
[ivy:configure] :: loading settings :: file = /usr/home/hudson/hudson-slave/workspace/Lucene-Solr-Clover-4.x/lucene/ivy-settings.xml

resolve:

init:

-clover.disable:

-clover.setup:
     [echo] Code coverage with Atlassian Clover enabled.
[ivy:cachepath] :: resolving dependencies :: com.cenqua.clover#clover-caller;working
[ivy:cachepath] 	confs: [master]
[ivy:cachepath] 	found com.cenqua.clover#clover;2.6.3 in public
[ivy:cachepath] :: resolution report :: resolve 7ms :: artifacts dl 1ms
	---------------------------------------------------------------------
	|                  |            modules            ||   artifacts   |
	|       conf       | number| search|dwnlded|evicted|| number|dwnlded|
	---------------------------------------------------------------------
	|      master      |   1   |   0   |   0   |   0   ||   1   |   0   |
	---------------------------------------------------------------------
[clover-setup] Clover Version 2.6.3, built on November 20 2009 (build-778)
[clover-setup] Loaded from: /home/hudson/.ivy2/cache/com.cenqua.clover/clover/jars/clover-2.6.3.jar
[clover-setup] Clover: Open Source License registered to Apache.
[clover-setup] Clover is enabled with initstring '/usr/home/hudson/hudson-slave/workspace/Lucene-Solr-Clover-4.x/lucene/build/clover/db/coverage.db'

clover:

compile-core:

init:

test:
     [echo] Building analyzers-smartcn...

ivy-availability-check:

ivy-fail:

ivy-configure:
[ivy:configure] :: loading settings :: file = /usr/home/hudson/hudson-slave/workspace/Lucene-Solr-Clover-4.x/lucene/ivy-settings.xml

resolve:

common.init:

compile-lucene-core:

init:

compile-test:
     [echo] Building analyzers-smartcn...

check-analyzers-common-uptodate:

jar-analyzers-common:

ivy-availability-check:

ivy-fail:

ivy-configure:
[ivy:configure] :: loading settings :: file = /usr/home/hudson/hudson-slave/workspace/Lucene-Solr-Clover-4.x/lucene/ivy-settings.xml

resolve:

common.init:

compile-lucene-core:

init:

-clover.disable:

-clover.setup:
     [echo] Code coverage with Atlassian Clover enabled.
[ivy:cachepath] :: resolving dependencies :: com.cenqua.clover#clover-caller;working
[ivy:cachepath] 	confs: [master]
[ivy:cachepath] 	found com.cenqua.clover#clover;2.6.3 in public
[ivy:cachepath] :: resolution report :: resolve 7ms :: artifacts dl 1ms
	---------------------------------------------------------------------
	|                  |            modules            ||   artifacts   |
	|       conf       | number| search|dwnlded|evicted|| number|dwnlded|
	---------------------------------------------------------------------
	|      master      |   1   |   0   |   0   |   0   ||   1   |   0   |
	---------------------------------------------------------------------
[clover-setup] Clover Version 2.6.3, built on November 20 2009 (build-778)
[clover-setup] Loaded from: /home/hudson/.ivy2/cache/com.cenqua.clover/clover/jars/clover-2.6.3.jar
[clover-setup] Clover: Open Source License registered to Apache.
[clover-setup] Clover is enabled with initstring '/usr/home/hudson/hudson-slave/workspace/Lucene-Solr-Clover-4.x/lucene/build/clover/db/coverage.db'

clover:

common.compile-core:

compile-core:

compile-test-framework:

ivy-availability-check:

ivy-fail:

ivy-configure:
[ivy:configure] :: loading settings :: file = /usr/home/hudson/hudson-slave/workspace/Lucene-Solr-Clover-4.x/lucene/ivy-settings.xml

resolve:

init:

compile-lucene-core:

compile-core:

common.compile-test:

install-junit4-taskdef:

-clover.disable:

-clover.setup:
     [echo] Code coverage with Atlassian Clover enabled.
[ivy:cachepath] :: resolving dependencies :: com.cenqua.clover#clover-caller;working
[ivy:cachepath] 	confs: [master]
[ivy:cachepath] 	found com.cenqua.clover#clover;2.6.3 in public
[ivy:cachepath] :: resolution report :: resolve 9ms :: artifacts dl 0ms
	---------------------------------------------------------------------
	|                  |            modules            ||   artifacts   |
	|       conf       | number| search|dwnlded|evicted|| number|dwnlded|
	---------------------------------------------------------------------
	|      master      |   1   |   0   |   0   |   0   ||   1   |   0   |
	---------------------------------------------------------------------
[clover-setup] Clover Version 2.6.3, built on November 20 2009 (build-778)
[clover-setup] Loaded from: /home/hudson/.ivy2/cache/com.cenqua.clover/clover/jars/clover-2.6.3.jar
[clover-setup] Clover: Open Source License registered to Apache.
[clover-setup] Clover is enabled with initstring '/usr/home/hudson/hudson-slave/workspace/Lucene-Solr-Clover-4.x/lucene/build/clover/db/coverage.db'

clover:

validate:

common.test:
    [mkdir] Created dir: /usr/home/hudson/hudson-slave/workspace/Lucene-Solr-Clover-4.x/lucene/build/analysis/smartcn/test
[junit4:junit4] <JUnit4> says salut! Master seed: 2639C924B9D5146D
[junit4:junit4] Your default console's encoding may not display certain unicode glyphs: ISO-8859-1
[junit4:junit4] Executing 2 suites with 1 JVM.
[junit4:junit4] 
[junit4:junit4] Suite: org.apache.lucene.analysis.cn.smart.TestSmartChineseAnalyzer
[junit4:junit4] Completed in 14.88s, 20 tests
[junit4:junit4] 
[junit4:junit4] Suite: org.apache.lucene.analysis.cn.smart.TestSmartChineseFactories
[junit4:junit4] Completed in 0.24s, 2 tests
[junit4:junit4] 
[junit4:junit4] JVM J0:     1.24 ..    17.25 =    16.00s
[junit4:junit4] Execution time total: 17 seconds
[junit4:junit4] Tests summary: 2 suites, 22 tests
     [echo] 5 slowest tests:
[junit4:tophints]  14.88s | org.apache.lucene.analysis.cn.smart.TestSmartChineseAnalyzer
[junit4:tophints]   0.24s | org.apache.lucene.analysis.cn.smart.TestSmartChineseFactories
     [echo] Building analyzers-stempel...

ivy-availability-check:

ivy-fail:

ivy-configure:
[ivy:configure] :: loading settings :: file = /usr/home/hudson/hudson-slave/workspace/Lucene-Solr-Clover-4.x/lucene/ivy-settings.xml

resolve:

common.init:

compile-lucene-core:

ivy-availability-check:

ivy-fail:

ivy-configure:
[ivy:configure] :: loading settings :: file = /usr/home/hudson/hudson-slave/workspace/Lucene-Solr-Clover-4.x/lucene/ivy-settings.xml

resolve:

init:

-clover.disable:

-clover.setup:
     [echo] Code coverage with Atlassian Clover enabled.
[ivy:cachepath] :: resolving dependencies :: com.cenqua.clover#clover-caller;working
[ivy:cachepath] 	confs: [master]
[ivy:cachepath] 	found com.cenqua.clover#clover;2.6.3 in public
[ivy:cachepath] :: resolution report :: resolve 11ms :: artifacts dl 1ms
	---------------------------------------------------------------------
	|                  |            modules            ||   artifacts   |
	|       conf       | number| search|dwnlded|evicted|| number|dwnlded|
	---------------------------------------------------------------------
	|      master      |   1   |   0   |   0   |   0   ||   1   |   0   |
	---------------------------------------------------------------------
[clover-setup] Clover Version 2.6.3, built on November 20 2009 (build-778)
[clover-setup] Loaded from: /home/hudson/.ivy2/cache/com.cenqua.clover/clover/jars/clover-2.6.3.jar
[clover-setup] Clover: Open Source License registered to Apache.
[clover-setup] Clover is enabled with initstring '/usr/home/hudson/hudson-slave/workspace/Lucene-Solr-Clover-4.x/lucene/build/clover/db/coverage.db'

clover:

compile-core:

init:

test:
     [echo] Building analyzers-stempel...

ivy-availability-check:

ivy-fail:

ivy-configure:
[ivy:configure] :: loading settings :: file = /usr/home/hudson/hudson-slave/workspace/Lucene-Solr-Clover-4.x/lucene/ivy-settings.xml

resolve:

common.init:

compile-lucene-core:

init:

compile-test:
     [echo] Building analyzers-stempel...

check-analyzers-common-uptodate:

jar-analyzers-common:

ivy-availability-check:

ivy-fail:

ivy-configure:
[ivy:configure] :: loading settings :: file = /usr/home/hudson/hudson-slave/workspace/Lucene-Solr-Clover-4.x/lucene/ivy-settings.xml

resolve:

common.init:

compile-lucene-core:

init:

-clover.disable:

-clover.setup:
     [echo] Code coverage with Atlassian Clover enabled.
[ivy:cachepath] :: resolving dependencies :: com.cenqua.clover#clover-caller;working
[ivy:cachepath] 	confs: [master]
[ivy:cachepath] 	found com.cenqua.clover#clover;2.6.3 in public
[ivy:cachepath] :: resolution report :: resolve 10ms :: artifacts dl 1ms
	---------------------------------------------------------------------
	|                  |            modules            ||   artifacts   |
	|       conf       | number| search|dwnlded|evicted|| number|dwnlded|
	---------------------------------------------------------------------
	|      master      |   1   |   0   |   0   |   0   ||   1   |   0   |
	---------------------------------------------------------------------
[clover-setup] Clover Version 2.6.3, built on November 20 2009 (build-778)
[clover-setup] Loaded from: /home/hudson/.ivy2/cache/com.cenqua.clover/clover/jars/clover-2.6.3.jar
[clover-setup] Clover: Open Source License registered to Apache.
[clover-setup] Clover is enabled with initstring '/usr/home/hudson/hudson-slave/workspace/Lucene-Solr-Clover-4.x/lucene/build/clover/db/coverage.db'

clover:

common.compile-core:

compile-core:

compile-test-framework:

ivy-availability-check:

ivy-fail:

ivy-configure:
[ivy:configure] :: loading settings :: file = /usr/home/hudson/hudson-slave/workspace/Lucene-Solr-Clover-4.x/lucene/ivy-settings.xml

resolve:

init:

compile-lucene-core:

compile-core:

common.compile-test:

install-junit4-taskdef:

-clover.disable:

-clover.setup:
     [echo] Code coverage with Atlassian Clover enabled.
[ivy:cachepath] :: resolving dependencies :: com.cenqua.clover#clover-caller;working
[ivy:cachepath] 	confs: [master]
[ivy:cachepath] 	found com.cenqua.clover#clover;2.6.3 in public
[ivy:cachepath] :: resolution report :: resolve 7ms :: artifacts dl 1ms
	---------------------------------------------------------------------
	|                  |            modules            ||   artifacts   |
	|       conf       | number| search|dwnlded|evicted|| number|dwnlded|
	---------------------------------------------------------------------
	|      master      |   1   |   0   |   0   |   0   ||   1   |   0   |
	---------------------------------------------------------------------
[clover-setup] Clover Version 2.6.3, built on November 20 2009 (build-778)
[clover-setup] Loaded from: /home/hudson/.ivy2/cache/com.cenqua.clover/clover/jars/clover-2.6.3.jar
[clover-setup] Clover: Open Source License registered to Apache.
[clover-setup] Clover is enabled with initstring '/usr/home/hudson/hudson-slave/workspace/Lucene-Solr-Clover-4.x/lucene/build/clover/db/coverage.db'

clover:

validate:

common.test:
    [mkdir] Created dir: /usr/home/hudson/hudson-slave/workspace/Lucene-Solr-Clover-4.x/lucene/build/analysis/stempel/test
[junit4:junit4] <JUnit4> says ??! Master seed: 3760BB2EDBF88017
[junit4:junit4] Your default console's encoding may not display certain unicode glyphs: ISO-8859-1
[junit4:junit4] Executing 4 suites with 1 JVM.
[junit4:junit4] 
[junit4:junit4] Suite: org.egothor.stemmer.TestStemmer
[junit4:junit4] Completed in 0.93s, 6 tests
[junit4:junit4] 
[junit4:junit4] Suite: org.apache.lucene.analysis.pl.TestPolishAnalyzer
[junit4:junit4] Completed in 1.15s, 4 tests
[junit4:junit4] 
[junit4:junit4] Suite: org.egothor.stemmer.TestCompile
[junit4:junit4] Completed in 0.19s, 3 tests
[junit4:junit4] 
[junit4:junit4] Suite: org.apache.lucene.analysis.stempel.TestStempelPolishStemFilterFactory
[junit4:junit4] Completed in 0.21s, 1 test
[junit4:junit4] 
[junit4:junit4] JVM J0:     1.30 ..     4.54 =     3.24s
[junit4:junit4] Execution time total: 4.55 sec.
[junit4:junit4] Tests summary: 4 suites, 14 tests
     [echo] 5 slowest tests:
[junit4:tophints]   1.15s | org.apache.lucene.analysis.pl.TestPolishAnalyzer
[junit4:tophints]   0.93s | org.egothor.stemmer.TestStemmer
[junit4:tophints]   0.21s | org.apache.lucene.analysis.stempel.TestStempelPolishStemFilterFactory
[junit4:tophints]   0.19s | org.egothor.stemmer.TestCompile
     [echo] Building analyzers-uima...

ivy-availability-check:

ivy-fail:

ivy-configure:
[ivy:configure] :: loading settings :: file = /usr/home/hudson/hudson-slave/workspace/Lucene-Solr-Clover-4.x/lucene/ivy-settings.xml

resolve:

common.init:

compile-lucene-core:

ivy-availability-check:

ivy-fail:

ivy-configure:
[ivy:configure] :: loading settings :: file = /usr/home/hudson/hudson-slave/workspace/Lucene-Solr-Clover-4.x/lucene/ivy-settings.xml

resolve:

init:

-clover.disable:

-clover.setup:
     [echo] Code coverage with Atlassian Clover enabled.
[ivy:cachepath] :: resolving dependencies :: com.cenqua.clover#clover-caller;working
[ivy:cachepath] 	confs: [master]
[ivy:cachepath] 	found com.cenqua.clover#clover;2.6.3 in public
[ivy:cachepath] :: resolution report :: resolve 11ms :: artifacts dl 1ms
	---------------------------------------------------------------------
	|                  |            modules            ||   artifacts   |
	|       conf       | number| search|dwnlded|evicted|| number|dwnlded|
	---------------------------------------------------------------------
	|      master      |   1   |   0   |   0   |   0   ||   1   |   0   |
	---------------------------------------------------------------------
[clover-setup] Clover Version 2.6.3, built on November 20 2009 (build-778)
[clover-setup] Loaded from: /home/hudson/.ivy2/cache/com.cenqua.clover/clover/jars/clover-2.6.3.jar
[clover-setup] Clover: Open Source License registered to Apache.
[clover-setup] Clover is enabled with initstring '/usr/home/hudson/hudson-slave/workspace/Lucene-Solr-Clover-4.x/lucene/build/clover/db/coverage.db'

clover:

compile-core:

init:

test:
     [echo] Building analyzers-uima...

ivy-availability-check:

ivy-fail:

ivy-configure:
[ivy:configure] :: loading settings :: file = /usr/home/hudson/hudson-slave/workspace/Lucene-Solr-Clover-4.x/lucene/ivy-settings.xml

resolve:

common.init:

compile-lucene-core:

init:

compile-test:
     [echo] Building analyzers-uima...

check-analyzers-common-uptodate:

jar-analyzers-common:

ivy-availability-check:

ivy-fail:

ivy-configure:
[ivy:configure] :: loading settings :: file = /usr/home/hudson/hudson-slave/workspace/Lucene-Solr-Clover-4.x/lucene/ivy-settings.xml

resolve:

common.init:

compile-lucene-core:

init:

-clover.disable:

-clover.setup:
     [echo] Code coverage with Atlassian Clover enabled.
[ivy:cachepath] :: resolving dependencies :: com.cenqua.clover#clover-caller;working
[ivy:cachepath] 	confs: [master]
[ivy:cachepath] 	found com.cenqua.clover#clover;2.6.3 in public
[ivy:cachepath] :: resolution report :: resolve 7ms :: artifacts dl 1ms
	---------------------------------------------------------------------
	|                  |            modules            ||   artifacts   |
	|       conf       | number| search|dwnlded|evicted|| number|dwnlded|
	---------------------------------------------------------------------
	|      master      |   1   |   0   |   0   |   0   ||   1   |   0   |
	---------------------------------------------------------------------
[clover-setup] Clover Version 2.6.3, built on November 20 2009 (build-778)
[clover-setup] Loaded from: /home/hudson/.ivy2/cache/com.cenqua.clover/clover/jars/clover-2.6.3.jar
[clover-setup] Clover: Open Source License registered to Apache.
[clover-setup] Clover is enabled with initstring '/usr/home/hudson/hudson-slave/workspace/Lucene-Solr-Clover-4.x/lucene/build/clover/db/coverage.db'

clover:

common.compile-core:

compile-core:

compile-test-framework:

ivy-availability-check:

ivy-fail:

ivy-configure:
[ivy:configure] :: loading settings :: file = /usr/home/hudson/hudson-slave/workspace/Lucene-Solr-Clover-4.x/lucene/ivy-settings.xml

resolve:

init:

compile-lucene-core:

compile-core:

common.compile-test:

install-junit4-taskdef:

-clover.disable:

-clover.setup:
     [echo] Code coverage with Atlassian Clover enabled.
[ivy:cachepath] :: resolving dependencies :: com.cenqua.clover#clover-caller;working
[ivy:cachepath] 	confs: [master]
[ivy:cachepath] 	found com.cenqua.clover#clover;2.6.3 in public
[ivy:cachepath] :: resolution report :: resolve 8ms :: artifacts dl 0ms
	---------------------------------------------------------------------
	|                  |            modules            ||   artifacts   |
	|       conf       | number| search|dwnlded|evicted|| number|dwnlded|
	---------------------------------------------------------------------
	|      master      |   1   |   0   |   0   |   0   ||   1   |   0   |
	---------------------------------------------------------------------
[clover-setup] Clover Version 2.6.3, built on November 20 2009 (build-778)
[clover-setup] Loaded from: /home/hudson/.ivy2/cache/com.cenqua.clover/clover/jars/clover-2.6.3.jar
[clover-setup] Clover: Open Source License registered to Apache.
[clover-setup] Clover is enabled with initstring '/usr/home/hudson/hudson-slave/workspace/Lucene-Solr-Clover-4.x/lucene/build/clover/db/coverage.db'

clover:

validate:

common.test:
    [mkdir] Created dir: /usr/home/hudson/hudson-slave/workspace/Lucene-Solr-Clover-4.x/lucene/build/analysis/uima/test
[junit4:junit4] <JUnit4> says �Hola! Master seed: EC63CE3360E77021
[junit4:junit4] Your default console's encoding may not display certain unicode glyphs: ISO-8859-1
[junit4:junit4] Executing 4 suites with 1 JVM.
[junit4:junit4] 
[junit4:junit4] Suite: org.apache.lucene.analysis.uima.ae.BasicAEProviderTest
[junit4:junit4] Completed in 1.14s, 1 test
[junit4:junit4] 
[junit4:junit4] Suite: org.apache.lucene.analysis.uima.UIMATypeAwareAnalyzerTest
[junit4:junit4] Completed in 6.19s, 2 tests
[junit4:junit4] 
[junit4:junit4] Suite: org.apache.lucene.analysis.uima.UIMABaseAnalyzerTest
[junit4:junit4] Completed in 8.39s, 3 tests
[junit4:junit4] 
[junit4:junit4] Suite: org.apache.lucene.analysis.uima.ae.OverridingParamsAEProviderTest
[junit4:junit4] Completed in 4.00s, 3 tests
[junit4:junit4] 
[junit4:junit4] JVM J0:     1.48 ..    22.07 =    20.58s
[junit4:junit4] Execution time total: 22 seconds
[junit4:junit4] Tests summary: 4 suites, 9 tests
     [echo] 5 slowest tests:
[junit4:tophints]   8.39s | org.apache.lucene.analysis.uima.UIMABaseAnalyzerTest
[junit4:tophints]   6.19s | org.apache.lucene.analysis.uima.UIMATypeAwareAnalyzerTest
[junit4:tophints]   4.00s | org.apache.lucene.analysis.uima.ae.OverridingParamsAEProviderTest
[junit4:tophints]   1.14s | org.apache.lucene.analysis.uima.ae.BasicAEProviderTest
     [echo] Building benchmark...

ivy-availability-check:

ivy-fail:

ivy-configure:
[ivy:configure] :: loading settings :: file = /usr/home/hudson/hudson-slave/workspace/Lucene-Solr-Clover-4.x/lucene/ivy-settings.xml

resolve:

common.init:

compile-lucene-core:

ivy-availability-check:

ivy-fail:

ivy-configure:
[ivy:configure] :: loading settings :: file = /usr/home/hudson/hudson-slave/workspace/Lucene-Solr-Clover-4.x/lucene/ivy-settings.xml

resolve:

init:

-clover.disable:

-clover.setup:
     [echo] Code coverage with Atlassian Clover enabled.
[ivy:cachepath] :: resolving dependencies :: com.cenqua.clover#clover-caller;working
[ivy:cachepath] 	confs: [master]
[ivy:cachepath] 	found com.cenqua.clover#clover;2.6.3 in public
[ivy:cachepath] :: resolution report :: resolve 7ms :: artifacts dl 1ms
	---------------------------------------------------------------------
	|                  |            modules            ||   artifacts   |
	|       conf       | number| search|dwnlded|evicted|| number|dwnlded|
	---------------------------------------------------------------------
	|      master      |   1   |   0   |   0   |   0   ||   1   |   0   |
	---------------------------------------------------------------------
[clover-setup] Clover Version 2.6.3, built on November 20 2009 (build-778)
[clover-setup] Loaded from: /home/hudson/.ivy2/cache/com.cenqua.clover/clover/jars/clover-2.6.3.jar
[clover-setup] Clover: Open Source License registered to Apache.
[clover-setup] Clover is enabled with initstring '/usr/home/hudson/hudson-slave/workspace/Lucene-Solr-Clover-4.x/lucene/build/clover/db/coverage.db'

clover:

compile-core:

module-build.init:

resolve-icu:
     [echo] Building analyzers-icu...

ivy-availability-check:

ivy-fail:

ivy-configure:
[ivy:configure] :: loading settings :: file = /usr/home/hudson/hudson-slave/workspace/Lucene-Solr-Clover-4.x/lucene/ivy-settings.xml

resolve:

check-memory-uptodate:

jar-memory:

check-highlighter-uptodate:

jar-highlighter:

check-analyzers-common-uptodate:

jar-analyzers-common:

check-queryparser-uptodate:

jar-queryparser:

check-facet-uptodate:

jar-facet:

init:

test:
     [echo] Building benchmark...

copy-alg-files-for-testing:

ivy-availability-check:

ivy-fail:

ivy-configure:
[ivy:configure] :: loading settings :: file = /usr/home/hudson/hudson-slave/workspace/Lucene-Solr-Clover-4.x/lucene/ivy-settings.xml

resolve:

common.init:

compile-lucene-core:

module-build.init:

resolve-icu:
     [echo] Building analyzers-icu...

ivy-availability-check:

ivy-fail:

ivy-configure:
[ivy:configure] :: loading settings :: file = /usr/home/hudson/hudson-slave/workspace/Lucene-Solr-Clover-4.x/lucene/ivy-settings.xml

resolve:

check-memory-uptodate:

jar-memory:

check-highlighter-uptodate:

jar-highlighter:

check-analyzers-common-uptodate:

jar-analyzers-common:

check-queryparser-uptodate:

jar-queryparser:

check-facet-uptodate:

jar-facet:

init:

module-build.compile-test:
     [echo] Building benchmark...

ivy-availability-check:

ivy-fail:

ivy-configure:
[ivy:configure] :: loading settings :: file = /usr/home/hudson/hudson-slave/workspace/Lucene-Solr-Clover-4.x/lucene/ivy-settings.xml

resolve:

common.init:

compile-lucene-core:

module-build.init:

resolve-icu:
     [echo] Building analyzers-icu...

ivy-availability-check:

ivy-fail:

ivy-configure:
[ivy:configure] :: loading settings :: file = /usr/home/hudson/hudson-slave/workspace/Lucene-Solr-Clover-4.x/lucene/ivy-settings.xml

resolve:

check-memory-uptodate:

jar-memory:

check-highlighter-uptodate:

jar-highlighter:

check-analyzers-common-uptodate:

jar-analyzers-common:

check-queryparser-uptodate:

jar-queryparser:

check-facet-uptodate:

jar-facet:

init:

-clover.disable:

-clover.setup:
     [echo] Code coverage with Atlassian Clover enabled.
[ivy:cachepath] :: resolving dependencies :: com.cenqua.clover#clover-caller;working
[ivy:cachepath] 	confs: [master]
[ivy:cachepath] 	found com.cenqua.clover#clover;2.6.3 in public
[ivy:cachepath] :: resolution report :: resolve 7ms :: artifacts dl 0ms
	---------------------------------------------------------------------
	|                  |            modules            ||   artifacts   |
	|       conf       | number| search|dwnlded|evicted|| number|dwnlded|
	---------------------------------------------------------------------
	|      master      |   1   |   0   |   0   |   0   ||   1   |   0   |
	---------------------------------------------------------------------
[clover-setup] Clover Version 2.6.3, built on November 20 2009 (build-778)
[clover-setup] Loaded from: /home/hudson/.ivy2/cache/com.cenqua.clover/clover/jars/clover-2.6.3.jar
[clover-setup] Clover: Open Source License registered to Apache.
[clover-setup] Clover is enabled with initstring '/usr/home/hudson/hudson-slave/workspace/Lucene-Solr-Clover-4.x/lucene/build/clover/db/coverage.db'

clover:

compile-core:

compile-test-framework:

ivy-availability-check:

ivy-fail:

ivy-configure:
[ivy:configure] :: loading settings :: file = /usr/home/hudson/hudson-slave/workspace/Lucene-Solr-Clover-4.x/lucene/ivy-settings.xml

resolve:

init:

compile-lucene-core:

compile-core:

common.compile-test:

compile-test:

install-junit4-taskdef:

-clover.disable:

-clover.setup:
     [echo] Code coverage with Atlassian Clover enabled.
[ivy:cachepath] :: resolving dependencies :: com.cenqua.clover#clover-caller;working
[ivy:cachepath] 	confs: [master]
[ivy:cachepath] 	found com.cenqua.clover#clover;2.6.3 in public
[ivy:cachepath] :: resolution report :: resolve 13ms :: artifacts dl 1ms
	---------------------------------------------------------------------
	|                  |            modules            ||   artifacts   |
	|       conf       | number| search|dwnlded|evicted|| number|dwnlded|
	---------------------------------------------------------------------
	|      master      |   1   |   0   |   0   |   0   ||   1   |   0   |
	---------------------------------------------------------------------
[clover-setup] Clover Version 2.6.3, built on November 20 2009 (build-778)
[clover-setup] Loaded from: /home/hudson/.ivy2/cache/com.cenqua.clover/clover/jars/clover-2.6.3.jar
[clover-setup] Clover: Open Source License registered to Apache.
[clover-setup] Clover is enabled with initstring '/usr/home/hudson/hudson-slave/workspace/Lucene-Solr-Clover-4.x/lucene/build/clover/db/coverage.db'

clover:

validate:

common.test:
    [mkdir] Created dir: /usr/home/hudson/hudson-slave/workspace/Lucene-Solr-Clover-4.x/lucene/build/benchmark/test
[junit4:junit4] <JUnit4> says ahoj! Master seed: 23861B3D0447C463
[junit4:junit4] Your default console's encoding may not display certain unicode glyphs: ISO-8859-1
[junit4:junit4] Executing 15 suites with 1 JVM.
[junit4:junit4] 
[junit4:junit4] Suite: org.apache.lucene.benchmark.byTask.feeds.LineDocSourceTest
[junit4:junit4] Completed in 3.27s, 8 tests
[junit4:junit4] 
[junit4:junit4] Suite: org.apache.lucene.benchmark.byTask.tasks.CreateIndexTaskTest
[junit4:junit4] Completed in 0.58s, 5 tests
[junit4:junit4] 
[junit4:junit4] Suite: org.apache.lucene.benchmark.byTask.tasks.AddIndexesTaskTest
[jun

[...truncated too long message...]

nit4:junit4] Completed in 0.80s, 3 tests
[junit4:junit4] 
[junit4:junit4] Suite: org.apache.solr.handler.component.SearchHandlerTest
[junit4:junit4] Completed in 0.90s, 1 test
[junit4:junit4] 
[junit4:junit4] Suite: org.apache.solr.schema.TestOmitPositions
[junit4:junit4] Completed in 0.97s, 2 tests
[junit4:junit4] 
[junit4:junit4] Suite: org.apache.solr.core.TestArbitraryIndexDir
[junit4:junit4] Completed in 1.01s, 1 test
[junit4:junit4] 
[junit4:junit4] Suite: org.apache.solr.search.TestQueryUtils
[junit4:junit4] Completed in 1.16s, 1 test
[junit4:junit4] 
[junit4:junit4] Suite: org.apache.solr.spelling.suggest.SuggesterTSTTest
[junit4:junit4] Completed in 1.55s, 4 tests
[junit4:junit4] 
[junit4:junit4] Suite: org.apache.solr.update.processor.UniqFieldsUpdateProcessorFactoryTest
[junit4:junit4] Completed in 0.86s, 1 test
[junit4:junit4] 
[junit4:junit4] Suite: org.apache.solr.update.UpdateParamsTest
[junit4:junit4] Completed in 0.90s, 1 test
[junit4:junit4] 
[junit4:junit4] Suite: org.apache.solr.spelling.suggest.SuggesterTest
[junit4:junit4] Completed in 1.45s, 4 tests
[junit4:junit4] 
[junit4:junit4] Suite: org.apache.solr.handler.CSVRequestHandlerTest
[junit4:junit4] Completed in 0.80s, 1 test
[junit4:junit4] 
[junit4:junit4] Suite: org.apache.solr.handler.admin.ShowFileRequestHandlerTest
[junit4:junit4] Completed in 2.24s, 2 tests
[junit4:junit4] 
[junit4:junit4] Suite: org.apache.solr.schema.NotRequiredUniqueKeyTest
[junit4:junit4] Completed in 0.41s, 1 test
[junit4:junit4] 
[junit4:junit4] Suite: org.apache.solr.schema.BadIndexSchemaTest
[junit4:junit4] Completed in 2.13s, 9 tests
[junit4:junit4] 
[junit4:junit4] Suite: org.apache.solr.search.TestFoldingMultitermQuery
[junit4:junit4] Completed in 1.59s, 18 tests
[junit4:junit4] 
[junit4:junit4] Suite: org.apache.solr.analysis.TestLuceneMatchVersion
[junit4:junit4] Completed in 0.45s, 1 test
[junit4:junit4] 
[junit4:junit4] Suite: org.apache.solr.update.processor.UpdateRequestProcessorFactoryTest
[junit4:junit4] Completed in 1.45s, 2 tests
[junit4:junit4] 
[junit4:junit4] Suite: org.apache.solr.schema.PrimitiveFieldTypeTest
[junit4:junit4] Completed in 1.01s, 1 test
[junit4:junit4] 
[junit4:junit4] Suite: org.apache.solr.core.AlternateDirectoryTest
[junit4:junit4] Completed in 0.73s, 1 test
[junit4:junit4] 
[junit4:junit4] Suite: org.apache.solr.update.processor.FieldMutatingUpdateProcessorTest
[junit4:junit4] Completed in 1.65s, 26 tests
[junit4:junit4] 
[junit4:junit4] Suite: org.apache.solr.handler.component.BadComponentTest
[junit4:junit4] Completed in 0.66s, 1 test
[junit4:junit4] 
[junit4:junit4] Suite: org.apache.solr.update.TestUpdate
[junit4:junit4] Completed in 0.83s, 1 test
[junit4:junit4] 
[junit4:junit4] Suite: org.apache.solr.highlight.HighlighterConfigTest
[junit4:junit4] Completed in 0.58s, 1 test
[junit4:junit4] 
[junit4:junit4] Suite: org.apache.solr.update.processor.DefaultValueUpdateProcessorTest
[junit4:junit4] Completed in 0.67s, 1 test
[junit4:junit4] 
[junit4:junit4] Suite: org.apache.solr.core.TestXIncludeConfig
[junit4:junit4] Completed in 0.55s, 1 test
[junit4:junit4] 
[junit4:junit4] Suite: org.apache.solr.search.TestDocSet
[junit4:junit4] Completed in 2.74s, 2 tests
[junit4:junit4] 
[junit4:junit4] Suite: org.apache.solr.search.TestLFUCache
[junit4:junit4] Completed in 0.72s, 5 tests
[junit4:junit4] 
[junit4:junit4] Suite: org.apache.solr.core.TestQuerySenderListener
[junit4:junit4] Completed in 0.56s, 3 tests
[junit4:junit4] 
[junit4:junit4] Suite: org.apache.solr.update.SolrIndexConfigTest
[junit4:junit4] Completed in 0.79s, 2 tests
[junit4:junit4] 
[junit4:junit4] Suite: org.apache.solr.core.TestQuerySenderNoQuery
[junit4:junit4] Completed in 0.56s, 3 tests
[junit4:junit4] 
[junit4:junit4] Suite: org.apache.solr.core.IndexReaderFactoryTest
[junit4:junit4] Completed in 0.85s, 1 test
[junit4:junit4] 
[junit4:junit4] Suite: org.apache.solr.schema.MultiTermTest
[junit4:junit4] Completed in 0.47s, 3 tests
[junit4:junit4] 
[junit4:junit4] Suite: org.apache.solr.EchoParamsTest
[junit4:junit4] Completed in 0.41s, 1 test
[junit4:junit4] 
[junit4:junit4] Suite: org.apache.solr.spelling.SpellPossibilityIteratorTest
[junit4:junit4] Completed in 1.38s, 3 tests
[junit4:junit4] 
[junit4:junit4] Suite: org.apache.solr.search.similarities.TestLMDirichletSimilarityFactory
[junit4:junit4] Completed in 0.26s, 2 tests
[junit4:junit4] 
[junit4:junit4] Suite: org.apache.solr.TestPluginEnable
[junit4:junit4] Completed in 0.33s, 1 test
[junit4:junit4] 
[junit4:junit4] Suite: org.apache.solr.util.TimeZoneUtilsTest
[junit4:junit4] Completed in 0.25s, 5 tests
[junit4:junit4] 
[junit4:junit4] Suite: org.apache.solr.search.TestFastLRUCache
[junit4:junit4] Completed in 0.28s, 7 tests
[junit4:junit4] 
[junit4:junit4] Suite: org.apache.solr.core.PluginInfoTest
[junit4:junit4] Completed in 0.42s, 9 tests
[junit4:junit4] 
[junit4:junit4] Suite: org.apache.solr.util.TestSystemIdResolver
[junit4:junit4] Completed in 0.08s, 1 test
[junit4:junit4] 
[junit4:junit4] Suite: org.apache.solr.core.TestSolrXMLSerializer
[junit4:junit4] Completed in 0.11s, 1 test
[junit4:junit4] 
[junit4:junit4] Suite: org.apache.solr.schema.DateFieldTest
[junit4:junit4] Completed in 0.16s, 8 tests, 1 skipped
[junit4:junit4] 
[junit4:junit4] Suite: org.apache.solr.spelling.TestSuggestSpellingConverter
[junit4:junit4] Completed in 0.12s, 2 tests
[junit4:junit4] 
[junit4:junit4] Suite: org.apache.solr.internal.csv.CSVParserTest
[junit4:junit4] Completed in 1.04s, 23 tests
[junit4:junit4] 
[junit4:junit4] Suite: org.apache.solr.search.TestLRUCache
[junit4:junit4] Completed in 0.07s, 3 tests
[junit4:junit4] 
[junit4:junit4] Suite: org.apache.solr.cloud.ChaosMonkeySafeLeaderTest
[junit4:junit4] Completed in 0.00s, 0 tests
[junit4:junit4] 
[junit4:junit4] Suite: org.apache.solr.internal.csv.CSVStrategyTest
[junit4:junit4] Completed in 0.07s, 5 tests
[junit4:junit4] 
[junit4:junit4] Suite: org.apache.solr.schema.UUIDFieldTest
[junit4:junit4] Completed in 0.04s, 1 test
[junit4:junit4] 
[junit4:junit4] Suite: org.apache.solr.handler.admin.SystemInfoHandlerTest
[junit4:junit4] Completed in 0.04s, 1 test
[junit4:junit4] 
[junit4:junit4] Suite: org.apache.solr.util.TestUtils
[junit4:junit4] Completed in 0.11s, 3 tests
[junit4:junit4] 
[junit4:junit4] Suite: org.apache.solr.cloud.ChaosMonkeyNothingIsSafeTest
[junit4:junit4] Completed in 0.00s, 0 tests
[junit4:junit4] 
[junit4:junit4] Suite: org.apache.solr.schema.PreAnalyzedFieldTest
[junit4:junit4] Completed in 0.14s, 3 tests
[junit4:junit4] 
[junit4:junit4] Suite: org.apache.solr.internal.csv.writer.CSVFieldTest
[junit4:junit4] Completed in 0.03s, 2 tests
[junit4:junit4] 
[junit4:junit4] Suite: org.apache.solr.internal.csv.writer.CSVConfigTest
[junit4:junit4] Completed in 0.10s, 7 tests
[junit4:junit4] 
[junit4:junit4] Suite: org.apache.solr.internal.csv.writer.CSVConfigGuesserTest
[junit4:junit4] Completed in 0.05s, 3 tests
[junit4:junit4] 
[junit4:junit4] Suite: org.apache.solr.AnalysisAfterCoreReloadTest
[junit4:junit4] Completed in 3.32s, 1 test
[junit4:junit4] 
[junit4:junit4] Suite: org.apache.solr.analysis.TestCharFilters
[junit4:junit4] Completed in 0.44s, 2 tests
[junit4:junit4] 
[junit4:junit4] HEARTBEAT J0: 2012-08-30T22:23:23, no events in: 67.5s, approx. at: BasicDistributedZk2Test.testDistribSearch
[junit4:junit4] HEARTBEAT J0: 2012-08-30T22:24:23, no events in:  127s, approx. at: BasicDistributedZk2Test.testDistribSearch
[junit4:junit4] HEARTBEAT J0: 2012-08-30T22:25:23, no events in:  188s, approx. at: BasicDistributedZk2Test.testDistribSearch
[junit4:junit4] Suite: org.apache.solr.cloud.BasicDistributedZk2Test
[junit4:junit4] Completed in 203.14s, 1 test
[junit4:junit4] 
[junit4:junit4] Suite: org.apache.solr.cloud.ClusterStateUpdateTest
[junit4:junit4] Completed in 11.85s, 1 test
[junit4:junit4] 
[junit4:junit4] HEARTBEAT J0: 2012-08-30T22:26:59, no events in: 68.1s, approx. at: SyncSliceTest.testDistribSearch
[junit4:junit4] Suite: org.apache.solr.cloud.SyncSliceTest
[junit4:junit4] Completed in 132.75s, 1 test
[junit4:junit4] 
[junit4:junit4] Suite: org.apache.solr.handler.component.TermVectorComponentDistributedTest
[junit4:junit4] Completed in 12.12s, 1 test
[junit4:junit4] 
[junit4:junit4] Suite: org.apache.solr.search.TestStressLucene
[junit4:junit4] Completed in 12.24s, 1 test
[junit4:junit4] 
[junit4:junit4] Suite: org.apache.solr.search.TestStressRecovery
[junit4:junit4] Completed in 12.66s, 1 test
[junit4:junit4] 
[junit4:junit4] Suite: org.apache.solr.search.TestStressReorder
[junit4:junit4] Completed in 33.82s, 1 test
[junit4:junit4] 
[junit4:junit4] JVM J0:     1.76 ..  1588.42 =  1586.66s
[junit4:junit4] Execution time total: 26 minutes 28 seconds
[junit4:junit4] Tests summary: 227 suites, 908 tests, 1 suite-level error, 1 error, 6 ignored (1 assumption)

BUILD FAILED
/usr/home/hudson/hudson-slave/workspace/Lucene-Solr-Clover-4.x/build.xml:268: The following error occurred while executing this line:
/usr/home/hudson/hudson-slave/workspace/Lucene-Solr-Clover-4.x/build.xml:29: The following error occurred while executing this line:
/usr/home/hudson/hudson-slave/workspace/Lucene-Solr-Clover-4.x/solr/build.xml:144: The following error occurred while executing this line:
/usr/home/hudson/hudson-slave/workspace/Lucene-Solr-Clover-4.x/lucene/module-build.xml:62: The following error occurred while executing this line:
/usr/home/hudson/hudson-slave/workspace/Lucene-Solr-Clover-4.x/lucene/common-build.xml:1056: The following error occurred while executing this line:
/usr/home/hudson/hudson-slave/workspace/Lucene-Solr-Clover-4.x/lucene/common-build.xml:741: There were test failures: 227 suites, 908 tests, 1 suite-level error, 1 error, 6 ignored (1 assumption)

Total time: 87 minutes 7 seconds
Build step 'Invoke Ant' marked build as failure
Publishing Clover coverage report...
No Clover report will be published due to a Build Failure
Recording test results
Email was triggered for: Failure
Sending email for trigger: Failure



Mime
View raw message