lucene-dev mailing list archives

Site index · List index
Message view « Date » · « Thread »
Top « Date » · « Thread »
From Policeman Jenkins Server <jenk...@sd-datasolutions.de>
Subject [JENKINS] Lucene-Solr-4.x-Linux (32bit/jdk1.8.0-ea-b49) - Build # 198 - Failure!
Date Sun, 05 Aug 2012 21:40:13 GMT
Build: http://jenkins.sd-datasolutions.de/job/Lucene-Solr-4.x-Linux/198/
Java: 32bit/jdk1.8.0-ea-b49 -server -XX:+UseG1GC

1 tests failed.
REGRESSION:  org.apache.solr.handler.component.DistributedQueryElevationComponentTest.testDistribSearch

Error Message:
.responseHeader.params.size()==9,9skipped=5,4

Stack Trace:
junit.framework.AssertionFailedError: .responseHeader.params.size()==9,9skipped=5,4
	at __randomizedtesting.SeedInfo.seed([51999E58853D9D51:D07F1040F262FD6D]:0)
	at junit.framework.Assert.fail(Assert.java:50)
	at org.apache.solr.BaseDistributedSearchTestCase.compareResponses(BaseDistributedSearchTestCase.java:670)
	at org.apache.solr.BaseDistributedSearchTestCase.query(BaseDistributedSearchTestCase.java:392)
	at org.apache.solr.handler.component.DistributedQueryElevationComponentTest.doTest(DistributedQueryElevationComponentTest.java:81)
	at org.apache.solr.BaseDistributedSearchTestCase.testDistribSearch(BaseDistributedSearchTestCase.java:679)
	at sun.reflect.NativeMethodAccessorImpl.invoke0(Native Method)
	at sun.reflect.NativeMethodAccessorImpl.invoke(NativeMethodAccessorImpl.java:57)
	at sun.reflect.DelegatingMethodAccessorImpl.invoke(DelegatingMethodAccessorImpl.java:43)
	at java.lang.reflect.Method.invoke(Method.java:474)
	at com.carrotsearch.randomizedtesting.RandomizedRunner.invoke(RandomizedRunner.java:1995)
	at com.carrotsearch.randomizedtesting.RandomizedRunner.access$1100(RandomizedRunner.java:132)
	at com.carrotsearch.randomizedtesting.RandomizedRunner$6.evaluate(RandomizedRunner.java:818)
	at com.carrotsearch.randomizedtesting.RandomizedRunner$7.evaluate(RandomizedRunner.java:877)
	at com.carrotsearch.randomizedtesting.RandomizedRunner$8.evaluate(RandomizedRunner.java:891)
	at com.carrotsearch.randomizedtesting.rules.SystemPropertiesRestoreRule$1.evaluate(SystemPropertiesRestoreRule.java:53)
	at org.apache.lucene.util.TestRuleSetupTeardownChained$1.evaluate(TestRuleSetupTeardownChained.java:50)
	at org.apache.lucene.util.TestRuleFieldCacheSanity$1.evaluate(TestRuleFieldCacheSanity.java:32)
	at org.apache.lucene.util.AbstractBeforeAfterRule$1.evaluate(AbstractBeforeAfterRule.java:45)
	at com.carrotsearch.randomizedtesting.rules.SystemPropertiesInvariantRule$1.evaluate(SystemPropertiesInvariantRule.java:55)
	at org.apache.lucene.util.TestRuleReportUncaughtExceptions$1.evaluate(TestRuleReportUncaughtExceptions.java:68)
	at org.apache.lucene.util.TestRuleThreadAndTestName$1.evaluate(TestRuleThreadAndTestName.java:48)
	at org.apache.lucene.util.TestRuleIgnoreAfterMaxFailures$1.evaluate(TestRuleIgnoreAfterMaxFailures.java:70)
	at org.apache.lucene.util.TestRuleMarkFailure$1.evaluate(TestRuleMarkFailure.java:48)
	at com.carrotsearch.randomizedtesting.RandomizedRunner.runSingleTest(RandomizedRunner.java:825)
	at com.carrotsearch.randomizedtesting.RandomizedRunner.access$700(RandomizedRunner.java:132)
	at com.carrotsearch.randomizedtesting.RandomizedRunner$3$1.run(RandomizedRunner.java:671)
	at com.carrotsearch.randomizedtesting.RandomizedRunner$3.evaluate(RandomizedRunner.java:697)
	at com.carrotsearch.randomizedtesting.RandomizedRunner$4.evaluate(RandomizedRunner.java:736)
	at com.carrotsearch.randomizedtesting.RandomizedRunner$5.evaluate(RandomizedRunner.java:747)
	at com.carrotsearch.randomizedtesting.rules.SystemPropertiesRestoreRule$1.evaluate(SystemPropertiesRestoreRule.java:53)
	at org.apache.lucene.util.AbstractBeforeAfterRule$1.evaluate(AbstractBeforeAfterRule.java:45)
	at org.apache.lucene.util.TestRuleReportUncaughtExceptions$1.evaluate(TestRuleReportUncaughtExceptions.java:68)
	at org.apache.lucene.util.TestRuleStoreClassName$1.evaluate(TestRuleStoreClassName.java:38)
	at com.carrotsearch.randomizedtesting.rules.SystemPropertiesInvariantRule$1.evaluate(SystemPropertiesInvariantRule.java:55)
	at org.apache.lucene.util.TestRuleNoInstanceHooksOverrides$1.evaluate(TestRuleNoInstanceHooksOverrides.java:53)
	at org.apache.lucene.util.TestRuleNoStaticHooksShadowing$1.evaluate(TestRuleNoStaticHooksShadowing.java:52)
	at org.apache.lucene.util.TestRuleAssertionsRequired$1.evaluate(TestRuleAssertionsRequired.java:36)
	at org.apache.lucene.util.TestRuleMarkFailure$1.evaluate(TestRuleMarkFailure.java:48)
	at org.apache.lucene.util.TestRuleIgnoreAfterMaxFailures$1.evaluate(TestRuleIgnoreAfterMaxFailures.java:70)
	at org.apache.lucene.util.TestRuleIgnoreTestSuites$1.evaluate(TestRuleIgnoreTestSuites.java:55)
	at com.carrotsearch.randomizedtesting.RandomizedRunner.runSuite(RandomizedRunner.java:605)
	at com.carrotsearch.randomizedtesting.RandomizedRunner.access$400(RandomizedRunner.java:132)
	at com.carrotsearch.randomizedtesting.RandomizedRunner$2.run(RandomizedRunner.java:551)




Build Log:
[...truncated 7178 lines...]
[junit4:junit4] Suite: org.apache.solr.handler.component.DistributedQueryElevationComponentTest
[junit4:junit4] FAILURE 2.72s J0 | DistributedQueryElevationComponentTest.testDistribSearch
[junit4:junit4]    > Throwable #1: junit.framework.AssertionFailedError: .responseHeader.params.size()==9,9skipped=5,4
[junit4:junit4]    > 	at __randomizedtesting.SeedInfo.seed([51999E58853D9D51:D07F1040F262FD6D]:0)
[junit4:junit4]    > 	at junit.framework.Assert.fail(Assert.java:50)
[junit4:junit4]    > 	at org.apache.solr.BaseDistributedSearchTestCase.compareResponses(BaseDistributedSearchTestCase.java:670)
[junit4:junit4]    > 	at org.apache.solr.BaseDistributedSearchTestCase.query(BaseDistributedSearchTestCase.java:392)
[junit4:junit4]    > 	at org.apache.solr.handler.component.DistributedQueryElevationComponentTest.doTest(DistributedQueryElevationComponentTest.java:81)
[junit4:junit4]    > 	at org.apache.solr.BaseDistributedSearchTestCase.testDistribSearch(BaseDistributedSearchTestCase.java:679)
[junit4:junit4]    > 	at sun.reflect.NativeMethodAccessorImpl.invoke0(Native Method)
[junit4:junit4]    > 	at sun.reflect.NativeMethodAccessorImpl.invoke(NativeMethodAccessorImpl.java:57)
[junit4:junit4]    > 	at sun.reflect.DelegatingMethodAccessorImpl.invoke(DelegatingMethodAccessorImpl.java:43)
[junit4:junit4]    > 	at java.lang.reflect.Method.invoke(Method.java:474)
[junit4:junit4]    > 	at com.carrotsearch.randomizedtesting.RandomizedRunner.invoke(RandomizedRunner.java:1995)
[junit4:junit4]    > 	at com.carrotsearch.randomizedtesting.RandomizedRunner.access$1100(RandomizedRunner.java:132)
[junit4:junit4]    > 	at com.carrotsearch.randomizedtesting.RandomizedRunner$6.evaluate(RandomizedRunner.java:818)
[junit4:junit4]    > 	at com.carrotsearch.randomizedtesting.RandomizedRunner$7.evaluate(RandomizedRunner.java:877)
[junit4:junit4]    > 	at com.carrotsearch.randomizedtesting.RandomizedRunner$8.evaluate(RandomizedRunner.java:891)
[junit4:junit4]    > 	at com.carrotsearch.randomizedtesting.rules.SystemPropertiesRestoreRule$1.evaluate(SystemPropertiesRestoreRule.java:53)
[junit4:junit4]    > 	at org.apache.lucene.util.TestRuleSetupTeardownChained$1.evaluate(TestRuleSetupTeardownChained.java:50)
[junit4:junit4]    > 	at org.apache.lucene.util.TestRuleFieldCacheSanity$1.evaluate(TestRuleFieldCacheSanity.java:32)
[junit4:junit4]    > 	at org.apache.lucene.util.AbstractBeforeAfterRule$1.evaluate(AbstractBeforeAfterRule.java:45)
[junit4:junit4]    > 	at com.carrotsearch.randomizedtesting.rules.SystemPropertiesInvariantRule$1.evaluate(SystemPropertiesInvariantRule.java:55)
[junit4:junit4]    > 	at org.apache.lucene.util.TestRuleReportUncaughtExceptions$1.evaluate(TestRuleReportUncaughtExceptions.java:68)
[junit4:junit4]    > 	at org.apache.lucene.util.TestRuleThreadAndTestName$1.evaluate(TestRuleThreadAndTestName.java:48)
[junit4:junit4]    > 	at org.apache.lucene.util.TestRuleIgnoreAfterMaxFailures$1.evaluate(TestRuleIgnoreAfterMaxFailures.java:70)
[junit4:junit4]    > 	at org.apache.lucene.util.TestRuleMarkFailure$1.evaluate(TestRuleMarkFailure.java:48)
[junit4:junit4]    > 	at com.carrotsearch.randomizedtesting.RandomizedRunner.runSingleTest(RandomizedRunner.java:825)
[junit4:junit4]    > 	at com.carrotsearch.randomizedtesting.RandomizedRunner.access$700(RandomizedRunner.java:132)
[junit4:junit4]    > 	at com.carrotsearch.randomizedtesting.RandomizedRunner$3$1.run(RandomizedRunner.java:671)
[junit4:junit4]    > 	at com.carrotsearch.randomizedtesting.RandomizedRunner$3.evaluate(RandomizedRunner.java:697)
[junit4:junit4]    > 	at com.carrotsearch.randomizedtesting.RandomizedRunner$4.evaluate(RandomizedRunner.java:736)
[junit4:junit4]    > 	at com.carrotsearch.randomizedtesting.RandomizedRunner$5.evaluate(RandomizedRunner.java:747)
[junit4:junit4]    > 	at com.carrotsearch.randomizedtesting.rules.SystemPropertiesRestoreRule$1.evaluate(SystemPropertiesRestoreRule.java:53)
[junit4:junit4]    > 	at org.apache.lucene.util.AbstractBeforeAfterRule$1.evaluate(AbstractBeforeAfterRule.java:45)
[junit4:junit4]    > 	at org.apache.lucene.util.TestRuleReportUncaughtExceptions$1.evaluate(TestRuleReportUncaughtExceptions.java:68)
[junit4:junit4]    > 	at org.apache.lucene.util.TestRuleStoreClassName$1.evaluate(TestRuleStoreClassName.java:38)
[junit4:junit4]    > 	at com.carrotsearch.randomizedtesting.rules.SystemPropertiesInvariantRule$1.evaluate(SystemPropertiesInvariantRule.java:55)
[junit4:junit4]    > 	at org.apache.lucene.util.TestRuleNoInstanceHooksOverrides$1.evaluate(TestRuleNoInstanceHooksOverrides.java:53)
[junit4:junit4]    > 	at org.apache.lucene.util.TestRuleNoStaticHooksShadowing$1.evaluate(TestRuleNoStaticHooksShadowing.java:52)
[junit4:junit4]    > 	at org.apache.lucene.util.TestRuleAssertionsRequired$1.evaluate(TestRuleAssertionsRequired.java:36)
[junit4:junit4]    > 	at org.apache.lucene.util.TestRuleMarkFailure$1.evaluate(TestRuleMarkFailure.java:48)
[junit4:junit4]    > 	at org.apache.lucene.util.TestRuleIgnoreAfterMaxFailures$1.evaluate(TestRuleIgnoreAfterMaxFailures.java:70)
[junit4:junit4]    > 	at org.apache.lucene.util.TestRuleIgnoreTestSuites$1.evaluate(TestRuleIgnoreTestSuites.java:55)
[junit4:junit4]    > 	at com.carrotsearch.randomizedtesting.RandomizedRunner.runSuite(RandomizedRunner.java:605)
[junit4:junit4]    > 	at com.carrotsearch.randomizedtesting.RandomizedRunner.access$400(RandomizedRunner.java:132)
[junit4:junit4]    > 	at com.carrotsearch.randomizedtesting.RandomizedRunner$2.run(RandomizedRunner.java:551)
[junit4:junit4]    > 
[junit4:junit4]   2> 3 T85 oas.SolrTestCaseJ4.setUp ###Starting testDistribSearch
[junit4:junit4]   2> 66 T85 oejs.Server.doStart jetty-8.1.2.v20120308
[junit4:junit4]   2> 214 T85 oejs.AbstractConnector.doStart Started SocketConnector@0.0.0.0:60688
[junit4:junit4]   2> 221 T85 oasc.SolrResourceLoader.locateSolrHome JNDI not configured for solr (NoInitialContextEx)
[junit4:junit4]   2> 222 T85 oasc.SolrResourceLoader.locateSolrHome using system property solr.solr.home: /mnt/ssd/jenkins/workspace/Lucene-Solr-4.x-Linux/checkout/solr/build/solr-core/test-files/solr
[junit4:junit4]   2> 222 T85 oasc.SolrResourceLoader.<init> new SolrResourceLoader for deduced Solr Home: '/mnt/ssd/jenkins/workspace/Lucene-Solr-4.x-Linux/checkout/solr/build/solr-core/test-files/solr/'
[junit4:junit4]   2> 236 T85 oass.SolrDispatchFilter.init SolrDispatchFilter.init()
[junit4:junit4]   2> 241 T85 oasc.SolrResourceLoader.locateSolrHome JNDI not configured for solr (NoInitialContextEx)
[junit4:junit4]   2> 242 T85 oasc.SolrResourceLoader.locateSolrHome using system property solr.solr.home: /mnt/ssd/jenkins/workspace/Lucene-Solr-4.x-Linux/checkout/solr/build/solr-core/test-files/solr
[junit4:junit4]   2> 242 T85 oasc.CoreContainer$Initializer.initialize looking for solr.xml: /mnt/ssd/jenkins/workspace/Lucene-Solr-4.x-Linux/checkout/solr/build/solr-core/test-files/solr/solr.xml
[junit4:junit4]   2> 243 T85 oasc.CoreContainer.<init> New CoreContainer 30934411
[junit4:junit4]   2> 243 T85 oasc.CoreContainer.load Loading CoreContainer using Solr Home: '/mnt/ssd/jenkins/workspace/Lucene-Solr-4.x-Linux/checkout/solr/build/solr-core/test-files/solr/'
[junit4:junit4]   2> 243 T85 oasc.SolrResourceLoader.<init> new SolrResourceLoader for directory: '/mnt/ssd/jenkins/workspace/Lucene-Solr-4.x-Linux/checkout/solr/build/solr-core/test-files/solr/'
[junit4:junit4]   2> 295 T85 oasc.CoreContainer.load Registering Log Listener
[junit4:junit4]   2> 327 T85 oasc.CoreContainer.create Creating SolrCore 'collection1' using instanceDir: /mnt/ssd/jenkins/workspace/Lucene-Solr-4.x-Linux/checkout/solr/build/solr-core/test-files/solr/collection1
[junit4:junit4]   2> 341 T85 oasc.SolrResourceLoader.<init> new SolrResourceLoader for directory: '/mnt/ssd/jenkins/workspace/Lucene-Solr-4.x-Linux/checkout/solr/build/solr-core/test-files/solr/collection1/'
[junit4:junit4]   2> 342 T85 oasc.SolrResourceLoader.replaceClassLoader Adding 'file:/mnt/ssd/jenkins/workspace/Lucene-Solr-4.x-Linux/checkout/solr/build/solr-core/test-files/solr/collection1/lib/README' to classloader
[junit4:junit4]   2> 342 T85 oasc.SolrResourceLoader.replaceClassLoader Adding 'file:/mnt/ssd/jenkins/workspace/Lucene-Solr-4.x-Linux/checkout/solr/build/solr-core/test-files/solr/collection1/lib/classes/' to classloader
[junit4:junit4]   2> 413 T85 oasc.SolrConfig.<init> Using Lucene MatchVersion: LUCENE_40
[junit4:junit4]   2> 551 T85 oasc.SolrConfig.<init> Loaded SolrConfig: solrconfig-elevate.xml
[junit4:junit4]   2> 551 T85 oass.IndexSchema.readSchema Reading Solr Schema
[junit4:junit4]   2> 555 T85 oass.IndexSchema.readSchema Schema name=example
[junit4:junit4]   2> 828 T85 oass.IndexSchema.readSchema default search field in schema is text
[junit4:junit4]   2> 830 T85 oass.IndexSchema.readSchema unique key field: id
[junit4:junit4]   2> 833 T85 oasc.SolrCore.<init> [collection1] Opening new SolrCore at /mnt/ssd/jenkins/workspace/Lucene-Solr-4.x-Linux/checkout/solr/build/solr-core/test-files/solr/collection1/, dataDir=./org.apache.solr.handler.component.DistributedQueryElevationComponentTest-1344202329924/control/data/
[junit4:junit4]   2> 834 T85 oasc.JmxMonitoredMap.<init> JMX monitoring is enabled. Adding Solr mbeans to JMX Server: com.sun.jmx.mbeanserver.JmxMBeanServer@13b460f
[junit4:junit4]   2> 834 T85 oasc.SolrCore.getNewIndexDir WARNING New index directory detected: old=null new=./org.apache.solr.handler.component.DistributedQueryElevationComponentTest-1344202329924/control/data/index/
[junit4:junit4]   2> 835 T85 oasc.SolrCore.initIndex WARNING [collection1] Solr index directory './org.apache.solr.handler.component.DistributedQueryElevationComponentTest-1344202329924/control/data/index' doesn't exist. Creating new index...
[junit4:junit4]   2> 837 T85 oasc.SolrDeletionPolicy.onCommit SolrDeletionPolicy.onCommit: commits:num=1
[junit4:junit4]   2> 		commit{dir=BaseDirectoryWrapper(org.apache.lucene.store.RAMDirectory@16a0cb3 lockFactory=org.apache.lucene.store.SingleInstanceLockFactory@167fc18),segFN=segments_1,generation=1,filenames=[segments_1]
[junit4:junit4]   2> 837 T85 oasc.SolrDeletionPolicy.updateCommits newest commit = 1
[junit4:junit4]   2> 844 T85 oasc.RequestHandlers.initHandlersFromConfig created /update: solr.UpdateRequestHandler
[junit4:junit4]   2> 844 T85 oasc.RequestHandlers.initHandlersFromConfig created /elevate: org.apache.solr.handler.component.SearchHandler
[junit4:junit4]   2> 845 T85 oasc.RequestHandlers.initHandlersFromConfig created /dataElevate: org.apache.solr.handler.component.SearchHandler
[junit4:junit4]   2> 846 T85 oashl.XMLLoader.init xsltCacheLifetimeSeconds=60
[junit4:junit4]   2> 846 T85 oasc.RequestHandlers.initHandlersFromConfig WARNING no default request handler is registered (either '/select' or 'standard')
[junit4:junit4]   2> 847 T85 oasc.SolrCore.initDeprecatedSupport WARNING solrconfig.xml uses deprecated <admin/gettableFiles>, Please update your config to use the ShowFileRequestHandler.
[junit4:junit4]   2> 849 T85 oasc.SolrCore.initDeprecatedSupport WARNING adding ShowFileRequestHandler with hidden files: [SCHEMA-LMDIRICHLET.XML, SOLRCONFIG-QUERYSENDER-NOQUERY.XML, SCHEMA-IB.XML, BAD-SCHEMA-OMIT-TF-BUT-NOT-POS.XML, SOLRCONFIG-MASTER1-KEEPONEBACKUP.XML, SCHEMA-BM25.XML, SCHEMA-NUMERIC.XML, KEEP-2.TXT, ADDFIELDS.UPDATEPROCESSOR.JS, SOLRCONFIG-DELPOLICY2.XML, SOLRCONFIG-BASIC-LUCENEVERSION31.XML, STOPWITHBOM.TXT, SCHEMA-SIM.XML, STOPWORDSWRONGENCODING.TXT, SOLRCONFIG_CODEC.XML, SCHEMA-REVERSED.XML, BAD-SOLRCONFIG-MISSING-SCRIPTFILE.XML, SOLRCONFIG-SPELLCHECKCOMPONENT.XML, SCHEMASURROUND.XML, XSLT, PROTWORDS.TXT, BAD-SCHEMA-UNIQUEKEY-USES-DEFAULT.XML, SCHEMA-REQUIRED-FIELDS.XML, STEMDICT.TXT, WDFTYPES.TXT, SOLRCONFIG-NATIVELOCK.XML, SOLRCONFIG-SOLCOREPROPERTIES.XML, SOLRCONFIG-TERMINDEX.XML, BAD-SCHEMA-DUP-FIELD.XML, SOLRCONFIG-TLOG.XML, TRIVIAL.UPDATEPROCESSOR1.JS, SOLRCONFIG-MERGEPOLICY.XML, SOLRCONFIG-REQHANDLER.INCL, SCHEMA15.XML, SOLRCONFIG-UPDATE-PROCESSOR-CHAINS.XML, SOLRCONFIG-ELEVATE.XML, SOLRCONFIG-MASTER.XML, SOLRCONFIG-MASTER3.XML, BAD-SCHEMA-ANALYZER-CLASS-AND-NESTED.XML, SCHEMA-CHARFILTERS.XML, STOP-1.TXT, SCHEMA-REPLICATION2.XML, MISSING.FUNCTIONS.UPDATEPROCESSOR.JS, MAPPING-ISOLATIN1ACCENT.TXT, BAD-SCHEMA-NOT-INDEXED-BUT-POS.XML, SCHEMA-TRIE.XML, BAD-SCHEMA-NOT-INDEXED-BUT-NORMS.XML, BAD-SCHEMA-UNIQUEKEY-IS-COPYFIELD-DEST.XML, TRIVIAL.UPDATEPROCESSOR0.JS, SOLRCONFIG-PROPINJECT-INDEXDEFAULT.XML, SCHEMA-STOP-KEEP.XML, KEEP-1.TXT, SOLRCONFIG-SLAVE1.XML, SCHEMA-COLLATEFILTER.XML, DA_COMPOUNDDICTIONARY.TXT, BAD-SCHEMA-DUP-FIELDTYPE.XML, SOLRCONFIG-HIGHLIGHT.XML, BAD-SCHEMA-CODEC-GLOBAL-VS-FT-MISMATCH.XML, SOLRCONFIG-CACHING.XML, SCHEMA.XML, SOLRCONFIG-XINCLUDE.XML, DA_UTF8.XML, SCHEMA-DFR.XML, STOPTYPES-1.TXT, OLD_SYNONYMS.TXT, SOLRCONFIG-TRANSFORMERS.XML, SOLRCONFIG-ENABLEPLUGIN.XML, BAD-SCHEMA-EXTERNAL-FILEFIELD.XML, SOLRCONFIG-FUNCTIONQUERY.XML, SOLRCONFIG_PERF.XML, PHRASESUGGEST.TXT, BAD-SOLRCONFIG-INVALID-SCRIPTFILE.XML, SOLRCONFIG-DELPOLICY1.XML, SOLRCONFIG-LAZYWRITER.XML, THROW.ERROR.ON.ADD.UPDATEPROCESSOR.JS, HYPHENATION.DTD, BAD-SOLRCONFIG-BOGUS-SCRIPTENGINE-NAME.XML, SCHEMA-REPLICATION1.XML, SOLRCONFIG-SIMPLELOCK.XML, STOPWORDS.TXT, SOLRCONFIG-SLAVE.XML, SOLRCONFIG-SPELLCHECKER.XML, SOLRCONFIG-ALTDIRECTORY.XML, BAD-SCHEMA-NOT-INDEXED-BUT-TF.XML, ELEVATE.XML, HUNSPELL-TEST.AFF, SOLRCONFIG-PHRASESUGGEST.XML, MISSLEADING.EXTENSION.UPDATEPROCESSOR.JS.TXT, CONDITIONAL.UPDATEPROCESSOR.JS, BAD_SOLRCONFIG.XML, SCHEMA11.XML, CURRENCY.XML, COMPOUNDDICTIONARY.TXT, SYNONYMS.TXT, HUNSPELL-TEST.DIC, SOLRCONFIG-REPEATER.XML, BAD-MP-SOLRCONFIG.XML, SOLRCONFIG-MASTER2.XML, SOLRCONFIG-QUERYSENDER.XML, SCHEMA12.XML, BAD-SCHEMA-NONTEXT-ANALYZER.XML, SCHEMA-COLLATE.XML, FRENCHARTICLES.TXT, BAD-SCHEMA-DUP-DYNAMICFIELD.XML, STOP-2.TXT, SCHEMA-TFIDF.XML, SCHEMA-PHRASESUGGEST.XML, SCHEMA-LMJELINEKMERCER.XML, STOP-SNOWBALL.TXT, SOLRCONFIG-PROPINJECT.XML, SCHEMA-COPYFIELD-TEST.XML, SOLRCONFIG-SOLR-749.XML, SOLRCONFIG-SCRIPT-UPDATEPROCESSOR.XML, BAD-SCHEMA-SIM-GLOBAL-VS-FT-MISMATCH.XML, SOLRCONFIG-BASIC.XML, SCHEMA_CODEC.XML, OPEN-EXCHANGE-RATES.JSON, BAD-SCHEMA-UNIQUEKEY-MULTIVALUED.XML, SCHEMA-MINIMAL.XML, SCHEMA-SPELLCHECKER.XML, SCHEMA-BINARYFIELD.XML, STOPTYPES-2.TXT, SCHEMA-LUCENEMATCHVERSION.XML, SCHEMA-FOLDING.XML, SCHEMA-NOT-REQUIRED-UNIQUE-KEY.XML, SOLRCONFIG-MASTER1.XML, SOLRCONFIG-NOCACHE.XML]
[junit4:junit4]   2> 858 T85 oass.SolrIndexSearcher.<init> Opening Searcher@1c1ad3b main
[junit4:junit4]   2> 858 T85 oass.SolrIndexSearcher.getIndexDir WARNING WARNING: Directory impl does not support setting indexDir: org.apache.lucene.store.BaseDirectoryWrapper
[junit4:junit4]   2> 859 T85 oasu.CommitTracker.<init> Hard AutoCommit: disabled
[junit4:junit4]   2> 859 T85 oasu.CommitTracker.<init> Soft AutoCommit: disabled
[junit4:junit4]   2> 859 T85 oashc.QueryElevationComponent.inform Loading QueryElevation from: /mnt/ssd/jenkins/workspace/Lucene-Solr-4.x-Linux/checkout/solr/build/solr-core/test-files/solr/collection1/conf/elevate.xml
[junit4:junit4]   2> 866 T85 oashc.QueryElevationComponent.inform Loading QueryElevation from: /mnt/ssd/jenkins/workspace/Lucene-Solr-4.x-Linux/checkout/solr/build/solr-core/test-files/solr/collection1/conf/elevate.xml
[junit4:junit4]   2> 874 T85 oashc.HttpShardHandlerFactory.getParameter Setting socketTimeout to: 0
[junit4:junit4]   2> 874 T85 oashc.HttpShardHandlerFactory.getParameter Setting urlScheme to: http://
[junit4:junit4]   2> 874 T85 oashc.HttpShardHandlerFactory.getParameter Setting connTimeout to: 0
[junit4:junit4]   2> 875 T85 oashc.HttpShardHandlerFactory.getParameter Setting maxConnectionsPerHost to: 20
[junit4:junit4]   2> 875 T85 oashc.HttpShardHandlerFactory.getParameter Setting corePoolSize to: 0
[junit4:junit4]   2> 875 T85 oashc.HttpShardHandlerFactory.getParameter Setting maximumPoolSize to: 2147483647
[junit4:junit4]   2> 875 T85 oashc.HttpShardHandlerFactory.getParameter Setting maxThreadIdleTime to: 5
[junit4:junit4]   2> 875 T85 oashc.HttpShardHandlerFactory.getParameter Setting sizeOfQueue to: -1
[junit4:junit4]   2> 876 T85 oashc.HttpShardHandlerFactory.getParameter Setting fairnessPolicy to: false
[junit4:junit4]   2> 876 T85 oascsi.HttpClientUtil.createClient Creating new http client, config:maxConnectionsPerHost=20&maxConnections=10000&socketTimeout=0&connTimeout=0&retry=false
[junit4:junit4]   2> 879 T96 oasc.SolrCore.registerSearcher [collection1] Registered new searcher Searcher@1c1ad3b main{StandardDirectoryReader(segments_1:1)}
[junit4:junit4]   2> 879 T85 oasc.CoreContainer.register registering core: collection1
[junit4:junit4]   2> 880 T85 oass.SolrDispatchFilter.init user.dir=/mnt/ssd/jenkins/workspace/Lucene-Solr-4.x-Linux/checkout/solr/build/solr-core/test/J0
[junit4:junit4]   2> 880 T85 oass.SolrDispatchFilter.init SolrDispatchFilter.init() done
[junit4:junit4]   2> 886 T85 oascsi.HttpClientUtil.createClient Creating new http client, config:maxConnections=128&maxConnectionsPerHost=32&followRedirects=false
[junit4:junit4]   2> 890 T85 oejs.Server.doStart jetty-8.1.2.v20120308
[junit4:junit4]   2> 893 T85 oejs.AbstractConnector.doStart Started SocketConnector@0.0.0.0:47631
[junit4:junit4]   2> 893 T85 oasc.SolrResourceLoader.locateSolrHome JNDI not configured for solr (NoInitialContextEx)
[junit4:junit4]   2> 894 T85 oasc.SolrResourceLoader.locateSolrHome using system property solr.solr.home: /mnt/ssd/jenkins/workspace/Lucene-Solr-4.x-Linux/checkout/solr/build/solr-core/test-files/solr
[junit4:junit4]   2> 894 T85 oasc.SolrResourceLoader.<init> new SolrResourceLoader for deduced Solr Home: '/mnt/ssd/jenkins/workspace/Lucene-Solr-4.x-Linux/checkout/solr/build/solr-core/test-files/solr/'
[junit4:junit4]   2> 931 T85 oass.SolrDispatchFilter.init SolrDispatchFilter.init()
[junit4:junit4]   2> 932 T85 oasc.SolrResourceLoader.locateSolrHome JNDI not configured for solr (NoInitialContextEx)
[junit4:junit4]   2> 932 T85 oasc.SolrResourceLoader.locateSolrHome using system property solr.solr.home: /mnt/ssd/jenkins/workspace/Lucene-Solr-4.x-Linux/checkout/solr/build/solr-core/test-files/solr
[junit4:junit4]   2> 932 T85 oasc.CoreContainer$Initializer.initialize looking for solr.xml: /mnt/ssd/jenkins/workspace/Lucene-Solr-4.x-Linux/checkout/solr/build/solr-core/test-files/solr/solr.xml
[junit4:junit4]   2> 933 T85 oasc.CoreContainer.<init> New CoreContainer 8044399
[junit4:junit4]   2> 933 T85 oasc.CoreContainer.load Loading CoreContainer using Solr Home: '/mnt/ssd/jenkins/workspace/Lucene-Solr-4.x-Linux/checkout/solr/build/solr-core/test-files/solr/'
[junit4:junit4]   2> 933 T85 oasc.SolrResourceLoader.<init> new SolrResourceLoader for directory: '/mnt/ssd/jenkins/workspace/Lucene-Solr-4.x-Linux/checkout/solr/build/solr-core/test-files/solr/'
[junit4:junit4]   2> 949 T85 oasc.CoreContainer.load Registering Log Listener
[junit4:junit4]   2> 961 T85 oasc.CoreContainer.create Creating SolrCore 'collection1' using instanceDir: /mnt/ssd/jenkins/workspace/Lucene-Solr-4.x-Linux/checkout/solr/build/solr-core/test-files/solr/collection1
[junit4:junit4]   2> 962 T85 oasc.SolrResourceLoader.<init> new SolrResourceLoader for directory: '/mnt/ssd/jenkins/workspace/Lucene-Solr-4.x-Linux/checkout/solr/build/solr-core/test-files/solr/collection1/'
[junit4:junit4]   2> 962 T85 oasc.SolrResourceLoader.replaceClassLoader Adding 'file:/mnt/ssd/jenkins/workspace/Lucene-Solr-4.x-Linux/checkout/solr/build/solr-core/test-files/solr/collection1/lib/README' to classloader
[junit4:junit4]   2> 963 T85 oasc.SolrResourceLoader.replaceClassLoader Adding 'file:/mnt/ssd/jenkins/workspace/Lucene-Solr-4.x-Linux/checkout/solr/build/solr-core/test-files/solr/collection1/lib/classes/' to classloader
[junit4:junit4]   2> 992 T85 oasc.SolrConfig.<init> Using Lucene MatchVersion: LUCENE_40
[junit4:junit4]   2> 1038 T85 oasc.SolrConfig.<init> Loaded SolrConfig: solrconfig-elevate.xml
[junit4:junit4]   2> 1039 T85 oass.IndexSchema.readSchema Reading Solr Schema
[junit4:junit4]   2> 1043 T85 oass.IndexSchema.readSchema Schema name=example
[junit4:junit4]   2> 1235 T85 oass.IndexSchema.readSchema default search field in schema is text
[junit4:junit4]   2> 1237 T85 oass.IndexSchema.readSchema unique key field: id
[junit4:junit4]   2> 1241 T85 oasc.SolrCore.<init> [collection1] Opening new SolrCore at /mnt/ssd/jenkins/workspace/Lucene-Solr-4.x-Linux/checkout/solr/build/solr-core/test-files/solr/collection1/, dataDir=./org.apache.solr.handler.component.DistributedQueryElevationComponentTest-1344202329924/shard0/data/
[junit4:junit4]   2> 1241 T85 oasc.JmxMonitoredMap.<init> JMX monitoring is enabled. Adding Solr mbeans to JMX Server: com.sun.jmx.mbeanserver.JmxMBeanServer@13b460f
[junit4:junit4]   2> 1242 T85 oasc.SolrCore.getNewIndexDir WARNING New index directory detected: old=null new=./org.apache.solr.handler.component.DistributedQueryElevationComponentTest-1344202329924/shard0/data/index/
[junit4:junit4]   2> 1242 T85 oasc.SolrCore.initIndex WARNING [collection1] Solr index directory './org.apache.solr.handler.component.DistributedQueryElevationComponentTest-1344202329924/shard0/data/index' doesn't exist. Creating new index...
[junit4:junit4]   2> 1243 T85 oasc.SolrDeletionPolicy.onCommit SolrDeletionPolicy.onCommit: commits:num=1
[junit4:junit4]   2> 		commit{dir=MockDirWrapper(org.apache.lucene.store.RAMDirectory@1365c67 lockFactory=org.apache.lucene.store.SingleInstanceLockFactory@e4a44b),segFN=segments_1,generation=1,filenames=[segments_1]
[junit4:junit4]   2> 1244 T85 oasc.SolrDeletionPolicy.updateCommits newest commit = 1
[junit4:junit4]   2> 1245 T85 oasc.RequestHandlers.initHandlersFromConfig created /update: solr.UpdateRequestHandler
[junit4:junit4]   2> 1246 T85 oasc.RequestHandlers.initHandlersFromConfig created /elevate: org.apache.solr.handler.component.SearchHandler
[junit4:junit4]   2> 1246 T85 oasc.RequestHandlers.initHandlersFromConfig created /dataElevate: org.apache.solr.handler.component.SearchHandler
[junit4:junit4]   2> 1247 T85 oashl.XMLLoader.init xsltCacheLifetimeSeconds=60
[junit4:junit4]   2> 1247 T85 oasc.RequestHandlers.initHandlersFromConfig WARNING no default request handler is registered (either '/select' or 'standard')
[junit4:junit4]   2> 1248 T85 oasc.SolrCore.initDeprecatedSupport WARNING solrconfig.xml uses deprecated <admin/gettableFiles>, Please update your config to use the ShowFileRequestHandler.
[junit4:junit4]   2> 1249 T85 oasc.SolrCore.initDeprecatedSupport WARNING adding ShowFileRequestHandler with hidden files: [SCHEMA-LMDIRICHLET.XML, SOLRCONFIG-QUERYSENDER-NOQUERY.XML, SCHEMA-IB.XML, BAD-SCHEMA-OMIT-TF-BUT-NOT-POS.XML, SOLRCONFIG-MASTER1-KEEPONEBACKUP.XML, SCHEMA-BM25.XML, SCHEMA-NUMERIC.XML, KEEP-2.TXT, ADDFIELDS.UPDATEPROCESSOR.JS, SOLRCONFIG-DELPOLICY2.XML, SOLRCONFIG-BASIC-LUCENEVERSION31.XML, STOPWITHBOM.TXT, SCHEMA-SIM.XML, STOPWORDSWRONGENCODING.TXT, SOLRCONFIG_CODEC.XML, SCHEMA-REVERSED.XML, BAD-SOLRCONFIG-MISSING-SCRIPTFILE.XML, SOLRCONFIG-SPELLCHECKCOMPONENT.XML, SCHEMASURROUND.XML, XSLT, PROTWORDS.TXT, BAD-SCHEMA-UNIQUEKEY-USES-DEFAULT.XML, SCHEMA-REQUIRED-FIELDS.XML, STEMDICT.TXT, WDFTYPES.TXT, SOLRCONFIG-NATIVELOCK.XML, SOLRCONFIG-SOLCOREPROPERTIES.XML, SOLRCONFIG-TERMINDEX.XML, BAD-SCHEMA-DUP-FIELD.XML, SOLRCONFIG-TLOG.XML, TRIVIAL.UPDATEPROCESSOR1.JS, SOLRCONFIG-MERGEPOLICY.XML, SOLRCONFIG-REQHANDLER.INCL, SCHEMA15.XML, SOLRCONFIG-UPDATE-PROCESSOR-CHAINS.XML, SOLRCONFIG-ELEVATE.XML, SOLRCONFIG-MASTER.XML, SOLRCONFIG-MASTER3.XML, BAD-SCHEMA-ANALYZER-CLASS-AND-NESTED.XML, SCHEMA-CHARFILTERS.XML, STOP-1.TXT, SCHEMA-REPLICATION2.XML, MISSING.FUNCTIONS.UPDATEPROCESSOR.JS, MAPPING-ISOLATIN1ACCENT.TXT, BAD-SCHEMA-NOT-INDEXED-BUT-POS.XML, SCHEMA-TRIE.XML, BAD-SCHEMA-NOT-INDEXED-BUT-NORMS.XML, BAD-SCHEMA-UNIQUEKEY-IS-COPYFIELD-DEST.XML, TRIVIAL.UPDATEPROCESSOR0.JS, SOLRCONFIG-PROPINJECT-INDEXDEFAULT.XML, SCHEMA-STOP-KEEP.XML, KEEP-1.TXT, SOLRCONFIG-SLAVE1.XML, SCHEMA-COLLATEFILTER.XML, DA_COMPOUNDDICTIONARY.TXT, BAD-SCHEMA-DUP-FIELDTYPE.XML, SOLRCONFIG-HIGHLIGHT.XML, BAD-SCHEMA-CODEC-GLOBAL-VS-FT-MISMATCH.XML, SOLRCONFIG-CACHING.XML, SCHEMA.XML, SOLRCONFIG-XINCLUDE.XML, DA_UTF8.XML, SCHEMA-DFR.XML, STOPTYPES-1.TXT, OLD_SYNONYMS.TXT, SOLRCONFIG-TRANSFORMERS.XML, SOLRCONFIG-ENABLEPLUGIN.XML, BAD-SCHEMA-EXTERNAL-FILEFIELD.XML, SOLRCONFIG-FUNCTIONQUERY.XML, SOLRCONFIG_PERF.XML, PHRASESUGGEST.TXT, BAD-SOLRCONFIG-INVALID-SCRIPTFILE.XML, SOLRCONFIG-DELPOLICY1.XML, SOLRCONFIG-LAZYWRITER.XML, THROW.ERROR.ON.ADD.UPDATEPROCESSOR.JS, HYPHENATION.DTD, BAD-SOLRCONFIG-BOGUS-SCRIPTENGINE-NAME.XML, SCHEMA-REPLICATION1.XML, SOLRCONFIG-SIMPLELOCK.XML, STOPWORDS.TXT, SOLRCONFIG-SLAVE.XML, SOLRCONFIG-SPELLCHECKER.XML, SOLRCONFIG-ALTDIRECTORY.XML, BAD-SCHEMA-NOT-INDEXED-BUT-TF.XML, ELEVATE.XML, HUNSPELL-TEST.AFF, SOLRCONFIG-PHRASESUGGEST.XML, MISSLEADING.EXTENSION.UPDATEPROCESSOR.JS.TXT, CONDITIONAL.UPDATEPROCESSOR.JS, BAD_SOLRCONFIG.XML, SCHEMA11.XML, CURRENCY.XML, COMPOUNDDICTIONARY.TXT, SYNONYMS.TXT, HUNSPELL-TEST.DIC, SOLRCONFIG-REPEATER.XML, BAD-MP-SOLRCONFIG.XML, SOLRCONFIG-MASTER2.XML, SOLRCONFIG-QUERYSENDER.XML, SCHEMA12.XML, BAD-SCHEMA-NONTEXT-ANALYZER.XML, SCHEMA-COLLATE.XML, FRENCHARTICLES.TXT, BAD-SCHEMA-DUP-DYNAMICFIELD.XML, STOP-2.TXT, SCHEMA-TFIDF.XML, SCHEMA-PHRASESUGGEST.XML, SCHEMA-LMJELINEKMERCER.XML, STOP-SNOWBALL.TXT, SOLRCONFIG-PROPINJECT.XML, SCHEMA-COPYFIELD-TEST.XML, SOLRCONFIG-SOLR-749.XML, SOLRCONFIG-SCRIPT-UPDATEPROCESSOR.XML, BAD-SCHEMA-SIM-GLOBAL-VS-FT-MISMATCH.XML, SOLRCONFIG-BASIC.XML, SCHEMA_CODEC.XML, OPEN-EXCHANGE-RATES.JSON, BAD-SCHEMA-UNIQUEKEY-MULTIVALUED.XML, SCHEMA-MINIMAL.XML, SCHEMA-SPELLCHECKER.XML, SCHEMA-BINARYFIELD.XML, STOPTYPES-2.TXT, SCHEMA-LUCENEMATCHVERSION.XML, SCHEMA-FOLDING.XML, SCHEMA-NOT-REQUIRED-UNIQUE-KEY.XML, SOLRCONFIG-MASTER1.XML, SOLRCONFIG-NOCACHE.XML]
[junit4:junit4]   2> 1252 T85 oass.SolrIndexSearcher.<init> Opening Searcher@cf9d51 main
[junit4:junit4]   2> 1252 T85 oass.SolrIndexSearcher.getIndexDir WARNING WARNING: Directory impl does not support setting indexDir: org.apache.lucene.store.MockDirectoryWrapper
[junit4:junit4]   2> 1252 T85 oasu.CommitTracker.<init> Hard AutoCommit: disabled
[junit4:junit4]   2> 1253 T85 oasu.CommitTracker.<init> Soft AutoCommit: disabled
[junit4:junit4]   2> 1253 T85 oashc.QueryElevationComponent.inform Loading QueryElevation from: /mnt/ssd/jenkins/workspace/Lucene-Solr-4.x-Linux/checkout/solr/build/solr-core/test-files/solr/collection1/conf/elevate.xml
[junit4:junit4]   2> 1262 T85 oashc.QueryElevationComponent.inform Loading QueryElevation from: /mnt/ssd/jenkins/workspace/Lucene-Solr-4.x-Linux/checkout/solr/build/solr-core/test-files/solr/collection1/conf/elevate.xml
[junit4:junit4]   2> 1273 T85 oashc.HttpShardHandlerFactory.getParameter Setting socketTimeout to: 0
[junit4:junit4]   2> 1273 T85 oashc.HttpShardHandlerFactory.getParameter Setting urlScheme to: http://
[junit4:junit4]   2> 1274 T85 oashc.HttpShardHandlerFactory.getParameter Setting connTimeout to: 0
[junit4:junit4]   2> 1274 T85 oashc.HttpShardHandlerFactory.getParameter Setting maxConnectionsPerHost to: 20
[junit4:junit4]   2> 1274 T85 oashc.HttpShardHandlerFactory.getParameter Setting corePoolSize to: 0
[junit4:junit4]   2> 1275 T85 oashc.HttpShardHandlerFactory.getParameter Setting maximumPoolSize to: 2147483647
[junit4:junit4]   2> 1275 T85 oashc.HttpShardHandlerFactory.getParameter Setting maxThreadIdleTime to: 5
[junit4:junit4]   2> 1275 T85 oashc.HttpShardHandlerFactory.getParameter Setting sizeOfQueue to: -1
[junit4:junit4]   2> 1276 T85 oashc.HttpShardHandlerFactory.getParameter Setting fairnessPolicy to: false
[junit4:junit4]   2> 1276 T85 oascsi.HttpClientUtil.createClient Creating new http client, config:maxConnectionsPerHost=20&maxConnections=10000&socketTimeout=0&connTimeout=0&retry=false
[junit4:junit4]   2> 1281 T106 oasc.SolrCore.registerSearcher [collection1] Registered new searcher Searcher@cf9d51 main{StandardDirectoryReader(segments_1:1)}
[junit4:junit4]   2> 1281 T85 oasc.CoreContainer.register registering core: collection1
[junit4:junit4]   2> 1281 T85 oass.SolrDispatchFilter.init user.dir=/mnt/ssd/jenkins/workspace/Lucene-Solr-4.x-Linux/checkout/solr/build/solr-core/test/J0
[junit4:junit4]   2> 1282 T85 oass.SolrDispatchFilter.init SolrDispatchFilter.init() done
[junit4:junit4]   2> 1282 T85 oascsi.HttpClientUtil.createClient Creating new http client, config:maxConnections=128&maxConnectionsPerHost=32&followRedirects=false
[junit4:junit4]   2> 1286 T85 oejs.Server.doStart jetty-8.1.2.v20120308
[junit4:junit4]   2> 1290 T85 oejs.AbstractConnector.doStart Started SocketConnector@0.0.0.0:51357
[junit4:junit4]   2> 1291 T85 oasc.SolrResourceLoader.locateSolrHome JNDI not configured for solr (NoInitialContextEx)
[junit4:junit4]   2> 1291 T85 oasc.SolrResourceLoader.locateSolrHome using system property solr.solr.home: /mnt/ssd/jenkins/workspace/Lucene-Solr-4.x-Linux/checkout/solr/build/solr-core/test-files/solr
[junit4:junit4]   2> 1292 T85 oasc.SolrResourceLoader.<init> new SolrResourceLoader for deduced Solr Home: '/mnt/ssd/jenkins/workspace/Lucene-Solr-4.x-Linux/checkout/solr/build/solr-core/test-files/solr/'
[junit4:junit4]   2> 1303 T85 oass.SolrDispatchFilter.init SolrDispatchFilter.init()
[junit4:junit4]   2> 1304 T85 oasc.SolrResourceLoader.locateSolrHome JNDI not configured for solr (NoInitialContextEx)
[junit4:junit4]   2> 1304 T85 oasc.SolrResourceLoader.locateSolrHome using system property solr.solr.home: /mnt/ssd/jenkins/workspace/Lucene-Solr-4.x-Linux/checkout/solr/build/solr-core/test-files/solr
[junit4:junit4]   2> 1304 T85 oasc.CoreContainer$Initializer.initialize looking for solr.xml: /mnt/ssd/jenkins/workspace/Lucene-Solr-4.x-Linux/checkout/solr/build/solr-core/test-files/solr/solr.xml
[junit4:junit4]   2> 1305 T85 oasc.CoreContainer.<init> New CoreContainer 3681272
[junit4:junit4]   2> 1305 T85 oasc.CoreContainer.load Loading CoreContainer using Solr Home: '/mnt/ssd/jenkins/workspace/Lucene-Solr-4.x-Linux/checkout/solr/build/solr-core/test-files/solr/'
[junit4:junit4]   2> 1306 T85 oasc.SolrResourceLoader.<init> new SolrResourceLoader for directory: '/mnt/ssd/jenkins/workspace/Lucene-Solr-4.x-Linux/checkout/solr/build/solr-core/test-files/solr/'
[junit4:junit4]   2> 1322 T85 oasc.CoreContainer.load Registering Log Listener
[junit4:junit4]   2> 1341 T85 oasc.CoreContainer.create Creating SolrCore 'collection1' using instanceDir: /mnt/ssd/jenkins/workspace/Lucene-Solr-4.x-Linux/checkout/solr/build/solr-core/test-files/solr/collection1
[junit4:junit4]   2> 1342 T85 oasc.SolrResourceLoader.<init> new SolrResourceLoader for directory: '/mnt/ssd/jenkins/workspace/Lucene-Solr-4.x-Linux/checkout/solr/build/solr-core/test-files/solr/collection1/'
[junit4:junit4]   2> 1342 T85 oasc.SolrResourceLoader.replaceClassLoader Adding 'file:/mnt/ssd/jenkins/workspace/Lucene-Solr-4.x-Linux/checkout/solr/build/solr-core/test-files/solr/collection1/lib/README' to classloader
[junit4:junit4]   2> 1343 T85 oasc.SolrResourceLoader.replaceClassLoader Adding 'file:/mnt/ssd/jenkins/workspace/Lucene-Solr-4.x-Linux/checkout/solr/build/solr-core/test-files/solr/collection1/lib/classes/' to classloader
[junit4:junit4]   2> 1371 T85 oasc.SolrConfig.<init> Using Lucene MatchVersion: LUCENE_40
[junit4:junit4]   2> 1417 T85 oasc.SolrConfig.<init> Loaded SolrConfig: solrconfig-elevate.xml
[junit4:junit4]   2> 1417 T85 oass.IndexSchema.readSchema Reading Solr Schema
[junit4:junit4]   2> 1421 T85 oass.IndexSchema.readSchema Schema name=example
[junit4:junit4]   2> 1665 T85 oass.IndexSchema.readSchema default search field in schema is text
[junit4:junit4]   2> 1667 T85 oass.IndexSchema.readSchema unique key field: id
[junit4:junit4]   2> 1670 T85 oasc.SolrCore.<init> [collection1] Opening new SolrCore at /mnt/ssd/jenkins/workspace/Lucene-Solr-4.x-Linux/checkout/solr/build/solr-core/test-files/solr/collection1/, dataDir=./org.apache.solr.handler.component.DistributedQueryElevationComponentTest-1344202329924/shard1/data/
[junit4:junit4]   2> 1671 T85 oasc.JmxMonitoredMap.<init> JMX monitoring is enabled. Adding Solr mbeans to JMX Server: com.sun.jmx.mbeanserver.JmxMBeanServer@13b460f
[junit4:junit4]   2> 1671 T85 oasc.SolrCore.getNewIndexDir WARNING New index directory detected: old=null new=./org.apache.solr.handler.component.DistributedQueryElevationComponentTest-1344202329924/shard1/data/index/
[junit4:junit4]   2> 1672 T85 oasc.SolrCore.initIndex WARNING [collection1] Solr index directory './org.apache.solr.handler.component.DistributedQueryElevationComponentTest-1344202329924/shard1/data/index' doesn't exist. Creating new index...
[junit4:junit4]   2> 1673 T85 oasc.SolrDeletionPolicy.onCommit SolrDeletionPolicy.onCommit: commits:num=1
[junit4:junit4]   2> 		commit{dir=MockDirWrapper(org.apache.lucene.store.RAMDirectory@1ad91db lockFactory=org.apache.lucene.store.SingleInstanceLockFactory@4fb6e1),segFN=segments_1,generation=1,filenames=[segments_1]
[junit4:junit4]   2> 1674 T85 oasc.SolrDeletionPolicy.updateCommits newest commit = 1
[junit4:junit4]   2> 1676 T85 oasc.RequestHandlers.initHandlersFromConfig created /update: solr.UpdateRequestHandler
[junit4:junit4]   2> 1676 T85 oasc.RequestHandlers.initHandlersFromConfig created /elevate: org.apache.solr.handler.component.SearchHandler
[junit4:junit4]   2> 1676 T85 oasc.RequestHandlers.initHandlersFromConfig created /dataElevate: org.apache.solr.handler.component.SearchHandler
[junit4:junit4]   2> 1677 T85 oashl.XMLLoader.init xsltCacheLifetimeSeconds=60
[junit4:junit4]   2> 1678 T85 oasc.RequestHandlers.initHandlersFromConfig WARNING no default request handler is registered (either '/select' or 'standard')
[junit4:junit4]   2> 1679 T85 oasc.SolrCore.initDeprecatedSupport WARNING solrconfig.xml uses deprecated <admin/gettableFiles>, Please update your config to use the ShowFileRequestHandler.
[junit4:junit4]   2> 1680 T85 oasc.SolrCore.initDeprecatedSupport WARNING adding ShowFileRequestHandler with hidden files: [SCHEMA-LMDIRICHLET.XML, SOLRCONFIG-QUERYSENDER-NOQUERY.XML, SCHEMA-IB.XML, BAD-SCHEMA-OMIT-TF-BUT-NOT-POS.XML, SOLRCONFIG-MASTER1-KEEPONEBACKUP.XML, SCHEMA-BM25.XML, SCHEMA-NUMERIC.XML, KEEP-2.TXT, ADDFIELDS.UPDATEPROCESSOR.JS, SOLRCONFIG-DELPOLICY2.XML, SOLRCONFIG-BASIC-LUCENEVERSION31.XML, STOPWITHBOM.TXT, SCHEMA-SIM.XML, STOPWORDSWRONGENCODING.TXT, SOLRCONFIG_CODEC.XML, SCHEMA-REVERSED.XML, BAD-SOLRCONFIG-MISSING-SCRIPTFILE.XML, SOLRCONFIG-SPELLCHECKCOMPONENT.XML, SCHEMASURROUND.XML, XSLT, PROTWORDS.TXT, BAD-SCHEMA-UNIQUEKEY-USES-DEFAULT.XML, SCHEMA-REQUIRED-FIELDS.XML, STEMDICT.TXT, WDFTYPES.TXT, SOLRCONFIG-NATIVELOCK.XML, SOLRCONFIG-SOLCOREPROPERTIES.XML, SOLRCONFIG-TERMINDEX.XML, BAD-SCHEMA-DUP-FIELD.XML, SOLRCONFIG-TLOG.XML, TRIVIAL.UPDATEPROCESSOR1.JS, SOLRCONFIG-MERGEPOLICY.XML, SOLRCONFIG-REQHANDLER.INCL, SCHEMA15.XML, SOLRCONFIG-UPDATE-PROCESSOR-CHAINS.XML, SOLRCONFIG-ELEVATE.XML, SOLRCONFIG-MASTER.XML, SOLRCONFIG-MASTER3.XML, BAD-SCHEMA-ANALYZER-CLASS-AND-NESTED.XML, SCHEMA-CHARFILTERS.XML, STOP-1.TXT, SCHEMA-REPLICATION2.XML, MISSING.FUNCTIONS.UPDATEPROCESSOR.JS, MAPPING-ISOLATIN1ACCENT.TXT, BAD-SCHEMA-NOT-INDEXED-BUT-POS.XML, SCHEMA-TRIE.XML, BAD-SCHEMA-NOT-INDEXED-BUT-NORMS.XML, BAD-SCHEMA-UNIQUEKEY-IS-COPYFIELD-DEST.XML, TRIVIAL.UPDATEPROCESSOR0.JS, SOLRCONFIG-PROPINJECT-INDEXDEFAULT.XML, SCHEMA-STOP-KEEP.XML, KEEP-1.TXT, SOLRCONFIG-SLAVE1.XML, SCHEMA-COLLATEFILTER.XML, DA_COMPOUNDDICTIONARY.TXT, BAD-SCHEMA-DUP-FIELDTYPE.XML, SOLRCONFIG-HIGHLIGHT.XML, BAD-SCHEMA-CODEC-GLOBAL-VS-FT-MISMATCH.XML, SOLRCONFIG-CACHING.XML, SCHEMA.XML, SOLRCONFIG-XINCLUDE.XML, DA_UTF8.XML, SCHEMA-DFR.XML, STOPTYPES-1.TXT, OLD_SYNONYMS.TXT, SOLRCONFIG-TRANSFORMERS.XML, SOLRCONFIG-ENABLEPLUGIN.XML, BAD-SCHEMA-EXTERNAL-FILEFIELD.XML, SOLRCONFIG-FUNCTIONQUERY.XML, SOLRCONFIG_PERF.XML, PHRASESUGGEST.TXT, BAD-SOLRCONFIG-INVALID-SCRIPTFILE.XML, SOLRCONFIG-DELPOLICY1.XML, SOLRCONFIG-LAZYWRITER.XML, THROW.ERROR.ON.ADD.UPDATEPROCESSOR.JS, HYPHENATION.DTD, BAD-SOLRCONFIG-BOGUS-SCRIPTENGINE-NAME.XML, SCHEMA-REPLICATION1.XML, SOLRCONFIG-SIMPLELOCK.XML, STOPWORDS.TXT, SOLRCONFIG-SLAVE.XML, SOLRCONFIG-SPELLCHECKER.XML, SOLRCONFIG-ALTDIRECTORY.XML, BAD-SCHEMA-NOT-INDEXED-BUT-TF.XML, ELEVATE.XML, HUNSPELL-TEST.AFF, SOLRCONFIG-PHRASESUGGEST.XML, MISSLEADING.EXTENSION.UPDATEPROCESSOR.JS.TXT, CONDITIONAL.UPDATEPROCESSOR.JS, BAD_SOLRCONFIG.XML, SCHEMA11.XML, CURRENCY.XML, COMPOUNDDICTIONARY.TXT, SYNONYMS.TXT, HUNSPELL-TEST.DIC, SOLRCONFIG-REPEATER.XML, BAD-MP-SOLRCONFIG.XML, SOLRCONFIG-MASTER2.XML, SOLRCONFIG-QUERYSENDER.XML, SCHEMA12.XML, BAD-SCHEMA-NONTEXT-ANALYZER.XML, SCHEMA-COLLATE.XML, FRENCHARTICLES.TXT, BAD-SCHEMA-DUP-DYNAMICFIELD.XML, STOP-2.TXT, SCHEMA-TFIDF.XML, SCHEMA-PHRASESUGGEST.XML, SCHEMA-LMJELINEKMERCER.XML, STOP-SNOWBALL.TXT, SOLRCONFIG-PROPINJECT.XML, SCHEMA-COPYFIELD-TEST.XML, SOLRCONFIG-SOLR-749.XML, SOLRCONFIG-SCRIPT-UPDATEPROCESSOR.XML, BAD-SCHEMA-SIM-GLOBAL-VS-FT-MISMATCH.XML, SOLRCONFIG-BASIC.XML, SCHEMA_CODEC.XML, OPEN-EXCHANGE-RATES.JSON, BAD-SCHEMA-UNIQUEKEY-MULTIVALUED.XML, SCHEMA-MINIMAL.XML, SCHEMA-SPELLCHECKER.XML, SCHEMA-BINARYFIELD.XML, STOPTYPES-2.TXT, SCHEMA-LUCENEMATCHVERSION.XML, SCHEMA-FOLDING.XML, SCHEMA-NOT-REQUIRED-UNIQUE-KEY.XML, SOLRCONFIG-MASTER1.XML, SOLRCONFIG-NOCACHE.XML]
[junit4:junit4]   2> 1683 T85 oass.SolrIndexSearcher.<init> Opening Searcher@15397d4 main
[junit4:junit4]   2> 1684 T85 oass.SolrIndexSearcher.getIndexDir WARNING WARNING: Directory impl does not support setting indexDir: org.apache.lucene.store.MockDirectoryWrapper
[junit4:junit4]   2> 1684 T85 oasu.CommitTracker.<init> Hard AutoCommit: disabled
[junit4:junit4]   2> 1685 T85 oasu.CommitTracker.<init> Soft AutoCommit: disabled
[junit4:junit4]   2> 1685 T85 oashc.QueryElevationComponent.inform Loading QueryElevation from: /mnt/ssd/jenkins/workspace/Lucene-Solr-4.x-Linux/checkout/solr/build/solr-core/test-files/solr/collection1/conf/elevate.xml
[junit4:junit4]   2> 1695 T85 oashc.QueryElevationComponent.inform Loading QueryElevation from: /mnt/ssd/jenkins/workspace/Lucene-Solr-4.x-Linux/checkout/solr/build/solr-core/test-files/solr/collection1/conf/elevate.xml
[junit4:junit4]   2> 1704 T85 oashc.HttpShardHandlerFactory.getParameter Setting socketTimeout to: 0
[junit4:junit4]   2> 1704 T85 oashc.HttpShardHandlerFactory.getParameter Setting urlScheme to: http://
[junit4:junit4]   2> 1705 T85 oashc.HttpShardHandlerFactory.getParameter Setting connTimeout to: 0
[junit4:junit4]   2> 1705 T85 oashc.HttpShardHandlerFactory.getParameter Setting maxConnectionsPerHost to: 20
[junit4:junit4]   2> 1705 T85 oashc.HttpShardHandlerFactory.getParameter Setting corePoolSize to: 0
[junit4:junit4]   2> 1706 T85 oashc.HttpShardHandlerFactory.getParameter Setting maximumPoolSize to: 2147483647
[junit4:junit4]   2> 1706 T85 oashc.HttpShardHandlerFactory.getParameter Setting maxThreadIdleTime to: 5
[junit4:junit4]   2> 1706 T85 oashc.HttpShardHandlerFactory.getParameter Setting sizeOfQueue to: -1
[junit4:junit4]   2> 1707 T85 oashc.HttpShardHandlerFactory.getParameter Setting fairnessPolicy to: false
[junit4:junit4]   2> 1707 T85 oascsi.HttpClientUtil.createClient Creating new http client, config:maxConnectionsPerHost=20&maxConnections=10000&socketTimeout=0&connTimeout=0&retry=false
[junit4:junit4]   2> 1710 T116 oasc.SolrCore.registerSearcher [collection1] Registered new searcher Searcher@15397d4 main{StandardDirectoryReader(segments_1:1)}
[junit4:junit4]   2> 1710 T85 oasc.CoreContainer.register registering core: collection1
[junit4:junit4]   2> 1710 T85 oass.SolrDispatchFilter.init user.dir=/mnt/ssd/jenkins/workspace/Lucene-Solr-4.x-Linux/checkout/solr/build/solr-core/test/J0
[junit4:junit4]   2> 1711 T85 oass.SolrDispatchFilter.init SolrDispatchFilter.init() done
[junit4:junit4]   2> 1711 T85 oascsi.HttpClientUtil.createClient Creating new http client, config:maxConnections=128&maxConnectionsPerHost=32&followRedirects=false
[junit4:junit4]   2> 1713 T85 oejs.Server.doStart jetty-8.1.2.v20120308
[junit4:junit4]   2> 1714 T85 oejs.AbstractConnector.doStart Started SocketConnector@0.0.0.0:47527
[junit4:junit4]   2> 1716 T85 oasc.SolrResourceLoader.locateSolrHome JNDI not configured for solr (NoInitialContextEx)
[junit4:junit4]   2> 1716 T85 oasc.SolrResourceLoader.locateSolrHome using system property solr.solr.home: /mnt/ssd/jenkins/workspace/Lucene-Solr-4.x-Linux/checkout/solr/build/solr-core/test-files/solr
[junit4:junit4]   2> 1716 T85 oasc.SolrResourceLoader.<init> new SolrResourceLoader for deduced Solr Home: '/mnt/ssd/jenkins/workspace/Lucene-Solr-4.x-Linux/checkout/solr/build/solr-core/test-files/solr/'
[junit4:junit4]   2> 1723 T85 oass.SolrDispatchFilter.init SolrDispatchFilter.init()
[junit4:junit4]   2> 1723 T85 oasc.SolrResourceLoader.locateSolrHome JNDI not configured for solr (NoInitialContextEx)
[junit4:junit4]   2> 1723 T85 oasc.SolrResourceLoader.locateSolrHome using system property solr.solr.home: /mnt/ssd/jenkins/workspace/Lucene-Solr-4.x-Linux/checkout/solr/build/solr-core/test-files/solr
[junit4:junit4]   2> 1724 T85 oasc.CoreContainer$Initializer.initialize looking for solr.xml: /mnt/ssd/jenkins/workspace/Lucene-Solr-4.x-Linux/checkout/solr/build/solr-core/test-files/solr/solr.xml
[junit4:junit4]   2> 1724 T85 oasc.CoreContainer.<init> New CoreContainer 10788506
[junit4:junit4]   2> 1724 T85 oasc.CoreContainer.load Loading CoreContainer using Solr Home: '/mnt/ssd/jenkins/workspace/Lucene-Solr-4.x-Linux/checkout/solr/build/solr-core/test-files/solr/'
[junit4:junit4]   2> 1724 T85 oasc.SolrResourceLoader.<init> new SolrResourceLoader for directory: '/mnt/ssd/jenkins/workspace/Lucene-Solr-4.x-Linux/checkout/solr/build/solr-core/test-files/solr/'
[junit4:junit4]   2> 1735 T85 oasc.CoreContainer.load Registering Log Listener
[junit4:junit4]   2> 1745 T85 oasc.CoreContainer.create Creating SolrCore 'collection1' using instanceDir: /mnt/ssd/jenkins/workspace/Lucene-Solr-4.x-Linux/checkout/solr/build/solr-core/test-files/solr/collection1
[junit4:junit4]   2> 1745 T85 oasc.SolrResourceLoader.<init> new SolrResourceLoader for directory: '/mnt/ssd/jenkins/workspace/Lucene-Solr-4.x-Linux/checkout/solr/build/solr-core/test-files/solr/collection1/'
[junit4:junit4]   2> 1746 T85 oasc.SolrResourceLoader.replaceClassLoader Adding 'file:/mnt/ssd/jenkins/workspace/Lucene-Solr-4.x-Linux/checkout/solr/build/solr-core/test-files/solr/collection1/lib/README' to classloader
[junit4:junit4]   2> 1746 T85 oasc.SolrResourceLoader.replaceClassLoader Adding 'file:/mnt/ssd/jenkins/workspace/Lucene-Solr-4.x-Linux/checkout/solr/build/solr-core/test-files/solr/collection1/lib/classes/' to classloader
[junit4:junit4]   2> 1793 T85 oasc.SolrConfig.<init> Using Lucene MatchVersion: LUCENE_40
[junit4:junit4]   2> 1823 T85 oasc.SolrConfig.<init> Loaded SolrConfig: solrconfig-elevate.xml
[junit4:junit4]   2> 1823 T85 oass.IndexSchema.readSchema Reading Solr Schema
[junit4:junit4]   2> 1825 T85 oass.IndexSchema.readSchema Schema name=example
[junit4:junit4]   2> 1996 T85 oass.IndexSchema.readSchema default search field in schema is text
[junit4:junit4]   2> 1999 T85 oass.IndexSchema.readSchema unique key field: id
[junit4:junit4]   2> 2003 T85 oasc.SolrCore.<init> [collection1] Opening new SolrCore at /mnt/ssd/jenkins/workspace/Lucene-Solr-4.x-Linux/checkout/solr/build/solr-core/test-files/solr/collection1/, dataDir=./org.apache.solr.handler.component.DistributedQueryElevationComponentTest-1344202329924/shard2/data/
[junit4:junit4]   2> 2004 T85 oasc.JmxMonitoredMap.<init> JMX monitoring is enabled. Adding Solr mbeans to JMX Server: com.sun.jmx.mbeanserver.JmxMBeanServer@13b460f
[junit4:junit4]   2> 2004 T85 oasc.SolrCore.getNewIndexDir WARNING New index directory detected: old=null new=./org.apache.solr.handler.component.DistributedQueryElevationComponentTest-1344202329924/shard2/data/index/
[junit4:junit4]   2> 2005 T85 oasc.SolrCore.initIndex WARNING [collection1] Solr index directory './org.apache.solr.handler.component.DistributedQueryElevationComponentTest-1344202329924/shard2/data/index' doesn't exist. Creating new index...
[junit4:junit4]   2> 2007 T85 oasc.SolrDeletionPolicy.onCommit SolrDeletionPolicy.onCommit: commits:num=1
[junit4:junit4]   2> 		commit{dir=MockDirWrapper(org.apache.lucene.store.RAMDirectory@1b6ed96 lockFactory=org.apache.lucene.store.SingleInstanceLockFactory@1b3f936),segFN=segments_1,generation=1,filenames=[segments_1]
[junit4:junit4]   2> 2007 T85 oasc.SolrDeletionPolicy.updateCommits newest commit = 1
[junit4:junit4]   2> 2008 T85 oasc.RequestHandlers.initHandlersFromConfig created /update: solr.UpdateRequestHandler
[junit4:junit4]   2> 2009 T85 oasc.RequestHandlers.initHandlersFromConfig created /elevate: org.apache.solr.handler.component.SearchHandler
[junit4:junit4]   2> 2009 T85 oasc.RequestHandlers.initHandlersFromConfig created /dataElevate: org.apache.solr.handler.component.SearchHandler
[junit4:junit4]   2> 2010 T85 oashl.XMLLoader.init xsltCacheLifetimeSeconds=60
[junit4:junit4]   2> 2010 T85 oasc.RequestHandlers.initHandlersFromConfig WARNING no default request handler is registered (either '/select' or 'standard')
[junit4:junit4]   2> 2012 T85 oasc.SolrCore.initDeprecatedSupport WARNING solrconfig.xml uses deprecated <admin/gettableFiles>, Please update your config to use the ShowFileRequestHandler.
[junit4:junit4]   2> 2013 T85 oasc.SolrCore.initDeprecatedSupport WARNING adding ShowFileRequestHandler with hidden files: [SCHEMA-LMDIRICHLET.XML, SOLRCONFIG-QUERYSENDER-NOQUERY.XML, SCHEMA-IB.XML, BAD-SCHEMA-OMIT-TF-BUT-NOT-POS.XML, SOLRCONFIG-MASTER1-KEEPONEBACKUP.XML, SCHEMA-BM25.XML, SCHEMA-NUMERIC.XML, KEEP-2.TXT, ADDFIELDS.UPDATEPROCESSOR.JS, SOLRCONFIG-DELPOLICY2.XML, SOLRCONFIG-BASIC-LUCENEVERSION31.XML, STOPWITHBOM.TXT, SCHEMA-SIM.XML, STOPWORDSWRONGENCODING.TXT, SOLRCONFIG_CODEC.XML, SCHEMA-REVERSED.XML, BAD-SOLRCONFIG-MISSING-SCRIPTFILE.XML, SOLRCONFIG-SPELLCHECKCOMPONENT.XML, SCHEMASURROUND.XML, XSLT, PROTWORDS.TXT, BAD-SCHEMA-UNIQUEKEY-USES-DEFAULT.XML, SCHEMA-REQUIRED-FIELDS.XML, STEMDICT.TXT, WDFTYPES.TXT, SOLRCONFIG-NATIVELOCK.XML, SOLRCONFIG-SOLCOREPROPERTIES.XML, SOLRCONFIG-TERMINDEX.XML, BAD-SCHEMA-DUP-FIELD.XML, SOLRCONFIG-TLOG.XML, TRIVIAL.UPDATEPROCESSOR1.JS, SOLRCONFIG-MERGEPOLICY.XML, SOLRCONFIG-REQHANDLER.INCL, SCHEMA15.XML, SOLRCONFIG-UPDATE-PROCESSOR-CHAINS.XML, SOLRCONFIG-ELEVATE.XML, SOLRCONFIG-MASTER.XML, SOLRCONFIG-MASTER3.XML, BAD-SCHEMA-ANALYZER-CLASS-AND-NESTED.XML, SCHEMA-CHARFILTERS.XML, STOP-1.TXT, SCHEMA-REPLICATION2.XML, MISSING.FUNCTIONS.UPDATEPROCESSOR.JS, MAPPING-ISOLATIN1ACCENT.TXT, BAD-SCHEMA-NOT-INDEXED-BUT-POS.XML, SCHEMA-TRIE.XML, BAD-SCHEMA-NOT-INDEXED-BUT-NORMS.XML, BAD-SCHEMA-UNIQUEKEY-IS-COPYFIELD-DEST.XML, TRIVIAL.UPDATEPROCESSOR0.JS, SOLRCONFIG-PROPINJECT-INDEXDEFAULT.XML, SCHEMA-STOP-KEEP.XML, KEEP-1.TXT, SOLRCONFIG-SLAVE1.XML, SCHEMA-COLLATEFILTER.XML, DA_COMPOUNDDICTIONARY.TXT, BAD-SCHEMA-DUP-FIELDTYPE.XML, SOLRCONFIG-HIGHLIGHT.XML, BAD-SCHEMA-CODEC-GLOBAL-VS-FT-MISMATCH.XML, SOLRCONFIG-CACHING.XML, SCHEMA.XML, SOLRCONFIG-XINCLUDE.XML, DA_UTF8.XML, SCHEMA-DFR.XML, STOPTYPES-1.TXT, OLD_SYNONYMS.TXT, SOLRCONFIG-TRANSFORMERS.XML, SOLRCONFIG-ENABLEPLUGIN.XML, BAD-SCHEMA-EXTERNAL-FILEFIELD.XML, SOLRCONFIG-FUNCTIONQUERY.XML, SOLRCONFIG_PERF.XML, PHRASESUGGEST.TXT, BAD-SOLRCONFIG-INVALID-SCRIPTFILE.XML, SOLRCONFIG-DELPOLICY1.XML, SOLRCONFIG-LAZYWRITER.XML, THROW.ERROR.ON.ADD.UPDATEPROCESSOR.JS, HYPHENATION.DTD, BAD-SOLRCONFIG-BOGUS-SCRIPTENGINE-NAME.XML, SCHEMA-REPLICATION1.XML, SOLRCONFIG-SIMPLELOCK.XML, STOPWORDS.TXT, SOLRCONFIG-SLAVE.XML, SOLRCONFIG-SPELLCHECKER.XML, SOLRCONFIG-ALTDIRECTORY.XML, BAD-SCHEMA-NOT-INDEXED-BUT-TF.XML, ELEVATE.XML, HUNSPELL-TEST.AFF, SOLRCONFIG-PHRASESUGGEST.XML, MISSLEADING.EXTENSION.UPDATEPROCESSOR.JS.TXT, CONDITIONAL.UPDATEPROCESSOR.JS, BAD_SOLRCONFIG.XML, SCHEMA11.XML, CURRENCY.XML, COMPOUNDDICTIONARY.TXT, SYNONYMS.TXT, HUNSPELL-TEST.DIC, SOLRCONFIG-REPEATER.XML, BAD-MP-SOLRCONFIG.XML, SOLRCONFIG-MASTER2.XML, SOLRCONFIG-QUERYSENDER.XML, SCHEMA12.XML, BAD-SCHEMA-NONTEXT-ANALYZER.XML, SCHEMA-COLLATE.XML, FRENCHARTICLES.TXT, BAD-SCHEMA-DUP-DYNAMICFIELD.XML, STOP-2.TXT, SCHEMA-TFIDF.XML, SCHEMA-PHRASESUGGEST.XML, SCHEMA-LMJELINEKMERCER.XML, STOP-SNOWBALL.TXT, SOLRCONFIG-PROPINJECT.XML, SCHEMA-COPYFIELD-TEST.XML, SOLRCONFIG-SOLR-749.XML, SOLRCONFIG-SCRIPT-UPDATEPROCESSOR.XML, BAD-SCHEMA-SIM-GLOBAL-VS-FT-MISMATCH.XML, SOLRCONFIG-BASIC.XML, SCHEMA_CODEC.XML, OPEN-EXCHANGE-RATES.JSON, BAD-SCHEMA-UNIQUEKEY-MULTIVALUED.XML, SCHEMA-MINIMAL.XML, SCHEMA-SPELLCHECKER.XML, SCHEMA-BINARYFIELD.XML, STOPTYPES-2.TXT, SCHEMA-LUCENEMATCHVERSION.XML, SCHEMA-FOLDING.XML, SCHEMA-NOT-REQUIRED-UNIQUE-KEY.XML, SOLRCONFIG-MASTER1.XML, SOLRCONFIG-NOCACHE.XML]
[junit4:junit4]   2> 2016 T85 oass.SolrIndexSearcher.<init> Opening Searcher@1ccba09 main
[junit4:junit4]   2> 2016 T85 oass.SolrIndexSearcher.getIndexDir WARNING WARNING: Directory impl does not support setting indexDir: org.apache.lucene.store.MockDirectoryWrapper
[junit4:junit4]   2> 2017 T85 oasu.CommitTracker.<init> Hard AutoCommit: disabled
[junit4:junit4]   2> 2017 T85 oasu.CommitTracker.<init> Soft AutoCommit: disabled
[junit4:junit4]   2> 2018 T85 oashc.QueryElevationComponent.inform Loading QueryElevation from: /mnt/ssd/jenkins/workspace/Lucene-Solr-4.x-Linux/checkout/solr/build/solr-core/test-files/solr/collection1/conf/elevate.xml
[junit4:junit4]   2> 2027 T85 oashc.QueryElevationComponent.inform Loading QueryElevation from: /mnt/ssd/jenkins/workspace/Lucene-Solr-4.x-Linux/checkout/solr/build/solr-core/test-files/solr/collection1/conf/elevate.xml
[junit4:junit4]   2> 2035 T85 oashc.HttpShardHandlerFactory.getParameter Setting socketTimeout to: 0
[junit4:junit4]   2> 2036 T85 oashc.HttpShardHandlerFactory.getParameter Setting urlScheme to: http://
[junit4:junit4]   2> 2036 T85 oashc.HttpShardHandlerFactory.getParameter Setting connTimeout to: 0
[junit4:junit4]   2> 2037 T85 oashc.HttpShardHandlerFactory.getParameter Setting maxConnectionsPerHost to: 20
[junit4:junit4]   2> 2037 T85 oashc.HttpShardHandlerFactory.getParameter Setting corePoolSize to: 0
[junit4:junit4]   2> 2037 T85 oashc.HttpShardHandlerFactory.getParameter Setting maximumPoolSize to: 2147483647
[junit4:junit4]   2> 2038 T85 oashc.HttpShardHandlerFactory.getParameter Setting maxThreadIdleTime to: 5
[junit4:junit4]   2> 2038 T85 oashc.HttpShardHandlerFactory.getParameter Setting sizeOfQueue to: -1
[junit4:junit4]   2> 2038 T85 oashc.HttpShardHandlerFactory.getParameter Setting fairnessPolicy to: false
[junit4:junit4]   2> 2039 T85 oascsi.HttpClientUtil.createClient Creating new http client, config:maxConnectionsPerHost=20&maxConnections=10000&socketTimeout=0&connTimeout=0&retry=false
[junit4:junit4]   2> 2043 T126 oasc.SolrCore.registerSearcher [collection1] Registered new searcher Searcher@1ccba09 main{StandardDirectoryReader(segments_1:1)}
[junit4:junit4]   2> 2043 T85 oasc.CoreContainer.register registering core: collection1
[junit4:junit4]   2> 2043 T85 oass.SolrDispatchFilter.init user.dir=/mnt/ssd/jenkins/workspace/Lucene-Solr-4.x-Linux/checkout/solr/build/solr-core/test/J0
[junit4:junit4]   2> 2044 T85 oass.SolrDispatchFilter.init SolrDispatchFilter.init() done
[junit4:junit4]   2> 2044 T85 oascsi.HttpClientUtil.createClient Creating new http client, config:maxConnections=128&maxConnectionsPerHost=32&followRedirects=false
[junit4:junit4]   2> ASYNC  NEW_CORE C15 name=collection1 org.apache.solr.core.SolrCore@c3da5f
[junit4:junit4]   2> 2189 T89 C15 oasu.DirectUpdateHandler2.deleteAll [collection1] REMOVING ALL DOCUMENTS FROM INDEX
[junit4:junit4]   2> 2191 T89 C15 oasc.SolrDeletionPolicy.onInit SolrDeletionPolicy.onInit: commits:num=1
[junit4:junit4]   2> 		commit{dir=BaseDirectoryWrapper(org.apache.lucene.store.RAMDirectory@16a0cb3 lockFactory=org.apache.lucene.store.SingleInstanceLockFactory@167fc18),segFN=segments_1,generation=1,filenames=[segments_1]
[junit4:junit4]   2> 2191 T89 C15 oasc.SolrDeletionPolicy.updateCommits newest commit = 1
[junit4:junit4]   2> 2192 T89 C15 UPDATE [collection1] webapp=/solr path=/update params={wt=javabin&version=2} {deleteByQuery=*:*} 0 10
[junit4:junit4]   2> ASYNC  NEW_CORE C16 name=collection1 org.apache.solr.core.SolrCore@85a96d
[junit4:junit4]   2> 2219 T99 C16 oasu.DirectUpdateHandler2.deleteAll [collection1] REMOVING ALL DOCUMENTS FROM INDEX
[junit4:junit4]   2> 2220 T99 C16 oasc.SolrDeletionPolicy.onInit SolrDeletionPolicy.onInit: commits:num=1
[junit4:junit4]   2> 		commit{dir=MockDirWrapper(org.apache.lucene.store.RAMDirectory@1365c67 lockFactory=org.apache.lucene.store.SingleInstanceLockFactory@e4a44b),segFN=segments_1,generation=1,filenames=[segments_1]
[junit4:junit4]   2> 2221 T99 C16 oasc.SolrDeletionPolicy.updateCommits newest commit = 1
[junit4:junit4]   2> 2221 T99 C16 UPDATE [collection1] webapp=/solr path=/update params={wt=javabin&version=2} {deleteByQuery=*:*} 0 3
[junit4:junit4]   2> ASYNC  NEW_CORE C17 name=collection1 org.apache.solr.core.SolrCore@675a11
[junit4:junit4]   2> 2228 T109 C17 oasu.DirectUpdateHandler2.deleteAll [collection1] REMOVING ALL DOCUMENTS FROM INDEX
[junit4:junit4]   2> 2229 T109 C17 oasc.SolrDeletionPolicy.onInit SolrDeletionPolicy.onInit: commits:num=1
[junit4:junit4]   2> 		commit{dir=MockDirWrapper(org.apache.lucene.store.RAMDirectory@1ad91db lockFactory=org.apache.lucene.store.SingleInstanceLockFactory@4fb6e1),segFN=segments_1,generation=1,filenames=[segments_1]
[junit4:junit4]   2> 2230 T109 C17 oasc.SolrDeletionPolicy.updateCommits newest commit = 1
[junit4:junit4]   2> 2230 T109 C17 UPDATE [collection1] webapp=/solr path=/update params={wt=javabin&version=2} {deleteByQuery=*:*} 0 3
[junit4:junit4]   2> ASYNC  NEW_CORE C18 name=collection1 org.apache.solr.core.SolrCore@1c938e7
[junit4:junit4]   2> 2246 T119 C18 oasu.DirectUpdateHandler2.deleteAll [collection1] REMOVING ALL DOCUMENTS FROM INDEX
[junit4:junit4]   2> 2247 T119 C18 oasc.SolrDeletionPolicy.onInit SolrDeletionPolicy.onInit: commits:num=1
[junit4:junit4]   2> 		commit{dir=MockDirWrapper(org.apache.lucene.store.RAMDirectory@1b6ed96 lockFactory=org.apache.lucene.store.SingleInstanceLockFactory@1b3f936),segFN=segments_1,generation=1,filenames=[segments_1]
[junit4:junit4]   2> 2247 T119 C18 oasc.SolrDeletionPolicy.updateCommits newest commit = 1
[junit4:junit4]   2> 2248 T119 C18 UPDATE [collection1] webapp=/solr path=/update params={wt=javabin&version=2} {deleteByQuery=*:*} 0 2
[junit4:junit4]   2> 2256 T89 C15 UPDATE [collection1] webapp=/solr path=/update params={wt=javabin&version=2} {add=[1]} 0 5
[junit4:junit4]   2> 2261 T99 C16 UPDATE [collection1] webapp=/solr path=/update params={wt=javabin&version=2} {add=[1]} 0 2
[junit4:junit4]   2> 2265 T89 C15 UPDATE [collection1] webapp=/solr path=/update params={wt=javabin&version=2} {add=[2]} 0 1
[junit4:junit4]   2> 2270 T109 C17 UPDATE [collection1] webapp=/solr path=/update params={wt=javabin&version=2} {add=[2]} 0 2
[junit4:junit4]   2> 2273 T89 C15 UPDATE [collection1] webapp=/solr path=/update params={wt=javabin&version=2} {add=[3]} 0 0
[junit4:junit4]   2> 2277 T119 C18 UPDATE [collection1] webapp=/solr path=/update params={wt=javabin&version=2} {add=[3]} 0 1
[junit4:junit4]   2> 2281 T89 C15 UPDATE [collection1] webapp=/solr path=/update params={wt=javabin&version=2} {add=[4]} 0 0
[junit4:junit4]   2> 2285 T99 C16 UPDATE [collection1] webapp=/solr path=/update params={wt=javabin&version=2} {add=[4]} 0 1
[junit4:junit4]   2> 2288 T89 C15 UPDATE [collection1] webapp=/solr path=/update params={wt=javabin&version=2} {add=[5]} 0 0
[junit4:junit4]   2> 2292 T109 C17 UPDATE [collection1] webapp=/solr path=/update params={wt=javabin&version=2} {add=[5]} 0 1
[junit4:junit4]   2> 2296 T89 C15 UPDATE [collection1] webapp=/solr path=/update params={wt=javabin&version=2} {add=[6]} 0 1
[junit4:junit4]   2> 2300 T119 C18 UPDATE [collection1] webapp=/solr path=/update params={wt=javabin&version=2} {add=[6]} 0 1
[junit4:junit4]   2> 2303 T89 C15 UPDATE [collection1] webapp=/solr path=/update params={wt=javabin&version=2} {add=[7]} 0 0
[junit4:junit4]   2> 2307 T119 C18 UPDATE [collection1] webapp=/solr path=/update params={wt=javabin&version=2} {add=[7]} 0 1
[junit4:junit4]   2> 2315 T89 C15 oasu.DirectUpdateHandler2.commit start commit{flags=0,_version_=0,optimize=false,openSearcher=true,waitSearcher=true,expungeDeletes=false,softCommit=false}
[junit4:junit4]   2> 2317 T89 C15 oasc.SolrDeletionPolicy.onCommit SolrDeletionPolicy.onCommit: commits:num=2
[junit4:junit4]   2> 		commit{dir=BaseDirectoryWrapper(org.apache.lucene.store.RAMDirectory@16a0cb3 lockFactory=org.apache.lucene.store.SingleInstanceLockFactory@167fc18),segFN=segments_1,generation=1,filenames=[segments_1]
[junit4:junit4]   2> 		commit{dir=BaseDirectoryWrapper(org.apache.lucene.store.RAMDirectory@16a0cb3 lockFactory=org.apache.lucene.store.SingleInstanceLockFactory@167fc18),segFN=segments_2,generation=2,filenames=[_0_2.len, _0.fld, _0_4.len, _0_3.len, _0.pst, _0.si, _0.inf, segments_2]
[junit4:junit4]   2> 2318 T89 C15 oasc.SolrDeletionPolicy.updateCommits newest commit = 2
[junit4:junit4]   2> 2321 T89 C15 oass.SolrIndexSearcher.<init> Opening Searcher@d8dd8a main
[junit4:junit4]   2> 2321 T89 C15 oass.SolrIndexSearcher.getIndexDir WARNING WARNING: Directory impl does not support setting indexDir: org.apache.lucene.store.BaseDirectoryWrapper
[junit4:junit4]   2> 2322 T89 C15 oasu.DirectUpdateHandler2.commit end_commit_flush
[junit4:junit4]   2> 2323 T96 oasc.SolrCore.registerSearcher [collection1] Registered new searcher Searcher@d8dd8a main{StandardDirectoryReader(segments_2:4 _0(4.0.0.1):C7)}
[junit4:junit4]   2> 2323 T89 C15 UPDATE [collection1] webapp=/solr path=/update params={wt=javabin&version=2&commit=true&waitSearcher=true&softCommit=false} {commit=} 0 8
[junit4:junit4]   2> 2326 T99 C16 oasu.DirectUpdateHandler2.commit start commit{flags=0,_version_=0,optimize=false,openSearcher=true,waitSearcher=true,expungeDeletes=false,softCommit=false}
[junit4:junit4]   2> 2327 T99 C16 oasc.SolrDeletionPolicy.onCommit SolrDeletionPolicy.onCommit: commits:num=2
[junit4:junit4]   2> 		commit{dir=MockDirWrapper(org.apache.lucene.store.RAMDirectory@1365c67 lockFactory=org.apache.lucene.store.SingleInstanceLockFactory@e4a44b),segFN=segments_1,generation=1,filenames=[segments_1]
[junit4:junit4]   2> 		commit{dir=MockDirWrapper(org.apache.lucene.store.RAMDirectory@1365c67 lockFactory=org.apache.lucene.store.SingleInstanceLockFactory@e4a44b),segFN=segments_2,generation=2,filenames=[_0_2.len, _0.fld, _0_3.len, _0.pst, _0.si, _0.inf, segments_2]
[junit4:junit4]   2> 2327 T99 C16 oasc.SolrDeletionPolicy.updateCommits newest commit = 2
[junit4:junit4]   2> 2328 T99 C16 oass.SolrIndexSearcher.<init> Opening Searcher@1287ceb main
[junit4:junit4]   2> 2328 T99 C16 oass.SolrIndexSearcher.getIndexDir WARNING WARNING: Directory impl does not support setting indexDir: org.apache.lucene.store.MockDirectoryWrapper
[junit4:junit4]   2> 2328 T99 C16 oasu.DirectUpdateHandler2.commit end_commit_flush
[junit4:junit4]   2> 2329 T106 oasc.SolrCore.registerSearcher [collection1] Registered new searcher Searcher@1287ceb main{StandardDirectoryReader(segments_2:4 _0(4.0.0.1):C2)}
[junit4:junit4]   2> 2339 T99 C16 UPDATE [collection1] webapp=/solr path=/update params={wt=javabin&version=2&commit=true&waitSearcher=true&softCommit=false} {commit=} 0 14
[junit4:junit4]   2> 2342 T109 C17 oasu.DirectUpdateHandler2.commit start commit{flags=0,_version_=0,optimize=false,openSearcher=true,waitSearcher=true,expungeDeletes=false,softCommit=false}
[junit4:junit4]   2> 2344 T109 C17 oasc.SolrDeletionPolicy.onCommit SolrDeletionPolicy.onCommit: commits:num=2
[junit4:junit4]   2> 		commit{dir=MockDirWrapper(org.apache.lucene.store.RAMDirectory@1ad91db lockFactory=org.apache.lucene.store.SingleInstanceLockFactory@4fb6e1),segFN=segments_1,generation=1,filenames=[segments_1]
[junit4:junit4]   2> 		commit{dir=MockDirWrapper(org.apache.lucene.store.RAMDirectory@1ad91db lockFactory=org.apache.lucene.store.SingleInstanceLockFactory@4fb6e1),segFN=segments_2,generation=2,filenames=[_0_2.len, _0.fld, _0_3.len, _0.pst, _0.si, _0.inf, segments_2]
[junit4:junit4]   2> 2344 T109 C17 oasc.SolrDeletionPolicy.updateCommits newest commit = 2
[junit4:junit4]   2> 2345 T109 C17 oass.SolrIndexSearcher.<init> Opening Searcher@1ff5468 main
[junit4:junit4]   2> 2346 T109 C17 oass.SolrIndexSearcher.getIndexDir WARNING WARNING: Directory impl does not support setting indexDir: org.apache.lucene.store.MockDirectoryWrapper
[junit4:junit4]   2> 2346 T109 C17 oasu.DirectUpdateHandler2.commit end_commit_flush
[junit4:junit4]   2> 2347 T116 oasc.SolrCore.registerSearcher [collection1] Registered new searcher Searcher@1ff5468 main{StandardDirectoryReader(segments_2:4 _0(4.0.0.1):C2)}
[junit4:junit4]   2> 2347 T109 C17 UPDATE [collection1] webapp=/solr path=/update params={wt=javabin&version=2&commit=true&waitSearcher=true&softCommit=false} {commit=} 0 5
[junit4:junit4]   2> 2350 T119 C18 oasu.DirectUpdateHandler2.commit start commit{flags=0,_version_=0,optimize=false,openSearcher=true,waitSearcher=true,expungeDeletes=false,softCommit=false}
[junit4:junit4]   2> 2354 T119 C18 oasc.SolrDeletionPolicy.onCommit SolrDeletionPolicy.onCommit: commits:num=2
[junit4:junit4]   2> 		commit{dir=MockDirWrapper(org.apache.lucene.store.RAMDirectory@1b6ed96 lockFactory=org.apache.lucene.store.SingleInstanceLockFactory@1b3f936),segFN=segments_1,generation=1,filenames=[segments_1]
[junit4:junit4]   2> 		commit{dir=MockDirWrapper(org.apache.lucene.store.RAMDirectory@1b6ed96 lockFactory=org.apache.lucene.store.SingleInstanceLockFactory@1b3f936),segFN=segments_2,generation=2,filenames=[_0_2.len, _0.fld, _0.pst, _0.si, _0.inf, segments_2]
[junit4:junit4]   2> 2354 T119 C18 oasc.SolrDeletionPolicy.updateCommits newest commit = 2
[junit4:junit4]   2> 2355 T119 C18 oass.SolrIndexSearcher.<init> Opening Searcher@609d49 main
[junit4:junit4]   2> 2355 T119 C18 oass.SolrIndexSearcher.getIndexDir WARNING WARNING: Directory impl does not support setting indexDir: org.apache.lucene.store.MockDirectoryWrapper
[junit4:junit4]   2> 2356 T119 C18 oasu.DirectUpdateHandler2.commit end_commit_flush
[junit4:junit4]   2> 2356 T126 oasc.SolrCore.registerSearcher [collection1] Registered new searcher Searcher@609d49 main{StandardDirectoryReader(segments_2:4 _0(4.0.0.1):C3)}
[junit4:junit4]   2> 2357 T119 C18 UPDATE [collection1] webapp=/solr path=/update params={wt=javabin&version=2&commit=true&waitSearcher=true&softCommit=false} {commit=} 0 7
[junit4:junit4]   2> 2379 T89 C15 REQ [collection1] webapp=/solr path=/elevate params={qt=/elevate&shards.qt=/elevate&sort=id+desc&q=*:*&rows=500&wt=javabin&version=2&fl=id,+score,+[elevated]&distrib=false} hits=7 status=0 QTime=14 
[junit4:junit4]   2> 2405 T120 C18 REQ [collection1] webapp=/solr path=/elevate params={qt=/elevate&NOW=1344202332304&fsv=true&version=2&fl=id,score&shard.url=[::1]:33332/solr|localhost:47527/solr&shards.qt=/elevate&sort=id+desc&isShard=true&q=*:*&rows=500&start=0&wt=javabin&distrib=false} hits=3 status=0 QTime=1 
[junit4:junit4]   2> 2405 T110 C17 REQ [collection1] webapp=/solr path=/elevate params={qt=/elevate&NOW=1344202332304&fsv=true&version=2&fl=id,score&shard.url=localhost:51357/solr&shards.qt=/elevate&sort=id+desc&isShard=true&q=*:*&rows=500&start=0&wt=javabin&distrib=false} hits=2 status=0 QTime=1 
[junit4:junit4]   2> 2410 T100 C16 REQ [collection1] webapp=/solr path=/elevate params={qt=/elevate&NOW=1344202332304&fsv=true&version=2&fl=id,score&shard.url=[::1]:33332/solr|localhost:47631/solr&shards.qt=/elevate&sort=id+desc&isShard=true&q=*:*&rows=500&start=0&wt=javabin&distrib=false} hits=2 status=0 QTime=1 
[junit4:junit4]   2> 2419 T110 C17 REQ [collection1] webapp=/solr path=/elevate params={qt=/elevate&ids=5.0,2.0&NOW=1344202332304&version=2&fl=id,+score,+[elevated]&shard.url=localhost:51357/solr&shards.qt=/elevate&isShard=true&q=*:*&rows=500&wt=javabin&distrib=false} status=0 QTime=0 
[junit4:junit4]   2> 2419 T120 C18 REQ [collection1] webapp=/solr path=/elevate params={qt=/elevate&ids=7.0,3.0,6.0&NOW=1344202332304&version=2&fl=id,+score,+[elevated]&shard.url=[::1]:33332/solr|localhost:47527/solr&shards.qt=/elevate&isShard=true&q=*:*&rows=500&wt=javabin&distrib=false} status=0 QTime=1 
[junit4:junit4]   2> 2421 T100 C16 REQ [collection1] webapp=/solr path=/elevate params={qt=/elevate&ids=1.0,4.0&NOW=1344202332304&version=2&fl=id,+score,+[elevated]&shard.url=[::1]:33332/solr|localhost:47631/solr&shards.qt=/elevate&isShard=true&q=*:*&rows=500&wt=javabin&distrib=false} status=0 QTime=1 
[junit4:junit4]   2> 2422 T119 C18 REQ [collection1] webapp=/solr path=/elevate params={qt=/elevate&shards.qt=/elevate&sort=id+desc&q=*:*&rows=500&shards=[::1]:33332/solr|localhost:47631/solr,localhost:51357/solr,[::1]:33332/solr|localhost:47527/solr&wt=javabin&version=2&fl=id,+score,+[elevated]} status=0 QTime=39 
[junit4:junit4]   2> 2424 T85 oas.BaseDistributedSearchTestCase.compareResponses SEVERE Mismatched responses:
[junit4:junit4]   2> 	{responseHeader={status=0,QTime=39,params={qt=/elevate,shards.qt=/elevate,sort=id desc,q=*:*,rows=500,shards=[::1]:33332/solr|localhost:47631/solr,localhost:51357/solr,[::1]:33332/solr|localhost:47527/solr,wt=javabin,version=2,fl=id, score, [elevated]}},response={numFound=7,start=0,maxScore=1.0,docs=[SolrDocument{id=7.0, [elevated]=false, score=1.0}, SolrDocument{id=6.0, [elevated]=false, score=1.0}, SolrDocument{id=5.0, [elevated]=false, score=1.0}, SolrDocument{id=4.0, [elevated]=false, score=1.0}, SolrDocument{id=3.0, [elevated]=false, score=1.0}, SolrDocument{id=2.0, [elevated]=false, score=1.0}, SolrDocument{id=1.0, [elevated]=false, score=1.0}]}}
[junit4:junit4]   2> 	{responseHeader={status=0,QTime=14,params={qt=/elevate,shards.qt=/elevate,sort=id desc,q=*:*,rows=500,wt=javabin,version=2,fl=id, score, [elevated],distrib=false}},response={numFound=7,start=0,maxScore=1.0,docs=[SolrDocument{id=7.0, score=1.0, [elevated]=false}, SolrDocument{id=6.0, score=1.0, [elevated]=false}, SolrDocument{id=5.0, score=1.0, [elevated]=false}, SolrDocument{id=4.0, score=1.0, [elevated]=false}, SolrDocument{id=3.0, score=1.0, [elevated]=false}, SolrDocument{id=2.0, score=1.0, [elevated]=false}, SolrDocument{id=1.0, score=1.0, [elevated]=false}]}}
[junit4:junit4]   2> 2428 T85 oasc.CoreContainer.shutdown Shutting down CoreContainer instance=30934411
[junit4:junit4]   2> 2429 T85 oasc.SolrCore.close [collection1]  CLOSING SolrCore org.apache.solr.core.SolrCore@c3da5f
[junit4:junit4]   2> 2430 T85 oasc.SolrCore.closeSearcher [collection1] Closing main searcher on request.
[junit4:junit4]   2> 2430 T85 oasu.DirectUpdateHandler2.close closing DirectUpdateHandler2{commits=1,autocommits=0,soft autocommits=0,optimizes=0,rollbacks=0,expungeDeletes=0,docsPending=0,adds=0,deletesById=0,deletesByQuery=0,errors=0,cumulative_adds=7,cumulative_deletesById=0,cumulative_deletesByQuery=1,cumulative_errors=0}
[junit4:junit4]   2> 2438 T85 oejsh.ContextHandler.doStop stopped o.e.j.s.ServletContextHandler{/solr,null}
[junit4:junit4]   2> 2491 T85 oasc.CoreContainer.shutdown Shutting down CoreContainer instance=8044399
[junit4:junit4]   2> 2492 T85 oasc.SolrCore.close [collection1]  CLOSING SolrCore org.apache.solr.core.SolrCore@85a96d
[junit4:junit4]   2> 2493 T85 oasc.SolrCore.closeSearcher [collection1] Closing main searcher on request.
[junit4:junit4]   2> 2493 T85 oasu.DirectUpdateHandler2.close closing DirectUpdateHandler2{commits=1,autocommits=0,soft autocommits=0,optimizes=0,rollbacks=0,expungeDeletes=0,docsPending=0,adds=0,deletesById=0,deletesByQuery=0,errors=0,cumulative_adds=2,cumulative_deletesById=0,cumulative_deletesByQuery=1,cumulative_errors=0}
[junit4:junit4]   2> 2496 T85 oejsh.ContextHandler.doStop stopped o.e.j.s.ServletContextHandler{/solr,null}
[junit4:junit4]   2> 2550 T85 oasc.CoreContainer.shutdown Shutting down CoreContainer instance=3681272
[junit4:junit4]   2> 2550 T85 oasc.SolrCore.close [collection1]  CLOSING SolrCore org.apache.solr.core.SolrCore@675a11
[junit4:junit4]   2> 2551 T85 oasc.SolrCore.closeSearcher [collection1] Closing main searcher on request.
[junit4:junit4]   2> 2551 T85 oasu.DirectUpdateHandler2.close closing DirectUpdateHandler2{commits=1,autocommits=0,soft autocommits=0,optimizes=0,rollbacks=0,expungeDeletes=0,docsPending=0,adds=0,deletesById=0,deletesByQuery=0,errors=0,cumulative_adds=2,cumulative_deletesById=0,cumulative_deletesByQuery=1,cumulative_errors=0}
[junit4:junit4]   2> 2560 T85 oejsh.ContextHandler.doStop stopped o.e.j.s.ServletContextHandler{/solr,null}
[junit4:junit4]   2> 2623 T85 oasc.CoreContainer.shutdown Shutting down CoreContainer instance=10788506
[junit4:junit4]   2> 2623 T85 oasc.SolrCore.close [collection1]  CLOSING SolrCore org.apache.solr.core.SolrCore@1c938e7
[junit4:junit4]   2> 2624 T85 oasc.SolrCore.closeSearcher [collection1] Closing main searcher on request.
[junit4:junit4]   2> 2624 T85 oasu.DirectUpdateHandler2.close closing DirectUpdateHandler2{commits=1,autocommits=0,soft autocommits=0,optimizes=0,rollbacks=0,expungeDeletes=0,docsPending=0,adds=0,deletesById=0,deletesByQuery=0,errors=0,cumulative_adds=3,cumulative_deletesById=0,cumulative_deletesByQuery=1,cumulative_errors=0}
[junit4:junit4]   2> 2629 T85 oejsh.ContextHandler.doStop stopped o.e.j.s.ServletContextHandler{/solr,null}
[junit4:junit4]   2> 2680 T85 oas.SolrTestCaseJ4.tearDown ###Ending testDistribSearch
[junit4:junit4]   2> NOTE: reproduce with: ant test  -Dtestcase=DistributedQueryElevationComponentTest -Dtests.method=testDistribSearch -Dtests.seed=51999E58853D9D51 -Dtests.multiplier=3 -Dtests.slow=true -Dtests.locale=ar_DZ -Dtests.timezone=Pacific/Tahiti -Dtests.file.encoding=US-ASCII
[junit4:junit4]   2>
[junit4:junit4]    > (@AfterClass output)
[junit4:junit4]   2> 2726 T85 oas.SolrTestCaseJ4.deleteCore ###deleteCore
[junit4:junit4]   2> NOTE: test params are: codec=SimpleText, sim=RandomSimilarityProvider(queryNorm=false,coord=false): {}, locale=ar_DZ, timezone=Pacific/Tahiti
[junit4:junit4]   2> NOTE: Linux 3.2.0-27-generic i386/Oracle Corporation 1.8.0-ea (32-bit)/cpus=8,threads=1,free=75448904,total=150994944
[junit4:junit4]   2> NOTE: All tests run in this JVM: [PluginInfoTest, ZkCLITest, IndexBasedSpellCheckerTest, SoftAutoCommitTest, QueryElevationComponentTest, LegacyHTMLStripCharFilterTest, MinimalSchemaTest, SuggesterTest, MoreLikeThisHandlerTest, DistributedQueryElevationComponentTest]
[junit4:junit4]   2> 
[junit4:junit4] Completed on J0 in 2.75s, 1 test, 1 failure <<< FAILURES!

[...truncated 637 lines...]
BUILD FAILED
/mnt/ssd/jenkins/workspace/Lucene-Solr-4.x-Linux/checkout/build.xml:29: The following error occurred while executing this line:
/mnt/ssd/jenkins/workspace/Lucene-Solr-4.x-Linux/checkout/solr/build.xml:144: The following error occurred while executing this line:
/mnt/ssd/jenkins/workspace/Lucene-Solr-4.x-Linux/checkout/lucene/module-build.xml:62: The following error occurred while executing this line:
/mnt/ssd/jenkins/workspace/Lucene-Solr-4.x-Linux/checkout/lucene/common-build.xml:1095: The following error occurred while executing this line:
/mnt/ssd/jenkins/workspace/Lucene-Solr-4.x-Linux/checkout/lucene/common-build.xml:790: There were test failures: 224 suites, 902 tests, 1 failure, 5 ignored

Total time: 22 minutes 3 seconds
Build step 'Execute shell' marked build as failure
Archiving artifacts
Recording test results
Email was triggered for: Failure
Sending email for trigger: Failure



Mime
View raw message