lucene-dev mailing list archives

Site index · List index
Message view « Date » · « Thread »
Top « Date » · « Thread »
From buil...@flonkings.com
Subject Build failed in Jenkins: Lucene-trunk-Linux-Java7-64 #111
Date Thu, 09 Aug 2012 00:42:05 GMT
See <builds.flonkings.com/job/Lucene-trunk-Linux-Java7-64/111/changes>

Changes:

[Robert Muir] LUCENE-4297: BooleanScorer2 sometimes multiplies coord() twice into the score

[Robert Muir] harden test against internet problems

[sarowe] fix doc bugs (thanks to Oren Bochman)

[Robert Muir] turn on nightly-smoke task

[Robert Muir] LUCENE-4295: add task to build and smoke-test a release for the nightly build

[sarowe] LUCENE-4296: Update/clean up Maven POMs and documentation

[sarowe] Mention ReusableAnalyzerBase -> Analyzer

[markrmiller] fix comment

[markrmiller] SOLR-3579: SolrCloud view should default to the graph view rather than tree
view.

[markrmiller] cancel recovery before trying to sync as new leader - also improve logging

[yonik] SOLR-3685: cloud sometimes skipped peersync attempt due to flags not being cleared
when no updates were buffered during replication

[Robert Muir] rename confusing variables: numDocs is really docFreq, docFreqs is really termFreqs,
termDocFreq is termFreq

[yonik] SOLR-3685: cloud sometimes skipped peersync attempt due to flags not being cleared
when no updates were buffered during replication

[Robert Muir] add test for when fixed dv is not really fixed length

------------------------------------------
[...truncated 73598 lines...]
check-memory-uptodate:

jar-memory:

check-misc-uptodate:

jar-misc:

check-spatial-uptodate:

jar-spatial:

check-grouping-uptodate:

jar-grouping:

check-queries-uptodate:

jar-queries:

check-queryparser-uptodate:

jar-queryparser:

prep-lucene-jars:

resolve-example:

resolve:

common.init:

compile-lucene-core:

jflex-uptodate-check:

jflex-notice:

javacc-uptodate-check:

javacc-notice:

ivy-availability-check:

ivy-fail:

ivy-configure:
[ivy:configure] :: loading settings :: file = <builds.flonkings.com/job/Lucene-trunk-Linux-Java7-64/ws/checkout/lucene/ivy-settings.xml>

resolve:

init:

-clover.disable:

-clover.setup:

clover:

common.compile-core:

compile-core:

init:

-clover.disable:

-clover.setup:

clover:

common.compile-core:

common-solr.compile-core:

compile-core:

jar-core:
      [jar] Building jar: <builds.flonkings.com/job/Lucene-trunk-Linux-Java7-64/ws/checkout/solr/build/contrib/solr-velocity/apache-solr-velocity-5.0.jar>

jar-src:
      [jar] Building jar: <builds.flonkings.com/job/Lucene-trunk-Linux-Java7-64/ws/checkout/solr/build/contrib/solr-velocity/apache-solr-velocity-5.0-src.jar>

define-lucene-javadoc-url-SNAPSHOT:

define-lucene-javadoc-url-release:

define-lucene-javadoc-url:

check-lucene-core-javadocs-uptodate:

javadocs-lucene-core:

check-analyzers-common-javadocs-uptodate:

javadocs-analyzers-common:

check-analyzers-icu-javadocs-uptodate:

javadocs-analyzers-icu:

check-analyzers-kuromoji-javadocs-uptodate:

javadocs-analyzers-kuromoji:

check-analyzers-phonetic-javadocs-uptodate:

javadocs-analyzers-phonetic:

check-analyzers-smartcn-javadocs-uptodate:

javadocs-analyzers-smartcn:

check-analyzers-morfologik-javadocs-uptodate:

javadocs-analyzers-morfologik:

check-analyzers-stempel-javadocs-uptodate:

javadocs-analyzers-stempel:

check-analyzers-uima-javadocs-uptodate:

javadocs-analyzers-uima:

check-suggest-javadocs-uptodate:

javadocs-suggest:

check-grouping-javadocs-uptodate:

javadocs-grouping:

check-queries-javadocs-uptodate:

javadocs-queries:

check-queryparser-javadocs-uptodate:

javadocs-queryparser:

check-highlighter-javadocs-uptodate:

javadocs-highlighter:

check-memory-javadocs-uptodate:

javadocs-memory:

check-misc-javadocs-uptodate:

javadocs-misc:

check-spatial-javadocs-uptodate:

javadocs-spatial:

lucene-javadocs:

javadocs:
    [mkdir] Created dir: <builds.flonkings.com/job/Lucene-trunk-Linux-Java7-64/ws/checkout/solr/build/contrib/solr-velocity/docs/api>
     [echo] Building solr-velocity...

download-java6-javadoc-packagelist:
     [copy] Copying 1 file to <builds.flonkings.com/job/Lucene-trunk-Linux-Java7-64/ws/checkout/solr/build/contrib/solr-velocity/docs/api>
  [javadoc] Generating Javadoc
  [javadoc] Javadoc execution
  [javadoc] Loading source files for package org.apache.solr.response...
  [javadoc] Constructing Javadoc information...
  [javadoc] Standard Doclet version 1.7.0_05
  [javadoc] Building tree for all the packages and classes...
  [javadoc] Building index for all the packages and classes...
  [javadoc] Building index for all classes...
  [javadoc] Generating <builds.flonkings.com/job/Lucene-trunk-Linux-Java7-64/ws/checkout/solr/build/contrib/solr-velocity/docs/api/help-doc.html...>
  [javadoc] Note: Custom tags that were not seen:  @lucene.internal, @lucene.experimental
      [jar] Building jar: <builds.flonkings.com/job/Lucene-trunk-Linux-Java7-64/ws/checkout/solr/build/contrib/solr-velocity/apache-solr-velocity-5.0-javadoc.jar>

dist-maven-common:
[artifact:install-provider] Installing provider: org.apache.maven.wagon:wagon-ssh:jar:1.0-beta-7:runtime
[artifact:deploy] Deploying to file://<builds.flonkings.com/job/Lucene-trunk-Linux-Java7-64/ws/checkout/solr/package/maven>
[artifact:deploy] Uploading: org/apache/solr/solr-velocity/5.0/solr-velocity-5.0.jar to repository
${m2.repository.id} at file://<builds.flonkings.com/job/Lucene-trunk-Linux-Java7-64/ws/checkout/solr/package/maven>
[artifact:deploy] Transferring 22K from ${m2.repository.id}
[artifact:deploy] Uploaded 22K
[artifact:deploy] [INFO] Retrieving previous metadata from ${m2.repository.id}
[artifact:deploy] [INFO] repository metadata for: 'artifact org.apache.solr:solr-velocity'
could not be found on repository: ${m2.repository.id}, so will be created
[artifact:deploy] [INFO] Uploading repository metadata for: 'artifact org.apache.solr:solr-velocity'
[artifact:deploy] [INFO] Uploading project information for solr-velocity 5.0
[artifact:deploy] Uploading: org/apache/solr/solr-velocity/5.0/solr-velocity-5.0-sources.jar
to repository ${m2.repository.id} at file://<builds.flonkings.com/job/Lucene-trunk-Linux-Java7-64/ws/checkout/solr/package/maven>
[artifact:deploy] Transferring 20K from ${m2.repository.id}
[artifact:deploy] Uploaded 20K
[artifact:deploy] Uploading: org/apache/solr/solr-velocity/5.0/solr-velocity-5.0-javadoc.jar
to repository ${m2.repository.id} at file://<builds.flonkings.com/job/Lucene-trunk-Linux-Java7-64/ws/checkout/solr/package/maven>
[artifact:deploy] Transferring 68K from ${m2.repository.id}
[artifact:deploy] Uploaded 68K

dist-maven:

prepare-release-no-sign:
    [mkdir] Created dir: <builds.flonkings.com/job/Lucene-trunk-Linux-Java7-64/ws/checkout/lucene/build/fakeRelease>
     [copy] Copying 366 files to <builds.flonkings.com/job/Lucene-trunk-Linux-Java7-64/ws/checkout/lucene/build/fakeRelease/lucene>
     [copy] Copying 4 files to <builds.flonkings.com/job/Lucene-trunk-Linux-Java7-64/ws/checkout/lucene/build/fakeRelease/lucene/changes>
      [get] Getting: http://people.apache.org/keys/group/lucene.asc
      [get] To: <builds.flonkings.com/job/Lucene-trunk-Linux-Java7-64/ws/checkout/lucene/build/fakeRelease/lucene/KEYS>
     [copy] Copying 189 files to <builds.flonkings.com/job/Lucene-trunk-Linux-Java7-64/ws/checkout/lucene/build/fakeRelease/solr>
     [copy] Copying 1 file to <builds.flonkings.com/job/Lucene-trunk-Linux-Java7-64/ws/checkout/lucene/build/fakeRelease/solr>

BUILD FAILED
<builds.flonkings.com/job/Lucene-trunk-Linux-Java7-64/ws/checkout/build.xml>:218: Execute
failed: java.io.IOException: Cannot run program "python3.2": error=2, No such file or directory
	at java.lang.ProcessBuilder.start(ProcessBuilder.java:1029)
	at java.lang.Runtime.exec(Runtime.java:615)
	at org.apache.tools.ant.taskdefs.Execute$Java13CommandLauncher.exec(Execute.java:862)
	at org.apache.tools.ant.taskdefs.Execute.launch(Execute.java:481)
	at org.apache.tools.ant.taskdefs.Execute.execute(Execute.java:495)
	at org.apache.tools.ant.taskdefs.ExecTask.runExecute(ExecTask.java:631)
	at org.apache.tools.ant.taskdefs.ExecTask.runExec(ExecTask.java:672)
	at org.apache.tools.ant.taskdefs.ExecTask.execute(ExecTask.java:498)
	at org.apache.tools.ant.UnknownElement.execute(UnknownElement.java:291)
	at sun.reflect.GeneratedMethodAccessor4.invoke(Unknown Source)
	at sun.reflect.DelegatingMethodAccessorImpl.invoke(DelegatingMethodAccessorImpl.java:43)
	at java.lang.reflect.Method.invoke(Method.java:601)
	at org.apache.tools.ant.dispatch.DispatchUtils.execute(DispatchUtils.java:106)
	at org.apache.tools.ant.Task.perform(Task.java:348)
	at org.apache.tools.ant.taskdefs.Sequential.execute(Sequential.java:68)
	at org.apache.tools.ant.UnknownElement.execute(UnknownElement.java:291)
	at sun.reflect.GeneratedMethodAccessor4.invoke(Unknown Source)
	at sun.reflect.DelegatingMethodAccessorImpl.invoke(DelegatingMethodAccessorImpl.java:43)
	at java.lang.reflect.Method.invoke(Method.java:601)
	at org.apache.tools.ant.dispatch.DispatchUtils.execute(DispatchUtils.java:106)
	at org.apache.tools.ant.Task.perform(Task.java:348)
	at org.apache.tools.ant.Target.execute(Target.java:392)
	at org.apache.tools.ant.Target.performTasks(Target.java:413)
	at org.apache.tools.ant.Project.executeSortedTargets(Project.java:1399)
	at org.apache.tools.ant.Project.executeTarget(Project.java:1368)
	at org.apache.tools.ant.helper.DefaultExecutor.executeTargets(DefaultExecutor.java:41)
	at org.apache.tools.ant.Project.executeTargets(Project.java:1251)
	at org.apache.tools.ant.Main.runBuild(Main.java:811)
	at org.apache.tools.ant.Main.startAnt(Main.java:217)
	at org.apache.tools.ant.launch.Launcher.run(Launcher.java:280)
	at org.apache.tools.ant.launch.Launcher.main(Launcher.java:109)
Caused by: java.io.IOException: error=2, No such file or directory
	at java.lang.UNIXProcess.forkAndExec(Native Method)
	at java.lang.UNIXProcess.<init>(UNIXProcess.java:135)
	at java.lang.ProcessImpl.start(ProcessImpl.java:130)
	at java.lang.ProcessBuilder.start(ProcessBuilder.java:1021)
	... 30 more

Total time: 23 minutes 31 seconds
Build step 'Execute shell' marked build as failure
Archiving artifacts
Recording test results

---------------------------------------------------------------------
To unsubscribe, e-mail: dev-unsubscribe@lucene.apache.org
For additional commands, e-mail: dev-help@lucene.apache.org


Mime
View raw message