lucene-dev mailing list archives

Site index · List index
Message view « Date » · « Thread »
Top « Date » · « Thread »
From Policeman Jenkins Server <jenk...@sd-datasolutions.de>
Subject [JENKINS] Lucene-Solr-trunk-Linux (32bit/ibm-j9-jdk6) - Build # 192 - Failure!
Date Sun, 05 Aug 2012 11:17:24 GMT
Build: http://jenkins.sd-datasolutions.de/job/Lucene-Solr-trunk-Linux/192/
Java: 32bit/ibm-j9-jdk6 

7 tests failed.
FAILED:  junit.framework.TestSuite.org.apache.lucene.search.TestFieldCache

Error Message:


Stack Trace:
java.lang.AssertionError
	at __randomizedtesting.SeedInfo.seed([31FFECE3F6ADCAF0]:0)
	at org.apache.lucene.util.packed.GrowableWriter.ensureCapacity(GrowableWriter.java:70)
	at org.apache.lucene.util.packed.GrowableWriter.set(GrowableWriter.java:83)
	at org.apache.lucene.util.fst.FST.pack(FST.java:1505)
	at org.apache.lucene.codecs.memory.MemoryPostingsFormat$TermsWriter.finish(MemoryPostingsFormat.java:273)
	at org.apache.lucene.index.FreqProxTermsWriterPerField.flush(FreqProxTermsWriterPerField.java:550)
	at org.apache.lucene.index.FreqProxTermsWriter.flush(FreqProxTermsWriter.java:85)
	at org.apache.lucene.index.TermsHash.flush(TermsHash.java:117)
	at org.apache.lucene.index.DocInverter.flush(DocInverter.java:53)
	at org.apache.lucene.index.DocFieldProcessor.flush(DocFieldProcessor.java:82)
	at org.apache.lucene.index.DocumentsWriterPerThread.flush(DocumentsWriterPerThread.java:481)
	at org.apache.lucene.index.DocumentsWriter.doFlush(DocumentsWriter.java:419)
	at org.apache.lucene.index.DocumentsWriter.flushAllThreads(DocumentsWriter.java:551)
	at org.apache.lucene.index.IndexWriter.prepareCommit(IndexWriter.java:2635)
	at org.apache.lucene.index.IndexWriter.commitInternal(IndexWriter.java:2771)
	at org.apache.lucene.index.IndexWriter.commit(IndexWriter.java:2751)
	at org.apache.lucene.index.IndexWriter.commit(IndexWriter.java:2735)
	at org.apache.lucene.index.RandomIndexWriter.maybeCommit(RandomIndexWriter.java:266)
	at org.apache.lucene.index.RandomIndexWriter.addDocument(RandomIndexWriter.java:189)
	at org.apache.lucene.index.RandomIndexWriter.addDocument(RandomIndexWriter.java:145)
	at org.apache.lucene.search.TestFieldCache.beforeClass(TestFieldCache.java:100)
	at sun.reflect.NativeMethodAccessorImpl.invoke0(Native Method)
	at sun.reflect.NativeMethodAccessorImpl.invoke(NativeMethodAccessorImpl.java:48)
	at sun.reflect.DelegatingMethodAccessorImpl.invoke(DelegatingMethodAccessorImpl.java:25)
	at java.lang.reflect.Method.invoke(Method.java:600)
	at com.carrotsearch.randomizedtesting.RandomizedRunner.invoke(RandomizedRunner.java:1995)
	at com.carrotsearch.randomizedtesting.RandomizedRunner.access$1100(RandomizedRunner.java:132)
	at com.carrotsearch.randomizedtesting.RandomizedRunner$4.evaluate(RandomizedRunner.java:731)
	at com.carrotsearch.randomizedtesting.RandomizedRunner$5.evaluate(RandomizedRunner.java:747)
	at org.apache.lucene.util.AbstractBeforeAfterRule$1.evaluate(AbstractBeforeAfterRule.java:45)
	at org.apache.lucene.util.TestRuleReportUncaughtExceptions$1.evaluate(TestRuleReportUncaughtExceptions.java:68)
	at org.apache.lucene.util.TestRuleStoreClassName$1.evaluate(TestRuleStoreClassName.java:38)
	at com.carrotsearch.randomizedtesting.rules.SystemPropertiesInvariantRule$1.evaluate(SystemPropertiesInvariantRule.java:55)
	at org.apache.lucene.util.TestRuleNoInstanceHooksOverrides$1.evaluate(TestRuleNoInstanceHooksOverrides.java:53)
	at org.apache.lucene.util.TestRuleNoStaticHooksShadowing$1.evaluate(TestRuleNoStaticHooksShadowing.java:52)
	at org.apache.lucene.util.TestRuleAssertionsRequired$1.evaluate(TestRuleAssertionsRequired.java:36)
	at org.apache.lucene.util.TestRuleMarkFailure$1.evaluate(TestRuleMarkFailure.java:48)
	at org.apache.lucene.util.TestRuleIgnoreAfterMaxFailures$1.evaluate(TestRuleIgnoreAfterMaxFailures.java:70)
	at org.apache.lucene.util.TestRuleIgnoreTestSuites$1.evaluate(TestRuleIgnoreTestSuites.java:55)
	at com.carrotsearch.randomizedtesting.RandomizedRunner.runSuite(RandomizedRunner.java:605)
	at com.carrotsearch.randomizedtesting.RandomizedRunner.access$400(RandomizedRunner.java:132)
	at com.carrotsearch.randomizedtesting.RandomizedRunner$2.run(RandomizedRunner.java:551)


FAILED:  junit.framework.TestSuite.org.apache.lucene.search.TestFieldCache

Error Message:


Stack Trace:
java.lang.NullPointerException
	at __randomizedtesting.SeedInfo.seed([31FFECE3F6ADCAF0]:0)
	at org.apache.lucene.search.TestFieldCache.afterClass(TestFieldCache.java:109)
	at sun.reflect.NativeMethodAccessorImpl.invoke0(Native Method)
	at sun.reflect.NativeMethodAccessorImpl.invoke(NativeMethodAccessorImpl.java:48)
	at sun.reflect.DelegatingMethodAccessorImpl.invoke(DelegatingMethodAccessorImpl.java:25)
	at java.lang.reflect.Method.invoke(Method.java:600)
	at com.carrotsearch.randomizedtesting.RandomizedRunner.invoke(RandomizedRunner.java:1995)
	at com.carrotsearch.randomizedtesting.RandomizedRunner.access$1100(RandomizedRunner.java:132)
	at com.carrotsearch.randomizedtesting.RandomizedRunner$5.evaluate(RandomizedRunner.java:754)
	at org.apache.lucene.util.AbstractBeforeAfterRule$1.evaluate(AbstractBeforeAfterRule.java:45)
	at org.apache.lucene.util.TestRuleReportUncaughtExceptions$1.evaluate(TestRuleReportUncaughtExceptions.java:68)
	at org.apache.lucene.util.TestRuleStoreClassName$1.evaluate(TestRuleStoreClassName.java:38)
	at com.carrotsearch.randomizedtesting.rules.SystemPropertiesInvariantRule$1.evaluate(SystemPropertiesInvariantRule.java:55)
	at org.apache.lucene.util.TestRuleNoInstanceHooksOverrides$1.evaluate(TestRuleNoInstanceHooksOverrides.java:53)
	at org.apache.lucene.util.TestRuleNoStaticHooksShadowing$1.evaluate(TestRuleNoStaticHooksShadowing.java:52)
	at org.apache.lucene.util.TestRuleAssertionsRequired$1.evaluate(TestRuleAssertionsRequired.java:36)
	at org.apache.lucene.util.TestRuleMarkFailure$1.evaluate(TestRuleMarkFailure.java:48)
	at org.apache.lucene.util.TestRuleIgnoreAfterMaxFailures$1.evaluate(TestRuleIgnoreAfterMaxFailures.java:70)
	at org.apache.lucene.util.TestRuleIgnoreTestSuites$1.evaluate(TestRuleIgnoreTestSuites.java:55)
	at com.carrotsearch.randomizedtesting.RandomizedRunner.runSuite(RandomizedRunner.java:605)
	at com.carrotsearch.randomizedtesting.RandomizedRunner.access$400(RandomizedRunner.java:132)
	at com.carrotsearch.randomizedtesting.RandomizedRunner$2.run(RandomizedRunner.java:551)


REGRESSION:  org.apache.lucene.index.TestDocTermOrds.testRandom

Error Message:


Stack Trace:
java.lang.AssertionError
	at __randomizedtesting.SeedInfo.seed([31FFECE3F6ADCAF0:43B3C9EC47CD7C83]:0)
	at org.apache.lucene.util.packed.GrowableWriter.ensureCapacity(GrowableWriter.java:70)
	at org.apache.lucene.util.packed.GrowableWriter.set(GrowableWriter.java:83)
	at org.apache.lucene.util.fst.FST.pack(FST.java:1505)
	at org.apache.lucene.codecs.memory.MemoryPostingsFormat$TermsWriter.finish(MemoryPostingsFormat.java:273)
	at org.apache.lucene.index.FreqProxTermsWriterPerField.flush(FreqProxTermsWriterPerField.java:550)
	at org.apache.lucene.index.FreqProxTermsWriter.flush(FreqProxTermsWriter.java:85)
	at org.apache.lucene.index.TermsHash.flush(TermsHash.java:117)
	at org.apache.lucene.index.DocInverter.flush(DocInverter.java:53)
	at org.apache.lucene.index.DocFieldProcessor.flush(DocFieldProcessor.java:82)
	at org.apache.lucene.index.DocumentsWriterPerThread.flush(DocumentsWriterPerThread.java:481)
	at org.apache.lucene.index.DocumentsWriter.doFlush(DocumentsWriter.java:419)
	at org.apache.lucene.index.DocumentsWriter.flushAllThreads(DocumentsWriter.java:551)
	at org.apache.lucene.index.IndexWriter.prepareCommit(IndexWriter.java:2635)
	at org.apache.lucene.index.IndexWriter.commitInternal(IndexWriter.java:2771)
	at org.apache.lucene.index.IndexWriter.commit(IndexWriter.java:2751)
	at org.apache.lucene.index.IndexWriter.commit(IndexWriter.java:2735)
	at org.apache.lucene.index.RandomIndexWriter.getReader(RandomIndexWriter.java:418)
	at org.apache.lucene.index.RandomIndexWriter.getReader(RandomIndexWriter.java:363)
	at org.apache.lucene.index.TestDocTermOrds.testRandom(TestDocTermOrds.java:150)
	at sun.reflect.NativeMethodAccessorImpl.invoke0(Native Method)
	at sun.reflect.NativeMethodAccessorImpl.invoke(NativeMethodAccessorImpl.java:48)
	at sun.reflect.DelegatingMethodAccessorImpl.invoke(DelegatingMethodAccessorImpl.java:25)
	at java.lang.reflect.Method.invoke(Method.java:600)
	at com.carrotsearch.randomizedtesting.RandomizedRunner.invoke(RandomizedRunner.java:1995)
	at com.carrotsearch.randomizedtesting.RandomizedRunner.access$1100(RandomizedRunner.java:132)
	at com.carrotsearch.randomizedtesting.RandomizedRunner$6.evaluate(RandomizedRunner.java:818)
	at com.carrotsearch.randomizedtesting.RandomizedRunner$7.evaluate(RandomizedRunner.java:877)
	at com.carrotsearch.randomizedtesting.RandomizedRunner$8.evaluate(RandomizedRunner.java:891)
	at org.apache.lucene.util.TestRuleSetupTeardownChained$1.evaluate(TestRuleSetupTeardownChained.java:50)
	at org.apache.lucene.util.TestRuleFieldCacheSanity$1.evaluate(TestRuleFieldCacheSanity.java:32)
	at org.apache.lucene.util.AbstractBeforeAfterRule$1.evaluate(AbstractBeforeAfterRule.java:45)
	at com.carrotsearch.randomizedtesting.rules.SystemPropertiesInvariantRule$1.evaluate(SystemPropertiesInvariantRule.java:55)
	at org.apache.lucene.util.TestRuleReportUncaughtExceptions$1.evaluate(TestRuleReportUncaughtExceptions.java:68)
	at org.apache.lucene.util.TestRuleThreadAndTestName$1.evaluate(TestRuleThreadAndTestName.java:48)
	at org.apache.lucene.util.TestRuleIgnoreAfterMaxFailures$1.evaluate(TestRuleIgnoreAfterMaxFailures.java:70)
	at org.apache.lucene.util.TestRuleMarkFailure$1.evaluate(TestRuleMarkFailure.java:48)
	at com.carrotsearch.randomizedtesting.RandomizedRunner.runSingleTest(RandomizedRunner.java:825)
	at com.carrotsearch.randomizedtesting.RandomizedRunner.access$700(RandomizedRunner.java:132)
	at com.carrotsearch.randomizedtesting.RandomizedRunner$3$1.run(RandomizedRunner.java:671)
	at com.carrotsearch.randomizedtesting.RandomizedRunner$3.evaluate(RandomizedRunner.java:697)
	at com.carrotsearch.randomizedtesting.RandomizedRunner$4.evaluate(RandomizedRunner.java:736)
	at com.carrotsearch.randomizedtesting.RandomizedRunner$5.evaluate(RandomizedRunner.java:747)
	at org.apache.lucene.util.AbstractBeforeAfterRule$1.evaluate(AbstractBeforeAfterRule.java:45)
	at org.apache.lucene.util.TestRuleReportUncaughtExceptions$1.evaluate(TestRuleReportUncaughtExceptions.java:68)
	at org.apache.lucene.util.TestRuleStoreClassName$1.evaluate(TestRuleStoreClassName.java:38)
	at com.carrotsearch.randomizedtesting.rules.SystemPropertiesInvariantRule$1.evaluate(SystemPropertiesInvariantRule.java:55)
	at org.apache.lucene.util.TestRuleNoInstanceHooksOverrides$1.evaluate(TestRuleNoInstanceHooksOverrides.java:53)
	at org.apache.lucene.util.TestRuleNoStaticHooksShadowing$1.evaluate(TestRuleNoStaticHooksShadowing.java:52)
	at org.apache.lucene.util.TestRuleAssertionsRequired$1.evaluate(TestRuleAssertionsRequired.java:36)
	at org.apache.lucene.util.TestRuleMarkFailure$1.evaluate(TestRuleMarkFailure.java:48)
	at org.apache.lucene.util.TestRuleIgnoreAfterMaxFailures$1.evaluate(TestRuleIgnoreAfterMaxFailures.java:70)
	at org.apache.lucene.util.TestRuleIgnoreTestSuites$1.evaluate(TestRuleIgnoreTestSuites.java:55)
	at com.carrotsearch.randomizedtesting.RandomizedRunner.runSuite(RandomizedRunner.java:605)
	at com.carrotsearch.randomizedtesting.RandomizedRunner.access$400(RandomizedRunner.java:132)
	at com.carrotsearch.randomizedtesting.RandomizedRunner$2.run(RandomizedRunner.java:551)


REGRESSION:  org.apache.lucene.index.TestPerSegmentDeletes.testDeletes1

Error Message:


Stack Trace:
java.lang.AssertionError
	at __randomizedtesting.SeedInfo.seed([31FFECE3F6ADCAF0:926043D0C3FDE6EB]:0)
	at org.apache.lucene.util.packed.GrowableWriter.ensureCapacity(GrowableWriter.java:70)
	at org.apache.lucene.util.packed.GrowableWriter.set(GrowableWriter.java:83)
	at org.apache.lucene.util.fst.FST.pack(FST.java:1505)
	at org.apache.lucene.codecs.memory.MemoryPostingsFormat$TermsWriter.finish(MemoryPostingsFormat.java:273)
	at org.apache.lucene.codecs.TermsConsumer.merge(TermsConsumer.java:213)
	at org.apache.lucene.codecs.FieldsConsumer.merge(FieldsConsumer.java:65)
	at org.apache.lucene.index.SegmentMerger.mergeTerms(SegmentMerger.java:323)
	at org.apache.lucene.index.SegmentMerger.merge(SegmentMerger.java:110)
	at org.apache.lucene.index.IndexWriter.mergeMiddle(IndexWriter.java:3611)
	at org.apache.lucene.index.IndexWriter.merge(IndexWriter.java:3226)
	at org.apache.lucene.index.SerialMergeScheduler.merge(SerialMergeScheduler.java:36)
	at org.apache.lucene.index.IndexWriter.maybeMerge(IndexWriter.java:1799)
	at org.apache.lucene.index.IndexWriter.maybeMerge(IndexWriter.java:1793)
	at org.apache.lucene.index.TestPerSegmentDeletes.testDeletes1(TestPerSegmentDeletes.java:93)
	at sun.reflect.NativeMethodAccessorImpl.invoke0(Native Method)
	at sun.reflect.NativeMethodAccessorImpl.invoke(NativeMethodAccessorImpl.java:48)
	at sun.reflect.DelegatingMethodAccessorImpl.invoke(DelegatingMethodAccessorImpl.java:25)
	at java.lang.reflect.Method.invoke(Method.java:600)
	at com.carrotsearch.randomizedtesting.RandomizedRunner.invoke(RandomizedRunner.java:1995)
	at com.carrotsearch.randomizedtesting.RandomizedRunner.access$1100(RandomizedRunner.java:132)
	at com.carrotsearch.randomizedtesting.RandomizedRunner$6.evaluate(RandomizedRunner.java:818)
	at com.carrotsearch.randomizedtesting.RandomizedRunner$7.evaluate(RandomizedRunner.java:877)
	at com.carrotsearch.randomizedtesting.RandomizedRunner$8.evaluate(RandomizedRunner.java:891)
	at org.apache.lucene.util.TestRuleSetupTeardownChained$1.evaluate(TestRuleSetupTeardownChained.java:50)
	at org.apache.lucene.util.TestRuleFieldCacheSanity$1.evaluate(TestRuleFieldCacheSanity.java:32)
	at org.apache.lucene.util.AbstractBeforeAfterRule$1.evaluate(AbstractBeforeAfterRule.java:45)
	at com.carrotsearch.randomizedtesting.rules.SystemPropertiesInvariantRule$1.evaluate(SystemPropertiesInvariantRule.java:55)
	at org.apache.lucene.util.TestRuleReportUncaughtExceptions$1.evaluate(TestRuleReportUncaughtExceptions.java:68)
	at org.apache.lucene.util.TestRuleThreadAndTestName$1.evaluate(TestRuleThreadAndTestName.java:48)
	at org.apache.lucene.util.TestRuleIgnoreAfterMaxFailures$1.evaluate(TestRuleIgnoreAfterMaxFailures.java:70)
	at org.apache.lucene.util.TestRuleMarkFailure$1.evaluate(TestRuleMarkFailure.java:48)
	at com.carrotsearch.randomizedtesting.RandomizedRunner.runSingleTest(RandomizedRunner.java:825)
	at com.carrotsearch.randomizedtesting.RandomizedRunner.access$700(RandomizedRunner.java:132)
	at com.carrotsearch.randomizedtesting.RandomizedRunner$3$1.run(RandomizedRunner.java:671)
	at com.carrotsearch.randomizedtesting.RandomizedRunner$3.evaluate(RandomizedRunner.java:697)
	at com.carrotsearch.randomizedtesting.RandomizedRunner$4.evaluate(RandomizedRunner.java:736)
	at com.carrotsearch.randomizedtesting.RandomizedRunner$5.evaluate(RandomizedRunner.java:747)
	at org.apache.lucene.util.AbstractBeforeAfterRule$1.evaluate(AbstractBeforeAfterRule.java:45)
	at org.apache.lucene.util.TestRuleReportUncaughtExceptions$1.evaluate(TestRuleReportUncaughtExceptions.java:68)
	at org.apache.lucene.util.TestRuleStoreClassName$1.evaluate(TestRuleStoreClassName.java:38)
	at com.carrotsearch.randomizedtesting.rules.SystemPropertiesInvariantRule$1.evaluate(SystemPropertiesInvariantRule.java:55)
	at org.apache.lucene.util.TestRuleNoInstanceHooksOverrides$1.evaluate(TestRuleNoInstanceHooksOverrides.java:53)
	at org.apache.lucene.util.TestRuleNoStaticHooksShadowing$1.evaluate(TestRuleNoStaticHooksShadowing.java:52)
	at org.apache.lucene.util.TestRuleAssertionsRequired$1.evaluate(TestRuleAssertionsRequired.java:36)
	at org.apache.lucene.util.TestRuleMarkFailure$1.evaluate(TestRuleMarkFailure.java:48)
	at org.apache.lucene.util.TestRuleIgnoreAfterMaxFailures$1.evaluate(TestRuleIgnoreAfterMaxFailures.java:70)
	at org.apache.lucene.util.TestRuleIgnoreTestSuites$1.evaluate(TestRuleIgnoreTestSuites.java:55)
	at com.carrotsearch.randomizedtesting.RandomizedRunner.runSuite(RandomizedRunner.java:605)
	at com.carrotsearch.randomizedtesting.RandomizedRunner.access$400(RandomizedRunner.java:132)
	at com.carrotsearch.randomizedtesting.RandomizedRunner$2.run(RandomizedRunner.java:551)


REGRESSION:  org.apache.lucene.index.TestRollingUpdates.testRollingUpdates

Error Message:


Stack Trace:
java.lang.AssertionError
	at __randomizedtesting.SeedInfo.seed([31FFECE3F6ADCAF0:BF04ED9A45336F3B]:0)
	at org.apache.lucene.util.packed.GrowableWriter.ensureCapacity(GrowableWriter.java:70)
	at org.apache.lucene.util.packed.GrowableWriter.set(GrowableWriter.java:83)
	at org.apache.lucene.util.fst.FST.pack(FST.java:1505)
	at org.apache.lucene.codecs.memory.MemoryPostingsFormat$TermsWriter.finish(MemoryPostingsFormat.java:273)
	at org.apache.lucene.index.FreqProxTermsWriterPerField.flush(FreqProxTermsWriterPerField.java:550)
	at org.apache.lucene.index.FreqProxTermsWriter.flush(FreqProxTermsWriter.java:85)
	at org.apache.lucene.index.TermsHash.flush(TermsHash.java:117)
	at org.apache.lucene.index.DocInverter.flush(DocInverter.java:53)
	at org.apache.lucene.index.DocFieldProcessor.flush(DocFieldProcessor.java:82)
	at org.apache.lucene.index.DocumentsWriterPerThread.flush(DocumentsWriterPerThread.java:481)
	at org.apache.lucene.index.DocumentsWriter.doFlush(DocumentsWriter.java:419)
	at org.apache.lucene.index.DocumentsWriter.flushAllThreads(DocumentsWriter.java:551)
	at org.apache.lucene.index.IndexWriter.getReader(IndexWriter.java:353)
	at org.apache.lucene.index.TestRollingUpdates.testRollingUpdates(TestRollingUpdates.java:114)
	at sun.reflect.NativeMethodAccessorImpl.invoke0(Native Method)
	at sun.reflect.NativeMethodAccessorImpl.invoke(NativeMethodAccessorImpl.java:48)
	at sun.reflect.DelegatingMethodAccessorImpl.invoke(DelegatingMethodAccessorImpl.java:25)
	at java.lang.reflect.Method.invoke(Method.java:600)
	at com.carrotsearch.randomizedtesting.RandomizedRunner.invoke(RandomizedRunner.java:1995)
	at com.carrotsearch.randomizedtesting.RandomizedRunner.access$1100(RandomizedRunner.java:132)
	at com.carrotsearch.randomizedtesting.RandomizedRunner$6.evaluate(RandomizedRunner.java:818)
	at com.carrotsearch.randomizedtesting.RandomizedRunner$7.evaluate(RandomizedRunner.java:877)
	at com.carrotsearch.randomizedtesting.RandomizedRunner$8.evaluate(RandomizedRunner.java:891)
	at org.apache.lucene.util.TestRuleSetupTeardownChained$1.evaluate(TestRuleSetupTeardownChained.java:50)
	at org.apache.lucene.util.TestRuleFieldCacheSanity$1.evaluate(TestRuleFieldCacheSanity.java:32)
	at org.apache.lucene.util.AbstractBeforeAfterRule$1.evaluate(AbstractBeforeAfterRule.java:45)
	at com.carrotsearch.randomizedtesting.rules.SystemPropertiesInvariantRule$1.evaluate(SystemPropertiesInvariantRule.java:55)
	at org.apache.lucene.util.TestRuleReportUncaughtExceptions$1.evaluate(TestRuleReportUncaughtExceptions.java:68)
	at org.apache.lucene.util.TestRuleThreadAndTestName$1.evaluate(TestRuleThreadAndTestName.java:48)
	at org.apache.lucene.util.TestRuleIgnoreAfterMaxFailures$1.evaluate(TestRuleIgnoreAfterMaxFailures.java:70)
	at org.apache.lucene.util.TestRuleMarkFailure$1.evaluate(TestRuleMarkFailure.java:48)
	at com.carrotsearch.randomizedtesting.RandomizedRunner.runSingleTest(RandomizedRunner.java:825)
	at com.carrotsearch.randomizedtesting.RandomizedRunner.access$700(RandomizedRunner.java:132)
	at com.carrotsearch.randomizedtesting.RandomizedRunner$3$1.run(RandomizedRunner.java:671)
	at com.carrotsearch.randomizedtesting.RandomizedRunner$3.evaluate(RandomizedRunner.java:697)
	at com.carrotsearch.randomizedtesting.RandomizedRunner$4.evaluate(RandomizedRunner.java:736)
	at com.carrotsearch.randomizedtesting.RandomizedRunner$5.evaluate(RandomizedRunner.java:747)
	at org.apache.lucene.util.AbstractBeforeAfterRule$1.evaluate(AbstractBeforeAfterRule.java:45)
	at org.apache.lucene.util.TestRuleReportUncaughtExceptions$1.evaluate(TestRuleReportUncaughtExceptions.java:68)
	at org.apache.lucene.util.TestRuleStoreClassName$1.evaluate(TestRuleStoreClassName.java:38)
	at com.carrotsearch.randomizedtesting.rules.SystemPropertiesInvariantRule$1.evaluate(SystemPropertiesInvariantRule.java:55)
	at org.apache.lucene.util.TestRuleNoInstanceHooksOverrides$1.evaluate(TestRuleNoInstanceHooksOverrides.java:53)
	at org.apache.lucene.util.TestRuleNoStaticHooksShadowing$1.evaluate(TestRuleNoStaticHooksShadowing.java:52)
	at org.apache.lucene.util.TestRuleAssertionsRequired$1.evaluate(TestRuleAssertionsRequired.java:36)
	at org.apache.lucene.util.TestRuleMarkFailure$1.evaluate(TestRuleMarkFailure.java:48)
	at org.apache.lucene.util.TestRuleIgnoreAfterMaxFailures$1.evaluate(TestRuleIgnoreAfterMaxFailures.java:70)
	at org.apache.lucene.util.TestRuleIgnoreTestSuites$1.evaluate(TestRuleIgnoreTestSuites.java:55)
	at com.carrotsearch.randomizedtesting.RandomizedRunner.runSuite(RandomizedRunner.java:605)
	at com.carrotsearch.randomizedtesting.RandomizedRunner.access$400(RandomizedRunner.java:132)
	at com.carrotsearch.randomizedtesting.RandomizedRunner$2.run(RandomizedRunner.java:551)


REGRESSION:  org.apache.lucene.search.TestShardSearching.testSimple

Error Message:


Stack Trace:
java.lang.AssertionError
	at __randomizedtesting.SeedInfo.seed([31FFECE3F6ADCAF0:94CC81DD15E1E21]:0)
	at org.apache.lucene.search.TestShardSearching.testSimple(TestShardSearching.java:247)
	at sun.reflect.NativeMethodAccessorImpl.invoke0(Native Method)
	at sun.reflect.NativeMethodAccessorImpl.invoke(NativeMethodAccessorImpl.java:48)
	at sun.reflect.DelegatingMethodAccessorImpl.invoke(DelegatingMethodAccessorImpl.java:25)
	at java.lang.reflect.Method.invoke(Method.java:600)
	at com.carrotsearch.randomizedtesting.RandomizedRunner.invoke(RandomizedRunner.java:1995)
	at com.carrotsearch.randomizedtesting.RandomizedRunner.access$1100(RandomizedRunner.java:132)
	at com.carrotsearch.randomizedtesting.RandomizedRunner$6.evaluate(RandomizedRunner.java:818)
	at com.carrotsearch.randomizedtesting.RandomizedRunner$7.evaluate(RandomizedRunner.java:877)
	at com.carrotsearch.randomizedtesting.RandomizedRunner$8.evaluate(RandomizedRunner.java:891)
	at org.apache.lucene.util.TestRuleSetupTeardownChained$1.evaluate(TestRuleSetupTeardownChained.java:50)
	at org.apache.lucene.util.TestRuleFieldCacheSanity$1.evaluate(TestRuleFieldCacheSanity.java:32)
	at org.apache.lucene.util.AbstractBeforeAfterRule$1.evaluate(AbstractBeforeAfterRule.java:45)
	at com.carrotsearch.randomizedtesting.rules.SystemPropertiesInvariantRule$1.evaluate(SystemPropertiesInvariantRule.java:55)
	at org.apache.lucene.util.TestRuleReportUncaughtExceptions$1.evaluate(TestRuleReportUncaughtExceptions.java:68)
	at org.apache.lucene.util.TestRuleThreadAndTestName$1.evaluate(TestRuleThreadAndTestName.java:48)
	at org.apache.lucene.util.TestRuleIgnoreAfterMaxFailures$1.evaluate(TestRuleIgnoreAfterMaxFailures.java:70)
	at org.apache.lucene.util.TestRuleMarkFailure$1.evaluate(TestRuleMarkFailure.java:48)
	at com.carrotsearch.randomizedtesting.RandomizedRunner.runSingleTest(RandomizedRunner.java:825)
	at com.carrotsearch.randomizedtesting.RandomizedRunner.access$700(RandomizedRunner.java:132)
	at com.carrotsearch.randomizedtesting.RandomizedRunner$3$1.run(RandomizedRunner.java:671)
	at com.carrotsearch.randomizedtesting.RandomizedRunner$3.evaluate(RandomizedRunner.java:697)
	at com.carrotsearch.randomizedtesting.RandomizedRunner$4.evaluate(RandomizedRunner.java:736)
	at com.carrotsearch.randomizedtesting.RandomizedRunner$5.evaluate(RandomizedRunner.java:747)
	at org.apache.lucene.util.AbstractBeforeAfterRule$1.evaluate(AbstractBeforeAfterRule.java:45)
	at org.apache.lucene.util.TestRuleReportUncaughtExceptions$1.evaluate(TestRuleReportUncaughtExceptions.java:68)
	at org.apache.lucene.util.TestRuleStoreClassName$1.evaluate(TestRuleStoreClassName.java:38)
	at com.carrotsearch.randomizedtesting.rules.SystemPropertiesInvariantRule$1.evaluate(SystemPropertiesInvariantRule.java:55)
	at org.apache.lucene.util.TestRuleNoInstanceHooksOverrides$1.evaluate(TestRuleNoInstanceHooksOverrides.java:53)
	at org.apache.lucene.util.TestRuleNoStaticHooksShadowing$1.evaluate(TestRuleNoStaticHooksShadowing.java:52)
	at org.apache.lucene.util.TestRuleAssertionsRequired$1.evaluate(TestRuleAssertionsRequired.java:36)
	at org.apache.lucene.util.TestRuleMarkFailure$1.evaluate(TestRuleMarkFailure.java:48)
	at org.apache.lucene.util.TestRuleIgnoreAfterMaxFailures$1.evaluate(TestRuleIgnoreAfterMaxFailures.java:70)
	at org.apache.lucene.util.TestRuleIgnoreTestSuites$1.evaluate(TestRuleIgnoreTestSuites.java:55)
	at com.carrotsearch.randomizedtesting.RandomizedRunner.runSuite(RandomizedRunner.java:605)
	at com.carrotsearch.randomizedtesting.RandomizedRunner.access$400(RandomizedRunner.java:132)
	at com.carrotsearch.randomizedtesting.RandomizedRunner$2.run(RandomizedRunner.java:551)


REGRESSION:  org.apache.lucene.util.fst.TestFSTs.testRandomWords

Error Message:


Stack Trace:
java.lang.AssertionError
	at __randomizedtesting.SeedInfo.seed([31FFECE3F6ADCAF0:4F6E57DC3FA26535]:0)
	at org.apache.lucene.util.packed.GrowableWriter.ensureCapacity(GrowableWriter.java:70)
	at org.apache.lucene.util.packed.GrowableWriter.set(GrowableWriter.java:83)
	at org.apache.lucene.util.fst.FST.pack(FST.java:1505)
	at org.apache.lucene.util.fst.TestFSTs$FSTTester.doTest(TestFSTs.java:542)
	at org.apache.lucene.util.fst.TestFSTs$FSTTester.doTest(TestFSTs.java:384)
	at org.apache.lucene.util.fst.TestFSTs.doTest(TestFSTs.java:234)
	at org.apache.lucene.util.fst.TestFSTs.testRandomWords(TestFSTs.java:1056)
	at org.apache.lucene.util.fst.TestFSTs.testRandomWords(TestFSTs.java:1030)
	at sun.reflect.NativeMethodAccessorImpl.invoke0(Native Method)
	at sun.reflect.NativeMethodAccessorImpl.invoke(NativeMethodAccessorImpl.java:48)
	at sun.reflect.DelegatingMethodAccessorImpl.invoke(DelegatingMethodAccessorImpl.java:25)
	at java.lang.reflect.Method.invoke(Method.java:600)
	at com.carrotsearch.randomizedtesting.RandomizedRunner.invoke(RandomizedRunner.java:1995)
	at com.carrotsearch.randomizedtesting.RandomizedRunner.access$1100(RandomizedRunner.java:132)
	at com.carrotsearch.randomizedtesting.RandomizedRunner$6.evaluate(RandomizedRunner.java:818)
	at com.carrotsearch.randomizedtesting.RandomizedRunner$7.evaluate(RandomizedRunner.java:877)
	at com.carrotsearch.randomizedtesting.RandomizedRunner$8.evaluate(RandomizedRunner.java:891)
	at org.apache.lucene.util.TestRuleSetupTeardownChained$1.evaluate(TestRuleSetupTeardownChained.java:50)
	at org.apache.lucene.util.TestRuleFieldCacheSanity$1.evaluate(TestRuleFieldCacheSanity.java:32)
	at org.apache.lucene.util.AbstractBeforeAfterRule$1.evaluate(AbstractBeforeAfterRule.java:45)
	at com.carrotsearch.randomizedtesting.rules.SystemPropertiesInvariantRule$1.evaluate(SystemPropertiesInvariantRule.java:55)
	at org.apache.lucene.util.TestRuleReportUncaughtExceptions$1.evaluate(TestRuleReportUncaughtExceptions.java:68)
	at org.apache.lucene.util.TestRuleThreadAndTestName$1.evaluate(TestRuleThreadAndTestName.java:48)
	at org.apache.lucene.util.TestRuleIgnoreAfterMaxFailures$1.evaluate(TestRuleIgnoreAfterMaxFailures.java:70)
	at org.apache.lucene.util.TestRuleMarkFailure$1.evaluate(TestRuleMarkFailure.java:48)
	at com.carrotsearch.randomizedtesting.RandomizedRunner.runSingleTest(RandomizedRunner.java:825)
	at com.carrotsearch.randomizedtesting.RandomizedRunner.access$700(RandomizedRunner.java:132)
	at com.carrotsearch.randomizedtesting.RandomizedRunner$3$1.run(RandomizedRunner.java:671)
	at com.carrotsearch.randomizedtesting.RandomizedRunner$3.evaluate(RandomizedRunner.java:697)
	at com.carrotsearch.randomizedtesting.RandomizedRunner$4.evaluate(RandomizedRunner.java:736)
	at com.carrotsearch.randomizedtesting.RandomizedRunner$5.evaluate(RandomizedRunner.java:747)
	at org.apache.lucene.util.AbstractBeforeAfterRule$1.evaluate(AbstractBeforeAfterRule.java:45)
	at org.apache.lucene.util.TestRuleReportUncaughtExceptions$1.evaluate(TestRuleReportUncaughtExceptions.java:68)
	at org.apache.lucene.util.TestRuleStoreClassName$1.evaluate(TestRuleStoreClassName.java:38)
	at com.carrotsearch.randomizedtesting.rules.SystemPropertiesInvariantRule$1.evaluate(SystemPropertiesInvariantRule.java:55)
	at org.apache.lucene.util.TestRuleNoInstanceHooksOverrides$1.evaluate(TestRuleNoInstanceHooksOverrides.java:53)
	at org.apache.lucene.util.TestRuleNoStaticHooksShadowing$1.evaluate(TestRuleNoStaticHooksShadowing.java:52)
	at org.apache.lucene.util.TestRuleAssertionsRequired$1.evaluate(TestRuleAssertionsRequired.java:36)
	at org.apache.lucene.util.TestRuleMarkFailure$1.evaluate(TestRuleMarkFailure.java:48)
	at org.apache.lucene.util.TestRuleIgnoreAfterMaxFailures$1.evaluate(TestRuleIgnoreAfterMaxFailures.java:70)
	at org.apache.lucene.util.TestRuleIgnoreTestSuites$1.evaluate(TestRuleIgnoreTestSuites.java:55)
	at com.carrotsearch.randomizedtesting.RandomizedRunner.runSuite(RandomizedRunner.java:605)
	at com.carrotsearch.randomizedtesting.RandomizedRunner.access$400(RandomizedRunner.java:132)
	at com.carrotsearch.randomizedtesting.RandomizedRunner$2.run(RandomizedRunner.java:551)




Build Log:
[...truncated 529 lines...]
[junit4:junit4] Suite: org.apache.lucene.search.TestShardSearching
[junit4:junit4] FAILURE 1.79s J0 | TestShardSearching.testSimple
[junit4:junit4]    > Throwable #1: java.lang.AssertionError
[junit4:junit4]    > 	at __randomizedtesting.SeedInfo.seed([31FFECE3F6ADCAF0:94CC81DD15E1E21]:0)
[junit4:junit4]    > 	at org.apache.lucene.search.TestShardSearching.testSimple(TestShardSearching.java:247)
[junit4:junit4]    > 	at sun.reflect.NativeMethodAccessorImpl.invoke0(Native Method)
[junit4:junit4]    > 	at sun.reflect.NativeMethodAccessorImpl.invoke(NativeMethodAccessorImpl.java:48)
[junit4:junit4]    > 	at sun.reflect.DelegatingMethodAccessorImpl.invoke(DelegatingMethodAccessorImpl.java:25)
[junit4:junit4]    > 	at java.lang.reflect.Method.invoke(Method.java:600)
[junit4:junit4]    > 	at com.carrotsearch.randomizedtesting.RandomizedRunner.invoke(RandomizedRunner.java:1995)
[junit4:junit4]    > 	at com.carrotsearch.randomizedtesting.RandomizedRunner.access$1100(RandomizedRunner.java:132)
[junit4:junit4]    > 	at com.carrotsearch.randomizedtesting.RandomizedRunner$6.evaluate(RandomizedRunner.java:818)
[junit4:junit4]    > 	at com.carrotsearch.randomizedtesting.RandomizedRunner$7.evaluate(RandomizedRunner.java:877)
[junit4:junit4]    > 	at com.carrotsearch.randomizedtesting.RandomizedRunner$8.evaluate(RandomizedRunner.java:891)
[junit4:junit4]    > 	at org.apache.lucene.util.TestRuleSetupTeardownChained$1.evaluate(TestRuleSetupTeardownChained.java:50)
[junit4:junit4]    > 	at org.apache.lucene.util.TestRuleFieldCacheSanity$1.evaluate(TestRuleFieldCacheSanity.java:32)
[junit4:junit4]    > 	at org.apache.lucene.util.AbstractBeforeAfterRule$1.evaluate(AbstractBeforeAfterRule.java:45)
[junit4:junit4]    > 	at com.carrotsearch.randomizedtesting.rules.SystemPropertiesInvariantRule$1.evaluate(SystemPropertiesInvariantRule.java:55)
[junit4:junit4]    > 	at org.apache.lucene.util.TestRuleReportUncaughtExceptions$1.evaluate(TestRuleReportUncaughtExceptions.java:68)
[junit4:junit4]    > 	at org.apache.lucene.util.TestRuleThreadAndTestName$1.evaluate(TestRuleThreadAndTestName.java:48)
[junit4:junit4]    > 	at org.apache.lucene.util.TestRuleIgnoreAfterMaxFailures$1.evaluate(TestRuleIgnoreAfterMaxFailures.java:70)
[junit4:junit4]    > 	at org.apache.lucene.util.TestRuleMarkFailure$1.evaluate(TestRuleMarkFailure.java:48)
[junit4:junit4]    > 	at com.carrotsearch.randomizedtesting.RandomizedRunner.runSingleTest(RandomizedRunner.java:825)
[junit4:junit4]    > 	at com.carrotsearch.randomizedtesting.RandomizedRunner.access$700(RandomizedRunner.java:132)
[junit4:junit4]    > 	at com.carrotsearch.randomizedtesting.RandomizedRunner$3$1.run(RandomizedRunner.java:671)
[junit4:junit4]    > 	at com.carrotsearch.randomizedtesting.RandomizedRunner$3.evaluate(RandomizedRunner.java:697)
[junit4:junit4]    > 	at com.carrotsearch.randomizedtesting.RandomizedRunner$4.evaluate(RandomizedRunner.java:736)
[junit4:junit4]    > 	at com.carrotsearch.randomizedtesting.RandomizedRunner$5.evaluate(RandomizedRunner.java:747)
[junit4:junit4]    > 	at org.apache.lucene.util.AbstractBeforeAfterRule$1.evaluate(AbstractBeforeAfterRule.java:45)
[junit4:junit4]    > 	at org.apache.lucene.util.TestRuleReportUncaughtExceptions$1.evaluate(TestRuleReportUncaughtExceptions.java:68)
[junit4:junit4]    > 	at org.apache.lucene.util.TestRuleStoreClassName$1.evaluate(TestRuleStoreClassName.java:38)
[junit4:junit4]    > 	at com.carrotsearch.randomizedtesting.rules.SystemPropertiesInvariantRule$1.evaluate(SystemPropertiesInvariantRule.java:55)
[junit4:junit4]    > 	at org.apache.lucene.util.TestRuleNoInstanceHooksOverrides$1.evaluate(TestRuleNoInstanceHooksOverrides.java:53)
[junit4:junit4]    > 	at org.apache.lucene.util.TestRuleNoStaticHooksShadowing$1.evaluate(TestRuleNoStaticHooksShadowing.java:52)
[junit4:junit4]    > 	at org.apache.lucene.util.TestRuleAssertionsRequired$1.evaluate(TestRuleAssertionsRequired.java:36)
[junit4:junit4]    > 	at org.apache.lucene.util.TestRuleMarkFailure$1.evaluate(TestRuleMarkFailure.java:48)
[junit4:junit4]    > 	at org.apache.lucene.util.TestRuleIgnoreAfterMaxFailures$1.evaluate(TestRuleIgnoreAfterMaxFailures.java:70)
[junit4:junit4]    > 	at org.apache.lucene.util.TestRuleIgnoreTestSuites$1.evaluate(TestRuleIgnoreTestSuites.java:55)
[junit4:junit4]    > 	at com.carrotsearch.randomizedtesting.RandomizedRunner.runSuite(RandomizedRunner.java:605)
[junit4:junit4]    > 	at com.carrotsearch.randomizedtesting.RandomizedRunner.access$400(RandomizedRunner.java:132)
[junit4:junit4]    > 	at com.carrotsearch.randomizedtesting.RandomizedRunner$2.run(RandomizedRunner.java:551)
[junit4:junit4]    > 
[junit4:junit4]   2> NOTE: reproduce with: ant test  -Dtestcase=TestShardSearching -Dtests.method=testSimple -Dtests.seed=31FFECE3F6ADCAF0 -Dtests.multiplier=3 -Dtests.slow=true -Dtests.locale=es_CL -Dtests.timezone=Australia/Currie -Dtests.file.encoding=UTF-8
[junit4:junit4]   2>
[junit4:junit4]    > (@AfterClass output)
[junit4:junit4]   1> FAILED:
[junit4:junit4]   1> java.io.FileNotFoundException: _c.prx
[junit4:junit4]   1> 	at org.apache.lucene.store.FSDirectory.fileLength(FSDirectory.java:266)
[junit4:junit4]   1> 	at org.apache.lucene.store.MockDirectoryWrapper.fileLength(MockDirectoryWrapper.java:696)
[junit4:junit4]   1> 	at org.apache.lucene.index.SegmentInfo.sizeInBytes(SegmentInfo.java:102)
[junit4:junit4]   1> 	at org.apache.lucene.index.DocumentsWriterPerThread.flush(DocumentsWriterPerThread.java:510)
[junit4:junit4]   1> 	at org.apache.lucene.index.DocumentsWriter.doFlush(DocumentsWriter.java:419)
[junit4:junit4]   1> 	at org.apache.lucene.index.DocumentsWriter.flushAllThreads(DocumentsWriter.java:551)
[junit4:junit4]   1> 	at org.apache.lucene.index.IndexWriter.getReader(IndexWriter.java:353)
[junit4:junit4]   1> 	at org.apache.lucene.index.StandardDirectoryReader.doOpenFromWriter(StandardDirectoryReader.java:265)
[junit4:junit4]   1> 	at org.apache.lucene.index.StandardDirectoryReader.doOpenIfChanged(StandardDirectoryReader.java:240)
[junit4:junit4]   1> 	at org.apache.lucene.index.StandardDirectoryReader.doOpenIfChanged(StandardDirectoryReader.java:230)
[junit4:junit4]   1> 	at org.apache.lucene.index.DirectoryReader.openIfChanged(DirectoryReader.java:166)
[junit4:junit4]   1> 	at org.apache.lucene.search.SearcherManager.refreshIfNeeded(SearcherManager.java:118)
[junit4:junit4]   1> 	at org.apache.lucene.search.SearcherManager.refreshIfNeeded(SearcherManager.java:58)
[junit4:junit4]   1> 	at org.apache.lucene.search.ReferenceManager.doMaybeRefresh(ReferenceManager.java:123)
[junit4:junit4]   1> 	at org.apache.lucene.search.ReferenceManager.maybeRefresh(ReferenceManager.java:169)
[junit4:junit4]   1> 	at org.apache.lucene.search.ShardSearchingTestBase$NodeState.reopen(ShardSearchingTestBase.java:494)
[junit4:junit4]   1> 	at org.apache.lucene.search.ShardSearchingTestBase$ChangeIndices.run(ShardSearchingTestBase.java:549)
[junit4:junit4]   2> NOTE: test params are: codec=Asserting, sim=DefaultSimilarity, locale=es_CL, timezone=Australia/Currie
[junit4:junit4]   2> NOTE: Linux 3.2.0-27-generic x86/IBM Corporation 1.6.0 (32-bit)/cpus=8,threads=2,free=18759568,total=158968320
[junit4:junit4]   2> NOTE: All tests run in this JVM: [TestTermsEnum2, TestTermScorer, TestBytesRef, TestDeterminizeLexicon, TestScorerPerf, TestVersion, TestMaxTermFrequency, TestMultiPhraseQuery, TestWindowsMMap, TestBackwardsCompatibility, TestIndexWriterCommit, TestBooleanScorer, TestSetOnce, TestAllFilesHaveCodecHeader, TestNGramPhraseQuery, TestConstantScoreQuery, TestSloppyPhraseQuery, TestLazyProxSkipping, TestTermdocPerf, TestFieldInfos, TestTermRangeQuery, TestIndexWriterForceMerge, TestIndexWriterLockRelease, TestIndexWriterExceptions, TestRegexpQuery, TestFlushByRamOrCountsPolicy, TestPhraseQuery, TestOpenBitSet, TestFieldCacheTermsFilter, TestAssertions, TestFieldCacheRangeFilter, TestCompoundFile, TestPrefixCodedTerms, TestAppendingCodec, TestDocValuesIndexing, TestTermVectors, TestSort, TestSpanExplanations, InBeforeClass, InAfterClass, InTestMethod, NonStringProperties, TestBooleanQueryVisitSubscorers, TestPostingsFormat, TestSpanFirstQuery, TestFlex, TestCharFilter, TestMultiMMap, TestIndexableField, TestCrashCausesCorruptIndex, TestSpansAdvanced2, TestCustomNorms, TestCopyBytes, TestRegexpRandom, TestIndexWriterOnJRECrash, TestParallelCompositeReader, TestNoDeletionPolicy, TestSearcherManager, TestDirectoryReaderReopen, TestFilterAtomicReader, TestSpanSearchEquivalence, Test2BTerms, TestTermVectorsReader, TestFieldCacheRewriteMethod, TestTimeLimitingCollector, TestFilteredQuery, TestShardSearching]
[junit4:junit4]   1> 
[junit4:junit4]   2> 
[junit4:junit4] Completed on J0 in 2.65s, 1 test, 1 failure <<< FAILURES!

[...truncated 55 lines...]
[junit4:junit4] Suite: org.apache.lucene.index.TestDocTermOrds
[junit4:junit4] FAILURE 0.16s J1 | TestDocTermOrds.testRandom
[junit4:junit4]    > Throwable #1: java.lang.AssertionError
[junit4:junit4]    > 	at __randomizedtesting.SeedInfo.seed([31FFECE3F6ADCAF0:43B3C9EC47CD7C83]:0)
[junit4:junit4]    > 	at org.apache.lucene.util.packed.GrowableWriter.ensureCapacity(GrowableWriter.java:70)
[junit4:junit4]    > 	at org.apache.lucene.util.packed.GrowableWriter.set(GrowableWriter.java:83)
[junit4:junit4]    > 	at org.apache.lucene.util.fst.FST.pack(FST.java:1505)
[junit4:junit4]    > 	at org.apache.lucene.codecs.memory.MemoryPostingsFormat$TermsWriter.finish(MemoryPostingsFormat.java:273)
[junit4:junit4]    > 	at org.apache.lucene.index.FreqProxTermsWriterPerField.flush(FreqProxTermsWriterPerField.java:550)
[junit4:junit4]    > 	at org.apache.lucene.index.FreqProxTermsWriter.flush(FreqProxTermsWriter.java:85)
[junit4:junit4]    > 	at org.apache.lucene.index.TermsHash.flush(TermsHash.java:117)
[junit4:junit4]    > 	at org.apache.lucene.index.DocInverter.flush(DocInverter.java:53)
[junit4:junit4]    > 	at org.apache.lucene.index.DocFieldProcessor.flush(DocFieldProcessor.java:82)
[junit4:junit4]    > 	at org.apache.lucene.index.DocumentsWriterPerThread.flush(DocumentsWriterPerThread.java:481)
[junit4:junit4]    > 	at org.apache.lucene.index.DocumentsWriter.doFlush(DocumentsWriter.java:419)
[junit4:junit4]    > 	at org.apache.lucene.index.DocumentsWriter.flushAllThreads(DocumentsWriter.java:551)
[junit4:junit4]    > 	at org.apache.lucene.index.IndexWriter.prepareCommit(IndexWriter.java:2635)
[junit4:junit4]    > 	at org.apache.lucene.index.IndexWriter.commitInternal(IndexWriter.java:2771)
[junit4:junit4]    > 	at org.apache.lucene.index.IndexWriter.commit(IndexWriter.java:2751)
[junit4:junit4]    > 	at org.apache.lucene.index.IndexWriter.commit(IndexWriter.java:2735)
[junit4:junit4]    > 	at org.apache.lucene.index.RandomIndexWriter.getReader(RandomIndexWriter.java:418)
[junit4:junit4]    > 	at org.apache.lucene.index.RandomIndexWriter.getReader(RandomIndexWriter.java:363)
[junit4:junit4]    > 	at org.apache.lucene.index.TestDocTermOrds.testRandom(TestDocTermOrds.java:150)
[junit4:junit4]    > 	at sun.reflect.NativeMethodAccessorImpl.invoke0(Native Method)
[junit4:junit4]    > 	at sun.reflect.NativeMethodAccessorImpl.invoke(NativeMethodAccessorImpl.java:48)
[junit4:junit4]    > 	at sun.reflect.DelegatingMethodAccessorImpl.invoke(DelegatingMethodAccessorImpl.java:25)
[junit4:junit4]    > 	at java.lang.reflect.Method.invoke(Method.java:600)
[junit4:junit4]    > 	at com.carrotsearch.randomizedtesting.RandomizedRunner.invoke(RandomizedRunner.java:1995)
[junit4:junit4]    > 	at com.carrotsearch.randomizedtesting.RandomizedRunner.access$1100(RandomizedRunner.java:132)
[junit4:junit4]    > 	at com.carrotsearch.randomizedtesting.RandomizedRunner$6.evaluate(RandomizedRunner.java:818)
[junit4:junit4]    > 	at com.carrotsearch.randomizedtesting.RandomizedRunner$7.evaluate(RandomizedRunner.java:877)
[junit4:junit4]    > 	at com.carrotsearch.randomizedtesting.RandomizedRunner$8.evaluate(RandomizedRunner.java:891)
[junit4:junit4]    > 	at org.apache.lucene.util.TestRuleSetupTeardownChained$1.evaluate(TestRuleSetupTeardownChained.java:50)
[junit4:junit4]    > 	at org.apache.lucene.util.TestRuleFieldCacheSanity$1.evaluate(TestRuleFieldCacheSanity.java:32)
[junit4:junit4]    > 	at org.apache.lucene.util.AbstractBeforeAfterRule$1.evaluate(AbstractBeforeAfterRule.java:45)
[junit4:junit4]    > 	at com.carrotsearch.randomizedtesting.rules.SystemPropertiesInvariantRule$1.evaluate(SystemPropertiesInvariantRule.java:55)
[junit4:junit4]    > 	at org.apache.lucene.util.TestRuleReportUncaughtExceptions$1.evaluate(TestRuleReportUncaughtExceptions.java:68)
[junit4:junit4]    > 	at org.apache.lucene.util.TestRuleThreadAndTestName$1.evaluate(TestRuleThreadAndTestName.java:48)
[junit4:junit4]    > 	at org.apache.lucene.util.TestRuleIgnoreAfterMaxFailures$1.evaluate(TestRuleIgnoreAfterMaxFailures.java:70)
[junit4:junit4]    > 	at org.apache.lucene.util.TestRuleMarkFailure$1.evaluate(TestRuleMarkFailure.java:48)
[junit4:junit4]    > 	at com.carrotsearch.randomizedtesting.RandomizedRunner.runSingleTest(RandomizedRunner.java:825)
[junit4:junit4]    > 	at com.carrotsearch.randomizedtesting.RandomizedRunner.access$700(RandomizedRunner.java:132)
[junit4:junit4]    > 	at com.carrotsearch.randomizedtesting.RandomizedRunner$3$1.run(RandomizedRunner.java:671)
[junit4:junit4]    > 	at com.carrotsearch.randomizedtesting.RandomizedRunner$3.evaluate(RandomizedRunner.java:697)
[junit4:junit4]    > 	at com.carrotsearch.randomizedtesting.RandomizedRunner$4.evaluate(RandomizedRunner.java:736)
[junit4:junit4]    > 	at com.carrotsearch.randomizedtesting.RandomizedRunner$5.evaluate(RandomizedRunner.java:747)
[junit4:junit4]    > 	at org.apache.lucene.util.AbstractBeforeAfterRule$1.evaluate(AbstractBeforeAfterRule.java:45)
[junit4:junit4]    > 	at org.apache.lucene.util.TestRuleReportUncaughtExceptions$1.evaluate(TestRuleReportUncaughtExceptions.java:68)
[junit4:junit4]    > 	at org.apache.lucene.util.TestRuleStoreClassName$1.evaluate(TestRuleStoreClassName.java:38)
[junit4:junit4]    > 	at com.carrotsearch.randomizedtesting.rules.SystemPropertiesInvariantRule$1.evaluate(SystemPropertiesInvariantRule.java:55)
[junit4:junit4]    > 	at org.apache.lucene.util.TestRuleNoInstanceHooksOverrides$1.evaluate(TestRuleNoInstanceHooksOverrides.java:53)
[junit4:junit4]    > 	at org.apache.lucene.util.TestRuleNoStaticHooksShadowing$1.evaluate(TestRuleNoStaticHooksShadowing.java:52)
[junit4:junit4]    > 	at org.apache.lucene.util.TestRuleAssertionsRequired$1.evaluate(TestRuleAssertionsRequired.java:36)
[junit4:junit4]    > 	at org.apache.lucene.util.TestRuleMarkFailure$1.evaluate(TestRuleMarkFailure.java:48)
[junit4:junit4]    > 	at org.apache.lucene.util.TestRuleIgnoreAfterMaxFailures$1.evaluate(TestRuleIgnoreAfterMaxFailures.java:70)
[junit4:junit4]    > 	at org.apache.lucene.util.TestRuleIgnoreTestSuites$1.evaluate(TestRuleIgnoreTestSuites.java:55)
[junit4:junit4]    > 	at com.carrotsearch.randomizedtesting.RandomizedRunner.runSuite(RandomizedRunner.java:605)
[junit4:junit4]    > 	at com.carrotsearch.randomizedtesting.RandomizedRunner.access$400(RandomizedRunner.java:132)
[junit4:junit4]    > 	at com.carrotsearch.randomizedtesting.RandomizedRunner$2.run(RandomizedRunner.java:551)
[junit4:junit4]    > 
[junit4:junit4]   2> NOTE: reproduce with: ant test  -Dtestcase=TestDocTermOrds -Dtests.method=testRandom -Dtests.seed=31FFECE3F6ADCAF0 -Dtests.multiplier=3 -Dtests.slow=true -Dtests.locale=es_CR -Dtests.timezone=Asia/Aden -Dtests.file.encoding=UTF-8
[junit4:junit4]   2>
[junit4:junit4]    > (@AfterClass output)
[junit4:junit4]   2> NOTE: test params are: codec=Lucene40: {field=PostingsFormat(name=Memory doPackFST= true), id=Lucene40(minBlockSize=50 maxBlockSize=118)}, sim=RandomSimilarityProvider(queryNorm=false,coord=true): {field=IB LL-L2}, locale=es_CR, timezone=Asia/Aden
[junit4:junit4]   2> NOTE: Linux 3.2.0-27-generic x86/IBM Corporation 1.6.0 (32-bit)/cpus=8,threads=1,free=5273616,total=10602496
[junit4:junit4]   2> NOTE: All tests run in this JVM: [TestLucene40PostingsReader, TestSimilarityBase, TestDocValuesScoring, TestNRTManager, TestUniqueTermCount, TestCachingCollector, TestDirectory, TestConsistentFieldNumbers, TestSimpleSearchEquivalence, TestNoMergeScheduler, TestDocsAndPositions, TestIntBlockCodec, TestLongPostings, TestFieldValueFilter, TestNoMergePolicy, TestBytesRefHash, TestNumericRangeQuery32, TestFieldsReader, TestPersistentSnapshotDeletionPolicy, TestLookaheadTokenFilter, TestConjunctions, TestDocumentsWriterStallControl, TestField, TestAutomatonQuery, TestNumericRangeQuery64, TestSegmentTermDocs, TestPayloads, TestTopScoreDocCollector, TestAttributeSource, TestNRTReaderWithThreads, TestHugeRamFile, TestReuseDocsEnum, Before3, Before3, TestNeverDelete, TestDateFilter, TestDocValuesTypeCompatibility, TestPerFieldPostingsFormat, TestVirtualMethod, TestComplexExplanations, TestMultiLevelSkipList, TestLock, TestSameTokenSamePosition, TestDateTools, TestSentinelIntSet, TestSimilarity, TestNearSpansOrdered, TestIntsRef, TestDocTermOrds]
[junit4:junit4]   2> 
[junit4:junit4] Completed on J1 in 1.04s, 3 tests, 1 failure <<< FAILURES!

[...truncated 310 lines...]
[junit4:junit4] Suite: org.apache.lucene.index.TestRollingUpdates
[junit4:junit4] FAILURE 0.22s J1 | TestRollingUpdates.testRollingUpdates
[junit4:junit4]    > Throwable #1: java.lang.AssertionError
[junit4:junit4]    > 	at __randomizedtesting.SeedInfo.seed([31FFECE3F6ADCAF0:BF04ED9A45336F3B]:0)
[junit4:junit4]    > 	at org.apache.lucene.util.packed.GrowableWriter.ensureCapacity(GrowableWriter.java:70)
[junit4:junit4]    > 	at org.apache.lucene.util.packed.GrowableWriter.set(GrowableWriter.java:83)
[junit4:junit4]    > 	at org.apache.lucene.util.fst.FST.pack(FST.java:1505)
[junit4:junit4]    > 	at org.apache.lucene.codecs.memory.MemoryPostingsFormat$TermsWriter.finish(MemoryPostingsFormat.java:273)
[junit4:junit4]    > 	at org.apache.lucene.index.FreqProxTermsWriterPerField.flush(FreqProxTermsWriterPerField.java:550)
[junit4:junit4]    > 	at org.apache.lucene.index.FreqProxTermsWriter.flush(FreqProxTermsWriter.java:85)
[junit4:junit4]    > 	at org.apache.lucene.index.TermsHash.flush(TermsHash.java:117)
[junit4:junit4]    > 	at org.apache.lucene.index.DocInverter.flush(DocInverter.java:53)
[junit4:junit4]    > 	at org.apache.lucene.index.DocFieldProcessor.flush(DocFieldProcessor.java:82)
[junit4:junit4]    > 	at org.apache.lucene.index.DocumentsWriterPerThread.flush(DocumentsWriterPerThread.java:481)
[junit4:junit4]    > 	at org.apache.lucene.index.DocumentsWriter.doFlush(DocumentsWriter.java:419)
[junit4:junit4]    > 	at org.apache.lucene.index.DocumentsWriter.flushAllThreads(DocumentsWriter.java:551)
[junit4:junit4]    > 	at org.apache.lucene.index.IndexWriter.getReader(IndexWriter.java:353)
[junit4:junit4]    > 	at org.apache.lucene.index.TestRollingUpdates.testRollingUpdates(TestRollingUpdates.java:114)
[junit4:junit4]    > 	at sun.reflect.NativeMethodAccessorImpl.invoke0(Native Method)
[junit4:junit4]    > 	at sun.reflect.NativeMethodAccessorImpl.invoke(NativeMethodAccessorImpl.java:48)
[junit4:junit4]    > 	at sun.reflect.DelegatingMethodAccessorImpl.invoke(DelegatingMethodAccessorImpl.java:25)
[junit4:junit4]    > 	at java.lang.reflect.Method.invoke(Method.java:600)
[junit4:junit4]    > 	at com.carrotsearch.randomizedtesting.RandomizedRunner.invoke(RandomizedRunner.java:1995)
[junit4:junit4]    > 	at com.carrotsearch.randomizedtesting.RandomizedRunner.access$1100(RandomizedRunner.java:132)
[junit4:junit4]    > 	at com.carrotsearch.randomizedtesting.RandomizedRunner$6.evaluate(RandomizedRunner.java:818)
[junit4:junit4]    > 	at com.carrotsearch.randomizedtesting.RandomizedRunner$7.evaluate(RandomizedRunner.java:877)
[junit4:junit4]    > 	at com.carrotsearch.randomizedtesting.RandomizedRunner$8.evaluate(RandomizedRunner.java:891)
[junit4:junit4]    > 	at org.apache.lucene.util.TestRuleSetupTeardownChained$1.evaluate(TestRuleSetupTeardownChained.java:50)
[junit4:junit4]    > 	at org.apache.lucene.util.TestRuleFieldCacheSanity$1.evaluate(TestRuleFieldCacheSanity.java:32)
[junit4:junit4]    > 	at org.apache.lucene.util.AbstractBeforeAfterRule$1.evaluate(AbstractBeforeAfterRule.java:45)
[junit4:junit4]    > 	at com.carrotsearch.randomizedtesting.rules.SystemPropertiesInvariantRule$1.evaluate(SystemPropertiesInvariantRule.java:55)
[junit4:junit4]    > 	at org.apache.lucene.util.TestRuleReportUncaughtExceptions$1.evaluate(TestRuleReportUncaughtExceptions.java:68)
[junit4:junit4]    > 	at org.apache.lucene.util.TestRuleThreadAndTestName$1.evaluate(TestRuleThreadAndTestName.java:48)
[junit4:junit4]    > 	at org.apache.lucene.util.TestRuleIgnoreAfterMaxFailures$1.evaluate(TestRuleIgnoreAfterMaxFailures.java:70)
[junit4:junit4]    > 	at org.apache.lucene.util.TestRuleMarkFailure$1.evaluate(TestRuleMarkFailure.java:48)
[junit4:junit4]    > 	at com.carrotsearch.randomizedtesting.RandomizedRunner.runSingleTest(RandomizedRunner.java:825)
[junit4:junit4]    > 	at com.carrotsearch.randomizedtesting.RandomizedRunner.access$700(RandomizedRunner.java:132)
[junit4:junit4]    > 	at com.carrotsearch.randomizedtesting.RandomizedRunner$3$1.run(RandomizedRunner.java:671)
[junit4:junit4]    > 	at com.carrotsearch.randomizedtesting.RandomizedRunner$3.evaluate(RandomizedRunner.java:697)
[junit4:junit4]    > 	at com.carrotsearch.randomizedtesting.RandomizedRunner$4.evaluate(RandomizedRunner.java:736)
[junit4:junit4]    > 	at com.carrotsearch.randomizedtesting.RandomizedRunner$5.evaluate(RandomizedRunner.java:747)
[junit4:junit4]    > 	at org.apache.lucene.util.AbstractBeforeAfterRule$1.evaluate(AbstractBeforeAfterRule.java:45)
[junit4:junit4]    > 	at org.apache.lucene.util.TestRuleReportUncaughtExceptions$1.evaluate(TestRuleReportUncaughtExceptions.java:68)
[junit4:junit4]    > 	at org.apache.lucene.util.TestRuleStoreClassName$1.evaluate(TestRuleStoreClassName.java:38)
[junit4:junit4]    > 	at com.carrotsearch.randomizedtesting.rules.SystemPropertiesInvariantRule$1.evaluate(SystemPropertiesInvariantRule.java:55)
[junit4:junit4]    > 	at org.apache.lucene.util.TestRuleNoInstanceHooksOverrides$1.evaluate(TestRuleNoInstanceHooksOverrides.java:53)
[junit4:junit4]    > 	at org.apache.lucene.util.TestRuleNoStaticHooksShadowing$1.evaluate(TestRuleNoStaticHooksShadowing.java:52)
[junit4:junit4]    > 	at org.apache.lucene.util.TestRuleAssertionsRequired$1.evaluate(TestRuleAssertionsRequired.java:36)
[junit4:junit4]    > 	at org.apache.lucene.util.TestRuleMarkFailure$1.evaluate(TestRuleMarkFailure.java:48)
[junit4:junit4]    > 	at org.apache.lucene.util.TestRuleIgnoreAfterMaxFailures$1.evaluate(TestRuleIgnoreAfterMaxFailures.java:70)
[junit4:junit4]    > 	at org.apache.lucene.util.TestRuleIgnoreTestSuites$1.evaluate(TestRuleIgnoreTestSuites.java:55)
[junit4:junit4]    > 	at com.carrotsearch.randomizedtesting.RandomizedRunner.runSuite(RandomizedRunner.java:605)
[junit4:junit4]    > 	at com.carrotsearch.randomizedtesting.RandomizedRunner.access$400(RandomizedRunner.java:132)
[junit4:junit4]    > 	at com.carrotsearch.randomizedtesting.RandomizedRunner$2.run(RandomizedRunner.java:551)
[junit4:junit4]    > 
[junit4:junit4]   2> NOTE: reproduce with: ant test  -Dtestcase=TestRollingUpdates -Dtests.method=testRollingUpdates -Dtests.seed=31FFECE3F6ADCAF0 -Dtests.multiplier=3 -Dtests.slow=true -Dtests.locale=es_HN -Dtests.timezone=America/Phoenix -Dtests.file.encoding=UTF-8
[junit4:junit4]   2>
[junit4:junit4]    > (@AfterClass output)
[junit4:junit4]   2> NOTE: test params are: codec=Lucene40: {id=Pulsing40(freqCutoff=8 minBlockSize=37 maxBlockSize=144)}, sim=RandomSimilarityProvider(queryNorm=true,coord=false): {titleTokenized=DFR GZ(0.3), body=LM Jelinek-Mercer(0.700000)}, locale=es_HN, timezone=America/Phoenix
[junit4:junit4]   2> NOTE: Linux 3.2.0-27-generic x86/IBM Corporation 1.6.0 (32-bit)/cpus=8,threads=1,free=6996120,total=17083392
[junit4:junit4]   2> NOTE: All tests run in this JVM: [TestLucene40PostingsReader, TestSimilarityBase, TestDocValuesScoring, TestNRTManager, TestUniqueTermCount, TestCachingCollector, TestDirectory, TestConsistentFieldNumbers, TestSimpleSearchEquivalence, TestNoMergeScheduler, TestDocsAndPositions, TestIntBlockCodec, TestLongPostings, TestFieldValueFilter, TestNoMergePolicy, TestBytesRefHash, TestNumericRangeQuery32, TestFieldsReader, TestPersistentSnapshotDeletionPolicy, TestLookaheadTokenFilter, TestConjunctions, TestDocumentsWriterStallControl, TestField, TestAutomatonQuery, TestNumericRangeQuery64, TestSegmentTermDocs, TestPayloads, TestTopScoreDocCollector, TestAttributeSource, TestNRTReaderWithThreads, TestHugeRamFile, TestReuseDocsEnum, Before3, Before3, TestNeverDelete, TestDateFilter, TestDocValuesTypeCompatibility, TestPerFieldPostingsFormat, TestVirtualMethod, TestComplexExplanations, TestMultiLevelSkipList, TestLock, TestSameTokenSamePosition, TestDateTools, TestSentinelIntSet, TestSimilarity, TestNearSpansOrdered, TestIntsRef, TestDocTermOrds, TestSegmentMerger, TestSimilarity2, TestIndexWriterConfig, TestSegmentTermEnum, TestFSTs, TestIOUtils, TestPayloadSpans, TestStressAdvance, TestCollectionUtil, TestMockAnalyzer, TestBinaryDocument, TestMinimize, TestComplexExplanationsOfNonMatches, TestTypePromotion, TestIndexWriterMerging, TestFieldMaskingSpanQuery, TestRecyclingByteBlockAllocator, TestBinaryTerms, TestMultiThreadTermVectors, TestExplanations, TestAddIndexes, TestLockFactory, TestNumericTokenStream, TestMultiValuedNumericRangeQuery, TestOmitPositions, TestDocumentsWriterDeleteQueue, TestIndexInput, TestSpanMultiTermQueryWrapper, TestStressIndexing, TestGraphTokenizers, TestBasics, TestByteSlices, TestAtomicUpdate, TestIndexWriter, TestSearchAfter, TestIndexWriterDelete, TestBufferedIndexInput, TestDirectoryReader, TestFixedBitSet, TestTieredMergePolicy, TestConcurrentMergeScheduler, TestSloppyPhraseQuery2, TestStressNRT, TestNumericUtils, TestLevenshteinAutomata, TestDeterminism, TestCharTermAttributeImpl, TestOmitNorms, TestRollingUpdates]
[junit4:junit4]   2> 
[junit4:junit4] Completed on J1 in 0.98s, 2 tests, 1 failure <<< FAILURES!

[...truncated 22 lines...]
[junit4:junit4] Suite: org.apache.lucene.search.TestFieldCache
[junit4:junit4]    > (@BeforeClass output)
[junit4:junit4]   2> NOTE: test params are: codec=Lucene40: {sparse=PostingsFormat(name=SimpleText), theDouble=PostingsFormat(name=Memory doPackFST= true), theByte=Lucene40(minBlockSize=79 maxBlockSize=203), numInt=Lucene40(minBlockSize=79 maxBlockSize=203), theFloat=PostingsFormat(name=MockRandom), theInt=PostingsFormat(name=Memory doPackFST= true)}, sim=DefaultSimilarity, locale=ko_KR, timezone=America/Guayaquil
[junit4:junit4]   2> NOTE: Linux 3.2.0-27-generic x86/IBM Corporation 1.6.0 (32-bit)/cpus=8,threads=1,free=1879736,total=26767360
[junit4:junit4]   2> NOTE: All tests run in this JVM: [TestLucene40PostingsReader, TestSimilarityBase, TestDocValuesScoring, TestNRTManager, TestUniqueTermCount, TestCachingCollector, TestDirectory, TestConsistentFieldNumbers, TestSimpleSearchEquivalence, TestNoMergeScheduler, TestDocsAndPositions, TestIntBlockCodec, TestLongPostings, TestFieldValueFilter, TestNoMergePolicy, TestBytesRefHash, TestNumericRangeQuery32, TestFieldsReader, TestPersistentSnapshotDeletionPolicy, TestLookaheadTokenFilter, TestConjunctions, TestDocumentsWriterStallControl, TestField, TestAutomatonQuery, TestNumericRangeQuery64, TestSegmentTermDocs, TestPayloads, TestTopScoreDocCollector, TestAttributeSource, TestNRTReaderWithThreads, TestHugeRamFile, TestReuseDocsEnum, Before3, Before3, TestNeverDelete, TestDateFilter, TestDocValuesTypeCompatibility, TestPerFieldPostingsFormat, TestVirtualMethod, TestComplexExplanations, TestMultiLevelSkipList, TestLock, TestSameTokenSamePosition, TestDateTools, TestSentinelIntSet, TestSimilarity, TestNearSpansOrdered, TestIntsRef, TestDocTermOrds, TestSegmentMerger, TestSimilarity2, TestIndexWriterConfig, TestSegmentTermEnum, TestFSTs, TestIOUtils, TestPayloadSpans, TestStressAdvance, TestCollectionUtil, TestMockAnalyzer, TestBinaryDocument, TestMinimize, TestComplexExplanationsOfNonMatches, TestTypePromotion, TestIndexWriterMerging, TestFieldMaskingSpanQuery, TestRecyclingByteBlockAllocator, TestBinaryTerms, TestMultiThreadTermVectors, TestExplanations, TestAddIndexes, TestLockFactory, TestNumericTokenStream, TestMultiValuedNumericRangeQuery, TestOmitPositions, TestDocumentsWriterDeleteQueue, TestIndexInput, TestSpanMultiTermQueryWrapper, TestStressIndexing, TestGraphTokenizers, TestBasics, TestByteSlices, TestAtomicUpdate, TestIndexWriter, TestSearchAfter, TestIndexWriterDelete, TestBufferedIndexInput, TestDirectoryReader, TestFixedBitSet, TestTieredMergePolicy, TestConcurrentMergeScheduler, TestSloppyPhraseQuery2, TestStressNRT, TestNumericUtils, TestLevenshteinAutomata, TestDeterminism, TestCharTermAttributeImpl, TestOmitNorms, TestRollingUpdates, TestBitVector, TestTransactions, TestPrefixInBooleanQuery, TestFieldCache]
[junit4:junit4]   2> NOTE: reproduce with: ant test  -Dtestcase=TestFieldCache -Dtests.seed=31FFECE3F6ADCAF0 -Dtests.multiplier=3 -Dtests.slow=true -Dtests.locale=ko_KR -Dtests.timezone=America/Guayaquil -Dtests.file.encoding=UTF-8
[junit4:junit4]   2> 
[junit4:junit4] ERROR   0.00s J1 | TestFieldCache (suite)
[junit4:junit4]    > Throwable #1: java.lang.AssertionError
[junit4:junit4]    > 	at __randomizedtesting.SeedInfo.seed([31FFECE3F6ADCAF0]:0)
[junit4:junit4]    > 	at org.apache.lucene.util.packed.GrowableWriter.ensureCapacity(GrowableWriter.java:70)
[junit4:junit4]    > 	at org.apache.lucene.util.packed.GrowableWriter.set(GrowableWriter.java:83)
[junit4:junit4]    > 	at org.apache.lucene.util.fst.FST.pack(FST.java:1505)
[junit4:junit4]    > 	at org.apache.lucene.codecs.memory.MemoryPostingsFormat$TermsWriter.finish(MemoryPostingsFormat.java:273)
[junit4:junit4]    > 	at org.apache.lucene.index.FreqProxTermsWriterPerField.flush(FreqProxTermsWriterPerField.java:550)
[junit4:junit4]    > 	at org.apache.lucene.index.FreqProxTermsWriter.flush(FreqProxTermsWriter.java:85)
[junit4:junit4]    > 	at org.apache.lucene.index.TermsHash.flush(TermsHash.java:117)
[junit4:junit4]    > 	at org.apache.lucene.index.DocInverter.flush(DocInverter.java:53)
[junit4:junit4]    > 	at org.apache.lucene.index.DocFieldProcessor.flush(DocFieldProcessor.java:82)
[junit4:junit4]    > 	at org.apache.lucene.index.DocumentsWriterPerThread.flush(DocumentsWriterPerThread.java:481)
[junit4:junit4]    > 	at org.apache.lucene.index.DocumentsWriter.doFlush(DocumentsWriter.java:419)
[junit4:junit4]    > 	at org.apache.lucene.index.DocumentsWriter.flushAllThreads(DocumentsWriter.java:551)
[junit4:junit4]    > 	at org.apache.lucene.index.IndexWriter.prepareCommit(IndexWriter.java:2635)
[junit4:junit4]    > 	at org.apache.lucene.index.IndexWriter.commitInternal(IndexWriter.java:2771)
[junit4:junit4]    > 	at org.apache.lucene.index.IndexWriter.commit(IndexWriter.java:2751)
[junit4:junit4]    > 	at org.apache.lucene.index.IndexWriter.commit(IndexWriter.java:2735)
[junit4:junit4]    > 	at org.apache.lucene.index.RandomIndexWriter.maybeCommit(RandomIndexWriter.java:266)
[junit4:junit4]    > 	at org.apache.lucene.index.RandomIndexWriter.addDocument(RandomIndexWriter.java:189)
[junit4:junit4]    > 	at org.apache.lucene.index.RandomIndexWriter.addDocument(RandomIndexWriter.java:145)
[junit4:junit4]    > 	at org.apache.lucene.search.TestFieldCache.beforeClass(TestFieldCache.java:100)
[junit4:junit4]    > 	at sun.reflect.NativeMethodAccessorImpl.invoke0(Native Method)
[junit4:junit4]    > 	at sun.reflect.NativeMethodAccessorImpl.invoke(NativeMethodAccessorImpl.java:48)
[junit4:junit4]    > 	at sun.reflect.DelegatingMethodAccessorImpl.invoke(DelegatingMethodAccessorImpl.java:25)
[junit4:junit4]    > 	at java.lang.reflect.Method.invoke(Method.java:600)
[junit4:junit4]    > 	at com.carrotsearch.randomizedtesting.RandomizedRunner.invoke(RandomizedRunner.java:1995)
[junit4:junit4]    > 	at com.carrotsearch.randomizedtesting.RandomizedRunner.access$1100(RandomizedRunner.java:132)
[junit4:junit4]    > 	at com.carrotsearch.randomizedtesting.RandomizedRunner$4.evaluate(RandomizedRunner.java:731)
[junit4:junit4]    > 	at com.carrotsearch.randomizedtesting.RandomizedRunner$5.evaluate(RandomizedRunner.java:747)
[junit4:junit4]    > 	at org.apache.lucene.util.AbstractBeforeAfterRule$1.evaluate(AbstractBeforeAfterRule.java:45)
[junit4:junit4]    > 	at org.apache.lucene.util.TestRuleReportUncaughtExceptions$1.evaluate(TestRuleReportUncaughtExceptions.java:68)
[junit4:junit4]    > 	at org.apache.lucene.util.TestRuleStoreClassName$1.evaluate(TestRuleStoreClassName.java:38)
[junit4:junit4]    > 	at com.carrotsearch.randomizedtesting.rules.SystemPropertiesInvariantRule$1.evaluate(SystemPropertiesInvariantRule.java:55)
[junit4:junit4]    > 	at org.apache.lucene.util.TestRuleNoInstanceHooksOverrides$1.evaluate(TestRuleNoInstanceHooksOverrides.java:53)
[junit4:junit4]    > 	at org.apache.lucene.util.TestRuleNoStaticHooksShadowing$1.evaluate(TestRuleNoStaticHooksShadowing.java:52)
[junit4:junit4]    > 	at org.apache.lucene.util.TestRuleAssertionsRequired$1.evaluate(TestRuleAssertionsRequired.java:36)
[junit4:junit4]    > 	at org.apache.lucene.util.TestRuleMarkFailure$1.evaluate(TestRuleMarkFailure.java:48)
[junit4:junit4]    > 	at org.apache.lucene.util.TestRuleIgnoreAfterMaxFailures$1.evaluate(TestRuleIgnoreAfterMaxFailures.java:70)
[junit4:junit4]    > 	at org.apache.lucene.util.TestRuleIgnoreTestSuites$1.evaluate(TestRuleIgnoreTestSuites.java:55)
[junit4:junit4]    > 	at com.carrotsearch.randomizedtesting.RandomizedRunner.runSuite(RandomizedRunner.java:605)
[junit4:junit4]    > 	at com.carrotsearch.randomizedtesting.RandomizedRunner.access$400(RandomizedRunner.java:132)
[junit4:junit4]    > 	at com.carrotsearch.randomizedtesting.RandomizedRunner$2.run(RandomizedRunner.java:551)
[junit4:junit4]    > Throwable #2: java.lang.NullPointerException
[junit4:junit4]    > 	at __randomizedtesting.SeedInfo.seed([31FFECE3F6ADCAF0]:0)
[junit4:junit4]    > 	at org.apache.lucene.search.TestFieldCache.afterClass(TestFieldCache.java:109)
[junit4:junit4]    > 	at sun.reflect.NativeMethodAccessorImpl.invoke0(Native Method)
[junit4:junit4]    > 	at sun.reflect.NativeMethodAccessorImpl.invoke(NativeMethodAccessorImpl.java:48)
[junit4:junit4]    > 	at sun.reflect.DelegatingMethodAccessorImpl.invoke(DelegatingMethodAccessorImpl.java:25)
[junit4:junit4]    > 	at java.lang.reflect.Method.invoke(Method.java:600)
[junit4:junit4]    > 	at com.carrotsearch.randomizedtesting.RandomizedRunner.invoke(RandomizedRunner.java:1995)
[junit4:junit4]    > 	at com.carrotsearch.randomizedtesting.RandomizedRunner.access$1100(RandomizedRunner.java:132)
[junit4:junit4]    > 	at com.carrotsearch.randomizedtesting.RandomizedRunner$5.evaluate(RandomizedRunner.java:754)
[junit4:junit4]    > 	at org.apache.lucene.util.AbstractBeforeAfterRule$1.evaluate(AbstractBeforeAfterRule.java:45)
[junit4:junit4]    > 	at org.apache.lucene.util.TestRuleReportUncaughtExceptions$1.evaluate(TestRuleReportUncaughtExceptions.java:68)
[junit4:junit4]    > 	at org.apache.lucene.util.TestRuleStoreClassName$1.evaluate(TestRuleStoreClassName.java:38)
[junit4:junit4]    > 	at com.carrotsearch.randomizedtesting.rules.SystemPropertiesInvariantRule$1.evaluate(SystemPropertiesInvariantRule.java:55)
[junit4:junit4]    > 	at org.apache.lucene.util.TestRuleNoInstanceHooksOverrides$1.evaluate(TestRuleNoInstanceHooksOverrides.java:53)
[junit4:junit4]    > 	at org.apache.lucene.util.TestRuleNoStaticHooksShadowing$1.evaluate(TestRuleNoStaticHooksShadowing.java:52)
[junit4:junit4]    > 	at org.apache.lucene.util.TestRuleAssertionsRequired$1.evaluate(TestRuleAssertionsRequired.java:36)
[junit4:junit4]    > 	at org.apache.lucene.util.TestRuleMarkFailure$1.evaluate(TestRuleMarkFailure.java:48)
[junit4:junit4]    > 	at org.apache.lucene.util.TestRuleIgnoreAfterMaxFailures$1.evaluate(TestRuleIgnoreAfterMaxFailures.java:70)
[junit4:junit4]    > 	at org.apache.lucene.util.TestRuleIgnoreTestSuites$1.evaluate(TestRuleIgnoreTestSuites.java:55)
[junit4:junit4]    > 	at com.carrotsearch.randomizedtesting.RandomizedRunner.runSuite(RandomizedRunner.java:605)
[junit4:junit4]    > 	at com.carrotsearch.randomizedtesting.RandomizedRunner.access$400(RandomizedRunner.java:132)
[junit4:junit4]    > 	at com.carrotsearch.randomizedtesting.RandomizedRunner$2.run(RandomizedRunner.java:551)
[junit4:junit4]    >
[junit4:junit4] Completed on J1 in 0.05s, 0 tests, 1 failure, 1 error <<< FAILURES!

[...truncated 136 lines...]
[junit4:junit4] Suite: org.apache.lucene.index.TestPerSegmentDeletes
[junit4:junit4] FAILURE 0.02s J1 | TestPerSegmentDeletes.testDeletes1
[junit4:junit4]    > Throwable #1: java.lang.AssertionError
[junit4:junit4]    > 	at __randomizedtesting.SeedInfo.seed([31FFECE3F6ADCAF0:926043D0C3FDE6EB]:0)
[junit4:junit4]    > 	at org.apache.lucene.util.packed.GrowableWriter.ensureCapacity(GrowableWriter.java:70)
[junit4:junit4]    > 	at org.apache.lucene.util.packed.GrowableWriter.set(GrowableWriter.java:83)
[junit4:junit4]    > 	at org.apache.lucene.util.fst.FST.pack(FST.java:1505)
[junit4:junit4]    > 	at org.apache.lucene.codecs.memory.MemoryPostingsFormat$TermsWriter.finish(MemoryPostingsFormat.java:273)
[junit4:junit4]    > 	at org.apache.lucene.codecs.TermsConsumer.merge(TermsConsumer.java:213)
[junit4:junit4]    > 	at org.apache.lucene.codecs.FieldsConsumer.merge(FieldsConsumer.java:65)
[junit4:junit4]    > 	at org.apache.lucene.index.SegmentMerger.mergeTerms(SegmentMerger.java:323)
[junit4:junit4]    > 	at org.apache.lucene.index.SegmentMerger.merge(SegmentMerger.java:110)
[junit4:junit4]    > 	at org.apache.lucene.index.IndexWriter.mergeMiddle(IndexWriter.java:3611)
[junit4:junit4]    > 	at org.apache.lucene.index.IndexWriter.merge(IndexWriter.java:3226)
[junit4:junit4]    > 	at org.apache.lucene.index.SerialMergeScheduler.merge(SerialMergeScheduler.java:36)
[junit4:junit4]    > 	at org.apache.lucene.index.IndexWriter.maybeMerge(IndexWriter.java:1799)
[junit4:junit4]    > 	at org.apache.lucene.index.IndexWriter.maybeMerge(IndexWriter.java:1793)
[junit4:junit4]    > 	at org.apache.lucene.index.TestPerSegmentDeletes.testDeletes1(TestPerSegmentDeletes.java:93)
[junit4:junit4]    > 	at sun.reflect.NativeMethodAccessorImpl.invoke0(Native Method)
[junit4:junit4]    > 	at sun.reflect.NativeMethodAccessorImpl.invoke(NativeMethodAccessorImpl.java:48)
[junit4:junit4]    > 	at sun.reflect.DelegatingMethodAccessorImpl.invoke(DelegatingMethodAccessorImpl.java:25)
[junit4:junit4]    > 	at java.lang.reflect.Method.invoke(Method.java:600)
[junit4:junit4]    > 	at com.carrotsearch.randomizedtesting.RandomizedRunner.invoke(RandomizedRunner.java:1995)
[junit4:junit4]    > 	at com.carrotsearch.randomizedtesting.RandomizedRunner.access$1100(RandomizedRunner.java:132)
[junit4:junit4]    > 	at com.carrotsearch.randomizedtesting.RandomizedRunner$6.evaluate(RandomizedRunner.java:818)
[junit4:junit4]    > 	at com.carrotsearch.randomizedtesting.RandomizedRunner$7.evaluate(RandomizedRunner.java:877)
[junit4:junit4]    > 	at com.carrotsearch.randomizedtesting.RandomizedRunner$8.evaluate(RandomizedRunner.java:891)
[junit4:junit4]    > 	at org.apache.lucene.util.TestRuleSetupTeardownChained$1.evaluate(TestRuleSetupTeardownChained.java:50)
[junit4:junit4]    > 	at org.apache.lucene.util.TestRuleFieldCacheSanity$1.evaluate(TestRuleFieldCacheSanity.java:32)
[junit4:junit4]    > 	at org.apache.lucene.util.AbstractBeforeAfterRule$1.evaluate(AbstractBeforeAfterRule.java:45)
[junit4:junit4]    > 	at com.carrotsearch.randomizedtesting.rules.SystemPropertiesInvariantRule$1.evaluate(SystemPropertiesInvariantRule.java:55)
[junit4:junit4]    > 	at org.apache.lucene.util.TestRuleReportUncaughtExceptions$1.evaluate(TestRuleReportUncaughtExceptions.java:68)
[junit4:junit4]    > 	at org.apache.lucene.util.TestRuleThreadAndTestName$1.evaluate(TestRuleThreadAndTestName.java:48)
[junit4:junit4]    > 	at org.apache.lucene.util.TestRuleIgnoreAfterMaxFailures$1.evaluate(TestRuleIgnoreAfterMaxFailures.java:70)
[junit4:junit4]    > 	at org.apache.lucene.util.TestRuleMarkFailure$1.evaluate(TestRuleMarkFailure.java:48)
[junit4:junit4]    > 	at com.carrotsearch.randomizedtesting.RandomizedRunner.runSingleTest(RandomizedRunner.java:825)
[junit4:junit4]    > 	at com.carrotsearch.randomizedtesting.RandomizedRunner.access$700(RandomizedRunner.java:132)
[junit4:junit4]    > 	at com.carrotsearch.randomizedtesting.RandomizedRunner$3$1.run(RandomizedRunner.java:671)
[junit4:junit4]    > 	at com.carrotsearch.randomizedtesting.RandomizedRunner$3.evaluate(RandomizedRunner.java:697)
[junit4:junit4]    > 	at com.carrotsearch.randomizedtesting.RandomizedRunner$4.evaluate(RandomizedRunner.java:736)
[junit4:junit4]    > 	at com.carrotsearch.randomizedtesting.RandomizedRunner$5.evaluate(RandomizedRunner.java:747)
[junit4:junit4]    > 	at org.apache.lucene.util.AbstractBeforeAfterRule$1.evaluate(AbstractBeforeAfterRule.java:45)
[junit4:junit4]    > 	at org.apache.lucene.util.TestRuleReportUncaughtExceptions$1.evaluate(TestRuleReportUncaughtExceptions.java:68)
[junit4:junit4]    > 	at org.apache.lucene.util.TestRuleStoreClassName$1.evaluate(TestRuleStoreClassName.java:38)
[junit4:junit4]    > 	at com.carrotsearch.randomizedtesting.rules.SystemPropertiesInvariantRule$1.evaluate(SystemPropertiesInvariantRule.java:55)
[junit4:junit4]    > 	at org.apache.lucene.util.TestRuleNoInstanceHooksOverrides$1.evaluate(TestRuleNoInstanceHooksOverrides.java:53)
[junit4:junit4]    > 	at org.apache.lucene.util.TestRuleNoStaticHooksShadowing$1.evaluate(TestRuleNoStaticHooksShadowing.java:52)
[junit4:junit4]    > 	at org.apache.lucene.util.TestRuleAssertionsRequired$1.evaluate(TestRuleAssertionsRequired.java:36)
[junit4:junit4]    > 	at org.apache.lucene.util.TestRuleMarkFailure$1.evaluate(TestRuleMarkFailure.java:48)
[junit4:junit4]    > 	at org.apache.lucene.util.TestRuleIgnoreAfterMaxFailures$1.evaluate(TestRuleIgnoreAfterMaxFailures.java:70)
[junit4:junit4]    > 	at org.apache.lucene.util.TestRuleIgnoreTestSuites$1.evaluate(TestRuleIgnoreTestSuites.java:55)
[junit4:junit4]    > 	at com.carrotsearch.randomizedtesting.RandomizedRunner.runSuite(RandomizedRunner.java:605)
[junit4:junit4]    > 	at com.carrotsearch.randomizedtesting.RandomizedRunner.access$400(RandomizedRunner.java:132)
[junit4:junit4]    > 	at com.carrotsearch.randomizedtesting.RandomizedRunner$2.run(RandomizedRunner.java:551)
[junit4:junit4]    > 
[junit4:junit4]   2> NOTE: reproduce with: ant test  -Dtestcase=TestPerSegmentDeletes -Dtests.method=testDeletes1 -Dtests.seed=31FFECE3F6ADCAF0 -Dtests.multiplier=3 -Dtests.slow=true -Dtests.locale=sr -Dtests.timezone=Canada/Central -Dtests.file.encoding=UTF-8
[junit4:junit4]   2>
[junit4:junit4]    > (@AfterClass output)
[junit4:junit4]   2> NOTE: test params are: codec=Lucene40: {field1=PostingsFormat(name=MockRandom), field2=PostingsFormat(name=Memory doPackFST= true), id=PostingsFormat(name=MockRandom), indexname=PostingsFormat(name=Direct)}, sim=DefaultSimilarity, locale=sr, timezone=Canada/Central
[junit4:junit4]   2> NOTE: Linux 3.2.0-27-generic x86/IBM Corporation 1.6.0 (32-bit)/cpus=8,threads=1,free=42040664,total=63273472
[junit4:junit4]   2> NOTE: All tests run in this JVM: [TestLucene40PostingsReader, TestSimilarityBase, TestDocValuesScoring, TestNRTManager, TestUniqueTermCount, TestCachingCollector, TestDirectory, TestConsistentFieldNumbers, TestSimpleSearchEquivalence, TestNoMergeScheduler, TestDocsAndPositions, TestIntBlockCodec, TestLongPostings, TestFieldValueFilter, TestNoMergePolicy, TestBytesRefHash, TestNumericRangeQuery32, TestFieldsReader, TestPersistentSnapshotDeletionPolicy, TestLookaheadTokenFilter, TestConjunctions, TestDocumentsWriterStallControl, TestField, TestAutomatonQuery, TestNumericRangeQuery64, TestSegmentTermDocs, TestPayloads, TestTopScoreDocCollector, TestAttributeSource, TestNRTReaderWithThreads, TestHugeRamFile, TestReuseDocsEnum, Before3, Before3, TestNeverDelete, TestDateFilter, TestDocValuesTypeCompatibility, TestPerFieldPostingsFormat, TestVirtualMethod, TestComplexExplanations, TestMultiLevelSkipList, TestLock, TestSameTokenSamePosition, TestDateTools, TestSentinelIntSet, TestSimilarity, TestNearSpansOrdered, TestIntsRef, TestDocTermOrds, TestSegmentMerger, TestSimilarity2, TestIndexWriterConfig, TestSegmentTermEnum, TestFSTs, TestIOUtils, TestPayloadSpans, TestStressAdvance, TestCollectionUtil, TestMockAnalyzer, TestBinaryDocument, TestMinimize, TestComplexExplanationsOfNonMatches, TestTypePromotion, TestIndexWriterMerging, TestFieldMaskingSpanQuery, TestRecyclingByteBlockAllocator, TestBinaryTerms, TestMultiThreadTermVectors, TestExplanations, TestAddIndexes, TestLockFactory, TestNumericTokenStream, TestMultiValuedNumericRangeQuery, TestOmitPositions, TestDocumentsWriterDeleteQueue, TestIndexInput, TestSpanMultiTermQueryWrapper, TestStressIndexing, TestGraphTokenizers, TestBasics, TestByteSlices, TestAtomicUpdate, TestIndexWriter, TestSearchAfter, TestIndexWriterDelete, TestBufferedIndexInput, TestDirectoryReader, TestFixedBitSet, TestTieredMergePolicy, TestConcurrentMergeScheduler, TestSloppyPhraseQuery2, TestStressNRT, TestNumericUtils, TestLevenshteinAutomata, TestDeterminism, TestCharTermAttributeImpl, TestOmitNorms, TestRollingUpdates, TestBitVector, TestTransactions, TestPrefixInBooleanQuery, TestFieldCache, TestRamUsageEstimatorOnWildAnimals, TestCodecs, TestMixedCodecs, TestPayloadProcessorProvider, Nested, Nested, Nested, Nested, Nested, Nested, Nested, Nested, Nested, Nested, Nested, Nested, Nested, Nested, Nested, Nested, Nested, Nested, Nested, Nested, Nested, TestPayloadNearQuery, TestPrefixRandom, TestTermVectorsWriter, TestTransactionRollback, TestForTooMuchCloning, TestCompiledAutomaton, TestMultiFields, Nested1, Nested2, Nested3, TestBooleanQuery, TestFuzzyQuery, TestRollingBuffer, TestIdentityHashSet, TestCheckIndex, TestSumDocFreq, TestPerSegmentDeletes]
[junit4:junit4]   2> 
[junit4:junit4] Completed on J1 in 0.03s, 1 test, 1 failure <<< FAILURES!

[...truncated 179 lines...]
BUILD FAILED
/mnt/ssd/jenkins/workspace/Lucene-Solr-trunk-Linux/checkout/build.xml:29: The following error occurred while executing this line:
/mnt/ssd/jenkins/workspace/Lucene-Solr-trunk-Linux/checkout/lucene/build.xml:49: The following error occurred while executing this line:
/mnt/ssd/jenkins/workspace/Lucene-Solr-trunk-Linux/checkout/lucene/common-build.xml:1095: The following error occurred while executing this line:
/mnt/ssd/jenkins/workspace/Lucene-Solr-trunk-Linux/checkout/lucene/common-build.xml:790: There were test failures: 307 suites, 1743 tests, 2 suite-level errors, 5 failures, 15 ignored (13 assumptions)

Total time: 5 minutes 53 seconds
Build step 'Execute shell' marked build as failure
Archiving artifacts
Recording test results
Email was triggered for: Failure
Sending email for trigger: Failure



Mime
View raw message