lucene-dev mailing list archives

Site index · List index
Message view « Date » · « Thread »
Top « Date » · « Thread »
From Policeman Jenkins Server <jenk...@sd-datasolutions.de>
Subject [JENKINS] Lucene-Solr-trunk-Linux (32bit/ibm-j9-jdk7) - Build # 431 - Still Failing!
Date Tue, 14 Aug 2012 02:20:13 GMT
Build: http://jenkins.sd-datasolutions.de/job/Lucene-Solr-trunk-Linux/431/
Java: 32bit/ibm-j9-jdk7 

2 tests failed.
FAILED:  junit.framework.TestSuite.org.apache.solr.MinimalSchemaTest

Error Message:
1 thread leaked from SUITE scope at org.apache.solr.MinimalSchemaTest:     1) Thread[id=2577,
name=process reaper, state=TIMED_WAITING, group=TGRP-MinimalSchemaTest]         at sun.misc.Unsafe.park(Native
Method)         at java.util.concurrent.locks.LockSupport.parkNanos(LockSupport.java:237)
        at java.util.concurrent.SynchronousQueue$TransferStack.awaitFulfill(SynchronousQueue.java:471)
        at java.util.concurrent.SynchronousQueue$TransferStack.transfer(SynchronousQueue.java:370)
        at java.util.concurrent.SynchronousQueue.poll(SynchronousQueue.java:953)         at
java.util.concurrent.ThreadPoolExecutor.getTask(ThreadPoolExecutor.java:1054)         at java.util.concurrent.ThreadPoolExecutor.runWorker(ThreadPoolExecutor.java:1114)
        at java.util.concurrent.ThreadPoolExecutor$Worker.run(ThreadPoolExecutor.java:614)
        at java.lang.Thread.run(Thread.java:777)

Stack Trace:
com.carrotsearch.randomizedtesting.ThreadLeakError: 1 thread leaked from SUITE scope at org.apache.solr.MinimalSchemaTest:

   1) Thread[id=2577, name=process reaper, state=TIMED_WAITING, group=TGRP-MinimalSchemaTest]
        at sun.misc.Unsafe.park(Native Method)
        at java.util.concurrent.locks.LockSupport.parkNanos(LockSupport.java:237)
        at java.util.concurrent.SynchronousQueue$TransferStack.awaitFulfill(SynchronousQueue.java:471)
        at java.util.concurrent.SynchronousQueue$TransferStack.transfer(SynchronousQueue.java:370)
        at java.util.concurrent.SynchronousQueue.poll(SynchronousQueue.java:953)
        at java.util.concurrent.ThreadPoolExecutor.getTask(ThreadPoolExecutor.java:1054)
        at java.util.concurrent.ThreadPoolExecutor.runWorker(ThreadPoolExecutor.java:1114)
        at java.util.concurrent.ThreadPoolExecutor$Worker.run(ThreadPoolExecutor.java:614)
        at java.lang.Thread.run(Thread.java:777)
	at __randomizedtesting.SeedInfo.seed([DFC68E363411F2C8]:0)


FAILED:  junit.framework.TestSuite.org.apache.solr.MinimalSchemaTest

Error Message:
There are still zombie threads that couldn't be terminated:    1) Thread[id=2577, name=process
reaper, state=TIMED_WAITING, group=TGRP-MinimalSchemaTest]         at sun.misc.Unsafe.park(Native
Method)         at java.util.concurrent.locks.LockSupport.parkNanos(LockSupport.java:237)
        at java.util.concurrent.SynchronousQueue$TransferStack.awaitFulfill(SynchronousQueue.java:471)
        at java.util.concurrent.SynchronousQueue$TransferStack.transfer(SynchronousQueue.java:370)
        at java.util.concurrent.SynchronousQueue.poll(SynchronousQueue.java:953)         at
java.util.concurrent.ThreadPoolExecutor.getTask(ThreadPoolExecutor.java:1054)         at java.util.concurrent.ThreadPoolExecutor.runWorker(ThreadPoolExecutor.java:1114)
        at java.util.concurrent.ThreadPoolExecutor$Worker.run(ThreadPoolExecutor.java:614)
        at java.lang.Thread.run(Thread.java:777)

Stack Trace:
com.carrotsearch.randomizedtesting.ThreadLeakError: There are still zombie threads that couldn't
be terminated:
   1) Thread[id=2577, name=process reaper, state=TIMED_WAITING, group=TGRP-MinimalSchemaTest]
        at sun.misc.Unsafe.park(Native Method)
        at java.util.concurrent.locks.LockSupport.parkNanos(LockSupport.java:237)
        at java.util.concurrent.SynchronousQueue$TransferStack.awaitFulfill(SynchronousQueue.java:471)
        at java.util.concurrent.SynchronousQueue$TransferStack.transfer(SynchronousQueue.java:370)
        at java.util.concurrent.SynchronousQueue.poll(SynchronousQueue.java:953)
        at java.util.concurrent.ThreadPoolExecutor.getTask(ThreadPoolExecutor.java:1054)
        at java.util.concurrent.ThreadPoolExecutor.runWorker(ThreadPoolExecutor.java:1114)
        at java.util.concurrent.ThreadPoolExecutor$Worker.run(ThreadPoolExecutor.java:614)
        at java.lang.Thread.run(Thread.java:777)
	at __randomizedtesting.SeedInfo.seed([DFC68E363411F2C8]:0)




Build Log:
[...truncated 7593 lines...]
[junit4:junit4] Suite: org.apache.solr.MinimalSchemaTest
[junit4:junit4]   2> 1 T2575 oas.SolrTestCaseJ4.initCore ####initCore
[junit4:junit4]   2> Creating dataDir: /mnt/ssd/jenkins/workspace/Lucene-Solr-trunk-Linux/solr/build/solr-core/test/J1/./solrtest-MinimalSchemaTest-1344910733549
[junit4:junit4]   2> 1 T2575 oasc.SolrResourceLoader.<init> new SolrResourceLoader
for directory: '/mnt/ssd/jenkins/workspace/Lucene-Solr-trunk-Linux/solr/build/solr-core/test-files/solr/collection1/'
[junit4:junit4]   2> 1 T2575 oasc.SolrResourceLoader.replaceClassLoader Adding 'file:/mnt/ssd/jenkins/workspace/Lucene-Solr-trunk-Linux/solr/build/solr-core/test-files/solr/collection1/lib/README'
to classloader
[junit4:junit4]   2> 2 T2575 oasc.SolrResourceLoader.replaceClassLoader Adding 'file:/mnt/ssd/jenkins/workspace/Lucene-Solr-trunk-Linux/solr/build/solr-core/test-files/solr/collection1/lib/classes/'
to classloader
[junit4:junit4]   2> 19 T2575 oasc.SolrConfig.<init> Using Lucene MatchVersion: LUCENE_50
[junit4:junit4]   2> 44 T2575 oasc.SolrConfig.<init> Loaded SolrConfig: solr/collection1/conf/solrconfig.xml
[junit4:junit4]   2> 44 T2575 oass.IndexSchema.readSchema Reading Solr Schema
[junit4:junit4]   2> 46 T2575 oass.IndexSchema.readSchema Schema name=minimal
[junit4:junit4]   2> 50 T2575 oass.IndexSchema.readSchema WARNING no uniqueKey specified
in schema.
[junit4:junit4]   2> 51 T2575 oasc.SolrResourceLoader.locateSolrHome JNDI not configured
for solr (NoInitialContextEx)
[junit4:junit4]   2> 51 T2575 oasc.SolrResourceLoader.locateSolrHome using system property
solr.solr.home: /mnt/ssd/jenkins/workspace/Lucene-Solr-trunk-Linux/solr/build/solr-core/test-files/solr
[junit4:junit4]   2> 51 T2575 oasc.SolrResourceLoader.<init> new SolrResourceLoader
for directory: '/mnt/ssd/jenkins/workspace/Lucene-Solr-trunk-Linux/solr/build/solr-core/test-files/solr/'
[junit4:junit4]   2> 55 T2575 oasc.CoreContainer.<init> New CoreContainer -111488641
[junit4:junit4]   2> 56 T2575 oasc.SolrCore.<init> [collection1] Opening new SolrCore
at /mnt/ssd/jenkins/workspace/Lucene-Solr-trunk-Linux/solr/build/solr-core/test-files/solr/collection1/,
dataDir=/mnt/ssd/jenkins/workspace/Lucene-Solr-trunk-Linux/solr/build/solr-core/test/J1/./solrtest-MinimalSchemaTest-1344910733549/
[junit4:junit4]   2> 56 T2575 oasc.JmxMonitoredMap.<init> JMX monitoring is enabled.
Adding Solr mbeans to JMX Server: com.sun.jmx.mbeanserver.JmxMBeanServer@3741c0bd
[junit4:junit4]   2> 56 T2575 oasc.SolrCore.getNewIndexDir WARNING New index directory
detected: old=null new=/mnt/ssd/jenkins/workspace/Lucene-Solr-trunk-Linux/solr/build/solr-core/test/J1/./solrtest-MinimalSchemaTest-1344910733549/index/
[junit4:junit4]   2> 56 T2575 oasc.SolrCore.initIndex WARNING [collection1] Solr index
directory '/mnt/ssd/jenkins/workspace/Lucene-Solr-trunk-Linux/solr/build/solr-core/test/J1/./solrtest-MinimalSchemaTest-1344910733549/index'
doesn't exist. Creating new index...
[junit4:junit4]   2> 57 T2575 oasc.SolrDeletionPolicy.onCommit SolrDeletionPolicy.onCommit:
commits:num=1
[junit4:junit4]   2> 		commit{dir=MockDirWrapper(org.apache.lucene.store.RAMDirectory@811624c2
lockFactory=org.apache.lucene.store.SingleInstanceLockFactory@b5400425),segFN=segments_1,generation=1,filenames=[segments_1]
[junit4:junit4]   2> 57 T2575 oasc.SolrDeletionPolicy.updateCommits newest commit = 1
[junit4:junit4]   2> 58 T2575 oasc.SolrCore.initWriters created xml: solr.XMLResponseWriter
[junit4:junit4]   2> 58 T2575 oasup.UpdateRequestProcessorChain.init inserting DistributedUpdateProcessorFactory
into updateRequestProcessorChain "dedupe"
[junit4:junit4]   2> 59 T2575 oasup.UpdateRequestProcessorChain.init inserting DistributedUpdateProcessorFactory
into updateRequestProcessorChain "dedupe-allfields"
[junit4:junit4]   2> 59 T2575 oasup.UpdateRequestProcessorChain.init inserting DistributedUpdateProcessorFactory
into updateRequestProcessorChain "stored_sig"
[junit4:junit4]   2> 59 T2575 oasup.UpdateRequestProcessorChain.init inserting DistributedUpdateProcessorFactory
into updateRequestProcessorChain "uniq-fields"
[junit4:junit4]   2> 60 T2575 oasup.UpdateRequestProcessorChain.init inserting DistributedUpdateProcessorFactory
into updateRequestProcessorChain "distrib-dup-test-chain-implicit"
[junit4:junit4]   2> 60 T2575 oasc.RequestHandlers.initHandlersFromConfig adding lazy requestHandler:
solr.ReplicationHandler
[junit4:junit4]   2> 60 T2575 oasc.RequestHandlers.initHandlersFromConfig created /replication:
solr.ReplicationHandler
[junit4:junit4]   2> 60 T2575 oasc.RequestHandlers.initHandlersFromConfig created standard:
solr.StandardRequestHandler
[junit4:junit4]   2> 61 T2575 oasc.RequestHandlers.initHandlersFromConfig created /get:
solr.RealTimeGetHandler
[junit4:junit4]   2> 61 T2575 oasc.RequestHandlers.initHandlersFromConfig created dismax:
solr.SearchHandler
[junit4:junit4]   2> 61 T2575 oasc.RequestHandlers.initHandlersFromConfig created mock:
org.apache.solr.core.MockQuerySenderListenerReqHandler
[junit4:junit4]   2> 61 T2575 oasc.RequestHandlers.initHandlersFromConfig created /admin/:
org.apache.solr.handler.admin.AdminHandlers
[junit4:junit4]   2> 62 T2575 oasc.RequestHandlers.initHandlersFromConfig created defaults:
solr.StandardRequestHandler
[junit4:junit4]   2> 62 T2575 oasc.RequestHandlers.initHandlersFromConfig adding lazy requestHandler:
solr.StandardRequestHandler
[junit4:junit4]   2> 62 T2575 oasc.RequestHandlers.initHandlersFromConfig created lazy:
solr.StandardRequestHandler
[junit4:junit4]   2> 62 T2575 oasc.RequestHandlers.initHandlersFromConfig created /update:
solr.UpdateRequestHandler
[junit4:junit4]   2> 63 T2575 oasc.RequestHandlers.initHandlersFromConfig created /terms:
org.apache.solr.handler.component.SearchHandler
[junit4:junit4]   2> 63 T2575 oasc.RequestHandlers.initHandlersFromConfig created spellCheckCompRH:
org.apache.solr.handler.component.SearchHandler
[junit4:junit4]   2> 63 T2575 oasc.RequestHandlers.initHandlersFromConfig created spellCheckCompRH_Direct:
org.apache.solr.handler.component.SearchHandler
[junit4:junit4]   2> 63 T2575 oasc.RequestHandlers.initHandlersFromConfig created spellCheckWithWordbreak:
org.apache.solr.handler.component.SearchHandler
[junit4:junit4]   2> 64 T2575 oasc.RequestHandlers.initHandlersFromConfig created spellCheckWithWordbreak_Direct:
org.apache.solr.handler.component.SearchHandler
[junit4:junit4]   2> 64 T2575 oasc.RequestHandlers.initHandlersFromConfig created spellCheckCompRH1:
org.apache.solr.handler.component.SearchHandler
[junit4:junit4]   2> 64 T2575 oasc.RequestHandlers.initHandlersFromConfig created tvrh:
org.apache.solr.handler.component.SearchHandler
[junit4:junit4]   2> 64 T2575 oasc.RequestHandlers.initHandlersFromConfig created /mlt:
solr.MoreLikeThisHandler
[junit4:junit4]   2> 65 T2575 oasc.RequestHandlers.initHandlersFromConfig created /debug/dump:
solr.DumpRequestHandler
[junit4:junit4]   2> 65 T2575 oashl.XMLLoader.init xsltCacheLifetimeSeconds=60
[junit4:junit4]   2> 66 T2575 oasc.SolrCore.initDeprecatedSupport WARNING solrconfig.xml
uses deprecated <admin/gettableFiles>, Please update your config to use the ShowFileRequestHandler.
[junit4:junit4]   2> 67 T2575 oasc.SolrCore.initDeprecatedSupport WARNING adding ShowFileRequestHandler
with hidden files: [BAD-SCHEMA-NOT-INDEXED-BUT-TF.XML, SCHEMA-REQUIRED-FIELDS.XML, SOLRCONFIG-MASTER1-KEEPONEBACKUP.XML,
BAD-SCHEMA-NONTEXT-ANALYZER.XML, SOLRCONFIG-PROPINJECT.XML, SOLRCONFIG-PROPINJECT-INDEXDEFAULT.XML,
STOP-2.TXT, SCHEMA11.XML, BAD-SCHEMA-UNIQUEKEY-USES-DEFAULT.XML, SCHEMA15.XML, SOLRCONFIG-NATIVELOCK.XML,
SCHEMA-SIM.XML, CONDITIONAL.UPDATEPROCESSOR.JS, BAD-SOLRCONFIG-MISSING-SCRIPTFILE.XML, SOLRCONFIG-SCRIPT-UPDATEPROCESSOR.XML,
SOLRCONFIG-REPEATER.XML, SOLRCONFIG-SPELLCHECKER.XML, SOLRCONFIG-NOCACHE.XML, SCHEMA-CHARFILTERS.XML,
SOLRCONFIG-SOLCOREPROPERTIES.XML, SOLRCONFIG_CODEC.XML, BAD-SCHEMA-EXTERNAL-FILEFIELD.XML,
HYPHENATION.DTD, SCHEMA.XML, SOLRCONFIG-MERGEPOLICY.XML, TRIVIAL.UPDATEPROCESSOR1.JS, SOLRCONFIG-PHRASESUGGEST.XML,
SOLRCONFIG-SLAVE1.XML, SOLRCONFIG-BASIC.XML, SCHEMA-LMJELINEKMERCER.XML, BAD-MP-SOLRCONFIG.XML,
BAD-SCHEMA-DUP-FIELD.XML, BAD-SCHEMA-UNIQUEKEY-MULTIVALUED.XML, SOLRCONFIG-MASTER.XML, SOLRCONFIG-HIGHLIGHT.XML,
SCHEMA-TFIDF.XML, SCHEMA-REPLICATION1.XML, SYNONYMS.TXT, SOLRCONFIG-ELEVATE.XML, STOPWITHBOM.TXT,
SOLRCONFIG-QUERYSENDER.XML, WDFTYPES.TXT, SOLRCONFIG-DELPOLICY1.XML, BAD_SOLRCONFIG.XML, HUNSPELL-TEST.DIC,
SCHEMA-NUMERIC.XML, SCHEMA-LUCENEMATCHVERSION.XML, KEEP-2.TXT, SCHEMA-STOP-KEEP.XML, SCHEMA-IB.XML,
STOP-SNOWBALL.TXT, SOLRCONFIG-SLAVE.XML, BAD-SCHEMA-NOT-INDEXED-BUT-NORMS.XML, STOPWORDSWRONGENCODING.TXT,
THROW.ERROR.ON.ADD.UPDATEPROCESSOR.JS, SOLRCONFIG-SPELLCHECKCOMPONENT.XML, STOPTYPES-1.TXT,
SOLRCONFIG-TLOG.XML, COMPOUNDDICTIONARY.TXT, DA_COMPOUNDDICTIONARY.TXT, SOLRCONFIG-TERMINDEX.XML,
BAD-SOLRCONFIG-INVALID-SCRIPTFILE.XML, SCHEMASURROUND.XML, OPEN-EXCHANGE-RATES.JSON, BAD-SCHEMA-DUP-FIELDTYPE.XML,
PHRASESUGGEST.TXT, SOLRCONFIG-MASTER2.XML, OLD_SYNONYMS.TXT, BAD-SCHEMA-UNIQUEKEY-IS-COPYFIELD-DEST.XML,
SCHEMA-NOT-REQUIRED-UNIQUE-KEY.XML, BAD-SCHEMA-CODEC-GLOBAL-VS-FT-MISMATCH.XML, SCHEMA-LMDIRICHLET.XML,
SCHEMA-REVERSED.XML, BAD-SCHEMA-NOT-INDEXED-BUT-POS.XML, SCHEMA-FOLDING.XML, SOLRCONFIG-CACHING.XML,
MAPPING-ISOLATIN1ACCENT.TXT, ADDFIELDS.UPDATEPROCESSOR.JS, SCHEMA-BM25.XML, STOP-1.TXT, SOLRCONFIG-ENABLEPLUGIN.XML,
MISSING.FUNCTIONS.UPDATEPROCESSOR.JS, SCHEMA12.XML, SOLRCONFIG-TRANSFORMERS.XML, SCHEMA-COPYFIELD-TEST.XML,
BAD-SCHEMA-DUP-DYNAMICFIELD.XML, CURRENCY.XML, DA_UTF8.XML, MISSLEADING.EXTENSION.UPDATEPROCESSOR.JS.TXT,
SOLRCONFIG-SOLR-749.XML, STOPWORDS.TXT, HUNSPELL-TEST.AFF, SOLRCONFIG_PERF.XML, SOLRCONFIG-SIMPLELOCK.XML,
FRENCHARTICLES.TXT, SOLRCONFIG-LAZYWRITER.XML, SCHEMA-REPLICATION2.XML, SOLRCONFIG-XINCLUDE.XML,
SCHEMA-SPELLCHECKER.XML, XSLT, SOLRCONFIG-DELPOLICY2.XML, TRIVIAL.UPDATEPROCESSOR0.JS, KEEP-1.TXT,
SCHEMA-TRIE.XML, SCHEMA-BINARYFIELD.XML, BAD-SCHEMA-OMIT-TF-BUT-NOT-POS.XML, SCHEMA-MINIMAL.XML,
STOPTYPES-2.TXT, STEMDICT.TXT, SCHEMA_CODEC.XML, ELEVATE.XML, SCHEMA-COLLATE.XML, PROTWORDS.TXT,
SOLRCONFIG-REQHANDLER.INCL, SCHEMA-PHRASESUGGEST.XML, SCHEMA-DFR.XML, BAD-SCHEMA-ANALYZER-CLASS-AND-NESTED.XML,
SOLRCONFIG-MASTER1.XML, SOLRCONFIG-FUNCTIONQUERY.XML, SOLRCONFIG-MASTER3.XML, SOLRCONFIG-UPDATE-PROCESSOR-CHAINS.XML,
SOLRCONFIG-ALTDIRECTORY.XML, BAD-SCHEMA-SIM-GLOBAL-VS-FT-MISMATCH.XML, SOLRCONFIG-QUERYSENDER-NOQUERY.XML,
BAD-SOLRCONFIG-BOGUS-SCRIPTENGINE-NAME.XML]
[junit4:junit4]   2> 68 T2575 oass.SolrIndexSearcher.<init> Opening Searcher@b24d3d60
main
[junit4:junit4]   2> 68 T2575 oass.SolrIndexSearcher.getIndexDir WARNING WARNING: Directory
impl does not support setting indexDir: org.apache.lucene.store.MockDirectoryWrapper
[junit4:junit4]   2> 68 T2575 oasu.CommitTracker.<init> Hard AutoCommit: disabled
[junit4:junit4]   2> 69 T2575 oasu.CommitTracker.<init> Soft AutoCommit: disabled
[junit4:junit4]   2> 69 T2575 oashc.SpellCheckComponent.inform Initializing spell checkers
[junit4:junit4]   2> 161 T2575 oass.DirectSolrSpellChecker.init init: {name=direct,classname=DirectSolrSpellChecker,field=lowerfilt,minQueryLength=3}
[junit4:junit4]   2> 171 T2575 oashc.HttpShardHandlerFactory.getParameter Setting socketTimeout
to: 0
[junit4:junit4]   2> 171 T2575 oashc.HttpShardHandlerFactory.getParameter Setting urlScheme
to: http://
[junit4:junit4]   2> 172 T2575 oashc.HttpShardHandlerFactory.getParameter Setting connTimeout
to: 0
[junit4:junit4]   2> 172 T2575 oashc.HttpShardHandlerFactory.getParameter Setting maxConnectionsPerHost
to: 20
[junit4:junit4]   2> 172 T2575 oashc.HttpShardHandlerFactory.getParameter Setting corePoolSize
to: 0
[junit4:junit4]   2> 172 T2575 oashc.HttpShardHandlerFactory.getParameter Setting maximumPoolSize
to: 2147483647
[junit4:junit4]   2> 172 T2575 oashc.HttpShardHandlerFactory.getParameter Setting maxThreadIdleTime
to: 5
[junit4:junit4]   2> 173 T2575 oashc.HttpShardHandlerFactory.getParameter Setting sizeOfQueue
to: -1
[junit4:junit4]   2> 173 T2575 oashc.HttpShardHandlerFactory.getParameter Setting fairnessPolicy
to: false
[junit4:junit4]   2> 173 T2575 oascsi.HttpClientUtil.createClient Creating new http client,
config:maxConnectionsPerHost=20&maxConnections=10000&socketTimeout=0&connTimeout=0&retry=false
[junit4:junit4]   2> 185 T2576 oasc.SolrCore.registerSearcher [collection1] Registered
new searcher Searcher@b24d3d60 main{StandardDirectoryReader(segments_1:1)}
[junit4:junit4]   2> 186 T2575 oasc.CoreContainer.register registering core: collection1
[junit4:junit4]   2> 186 T2575 oas.SolrTestCaseJ4.initCore ####initCore end
[junit4:junit4]   2> ASYNC  NEW_CORE C173 name=collection1 org.apache.solr.core.SolrCore@445cc560
[junit4:junit4]   2> 189 T2575 C173 oasc.SolrDeletionPolicy.onInit SolrDeletionPolicy.onInit:
commits:num=1
[junit4:junit4]   2> 		commit{dir=MockDirWrapper(org.apache.lucene.store.RAMDirectory@811624c2
lockFactory=org.apache.lucene.store.SingleInstanceLockFactory@b5400425),segFN=segments_1,generation=1,filenames=[segments_1]
[junit4:junit4]   2> 189 T2575 C173 oasc.SolrDeletionPolicy.updateCommits newest commit
= 1
[junit4:junit4]   2> 190 T2575 C173 UPDATE [collection1] webapp=null path=null params={}
{add=[(null)]} 0 2
[junit4:junit4]   2> 195 T2575 C173 UPDATE [collection1] webapp=null path=null params={}
{add=[(null)]} 0 0
[junit4:junit4]   2> 197 T2575 C173 oasu.DirectUpdateHandler2.commit start commit{flags=0,_version_=0,optimize=false,openSearcher=true,waitSearcher=true,expungeDeletes=false,softCommit=false}
[junit4:junit4]   2> 198 T2575 C173 oasc.SolrDeletionPolicy.onCommit SolrDeletionPolicy.onCommit:
commits:num=2
[junit4:junit4]   2> 		commit{dir=MockDirWrapper(org.apache.lucene.store.RAMDirectory@811624c2
lockFactory=org.apache.lucene.store.SingleInstanceLockFactory@b5400425),segFN=segments_1,generation=1,filenames=[segments_1]
[junit4:junit4]   2> 		commit{dir=MockDirWrapper(org.apache.lucene.store.RAMDirectory@811624c2
lockFactory=org.apache.lucene.store.SingleInstanceLockFactory@b5400425),segFN=segments_2,generation=2,filenames=[_0_Memory_0.ram,
_0.si, segments_2, _0_Asserting_0.frq, _0_Asserting_0.prx, _0.fnm, _0.fdt, _0_Asserting_0.tim,
_0_Asserting_0.tip, _0.fdx, _0_nrm.cfs, _0_nrm.cfe]
[junit4:junit4]   2> 198 T2575 C173 oasc.SolrDeletionPolicy.updateCommits newest commit
= 2
[junit4:junit4]   2> 199 T2575 C173 oass.SolrIndexSearcher.<init> Opening Searcher@1b2abba4
main
[junit4:junit4]   2> 199 T2575 C173 oass.SolrIndexSearcher.getIndexDir WARNING WARNING:
Directory impl does not support setting indexDir: org.apache.lucene.store.MockDirectoryWrapper
[junit4:junit4]   2> 200 T2575 C173 oasu.DirectUpdateHandler2.commit end_commit_flush
[junit4:junit4]   2> 200 T2576 oasc.SolrCore.registerSearcher [collection1] Registered
new searcher Searcher@1b2abba4 main{StandardDirectoryReader(segments_2:3 _0(5.0):C2)}
[junit4:junit4]   2> 201 T2575 C173 UPDATE [collection1] webapp=null path=null params={}
{commit=} 0 4
[junit4:junit4]   2> 204 T2575 C173 oasu.DirectUpdateHandler2.commit start commit{flags=0,_version_=0,optimize=true,openSearcher=true,waitSearcher=true,expungeDeletes=false,softCommit=false}
[junit4:junit4]   2> 204 T2575 C173 oass.SolrIndexSearcher.<init> Opening Searcher@3bc4d0db
main
[junit4:junit4]   2> 204 T2575 C173 oass.SolrIndexSearcher.getIndexDir WARNING WARNING:
Directory impl does not support setting indexDir: org.apache.lucene.store.MockDirectoryWrapper
[junit4:junit4]   2> 205 T2575 C173 oasu.DirectUpdateHandler2.commit end_commit_flush
[junit4:junit4]   2> 205 T2576 oasc.SolrCore.registerSearcher [collection1] Registered
new searcher Searcher@3bc4d0db main{StandardDirectoryReader(segments_2:3 _0(5.0):C2)}
[junit4:junit4]   2> 205 T2575 C173 UPDATE [collection1] webapp=null path=null params={}
{optimize=} 0 2
[junit4:junit4]   2> 208 T2575 oas.SolrTestCaseJ4.setUp ###Starting testAllConfiguredHandlers
[junit4:junit4]   2> 213 T2575 C173 REQ [collection1] webapp=null path=null params={q=foo:bar&qt=/admin/logging&omitHeader=false}
status=0 QTime=5 
[junit4:junit4]   2> 216 T2575 C173 REQ [collection1] webapp=null path=null params={q=foo:bar&qt=/admin/plugins&omitHeader=false}
status=0 QTime=1 
[junit4:junit4]   2> 302 T2575 C173 REQ [collection1] webapp=null path=null params={q=foo:bar&qt=/admin/system&omitHeader=false}
status=0 QTime=85 
[junit4:junit4]   2> 303 T2575 C173 REQ [collection1] webapp=null path=null params={q=foo:bar&qt=spellCheckWithWordbreak_Direct&omitHeader=false}
hits=0 status=0 QTime=0 
[junit4:junit4]   2> 305 T2575 C173 REQ [collection1] webapp=null path=null params={q=foo:bar&qt=/admin/file&omitHeader=false}
status=0 QTime=1 
[junit4:junit4]   2> 305 T2575 C173 REQ [collection1] webapp=null path=null params={q=foo:bar&qt=mock&omitHeader=false}
status=0 QTime=0 
[junit4:junit4]   2> 306 T2575 C173 REQ [collection1] webapp=null path=null params={q=foo:bar&qt=spellCheckCompRH1&omitHeader=false}
hits=0 status=0 QTime=0 
[junit4:junit4]   2> 307 T2575 C173 REQ [collection1] webapp=null path=null params={q=foo:bar&qt=spellCheckWithWordbreak&omitHeader=false}
hits=0 status=0 QTime=0 
[junit4:junit4]   2> 308 T2575 C173 REQ [collection1] webapp=null path=null params={q=foo:bar&qt=/admin/luke&omitHeader=false}
status=0 QTime=1 
[junit4:junit4]   2> 309 T2575 C173 REQ [collection1] webapp=null path=null params={q=foo:bar&qt=defaults&omitHeader=false}
hits=0 status=0 QTime=0 
[junit4:junit4]   2> 309 T2575 C173 REQ [collection1] webapp=null path=null params={q=foo:bar&qt=/terms&omitHeader=false}
status=0 QTime=0 
[junit4:junit4]   2> 310 T2575 C173 REQ [collection1] webapp=null path=null params={q=foo:bar&qt=&omitHeader=false}
hits=0 status=0 QTime=0 
[junit4:junit4]   2> 318 T2575 C173 REQ [collection1] webapp=null path=null params={q=foo:bar&qt=/admin/threads&omitHeader=false}
status=0 QTime=7 
[junit4:junit4]   2> 320 T2575 C173 REQ [collection1] webapp=null path=null params={q=foo:bar&qt=spellCheckCompRH_Direct&omitHeader=false}
hits=0 status=0 QTime=0 
[junit4:junit4]   2> 321 T2575 C173 oash.ReplicationHandler.inform Commits will be reserved
for  10000
[junit4:junit4]   2> 321 T2575 C173 REQ [collection1] webapp=null path=null params={q=foo:bar&qt=/replication&omitHeader=false}
status=0 QTime=0 
[junit4:junit4]   2> 322 T2575 C173 REQ [collection1] webapp=null path=null params={q=foo:bar&qt=lazy&omitHeader=false}
hits=0 status=0 QTime=0 
[junit4:junit4]   2> 323 T2575 C173 REQ [collection1] webapp=null path=null params={q=foo:bar&qt=/admin/mbeans&omitHeader=false}
status=0 QTime=0 
[junit4:junit4]   2> 325 T2575 C173 REQ [collection1] webapp=null path=null params={q=foo:bar&qt=dismax&omitHeader=false}
hits=0 status=0 QTime=0 
[junit4:junit4]   2> 326 T2575 C173 REQ [collection1] webapp=null path=null params={q=foo:bar&qt=/get&omitHeader=false}
status=0 QTime=0 
[junit4:junit4]   2> 326 T2575 C173 REQ [collection1] webapp=null path=null params={q=foo:bar&qt=spellCheckCompRH&omitHeader=false}
hits=0 status=0 QTime=0 
[junit4:junit4]   2> 327 T2575 C173 REQ [collection1] webapp=null path=null params={q=foo:bar&qt=standard&omitHeader=false}
hits=0 status=0 QTime=0 
[junit4:junit4]   2> 328 T2575 C173 REQ [collection1] webapp=null path=null params={q=foo:bar&qt=/admin/properties&omitHeader=false}
status=0 QTime=0 
[junit4:junit4]   2> 329 T2575 C173 REQ [collection1] webapp=null path=null params={q=foo:bar&qt=tvrh&omitHeader=false}
hits=0 status=0 QTime=0 
[junit4:junit4]   2> 330 T2575 C173 REQ [collection1] webapp=null path=null params={q=foo:bar&qt=/debug/dump&omitHeader=false}
status=0 QTime=0 
[junit4:junit4]   2> 330 T2575 oas.SolrTestCaseJ4.tearDown ###Ending testAllConfiguredHandlers
[junit4:junit4]   2> 333 T2575 oas.SolrTestCaseJ4.setUp ###Starting testLuke
[junit4:junit4]   2> 333 T2575 C173 REQ [collection1] webapp=null path=null params={qt=/admin/luke}
status=0 QTime=0 
[junit4:junit4]   2> 335 T2575 C173 REQ [collection1] webapp=null path=null params={qt=/admin/luke&show=schema}
status=0 QTime=1 
[junit4:junit4]   2> 336 T2575 oas.SolrTestCaseJ4.tearDown ###Ending testLuke
[junit4:junit4]   2> 338 T2575 oas.SolrTestCaseJ4.setUp ###Starting testSimpleQueries
[junit4:junit4]   2> 339 T2575 C173 REQ [collection1] webapp=null path=null params={q=subject:Hoss&start=0&qt=standard&version=2.2&rows=20}
hits=1 status=0 QTime=0 
[junit4:junit4]   2> 340 T2575 C173 REQ [collection1] webapp=null path=null params={q=subject:Yonik&start=0&qt=standard&version=2.2&rows=20}
hits=1 status=0 QTime=0 
[junit4:junit4]   2> 341 T2575 oas.SolrTestCaseJ4.tearDown ###Ending testSimpleQueries
[junit4:junit4]   2> 342 T2575 oas.SolrTestCaseJ4.deleteCore ###deleteCore
[junit4:junit4]   2> 342 T2575 oasc.CoreContainer.shutdown Shutting down CoreContainer
instance=-111488641
[junit4:junit4]   2> 342 T2575 oasc.SolrCore.close [collection1]  CLOSING SolrCore org.apache.solr.core.SolrCore@445cc560
[junit4:junit4]   2> 343 T2575 oasc.SolrCore.closeSearcher [collection1] Closing main searcher
on request.
[junit4:junit4]   2> 343 T2575 oasu.DirectUpdateHandler2.close closing DirectUpdateHandler2{commits=1,autocommits=0,soft
autocommits=0,optimizes=1,rollbacks=0,expungeDeletes=0,docsPending=0,adds=0,deletesById=0,deletesByQuery=0,errors=0,cumulative_adds=2,cumulative_deletesById=0,cumulative_deletesByQuery=0,cumulative_errors=0}
[junit4:junit4]   2> 345 T2574 ccr.ThreadLeakControl.checkThreadLeaks WARNING Will linger
awaiting termination of 1 leaked thread(s).
[junit4:junit4]   2> 20386 T2574 ccr.ThreadLeakControl.checkThreadLeaks SEVERE 1 thread
leaked from SUITE scope at org.apache.solr.MinimalSchemaTest: 
[junit4:junit4]   2> 	   1) Thread[id=2577, name=process reaper, state=TIMED_WAITING, group=TGRP-MinimalSchemaTest]
[junit4:junit4]   2> 	        at sun.misc.Unsafe.park(Native Method)
[junit4:junit4]   2> 	        at java.util.concurrent.locks.LockSupport.parkNanos(LockSupport.java:237)
[junit4:junit4]   2> 	        at java.util.concurrent.SynchronousQueue$TransferStack.awaitFulfill(SynchronousQueue.java:471)
[junit4:junit4]   2> 	        at java.util.concurrent.SynchronousQueue$TransferStack.transfer(SynchronousQueue.java:370)
[junit4:junit4]   2> 	        at java.util.concurrent.SynchronousQueue.poll(SynchronousQueue.java:953)
[junit4:junit4]   2> 	        at java.util.concurrent.ThreadPoolExecutor.getTask(ThreadPoolExecutor.java:1054)
[junit4:junit4]   2> 	        at java.util.concurrent.ThreadPoolExecutor.runWorker(ThreadPoolExecutor.java:1114)
[junit4:junit4]   2> 	        at java.util.concurrent.ThreadPoolExecutor$Worker.run(ThreadPoolExecutor.java:614)
[junit4:junit4]   2> 	        at java.lang.Thread.run(Thread.java:777)
[junit4:junit4]   2> 20387 T2574 ccr.ThreadLeakControl.tryToInterruptAll Starting to interrupt
leaked threads:
[junit4:junit4]   2> 	   1) Thread[id=2577, name=process reaper, state=TIMED_WAITING, group=TGRP-MinimalSchemaTest]
[junit4:junit4]   2> 23388 T2574 ccr.ThreadLeakControl.tryToInterruptAll SEVERE There are
still zombie threads that couldn't be terminated:
[junit4:junit4]   2> 	   1) Thread[id=2577, name=process reaper, state=TIMED_WAITING, group=TGRP-MinimalSchemaTest]
[junit4:junit4]   2> 	        at sun.misc.Unsafe.park(Native Method)
[junit4:junit4]   2> 	        at java.util.concurrent.locks.LockSupport.parkNanos(LockSupport.java:237)
[junit4:junit4]   2> 	        at java.util.concurrent.SynchronousQueue$TransferStack.awaitFulfill(SynchronousQueue.java:471)
[junit4:junit4]   2> 	        at java.util.concurrent.SynchronousQueue$TransferStack.transfer(SynchronousQueue.java:370)
[junit4:junit4]   2> 	        at java.util.concurrent.SynchronousQueue.poll(SynchronousQueue.java:953)
[junit4:junit4]   2> 	        at java.util.concurrent.ThreadPoolExecutor.getTask(ThreadPoolExecutor.java:1054)
[junit4:junit4]   2> 	        at java.util.concurrent.ThreadPoolExecutor.runWorker(ThreadPoolExecutor.java:1114)
[junit4:junit4]   2> 	        at java.util.concurrent.ThreadPoolExecutor$Worker.run(ThreadPoolExecutor.java:614)
[junit4:junit4]   2> 	        at java.lang.Thread.run(Thread.java:777)
[junit4:junit4]   2> NOTE: test params are: codec=Lucene40: {project=PostingsFormat(name=Asserting),
id=PostingsFormat(name=Asserting), subject=PostingsFormat(name=Memory doPackFST= true)}, sim=DefaultSimilarity,
locale=sl_SI_PREEURO, timezone=America/New_York
[junit4:junit4]   2> NOTE: Linux 3.2.0-29-generic x86/IBM Corporation 1.7.0 (32-bit)/cpus=8,threads=2,free=106575888,total=174587904
[junit4:junit4]   2> NOTE: All tests run in this JVM: [PrimitiveFieldTypeTest, StandardRequestHandlerTest,
TestRecovery, TermVectorComponentTest, BadIndexSchemaTest, TestBM25SimilarityFactory, TestTrie,
TestBinaryField, TestReplicationHandler, TestReload, ShowFileRequestHandlerTest, DistributedQueryElevationComponentTest,
FileUtilsTest, PolyFieldTest, IndexReaderFactoryTest, TestLRUCache, TestPropInjectDefaults,
TestDistributedSearch, ConvertedLegacyTest, TestSolrCoreProperties, LegacyHTMLStripCharFilterTest,
TestStressLucene, RAMDirectoryFactoryTest, MultiTermTest, TestSort, LukeRequestHandlerTest,
TestArbitraryIndexDir, FieldMutatingUpdateProcessorTest, BasicZkTest, SuggesterTest, DOMUtilTest,
SolrInfoMBeanTest, SpellingQueryConverterTest, TestQueryUtils, EchoParamsTest, ScriptEngineTest,
OutputWriterTest, TestWriterPerf, TestMergePolicyConfig, RequiredFieldsTest, CoreContainerCoreInitFailuresTest,
HighlighterTest, UpdateParamsTest, TestSurroundQueryParser, ZkSolrClientTest, TestStressVersions,
TestDFRSimilarityFactory, AnalysisAfterCoreReloadTest, TestStressRecovery, PeerSyncTest, ZkCLITest,
PingRequestHandlerTest, OverseerTest, RecoveryZkTest, FullSolrCloudDistribCmdsTest, LeaderElectionTest,
DistributedSpellCheckComponentTest, TestRealTimeGet, TestDistributedGrouping, SoftAutoCommitTest,
AutoCommitTest, TestFaceting, TestHashPartitioner, StatsComponentTest, SolrCoreTest, TestMultiCoreConfBootstrap,
TestGroupingSearch, BasicFunctionalityTest, SignatureUpdateProcessorFactoryTest, TestJmxIntegration,
SampleTest, TestIndexSearcher, SolrRequestParserTest, TestRemoteStreaming, QueryEqualityTest,
TestWordDelimiterFilterFactory, TestCSVLoader, SpatialFilterTest, DocumentBuilderTest, DisMaxRequestHandlerTest,
IndexSchemaTest, TermsComponentTest, DistanceFunctionTest, MinimalSchemaTest]
[junit4:junit4]   2> NOTE: reproduce with: ant test  -Dtestcase=MinimalSchemaTest -Dtests.seed=DFC68E363411F2C8
-Dtests.multiplier=3 -Dtests.slow=true -Dtests.locale=sl_SI_PREEURO -Dtests.timezone=America/New_York
-Dtests.file.encoding=ISO-8859-1
[junit4:junit4] ERROR   0.00s J1 | MinimalSchemaTest (suite) <<<
[junit4:junit4]    > Throwable #1: com.carrotsearch.randomizedtesting.ThreadLeakError:
1 thread leaked from SUITE scope at org.apache.solr.MinimalSchemaTest: 
[junit4:junit4]    >    1) Thread[id=2577, name=process reaper, state=TIMED_WAITING, group=TGRP-MinimalSchemaTest]
[junit4:junit4]    >         at sun.misc.Unsafe.park(Native Method)
[junit4:junit4]    >         at java.util.concurrent.locks.LockSupport.parkNanos(LockSupport.java:237)
[junit4:junit4]    >         at java.util.concurrent.SynchronousQueue$TransferStack.awaitFulfill(SynchronousQueue.java:471)
[junit4:junit4]    >         at java.util.concurrent.SynchronousQueue$TransferStack.transfer(SynchronousQueue.java:370)
[junit4:junit4]    >         at java.util.concurrent.SynchronousQueue.poll(SynchronousQueue.java:953)
[junit4:junit4]    >         at java.util.concurrent.ThreadPoolExecutor.getTask(ThreadPoolExecutor.java:1054)
[junit4:junit4]    >         at java.util.concurrent.ThreadPoolExecutor.runWorker(ThreadPoolExecutor.java:1114)
[junit4:junit4]    >         at java.util.concurrent.ThreadPoolExecutor$Worker.run(ThreadPoolExecutor.java:614)
[junit4:junit4]    >         at java.lang.Thread.run(Thread.java:777)
[junit4:junit4]    > 	at __randomizedtesting.SeedInfo.seed([DFC68E363411F2C8]:0)
[junit4:junit4]    > Throwable #2: com.carrotsearch.randomizedtesting.ThreadLeakError:
There are still zombie threads that couldn't be terminated:
[junit4:junit4]    >    1) Thread[id=2577, name=process reaper, state=TIMED_WAITING, group=TGRP-MinimalSchemaTest]
[junit4:junit4]    >         at sun.misc.Unsafe.park(Native Method)
[junit4:junit4]    >         at java.util.concurrent.locks.LockSupport.parkNanos(LockSupport.java:237)
[junit4:junit4]    >         at java.util.concurrent.SynchronousQueue$TransferStack.awaitFulfill(SynchronousQueue.java:471)
[junit4:junit4]    >         at java.util.concurrent.SynchronousQueue$TransferStack.transfer(SynchronousQueue.java:370)
[junit4:junit4]    >         at java.util.concurrent.SynchronousQueue.poll(SynchronousQueue.java:953)
[junit4:junit4]    >         at java.util.concurrent.ThreadPoolExecutor.getTask(ThreadPoolExecutor.java:1054)
[junit4:junit4]    >         at java.util.concurrent.ThreadPoolExecutor.runWorker(ThreadPoolExecutor.java:1114)
[junit4:junit4]    >         at java.util.concurrent.ThreadPoolExecutor$Worker.run(ThreadPoolExecutor.java:614)
[junit4:junit4]    >         at java.lang.Thread.run(Thread.java:777)
[junit4:junit4]    > 	at __randomizedtesting.SeedInfo.seed([DFC68E363411F2C8]:0)
[junit4:junit4] Completed on J1 in 23.43s, 3 tests, 2 errors <<< FAILURES!

[...truncated 101 lines...]
BUILD FAILED
/mnt/ssd/jenkins/workspace/Lucene-Solr-trunk-Linux/build.xml:29: The following error occurred
while executing this line:
/mnt/ssd/jenkins/workspace/Lucene-Solr-trunk-Linux/solr/build.xml:144: The following error
occurred while executing this line:
/mnt/ssd/jenkins/workspace/Lucene-Solr-trunk-Linux/lucene/module-build.xml:62: The following
error occurred while executing this line:
/mnt/ssd/jenkins/workspace/Lucene-Solr-trunk-Linux/lucene/common-build.xml:1105: The following
error occurred while executing this line:
/mnt/ssd/jenkins/workspace/Lucene-Solr-trunk-Linux/lucene/common-build.xml:797: There were
test failures: 224 suites, 902 tests, 2 suite-level errors, 51 ignored (1 assumption)

Total time: 22 minutes 38 seconds
Build step 'Invoke Ant' marked build as failure
Recording test results
Description set: Java: 32bit/ibm-j9-jdk7 
Email was triggered for: Failure
Sending email for trigger: Failure



Mime
View raw message