lucene-dev mailing list archives

Site index · List index
Message view « Date » · « Thread »
Top « Date » · « Thread »
From Policeman Jenkins Server <jenk...@sd-datasolutions.de>
Subject [JENKINS] Lucene-Solr-trunk-Windows (32bit/jdk1.7.0_05) - Build # 324 - Failure!
Date Sat, 18 Aug 2012 17:22:48 GMT
Build: http://jenkins.sd-datasolutions.de/job/Lucene-Solr-trunk-Windows/324/
Java: 32bit/jdk1.7.0_05 -server -XX:+UseG1GC

1 tests failed.
REGRESSION:  org.apache.solr.spelling.suggest.SuggesterTSTTest.testSuggestions

Error Message:
Exception during query

Stack Trace:
java.lang.RuntimeException: Exception during query
	at __randomizedtesting.SeedInfo.seed([EA4FB8CA688A9555:4C93813FA6BEC2AB]:0)
	at org.apache.solr.SolrTestCaseJ4.assertQ(SolrTestCaseJ4.java:493)
	at org.apache.solr.SolrTestCaseJ4.assertQ(SolrTestCaseJ4.java:460)
	at org.apache.solr.spelling.suggest.SuggesterTest.testSuggestions(SuggesterTest.java:71)
	at sun.reflect.NativeMethodAccessorImpl.invoke0(Native Method)
	at sun.reflect.NativeMethodAccessorImpl.invoke(NativeMethodAccessorImpl.java:57)
	at sun.reflect.DelegatingMethodAccessorImpl.invoke(DelegatingMethodAccessorImpl.java:43)
	at java.lang.reflect.Method.invoke(Method.java:601)
	at com.carrotsearch.randomizedtesting.RandomizedRunner.invoke(RandomizedRunner.java:1559)
	at com.carrotsearch.randomizedtesting.RandomizedRunner.access$600(RandomizedRunner.java:79)
	at com.carrotsearch.randomizedtesting.RandomizedRunner$6.evaluate(RandomizedRunner.java:737)
	at com.carrotsearch.randomizedtesting.RandomizedRunner$7.evaluate(RandomizedRunner.java:773)
	at com.carrotsearch.randomizedtesting.RandomizedRunner$8.evaluate(RandomizedRunner.java:787)
	at com.carrotsearch.randomizedtesting.rules.SystemPropertiesRestoreRule$1.evaluate(SystemPropertiesRestoreRule.java:53)
	at org.apache.lucene.util.TestRuleSetupTeardownChained$1.evaluate(TestRuleSetupTeardownChained.java:50)
	at org.apache.lucene.util.TestRuleFieldCacheSanity$1.evaluate(TestRuleFieldCacheSanity.java:51)
	at org.apache.lucene.util.AbstractBeforeAfterRule$1.evaluate(AbstractBeforeAfterRule.java:45)
	at com.carrotsearch.randomizedtesting.rules.SystemPropertiesInvariantRule$1.evaluate(SystemPropertiesInvariantRule.java:55)
	at org.apache.lucene.util.TestRuleThreadAndTestName$1.evaluate(TestRuleThreadAndTestName.java:48)
	at org.apache.lucene.util.TestRuleIgnoreAfterMaxFailures$1.evaluate(TestRuleIgnoreAfterMaxFailures.java:70)
	at org.apache.lucene.util.TestRuleMarkFailure$1.evaluate(TestRuleMarkFailure.java:48)
	at com.carrotsearch.randomizedtesting.rules.StatementAdapter.evaluate(StatementAdapter.java:36)
	at com.carrotsearch.randomizedtesting.ThreadLeakControl$StatementRunner.run(ThreadLeakControl.java:345)
	at com.carrotsearch.randomizedtesting.ThreadLeakControl.forkTimeoutingTask(ThreadLeakControl.java:769)
	at com.carrotsearch.randomizedtesting.ThreadLeakControl$3.evaluate(ThreadLeakControl.java:429)
	at com.carrotsearch.randomizedtesting.RandomizedRunner.runSingleTest(RandomizedRunner.java:746)
	at com.carrotsearch.randomizedtesting.RandomizedRunner$3.evaluate(RandomizedRunner.java:648)
	at com.carrotsearch.randomizedtesting.RandomizedRunner$4.evaluate(RandomizedRunner.java:682)
	at com.carrotsearch.randomizedtesting.RandomizedRunner$5.evaluate(RandomizedRunner.java:693)
	at com.carrotsearch.randomizedtesting.rules.StatementAdapter.evaluate(StatementAdapter.java:36)
	at com.carrotsearch.randomizedtesting.rules.SystemPropertiesRestoreRule$1.evaluate(SystemPropertiesRestoreRule.java:53)
	at org.apache.lucene.util.AbstractBeforeAfterRule$1.evaluate(AbstractBeforeAfterRule.java:45)
	at org.apache.lucene.util.TestRuleStoreClassName$1.evaluate(TestRuleStoreClassName.java:42)
	at com.carrotsearch.randomizedtesting.rules.SystemPropertiesInvariantRule$1.evaluate(SystemPropertiesInvariantRule.java:55)
	at com.carrotsearch.randomizedtesting.rules.NoShadowingOrOverridesOnMethodsRule$1.evaluate(NoShadowingOrOverridesOnMethodsRule.java:39)
	at com.carrotsearch.randomizedtesting.rules.NoShadowingOrOverridesOnMethodsRule$1.evaluate(NoShadowingOrOverridesOnMethodsRule.java:39)
	at org.apache.lucene.util.TestRuleAssertionsRequired$1.evaluate(TestRuleAssertionsRequired.java:40)
	at org.apache.lucene.util.TestRuleMarkFailure$1.evaluate(TestRuleMarkFailure.java:48)
	at org.apache.lucene.util.TestRuleIgnoreAfterMaxFailures$1.evaluate(TestRuleIgnoreAfterMaxFailures.java:70)
	at org.apache.lucene.util.TestRuleIgnoreTestSuites$1.evaluate(TestRuleIgnoreTestSuites.java:55)
	at com.carrotsearch.randomizedtesting.rules.StatementAdapter.evaluate(StatementAdapter.java:36)
	at com.carrotsearch.randomizedtesting.ThreadLeakControl$StatementRunner.run(ThreadLeakControl.java:345)
	at java.lang.Thread.run(Thread.java:722)
Caused by: java.lang.RuntimeException: REQUEST FAILED: xpath=//lst[@name='spellcheck']/lst[@name='suggestions']/lst[@name='ac']/int[@name='numFound'][.='2']
	xml response was: <?xml version="1.0" encoding="UTF-8"?>
<response>
<lst name="responseHeader"><int name="status">0</int><int name="QTime">0</int></lst><lst name="spellcheck"><lst name="suggestions"/></lst>
</response>

	request was:q=ac&spellcheck.count=2&qt=/suggest_tst&spellcheck.onlyMorePopular=true
	at org.apache.solr.SolrTestCaseJ4.assertQ(SolrTestCaseJ4.java:486)
	... 41 more




Build Log:
[...truncated 7611 lines...]
[junit4:junit4] Suite: org.apache.solr.spelling.suggest.SuggesterTSTTest
[junit4:junit4]   2> 0 T3573 oas.SolrTestCaseJ4.initCore ####initCore
[junit4:junit4]   2> Creating dataDir: C:\Jenkins\workspace\Lucene-Solr-trunk-Windows\solr\build\solr-core\test\J0\.\solrtest-SuggesterTSTTest-1345310510885
[junit4:junit4]   2> 1 T3573 oasc.SolrResourceLoader.<init> new SolrResourceLoader for directory: 'C:\Jenkins\workspace\Lucene-Solr-trunk-Windows\solr\build\solr-core\test-files\solr\collection1\'
[junit4:junit4]   2> 2 T3573 oasc.SolrResourceLoader.replaceClassLoader Adding 'file:/C:/Jenkins/workspace/Lucene-Solr-trunk-Windows/solr/build/solr-core/test-files/solr/collection1/lib/classes/' to classloader
[junit4:junit4]   2> 2 T3573 oasc.SolrResourceLoader.replaceClassLoader Adding 'file:/C:/Jenkins/workspace/Lucene-Solr-trunk-Windows/solr/build/solr-core/test-files/solr/collection1/lib/README' to classloader
[junit4:junit4]   2> 48 T3573 oasc.SolrConfig.<init> Using Lucene MatchVersion: LUCENE_50
[junit4:junit4]   2> 111 T3573 oasc.SolrConfig.<init> Loaded SolrConfig: solrconfig-spellchecker.xml
[junit4:junit4]   2> 112 T3573 oass.IndexSchema.readSchema Reading Solr Schema
[junit4:junit4]   2> 114 T3573 oass.IndexSchema.readSchema Schema name=Solr SpellCheck Test
[junit4:junit4]   2> 156 T3573 oass.IndexSchema.readSchema default search field in schema is text
[junit4:junit4]   2> 158 T3573 oass.IndexSchema.readSchema query parser default operator is OR
[junit4:junit4]   2> 159 T3573 oass.IndexSchema.readSchema unique key field: id
[junit4:junit4]   2> 163 T3573 oasc.SolrResourceLoader.locateSolrHome JNDI not configured for solr (NoInitialContextEx)
[junit4:junit4]   2> 163 T3573 oasc.SolrResourceLoader.locateSolrHome using system property solr.solr.home: C:\Jenkins\workspace\Lucene-Solr-trunk-Windows\solr\build\solr-core\test-files\solr
[junit4:junit4]   2> 163 T3573 oasc.SolrResourceLoader.<init> new SolrResourceLoader for directory: 'C:\Jenkins\workspace\Lucene-Solr-trunk-Windows\solr\build\solr-core\test-files\solr\'
[junit4:junit4]   2> 178 T3573 oasc.CoreContainer.<init> New CoreContainer 5781178
[junit4:junit4]   2> 178 T3573 oasc.SolrCore.<init> [collection1] Opening new SolrCore at C:\Jenkins\workspace\Lucene-Solr-trunk-Windows\solr\build\solr-core\test-files\solr\collection1\, dataDir=C:\Jenkins\workspace\Lucene-Solr-trunk-Windows\solr\build\solr-core\test\J0\.\solrtest-SuggesterTSTTest-1345310510885\
[junit4:junit4]   2> 179 T3573 oasc.SolrCore.<init> JMX monitoring not detected for core: collection1
[junit4:junit4]   2> 179 T3573 oasc.SolrCore.getNewIndexDir WARNING New index directory detected: old=null new=C:\Jenkins\workspace\Lucene-Solr-trunk-Windows\solr\build\solr-core\test\J0\.\solrtest-SuggesterTSTTest-1345310510885\index/
[junit4:junit4]   2> 180 T3573 oasc.SolrCore.initIndex WARNING [collection1] Solr index directory 'C:\Jenkins\workspace\Lucene-Solr-trunk-Windows\solr\build\solr-core\test\J0\.\solrtest-SuggesterTSTTest-1345310510885\index' doesn't exist. Creating new index...
[junit4:junit4]   2> 183 T3573 oasc.CachingDirectoryFactory.get return new directory for C:\Jenkins\workspace\Lucene-Solr-trunk-Windows\solr\build\solr-core\test\J0\.\solrtest-SuggesterTSTTest-1345310510885\index forceNew:false
[junit4:junit4]   2> 188 T3573 oasc.SolrDeletionPolicy.onCommit SolrDeletionPolicy.onCommit: commits:num=1
[junit4:junit4]   2> 		commit{dir=MockDirWrapper(org.apache.lucene.store.NIOFSDirectory@C:\Jenkins\workspace\Lucene-Solr-trunk-Windows\solr\build\solr-core\test\J0\solrtest-SuggesterTSTTest-1345310510885\index lockFactory=org.apache.lucene.store.NativeFSLockFactory@b51da8),segFN=segments_1,generation=1,filenames=[segments_1]
[junit4:junit4]   2> 188 T3573 oasc.SolrDeletionPolicy.updateCommits newest commit = 1
[junit4:junit4]   2> 190 T3573 oasc.RequestHandlers.initHandlersFromConfig created standard: solr.StandardRequestHandler
[junit4:junit4]   2> 190 T3573 oasc.RequestHandlers.initHandlersFromConfig created /suggest: org.apache.solr.handler.component.SearchHandler
[junit4:junit4]   2> 190 T3573 oasc.RequestHandlers.initHandlersFromConfig created /suggest_tst: org.apache.solr.handler.component.SearchHandler
[junit4:junit4]   2> 191 T3573 oasc.RequestHandlers.initHandlersFromConfig created /suggest_fst: org.apache.solr.handler.component.SearchHandler
[junit4:junit4]   2> 191 T3573 oasc.RequestHandlers.initHandlersFromConfig created /suggest_wfst: org.apache.solr.handler.component.SearchHandler
[junit4:junit4]   2> 197 T3573 oass.SolrIndexSearcher.<init> Opening Searcher@12fca54 main
[junit4:junit4]   2> 197 T3573 oass.SolrIndexSearcher.getIndexDir WARNING WARNING: Directory impl does not support setting indexDir: org.apache.lucene.store.MockDirectoryWrapper
[junit4:junit4]   2> 197 T3573 oasu.CommitTracker.<init> Hard AutoCommit: disabled
[junit4:junit4]   2> 198 T3573 oasu.CommitTracker.<init> Soft AutoCommit: disabled
[junit4:junit4]   2> 198 T3573 oashc.SpellCheckComponent.inform Initializing spell checkers
[junit4:junit4]   2> 199 T3573 oasss.Suggester.init init: {name=suggest,classname=org.apache.solr.spelling.suggest.Suggester,lookupImpl=org.apache.solr.spelling.suggest.jaspell.JaspellLookup,field=suggest,storeDir=suggest,buildOnCommit=true,threshold=0.0}
[junit4:junit4]   2> 200 T3573 oasssj.JaspellLookupFactory.create init: {name=suggest,classname=org.apache.solr.spelling.suggest.Suggester,lookupImpl=org.apache.solr.spelling.suggest.jaspell.JaspellLookup,field=suggest,storeDir=suggest,buildOnCommit=true,threshold=0.0}
[junit4:junit4]   2> 200 T3573 oashc.SpellCheckComponent.inform Registering newSearcher listener for spellchecker: suggest
[junit4:junit4]   2> 201 T3573 oashc.SpellCheckComponent.inform No queryConverter defined, using default converter
[junit4:junit4]   2> 201 T3573 oashc.SpellCheckComponent.inform Initializing spell checkers
[junit4:junit4]   2> 201 T3573 oasss.Suggester.init init: {name=suggest_tst,classname=org.apache.solr.spelling.suggest.Suggester,lookupImpl=org.apache.solr.spelling.suggest.tst.TSTLookup,field=suggest,storeDir=suggest_tst,buildOnCommit=true,threshold=0.0}
[junit4:junit4]   2> 202 T3573 oashc.SpellCheckComponent.inform Registering newSearcher listener for spellchecker: suggest_tst
[junit4:junit4]   2> 202 T3573 oashc.SpellCheckComponent.inform No queryConverter defined, using default converter
[junit4:junit4]   2> 202 T3573 oashc.SpellCheckComponent.inform Initializing spell checkers
[junit4:junit4]   2> 202 T3573 oasss.Suggester.init init: {name=suggest_fst,classname=org.apache.solr.spelling.suggest.Suggester,lookupImpl=org.apache.solr.spelling.suggest.fst.FSTLookup,field=suggest,storeDir=suggest_fst,buildOnCommit=true,weightBuckets=5,exactMatchFirst=true}
[junit4:junit4]   2> 204 T3573 oashc.SpellCheckComponent.inform Registering newSearcher listener for spellchecker: suggest_fst
[junit4:junit4]   2> 204 T3573 oashc.SpellCheckComponent.inform No queryConverter defined, using default converter
[junit4:junit4]   2> 205 T3573 oashc.SpellCheckComponent.inform Initializing spell checkers
[junit4:junit4]   2> 205 T3573 oasss.Suggester.init init: {name=suggest_wfst,classname=org.apache.solr.spelling.suggest.Suggester,lookupImpl=org.apache.solr.spelling.suggest.fst.WFSTLookupFactory,field=suggest,storeDir=suggest_wfst,buildOnCommit=true,exactMatchFirst=true}
[junit4:junit4]   2> 206 T3573 oashc.SpellCheckComponent.inform Registering newSearcher listener for spellchecker: suggest_wfst
[junit4:junit4]   2> 206 T3573 oashc.SpellCheckComponent.inform No queryConverter defined, using default converter
[junit4:junit4]   2> 206 T3573 oashc.HttpShardHandlerFactory.getParameter Setting socketTimeout to: 0
[junit4:junit4]   2> 206 T3573 oashc.HttpShardHandlerFactory.getParameter Setting urlScheme to: http://
[junit4:junit4]   2> 207 T3573 oashc.HttpShardHandlerFactory.getParameter Setting connTimeout to: 0
[junit4:junit4]   2> 207 T3573 oashc.HttpShardHandlerFactory.getParameter Setting maxConnectionsPerHost to: 20
[junit4:junit4]   2> 208 T3573 oashc.HttpShardHandlerFactory.getParameter Setting corePoolSize to: 0
[junit4:junit4]   2> 208 T3573 oashc.HttpShardHandlerFactory.getParameter Setting maximumPoolSize to: 2147483647
[junit4:junit4]   2> 208 T3573 oashc.HttpShardHandlerFactory.getParameter Setting maxThreadIdleTime to: 5
[junit4:junit4]   2> 209 T3573 oashc.HttpShardHandlerFactory.getParameter Setting sizeOfQueue to: -1
[junit4:junit4]   2> 209 T3573 oashc.HttpShardHandlerFactory.getParameter Setting fairnessPolicy to: false
[junit4:junit4]   2> 209 T3573 oascsi.HttpClientUtil.createClient Creating new http client, config:maxConnectionsPerHost=20&maxConnections=10000&socketTimeout=0&connTimeout=0&retry=false
[junit4:junit4]   2> 220 T3573 oasc.CoreContainer.register registering core: collection1
[junit4:junit4]   2> 222 T3573 oas.SolrTestCaseJ4.initCore ####initCore end
[junit4:junit4]   2> 231 T3573 oas.SolrTestCaseJ4.setUp ###Starting testSuggestions
[junit4:junit4]   2> ASYNC  NEW_CORE C266 name=collection1 org.apache.solr.core.SolrCore@7fd7f5
[junit4:junit4]   2> 245 T3573 C266 oasc.SolrDeletionPolicy.onInit SolrDeletionPolicy.onInit: commits:num=1
[junit4:junit4]   2> 		commit{dir=MockDirWrapper(org.apache.lucene.store.NIOFSDirectory@C:\Jenkins\workspace\Lucene-Solr-trunk-Windows\solr\build\solr-core\test\J0\solrtest-SuggesterTSTTest-1345310510885\index lockFactory=org.apache.lucene.store.NativeFSLockFactory@b51da8),segFN=segments_1,generation=1,filenames=[segments_1]
[junit4:junit4]   2> 246 T3573 C266 oasc.SolrDeletionPolicy.updateCommits newest commit = 1
[junit4:junit4]   2> 248 T3573 C266 UPDATE [collection1] webapp=null path=null params={} {add=[1]} 0 6
[junit4:junit4]   2> 261 T3573 C266 UPDATE [collection1] webapp=null path=null params={} {add=[2]} 0 0
[junit4:junit4]   2> 271 T3573 C266 UPDATE [collection1] webapp=null path=null params={} {add=[3]} 0 1
[junit4:junit4]   2> 281 T3573 C266 oasu.DirectUpdateHandler2.commit start commit{flags=0,_version_=0,optimize=false,openSearcher=true,waitSearcher=true,expungeDeletes=false,softCommit=false}
[junit4:junit4]   2> 288 T3573 C266 oasc.SolrDeletionPolicy.onCommit SolrDeletionPolicy.onCommit: commits:num=2
[junit4:junit4]   2> 		commit{dir=MockDirWrapper(org.apache.lucene.store.NIOFSDirectory@C:\Jenkins\workspace\Lucene-Solr-trunk-Windows\solr\build\solr-core\test\J0\solrtest-SuggesterTSTTest-1345310510885\index lockFactory=org.apache.lucene.store.NativeFSLockFactory@b51da8),segFN=segments_1,generation=1,filenames=[segments_1]
[junit4:junit4]   2> 		commit{dir=MockDirWrapper(org.apache.lucene.store.NIOFSDirectory@C:\Jenkins\workspace\Lucene-Solr-trunk-Windows\solr\build\solr-core\test\J0\solrtest-SuggesterTSTTest-1345310510885\index lockFactory=org.apache.lucene.store.NativeFSLockFactory@b51da8),segFN=segments_2,generation=2,filenames=[_0.fnm, _0_Pulsing40_0.tim, _0_Memory_0.ram, _0_NestedPulsing_0.frq, _0_nrm.cfs, _0_Pulsing40_0.prx, _0_NestedPulsing_0.tip, _0_Pulsing40_0.frq, _0_NestedPulsing_0.prx, _0_NestedPulsing_0.tim, _0_nrm.cfe, segments_2, _0_Pulsing40_0.tip, _0.fdx, _0.si, _0.fdt]
[junit4:junit4]   2> 289 T3573 C266 oasc.SolrDeletionPolicy.updateCommits newest commit = 2
[junit4:junit4]   2> 289 T3573 C266 oasc.SolrCore.getSearcher WARNING [collection1] PERFORMANCE WARNING: Overlapping onDeckSearchers=2
[junit4:junit4]   2> 294 T3573 C266 oass.SolrIndexSearcher.<init> Opening Searcher@2c5573 main
[junit4:junit4]   2> 295 T3573 C266 oass.SolrIndexSearcher.getIndexDir WARNING WARNING: Directory impl does not support setting indexDir: org.apache.lucene.store.MockDirectoryWrapper
[junit4:junit4]   2> 295 T3573 C266 oasu.DirectUpdateHandler2.commit end_commit_flush
[junit4:junit4]   2> 296 T3574 oasc.SolrCore.registerSearcher [collection1] Registered new searcher Searcher@12fca54 main{StandardDirectoryReader(segments_1:1)}
[junit4:junit4]   2> 297 T3574 oashc.SpellCheckComponent$SpellCheckerListener.newSearcher Loading spell index for spellchecker: suggest
[junit4:junit4]   2> 297 T3574 oasss.Suggester.reload reload()
[junit4:junit4]   2> 297 T3574 oashc.SpellCheckComponent$SpellCheckerListener.newSearcher SEVERE Exception in reloading spell check index for spellchecker: suggest java.io.FileNotFoundException: C:\Jenkins\workspace\Lucene-Solr-trunk-Windows\solr\build\solr-core\test\J0\.\solrtest-SuggesterTSTTest-1345310510885\suggest\jaspell.dat (The system cannot find the file specified)
[junit4:junit4]   2> 	at java.io.FileInputStream.open(Native Method)
[junit4:junit4]   2> 	at java.io.FileInputStream.<init>(FileInputStream.java:138)
[junit4:junit4]   2> 	at org.apache.solr.spelling.suggest.Suggester.reload(Suggester.java:161)
[junit4:junit4]   2> 	at org.apache.solr.handler.component.SpellCheckComponent$SpellCheckerListener.newSearcher(SpellCheckComponent.java:673)
[junit4:junit4]   2> 	at org.apache.solr.core.SolrCore$5.call(SolrCore.java:1438)
[junit4:junit4]   2> 	at java.util.concurrent.FutureTask$Sync.innerRun(FutureTask.java:334)
[junit4:junit4]   2> 	at java.util.concurrent.FutureTask.run(FutureTask.java:166)
[junit4:junit4]   2> 	at java.util.concurrent.ThreadPoolExecutor.runWorker(ThreadPoolExecutor.java:1110)
[junit4:junit4]   2> 	at java.util.concurrent.ThreadPoolExecutor$Worker.run(ThreadPoolExecutor.java:603)
[junit4:junit4]   2> 	at java.lang.Thread.run(Thread.java:722)
[junit4:junit4]   2> 
[junit4:junit4]   2> 299 T3574 oashc.SpellCheckComponent$SpellCheckerListener.newSearcher Loading spell index for spellchecker: suggest_tst
[junit4:junit4]   2> 299 T3574 oasss.Suggester.reload reload()
[junit4:junit4]   2> 299 T3574 oashc.SpellCheckComponent$SpellCheckerListener.newSearcher SEVERE Exception in reloading spell check index for spellchecker: suggest_tst java.io.FileNotFoundException: C:\Jenkins\workspace\Lucene-Solr-trunk-Windows\solr\build\solr-core\test\J0\.\solrtest-SuggesterTSTTest-1345310510885\suggest_tst\tst.dat (The system cannot find the file specified)
[junit4:junit4]   2> 	at java.io.FileInputStream.open(Native Method)
[junit4:junit4]   2> 	at java.io.FileInputStream.<init>(FileInputStream.java:138)
[junit4:junit4]   2> 	at org.apache.solr.spelling.suggest.Suggester.reload(Suggester.java:161)
[junit4:junit4]   2> 	at org.apache.solr.handler.component.SpellCheckComponent$SpellCheckerListener.newSearcher(SpellCheckComponent.java:673)
[junit4:junit4]   2> 	at org.apache.solr.core.SolrCore$5.call(SolrCore.java:1438)
[junit4:junit4]   2> 	at java.util.concurrent.FutureTask$Sync.innerRun(FutureTask.java:334)
[junit4:junit4]   2> 	at java.util.concurrent.FutureTask.run(FutureTask.java:166)
[junit4:junit4]   2> 	at java.util.concurrent.ThreadPoolExecutor.runWorker(ThreadPoolExecutor.java:1110)
[junit4:junit4]   2> 	at java.util.concurrent.ThreadPoolExecutor$Worker.run(ThreadPoolExecutor.java:603)
[junit4:junit4]   2> 	at java.lang.Thread.run(Thread.java:722)
[junit4:junit4]   2> 
[junit4:junit4]   2> 300 T3574 oashc.SpellCheckComponent$SpellCheckerListener.newSearcher Loading spell index for spellchecker: suggest_fst
[junit4:junit4]   2> 300 T3574 oasss.Suggester.reload reload()
[junit4:junit4]   2> 300 T3574 oashc.SpellCheckComponent$SpellCheckerListener.newSearcher SEVERE Exception in reloading spell check index for spellchecker: suggest_fst java.io.FileNotFoundException: C:\Jenkins\workspace\Lucene-Solr-trunk-Windows\solr\build\solr-core\test\J0\.\solrtest-SuggesterTSTTest-1345310510885\suggest_fst\fst.bin (The system cannot find the file specified)
[junit4:junit4]   2> 	at java.io.FileInputStream.open(Native Method)
[junit4:junit4]   2> 	at java.io.FileInputStream.<init>(FileInputStream.java:138)
[junit4:junit4]   2> 	at org.apache.solr.spelling.suggest.Suggester.reload(Suggester.java:161)
[junit4:junit4]   2> 	at org.apache.solr.handler.component.SpellCheckComponent$SpellCheckerListener.newSearcher(SpellCheckComponent.java:673)
[junit4:junit4]   2> 	at org.apache.solr.core.SolrCore$5.call(SolrCore.java:1438)
[junit4:junit4]   2> 	at java.util.concurrent.FutureTask$Sync.innerRun(FutureTask.java:334)
[junit4:junit4]   2> 	at java.util.concurrent.FutureTask.run(FutureTask.java:166)
[junit4:junit4]   2> 	at java.util.concurrent.ThreadPoolExecutor.runWorker(ThreadPoolExecutor.java:1110)
[junit4:junit4]   2> 	at java.util.concurrent.ThreadPoolExecutor$Worker.run(ThreadPoolExecutor.java:603)
[junit4:junit4]   2> 	at java.lang.Thread.run(Thread.java:722)
[junit4:junit4]   2> 
[junit4:junit4]   2> 300 T3574 oashc.SpellCheckComponent$SpellCheckerListener.newSearcher Loading spell index for spellchecker: suggest_wfst
[junit4:junit4]   2> 300 T3574 oasss.Suggester.reload reload()
[junit4:junit4]   2> 300 T3574 oashc.SpellCheckComponent$SpellCheckerListener.newSearcher SEVERE Exception in reloading spell check index for spellchecker: suggest_wfst java.io.FileNotFoundException: C:\Jenkins\workspace\Lucene-Solr-trunk-Windows\solr\build\solr-core\test\J0\.\solrtest-SuggesterTSTTest-1345310510885\suggest_wfst\wfst.bin (The system cannot find the file specified)
[junit4:junit4]   2> 	at java.io.FileInputStream.open(Native Method)
[junit4:junit4]   2> 	at java.io.FileInputStream.<init>(FileInputStream.java:138)
[junit4:junit4]   2> 	at org.apache.solr.spelling.suggest.Suggester.reload(Suggester.java:161)
[junit4:junit4]   2> 	at org.apache.solr.handler.component.SpellCheckComponent$SpellCheckerListener.newSearcher(SpellCheckComponent.java:673)
[junit4:junit4]   2> 	at org.apache.solr.core.SolrCore$5.call(SolrCore.java:1438)
[junit4:junit4]   2> 	at java.util.concurrent.FutureTask$Sync.innerRun(FutureTask.java:334)
[junit4:junit4]   2> 	at java.util.concurrent.FutureTask.run(FutureTask.java:166)
[junit4:junit4]   2> 	at java.util.concurrent.ThreadPoolExecutor.runWorker(ThreadPoolExecutor.java:1110)
[junit4:junit4]   2> 	at java.util.concurrent.ThreadPoolExecutor$Worker.run(ThreadPoolExecutor.java:603)
[junit4:junit4]   2> 	at java.lang.Thread.run(Thread.java:722)
[junit4:junit4]   2> 
[junit4:junit4]   2> 303 T3574 oasc.SolrCore.registerSearcher [collection1] Registered new searcher Searcher@2c5573 main{StandardDirectoryReader(segments_2:3 _0(5.0):C3)}
[junit4:junit4]   2> 303 T3573 C266 UPDATE [collection1] webapp=null path=null params={} {commit=} 0 22
[junit4:junit4]   2> 305 T3573 C266 REQ [collection1] webapp=null path=null params={q=ac&spellcheck.count=2&qt=/suggest_tst&spellcheck.onlyMorePopular=true} status=0 QTime=0 
[junit4:junit4]   2> 308 T3573 oas.SolrTestCaseJ4.assertQ SEVERE REQUEST FAILED: xpath=//lst[@name='spellcheck']/lst[@name='suggestions']/lst[@name='ac']/int[@name='numFound'][.='2']
[junit4:junit4]   2> 		xml response was: <?xml version="1.0" encoding="UTF-8"?>
[junit4:junit4]   2> 	<response>
[junit4:junit4]   2> 	<lst name="responseHeader"><int name="status">0</int><int name="QTime">0</int></lst><lst name="spellcheck"><lst name="suggestions"/></lst>
[junit4:junit4]   2> 	</response>
[junit4:junit4]   2> 	
[junit4:junit4]   2> 		request was:q=ac&spellcheck.count=2&qt=/suggest_tst&spellcheck.onlyMorePopular=true
[junit4:junit4]   2> 341 T3573 oasc.SolrException.log SEVERE REQUEST FAILED: q=ac&spellcheck.count=2&qt=/suggest_tst&spellcheck.onlyMorePopular=true:java.lang.RuntimeException: REQUEST FAILED: xpath=//lst[@name='spellcheck']/lst[@name='suggestions']/lst[@name='ac']/int[@name='numFound'][.='2']
[junit4:junit4]   2> 		xml response was: <?xml version="1.0" encoding="UTF-8"?>
[junit4:junit4]   2> 	<response>
[junit4:junit4]   2> 	<lst name="responseHeader"><int name="status">0</int><int name="QTime">0</int></lst><lst name="spellcheck"><lst name="suggestions"/></lst>
[junit4:junit4]   2> 	</response>
[junit4:junit4]   2> 	
[junit4:junit4]   2> 		request was:q=ac&spellcheck.count=2&qt=/suggest_tst&spellcheck.onlyMorePopular=true
[junit4:junit4]   2> 		at org.apache.solr.SolrTestCaseJ4.assertQ(SolrTestCaseJ4.java:486)
[junit4:junit4]   2> 		at org.apache.solr.SolrTestCaseJ4.assertQ(SolrTestCaseJ4.java:460)
[junit4:junit4]   2> 		at org.apache.solr.spelling.suggest.SuggesterTest.testSuggestions(SuggesterTest.java:71)
[junit4:junit4]   2> 		at sun.reflect.NativeMethodAccessorImpl.invoke0(Native Method)
[junit4:junit4]   2> 		at sun.reflect.NativeMethodAccessorImpl.invoke(NativeMethodAccessorImpl.java:57)
[junit4:junit4]   2> 		at sun.reflect.DelegatingMethodAccessorImpl.invoke(DelegatingMethodAccessorImpl.java:43)
[junit4:junit4]   2> 		at java.lang.reflect.Method.invoke(Method.java:601)
[junit4:junit4]   2> 		at com.carrotsearch.randomizedtesting.RandomizedRunner.invoke(RandomizedRunner.java:1559)
[junit4:junit4]   2> 		at com.carrotsearch.randomizedtesting.RandomizedRunner.access$600(RandomizedRunner.java:79)
[junit4:junit4]   2> 		at com.carrotsearch.randomizedtesting.RandomizedRunner$6.evaluate(RandomizedRunner.java:737)
[junit4:junit4]   2> 		at com.carrotsearch.randomizedtesting.RandomizedRunner$7.evaluate(RandomizedRunner.java:773)
[junit4:junit4]   2> 		at com.carrotsearch.randomizedtesting.RandomizedRunner$8.evaluate(RandomizedRunner.java:787)
[junit4:junit4]   2> 		at com.carrotsearch.randomizedtesting.rules.SystemPropertiesRestoreRule$1.evaluate(SystemPropertiesRestoreRule.java:53)
[junit4:junit4]   2> 		at org.apache.lucene.util.TestRuleSetupTeardownChained$1.evaluate(TestRuleSetupTeardownChained.java:50)
[junit4:junit4]   2> 		at org.apache.lucene.util.TestRuleFieldCacheSanity$1.evaluate(TestRuleFieldCacheSanity.java:51)
[junit4:junit4]   2> 		at org.apache.lucene.util.AbstractBeforeAfterRule$1.evaluate(AbstractBeforeAfterRule.java:45)
[junit4:junit4]   2> 		at com.carrotsearch.randomizedtesting.rules.SystemPropertiesInvariantRule$1.evaluate(SystemPropertiesInvariantRule.java:55)
[junit4:junit4]   2> 		at org.apache.lucene.util.TestRuleThreadAndTestName$1.evaluate(TestRuleThreadAndTestName.java:48)
[junit4:junit4]   2> 		at org.apache.lucene.util.TestRuleIgnoreAfterMaxFailures$1.evaluate(TestRuleIgnoreAfterMaxFailures.java:70)
[junit4:junit4]   2> 		at org.apache.lucene.util.TestRuleMarkFailure$1.evaluate(TestRuleMarkFailure.java:48)
[junit4:junit4]   2> 		at com.carrotsearch.randomizedtesting.rules.StatementAdapter.evaluate(StatementAdapter.java:36)
[junit4:junit4]   2> 		at com.carrotsearch.randomizedtesting.ThreadLeakControl$StatementRunner.run(ThreadLeakControl.java:345)
[junit4:junit4]   2> 		at com.carrotsearch.randomizedtesting.ThreadLeakControl.forkTimeoutingTask(ThreadLeakControl.java:769)
[junit4:junit4]   2> 		at com.carrotsearch.randomizedtesting.ThreadLeakControl$3.evaluate(ThreadLeakControl.java:429)
[junit4:junit4]   2> 		at com.carrotsearch.randomizedtesting.RandomizedRunner.runSingleTest(RandomizedRunner.java:746)
[junit4:junit4]   2> 		at com.carrotsearch.randomizedtesting.RandomizedRunner$3.evaluate(RandomizedRunner.java:648)
[junit4:junit4]   2> 		at com.carrotsearch.randomizedtesting.RandomizedRunner$4.evaluate(RandomizedRunner.java:682)
[junit4:junit4]   2> 		at com.carrotsearch.randomizedtesting.RandomizedRunner$5.evaluate(RandomizedRunner.java:693)
[junit4:junit4]   2> 		at com.carrotsearch.randomizedtesting.rules.StatementAdapter.evaluate(StatementAdapter.java:36)
[junit4:junit4]   2> 		at com.carrotsearch.randomizedtesting.rules.SystemPropertiesRestoreRule$1.evaluate(SystemPropertiesRestoreRule.java:53)
[junit4:junit4]   2> 		at org.apache.lucene.util.AbstractBeforeAfterRule$1.evaluate(AbstractBeforeAfterRule.java:45)
[junit4:junit4]   2> 		at org.apache.lucene.util.TestRuleStoreClassName$1.evaluate(TestRuleStoreClassName.java:42)
[junit4:junit4]   2> 		at com.carrotsearch.randomizedtesting.rules.SystemPropertiesInvariantRule$1.evaluate(SystemPropertiesInvariantRule.java:55)
[junit4:junit4]   2> 		at com.carrotsearch.randomizedtesting.rules.NoShadowingOrOverridesOnMethodsRule$1.evaluate(NoShadowingOrOverridesOnMethodsRule.java:39)
[junit4:junit4]   2> 		at com.carrotsearch.randomizedtesting.rules.NoShadowingOrOverridesOnMethodsRule$1.evaluate(NoShadowingOrOverridesOnMethodsRule.java:39)
[junit4:junit4]   2> 		at org.apache.lucene.util.TestRuleAssertionsRequired$1.evaluate(TestRuleAssertionsRequired.java:40)
[junit4:junit4]   2> 		at org.apache.lucene.util.TestRuleMarkFailure$1.evaluate(TestRuleMarkFailure.java:48)
[junit4:junit4]   2> 		at org.apache.lucene.util.TestRuleIgnoreAfterMaxFailures$1.evaluate(TestRuleIgnoreAfterMaxFailures.java:70)
[junit4:junit4]   2> 		at org.apache.lucene.util.TestRuleIgnoreTestSuites$1.evaluate(TestRuleIgnoreTestSuites.java:55)
[junit4:junit4]   2> 		at com.carrotsearch.randomizedtesting.rules.StatementAdapter.evaluate(StatementAdapter.java:36)
[junit4:junit4]   2> 		at com.carrotsearch.randomizedtesting.ThreadLeakControl$StatementRunner.run(ThreadLeakControl.java:345)
[junit4:junit4]   2> 		at java.lang.Thread.run(Thread.java:722)
[junit4:junit4]   2> 	
[junit4:junit4]   2> 341 T3573 oas.SolrTestCaseJ4.tearDown ###Ending testSuggestions
[junit4:junit4]   2> NOTE: reproduce with: ant test  -Dtestcase=SuggesterTSTTest -Dtests.method=testSuggestions -Dtests.seed=EA4FB8CA688A9555 -Dtests.slow=true -Dtests.locale=ms_MY -Dtests.timezone=America/New_York -Dtests.file.encoding=ISO-8859-1
[junit4:junit4] ERROR   0.13s | SuggesterTSTTest.testSuggestions <<<
[junit4:junit4]    > Throwable #1: java.lang.RuntimeException: Exception during query
[junit4:junit4]    > 	at __randomizedtesting.SeedInfo.seed([EA4FB8CA688A9555:4C93813FA6BEC2AB]:0)
[junit4:junit4]    > 	at org.apache.solr.SolrTestCaseJ4.assertQ(SolrTestCaseJ4.java:493)
[junit4:junit4]    > 	at org.apache.solr.SolrTestCaseJ4.assertQ(SolrTestCaseJ4.java:460)
[junit4:junit4]    > 	at org.apache.solr.spelling.suggest.SuggesterTest.testSuggestions(SuggesterTest.java:71)
[junit4:junit4]    > 	at sun.reflect.NativeMethodAccessorImpl.invoke0(Native Method)
[junit4:junit4]    > 	at sun.reflect.NativeMethodAccessorImpl.invoke(NativeMethodAccessorImpl.java:57)
[junit4:junit4]    > 	at sun.reflect.DelegatingMethodAccessorImpl.invoke(DelegatingMethodAccessorImpl.java:43)
[junit4:junit4]    > 	at java.lang.reflect.Method.invoke(Method.java:601)
[junit4:junit4]    > 	at com.carrotsearch.randomizedtesting.RandomizedRunner.invoke(RandomizedRunner.java:1559)
[junit4:junit4]    > 	at com.carrotsearch.randomizedtesting.RandomizedRunner.access$600(RandomizedRunner.java:79)
[junit4:junit4]    > 	at com.carrotsearch.randomizedtesting.RandomizedRunner$6.evaluate(RandomizedRunner.java:737)
[junit4:junit4]    > 	at com.carrotsearch.randomizedtesting.RandomizedRunner$7.evaluate(RandomizedRunner.java:773)
[junit4:junit4]    > 	at com.carrotsearch.randomizedtesting.RandomizedRunner$8.evaluate(RandomizedRunner.java:787)
[junit4:junit4]    > 	at com.carrotsearch.randomizedtesting.rules.SystemPropertiesRestoreRule$1.evaluate(SystemPropertiesRestoreRule.java:53)
[junit4:junit4]    > 	at org.apache.lucene.util.TestRuleSetupTeardownChained$1.evaluate(TestRuleSetupTeardownChained.java:50)
[junit4:junit4]    > 	at org.apache.lucene.util.TestRuleFieldCacheSanity$1.evaluate(TestRuleFieldCacheSanity.java:51)
[junit4:junit4]    > 	at org.apache.lucene.util.AbstractBeforeAfterRule$1.evaluate(AbstractBeforeAfterRule.java:45)
[junit4:junit4]    > 	at com.carrotsearch.randomizedtesting.rules.SystemPropertiesInvariantRule$1.evaluate(SystemPropertiesInvariantRule.java:55)
[junit4:junit4]    > 	at org.apache.lucene.util.TestRuleThreadAndTestName$1.evaluate(TestRuleThreadAndTestName.java:48)
[junit4:junit4]    > 	at org.apache.lucene.util.TestRuleIgnoreAfterMaxFailures$1.evaluate(TestRuleIgnoreAfterMaxFailures.java:70)
[junit4:junit4]    > 	at org.apache.lucene.util.TestRuleMarkFailure$1.evaluate(TestRuleMarkFailure.java:48)
[junit4:junit4]    > 	at com.carrotsearch.randomizedtesting.rules.StatementAdapter.evaluate(StatementAdapter.java:36)
[junit4:junit4]    > 	at com.carrotsearch.randomizedtesting.ThreadLeakControl$StatementRunner.run(ThreadLeakControl.java:345)
[junit4:junit4]    > 	at com.carrotsearch.randomizedtesting.ThreadLeakControl.forkTimeoutingTask(ThreadLeakControl.java:769)
[junit4:junit4]    > 	at com.carrotsearch.randomizedtesting.ThreadLeakControl$3.evaluate(ThreadLeakControl.java:429)
[junit4:junit4]    > 	at com.carrotsearch.randomizedtesting.RandomizedRunner.runSingleTest(RandomizedRunner.java:746)
[junit4:junit4]    > 	at com.carrotsearch.randomizedtesting.RandomizedRunner$3.evaluate(RandomizedRunner.java:648)
[junit4:junit4]    > 	at com.carrotsearch.randomizedtesting.RandomizedRunner$4.evaluate(RandomizedRunner.java:682)
[junit4:junit4]    > 	at com.carrotsearch.randomizedtesting.RandomizedRunner$5.evaluate(RandomizedRunner.java:693)
[junit4:junit4]    > 	at com.carrotsearch.randomizedtesting.rules.StatementAdapter.evaluate(StatementAdapter.java:36)
[junit4:junit4]    > 	at com.carrotsearch.randomizedtesting.rules.SystemPropertiesRestoreRule$1.evaluate(SystemPropertiesRestoreRule.java:53)
[junit4:junit4]    > 	at org.apache.lucene.util.AbstractBeforeAfterRule$1.evaluate(AbstractBeforeAfterRule.java:45)
[junit4:junit4]    > 	at org.apache.lucene.util.TestRuleStoreClassName$1.evaluate(TestRuleStoreClassName.java:42)
[junit4:junit4]    > 	at com.carrotsearch.randomizedtesting.rules.SystemPropertiesInvariantRule$1.evaluate(SystemPropertiesInvariantRule.java:55)
[junit4:junit4]    > 	at com.carrotsearch.randomizedtesting.rules.NoShadowingOrOverridesOnMethodsRule$1.evaluate(NoShadowingOrOverridesOnMethodsRule.java:39)
[junit4:junit4]    > 	at com.carrotsearch.randomizedtesting.rules.NoShadowingOrOverridesOnMethodsRule$1.evaluate(NoShadowingOrOverridesOnMethodsRule.java:39)
[junit4:junit4]    > 	at org.apache.lucene.util.TestRuleAssertionsRequired$1.evaluate(TestRuleAssertionsRequired.java:40)
[junit4:junit4]    > 	at org.apache.lucene.util.TestRuleMarkFailure$1.evaluate(TestRuleMarkFailure.java:48)
[junit4:junit4]    > 	at org.apache.lucene.util.TestRuleIgnoreAfterMaxFailures$1.evaluate(TestRuleIgnoreAfterMaxFailures.java:70)
[junit4:junit4]    > 	at org.apache.lucene.util.TestRuleIgnoreTestSuites$1.evaluate(TestRuleIgnoreTestSuites.java:55)
[junit4:junit4]    > 	at com.carrotsearch.randomizedtesting.rules.StatementAdapter.evaluate(StatementAdapter.java:36)
[junit4:junit4]    > 	at com.carrotsearch.randomizedtesting.ThreadLeakControl$StatementRunner.run(ThreadLeakControl.java:345)
[junit4:junit4]    > 	at java.lang.Thread.run(Thread.java:722)
[junit4:junit4]    > Caused by: java.lang.RuntimeException: REQUEST FAILED: xpath=//lst[@name='spellcheck']/lst[@name='suggestions']/lst[@name='ac']/int[@name='numFound'][.='2']
[junit4:junit4]    > 	xml response was: <?xml version="1.0" encoding="UTF-8"?>
[junit4:junit4]    > <response>
[junit4:junit4]    > <lst name="responseHeader"><int name="status">0</int><int name="QTime">0</int></lst><lst name="spellcheck"><lst name="suggestions"/></lst>
[junit4:junit4]    > </response>
[junit4:junit4]    > 
[junit4:junit4]    > 	request was:q=ac&spellcheck.count=2&qt=/suggest_tst&spellcheck.onlyMorePopular=true
[junit4:junit4]    > 	at org.apache.solr.SolrTestCaseJ4.assertQ(SolrTestCaseJ4.java:486)
[junit4:junit4]    > 	... 41 more
[junit4:junit4]   2> 357 T3573 oas.SolrTestCaseJ4.setUp ###Starting testAnalyzer
[junit4:junit4]   2> 357 T3573 oasss.Suggester.init init: {lookupImpl=org.apache.solr.spelling.suggest.tst.TSTLookupFactory}
[junit4:junit4]   2> 357 T3573 oas.SolrTestCaseJ4.tearDown ###Ending testAnalyzer
[junit4:junit4]   2> 361 T3573 oas.SolrTestCaseJ4.setUp ###Starting testRebuild
[junit4:junit4]   2> 367 T3573 C266 UPDATE [collection1] webapp=null path=null params={} {add=[1]} 0 1
[junit4:junit4]   2> 375 T3573 C266 UPDATE [collection1] webapp=null path=null params={} {add=[2]} 0 1
[junit4:junit4]   2> 383 T3573 C266 UPDATE [collection1] webapp=null path=null params={} {add=[3]} 0 1
[junit4:junit4]   2> 389 T3573 C266 oasu.DirectUpdateHandler2.commit start commit{flags=0,_version_=0,optimize=false,openSearcher=true,waitSearcher=true,expungeDeletes=false,softCommit=false}
[junit4:junit4]   2> 403 T3573 C266 oasc.SolrDeletionPolicy.onCommit SolrDeletionPolicy.onCommit: commits:num=2
[junit4:junit4]   2> 		commit{dir=MockDirWrapper(org.apache.lucene.store.NIOFSDirectory@C:\Jenkins\workspace\Lucene-Solr-trunk-Windows\solr\build\solr-core\test\J0\solrtest-SuggesterTSTTest-1345310510885\index lockFactory=org.apache.lucene.store.NativeFSLockFactory@b51da8),segFN=segments_2,generation=2,filenames=[_0.fnm, _0_Pulsing40_0.tim, _0_Memory_0.ram, _0_NestedPulsing_0.frq, _0_nrm.cfs, _0_Pulsing40_0.prx, _0_NestedPulsing_0.tip, _0_Pulsing40_0.frq, _0_NestedPulsing_0.prx, _0_NestedPulsing_0.tim, _0_nrm.cfe, segments_2, _0_Pulsing40_0.tip, _0.fdx, _0.si, _0.fdt]
[junit4:junit4]   2> 		commit{dir=MockDirWrapper(org.apache.lucene.store.NIOFSDirectory@C:\Jenkins\workspace\Lucene-Solr-trunk-Windows\solr\build\solr-core\test\J0\solrtest-SuggesterTSTTest-1345310510885\index lockFactory=org.apache.lucene.store.NativeFSLockFactory@b51da8),segFN=segments_3,generation=3,filenames=[_1_NestedPulsing_0.tip, _1_nrm.cfs, _1_Pulsing40_0.tip, _1_NestedPulsing_0.prx, _1_Pulsing40_0.tim, _1.fnm, _1_nrm.cfe, _1_Pulsing40_0.frq, _1.fdx, _1_Memory_0.ram, _1_NestedPulsing_0.frq, _1.fdt, _1.si, _1_Pulsing40_0.prx, _1_NestedPulsing_0.tim, segments_3]
[junit4:junit4]   2> 404 T3573 C266 oasc.SolrDeletionPolicy.updateCommits newest commit = 3
[junit4:junit4]   2> 412 T3573 C266 oass.SolrIndexSearcher.<init> Opening Searcher@1627256 main
[junit4:junit4]   2> 413 T3573 C266 oass.SolrIndexSearcher.getIndexDir WARNING WARNING: Directory impl does not support setting indexDir: org.apache.lucene.store.MockDirectoryWrapper
[junit4:junit4]   2> 413 T3574 oashc.SpellCheckComponent$SpellCheckerListener.buildSpellIndex Building spell index for spell checker: suggest
[junit4:junit4]   2> 413 T3574 oasss.Suggester.build build()
[junit4:junit4]   2> 416 T3574 oasss.Suggester.build Stored suggest data to: C:\Jenkins\workspace\Lucene-Solr-trunk-Windows\solr\build\solr-core\test\J0\.\solrtest-SuggesterTSTTest-1345310510885\suggest\jaspell.dat
[junit4:junit4]   2> 416 T3574 oashc.SpellCheckComponent$SpellCheckerListener.buildSpellIndex Building spell index for spell checker: suggest_tst
[junit4:junit4]   2> 416 T3574 oasss.Suggester.build build()
[junit4:junit4]   2> 423 T3574 oasss.Suggester.build Stored suggest data to: C:\Jenkins\workspace\Lucene-Solr-trunk-Windows\solr\build\solr-core\test\J0\.\solrtest-SuggesterTSTTest-1345310510885\suggest_tst\tst.dat
[junit4:junit4]   2> 423 T3574 oashc.SpellCheckComponent$SpellCheckerListener.buildSpellIndex Building spell index for spell checker: suggest_fst
[junit4:junit4]   2> 423 T3574 oasss.Suggester.build build()
[junit4:junit4]   2> 430 T3574 oasss.Suggester.build Stored suggest data to: C:\Jenkins\workspace\Lucene-Solr-trunk-Windows\solr\build\solr-core\test\J0\.\solrtest-SuggesterTSTTest-1345310510885\suggest_fst\fst.bin
[junit4:junit4]   2> 430 T3574 oashc.SpellCheckComponent$SpellCheckerListener.buildSpellIndex Building spell index for spell checker: suggest_wfst
[junit4:junit4]   2> 430 T3574 oasss.Suggester.build build()
[junit4:junit4]   2> 433 T3574 oasss.Suggester.build Stored suggest data to: C:\Jenkins\workspace\Lucene-Solr-trunk-Windows\solr\build\solr-core\test\J0\.\solrtest-SuggesterTSTTest-1345310510885\suggest_wfst\wfst.bin
[junit4:junit4]   2> 433 T3574 oasc.SolrCore.registerSearcher [collection1] Registered new searcher Searcher@1627256 main{StandardDirectoryReader(segments_3:7 _1(5.0):C3)}
[junit4:junit4]   2> 438 T3573 C266 oasu.DirectUpdateHandler2.commit end_commit_flush
[junit4:junit4]   2> 438 T3573 C266 UPDATE [collection1] webapp=null path=null params={} {commit=} 0 49
[junit4:junit4]   2> 441 T3573 C266 REQ [collection1] webapp=null path=null params={q=ac&spellcheck.count=2&qt=/suggest_tst&spellcheck.onlyMorePopular=true} status=0 QTime=0 
[junit4:junit4]   2> 447 T3573 C266 UPDATE [collection1] webapp=null path=null params={} {add=[4]} 0 0
[junit4:junit4]   2> 453 T3573 C266 oasu.DirectUpdateHandler2.commit start commit{flags=0,_version_=0,optimize=false,openSearcher=true,waitSearcher=true,expungeDeletes=false,softCommit=false}
[junit4:junit4]   2> 468 T3573 C266 oasc.SolrDeletionPolicy.onCommit SolrDeletionPolicy.onCommit: commits:num=2
[junit4:junit4]   2> 		commit{dir=MockDirWrapper(org.apache.lucene.store.NIOFSDirectory@C:\Jenkins\workspace\Lucene-Solr-trunk-Windows\solr\build\solr-core\test\J0\solrtest-SuggesterTSTTest-1345310510885\index lockFactory=org.apache.lucene.store.NativeFSLockFactory@b51da8),segFN=segments_3,generation=3,filenames=[_1_NestedPulsing_0.tip, _1_nrm.cfs, _1_Pulsing40_0.tip, _1_NestedPulsing_0.prx, _1_Pulsing40_0.tim, _1.fnm, _1_nrm.cfe, _1_Pulsing40_0.frq, _1.fdx, _1_Memory_0.ram, _1_NestedPulsing_0.frq, _1.fdt, _1.si, _1_Pulsing40_0.prx, _1_NestedPulsing_0.tim, segments_3]
[junit4:junit4]   2> 		commit{dir=MockDirWrapper(org.apache.lucene.store.NIOFSDirectory@C:\Jenkins\workspace\Lucene-Solr-trunk-Windows\solr\build\solr-core\test\J0\solrtest-SuggesterTSTTest-1345310510885\index lockFactory=org.apache.lucene.store.NativeFSLockFactory@b51da8),segFN=segments_4,generation=4,filenames=[_1_NestedPulsing_0.tip, _2_NestedPulsing_0.tim, _2.si, _2_Pulsing40_0.tim, _1_NestedPulsing_0.prx, _1_Pulsing40_0.tip, _1_Pulsing40_0.tim, _2_Pulsing40_0.tip, _1.fnm, _1_Pulsing40_0.frq, _2_nrm.cfe, _1_Memory_0.ram, _1_Pulsing40_0.prx, _2_Memory_0.ram, _2_nrm.cfs, _1_NestedPulsing_0.tim, _2_NestedPulsing_0.tip, _2_Pulsing40_0.prx, _1_nrm.cfs, _2_NestedPulsing_0.prx, _2.fdt, _2.fdx, _2_Pulsing40_0.frq, _1_nrm.cfe, _2.fnm, _1.fdx, _1_NestedPulsing_0.frq, _1.fdt, _1.si, _2_NestedPulsing_0.frq, segments_4]
[junit4:junit4]   2> 468 T3573 C266 oasc.SolrDeletionPolicy.updateCommits newest commit = 4
[junit4:junit4]   2> 475 T3573 C266 oass.SolrIndexSearcher.<init> Opening Searcher@13f02f8 main
[junit4:junit4]   2> 475 T3573 C266 oass.SolrIndexSearcher.getIndexDir WARNING WARNING: Directory impl does not support setting indexDir: org.apache.lucene.store.MockDirectoryWrapper
[junit4:junit4]   2> 476 T3574 oashc.SpellCheckComponent$SpellCheckerListener.buildSpellIndex Building spell index for spell checker: suggest
[junit4:junit4]   2> 476 T3573 C266 oasu.DirectUpdateHandler2.commit end_commit_flush
[junit4:junit4]   2> 476 T3574 oasss.Suggester.build build()
[junit4:junit4]   2> 479 T3574 oasss.Suggester.build Stored suggest data to: C:\Jenkins\workspace\Lucene-Solr-trunk-Windows\solr\build\solr-core\test\J0\.\solrtest-SuggesterTSTTest-1345310510885\suggest\jaspell.dat
[junit4:junit4]   2> 479 T3574 oashc.SpellCheckComponent$SpellCheckerListener.buildSpellIndex Building spell index for spell checker: suggest_tst
[junit4:junit4]   2> 479 T3574 oasss.Suggester.build build()
[junit4:junit4]   2> 484 T3574 oasss.Suggester.build Stored suggest data to: C:\Jenkins\workspace\Lucene-Solr-trunk-Windows\solr\build\solr-core\test\J0\.\solrtest-SuggesterTSTTest-1345310510885\suggest_tst\tst.dat
[junit4:junit4]   2> 485 T3574 oashc.SpellCheckComponent$SpellCheckerListener.buildSpellIndex Building spell index for spell checker: suggest_fst
[junit4:junit4]   2> 485 T3574 oasss.Suggester.build build()
[junit4:junit4]   2> 491 T3574 oasss.Suggester.build Stored suggest data to: C:\Jenkins\workspace\Lucene-Solr-trunk-Windows\solr\build\solr-core\test\J0\.\solrtest-SuggesterTSTTest-1345310510885\suggest_fst\fst.bin
[junit4:junit4]   2> 491 T3574 oashc.SpellCheckComponent$SpellCheckerListener.buildSpellIndex Building spell index for spell checker: suggest_wfst
[junit4:junit4]   2> 491 T3574 oasss.Suggester.build build()
[junit4:junit4]   2> 495 T3574 oasss.Suggester.build Stored suggest data to: C:\Jenkins\workspace\Lucene-Solr-trunk-Windows\solr\build\solr-core\test\J0\.\solrtest-SuggesterTSTTest-1345310510885\suggest_wfst\wfst.bin
[junit4:junit4]   2> 495 T3574 oasc.SolrCore.registerSearcher [collection1] Registered new searcher Searcher@13f02f8 main{StandardDirectoryReader(segments_4:9 _1(5.0):C3 _2(5.0):C1)}
[junit4:junit4]   2> 496 T3573 C266 UPDATE [collection1] webapp=null path=null params={} {commit=} 0 43
[junit4:junit4]   2> 498 T3573 C266 REQ [collection1] webapp=null path=null params={q=ac&spellcheck.count=2&qt=/suggest_tst&spellcheck.onlyMorePopular=true} status=0 QTime=1 
[junit4:junit4]   2> 499 T3573 oas.SolrTestCaseJ4.tearDown ###Ending testRebuild
[junit4:junit4]   2> 502 T3573 oas.SolrTestCaseJ4.setUp ###Starting testReload
[junit4:junit4]   2> 507 T3573 C266 UPDATE [collection1] webapp=null path=null params={} {add=[1]} 0 1
[junit4:junit4]   2> 513 T3573 C266 UPDATE [collection1] webapp=null path=null params={} {add=[2]} 0 0
[junit4:junit4]   2> 519 T3573 C266 UPDATE [collection1] webapp=null path=null params={} {add=[3]} 0 0
[junit4:junit4]   2> 526 T3573 C266 oasu.DirectUpdateHandler2.commit start commit{flags=0,_version_=0,optimize=false,openSearcher=true,waitSearcher=true,expungeDeletes=false,softCommit=false}
[junit4:junit4]   2> 540 T3573 C266 oasc.SolrDeletionPolicy.onCommit SolrDeletionPolicy.onCommit: commits:num=2
[junit4:junit4]   2> 		commit{dir=MockDirWrapper(org.apache.lucene.store.NIOFSDirectory@C:\Jenkins\workspace\Lucene-Solr-trunk-Windows\solr\build\solr-core\test\J0\solrtest-SuggesterTSTTest-1345310510885\index lockFactory=org.apache.lucene.store.NativeFSLockFactory@b51da8),segFN=segments_4,generation=4,filenames=[_1_NestedPulsing_0.tip, _2_NestedPulsing_0.tim, _2.si, _2_Pulsing40_0.tim, _1_NestedPulsing_0.prx, _1_Pulsing40_0.tip, _1_Pulsing40_0.tim, _2_Pulsing40_0.tip, _1.fnm, _1_Pulsing40_0.frq, _2_nrm.cfe, _1_Memory_0.ram, _1_Pulsing40_0.prx, _2_Memory_0.ram, _2_nrm.cfs, _1_NestedPulsing_0.tim, _2_NestedPulsing_0.tip, _2_Pulsing40_0.prx, _1_nrm.cfs, _2_NestedPulsing_0.prx, _2.fdt, _2.fdx, _2_Pulsing40_0.frq, _1_nrm.cfe, _2.fnm, _1.fdx, _1_NestedPulsing_0.frq, _1.fdt, _1.si, _2_NestedPulsing_0.frq, segments_4]
[junit4:junit4]   2> 		commit{dir=MockDirWrapper(org.apache.lucene.store.NIOFSDirectory@C:\Jenkins\workspace\Lucene-Solr-trunk-Windows\solr\build\solr-core\test\J0\solrtest-SuggesterTSTTest-1345310510885\index lockFactory=org.apache.lucene.store.NativeFSLockFactory@b51da8),segFN=segments_5,generation=5,filenames=[_2.si, _2_NestedPulsing_0.tim, _3_Pulsing40_0.frq, _3_nrm.cfe, _2_Pulsing40_0.tim, _2_Pulsing40_0.tip, _3.fnm, _3.fdt, _3_NestedPulsing_0.prx, _2_nrm.cfe, _2_Memory_0.ram, _3_Memory_0.ram, _2_nrm.cfs, _2_Pulsing40_0.prx, _2_NestedPulsing_0.tip, _2_NestedPulsing_0.prx, _2.fdt, _3_Pulsing40_0.tip, _3_NestedPulsing_0.tim, _2.fdx, _2_Pulsing40_0.frq, _3_Pulsing40_0.tim, _2.fnm, _3.fdx, _3_nrm.cfs, _3_Pulsing40_0.prx, _3_NestedPulsing_0.frq, _3_NestedPulsing_0.tip, _2_NestedPulsing_0.frq, _3.si, segments_5]
[junit4:junit4]   2> 540 T3573 C266 oasc.SolrDeletionPolicy.updateCommits newest commit = 5
[junit4:junit4]   2> 548 T3573 C266 oass.SolrIndexSearcher.<init> Opening Searcher@1a9c4c5 main
[junit4:junit4]   2> 548 T3573 C266 oass.SolrIndexSearcher.getIndexDir WARNING WARNING: Directory impl does not support setting indexDir: org.apache.lucene.store.MockDirectoryWrapper
[junit4:junit4]   2> 549 T3574 oashc.SpellCheckComponent$SpellCheckerListener.buildSpellIndex Building spell index for spell checker: suggest
[junit4:junit4]   2> 548 T3573 C266 oasu.DirectUpdateHandler2.commit end_commit_flush
[junit4:junit4]   2> 549 T3574 oasss.Suggester.build build()
[junit4:junit4]   2> 553 T3574 oasss.Suggester.build Stored suggest data to: C:\Jenkins\workspace\Lucene-Solr-trunk-Windows\solr\build\solr-core\test\J0\.\solrtest-SuggesterTSTTest-1345310510885\suggest\jaspell.dat
[junit4:junit4]   2> 553 T3574 oashc.SpellCheckComponent$SpellCheckerListener.buildSpellIndex Building spell index for spell checker: suggest_tst
[junit4:junit4]   2> 553 T3574 oasss.Suggester.build build()
[junit4:junit4]   2> 563 T3574 oasss.Suggester.build Stored suggest data to: C:\Jenkins\workspace\Lucene-Solr-trunk-Windows\solr\build\solr-core\test\J0\.\solrtest-SuggesterTSTTest-1345310510885\suggest_tst\tst.dat
[junit4:junit4]   2> 563 T3574 oashc.SpellCheckComponent$SpellCheckerListener.buildSpellIndex Building spell index for spell checker: suggest_fst
[junit4:junit4]   2> 563 T3574 oasss.Suggester.build build()
[junit4:junit4]   2> 572 T3574 oasss.Suggester.build Stored suggest data to: C:\Jenkins\workspace\Lucene-Solr-trunk-Windows\solr\build\solr-core\test\J0\.\solrtest-SuggesterTSTTest-1345310510885\suggest_fst\fst.bin
[junit4:junit4]   2> 572 T3574 oashc.SpellCheckComponent$SpellCheckerListener.buildSpellIndex Building spell index for spell checker: suggest_wfst
[junit4:junit4]   2> 572 T3574 oasss.Suggester.build build()
[junit4:junit4]   2> 576 T3574 oasss.Suggester.build Stored suggest data to: C:\Jenkins\workspace\Lucene-Solr-trunk-Windows\solr\build\solr-core\test\J0\.\solrtest-SuggesterTSTTest-1345310510885\suggest_wfst\wfst.bin
[junit4:junit4]   2> 576 T3574 oasc.SolrCore.registerSearcher [collection1] Registered new searcher Searcher@1a9c4c5 main{StandardDirectoryReader(segments_5:13 _2(5.0):C1 _3(5.0):C3)}
[junit4:junit4]   2> 576 T3573 C266 UPDATE [collection1] webapp=null path=null params={} {commit=} 0 50
[junit4:junit4]   2> 578 T3573 oas.SolrTestCaseJ4.deleteCore ###deleteCore
[junit4:junit4]   2> 578 T3573 oasc.CoreContainer.shutdown Shutting down CoreContainer instance=5781178
[junit4:junit4]   2> 579 T3573 oasc.SolrCore.close [collection1]  CLOSING SolrCore org.apache.solr.core.SolrCore@7fd7f5
[junit4:junit4]   2> 579 T3573 oasc.SolrCore.closeSearcher [collection1] Closing main searcher on request.
[junit4:junit4]   2> 579 T3573 oasu.DirectUpdateHandler2.close closing DirectUpdateHandler2{commits=4,autocommits=0,soft autocommits=0,optimizes=0,rollbacks=0,expungeDeletes=0,docsPending=0,adds=0,deletesById=0,deletesByQuery=0,errors=0,cumulative_adds=10,cumulative_deletesById=0,cumulative_deletesByQuery=0,cumulative_errors=0}
[junit4:junit4]   2> 579 T3573 oasu.DefaultSolrCoreState.decref SolrCoreState ref count has reached 0 - closing IndexWriter
[junit4:junit4]   2> NOTE: per solr.test.leavedatadir, dataDir will not be removed: C:\Jenkins\workspace\Lucene-Solr-trunk-Windows\solr\build\solr-core\test\J0\.\solrtest-SuggesterTSTTest-1345310510885
[junit4:junit4]   2> 594 T3573 oas.SolrTestCaseJ4.initCore ####initCore
[junit4:junit4]   2> 595 T3573 oasc.SolrResourceLoader.<init> new SolrResourceLoader for directory: 'C:\Jenkins\workspace\Lucene-Solr-trunk-Windows\solr\build\solr-core\test-files\solr\collection1\'
[junit4:junit4]   2> 595 T3573 oasc.SolrResourceLoader.replaceClassLoader Adding 'file:/C:/Jenkins/workspace/Lucene-Solr-trunk-Windows/solr/build/solr-core/test-files/solr/collection1/lib/classes/' to classloader
[junit4:junit4]   2> 596 T3573 oasc.SolrResourceLoader.replaceClassLoader Adding 'file:/C:/Jenkins/workspace/Lucene-Solr-trunk-Windows/solr/build/solr-core/test-files/solr/collection1/lib/README' to classloader
[junit4:junit4]   2> 638 T3573 oasc.SolrConfig.<init> Using Lucene MatchVersion: LUCENE_50
[junit4:junit4]   2> 696 T3573 oasc.SolrConfig.<init> Loaded SolrConfig: solrconfig-spellchecker.xml
[junit4:junit4]   2> 696 T3573 oass.IndexSchema.readSchema Reading Solr Schema
[junit4:junit4]   2> 700 T3573 oass.IndexSchema.readSchema Schema name=test
[junit4:junit4]   2> 1408 T3573 oass.OpenExchangeRatesOrgProvider.init Initialized with rates=open-exchange-rates.json, refreshInterval=1440.
[junit4:junit4]   2> 1417 T3573 oass.IndexSchema.readSchema default search field in schema is text
[junit4:junit4]   2> 1421 T3573 oass.IndexSchema.readSchema unique key field: id
[junit4:junit4]   2> 1427 T3573 oass.FileExchangeRateProvider.reload Reloading exchange rates from file currency.xml
[junit4:junit4]   2> 1431 T3573 oass.FileExchangeRateProvider.reload Reloading exchange rates from file currency.xml
[junit4:junit4]   2> 1435 T3573 oass.OpenExchangeRatesOrgProvider.reload Reloading exchange rates from open-exchange-rates.json
[junit4:junit4]   2> 1436 T3573 oass.OpenExchangeRatesOrgProvider.reload Reloading exchange rates from open-exchange-rates.json
[junit4:junit4]   2> 1437 T3573 oasc.SolrResourceLoader.locateSolrHome JNDI not configured for solr (NoInitialContextEx)
[junit4:junit4]   2> 1437 T3573 oasc.SolrResourceLoader.locateSolrHome using system property solr.solr.home: C:\Jenkins\workspace\Lucene-Solr-trunk-Windows\solr\build\solr-core\test-files\solr
[junit4:junit4]   2> 1437 T3573 oasc.SolrResourceLoader.<init> new SolrResourceLoader for directory: 'C:\Jenkins\workspace\Lucene-Solr-trunk-Windows\solr\build\solr-core\test-files\solr\'
[junit4:junit4]   2> 1447 T3573 oasc.CoreContainer.<init> New CoreContainer 11211820
[junit4:junit4]   2> 1447 T3573 oasc.SolrCore.<init> [collection1] Opening new SolrCore at C:\Jenkins\workspace\Lucene-Solr-trunk-Windows\solr\build\solr-core\test-files\solr\collection1\, dataDir=C:\Jenkins\workspace\Lucene-Solr-trunk-Windows\solr\build\solr-core\test\J0\.\solrtest-SuggesterTSTTest-1345310510885\
[junit4:junit4]   2> 1447 T3573 oasc.SolrCore.<init> JMX monitoring not detected for core: collection1
[junit4:junit4]   2> 1448 T3573 oasc.SolrCore.getNewIndexDir WARNING New index directory detected: old=null new=C:\Jenkins\workspace\Lucene-Solr-trunk-Windows\solr\build\solr-core\test\J0\.\solrtest-SuggesterTSTTest-1345310510885\index/
[junit4:junit4]   2> 1449 T3573 oasc.RequestHandlers.initHandlersFromConfig created standard: solr.StandardRequestHandler
[junit4:junit4]   2> 1449 T3573 oasc.RequestHandlers.initHandlersFromConfig created /suggest: org.apache.solr.handler.component.SearchHandler
[junit4:junit4]   2> 1450 T3573 oasc.RequestHandlers.initHandlersFromConfig created /suggest_tst: org.apache.solr.handler.component.SearchHandler
[junit4:junit4]   2> 1450 T3573 oasc.RequestHandlers.initHandlersFromConfig created /suggest_fst: org.apache.solr.handler.component.SearchHandler
[junit4:junit4]   2> 1450 T3573 oasc.RequestHandlers.initHandlersFromConfig created /suggest_wfst: org.apache.solr.handler.component.SearchHandler
[junit4:junit4]   2> 1455 T3573 oasc.CachingDirectoryFactory.get return new directory for C:\Jenkins\workspace\Lucene-Solr-trunk-Windows\solr\build\solr-core\test\J0\.\solrtest-SuggesterTSTTest-1345310510885\index forceNew:false
[junit4:junit4]   2> 1463 T3573 oass.SolrIndexSearcher.<init> Opening Searcher@21acc main
[junit4:junit4]   2> 1463 T3573 oass.SolrIndexSearcher.getIndexDir WARNING WARNING: Directory impl does not support setting indexDir: org.apache.lucene.store.MockDirectoryWrapper
[junit4:junit4]   2> 1464 T3573 oasu.CommitTracker.<init> Hard AutoCommit: disabled
[junit4:junit4]   2> 1464 T3573 oasu.CommitTracker.<init> Soft AutoCommit: disabled
[junit4:junit4]   2> 1464 T3573 oashc.SpellCheckComponent.inform Initializing spell checkers
[junit4:junit4]   2> 1465 T3573 oasss.Suggester.init init: {name=suggest,classname=org.apache.solr.spelling.suggest.Suggester,lookupImpl=org.apache.solr.spelling.suggest.jaspell.JaspellLookup,field=suggest,storeDir=suggest,buildOnCommit=true,threshold=0.0}
[junit4:junit4]   2> 1465 T3573 oasssj.JaspellLookupFactory.create init: {name=suggest,classname=org.apache.solr.spelling.suggest.Suggester,lookupImpl=org.apache.solr.spelling.suggest.jaspell.JaspellLookup,field=suggest,storeDir=suggest,buildOnCommit=true,threshold=0.0}
[junit4:junit4]   2> 1466 T3573 oashc.SpellCheckComponent.inform Registering newSearcher listener for spellchecker: suggest
[junit4:junit4]   2> 1466 T3573 oashc.SpellCheckComponent.inform No queryConverter defined, using default converter
[junit4:junit4]   2> 1467 T3573 oashc.SpellCheckComponent.inform Initializing spell checkers
[junit4:junit4]   2> 1467 T3573 oasss.Suggester.init init: {name=suggest_tst,classname=org.apache.solr.spelling.suggest.Suggester,lookupImpl=org.apache.solr.spelling.suggest.tst.TSTLookup,field=suggest,storeDir=suggest_tst,buildOnCommit=true,threshold=0.0}
[junit4:junit4]   2> 1468 T3573 oashc.SpellCheckComponent.inform Registering newSearcher listener for spellchecker: suggest_tst
[junit4:junit4]   2> 1468 T3573 oashc.SpellCheckComponent.inform No queryConverter defined, using default converter
[junit4:junit4]   2> 1469 T3573 oashc.SpellCheckComponent.inform Initializing spell checkers
[junit4:junit4]   2> 1469 T3573 oasss.Suggester.init init: {name=suggest_fst,classname=org.apache.solr.spelling.suggest.Suggester,lookupImpl=org.apache.solr.spelling.suggest.fst.FSTLookup,field=suggest,storeDir=suggest_fst,buildOnCommit=true,weightBuckets=5,exactMatchFirst=true}
[junit4:junit4]   2> 1469 T3573 oashc.SpellCheckComponent.inform Registering newSearcher listener for spellchecker: suggest_fst
[junit4:junit4]   2> 1470 T3573 oashc.SpellCheckComponent.inform No queryConverter defined, using default converter
[junit4:junit4]   2> 1470 T3573 oashc.SpellCheckComponent.inform Initializing spell checkers
[junit4:junit4]   2> 1470 T3573 oasss.Suggester.init init: {name=suggest_wfst,classname=org.apache.solr.spelling.suggest.Suggester,lookupImpl=org.apache.solr.spelling.suggest.fst.WFSTLookupFactory,field=suggest,storeDir=suggest_wfst,buildOnCommit=true,exactMatchFirst=true}
[junit4:junit4]   2> 1471 T3573 oashc.SpellCheckComponent.inform Registering newSearcher listener for spellchecker: suggest_wfst
[junit4:junit4]   2> 1471 T3573 oashc.SpellCheckComponent.inform No queryConverter defined, using default converter
[junit4:junit4]   2> 1471 T3573 oashc.HttpShardHandlerFactory.getParameter Setting socketTimeout to: 0
[junit4:junit4]   2> 1471 T3573 oashc.HttpShardHandlerFactory.getParameter Setting urlScheme to: http://
[junit4:junit4]   2> 1472 T3573 oashc.HttpShardHandlerFactory.getParameter Setting connTimeout to: 0
[junit4:junit4]   2> 1472 T3573 oashc.HttpShardHandlerFactory.getParameter Setting maxConnectionsPerHost to: 20
[junit4:junit4]   2> 1472 T3573 oashc.HttpShardHandlerFactory.getParameter Setting corePoolSize to: 0
[junit4:junit4]   2> 1472 T3573 oashc.HttpShardHandlerFactory.getParameter Setting maximumPoolSize to: 2147483647
[junit4:junit4]   2> 1473 T3573 oashc.HttpShardHandlerFactory.getParameter Setting maxThreadIdleTime to: 5
[junit4:junit4]   2> 1473 T3573 oashc.HttpShardHandlerFactory.getParameter Setting sizeOfQueue to: -1
[junit4:junit4]   2> 1473 T3573 oashc.HttpShardHandlerFactory.getParameter Setting fairnessPolicy to: false
[junit4:junit4]   2> 1473 T3573 oascsi.HttpClientUtil.createClient Creating new http client, config:maxConnectionsPerHost=20&maxConnections=10000&socketTimeout=0&connTimeout=0&retry=false
[junit4:junit4]   2> 1478 T3575 oasc.SolrCore.registerSearcher [collection1] Registered new searcher Searcher@21acc main{StandardDirectoryReader(segments_5:13 _2(5.0):C1 _3(5.0):C3)}
[junit4:junit4]   2> 1478 T3573 oasc.CoreContainer.register registering core: collection1
[junit4:junit4]   2> 1480 T3573 oas.SolrTestCaseJ4.initCore ####initCore end
[junit4:junit4]   2> ASYNC  NEW_CORE C267 name=collection1 org.apache.solr.core.SolrCore@1b87fb9
[junit4:junit4]   2> 1480 T3573 C267 REQ [collection1] webapp=null path=null params={q=ac&spellcheck.count=2&qt=/suggest_tst&spellcheck.onlyMorePopular=true} status=0 QTime=0 
[junit4:junit4]   2> 1489 T3573 oas.SolrTestCaseJ4.tearDown ###Ending testReload
[junit4:junit4]   2> 1490 T3573 oas.SolrTestCaseJ4.deleteCore ###deleteCore
[junit4:junit4]   2> 1490 T3573 oasc.CoreContainer.shutdown Shutting down CoreContainer instance=11211820
[junit4:junit4]   2> 1490 T3573 oasc.SolrCore.close [collection1]  CLOSING SolrCore org.apache.solr.core.SolrCore@1b87fb9
[junit4:junit4]   2> 1491 T3573 oasc.SolrCore.closeSearcher [collection1] Closing main searcher on request.
[junit4:junit4]   2> 1493 T3573 oasu.DirectUpdateHandler2.close closing DirectUpdateHandler2{commits=0,autocommits=0,soft autocommits=0,optimizes=0,rollbacks=0,expungeDeletes=0,docsPending=0,adds=0,deletesById=0,deletesByQuery=0,errors=0,cumulative_adds=0,cumulative_deletesById=0,cumulative_deletesByQuery=0,cumulative_errors=0}
[junit4:junit4]   2> 1493 T3573 oasu.DefaultSolrCoreState.decref SolrCoreState ref count has reached 0 - closing IndexWriter
[junit4:junit4]   2> NOTE: test params are: codec=Lucene40: {id=PostingsFormat(name=Memory doPackFST= false), text=PostingsFormat(name=NestedPulsing), suggest=Pulsing40(freqCutoff=18 minBlockSize=57 maxBlockSize=182), spell=Pulsing40(freqCutoff=18 minBlockSize=57 maxBlockSize=182)}, sim=RandomSimilarityProvider(queryNorm=false,coord=no): {}, locale=ms_MY, timezone=America/New_York
[junit4:junit4]   2> NOTE: Windows 7 6.1 x86/Oracle Corporation 1.7.0_05 (32-bit)/cpus=2,threads=1,free=407783128,total=490733568
[junit4:junit4]   2> NOTE: All tests run in this JVM: [TestUtils, PrimitiveFieldTypeTest, TestMultiCoreConfBootstrap, TestSuggestSpellingConverter, SpellingQueryConverterTest, XsltUpdateRequestHandlerTest, BinaryUpdateRequestHandlerTest, TestLRUCache, LoggingHandlerTest, TestReplicationHandler, TermVectorComponentTest, TestFastWriter, TestStressRecovery, TestSort, SpellCheckComponentTest, AlternateDirectoryTest, NotRequiredUniqueKeyTest, SolrRequestParserTest, TestDistributedSearch, ScriptEngineTest, TestLMJelinekMercerSimilarityFactory, BasicDistributedZk2Test, TestBinaryResponseWriter, ReturnFieldsTest, ClusterStateTest, TestCharFilters, DocumentBuilderTest, OpenExchangeRatesOrgProviderTest, URLClassifyProcessorTest, JsonLoaderTest, MoreLikeThisHandlerTest, UpdateRequestProcessorFactoryTest, TestQueryTypes, TestRemoteStreaming, CSVRequestHandlerTest, SyncSliceTest, ZkCLITest, TestReload, TestSolrDeletionPolicy2, SolrCoreCheckLockOnStartupTest, ZkControllerTest, SolrCoreTest, TestJoin, ConvertedLegacyTest, TestJmxIntegration, TestStressReorder, CacheHeaderTest, TestReversedWildcardFilterFactory, TestWordDelimiterFilterFactory, TestStressLucene, BasicZkTest, JSONWriterTest, LukeRequestHandlerTest, StatelessScriptUpdateProcessorFactoryTest, TestConfig, TestBadConfig, FieldMutatingUpdateProcessorTest, FileUtilsTest, TestPerFieldSimilarity, BadComponentTest, TestStressVersions, TestSolrJ, TestBM25SimilarityFactory, TestQuerySenderListener, TestIndexingPerformance, SimplePostToolTest, TestSolrQueryParser, SuggesterTest, PingRequestHandlerTest, TestPropInject, TestSystemIdResolver, SimpleFacetsTest, PolyFieldTest, TestNumberUtils, TestArbitraryIndexDir, TestUpdate, NoCacheHeaderTest, TestLMDirichletSimilarityFactory, SystemInfoHandlerTest, TestCollationField, ResourceLoaderTest, SoftAutoCommitTest, HighlighterConfigTest, ZkNodePropsTest, RAMDirectoryFactoryTest, TestCodecSupport, TestRandomFaceting, TestLFUCache, MultiTermTest, ZkSolrClientTest, PathHierarchyTokenizerFactoryTest, TermsComponentTest, TestOmitPositions, StandardRequestHandlerTest, TestDefaultSimilarityFactory, TestFastOutputStream, TermVectorComponentDistributedTest, TestPhraseSuggestions, TestDocumentBuilder, TestTrie, TestRTGBase, FastVectorHighlighterTest, SuggesterFSTTest, BasicFunctionalityTest, SuggesterWFSTTest, TestSearchPerf, SpellPossibilityIteratorTest, TestPHPSerializedResponseWriter, TestValueSourceCache, BasicDistributedZkTest, OverseerTest, RecoveryZkTest, FullSolrCloudDistribCmdsTest, LeaderElectionIntegrationTest, LeaderElectionTest, DistributedSpellCheckComponentTest, TestRealTimeGet, TestDistributedGrouping, SpellCheckCollatorTest, TestExtendedDismaxParser, AutoCommitTest, TestFaceting, WordBreakSolrSpellCheckerTest, TestHashPartitioner, DistributedTermsComponentTest, StatsComponentTest, TestRecovery, IndexBasedSpellCheckerTest, TestRangeQuery, DirectUpdateHandlerTest, TestCoreContainer, TestGroupingSearch, DirectSolrSpellCheckerTest, TestFiltering, FileBasedSpellCheckerTest, PeerSyncTest, QueryElevationComponentTest, SortByFunctionTest, SignatureUpdateProcessorFactoryTest, SampleTest, HighlighterTest, TestIndexSearcher, CoreAdminHandlerTest, TestFunctionQuery, DirectSolrConnectionTest, QueryEqualityTest, TestCSVLoader, SpatialFilterTest, TestCSVResponseWriter, MBeansHandlerTest, DistributedQueryElevationComponentTest, CurrencyFieldTest, TestPseudoReturnFields, DisMaxRequestHandlerTest, IndexSchemaTest, QueryParsingTest, DistanceFunctionTest, SolrInfoMBeanTest, MinimalSchemaTest, XmlUpdateRequestHandlerTest, FieldAnalysisRequestHandlerTest, TestSurroundQueryParser, DocumentAnalysisRequestHandlerTest, DirectUpdateHandlerOptimizeTest, IndexSchemaRuntimeFieldTest, SolrPluginUtilsTest, DebugComponentTest, RequestHandlersTest, SearchHandlerTest, RequiredFieldsTest, CopyFieldTest, TestQueryUtils, SuggesterTSTTest]
[junit4:junit4] Completed in 1.56s, 4 tests, 1 error <<< FAILURES!

[...truncated 153 lines...]
BUILD FAILED
C:\Jenkins\workspace\Lucene-Solr-trunk-Windows\build.xml:29: The following error occurred while executing this line:
C:\Jenkins\workspace\Lucene-Solr-trunk-Windows\solr\build.xml:144: The following error occurred while executing this line:
C:\Jenkins\workspace\Lucene-Solr-trunk-Windows\lucene\module-build.xml:62: The following error occurred while executing this line:
C:\Jenkins\workspace\Lucene-Solr-trunk-Windows\lucene\common-build.xml:1105: The following error occurred while executing this line:
C:\Jenkins\workspace\Lucene-Solr-trunk-Windows\lucene\common-build.xml:797: There were test failures: 227 suites, 915 tests, 1 error, 11 ignored (6 assumptions)

Total time: 34 minutes 46 seconds
Build step 'Invoke Ant' marked build as failure
Recording test results
Description set: Java: 32bit/jdk1.7.0_05 -server -XX:+UseG1GC
Email was triggered for: Failure
Sending email for trigger: Failure



Mime
View raw message