lucene-dev mailing list archives

Site index · List index
Message view « Date » · « Thread »
Top « Date » · « Thread »
From Policeman Jenkins Server <jenk...@sd-datasolutions.de>
Subject [JENKINS] Lucene-Solr-4.x-Linux (32bit/jdk1.8.0-ea-b49) - Build # 114 - Still Failing!
Date Thu, 02 Aug 2012 20:18:15 GMT
Build: http://jenkins.sd-datasolutions.de/job/Lucene-Solr-4.x-Linux/114/
Java: 32bit/jdk1.8.0-ea-b49 -client -XX:+UseSerialGC

1 tests failed.
FAILED:  org.apache.solr.handler.component.DistributedQueryElevationComponentTest.testDistribSearch

Error Message:
.responseHeader.params.shards.qt:/elevate!=false

Stack Trace:
junit.framework.AssertionFailedError: .responseHeader.params.shards.qt:/elevate!=false
	at __randomizedtesting.SeedInfo.seed([7D037B2225CB717A:FCE5F53A52941146]:0)
	at junit.framework.Assert.fail(Assert.java:50)
	at org.apache.solr.BaseDistributedSearchTestCase.compareResponses(BaseDistributedSearchTestCase.java:670)
	at org.apache.solr.BaseDistributedSearchTestCase.query(BaseDistributedSearchTestCase.java:392)
	at org.apache.solr.handler.component.DistributedQueryElevationComponentTest.doTest(DistributedQueryElevationComponentTest.java:81)
	at org.apache.solr.BaseDistributedSearchTestCase.testDistribSearch(BaseDistributedSearchTestCase.java:679)
	at sun.reflect.NativeMethodAccessorImpl.invoke0(Native Method)
	at sun.reflect.NativeMethodAccessorImpl.invoke(NativeMethodAccessorImpl.java:57)
	at sun.reflect.DelegatingMethodAccessorImpl.invoke(DelegatingMethodAccessorImpl.java:43)
	at java.lang.reflect.Method.invoke(Method.java:474)
	at com.carrotsearch.randomizedtesting.RandomizedRunner.invoke(RandomizedRunner.java:1995)
	at com.carrotsearch.randomizedtesting.RandomizedRunner.access$1100(RandomizedRunner.java:132)
	at com.carrotsearch.randomizedtesting.RandomizedRunner$6.evaluate(RandomizedRunner.java:818)
	at com.carrotsearch.randomizedtesting.RandomizedRunner$7.evaluate(RandomizedRunner.java:877)
	at com.carrotsearch.randomizedtesting.RandomizedRunner$8.evaluate(RandomizedRunner.java:891)
	at com.carrotsearch.randomizedtesting.rules.SystemPropertiesRestoreRule$1.evaluate(SystemPropertiesRestoreRule.java:53)
	at org.apache.lucene.util.TestRuleSetupTeardownChained$1.evaluate(TestRuleSetupTeardownChained.java:50)
	at org.apache.lucene.util.TestRuleFieldCacheSanity$1.evaluate(TestRuleFieldCacheSanity.java:32)
	at org.apache.lucene.util.AbstractBeforeAfterRule$1.evaluate(AbstractBeforeAfterRule.java:45)
	at com.carrotsearch.randomizedtesting.rules.SystemPropertiesInvariantRule$1.evaluate(SystemPropertiesInvariantRule.java:55)
	at org.apache.lucene.util.TestRuleReportUncaughtExceptions$1.evaluate(TestRuleReportUncaughtExceptions.java:68)
	at org.apache.lucene.util.TestRuleThreadAndTestName$1.evaluate(TestRuleThreadAndTestName.java:48)
	at org.apache.lucene.util.TestRuleIgnoreAfterMaxFailures$1.evaluate(TestRuleIgnoreAfterMaxFailures.java:70)
	at org.apache.lucene.util.TestRuleMarkFailure$1.evaluate(TestRuleMarkFailure.java:48)
	at com.carrotsearch.randomizedtesting.RandomizedRunner.runSingleTest(RandomizedRunner.java:825)
	at com.carrotsearch.randomizedtesting.RandomizedRunner.access$700(RandomizedRunner.java:132)
	at com.carrotsearch.randomizedtesting.RandomizedRunner$3$1.run(RandomizedRunner.java:671)
	at com.carrotsearch.randomizedtesting.RandomizedRunner$3.evaluate(RandomizedRunner.java:697)
	at com.carrotsearch.randomizedtesting.RandomizedRunner$4.evaluate(RandomizedRunner.java:736)
	at com.carrotsearch.randomizedtesting.RandomizedRunner$5.evaluate(RandomizedRunner.java:747)
	at com.carrotsearch.randomizedtesting.rules.SystemPropertiesRestoreRule$1.evaluate(SystemPropertiesRestoreRule.java:53)
	at org.apache.lucene.util.AbstractBeforeAfterRule$1.evaluate(AbstractBeforeAfterRule.java:45)
	at org.apache.lucene.util.TestRuleReportUncaughtExceptions$1.evaluate(TestRuleReportUncaughtExceptions.java:68)
	at org.apache.lucene.util.TestRuleStoreClassName$1.evaluate(TestRuleStoreClassName.java:38)
	at com.carrotsearch.randomizedtesting.rules.SystemPropertiesInvariantRule$1.evaluate(SystemPropertiesInvariantRule.java:55)
	at org.apache.lucene.util.TestRuleNoInstanceHooksOverrides$1.evaluate(TestRuleNoInstanceHooksOverrides.java:53)
	at org.apache.lucene.util.TestRuleNoStaticHooksShadowing$1.evaluate(TestRuleNoStaticHooksShadowing.java:52)
	at org.apache.lucene.util.TestRuleAssertionsRequired$1.evaluate(TestRuleAssertionsRequired.java:36)
	at org.apache.lucene.util.TestRuleMarkFailure$1.evaluate(TestRuleMarkFailure.java:48)
	at org.apache.lucene.util.TestRuleIgnoreAfterMaxFailures$1.evaluate(TestRuleIgnoreAfterMaxFailures.java:70)
	at org.apache.lucene.util.TestRuleIgnoreTestSuites$1.evaluate(TestRuleIgnoreTestSuites.java:55)
	at com.carrotsearch.randomizedtesting.RandomizedRunner.runSuite(RandomizedRunner.java:605)
	at com.carrotsearch.randomizedtesting.RandomizedRunner.access$400(RandomizedRunner.java:132)
	at com.carrotsearch.randomizedtesting.RandomizedRunner$2.run(RandomizedRunner.java:551)




Build Log:
[...truncated 7373 lines...]
[junit4:junit4] Suite: org.apache.solr.handler.component.DistributedQueryElevationComponentTest
[junit4:junit4] FAILURE 1.57s J1 | DistributedQueryElevationComponentTest.testDistribSearch
[junit4:junit4]    > Throwable #1: junit.framework.AssertionFailedError: .responseHeader.params.shards.qt:/elevate!=false
[junit4:junit4]    > 	at __randomizedtesting.SeedInfo.seed([7D037B2225CB717A:FCE5F53A52941146]:0)
[junit4:junit4]    > 	at junit.framework.Assert.fail(Assert.java:50)
[junit4:junit4]    > 	at org.apache.solr.BaseDistributedSearchTestCase.compareResponses(BaseDistributedSearchTestCase.java:670)
[junit4:junit4]    > 	at org.apache.solr.BaseDistributedSearchTestCase.query(BaseDistributedSearchTestCase.java:392)
[junit4:junit4]    > 	at org.apache.solr.handler.component.DistributedQueryElevationComponentTest.doTest(DistributedQueryElevationComponentTest.java:81)
[junit4:junit4]    > 	at org.apache.solr.BaseDistributedSearchTestCase.testDistribSearch(BaseDistributedSearchTestCase.java:679)
[junit4:junit4]    > 	at sun.reflect.NativeMethodAccessorImpl.invoke0(Native Method)
[junit4:junit4]    > 	at sun.reflect.NativeMethodAccessorImpl.invoke(NativeMethodAccessorImpl.java:57)
[junit4:junit4]    > 	at sun.reflect.DelegatingMethodAccessorImpl.invoke(DelegatingMethodAccessorImpl.java:43)
[junit4:junit4]    > 	at java.lang.reflect.Method.invoke(Method.java:474)
[junit4:junit4]    > 	at com.carrotsearch.randomizedtesting.RandomizedRunner.invoke(RandomizedRunner.java:1995)
[junit4:junit4]    > 	at com.carrotsearch.randomizedtesting.RandomizedRunner.access$1100(RandomizedRunner.java:132)
[junit4:junit4]    > 	at com.carrotsearch.randomizedtesting.RandomizedRunner$6.evaluate(RandomizedRunner.java:818)
[junit4:junit4]    > 	at com.carrotsearch.randomizedtesting.RandomizedRunner$7.evaluate(RandomizedRunner.java:877)
[junit4:junit4]    > 	at com.carrotsearch.randomizedtesting.RandomizedRunner$8.evaluate(RandomizedRunner.java:891)
[junit4:junit4]    > 	at com.carrotsearch.randomizedtesting.rules.SystemPropertiesRestoreRule$1.evaluate(SystemPropertiesRestoreRule.java:53)
[junit4:junit4]    > 	at org.apache.lucene.util.TestRuleSetupTeardownChained$1.evaluate(TestRuleSetupTeardownChained.java:50)
[junit4:junit4]    > 	at org.apache.lucene.util.TestRuleFieldCacheSanity$1.evaluate(TestRuleFieldCacheSanity.java:32)
[junit4:junit4]    > 	at org.apache.lucene.util.AbstractBeforeAfterRule$1.evaluate(AbstractBeforeAfterRule.java:45)
[junit4:junit4]    > 	at com.carrotsearch.randomizedtesting.rules.SystemPropertiesInvariantRule$1.evaluate(SystemPropertiesInvariantRule.java:55)
[junit4:junit4]    > 	at org.apache.lucene.util.TestRuleReportUncaughtExceptions$1.evaluate(TestRuleReportUncaughtExceptions.java:68)
[junit4:junit4]    > 	at org.apache.lucene.util.TestRuleThreadAndTestName$1.evaluate(TestRuleThreadAndTestName.java:48)
[junit4:junit4]    > 	at org.apache.lucene.util.TestRuleIgnoreAfterMaxFailures$1.evaluate(TestRuleIgnoreAfterMaxFailures.java:70)
[junit4:junit4]    > 	at org.apache.lucene.util.TestRuleMarkFailure$1.evaluate(TestRuleMarkFailure.java:48)
[junit4:junit4]    > 	at com.carrotsearch.randomizedtesting.RandomizedRunner.runSingleTest(RandomizedRunner.java:825)
[junit4:junit4]    > 	at com.carrotsearch.randomizedtesting.RandomizedRunner.access$700(RandomizedRunner.java:132)
[junit4:junit4]    > 	at com.carrotsearch.randomizedtesting.RandomizedRunner$3$1.run(RandomizedRunner.java:671)
[junit4:junit4]    > 	at com.carrotsearch.randomizedtesting.RandomizedRunner$3.evaluate(RandomizedRunner.java:697)
[junit4:junit4]    > 	at com.carrotsearch.randomizedtesting.RandomizedRunner$4.evaluate(RandomizedRunner.java:736)
[junit4:junit4]    > 	at com.carrotsearch.randomizedtesting.RandomizedRunner$5.evaluate(RandomizedRunner.java:747)
[junit4:junit4]    > 	at com.carrotsearch.randomizedtesting.rules.SystemPropertiesRestoreRule$1.evaluate(SystemPropertiesRestoreRule.java:53)
[junit4:junit4]    > 	at org.apache.lucene.util.AbstractBeforeAfterRule$1.evaluate(AbstractBeforeAfterRule.java:45)
[junit4:junit4]    > 	at org.apache.lucene.util.TestRuleReportUncaughtExceptions$1.evaluate(TestRuleReportUncaughtExceptions.java:68)
[junit4:junit4]    > 	at org.apache.lucene.util.TestRuleStoreClassName$1.evaluate(TestRuleStoreClassName.java:38)
[junit4:junit4]    > 	at com.carrotsearch.randomizedtesting.rules.SystemPropertiesInvariantRule$1.evaluate(SystemPropertiesInvariantRule.java:55)
[junit4:junit4]    > 	at org.apache.lucene.util.TestRuleNoInstanceHooksOverrides$1.evaluate(TestRuleNoInstanceHooksOverrides.java:53)
[junit4:junit4]    > 	at org.apache.lucene.util.TestRuleNoStaticHooksShadowing$1.evaluate(TestRuleNoStaticHooksShadowing.java:52)
[junit4:junit4]    > 	at org.apache.lucene.util.TestRuleAssertionsRequired$1.evaluate(TestRuleAssertionsRequired.java:36)
[junit4:junit4]    > 	at org.apache.lucene.util.TestRuleMarkFailure$1.evaluate(TestRuleMarkFailure.java:48)
[junit4:junit4]    > 	at org.apache.lucene.util.TestRuleIgnoreAfterMaxFailures$1.evaluate(TestRuleIgnoreAfterMaxFailures.java:70)
[junit4:junit4]    > 	at org.apache.lucene.util.TestRuleIgnoreTestSuites$1.evaluate(TestRuleIgnoreTestSuites.java:55)
[junit4:junit4]    > 	at com.carrotsearch.randomizedtesting.RandomizedRunner.runSuite(RandomizedRunner.java:605)
[junit4:junit4]    > 	at com.carrotsearch.randomizedtesting.RandomizedRunner.access$400(RandomizedRunner.java:132)
[junit4:junit4]    > 	at com.carrotsearch.randomizedtesting.RandomizedRunner$2.run(RandomizedRunner.java:551)
[junit4:junit4]    > 
[junit4:junit4]   2> 2 T1302 oas.SolrTestCaseJ4.setUp ###Starting testDistribSearch
[junit4:junit4]   2> 3 T1302 oejs.Server.doStart jetty-8.1.2.v20120308
[junit4:junit4]   2> 6 T1302 oejs.AbstractConnector.doStart Started SocketConnector@0.0.0.0:34550
[junit4:junit4]   2> 6 T1302 oasc.SolrResourceLoader.locateSolrHome JNDI not configured for solr (NoInitialContextEx)
[junit4:junit4]   2> 6 T1302 oasc.SolrResourceLoader.locateSolrHome using system property solr.solr.home: /mnt/ssd/jenkins/workspace/Lucene-Solr-4.x-Linux/checkout/solr/build/solr-core/test-files/solr
[junit4:junit4]   2> 6 T1302 oasc.SolrResourceLoader.<init> new SolrResourceLoader for deduced Solr Home: '/mnt/ssd/jenkins/workspace/Lucene-Solr-4.x-Linux/checkout/solr/build/solr-core/test-files/solr/'
[junit4:junit4]   2> 13 T1302 oass.SolrDispatchFilter.init SolrDispatchFilter.init()
[junit4:junit4]   2> 14 T1302 oasc.SolrResourceLoader.locateSolrHome JNDI not configured for solr (NoInitialContextEx)
[junit4:junit4]   2> 14 T1302 oasc.SolrResourceLoader.locateSolrHome using system property solr.solr.home: /mnt/ssd/jenkins/workspace/Lucene-Solr-4.x-Linux/checkout/solr/build/solr-core/test-files/solr
[junit4:junit4]   2> 14 T1302 oasc.CoreContainer$Initializer.initialize looking for solr.xml: /mnt/ssd/jenkins/workspace/Lucene-Solr-4.x-Linux/checkout/solr/build/solr-core/test-files/solr/solr.xml
[junit4:junit4]   2> 14 T1302 oasc.CoreContainer.<init> New CoreContainer 2309574
[junit4:junit4]   2> 15 T1302 oasc.CoreContainer.load Loading CoreContainer using Solr Home: '/mnt/ssd/jenkins/workspace/Lucene-Solr-4.x-Linux/checkout/solr/build/solr-core/test-files/solr/'
[junit4:junit4]   2> 15 T1302 oasc.SolrResourceLoader.<init> new SolrResourceLoader for directory: '/mnt/ssd/jenkins/workspace/Lucene-Solr-4.x-Linux/checkout/solr/build/solr-core/test-files/solr/'
[junit4:junit4]   2> 24 T1302 oasc.CoreContainer.load Registering Log Listener
[junit4:junit4]   2> 40 T1302 oasc.CoreContainer.create Creating SolrCore 'collection1' using instanceDir: /mnt/ssd/jenkins/workspace/Lucene-Solr-4.x-Linux/checkout/solr/build/solr-core/test-files/solr/collection1
[junit4:junit4]   2> 41 T1302 oasc.SolrResourceLoader.<init> new SolrResourceLoader for directory: '/mnt/ssd/jenkins/workspace/Lucene-Solr-4.x-Linux/checkout/solr/build/solr-core/test-files/solr/collection1/'
[junit4:junit4]   2> 41 T1302 oasc.SolrResourceLoader.replaceClassLoader Adding 'file:/mnt/ssd/jenkins/workspace/Lucene-Solr-4.x-Linux/checkout/solr/build/solr-core/test-files/solr/collection1/lib/README' to classloader
[junit4:junit4]   2> 42 T1302 oasc.SolrResourceLoader.replaceClassLoader Adding 'file:/mnt/ssd/jenkins/workspace/Lucene-Solr-4.x-Linux/checkout/solr/build/solr-core/test-files/solr/collection1/lib/classes/' to classloader
[junit4:junit4]   2> 63 T1302 oasc.SolrConfig.<init> Using Lucene MatchVersion: LUCENE_40
[junit4:junit4]   2> 104 T1302 oasc.SolrConfig.<init> Loaded SolrConfig: solrconfig-elevate.xml
[junit4:junit4]   2> 104 T1302 oass.IndexSchema.readSchema Reading Solr Schema
[junit4:junit4]   2> 107 T1302 oass.IndexSchema.readSchema Schema name=example
[junit4:junit4]   2> 269 T1302 oass.IndexSchema.readSchema default search field in schema is text
[junit4:junit4]   2> 271 T1302 oass.IndexSchema.readSchema unique key field: id
[junit4:junit4]   2> 273 T1302 oasc.SolrCore.<init> [collection1] Opening new SolrCore at /mnt/ssd/jenkins/workspace/Lucene-Solr-4.x-Linux/checkout/solr/build/solr-core/test-files/solr/collection1/, dataDir=./org.apache.solr.handler.component.DistributedQueryElevationComponentTest-1343938378199/control/data/
[junit4:junit4]   2> 274 T1302 oasc.JmxMonitoredMap.<init> JMX monitoring is enabled. Adding Solr mbeans to JMX Server: com.sun.jmx.mbeanserver.JmxMBeanServer@14412b0
[junit4:junit4]   2> 274 T1302 oasc.SolrCore.getNewIndexDir WARNING New index directory detected: old=null new=./org.apache.solr.handler.component.DistributedQueryElevationComponentTest-1343938378199/control/data/index/
[junit4:junit4]   2> 274 T1302 oasc.SolrCore.initIndex WARNING [collection1] Solr index directory './org.apache.solr.handler.component.DistributedQueryElevationComponentTest-1343938378199/control/data/index' doesn't exist. Creating new index...
[junit4:junit4]   2> 276 T1302 oasc.SolrDeletionPolicy.onCommit SolrDeletionPolicy.onCommit: commits:num=1
[junit4:junit4]   2> 		commit{dir=MockDirWrapper(org.apache.lucene.store.RAMDirectory@18cf082 lockFactory=org.apache.lucene.store.SingleInstanceLockFactory@bae4a),segFN=segments_1,generation=1,filenames=[segments_1]
[junit4:junit4]   2> 276 T1302 oasc.SolrDeletionPolicy.updateCommits newest commit = 1
[junit4:junit4]   2> 277 T1302 oasc.RequestHandlers.initHandlersFromConfig created /update: solr.UpdateRequestHandler
[junit4:junit4]   2> 277 T1302 oasc.RequestHandlers.initHandlersFromConfig created /elevate: org.apache.solr.handler.component.SearchHandler
[junit4:junit4]   2> 277 T1302 oasc.RequestHandlers.initHandlersFromConfig created /dataElevate: org.apache.solr.handler.component.SearchHandler
[junit4:junit4]   2> 278 T1302 oashl.XMLLoader.init xsltCacheLifetimeSeconds=60
[junit4:junit4]   2> 278 T1302 oasc.RequestHandlers.initHandlersFromConfig WARNING no default request handler is registered (either '/select' or 'standard')
[junit4:junit4]   2> 279 T1302 oasc.SolrCore.initDeprecatedSupport WARNING solrconfig.xml uses deprecated <admin/gettableFiles>, Please update your config to use the ShowFileRequestHandler.
[junit4:junit4]   2> 280 T1302 oasc.SolrCore.initDeprecatedSupport WARNING adding ShowFileRequestHandler with hidden files: [SCHEMA-LUCENEMATCHVERSION.XML, SCHEMA-BM25.XML, SOLRCONFIG-TLOG.XML, SOLRCONFIG-SPELLCHECKCOMPONENT.XML, SOLRCONFIG-TERMINDEX.XML, SCHEMA.XML, BAD-SCHEMA-OMIT-TF-BUT-NOT-POS.XML, MISSING.FUNCTIONS.UPDATEPROCESSOR.JS, BAD-SCHEMA-UNIQUEKEY-USES-DEFAULT.XML, HUNSPELL-TEST.DIC, KEEP-2.TXT, SOLRCONFIG-REPEATER.XML, SOLRCONFIG-QUERYSENDER-NOQUERY.XML, SCHEMA-BINARYFIELD.XML, SCHEMA-SPELLCHECKER.XML, THROW.ERROR.ON.ADD.UPDATEPROCESSOR.JS, BAD-SCHEMA-DUP-FIELD.XML, BAD-SOLRCONFIG-INVALID-SCRIPTFILE.XML, SOLRCONFIG-FUNCTIONQUERY.XML, SOLRCONFIG-SOLCOREPROPERTIES.XML, SOLRCONFIG-MASTER2.XML, WDFTYPES.TXT, CONDITIONAL.UPDATEPROCESSOR.JS, SOLRCONFIG-LAZYWRITER.XML, HYPHENATION.DTD, SOLRCONFIG-HIGHLIGHT.XML, SOLRCONFIG-NOCACHE.XML, OPEN-EXCHANGE-RATES.JSON, SOLRCONFIG_PERF.XML, SCHEMA-COLLATEFILTER.XML, DA_UTF8.XML, SCHEMA-LMJELINEKMERCER.XML, SOLRCONFIG-PROPINJECT-INDEXDEFAULT.XML, BAD-SCHEMA-NOT-INDEXED-BUT-NORMS.XML, BAD-SCHEMA-SIM-GLOBAL-VS-FT-MISMATCH.XML, SCHEMA-FOLDING.XML, SCHEMA-TRIE.XML, MAPPING-ISOLATIN1ACCENT.TXT, MISSLEADING.EXTENSION.UPDATEPROCESSOR.JS.TXT, SOLRCONFIG-ENABLEPLUGIN.XML, SOLRCONFIG-QUERYSENDER.XML, STOPWORDS.TXT, SOLRCONFIG-TRANSFORMERS.XML, SCHEMA-LMDIRICHLET.XML, SOLRCONFIG-DELPOLICY2.XML, STOPWORDSWRONGENCODING.TXT, SOLRCONFIG-CACHING.XML, SOLRCONFIG-XINCLUDE.XML, BAD-SCHEMA-DUP-FIELDTYPE.XML, SCHEMA-STOP-KEEP.XML, BAD-SCHEMA-NOT-INDEXED-BUT-POS.XML, PHRASESUGGEST.TXT, PROTWORDS.TXT, SOLRCONFIG_CODEC.XML, TRIVIAL.UPDATEPROCESSOR1.JS, COMPOUNDDICTIONARY.TXT, BAD-SOLRCONFIG-MISSING-SCRIPTFILE.XML, SOLRCONFIG-SIMPLELOCK.XML, SCHEMA-COLLATE.XML, BAD-SCHEMA-DUP-DYNAMICFIELD.XML, ELEVATE.XML, SCHEMA-NOT-REQUIRED-UNIQUE-KEY.XML, BAD-SCHEMA-ANALYZER-CLASS-AND-NESTED.XML, SOLRCONFIG-SLAVE1.XML, SOLRCONFIG-MASTER1-KEEPONEBACKUP.XML, FRENCHARTICLES.TXT, STOP-1.TXT, SOLRCONFIG-PHRASESUGGEST.XML, TRIVIAL.UPDATEPROCESSOR0.JS, BAD-MP-SOLRCONFIG.XML, SOLRCONFIG-NATIVELOCK.XML, SOLRCONFIG-DELPOLICY1.XML, DA_COMPOUNDDICTIONARY.TXT, SCHEMA15.XML, STOPTYPES-2.TXT, KEEP-1.TXT, SCHEMA12.XML, SOLRCONFIG-SLAVE.XML, SOLRCONFIG-MERGEPOLICY.XML, SCHEMA-REVERSED.XML, SCHEMA-NUMERIC.XML, BAD-SCHEMA-NONTEXT-ANALYZER.XML, BAD-SCHEMA-CODEC-GLOBAL-VS-FT-MISMATCH.XML, SCHEMA-PHRASESUGGEST.XML, STOPWITHBOM.TXT, SOLRCONFIG-BASIC.XML, SOLRCONFIG-BASIC-LUCENEVERSION31.XML, BAD-SCHEMA-NOT-INDEXED-BUT-TF.XML, SCHEMA_CODEC.XML, SCHEMA-MINIMAL.XML, STEMDICT.TXT, STOP-SNOWBALL.TXT, SOLRCONFIG-SOLR-749.XML, SOLRCONFIG-SPELLCHECKER.XML, SOLRCONFIG-MASTER3.XML, SOLRCONFIG-SCRIPT-UPDATEPROCESSOR.XML, SOLRCONFIG-MASTER1.XML, SCHEMA-REPLICATION1.XML, SYNONYMS.TXT, SOLRCONFIG-ELEVATE.XML, OLD_SYNONYMS.TXT, SCHEMA-REPLICATION2.XML, SOLRCONFIG-ALTDIRECTORY.XML, STOPTYPES-1.TXT, BAD-SCHEMA-EXTERNAL-FILEFIELD.XML, SCHEMA-DFR.XML, SCHEMA-IB.XML, HUNSPELL-TEST.AFF, SCHEMA11.XML, BAD-SCHEMA-UNIQUEKEY-IS-COPYFIELD-DEST.XML, STOP-2.TXT, BAD-SCHEMA-UNIQUEKEY-MULTIVALUED.XML, XSLT, SOLRCONFIG-UPDATE-PROCESSOR-CHAINS.XML, SCHEMA-SIM.XML, SCHEMA-CHARFILTERS.XML, SCHEMA-COPYFIELD-TEST.XML, SOLRCONFIG-PROPINJECT.XML, ADDFIELDS.UPDATEPROCESSOR.JS, SCHEMA-TFIDF.XML, BAD_SOLRCONFIG.XML, BAD-SOLRCONFIG-BOGUS-SCRIPTENGINE-NAME.XML, SCHEMASURROUND.XML, SOLRCONFIG-MASTER.XML, CURRENCY.XML, SCHEMA-REQUIRED-FIELDS.XML, SOLRCONFIG-REQHANDLER.INCL]
[junit4:junit4]   2> 282 T1302 oass.SolrIndexSearcher.<init> Opening Searcher@191e67c main
[junit4:junit4]   2> 282 T1302 oass.SolrIndexSearcher.getIndexDir WARNING WARNING: Directory impl does not support setting indexDir: org.apache.lucene.store.MockDirectoryWrapper
[junit4:junit4]   2> 283 T1302 oasu.CommitTracker.<init> Hard AutoCommit: disabled
[junit4:junit4]   2> 283 T1302 oasu.CommitTracker.<init> Soft AutoCommit: disabled
[junit4:junit4]   2> 283 T1302 oashc.QueryElevationComponent.inform Loading QueryElevation from: /mnt/ssd/jenkins/workspace/Lucene-Solr-4.x-Linux/checkout/solr/build/solr-core/test-files/solr/collection1/conf/elevate.xml
[junit4:junit4]   2> 289 T1302 oashc.QueryElevationComponent.inform Loading QueryElevation from: /mnt/ssd/jenkins/workspace/Lucene-Solr-4.x-Linux/checkout/solr/build/solr-core/test-files/solr/collection1/conf/elevate.xml
[junit4:junit4]   2> 296 T1302 oashc.HttpShardHandlerFactory.getParameter Setting socketTimeout to: 0
[junit4:junit4]   2> 296 T1302 oashc.HttpShardHandlerFactory.getParameter Setting urlScheme to: http://
[junit4:junit4]   2> 296 T1302 oashc.HttpShardHandlerFactory.getParameter Setting connTimeout to: 0
[junit4:junit4]   2> 297 T1302 oashc.HttpShardHandlerFactory.getParameter Setting maxConnectionsPerHost to: 20
[junit4:junit4]   2> 297 T1302 oashc.HttpShardHandlerFactory.getParameter Setting corePoolSize to: 0
[junit4:junit4]   2> 297 T1302 oashc.HttpShardHandlerFactory.getParameter Setting maximumPoolSize to: 2147483647
[junit4:junit4]   2> 297 T1302 oashc.HttpShardHandlerFactory.getParameter Setting maxThreadIdleTime to: 5
[junit4:junit4]   2> 297 T1302 oashc.HttpShardHandlerFactory.getParameter Setting sizeOfQueue to: -1
[junit4:junit4]   2> 298 T1302 oashc.HttpShardHandlerFactory.getParameter Setting fairnessPolicy to: false
[junit4:junit4]   2> 298 T1302 oascsi.HttpClientUtil.createClient Creating new http client, config:maxConnectionsPerHost=20&maxConnections=10000&socketTimeout=0&connTimeout=0&retry=false
[junit4:junit4]   2> 301 T1312 oasc.SolrCore.registerSearcher [collection1] Registered new searcher Searcher@191e67c main{StandardDirectoryReader(segments_1:1)}
[junit4:junit4]   2> 301 T1302 oasc.CoreContainer.register registering core: collection1
[junit4:junit4]   2> 301 T1302 oass.SolrDispatchFilter.init user.dir=/mnt/ssd/jenkins/workspace/Lucene-Solr-4.x-Linux/checkout/solr/build/solr-core/test/J1
[junit4:junit4]   2> 301 T1302 oass.SolrDispatchFilter.init SolrDispatchFilter.init() done
[junit4:junit4]   2> 301 T1302 oascsi.HttpClientUtil.createClient Creating new http client, config:maxConnections=128&maxConnectionsPerHost=32&followRedirects=false
[junit4:junit4]   2> 304 T1302 oejs.Server.doStart jetty-8.1.2.v20120308
[junit4:junit4]   2> 309 T1302 oejs.AbstractConnector.doStart Started SocketConnector@0.0.0.0:57157
[junit4:junit4]   2> 310 T1302 oasc.SolrResourceLoader.locateSolrHome JNDI not configured for solr (NoInitialContextEx)
[junit4:junit4]   2> 310 T1302 oasc.SolrResourceLoader.locateSolrHome using system property solr.solr.home: /mnt/ssd/jenkins/workspace/Lucene-Solr-4.x-Linux/checkout/solr/build/solr-core/test-files/solr
[junit4:junit4]   2> 310 T1302 oasc.SolrResourceLoader.<init> new SolrResourceLoader for deduced Solr Home: '/mnt/ssd/jenkins/workspace/Lucene-Solr-4.x-Linux/checkout/solr/build/solr-core/test-files/solr/'
[junit4:junit4]   2> 317 T1302 oass.SolrDispatchFilter.init SolrDispatchFilter.init()
[junit4:junit4]   2> 317 T1302 oasc.SolrResourceLoader.locateSolrHome JNDI not configured for solr (NoInitialContextEx)
[junit4:junit4]   2> 317 T1302 oasc.SolrResourceLoader.locateSolrHome using system property solr.solr.home: /mnt/ssd/jenkins/workspace/Lucene-Solr-4.x-Linux/checkout/solr/build/solr-core/test-files/solr
[junit4:junit4]   2> 318 T1302 oasc.CoreContainer$Initializer.initialize looking for solr.xml: /mnt/ssd/jenkins/workspace/Lucene-Solr-4.x-Linux/checkout/solr/build/solr-core/test-files/solr/solr.xml
[junit4:junit4]   2> 318 T1302 oasc.CoreContainer.<init> New CoreContainer 16205071
[junit4:junit4]   2> 318 T1302 oasc.CoreContainer.load Loading CoreContainer using Solr Home: '/mnt/ssd/jenkins/workspace/Lucene-Solr-4.x-Linux/checkout/solr/build/solr-core/test-files/solr/'
[junit4:junit4]   2> 318 T1302 oasc.SolrResourceLoader.<init> new SolrResourceLoader for directory: '/mnt/ssd/jenkins/workspace/Lucene-Solr-4.x-Linux/checkout/solr/build/solr-core/test-files/solr/'
[junit4:junit4]   2> 328 T1302 oasc.CoreContainer.load Registering Log Listener
[junit4:junit4]   2> 339 T1302 oasc.CoreContainer.create Creating SolrCore 'collection1' using instanceDir: /mnt/ssd/jenkins/workspace/Lucene-Solr-4.x-Linux/checkout/solr/build/solr-core/test-files/solr/collection1
[junit4:junit4]   2> 340 T1302 oasc.SolrResourceLoader.<init> new SolrResourceLoader for directory: '/mnt/ssd/jenkins/workspace/Lucene-Solr-4.x-Linux/checkout/solr/build/solr-core/test-files/solr/collection1/'
[junit4:junit4]   2> 340 T1302 oasc.SolrResourceLoader.replaceClassLoader Adding 'file:/mnt/ssd/jenkins/workspace/Lucene-Solr-4.x-Linux/checkout/solr/build/solr-core/test-files/solr/collection1/lib/README' to classloader
[junit4:junit4]   2> 341 T1302 oasc.SolrResourceLoader.replaceClassLoader Adding 'file:/mnt/ssd/jenkins/workspace/Lucene-Solr-4.x-Linux/checkout/solr/build/solr-core/test-files/solr/collection1/lib/classes/' to classloader
[junit4:junit4]   2> 366 T1302 oasc.SolrConfig.<init> Using Lucene MatchVersion: LUCENE_40
[junit4:junit4]   2> 406 T1302 oasc.SolrConfig.<init> Loaded SolrConfig: solrconfig-elevate.xml
[junit4:junit4]   2> 406 T1302 oass.IndexSchema.readSchema Reading Solr Schema
[junit4:junit4]   2> 409 T1302 oass.IndexSchema.readSchema Schema name=example
[junit4:junit4]   2> 571 T1302 oass.IndexSchema.readSchema default search field in schema is text
[junit4:junit4]   2> 573 T1302 oass.IndexSchema.readSchema unique key field: id
[junit4:junit4]   2> 575 T1302 oasc.SolrCore.<init> [collection1] Opening new SolrCore at /mnt/ssd/jenkins/workspace/Lucene-Solr-4.x-Linux/checkout/solr/build/solr-core/test-files/solr/collection1/, dataDir=./org.apache.solr.handler.component.DistributedQueryElevationComponentTest-1343938378199/shard0/data/
[junit4:junit4]   2> 575 T1302 oasc.JmxMonitoredMap.<init> JMX monitoring is enabled. Adding Solr mbeans to JMX Server: com.sun.jmx.mbeanserver.JmxMBeanServer@14412b0
[junit4:junit4]   2> 576 T1302 oasc.SolrCore.getNewIndexDir WARNING New index directory detected: old=null new=./org.apache.solr.handler.component.DistributedQueryElevationComponentTest-1343938378199/shard0/data/index/
[junit4:junit4]   2> 576 T1302 oasc.SolrCore.initIndex WARNING [collection1] Solr index directory './org.apache.solr.handler.component.DistributedQueryElevationComponentTest-1343938378199/shard0/data/index' doesn't exist. Creating new index...
[junit4:junit4]   2> 578 T1302 oasc.SolrDeletionPolicy.onCommit SolrDeletionPolicy.onCommit: commits:num=1
[junit4:junit4]   2> 		commit{dir=MockDirWrapper(org.apache.lucene.store.NIOFSDirectory@/mnt/ssd/jenkins/workspace/Lucene-Solr-4.x-Linux/checkout/solr/build/solr-core/test/J1/index5199452002tmp lockFactory=org.apache.lucene.store.SingleInstanceLockFactory@ff52ee),segFN=segments_1,generation=1,filenames=[segments_1]
[junit4:junit4]   2> 578 T1302 oasc.SolrDeletionPolicy.updateCommits newest commit = 1
[junit4:junit4]   2> 579 T1302 oasc.RequestHandlers.initHandlersFromConfig created /update: solr.UpdateRequestHandler
[junit4:junit4]   2> 579 T1302 oasc.RequestHandlers.initHandlersFromConfig created /elevate: org.apache.solr.handler.component.SearchHandler
[junit4:junit4]   2> 579 T1302 oasc.RequestHandlers.initHandlersFromConfig created /dataElevate: org.apache.solr.handler.component.SearchHandler
[junit4:junit4]   2> 580 T1302 oashl.XMLLoader.init xsltCacheLifetimeSeconds=60
[junit4:junit4]   2> 580 T1302 oasc.RequestHandlers.initHandlersFromConfig WARNING no default request handler is registered (either '/select' or 'standard')
[junit4:junit4]   2> 581 T1302 oasc.SolrCore.initDeprecatedSupport WARNING solrconfig.xml uses deprecated <admin/gettableFiles>, Please update your config to use the ShowFileRequestHandler.
[junit4:junit4]   2> 586 T1302 oasc.SolrCore.initDeprecatedSupport WARNING adding ShowFileRequestHandler with hidden files: [SCHEMA-LUCENEMATCHVERSION.XML, SCHEMA-BM25.XML, SOLRCONFIG-TLOG.XML, SOLRCONFIG-SPELLCHECKCOMPONENT.XML, SOLRCONFIG-TERMINDEX.XML, SCHEMA.XML, BAD-SCHEMA-OMIT-TF-BUT-NOT-POS.XML, MISSING.FUNCTIONS.UPDATEPROCESSOR.JS, BAD-SCHEMA-UNIQUEKEY-USES-DEFAULT.XML, HUNSPELL-TEST.DIC, KEEP-2.TXT, SOLRCONFIG-REPEATER.XML, SOLRCONFIG-QUERYSENDER-NOQUERY.XML, SCHEMA-BINARYFIELD.XML, SCHEMA-SPELLCHECKER.XML, THROW.ERROR.ON.ADD.UPDATEPROCESSOR.JS, BAD-SCHEMA-DUP-FIELD.XML, BAD-SOLRCONFIG-INVALID-SCRIPTFILE.XML, SOLRCONFIG-FUNCTIONQUERY.XML, SOLRCONFIG-SOLCOREPROPERTIES.XML, SOLRCONFIG-MASTER2.XML, WDFTYPES.TXT, CONDITIONAL.UPDATEPROCESSOR.JS, SOLRCONFIG-LAZYWRITER.XML, HYPHENATION.DTD, SOLRCONFIG-HIGHLIGHT.XML, SOLRCONFIG-NOCACHE.XML, OPEN-EXCHANGE-RATES.JSON, SOLRCONFIG_PERF.XML, SCHEMA-COLLATEFILTER.XML, DA_UTF8.XML, SCHEMA-LMJELINEKMERCER.XML, SOLRCONFIG-PROPINJECT-INDEXDEFAULT.XML, BAD-SCHEMA-NOT-INDEXED-BUT-NORMS.XML, BAD-SCHEMA-SIM-GLOBAL-VS-FT-MISMATCH.XML, SCHEMA-FOLDING.XML, SCHEMA-TRIE.XML, MAPPING-ISOLATIN1ACCENT.TXT, MISSLEADING.EXTENSION.UPDATEPROCESSOR.JS.TXT, SOLRCONFIG-ENABLEPLUGIN.XML, SOLRCONFIG-QUERYSENDER.XML, STOPWORDS.TXT, SOLRCONFIG-TRANSFORMERS.XML, SCHEMA-LMDIRICHLET.XML, SOLRCONFIG-DELPOLICY2.XML, STOPWORDSWRONGENCODING.TXT, SOLRCONFIG-CACHING.XML, SOLRCONFIG-XINCLUDE.XML, BAD-SCHEMA-DUP-FIELDTYPE.XML, SCHEMA-STOP-KEEP.XML, BAD-SCHEMA-NOT-INDEXED-BUT-POS.XML, PHRASESUGGEST.TXT, PROTWORDS.TXT, SOLRCONFIG_CODEC.XML, TRIVIAL.UPDATEPROCESSOR1.JS, COMPOUNDDICTIONARY.TXT, BAD-SOLRCONFIG-MISSING-SCRIPTFILE.XML, SOLRCONFIG-SIMPLELOCK.XML, SCHEMA-COLLATE.XML, BAD-SCHEMA-DUP-DYNAMICFIELD.XML, ELEVATE.XML, SCHEMA-NOT-REQUIRED-UNIQUE-KEY.XML, BAD-SCHEMA-ANALYZER-CLASS-AND-NESTED.XML, SOLRCONFIG-SLAVE1.XML, SOLRCONFIG-MASTER1-KEEPONEBACKUP.XML, FRENCHARTICLES.TXT, STOP-1.TXT, SOLRCONFIG-PHRASESUGGEST.XML, TRIVIAL.UPDATEPROCESSOR0.JS, BAD-MP-SOLRCONFIG.XML, SOLRCONFIG-NATIVELOCK.XML, SOLRCONFIG-DELPOLICY1.XML, DA_COMPOUNDDICTIONARY.TXT, SCHEMA15.XML, STOPTYPES-2.TXT, KEEP-1.TXT, SCHEMA12.XML, SOLRCONFIG-SLAVE.XML, SOLRCONFIG-MERGEPOLICY.XML, SCHEMA-REVERSED.XML, SCHEMA-NUMERIC.XML, BAD-SCHEMA-NONTEXT-ANALYZER.XML, BAD-SCHEMA-CODEC-GLOBAL-VS-FT-MISMATCH.XML, SCHEMA-PHRASESUGGEST.XML, STOPWITHBOM.TXT, SOLRCONFIG-BASIC.XML, SOLRCONFIG-BASIC-LUCENEVERSION31.XML, BAD-SCHEMA-NOT-INDEXED-BUT-TF.XML, SCHEMA_CODEC.XML, SCHEMA-MINIMAL.XML, STEMDICT.TXT, STOP-SNOWBALL.TXT, SOLRCONFIG-SOLR-749.XML, SOLRCONFIG-SPELLCHECKER.XML, SOLRCONFIG-MASTER3.XML, SOLRCONFIG-SCRIPT-UPDATEPROCESSOR.XML, SOLRCONFIG-MASTER1.XML, SCHEMA-REPLICATION1.XML, SYNONYMS.TXT, SOLRCONFIG-ELEVATE.XML, OLD_SYNONYMS.TXT, SCHEMA-REPLICATION2.XML, SOLRCONFIG-ALTDIRECTORY.XML, STOPTYPES-1.TXT, BAD-SCHEMA-EXTERNAL-FILEFIELD.XML, SCHEMA-DFR.XML, SCHEMA-IB.XML, HUNSPELL-TEST.AFF, SCHEMA11.XML, BAD-SCHEMA-UNIQUEKEY-IS-COPYFIELD-DEST.XML, STOP-2.TXT, BAD-SCHEMA-UNIQUEKEY-MULTIVALUED.XML, XSLT, SOLRCONFIG-UPDATE-PROCESSOR-CHAINS.XML, SCHEMA-SIM.XML, SCHEMA-CHARFILTERS.XML, SCHEMA-COPYFIELD-TEST.XML, SOLRCONFIG-PROPINJECT.XML, ADDFIELDS.UPDATEPROCESSOR.JS, SCHEMA-TFIDF.XML, BAD_SOLRCONFIG.XML, BAD-SOLRCONFIG-BOGUS-SCRIPTENGINE-NAME.XML, SCHEMASURROUND.XML, SOLRCONFIG-MASTER.XML, CURRENCY.XML, SCHEMA-REQUIRED-FIELDS.XML, SOLRCONFIG-REQHANDLER.INCL]
[junit4:junit4]   2> 588 T1302 oass.SolrIndexSearcher.<init> Opening Searcher@185ff15 main
[junit4:junit4]   2> 589 T1302 oass.SolrIndexSearcher.getIndexDir WARNING WARNING: Directory impl does not support setting indexDir: org.apache.lucene.store.MockDirectoryWrapper
[junit4:junit4]   2> 589 T1302 oasu.CommitTracker.<init> Hard AutoCommit: disabled
[junit4:junit4]   2> 589 T1302 oasu.CommitTracker.<init> Soft AutoCommit: disabled
[junit4:junit4]   2> 589 T1302 oashc.QueryElevationComponent.inform Loading QueryElevation from: /mnt/ssd/jenkins/workspace/Lucene-Solr-4.x-Linux/checkout/solr/build/solr-core/test-files/solr/collection1/conf/elevate.xml
[junit4:junit4]   2> 596 T1302 oashc.QueryElevationComponent.inform Loading QueryElevation from: /mnt/ssd/jenkins/workspace/Lucene-Solr-4.x-Linux/checkout/solr/build/solr-core/test-files/solr/collection1/conf/elevate.xml
[junit4:junit4]   2> 602 T1302 oashc.HttpShardHandlerFactory.getParameter Setting socketTimeout to: 0
[junit4:junit4]   2> 602 T1302 oashc.HttpShardHandlerFactory.getParameter Setting urlScheme to: http://
[junit4:junit4]   2> 602 T1302 oashc.HttpShardHandlerFactory.getParameter Setting connTimeout to: 0
[junit4:junit4]   2> 603 T1302 oashc.HttpShardHandlerFactory.getParameter Setting maxConnectionsPerHost to: 20
[junit4:junit4]   2> 603 T1302 oashc.HttpShardHandlerFactory.getParameter Setting corePoolSize to: 0
[junit4:junit4]   2> 603 T1302 oashc.HttpShardHandlerFactory.getParameter Setting maximumPoolSize to: 2147483647
[junit4:junit4]   2> 603 T1302 oashc.HttpShardHandlerFactory.getParameter Setting maxThreadIdleTime to: 5
[junit4:junit4]   2> 604 T1302 oashc.HttpShardHandlerFactory.getParameter Setting sizeOfQueue to: -1
[junit4:junit4]   2> 604 T1302 oashc.HttpShardHandlerFactory.getParameter Setting fairnessPolicy to: false
[junit4:junit4]   2> 604 T1302 oascsi.HttpClientUtil.createClient Creating new http client, config:maxConnectionsPerHost=20&maxConnections=10000&socketTimeout=0&connTimeout=0&retry=false
[junit4:junit4]   2> 606 T1322 oasc.SolrCore.registerSearcher [collection1] Registered new searcher Searcher@185ff15 main{StandardDirectoryReader(segments_1:1)}
[junit4:junit4]   2> 606 T1302 oasc.CoreContainer.register registering core: collection1
[junit4:junit4]   2> 607 T1302 oass.SolrDispatchFilter.init user.dir=/mnt/ssd/jenkins/workspace/Lucene-Solr-4.x-Linux/checkout/solr/build/solr-core/test/J1
[junit4:junit4]   2> 607 T1302 oass.SolrDispatchFilter.init SolrDispatchFilter.init() done
[junit4:junit4]   2> 607 T1302 oascsi.HttpClientUtil.createClient Creating new http client, config:maxConnections=128&maxConnectionsPerHost=32&followRedirects=false
[junit4:junit4]   2> 609 T1302 oejs.Server.doStart jetty-8.1.2.v20120308
[junit4:junit4]   2> 610 T1302 oejs.AbstractConnector.doStart Started SocketConnector@0.0.0.0:52875
[junit4:junit4]   2> 611 T1302 oasc.SolrResourceLoader.locateSolrHome JNDI not configured for solr (NoInitialContextEx)
[junit4:junit4]   2> 611 T1302 oasc.SolrResourceLoader.locateSolrHome using system property solr.solr.home: /mnt/ssd/jenkins/workspace/Lucene-Solr-4.x-Linux/checkout/solr/build/solr-core/test-files/solr
[junit4:junit4]   2> 611 T1302 oasc.SolrResourceLoader.<init> new SolrResourceLoader for deduced Solr Home: '/mnt/ssd/jenkins/workspace/Lucene-Solr-4.x-Linux/checkout/solr/build/solr-core/test-files/solr/'
[junit4:junit4]   2> 618 T1302 oass.SolrDispatchFilter.init SolrDispatchFilter.init()
[junit4:junit4]   2> 618 T1302 oasc.SolrResourceLoader.locateSolrHome JNDI not configured for solr (NoInitialContextEx)
[junit4:junit4]   2> 618 T1302 oasc.SolrResourceLoader.locateSolrHome using system property solr.solr.home: /mnt/ssd/jenkins/workspace/Lucene-Solr-4.x-Linux/checkout/solr/build/solr-core/test-files/solr
[junit4:junit4]   2> 618 T1302 oasc.CoreContainer$Initializer.initialize looking for solr.xml: /mnt/ssd/jenkins/workspace/Lucene-Solr-4.x-Linux/checkout/solr/build/solr-core/test-files/solr/solr.xml
[junit4:junit4]   2> 619 T1302 oasc.CoreContainer.<init> New CoreContainer 26388703
[junit4:junit4]   2> 619 T1302 oasc.CoreContainer.load Loading CoreContainer using Solr Home: '/mnt/ssd/jenkins/workspace/Lucene-Solr-4.x-Linux/checkout/solr/build/solr-core/test-files/solr/'
[junit4:junit4]   2> 619 T1302 oasc.SolrResourceLoader.<init> new SolrResourceLoader for directory: '/mnt/ssd/jenkins/workspace/Lucene-Solr-4.x-Linux/checkout/solr/build/solr-core/test-files/solr/'
[junit4:junit4]   2> 627 T1302 oasc.CoreContainer.load Registering Log Listener
[junit4:junit4]   2> 643 T1302 oasc.CoreContainer.create Creating SolrCore 'collection1' using instanceDir: /mnt/ssd/jenkins/workspace/Lucene-Solr-4.x-Linux/checkout/solr/build/solr-core/test-files/solr/collection1
[junit4:junit4]   2> 644 T1302 oasc.SolrResourceLoader.<init> new SolrResourceLoader for directory: '/mnt/ssd/jenkins/workspace/Lucene-Solr-4.x-Linux/checkout/solr/build/solr-core/test-files/solr/collection1/'
[junit4:junit4]   2> 644 T1302 oasc.SolrResourceLoader.replaceClassLoader Adding 'file:/mnt/ssd/jenkins/workspace/Lucene-Solr-4.x-Linux/checkout/solr/build/solr-core/test-files/solr/collection1/lib/README' to classloader
[junit4:junit4]   2> 645 T1302 oasc.SolrResourceLoader.replaceClassLoader Adding 'file:/mnt/ssd/jenkins/workspace/Lucene-Solr-4.x-Linux/checkout/solr/build/solr-core/test-files/solr/collection1/lib/classes/' to classloader
[junit4:junit4]   2> 665 T1302 oasc.SolrConfig.<init> Using Lucene MatchVersion: LUCENE_40
[junit4:junit4]   2> 704 T1302 oasc.SolrConfig.<init> Loaded SolrConfig: solrconfig-elevate.xml
[junit4:junit4]   2> 705 T1302 oass.IndexSchema.readSchema Reading Solr Schema
[junit4:junit4]   2> 707 T1302 oass.IndexSchema.readSchema Schema name=example
[junit4:junit4]   2> 870 T1302 oass.IndexSchema.readSchema default search field in schema is text
[junit4:junit4]   2> 872 T1302 oass.IndexSchema.readSchema unique key field: id
[junit4:junit4]   2> 875 T1302 oasc.SolrCore.<init> [collection1] Opening new SolrCore at /mnt/ssd/jenkins/workspace/Lucene-Solr-4.x-Linux/checkout/solr/build/solr-core/test-files/solr/collection1/, dataDir=./org.apache.solr.handler.component.DistributedQueryElevationComponentTest-1343938378199/shard1/data/
[junit4:junit4]   2> 875 T1302 oasc.JmxMonitoredMap.<init> JMX monitoring is enabled. Adding Solr mbeans to JMX Server: com.sun.jmx.mbeanserver.JmxMBeanServer@14412b0
[junit4:junit4]   2> 875 T1302 oasc.SolrCore.getNewIndexDir WARNING New index directory detected: old=null new=./org.apache.solr.handler.component.DistributedQueryElevationComponentTest-1343938378199/shard1/data/index/
[junit4:junit4]   2> 876 T1302 oasc.SolrCore.initIndex WARNING [collection1] Solr index directory './org.apache.solr.handler.component.DistributedQueryElevationComponentTest-1343938378199/shard1/data/index' doesn't exist. Creating new index...
[junit4:junit4]   2> 877 T1302 oasc.SolrDeletionPolicy.onCommit SolrDeletionPolicy.onCommit: commits:num=1
[junit4:junit4]   2> 		commit{dir=MockDirWrapper(org.apache.lucene.store.RAMDirectory@ec603e lockFactory=org.apache.lucene.store.SingleInstanceLockFactory@db6d09),segFN=segments_1,generation=1,filenames=[segments_1]
[junit4:junit4]   2> 877 T1302 oasc.SolrDeletionPolicy.updateCommits newest commit = 1
[junit4:junit4]   2> 878 T1302 oasc.RequestHandlers.initHandlersFromConfig created /update: solr.UpdateRequestHandler
[junit4:junit4]   2> 878 T1302 oasc.RequestHandlers.initHandlersFromConfig created /elevate: org.apache.solr.handler.component.SearchHandler
[junit4:junit4]   2> 878 T1302 oasc.RequestHandlers.initHandlersFromConfig created /dataElevate: org.apache.solr.handler.component.SearchHandler
[junit4:junit4]   2> 879 T1302 oashl.XMLLoader.init xsltCacheLifetimeSeconds=60
[junit4:junit4]   2> 879 T1302 oasc.RequestHandlers.initHandlersFromConfig WARNING no default request handler is registered (either '/select' or 'standard')
[junit4:junit4]   2> 880 T1302 oasc.SolrCore.initDeprecatedSupport WARNING solrconfig.xml uses deprecated <admin/gettableFiles>, Please update your config to use the ShowFileRequestHandler.
[junit4:junit4]   2> 881 T1302 oasc.SolrCore.initDeprecatedSupport WARNING adding ShowFileRequestHandler with hidden files: [SCHEMA-LUCENEMATCHVERSION.XML, SCHEMA-BM25.XML, SOLRCONFIG-TLOG.XML, SOLRCONFIG-SPELLCHECKCOMPONENT.XML, SOLRCONFIG-TERMINDEX.XML, SCHEMA.XML, BAD-SCHEMA-OMIT-TF-BUT-NOT-POS.XML, MISSING.FUNCTIONS.UPDATEPROCESSOR.JS, BAD-SCHEMA-UNIQUEKEY-USES-DEFAULT.XML, HUNSPELL-TEST.DIC, KEEP-2.TXT, SOLRCONFIG-REPEATER.XML, SOLRCONFIG-QUERYSENDER-NOQUERY.XML, SCHEMA-BINARYFIELD.XML, SCHEMA-SPELLCHECKER.XML, THROW.ERROR.ON.ADD.UPDATEPROCESSOR.JS, BAD-SCHEMA-DUP-FIELD.XML, BAD-SOLRCONFIG-INVALID-SCRIPTFILE.XML, SOLRCONFIG-FUNCTIONQUERY.XML, SOLRCONFIG-SOLCOREPROPERTIES.XML, SOLRCONFIG-MASTER2.XML, WDFTYPES.TXT, CONDITIONAL.UPDATEPROCESSOR.JS, SOLRCONFIG-LAZYWRITER.XML, HYPHENATION.DTD, SOLRCONFIG-HIGHLIGHT.XML, SOLRCONFIG-NOCACHE.XML, OPEN-EXCHANGE-RATES.JSON, SOLRCONFIG_PERF.XML, SCHEMA-COLLATEFILTER.XML, DA_UTF8.XML, SCHEMA-LMJELINEKMERCER.XML, SOLRCONFIG-PROPINJECT-INDEXDEFAULT.XML, BAD-SCHEMA-NOT-INDEXED-BUT-NORMS.XML, BAD-SCHEMA-SIM-GLOBAL-VS-FT-MISMATCH.XML, SCHEMA-FOLDING.XML, SCHEMA-TRIE.XML, MAPPING-ISOLATIN1ACCENT.TXT, MISSLEADING.EXTENSION.UPDATEPROCESSOR.JS.TXT, SOLRCONFIG-ENABLEPLUGIN.XML, SOLRCONFIG-QUERYSENDER.XML, STOPWORDS.TXT, SOLRCONFIG-TRANSFORMERS.XML, SCHEMA-LMDIRICHLET.XML, SOLRCONFIG-DELPOLICY2.XML, STOPWORDSWRONGENCODING.TXT, SOLRCONFIG-CACHING.XML, SOLRCONFIG-XINCLUDE.XML, BAD-SCHEMA-DUP-FIELDTYPE.XML, SCHEMA-STOP-KEEP.XML, BAD-SCHEMA-NOT-INDEXED-BUT-POS.XML, PHRASESUGGEST.TXT, PROTWORDS.TXT, SOLRCONFIG_CODEC.XML, TRIVIAL.UPDATEPROCESSOR1.JS, COMPOUNDDICTIONARY.TXT, BAD-SOLRCONFIG-MISSING-SCRIPTFILE.XML, SOLRCONFIG-SIMPLELOCK.XML, SCHEMA-COLLATE.XML, BAD-SCHEMA-DUP-DYNAMICFIELD.XML, ELEVATE.XML, SCHEMA-NOT-REQUIRED-UNIQUE-KEY.XML, BAD-SCHEMA-ANALYZER-CLASS-AND-NESTED.XML, SOLRCONFIG-SLAVE1.XML, SOLRCONFIG-MASTER1-KEEPONEBACKUP.XML, FRENCHARTICLES.TXT, STOP-1.TXT, SOLRCONFIG-PHRASESUGGEST.XML, TRIVIAL.UPDATEPROCESSOR0.JS, BAD-MP-SOLRCONFIG.XML, SOLRCONFIG-NATIVELOCK.XML, SOLRCONFIG-DELPOLICY1.XML, DA_COMPOUNDDICTIONARY.TXT, SCHEMA15.XML, STOPTYPES-2.TXT, KEEP-1.TXT, SCHEMA12.XML, SOLRCONFIG-SLAVE.XML, SOLRCONFIG-MERGEPOLICY.XML, SCHEMA-REVERSED.XML, SCHEMA-NUMERIC.XML, BAD-SCHEMA-NONTEXT-ANALYZER.XML, BAD-SCHEMA-CODEC-GLOBAL-VS-FT-MISMATCH.XML, SCHEMA-PHRASESUGGEST.XML, STOPWITHBOM.TXT, SOLRCONFIG-BASIC.XML, SOLRCONFIG-BASIC-LUCENEVERSION31.XML, BAD-SCHEMA-NOT-INDEXED-BUT-TF.XML, SCHEMA_CODEC.XML, SCHEMA-MINIMAL.XML, STEMDICT.TXT, STOP-SNOWBALL.TXT, SOLRCONFIG-SOLR-749.XML, SOLRCONFIG-SPELLCHECKER.XML, SOLRCONFIG-MASTER3.XML, SOLRCONFIG-SCRIPT-UPDATEPROCESSOR.XML, SOLRCONFIG-MASTER1.XML, SCHEMA-REPLICATION1.XML, SYNONYMS.TXT, SOLRCONFIG-ELEVATE.XML, OLD_SYNONYMS.TXT, SCHEMA-REPLICATION2.XML, SOLRCONFIG-ALTDIRECTORY.XML, STOPTYPES-1.TXT, BAD-SCHEMA-EXTERNAL-FILEFIELD.XML, SCHEMA-DFR.XML, SCHEMA-IB.XML, HUNSPELL-TEST.AFF, SCHEMA11.XML, BAD-SCHEMA-UNIQUEKEY-IS-COPYFIELD-DEST.XML, STOP-2.TXT, BAD-SCHEMA-UNIQUEKEY-MULTIVALUED.XML, XSLT, SOLRCONFIG-UPDATE-PROCESSOR-CHAINS.XML, SCHEMA-SIM.XML, SCHEMA-CHARFILTERS.XML, SCHEMA-COPYFIELD-TEST.XML, SOLRCONFIG-PROPINJECT.XML, ADDFIELDS.UPDATEPROCESSOR.JS, SCHEMA-TFIDF.XML, BAD_SOLRCONFIG.XML, BAD-SOLRCONFIG-BOGUS-SCRIPTENGINE-NAME.XML, SCHEMASURROUND.XML, SOLRCONFIG-MASTER.XML, CURRENCY.XML, SCHEMA-REQUIRED-FIELDS.XML, SOLRCONFIG-REQHANDLER.INCL]
[junit4:junit4]   2> 883 T1302 oass.SolrIndexSearcher.<init> Opening Searcher@107cea0 main
[junit4:junit4]   2> 883 T1302 oass.SolrIndexSearcher.getIndexDir WARNING WARNING: Directory impl does not support setting indexDir: org.apache.lucene.store.MockDirectoryWrapper
[junit4:junit4]   2> 883 T1302 oasu.CommitTracker.<init> Hard AutoCommit: disabled
[junit4:junit4]   2> 884 T1302 oasu.CommitTracker.<init> Soft AutoCommit: disabled
[junit4:junit4]   2> 884 T1302 oashc.QueryElevationComponent.inform Loading QueryElevation from: /mnt/ssd/jenkins/workspace/Lucene-Solr-4.x-Linux/checkout/solr/build/solr-core/test-files/solr/collection1/conf/elevate.xml
[junit4:junit4]   2> 890 T1302 oashc.QueryElevationComponent.inform Loading QueryElevation from: /mnt/ssd/jenkins/workspace/Lucene-Solr-4.x-Linux/checkout/solr/build/solr-core/test-files/solr/collection1/conf/elevate.xml
[junit4:junit4]   2> 897 T1302 oashc.HttpShardHandlerFactory.getParameter Setting socketTimeout to: 0
[junit4:junit4]   2> 897 T1302 oashc.HttpShardHandlerFactory.getParameter Setting urlScheme to: http://
[junit4:junit4]   2> 897 T1302 oashc.HttpShardHandlerFactory.getParameter Setting connTimeout to: 0
[junit4:junit4]   2> 897 T1302 oashc.HttpShardHandlerFactory.getParameter Setting maxConnectionsPerHost to: 20
[junit4:junit4]   2> 898 T1302 oashc.HttpShardHandlerFactory.getParameter Setting corePoolSize to: 0
[junit4:junit4]   2> 898 T1302 oashc.HttpShardHandlerFactory.getParameter Setting maximumPoolSize to: 2147483647
[junit4:junit4]   2> 898 T1302 oashc.HttpShardHandlerFactory.getParameter Setting maxThreadIdleTime to: 5
[junit4:junit4]   2> 898 T1302 oashc.HttpShardHandlerFactory.getParameter Setting sizeOfQueue to: -1
[junit4:junit4]   2> 898 T1302 oashc.HttpShardHandlerFactory.getParameter Setting fairnessPolicy to: false
[junit4:junit4]   2> 899 T1302 oascsi.HttpClientUtil.createClient Creating new http client, config:maxConnectionsPerHost=20&maxConnections=10000&socketTimeout=0&connTimeout=0&retry=false
[junit4:junit4]   2> 901 T1332 oasc.SolrCore.registerSearcher [collection1] Registered new searcher Searcher@107cea0 main{StandardDirectoryReader(segments_1:1)}
[junit4:junit4]   2> 901 T1302 oasc.CoreContainer.register registering core: collection1
[junit4:junit4]   2> 901 T1302 oass.SolrDispatchFilter.init user.dir=/mnt/ssd/jenkins/workspace/Lucene-Solr-4.x-Linux/checkout/solr/build/solr-core/test/J1
[junit4:junit4]   2> 902 T1302 oass.SolrDispatchFilter.init SolrDispatchFilter.init() done
[junit4:junit4]   2> 902 T1302 oascsi.HttpClientUtil.createClient Creating new http client, config:maxConnections=128&maxConnectionsPerHost=32&followRedirects=false
[junit4:junit4]   2> 908 T1302 oejs.Server.doStart jetty-8.1.2.v20120308
[junit4:junit4]   2> 909 T1302 oejs.AbstractConnector.doStart Started SocketConnector@0.0.0.0:37989
[junit4:junit4]   2> 909 T1302 oasc.SolrResourceLoader.locateSolrHome JNDI not configured for solr (NoInitialContextEx)
[junit4:junit4]   2> 910 T1302 oasc.SolrResourceLoader.locateSolrHome using system property solr.solr.home: /mnt/ssd/jenkins/workspace/Lucene-Solr-4.x-Linux/checkout/solr/build/solr-core/test-files/solr
[junit4:junit4]   2> 910 T1302 oasc.SolrResourceLoader.<init> new SolrResourceLoader for deduced Solr Home: '/mnt/ssd/jenkins/workspace/Lucene-Solr-4.x-Linux/checkout/solr/build/solr-core/test-files/solr/'
[junit4:junit4]   2> 917 T1302 oass.SolrDispatchFilter.init SolrDispatchFilter.init()
[junit4:junit4]   2> 917 T1302 oasc.SolrResourceLoader.locateSolrHome JNDI not configured for solr (NoInitialContextEx)
[junit4:junit4]   2> 917 T1302 oasc.SolrResourceLoader.locateSolrHome using system property solr.solr.home: /mnt/ssd/jenkins/workspace/Lucene-Solr-4.x-Linux/checkout/solr/build/solr-core/test-files/solr
[junit4:junit4]   2> 917 T1302 oasc.CoreContainer$Initializer.initialize looking for solr.xml: /mnt/ssd/jenkins/workspace/Lucene-Solr-4.x-Linux/checkout/solr/build/solr-core/test-files/solr/solr.xml
[junit4:junit4]   2> 918 T1302 oasc.CoreContainer.<init> New CoreContainer 26849114
[junit4:junit4]   2> 918 T1302 oasc.CoreContainer.load Loading CoreContainer using Solr Home: '/mnt/ssd/jenkins/workspace/Lucene-Solr-4.x-Linux/checkout/solr/build/solr-core/test-files/solr/'
[junit4:junit4]   2> 918 T1302 oasc.SolrResourceLoader.<init> new SolrResourceLoader for directory: '/mnt/ssd/jenkins/workspace/Lucene-Solr-4.x-Linux/checkout/solr/build/solr-core/test-files/solr/'
[junit4:junit4]   2> 928 T1302 oasc.CoreContainer.load Registering Log Listener
[junit4:junit4]   2> 939 T1302 oasc.CoreContainer.create Creating SolrCore 'collection1' using instanceDir: /mnt/ssd/jenkins/workspace/Lucene-Solr-4.x-Linux/checkout/solr/build/solr-core/test-files/solr/collection1
[junit4:junit4]   2> 939 T1302 oasc.SolrResourceLoader.<init> new SolrResourceLoader for directory: '/mnt/ssd/jenkins/workspace/Lucene-Solr-4.x-Linux/checkout/solr/build/solr-core/test-files/solr/collection1/'
[junit4:junit4]   2> 940 T1302 oasc.SolrResourceLoader.replaceClassLoader Adding 'file:/mnt/ssd/jenkins/workspace/Lucene-Solr-4.x-Linux/checkout/solr/build/solr-core/test-files/solr/collection1/lib/README' to classloader
[junit4:junit4]   2> 940 T1302 oasc.SolrResourceLoader.replaceClassLoader Adding 'file:/mnt/ssd/jenkins/workspace/Lucene-Solr-4.x-Linux/checkout/solr/build/solr-core/test-files/solr/collection1/lib/classes/' to classloader
[junit4:junit4]   2> 965 T1302 oasc.SolrConfig.<init> Using Lucene MatchVersion: LUCENE_40
[junit4:junit4]   2> 1003 T1302 oasc.SolrConfig.<init> Loaded SolrConfig: solrconfig-elevate.xml
[junit4:junit4]   2> 1003 T1302 oass.IndexSchema.readSchema Reading Solr Schema
[junit4:junit4]   2> 1006 T1302 oass.IndexSchema.readSchema Schema name=example
[junit4:junit4]   2> 1156 T1302 oass.IndexSchema.readSchema default search field in schema is text
[junit4:junit4]   2> 1158 T1302 oass.IndexSchema.readSchema unique key field: id
[junit4:junit4]   2> 1166 T1302 oasc.SolrCore.<init> [collection1] Opening new SolrCore at /mnt/ssd/jenkins/workspace/Lucene-Solr-4.x-Linux/checkout/solr/build/solr-core/test-files/solr/collection1/, dataDir=./org.apache.solr.handler.component.DistributedQueryElevationComponentTest-1343938378199/shard2/data/
[junit4:junit4]   2> 1167 T1302 oasc.JmxMonitoredMap.<init> JMX monitoring is enabled. Adding Solr mbeans to JMX Server: com.sun.jmx.mbeanserver.JmxMBeanServer@14412b0
[junit4:junit4]   2> 1167 T1302 oasc.SolrCore.getNewIndexDir WARNING New index directory detected: old=null new=./org.apache.solr.handler.component.DistributedQueryElevationComponentTest-1343938378199/shard2/data/index/
[junit4:junit4]   2> 1167 T1302 oasc.SolrCore.initIndex WARNING [collection1] Solr index directory './org.apache.solr.handler.component.DistributedQueryElevationComponentTest-1343938378199/shard2/data/index' doesn't exist. Creating new index...
[junit4:junit4]   2> 1168 T1302 oasc.SolrDeletionPolicy.onCommit SolrDeletionPolicy.onCommit: commits:num=1
[junit4:junit4]   2> 		commit{dir=MockDirWrapper(org.apache.lucene.store.RAMDirectory@529659 lockFactory=org.apache.lucene.store.SingleInstanceLockFactory@168bbda),segFN=segments_1,generation=1,filenames=[segments_1]
[junit4:junit4]   2> 1168 T1302 oasc.SolrDeletionPolicy.updateCommits newest commit = 1
[junit4:junit4]   2> 1169 T1302 oasc.RequestHandlers.initHandlersFromConfig created /update: solr.UpdateRequestHandler
[junit4:junit4]   2> 1170 T1302 oasc.RequestHandlers.initHandlersFromConfig created /elevate: org.apache.solr.handler.component.SearchHandler
[junit4:junit4]   2> 1170 T1302 oasc.RequestHandlers.initHandlersFromConfig created /dataElevate: org.apache.solr.handler.component.SearchHandler
[junit4:junit4]   2> 1170 T1302 oashl.XMLLoader.init xsltCacheLifetimeSeconds=60
[junit4:junit4]   2> 1171 T1302 oasc.RequestHandlers.initHandlersFromConfig WARNING no default request handler is registered (either '/select' or 'standard')
[junit4:junit4]   2> 1172 T1302 oasc.SolrCore.initDeprecatedSupport WARNING solrconfig.xml uses deprecated <admin/gettableFiles>, Please update your config to use the ShowFileRequestHandler.
[junit4:junit4]   2> 1173 T1302 oasc.SolrCore.initDeprecatedSupport WARNING adding ShowFileRequestHandler with hidden files: [SCHEMA-LUCENEMATCHVERSION.XML, SCHEMA-BM25.XML, SOLRCONFIG-TLOG.XML, SOLRCONFIG-SPELLCHECKCOMPONENT.XML, SOLRCONFIG-TERMINDEX.XML, SCHEMA.XML, BAD-SCHEMA-OMIT-TF-BUT-NOT-POS.XML, MISSING.FUNCTIONS.UPDATEPROCESSOR.JS, BAD-SCHEMA-UNIQUEKEY-USES-DEFAULT.XML, HUNSPELL-TEST.DIC, KEEP-2.TXT, SOLRCONFIG-REPEATER.XML, SOLRCONFIG-QUERYSENDER-NOQUERY.XML, SCHEMA-BINARYFIELD.XML, SCHEMA-SPELLCHECKER.XML, THROW.ERROR.ON.ADD.UPDATEPROCESSOR.JS, BAD-SCHEMA-DUP-FIELD.XML, BAD-SOLRCONFIG-INVALID-SCRIPTFILE.XML, SOLRCONFIG-FUNCTIONQUERY.XML, SOLRCONFIG-SOLCOREPROPERTIES.XML, SOLRCONFIG-MASTER2.XML, WDFTYPES.TXT, CONDITIONAL.UPDATEPROCESSOR.JS, SOLRCONFIG-LAZYWRITER.XML, HYPHENATION.DTD, SOLRCONFIG-HIGHLIGHT.XML, SOLRCONFIG-NOCACHE.XML, OPEN-EXCHANGE-RATES.JSON, SOLRCONFIG_PERF.XML, SCHEMA-COLLATEFILTER.XML, DA_UTF8.XML, SCHEMA-LMJELINEKMERCER.XML, SOLRCONFIG-PROPINJECT-INDEXDEFAULT.XML, BAD-SCHEMA-NOT-INDEXED-BUT-NORMS.XML, BAD-SCHEMA-SIM-GLOBAL-VS-FT-MISMATCH.XML, SCHEMA-FOLDING.XML, SCHEMA-TRIE.XML, MAPPING-ISOLATIN1ACCENT.TXT, MISSLEADING.EXTENSION.UPDATEPROCESSOR.JS.TXT, SOLRCONFIG-ENABLEPLUGIN.XML, SOLRCONFIG-QUERYSENDER.XML, STOPWORDS.TXT, SOLRCONFIG-TRANSFORMERS.XML, SCHEMA-LMDIRICHLET.XML, SOLRCONFIG-DELPOLICY2.XML, STOPWORDSWRONGENCODING.TXT, SOLRCONFIG-CACHING.XML, SOLRCONFIG-XINCLUDE.XML, BAD-SCHEMA-DUP-FIELDTYPE.XML, SCHEMA-STOP-KEEP.XML, BAD-SCHEMA-NOT-INDEXED-BUT-POS.XML, PHRASESUGGEST.TXT, PROTWORDS.TXT, SOLRCONFIG_CODEC.XML, TRIVIAL.UPDATEPROCESSOR1.JS, COMPOUNDDICTIONARY.TXT, BAD-SOLRCONFIG-MISSING-SCRIPTFILE.XML, SOLRCONFIG-SIMPLELOCK.XML, SCHEMA-COLLATE.XML, BAD-SCHEMA-DUP-DYNAMICFIELD.XML, ELEVATE.XML, SCHEMA-NOT-REQUIRED-UNIQUE-KEY.XML, BAD-SCHEMA-ANALYZER-CLASS-AND-NESTED.XML, SOLRCONFIG-SLAVE1.XML, SOLRCONFIG-MASTER1-KEEPONEBACKUP.XML, FRENCHARTICLES.TXT, STOP-1.TXT, SOLRCONFIG-PHRASESUGGEST.XML, TRIVIAL.UPDATEPROCESSOR0.JS, BAD-MP-SOLRCONFIG.XML, SOLRCONFIG-NATIVELOCK.XML, SOLRCONFIG-DELPOLICY1.XML, DA_COMPOUNDDICTIONARY.TXT, SCHEMA15.XML, STOPTYPES-2.TXT, KEEP-1.TXT, SCHEMA12.XML, SOLRCONFIG-SLAVE.XML, SOLRCONFIG-MERGEPOLICY.XML, SCHEMA-REVERSED.XML, SCHEMA-NUMERIC.XML, BAD-SCHEMA-NONTEXT-ANALYZER.XML, BAD-SCHEMA-CODEC-GLOBAL-VS-FT-MISMATCH.XML, SCHEMA-PHRASESUGGEST.XML, STOPWITHBOM.TXT, SOLRCONFIG-BASIC.XML, SOLRCONFIG-BASIC-LUCENEVERSION31.XML, BAD-SCHEMA-NOT-INDEXED-BUT-TF.XML, SCHEMA_CODEC.XML, SCHEMA-MINIMAL.XML, STEMDICT.TXT, STOP-SNOWBALL.TXT, SOLRCONFIG-SOLR-749.XML, SOLRCONFIG-SPELLCHECKER.XML, SOLRCONFIG-MASTER3.XML, SOLRCONFIG-SCRIPT-UPDATEPROCESSOR.XML, SOLRCONFIG-MASTER1.XML, SCHEMA-REPLICATION1.XML, SYNONYMS.TXT, SOLRCONFIG-ELEVATE.XML, OLD_SYNONYMS.TXT, SCHEMA-REPLICATION2.XML, SOLRCONFIG-ALTDIRECTORY.XML, STOPTYPES-1.TXT, BAD-SCHEMA-EXTERNAL-FILEFIELD.XML, SCHEMA-DFR.XML, SCHEMA-IB.XML, HUNSPELL-TEST.AFF, SCHEMA11.XML, BAD-SCHEMA-UNIQUEKEY-IS-COPYFIELD-DEST.XML, STOP-2.TXT, BAD-SCHEMA-UNIQUEKEY-MULTIVALUED.XML, XSLT, SOLRCONFIG-UPDATE-PROCESSOR-CHAINS.XML, SCHEMA-SIM.XML, SCHEMA-CHARFILTERS.XML, SCHEMA-COPYFIELD-TEST.XML, SOLRCONFIG-PROPINJECT.XML, ADDFIELDS.UPDATEPROCESSOR.JS, SCHEMA-TFIDF.XML, BAD_SOLRCONFIG.XML, BAD-SOLRCONFIG-BOGUS-SCRIPTENGINE-NAME.XML, SCHEMASURROUND.XML, SOLRCONFIG-MASTER.XML, CURRENCY.XML, SCHEMA-REQUIRED-FIELDS.XML, SOLRCONFIG-REQHANDLER.INCL]
[junit4:junit4]   2> 1175 T1302 oass.SolrIndexSearcher.<init> Opening Searcher@e04b5f main
[junit4:junit4]   2> 1175 T1302 oass.SolrIndexSearcher.getIndexDir WARNING WARNING: Directory impl does not support setting indexDir: org.apache.lucene.store.MockDirectoryWrapper
[junit4:junit4]   2> 1176 T1302 oasu.CommitTracker.<init> Hard AutoCommit: disabled
[junit4:junit4]   2> 1176 T1302 oasu.CommitTracker.<init> Soft AutoCommit: disabled
[junit4:junit4]   2> 1177 T1302 oashc.QueryElevationComponent.inform Loading QueryElevation from: /mnt/ssd/jenkins/workspace/Lucene-Solr-4.x-Linux/checkout/solr/build/solr-core/test-files/solr/collection1/conf/elevate.xml
[junit4:junit4]   2> 1184 T1302 oashc.QueryElevationComponent.inform Loading QueryElevation from: /mnt/ssd/jenkins/workspace/Lucene-Solr-4.x-Linux/checkout/solr/build/solr-core/test-files/solr/collection1/conf/elevate.xml
[junit4:junit4]   2> 1191 T1302 oashc.HttpShardHandlerFactory.getParameter Setting socketTimeout to: 0
[junit4:junit4]   2> 1191 T1302 oashc.HttpShardHandlerFactory.getParameter Setting urlScheme to: http://
[junit4:junit4]   2> 1192 T1302 oashc.HttpShardHandlerFactory.getParameter Setting connTimeout to: 0
[junit4:junit4]   2> 1192 T1302 oashc.HttpShardHandlerFactory.getParameter Setting maxConnectionsPerHost to: 20
[junit4:junit4]   2> 1192 T1302 oashc.HttpShardHandlerFactory.getParameter Setting corePoolSize to: 0
[junit4:junit4]   2> 1192 T1302 oashc.HttpShardHandlerFactory.getParameter Setting maximumPoolSize to: 2147483647
[junit4:junit4]   2> 1193 T1302 oashc.HttpShardHandlerFactory.getParameter Setting maxThreadIdleTime to: 5
[junit4:junit4]   2> 1193 T1302 oashc.HttpShardHandlerFactory.getParameter Setting sizeOfQueue to: -1
[junit4:junit4]   2> 1193 T1302 oashc.HttpShardHandlerFactory.getParameter Setting fairnessPolicy to: false
[junit4:junit4]   2> 1193 T1302 oascsi.HttpClientUtil.createClient Creating new http client, config:maxConnectionsPerHost=20&maxConnections=10000&socketTimeout=0&connTimeout=0&retry=false
[junit4:junit4]   2> 1196 T1342 oasc.SolrCore.registerSearcher [collection1] Registered new searcher Searcher@e04b5f main{StandardDirectoryReader(segments_1:1)}
[junit4:junit4]   2> 1196 T1302 oasc.CoreContainer.register registering core: collection1
[junit4:junit4]   2> 1196 T1302 oass.SolrDispatchFilter.init user.dir=/mnt/ssd/jenkins/workspace/Lucene-Solr-4.x-Linux/checkout/solr/build/solr-core/test/J1
[junit4:junit4]   2> 1197 T1302 oass.SolrDispatchFilter.init SolrDispatchFilter.init() done
[junit4:junit4]   2> 1197 T1302 oascsi.HttpClientUtil.createClient Creating new http client, config:maxConnections=128&maxConnectionsPerHost=32&followRedirects=false
[junit4:junit4]   2> ASYNC  NEW_CORE C60 name=collection1 org.apache.solr.core.SolrCore@1f8702e
[junit4:junit4]   2> 1202 T1305 C60 oasu.DirectUpdateHandler2.deleteAll [collection1] REMOVING ALL DOCUMENTS FROM INDEX
[junit4:junit4]   2> 1203 T1305 C60 oasc.SolrDeletionPolicy.onInit SolrDeletionPolicy.onInit: commits:num=1
[junit4:junit4]   2> 		commit{dir=MockDirWrapper(org.apache.lucene.store.RAMDirectory@18cf082 lockFactory=org.apache.lucene.store.SingleInstanceLockFactory@bae4a),segFN=segments_1,generation=1,filenames=[segments_1]
[junit4:junit4]   2> 1204 T1305 C60 oasc.SolrDeletionPolicy.updateCommits newest commit = 1
[junit4:junit4]   2> 1204 T1305 C60 UPDATE [collection1] webapp=/solr path=/update params={version=2&wt=javabin} {deleteByQuery=*:*} 0 2
[junit4:junit4]   2> ASYNC  NEW_CORE C61 name=collection1 org.apache.solr.core.SolrCore@94ef3e
[junit4:junit4]   2> 1207 T1315 C61 oasu.DirectUpdateHandler2.deleteAll [collection1] REMOVING ALL DOCUMENTS FROM INDEX
[junit4:junit4]   2> 1209 T1315 C61 oasc.SolrDeletionPolicy.onInit SolrDeletionPolicy.onInit: commits:num=1
[junit4:junit4]   2> 		commit{dir=MockDirWrapper(org.apache.lucene.store.NIOFSDirectory@/mnt/ssd/jenkins/workspace/Lucene-Solr-4.x-Linux/checkout/solr/build/solr-core/test/J1/index5199452002tmp lockFactory=org.apache.lucene.store.SingleInstanceLockFactory@ff52ee),segFN=segments_1,generation=1,filenames=[segments_1]
[junit4:junit4]   2> 1209 T1315 C61 oasc.SolrDeletionPolicy.updateCommits newest commit = 1
[junit4:junit4]   2> 1209 T1315 C61 UPDATE [collection1] webapp=/solr path=/update params={version=2&wt=javabin} {deleteByQuery=*:*} 0 2
[junit4:junit4]   2> ASYNC  NEW_CORE C62 name=collection1 org.apache.solr.core.SolrCore@aa07e5
[junit4:junit4]   2> 1212 T1325 C62 oasu.DirectUpdateHandler2.deleteAll [collection1] REMOVING ALL DOCUMENTS FROM INDEX
[junit4:junit4]   2> 1213 T1325 C62 oasc.SolrDeletionPolicy.onInit SolrDeletionPolicy.onInit: commits:num=1
[junit4:junit4]   2> 		commit{dir=MockDirWrapper(org.apache.lucene.store.RAMDirectory@ec603e lockFactory=org.apache.lucene.store.SingleInstanceLockFactory@db6d09),segFN=segments_1,generation=1,filenames=[segments_1]
[junit4:junit4]   2> 1214 T1325 C62 oasc.SolrDeletionPolicy.updateCommits newest commit = 1
[junit4:junit4]   2> 1214 T1325 C62 UPDATE [collection1] webapp=/solr path=/update params={version=2&wt=javabin} {deleteByQuery=*:*} 0 2
[junit4:junit4]   2> ASYNC  NEW_CORE C63 name=collection1 org.apache.solr.core.SolrCore@16e7348
[junit4:junit4]   2> 1217 T1335 C63 oasu.DirectUpdateHandler2.deleteAll [collection1] REMOVING ALL DOCUMENTS FROM INDEX
[junit4:junit4]   2> 1218 T1335 C63 oasc.SolrDeletionPolicy.onInit SolrDeletionPolicy.onInit: commits:num=1
[junit4:junit4]   2> 		commit{dir=MockDirWrapper(org.apache.lucene.store.RAMDirectory@529659 lockFactory=org.apache.lucene.store.SingleInstanceLockFactory@168bbda),segFN=segments_1,generation=1,filenames=[segments_1]
[junit4:junit4]   2> 1219 T1335 C63 oasc.SolrDeletionPolicy.updateCommits newest commit = 1
[junit4:junit4]   2> 1219 T1335 C63 UPDATE [collection1] webapp=/solr path=/update params={version=2&wt=javabin} {deleteByQuery=*:*} 0 2
[junit4:junit4]   2> 1221 T1305 C60 UPDATE [collection1] webapp=/solr path=/update params={version=2&wt=javabin} {add=[1]} 0 0
[junit4:junit4]   2> 1223 T1315 C61 UPDATE [collection1] webapp=/solr path=/update params={version=2&wt=javabin} {add=[1]} 0 0
[junit4:junit4]   2> 1225 T1305 C60 UPDATE [collection1] webapp=/solr path=/update params={version=2&wt=javabin} {add=[2]} 0 0
[junit4:junit4]   2> 1227 T1325 C62 UPDATE [collection1] webapp=/solr path=/update params={version=2&wt=javabin} {add=[2]} 0 0
[junit4:junit4]   2> 1229 T1305 C60 UPDATE [collection1] webapp=/solr path=/update params={version=2&wt=javabin} {add=[3]} 0 1
[junit4:junit4]   2> 1230 T1335 C63 UPDATE [collection1] webapp=/solr path=/update params={version=2&wt=javabin} {add=[3]} 0 0
[junit4:junit4]   2> 1232 T1305 C60 UPDATE [collection1] webapp=/solr path=/update params={version=2&wt=javabin} {add=[4]} 0 0
[junit4:junit4]   2> 1234 T1315 C61 UPDATE [collection1] webapp=/solr path=/update params={version=2&wt=javabin} {add=[4]} 0 0
[junit4:junit4]   2> 1235 T1305 C60 UPDATE [collection1] webapp=/solr path=/update params={version=2&wt=javabin} {add=[5]} 0 0
[junit4:junit4]   2> 1237 T1325 C62 UPDATE [collection1] webapp=/solr path=/update params={version=2&wt=javabin} {add=[5]} 0 0
[junit4:junit4]   2> 1239 T1305 C60 UPDATE [collection1] webapp=/solr path=/update params={version=2&wt=javabin} {add=[6]} 0 0
[junit4:junit4]   2> 1240 T1335 C63 UPDATE [collection1] webapp=/solr path=/update params={version=2&wt=javabin} {add=[6]} 0 0
[junit4:junit4]   2> 1242 T1305 C60 UPDATE [collection1] webapp=/solr path=/update params={version=2&wt=javabin} {add=[7]} 0 0
[junit4:junit4]   2> 1244 T1335 C63 UPDATE [collection1] webapp=/solr path=/update params={version=2&wt=javabin} {add=[7]} 0 0
[junit4:junit4]   2> 1246 T1305 C60 oasu.DirectUpdateHandler2.commit start commit{flags=0,_version_=0,optimize=false,openSearcher=true,waitSearcher=true,expungeDeletes=false,softCommit=false}
[junit4:junit4]   2> 1246 T1305 C60 oasc.SolrDeletionPolicy.onCommit SolrDeletionPolicy.onCommit: commits:num=2
[junit4:junit4]   2> 		commit{dir=MockDirWrapper(org.apache.lucene.store.RAMDirectory@18cf082 lockFactory=org.apache.lucene.store.SingleInstanceLockFactory@bae4a),segFN=segments_1,generation=1,filenames=[segments_1]
[junit4:junit4]   2> 		commit{dir=MockDirWrapper(org.apache.lucene.store.RAMDirectory@18cf082 lockFactory=org.apache.lucene.store.SingleInstanceLockFactory@bae4a),segFN=segments_2,generation=2,filenames=[_0.si, _0.frq, _0.fdx, _0.prx, _0.tis, _0.tii, segments_2, _0.nrm, _0.fdt, _0.fnm]
[junit4:junit4]   2> 1247 T1305 C60 oasc.SolrDeletionPolicy.updateCommits newest commit = 2
[junit4:junit4]   2> 1247 T1305 C60 oass.SolrIndexSearcher.<init> Opening Searcher@4240d0 main
[junit4:junit4]   2> 1248 T1305 C60 oass.SolrIndexSearcher.getIndexDir WARNING WARNING: Directory impl does not support setting indexDir: org.apache.lucene.store.MockDirectoryWrapper
[junit4:junit4]   2> 1248 T1305 C60 oasu.DirectUpdateHandler2.commit end_commit_flush
[junit4:junit4]   2> 1249 T1312 oasc.SolrCore.registerSearcher [collection1] Registered new searcher Searcher@4240d0 main{StandardDirectoryReader(segments_2:4 _0(4.0.0.1):C7)}
[junit4:junit4]   2> 1249 T1305 C60 UPDATE [collection1] webapp=/solr path=/update params={wt=javabin&version=2&softCommit=false&waitSearcher=true&commit=true} {commit=} 0 3
[junit4:junit4]   2> 1251 T1315 C61 oasu.DirectUpdateHandler2.commit start commit{flags=0,_version_=0,optimize=false,openSearcher=true,waitSearcher=true,expungeDeletes=false,softCommit=false}
[junit4:junit4]   2> 1253 T1315 C61 oasc.SolrDeletionPolicy.onCommit SolrDeletionPolicy.onCommit: commits:num=2
[junit4:junit4]   2> 		commit{dir=MockDirWrapper(org.apache.lucene.store.NIOFSDirectory@/mnt/ssd/jenkins/workspace/Lucene-Solr-4.x-Linux/checkout/solr/build/solr-core/test/J1/index5199452002tmp lockFactory=org.apache.lucene.store.SingleInstanceLockFactory@ff52ee),segFN=segments_1,generation=1,filenames=[segments_1]
[junit4:junit4]   2> 		commit{dir=MockDirWrapper(org.apache.lucene.store.NIOFSDirectory@/mnt/ssd/jenkins/workspace/Lucene-Solr-4.x-Linux/checkout/solr/build/solr-core/test/J1/index5199452002tmp lockFactory=org.apache.lucene.store.SingleInstanceLockFactory@ff52ee),segFN=segments_2,generation=2,filenames=[_0.si, _0.frq, _0.fdx, _0.prx, _0.tis, _0.tii, segments_2, _0.nrm, _0.fdt, _0.fnm]
[junit4:junit4]   2> 1254 T1315 C61 oasc.SolrDeletionPolicy.updateCommits newest commit = 2
[junit4:junit4]   2> 1255 T1315 C61 oass.SolrIndexSearcher.<init> Opening Searcher@17fcd31 main
[junit4:junit4]   2> 1256 T1315 C61 oass.SolrIndexSearcher.getIndexDir WARNING WARNING: Directory impl does not support setting indexDir: org.apache.lucene.store.MockDirectoryWrapper
[junit4:junit4]   2> 1256 T1315 C61 oasu.DirectUpdateHandler2.commit end_commit_flush
[junit4:junit4]   2> 1257 T1322 oasc.SolrCore.registerSearcher [collection1] Registered new searcher Searcher@17fcd31 main{StandardDirectoryReader(segments_2:4 _0(4.0.0.1):C2)}
[junit4:junit4]   2> 1257 T1315 C61 UPDATE [collection1] webapp=/solr path=/update params={wt=javabin&version=2&softCommit=false&waitSearcher=true&commit=true} {commit=} 0 6
[junit4:junit4]   2> 1259 T1325 C62 oasu.DirectUpdateHandler2.commit start commit{flags=0,_version_=0,optimize=false,openSearcher=true,waitSearcher=true,expungeDeletes=false,softCommit=false}
[junit4:junit4]   2> 1260 T1325 C62 oasc.SolrDeletionPolicy.onCommit SolrDeletionPolicy.onCommit: commits:num=2
[junit4:junit4]   2> 		commit{dir=MockDirWrapper(org.apache.lucene.store.RAMDirectory@ec603e lockFactory=org.apache.lucene.store.SingleInstanceLockFactory@db6d09),segFN=segments_1,generation=1,filenames=[segments_1]
[junit4:junit4]   2> 		commit{dir=MockDirWrapper(org.apache.lucene.store.RAMDirectory@ec603e lockFactory=org.apache.lucene.store.SingleInstanceLockFactory@db6d09),segFN=segments_2,generation=2,filenames=[_0.si, _0.frq, _0.fdx, _0.prx, _0.tis, _0.tii, segments_2, _0.nrm, _0.fdt, _0.fnm]
[junit4:junit4]   2> 1260 T1325 C62 oasc.SolrDeletionPolicy.updateCommits newest commit = 2
[junit4:junit4]   2> 1261 T1325 C62 oass.SolrIndexSearcher.<init> Opening Searcher@18dd094 main
[junit4:junit4]   2> 1261 T1325 C62 oass.SolrIndexSearcher.getIndexDir WARNING WARNING: Directory impl does not support setting indexDir: org.apache.lucene.store.MockDirectoryWrapper
[junit4:junit4]   2> 1261 T1325 C62 oasu.DirectUpdateHandler2.commit end_commit_flush
[junit4:junit4]   2> 1262 T1332 oasc.SolrCore.registerSearcher [collection1] Registered new searcher Searcher@18dd094 main{StandardDirectoryReader(segments_2:4 _0(4.0.0.1):C2)}
[junit4:junit4]   2> 1262 T1325 C62 UPDATE [collection1] webapp=/solr path=/update params={wt=javabin&version=2&softCommit=false&waitSearcher=true&commit=true} {commit=} 0 3
[junit4:junit4]   2> 1264 T1335 C63 oasu.DirectUpdateHandler2.commit start commit{flags=0,_version_=0,optimize=false,openSearcher=true,waitSearcher=true,expungeDeletes=false,softCommit=false}
[junit4:junit4]   2> 1265 T1335 C63 oasc.SolrDeletionPolicy.onCommit SolrDeletionPolicy.onCommit: commits:num=2
[junit4:junit4]   2> 		commit{dir=MockDirWrapper(org.apache.lucene.store.RAMDirectory@529659 lockFactory=org.apache.lucene.store.SingleInstanceLockFactory@168bbda),segFN=segments_1,generation=1,filenames=[segments_1]
[junit4:junit4]   2> 		commit{dir=MockDirWrapper(org.apache.lucene.store.RAMDirectory@529659 lockFactory=org.apache.lucene.store.SingleInstanceLockFactory@168bbda),segFN=segments_2,generation=2,filenames=[_0.si, _0.frq, _0.fdx, _0.prx, _0.tis, _0.tii, segments_2, _0.nrm, _0.fdt, _0.fnm]
[junit4:junit4]   2> 1265 T1335 C63 oasc.SolrDeletionPolicy.updateCommits newest commit = 2
[junit4:junit4]   2> 1266 T1335 C63 oass.SolrIndexSearcher.<init> Opening Searcher@5e0bf4 main
[junit4:junit4]   2> 1266 T1335 C63 oass.SolrIndexSearcher.getIndexDir WARNING WARNING: Directory impl does not support setting indexDir: org.apache.lucene.store.MockDirectoryWrapper
[junit4:junit4]   2> 1266 T1335 C63 oasu.DirectUpdateHandler2.commit end_commit_flush
[junit4:junit4]   2> 1266 T1342 oasc.SolrCore.registerSearcher [collection1] Registered new searcher Searcher@5e0bf4 main{StandardDirectoryReader(segments_2:4 _0(4.0.0.1):C3)}
[junit4:junit4]   2> 1267 T1335 C63 UPDATE [collection1] webapp=/solr path=/update params={wt=javabin&version=2&softCommit=false&waitSearcher=true&commit=true} {commit=} 0 3
[junit4:junit4]   2> 1270 T1305 C60 REQ [collection1] webapp=/solr path=/elevate params={sort=id+desc&fl=id,+score,+[elevated]&qt=/elevate&q=*:*&rows=500&wt=javabin&version=2&shards.qt=/elevate&distrib=false} hits=7 status=0 QTime=1 
[junit4:junit4]   2> 1280 T1336 C63 REQ [collection1] webapp=/solr path=/elevate params={fsv=true&fl=id,score&rows=500&wt=javabin&shard.url=localhost:37989/solr|[::1]:33332/solr&isShard=true&start=0&sort=id+desc&qt=/elevate&q=*:*&version=2&NOW=1343938379467&shards.qt=/elevate&distrib=false} hits=3 status=0 QTime=0 
[junit4:junit4]   2> 1280 T1326 C62 REQ [collection1] webapp=/solr path=/elevate params={fsv=true&fl=id,score&rows=500&wt=javabin&shard.url=localhost:52875/solr&isShard=true&start=0&sort=id+desc&qt=/elevate&q=*:*&version=2&NOW=1343938379467&shards.qt=/elevate&distrib=false} hits=2 status=0 QTime=0 
[junit4:junit4]   2> 1282 T1316 C61 REQ [collection1] webapp=/solr path=/elevate params={fsv=true&fl=id,score&rows=500&wt=javabin&shard.url=localhost:57157/solr|[::1]:33332/solr&isShard=true&start=0&sort=id+desc&qt=/elevate&q=*:*&version=2&NOW=1343938379467&shards.qt=/elevate&distrib=false} hits=2 status=0 QTime=1 
[junit4:junit4]   2> 1284 T1316 C61 REQ [collection1] webapp=/solr path=/elevate params={fl=id,+score,+[elevated]&rows=500&wt=javabin&isShard=true&shard.url=localhost:57157/solr|[::1]:33332/solr&ids=4.0,1.0&qt=/elevate&q=*:*&version=2&shards.qt=/elevate&NOW=1343938379467&distrib=false} status=0 QTime=0 
[junit4:junit4]   2> 1284 T1326 C62 REQ [collection1] webapp=/solr path=/elevate params={fl=id,+score,+[elevated]&rows=500&wt=javabin&isShard=true&shard.url=localhost:52875/solr&ids=5.0,2.0&qt=/elevate&q=*:*&version=2&shards.qt=/elevate&NOW=1343938379467&distrib=false} status=0 QTime=0 
[junit4:junit4]   2> 1284 T1336 C63 REQ [collection1] webapp=/solr path=/elevate params={fl=id,+score,+[elevated]&rows=500&wt=javabin&isShard=true&shard.url=localhost:37989/solr|[::1]:33332/solr&ids=6.0,3.0,7.0&qt=/elevate&q=*:*&version=2&shards.qt=/elevate&NOW=1343938379467&distrib=false} status=0 QTime=0 
[junit4:junit4]   2> 1285 T1325 C62 REQ [collection1] webapp=/solr path=/elevate params={sort=id+desc&fl=id,+score,+[elevated]&qt=/elevate&shards=localhost:57157/solr|[::1]:33332/solr,localhost:52875/solr,localhost:37989/solr|[::1]:33332/solr&q=*:*&rows=500&wt=javabin&version=2&shards.qt=/elevate} status=0 QTime=14 
[junit4:junit4]   2> 1285 T1302 oas.BaseDistributedSearchTestCase.compareResponses SEVERE Mismatched responses:
[junit4:junit4]   2> 	{responseHeader={status=0,QTime=14,params={sort=id desc,fl=id, score, [elevated],qt=/elevate,shards=localhost:57157/solr|[::1]:33332/solr,localhost:52875/solr,localhost:37989/solr|[::1]:33332/solr,q=*:*,rows=500,wt=javabin,version=2,shards.qt=/elevate}},response={numFound=7,start=0,maxScore=1.0,docs=[SolrDocument{id=7.0, [elevated]=false, score=1.0}, SolrDocument{id=6.0, [elevated]=false, score=1.0}, SolrDocument{id=5.0, [elevated]=false, score=1.0}, SolrDocument{id=4.0, [elevated]=false, score=1.0}, SolrDocument{id=3.0, [elevated]=false, score=1.0}, SolrDocument{id=2.0, [elevated]=false, score=1.0}, SolrDocument{id=1.0, [elevated]=false, score=1.0}]}}
[junit4:junit4]   2> 	{responseHeader={status=0,QTime=1,params={sort=id desc,fl=id, score, [elevated],qt=/elevate,q=*:*,rows=500,wt=javabin,version=2,shards.qt=/elevate,distrib=false}},response={numFound=7,start=0,maxScore=1.0,docs=[SolrDocument{id=7.0, score=1.0, [elevated]=false}, SolrDocument{id=6.0, score=1.0, [elevated]=false}, SolrDocument{id=5.0, score=1.0, [elevated]=false}, SolrDocument{id=4.0, score=1.0, [elevated]=false}, SolrDocument{id=3.0, score=1.0, [elevated]=false}, SolrDocument{id=2.0, score=1.0, [elevated]=false}, SolrDocument{id=1.0, score=1.0, [elevated]=false}]}}
[junit4:junit4]   2> 1286 T1302 oasc.CoreContainer.shutdown Shutting down CoreContainer instance=2309574
[junit4:junit4]   2> 1287 T1302 oasc.SolrCore.close [collection1]  CLOSING SolrCore org.apache.solr.core.SolrCore@1f8702e
[junit4:junit4]   2> 1288 T1302 oasc.SolrCore.closeSearcher [collection1] Closing main searcher on request.
[junit4:junit4]   2> 1288 T1302 oasu.DirectUpdateHandler2.close closing DirectUpdateHandler2{commits=1,autocommits=0,soft autocommits=0,optimizes=0,rollbacks=0,expungeDeletes=0,docsPending=0,adds=0,deletesById=0,deletesByQuery=0,errors=0,cumulative_adds=7,cumulative_deletesById=0,cumulative_deletesByQuery=1,cumulative_errors=0}
[junit4:junit4]   2> 1291 T1302 oejsh.ContextHandler.doStop stopped o.e.j.s.ServletContextHandler{/solr,null}
[junit4:junit4]   2> 1344 T1302 oasc.CoreContainer.shutdown Shutting down CoreContainer instance=16205071
[junit4:junit4]   2> 1344 T1302 oasc.SolrCore.close [collection1]  CLOSING SolrCore org.apache.solr.core.SolrCore@94ef3e
[junit4:junit4]   2> 1345 T1302 oasc.SolrCore.closeSearcher [collection1] Closing main searcher on request.
[junit4:junit4]   2> 1346 T1302 oasu.DirectUpdateHandler2.close closing DirectUpdateHandler2{commits=1,autocommits=0,soft autocommits=0,optimizes=0,rollbacks=0,expungeDeletes=0,docsPending=0,adds=0,deletesById=0,deletesByQuery=0,errors=0,cumulative_adds=2,cumulative_deletesById=0,cumulative_deletesByQuery=1,cumulative_errors=0}
[junit4:junit4]   2> 1353 T1302 oejsh.ContextHandler.doStop stopped o.e.j.s.ServletContextHandler{/solr,null}
[junit4:junit4]   2> 1406 T1302 oasc.CoreContainer.shutdown Shutting down CoreContainer instance=26388703
[junit4:junit4]   2> 1406 T1302 oasc.SolrCore.close [collection1]  CLOSING SolrCore org.apache.solr.core.SolrCore@aa07e5
[junit4:junit4]   2> 1407 T1302 oasc.SolrCore.closeSearcher [collection1] Closing main searcher on request.
[junit4:junit4]   2> 1407 T1302 oasu.DirectUpdateHandler2.close closing DirectUpdateHandler2{commits=1,autocommits=0,soft autocommits=0,optimizes=0,rollbacks=0,expungeDeletes=0,docsPending=0,adds=0,deletesById=0,deletesByQuery=0,errors=0,cumulative_adds=2,cumulative_deletesById=0,cumulative_deletesByQuery=1,cumulative_errors=0}
[junit4:junit4]   2> 1414 T1302 oejsh.ContextHandler.doStop stopped o.e.j.s.ServletContextHandler{/solr,null}
[junit4:junit4]   2> 1466 T1302 oasc.CoreContainer.shutdown Shutting down CoreContainer instance=26849114
[junit4:junit4]   2> 1467 T1302 oasc.SolrCore.close [collection1]  CLOSING SolrCore org.apache.solr.core.SolrCore@16e7348
[junit4:junit4]   2> 1468 T1302 oasc.SolrCore.closeSearcher [collection1] Closing main searcher on request.
[junit4:junit4]   2> 1469 T1302 oasu.DirectUpdateHandler2.close closing DirectUpdateHandler2{commits=1,autocommits=0,soft autocommits=0,optimizes=0,rollbacks=0,expungeDeletes=0,docsPending=0,adds=0,deletesById=0,deletesByQuery=0,errors=0,cumulative_adds=3,cumulative_deletesById=0,cumulative_deletesByQuery=1,cumulative_errors=0}
[junit4:junit4]   2> 1474 T1302 oejsh.ContextHandler.doStop stopped o.e.j.s.ServletContextHandler{/solr,null}
[junit4:junit4]   2> 1526 T1302 oas.SolrTestCaseJ4.tearDown ###Ending testDistribSearch
[junit4:junit4]   2> NOTE: reproduce with: ant test  -Dtestcase=DistributedQueryElevationComponentTest -Dtests.method=testDistribSearch -Dtests.seed=7D037B2225CB717A -Dtests.multiplier=3 -Dtests.slow=true -Dtests.locale=es_PE -Dtests.timezone=Greenwich -Dtests.file.encoding=UTF-8
[junit4:junit4]   2>
[junit4:junit4]    > (@AfterClass output)
[junit4:junit4]   2> 1573 T1302 oas.SolrTestCaseJ4.deleteCore ###deleteCore
[junit4:junit4]   2> NOTE: test params are: codec=Lucene3x, sim=DefaultSimilarity, locale=es_PE, timezone=Greenwich
[junit4:junit4]   2> NOTE: Linux 3.2.0-27-generic i386/Oracle Corporation 1.8.0-ea (32-bit)/cpus=8,threads=1,free=43275728,total=97320960
[junit4:junit4]   2> NOTE: All tests run in this JVM: [OpenExchangeRatesOrgProviderTest, DocumentBuilderTest, URLClassifyProcessorTest, LeaderElectionTest, ConvertedLegacyTest, EchoParamsTest, TestPHPSerializedResponseWriter, TestQueryUtils, MultiTermTest, FieldMutatingUpdateProcessorTest, CloudStateUpdateTest, TestGroupingSearch, HighlighterTest, TestReversedWildcardFilterFactory, SolrInfoMBeanTest, IndexBasedSpellCheckerTest, LukeRequestHandlerTest, TestSolrQueryParser, TestQuerySenderListener, IndexReaderFactoryTest, TestSolrDeletionPolicy1, SpellCheckCollatorTest, TestFaceting, DirectUpdateHandlerOptimizeTest, ReturnFieldsTest, IndexSchemaTest, PrimUtilsTest, TestReplicationHandler, OutputWriterTest, BasicZkTest, TestQueryTypes, TestSolrXMLSerializer, QueryElevationComponentTest, TestCSVResponseWriter, TestDocSet, JsonLoaderTest, SoftAutoCommitTest, SimpleFacetsTest, ShowFileRequestHandlerTest, SyncSliceTest, CircularListTest, DistributedQueryElevationComponentTest]
[junit4:junit4]   2> 
[junit4:junit4] Completed on J1 in 1.59s, 1 test, 1 failure <<< FAILURES!

[...truncated 386 lines...]
BUILD FAILED
/mnt/ssd/jenkins/workspace/Lucene-Solr-4.x-Linux/checkout/build.xml:29: The following error occurred while executing this line:
/mnt/ssd/jenkins/workspace/Lucene-Solr-4.x-Linux/checkout/solr/build.xml:144: The following error occurred while executing this line:
/mnt/ssd/jenkins/workspace/Lucene-Solr-4.x-Linux/checkout/lucene/module-build.xml:62: The following error occurred while executing this line:
/mnt/ssd/jenkins/workspace/Lucene-Solr-4.x-Linux/checkout/lucene/common-build.xml:1095: The following error occurred while executing this line:
/mnt/ssd/jenkins/workspace/Lucene-Solr-4.x-Linux/checkout/lucene/common-build.xml:790: There were test failures: 224 suites, 903 tests, 1 failure, 5 ignored

Total time: 21 minutes 51 seconds
Build step 'Execute shell' marked build as failure
Archiving artifacts
Recording test results
Email was triggered for: Failure
Sending email for trigger: Failure



Mime
View raw message