lucene-dev mailing list archives

Site index · List index
Message view « Date » · « Thread »
Top « Date » · « Thread »
From Policeman Jenkins Server <jenk...@sd-datasolutions.de>
Subject [JENKINS] Lucene-Solr-4.x-Linux (64bit/ibm-j9-jdk7) - Build # 762 - Failure!
Date Fri, 31 Aug 2012 03:23:36 GMT
Build: http://jenkins.sd-datasolutions.de/job/Lucene-Solr-4.x-Linux/762/
Java: 64bit/ibm-j9-jdk7 -Xjit:exclude={org/apache/lucene/util/fst/FST.pack(IIF)Lorg/apache/lucene/util/fst/FST;}

1 tests failed.
REGRESSION:  org.apache.solr.update.AutoCommitTest.testCommitWithin

Error Message:
shouldn't find any query failed XPath: //result[@numFound=0]  xml response was: <?xml version="1.0" encoding="UTF-8"?> <response> <lst name="responseHeader"><int name="status">0</int><int name="QTime">2315</int></lst><result name="response" numFound="1" start="0"><doc><int name="id">529</int><int name="range_facet_si">529</int><arr name="range_facet_l"><long>529</long></arr><arr name="range_facet_sl"><long>529</long></arr><arr name="field_t"><str>what's inside?</str></arr><arr name="subject"><str>info</str></arr><int name="intDefault">42</int><date name="timestamp">2012-08-31T03:15:04.96Z</date><arr name="multiDefault"><str>muLti-Default</str></arr></doc></result> </response>   request was: q=id:529&start=0&qt=standard&version=2.2&rows=20

Stack Trace:
java.lang.AssertionError: shouldn't find any query failed XPath: //result[@numFound=0]
 xml response was: <?xml version="1.0" encoding="UTF-8"?>
<response>
<lst name="responseHeader"><int name="status">0</int><int name="QTime">2315</int></lst><result name="response" numFound="1" start="0"><doc><int name="id">529</int><int name="range_facet_si">529</int><arr name="range_facet_l"><long>529</long></arr><arr name="range_facet_sl"><long>529</long></arr><arr name="field_t"><str>what's inside?</str></arr><arr name="subject"><str>info</str></arr><int name="intDefault">42</int><date name="timestamp">2012-08-31T03:15:04.96Z</date><arr name="multiDefault"><str>muLti-Default</str></arr></doc></result>
</response>

 request was: q=id:529&start=0&qt=standard&version=2.2&rows=20
	at __randomizedtesting.SeedInfo.seed([6FB14361A39FA23E:D5632C1920B14C2B]:0)
	at org.junit.Assert.fail(Assert.java:93)
	at org.apache.solr.util.AbstractSolrTestCase.assertQ(AbstractSolrTestCase.java:276)
	at org.apache.solr.update.AutoCommitTest.testCommitWithin(AutoCommitTest.java:287)
	at sun.reflect.NativeMethodAccessorImpl.invoke0(Native Method)
	at sun.reflect.NativeMethodAccessorImpl.invoke(NativeMethodAccessorImpl.java:88)
	at sun.reflect.DelegatingMethodAccessorImpl.invoke(DelegatingMethodAccessorImpl.java:55)
	at java.lang.reflect.Method.invoke(Method.java:613)
	at com.carrotsearch.randomizedtesting.RandomizedRunner.invoke(RandomizedRunner.java:1559)
	at com.carrotsearch.randomizedtesting.RandomizedRunner.access$600(RandomizedRunner.java:79)
	at com.carrotsearch.randomizedtesting.RandomizedRunner$6.evaluate(RandomizedRunner.java:737)
	at com.carrotsearch.randomizedtesting.RandomizedRunner$7.evaluate(RandomizedRunner.java:773)
	at com.carrotsearch.randomizedtesting.RandomizedRunner$8.evaluate(RandomizedRunner.java:787)
	at com.carrotsearch.randomizedtesting.rules.SystemPropertiesRestoreRule$1.evaluate(SystemPropertiesRestoreRule.java:53)
	at org.apache.lucene.util.TestRuleSetupTeardownChained$1.evaluate(TestRuleSetupTeardownChained.java:50)
	at org.apache.lucene.util.TestRuleFieldCacheSanity$1.evaluate(TestRuleFieldCacheSanity.java:51)
	at org.apache.lucene.util.AbstractBeforeAfterRule$1.evaluate(AbstractBeforeAfterRule.java:45)
	at com.carrotsearch.randomizedtesting.rules.SystemPropertiesInvariantRule$1.evaluate(SystemPropertiesInvariantRule.java:55)
	at org.apache.lucene.util.TestRuleThreadAndTestName$1.evaluate(TestRuleThreadAndTestName.java:48)
	at org.apache.lucene.util.TestRuleIgnoreAfterMaxFailures$1.evaluate(TestRuleIgnoreAfterMaxFailures.java:70)
	at org.apache.lucene.util.TestRuleMarkFailure$1.evaluate(TestRuleMarkFailure.java:48)
	at com.carrotsearch.randomizedtesting.rules.StatementAdapter.evaluate(StatementAdapter.java:36)
	at com.carrotsearch.randomizedtesting.ThreadLeakControl$StatementRunner.run(ThreadLeakControl.java:345)
	at com.carrotsearch.randomizedtesting.ThreadLeakControl.forkTimeoutingTask(ThreadLeakControl.java:769)
	at com.carrotsearch.randomizedtesting.ThreadLeakControl$3.evaluate(ThreadLeakControl.java:429)
	at com.carrotsearch.randomizedtesting.RandomizedRunner.runSingleTest(RandomizedRunner.java:746)
	at com.carrotsearch.randomizedtesting.RandomizedRunner$3.evaluate(RandomizedRunner.java:648)
	at com.carrotsearch.randomizedtesting.RandomizedRunner$4.evaluate(RandomizedRunner.java:682)
	at com.carrotsearch.randomizedtesting.RandomizedRunner$5.evaluate(RandomizedRunner.java:693)
	at com.carrotsearch.randomizedtesting.rules.StatementAdapter.evaluate(StatementAdapter.java:36)
	at com.carrotsearch.randomizedtesting.rules.SystemPropertiesRestoreRule$1.evaluate(SystemPropertiesRestoreRule.java:53)
	at org.apache.lucene.util.AbstractBeforeAfterRule$1.evaluate(AbstractBeforeAfterRule.java:45)
	at org.apache.lucene.util.TestRuleStoreClassName$1.evaluate(TestRuleStoreClassName.java:42)
	at com.carrotsearch.randomizedtesting.rules.SystemPropertiesInvariantRule$1.evaluate(SystemPropertiesInvariantRule.java:55)
	at com.carrotsearch.randomizedtesting.rules.NoShadowingOrOverridesOnMethodsRule$1.evaluate(NoShadowingOrOverridesOnMethodsRule.java:39)
	at com.carrotsearch.randomizedtesting.rules.NoShadowingOrOverridesOnMethodsRule$1.evaluate(NoShadowingOrOverridesOnMethodsRule.java:39)
	at org.apache.lucene.util.TestRuleAssertionsRequired$1.evaluate(TestRuleAssertionsRequired.java:40)
	at org.apache.lucene.util.TestRuleMarkFailure$1.evaluate(TestRuleMarkFailure.java:48)
	at org.apache.lucene.util.TestRuleIgnoreAfterMaxFailures$1.evaluate(TestRuleIgnoreAfterMaxFailures.java:70)
	at org.apache.lucene.util.TestRuleIgnoreTestSuites$1.evaluate(TestRuleIgnoreTestSuites.java:55)
	at com.carrotsearch.randomizedtesting.rules.StatementAdapter.evaluate(StatementAdapter.java:36)
	at com.carrotsearch.randomizedtesting.ThreadLeakControl$StatementRunner.run(ThreadLeakControl.java:345)
	at java.lang.Thread.run(Thread.java:777)




Build Log:
[...truncated 6940 lines...]
[junit4:junit4] Suite: org.apache.solr.update.AutoCommitTest
[junit4:junit4]   2> 4948 T547 oasu.AbstractSolrTestCase.setUp ####SETUP_START testCommitWithin
[junit4:junit4]   2> 4949 T547 oasc.SolrResourceLoader.<init> new SolrResourceLoader for directory: '/mnt/ssd/jenkins/workspace/Lucene-Solr-4.x-Linux/solr/build/solr-core/test-files/solr/collection1/'
[junit4:junit4]   2> 4950 T547 oasc.SolrResourceLoader.replaceClassLoader Adding 'file:/mnt/ssd/jenkins/workspace/Lucene-Solr-4.x-Linux/solr/build/solr-core/test-files/solr/collection1/lib/README' to classloader
[junit4:junit4]   2> 4951 T547 oasc.SolrResourceLoader.replaceClassLoader Adding 'file:/mnt/ssd/jenkins/workspace/Lucene-Solr-4.x-Linux/solr/build/solr-core/test-files/solr/collection1/lib/classes/' to classloader
[junit4:junit4]   2> 5077 T547 oasc.SolrConfig.<init> Using Lucene MatchVersion: LUCENE_40
[junit4:junit4]   2> 5305 T547 oasc.SolrConfig.<init> Loaded SolrConfig: solrconfig.xml
[junit4:junit4]   2> 5324 T547 oass.IndexSchema.readSchema Reading Solr Schema
[junit4:junit4]   2> 5348 T547 oass.IndexSchema.readSchema Schema name=test
[junit4:junit4]   2> 7021 T547 oass.OpenExchangeRatesOrgProvider.init Initialized with rates=open-exchange-rates.json, refreshInterval=1440.
[junit4:junit4]   2> 7029 T547 oass.IndexSchema.readSchema default search field in schema is text
[junit4:junit4]   2> 7073 T547 oass.IndexSchema.readSchema unique key field: id
[junit4:junit4]   2> 7101 T547 oass.FileExchangeRateProvider.reload Reloading exchange rates from file currency.xml
[junit4:junit4]   2> 7105 T547 oass.FileExchangeRateProvider.reload Reloading exchange rates from file currency.xml
[junit4:junit4]   2> 7131 T547 oass.OpenExchangeRatesOrgProvider.reload Reloading exchange rates from open-exchange-rates.json
[junit4:junit4]   2> 7132 T547 oass.OpenExchangeRatesOrgProvider.reload Reloading exchange rates from open-exchange-rates.json
[junit4:junit4]   2> 7133 T547 oasc.SolrResourceLoader.locateSolrHome JNDI not configured for solr (NoInitialContextEx)
[junit4:junit4]   2> 7133 T547 oasc.SolrResourceLoader.locateSolrHome using system property solr.solr.home: /mnt/ssd/jenkins/workspace/Lucene-Solr-4.x-Linux/solr/build/solr-core/test-files/solr
[junit4:junit4]   2> 7134 T547 oasc.SolrResourceLoader.<init> new SolrResourceLoader for directory: '/mnt/ssd/jenkins/workspace/Lucene-Solr-4.x-Linux/solr/build/solr-core/test-files/solr/'
[junit4:junit4]   2> 7225 T547 oasc.CoreContainer.<init> New CoreContainer 796314510
[junit4:junit4]   2> 7244 T547 oasc.SolrCore.<init> [collection1] Opening new SolrCore at /mnt/ssd/jenkins/workspace/Lucene-Solr-4.x-Linux/solr/build/solr-core/test-files/solr/collection1/, dataDir=/mnt/ssd/jenkins/workspace/Lucene-Solr-4.x-Linux/solr/build/solr-core/test/J0/./org.apache.solr.update.AutoCommitTest-1346382898602/
[junit4:junit4]   2> 7244 T547 oasc.JmxMonitoredMap.<init> No JMX servers found, not exposing Solr information with JMX.
[junit4:junit4]   2> 7245 T547 oasc.SolrCore.getNewIndexDir WARNING New index directory detected: old=null new=/mnt/ssd/jenkins/workspace/Lucene-Solr-4.x-Linux/solr/build/solr-core/test/J0/./org.apache.solr.update.AutoCommitTest-1346382898602/index/
[junit4:junit4]   2> 7267 T547 oasc.SolrCore.initIndex WARNING [collection1] Solr index directory '/mnt/ssd/jenkins/workspace/Lucene-Solr-4.x-Linux/solr/build/solr-core/test/J0/./org.apache.solr.update.AutoCommitTest-1346382898602/index' doesn't exist. Creating new index...
[junit4:junit4]   2> 7268 T547 oasc.CachingDirectoryFactory.get return new directory for /mnt/ssd/jenkins/workspace/Lucene-Solr-4.x-Linux/solr/build/solr-core/test/J0/./org.apache.solr.update.AutoCommitTest-1346382898602/index forceNew:false
[junit4:junit4]   2> 7272 T547 oasc.SolrDeletionPolicy.onCommit SolrDeletionPolicy.onCommit: commits:num=1
[junit4:junit4]   2> 		commit{dir=MockDirWrapper(org.apache.lucene.store.RAMDirectory@f0c5c47a lockFactory=org.apache.lucene.store.NativeFSLockFactory@ed3d7b39),segFN=segments_1,generation=1,filenames=[segments_1]
[junit4:junit4]   2> 7276 T547 oasc.SolrDeletionPolicy.updateCommits newest commit = 1
[junit4:junit4]   2> 7277 T547 oasc.SolrCore.initWriters created xml: solr.XMLResponseWriter
[junit4:junit4]   2> 7279 T547 oasup.UpdateRequestProcessorChain.init inserting DistributedUpdateProcessorFactory into updateRequestProcessorChain "dedupe"
[junit4:junit4]   2> 7279 T547 oasup.UpdateRequestProcessorChain.init inserting DistributedUpdateProcessorFactory into updateRequestProcessorChain "dedupe-allfields"
[junit4:junit4]   2> 7280 T547 oasup.UpdateRequestProcessorChain.init inserting DistributedUpdateProcessorFactory into updateRequestProcessorChain "stored_sig"
[junit4:junit4]   2> 7280 T547 oasup.UpdateRequestProcessorChain.init inserting DistributedUpdateProcessorFactory into updateRequestProcessorChain "uniq-fields"
[junit4:junit4]   2> 7281 T547 oasup.UpdateRequestProcessorChain.init inserting DistributedUpdateProcessorFactory into updateRequestProcessorChain "distrib-dup-test-chain-implicit"
[junit4:junit4]   2> 7282 T547 oasc.RequestHandlers.initHandlersFromConfig adding lazy requestHandler: solr.ReplicationHandler
[junit4:junit4]   2> 7282 T547 oasc.RequestHandlers.initHandlersFromConfig created /replication: solr.ReplicationHandler
[junit4:junit4]   2> 7283 T547 oasc.RequestHandlers.initHandlersFromConfig created standard: solr.StandardRequestHandler
[junit4:junit4]   2> 7283 T547 oasc.RequestHandlers.initHandlersFromConfig created /get: solr.RealTimeGetHandler
[junit4:junit4]   2> 7284 T547 oasc.RequestHandlers.initHandlersFromConfig created dismax: solr.SearchHandler
[junit4:junit4]   2> 7284 T547 oasc.RequestHandlers.initHandlersFromConfig created mock: org.apache.solr.core.MockQuerySenderListenerReqHandler
[junit4:junit4]   2> 7284 T547 oasc.RequestHandlers.initHandlersFromConfig created /admin/: org.apache.solr.handler.admin.AdminHandlers
[junit4:junit4]   2> 7285 T547 oasc.RequestHandlers.initHandlersFromConfig created defaults: solr.StandardRequestHandler
[junit4:junit4]   2> 7285 T547 oasc.RequestHandlers.initHandlersFromConfig adding lazy requestHandler: solr.StandardRequestHandler
[junit4:junit4]   2> 7286 T547 oasc.RequestHandlers.initHandlersFromConfig created lazy: solr.StandardRequestHandler
[junit4:junit4]   2> 7286 T547 oasc.RequestHandlers.initHandlersFromConfig created /update: solr.UpdateRequestHandler
[junit4:junit4]   2> 7287 T547 oasc.RequestHandlers.initHandlersFromConfig created /terms: org.apache.solr.handler.component.SearchHandler
[junit4:junit4]   2> 7287 T547 oasc.RequestHandlers.initHandlersFromConfig created spellCheckCompRH: org.apache.solr.handler.component.SearchHandler
[junit4:junit4]   2> 7287 T547 oasc.RequestHandlers.initHandlersFromConfig created spellCheckCompRH_Direct: org.apache.solr.handler.component.SearchHandler
[junit4:junit4]   2> 7288 T547 oasc.RequestHandlers.initHandlersFromConfig created spellCheckWithWordbreak: org.apache.solr.handler.component.SearchHandler
[junit4:junit4]   2> 7288 T547 oasc.RequestHandlers.initHandlersFromConfig created spellCheckWithWordbreak_Direct: org.apache.solr.handler.component.SearchHandler
[junit4:junit4]   2> 7289 T547 oasc.RequestHandlers.initHandlersFromConfig created spellCheckCompRH1: org.apache.solr.handler.component.SearchHandler
[junit4:junit4]   2> 7289 T547 oasc.RequestHandlers.initHandlersFromConfig created tvrh: org.apache.solr.handler.component.SearchHandler
[junit4:junit4]   2> 7290 T547 oasc.RequestHandlers.initHandlersFromConfig created /mlt: solr.MoreLikeThisHandler
[junit4:junit4]   2> 7290 T547 oasc.RequestHandlers.initHandlersFromConfig created /debug/dump: solr.DumpRequestHandler
[junit4:junit4]   2> 7291 T547 oashl.XMLLoader.init xsltCacheLifetimeSeconds=60
[junit4:junit4]   2> 7293 T547 oasc.SolrCore.initDeprecatedSupport WARNING solrconfig.xml uses deprecated <admin/gettableFiles>, Please update your config to use the ShowFileRequestHandler.
[junit4:junit4]   2> 7294 T547 oasc.SolrCore.initDeprecatedSupport WARNING adding ShowFileRequestHandler with hidden files: [BAD-SCHEMA-NOT-INDEXED-BUT-TF.XML, SCHEMA-REQUIRED-FIELDS.XML, SOLRCONFIG-MASTER1-KEEPONEBACKUP.XML, BAD-SCHEMA-NONTEXT-ANALYZER.XML, SOLRCONFIG-PROPINJECT.XML, SOLRCONFIG-PROPINJECT-INDEXDEFAULT.XML, STOP-2.TXT, SCHEMA11.XML, BAD-SCHEMA-UNIQUEKEY-USES-DEFAULT.XML, SCHEMA15.XML, SOLRCONFIG-NATIVELOCK.XML, SCHEMA-SIM.XML, CONDITIONAL.UPDATEPROCESSOR.JS, BAD-SOLRCONFIG-MISSING-SCRIPTFILE.XML, SOLRCONFIG-SCRIPT-UPDATEPROCESSOR.XML, SOLRCONFIG-REPEATER.XML, SOLRCONFIG-SPELLCHECKER.XML, SOLRCONFIG-NOCACHE.XML, SCHEMA-CHARFILTERS.XML, SOLRCONFIG-SOLCOREPROPERTIES.XML, SOLRCONFIG_CODEC.XML, BAD-SCHEMA-EXTERNAL-FILEFIELD.XML, HYPHENATION.DTD, SCHEMA.XML, SOLRCONFIG-MERGEPOLICY.XML, TRIVIAL.UPDATEPROCESSOR1.JS, SOLRCONFIG-PHRASESUGGEST.XML, SOLRCONFIG-SLAVE1.XML, SOLRCONFIG-BASIC.XML, SCHEMA-LMJELINEKMERCER.XML, BAD-MP-SOLRCONFIG.XML, BAD-SCHEMA-DUP-FIELD.XML, BAD-SCHEMA-UNIQUEKEY-MULTIVALUED.XML, SOLRCONFIG-MASTER.XML, SOLRCONFIG-HIGHLIGHT.XML, SCHEMA-TFIDF.XML, SCHEMA-REPLICATION1.XML, SYNONYMS.TXT, SOLRCONFIG-ELEVATE.XML, STOPWITHBOM.TXT, SOLRCONFIG-QUERYSENDER.XML, WDFTYPES.TXT, SOLRCONFIG-DELPOLICY1.XML, BAD_SOLRCONFIG.XML, HUNSPELL-TEST.DIC, SCHEMA-NUMERIC.XML, SCHEMA-LUCENEMATCHVERSION.XML, KEEP-2.TXT, SCHEMA-STOP-KEEP.XML, SCHEMA-IB.XML, STOP-SNOWBALL.TXT, SOLRCONFIG-SLAVE.XML, BAD-SCHEMA-NOT-INDEXED-BUT-NORMS.XML, STOPWORDSWRONGENCODING.TXT, THROW.ERROR.ON.ADD.UPDATEPROCESSOR.JS, SOLRCONFIG-SPELLCHECKCOMPONENT.XML, STOPTYPES-1.TXT, SOLRCONFIG-TLOG.XML, COMPOUNDDICTIONARY.TXT, DA_COMPOUNDDICTIONARY.TXT, SOLRCONFIG-TERMINDEX.XML, BAD-SOLRCONFIG-INVALID-SCRIPTFILE.XML, SCHEMASURROUND.XML, OPEN-EXCHANGE-RATES.JSON, BAD-SCHEMA-DUP-FIELDTYPE.XML, PHRASESUGGEST.TXT, SOLRCONFIG-MASTER2.XML, OLD_SYNONYMS.TXT, BAD-SCHEMA-UNIQUEKEY-IS-COPYFIELD-DEST.XML, SCHEMA-NOT-REQUIRED-UNIQUE-KEY.XML, BAD-SCHEMA-CODEC-GLOBAL-VS-FT-MISMATCH.XML, SCHEMA-LMDIRICHLET.XML, SCHEMA-REVERSED.XML, BAD-SCHEMA-NOT-INDEXED-BUT-POS.XML, SCHEMA-FOLDING.XML, SOLRCONFIG-CACHING.XML, MAPPING-ISOLATIN1ACCENT.TXT, ADDFIELDS.UPDATEPROCESSOR.JS, SCHEMA-BM25.XML, STOP-1.TXT, SOLRCONFIG-ENABLEPLUGIN.XML, MISSING.FUNCTIONS.UPDATEPROCESSOR.JS, SCHEMA12.XML, SOLRCONFIG-TRANSFORMERS.XML, SCHEMA-COPYFIELD-TEST.XML, SOLRCONFIG-BASIC-LUCENEVERSION31.XML, BAD-SCHEMA-DUP-DYNAMICFIELD.XML, CURRENCY.XML, DA_UTF8.XML, MISSLEADING.EXTENSION.UPDATEPROCESSOR.JS.TXT, SOLRCONFIG-SOLR-749.XML, STOPWORDS.TXT, HUNSPELL-TEST.AFF, SOLRCONFIG_PERF.XML, SOLRCONFIG-SIMPLELOCK.XML, FRENCHARTICLES.TXT, SOLRCONFIG-LAZYWRITER.XML, SCHEMA-REPLICATION2.XML, SOLRCONFIG-XINCLUDE.XML, SCHEMA-SPELLCHECKER.XML, XSLT, SOLRCONFIG-DELPOLICY2.XML, TRIVIAL.UPDATEPROCESSOR0.JS, KEEP-1.TXT, SCHEMA-TRIE.XML, SCHEMA-BINARYFIELD.XML, SCHEMA-COLLATEFILTER.XML, BAD-SCHEMA-OMIT-TF-BUT-NOT-POS.XML, SCHEMA-MINIMAL.XML, STOPTYPES-2.TXT, STEMDICT.TXT, SCHEMA_CODEC.XML, ELEVATE.XML, SCHEMA-COLLATE.XML, PROTWORDS.TXT, SOLRCONFIG-REQHANDLER.INCL, SCHEMA-PHRASESUGGEST.XML, SCHEMA-DFR.XML, BAD-SCHEMA-ANALYZER-CLASS-AND-NESTED.XML, SOLRCONFIG-MASTER1.XML, SOLRCONFIG-FUNCTIONQUERY.XML, SOLRCONFIG-MASTER3.XML, SOLRCONFIG-UPDATE-PROCESSOR-CHAINS.XML, SOLRCONFIG-ALTDIRECTORY.XML, BAD-SCHEMA-SIM-GLOBAL-VS-FT-MISMATCH.XML, SOLRCONFIG-QUERYSENDER-NOQUERY.XML, BAD-SOLRCONFIG-BOGUS-SCRIPTENGINE-NAME.XML]
[junit4:junit4]   2> 7298 T547 oass.SolrIndexSearcher.<init> Opening Searcher@987e36f9 main
[junit4:junit4]   2> 7298 T547 oass.SolrIndexSearcher.getIndexDir WARNING WARNING: Directory impl does not support setting indexDir: org.apache.lucene.store.MockDirectoryWrapper
[junit4:junit4]   2> 7299 T547 oasu.CommitTracker.<init> Hard AutoCommit: disabled
[junit4:junit4]   2> 7300 T547 oasu.CommitTracker.<init> Soft AutoCommit: disabled
[junit4:junit4]   2> 7300 T547 oashc.SpellCheckComponent.inform Initializing spell checkers
[junit4:junit4]   2> 7371 T547 oass.DirectSolrSpellChecker.init init: {name=direct,classname=DirectSolrSpellChecker,field=lowerfilt,minQueryLength=3}
[junit4:junit4]   2> 7435 T547 oashc.HttpShardHandlerFactory.getParameter Setting socketTimeout to: 0
[junit4:junit4]   2> 7435 T547 oashc.HttpShardHandlerFactory.getParameter Setting urlScheme to: http://
[junit4:junit4]   2> 7436 T547 oashc.HttpShardHandlerFactory.getParameter Setting connTimeout to: 0
[junit4:junit4]   2> 7437 T547 oashc.HttpShardHandlerFactory.getParameter Setting maxConnectionsPerHost to: 20
[junit4:junit4]   2> 7437 T547 oashc.HttpShardHandlerFactory.getParameter Setting corePoolSize to: 0
[junit4:junit4]   2> 7455 T547 oashc.HttpShardHandlerFactory.getParameter Setting maximumPoolSize to: 2147483647
[junit4:junit4]   2> 7455 T547 oashc.HttpShardHandlerFactory.getParameter Setting maxThreadIdleTime to: 5
[junit4:junit4]   2> 7456 T547 oashc.HttpShardHandlerFactory.getParameter Setting sizeOfQueue to: -1
[junit4:junit4]   2> 7456 T547 oashc.HttpShardHandlerFactory.getParameter Setting fairnessPolicy to: false
[junit4:junit4]   2> 7457 T547 oascsi.HttpClientUtil.createClient Creating new http client, config:maxConnectionsPerHost=20&maxConnections=10000&socketTimeout=0&connTimeout=0&retry=false
[junit4:junit4]   2> 7464 T548 oasc.SolrCore.registerSearcher [collection1] Registered new searcher Searcher@987e36f9 main{StandardDirectoryReader(segments_1:1)}
[junit4:junit4]   2> 7464 T547 oasc.CoreContainer.register registering core: collection1
[junit4:junit4]   2> 7465 T547 oasu.AbstractSolrTestCase.setUp ####SETUP_END testCommitWithin
[junit4:junit4]   2> 11304 T547 oasc.SolrDeletionPolicy.onInit SolrDeletionPolicy.onInit: commits:num=1
[junit4:junit4]   2> 		commit{dir=MockDirWrapper(org.apache.lucene.store.RAMDirectory@f0c5c47a lockFactory=org.apache.lucene.store.NativeFSLockFactory@ed3d7b39),segFN=segments_1,generation=1,filenames=[segments_1]
[junit4:junit4]   2> 11305 T547 oasc.SolrDeletionPolicy.updateCommits newest commit = 1
[junit4:junit4]   2> 11307 T547 UPDATE [collection1] {add=[529]} 0 3841
[junit4:junit4]   2> 12307 T549 oasu.DirectUpdateHandler2.commit start commit{flags=0,_version_=0,optimize=false,openSearcher=true,waitSearcher=true,expungeDeletes=false,softCommit=true}
[junit4:junit4]   2> 12309 T549 oass.SolrIndexSearcher.<init> Opening Searcher@89a99fc2 main
[junit4:junit4]   2> 12310 T549 oass.SolrIndexSearcher.getIndexDir WARNING WARNING: Directory impl does not support setting indexDir: org.apache.lucene.store.MockDirectoryWrapper
[junit4:junit4]   2> 12310 T549 oasu.DirectUpdateHandler2.commit end_commit_flush
[junit4:junit4]   2> 12311 T548 oasc.SolrCore.registerSearcher [collection1] Registered new searcher Searcher@89a99fc2 main{StandardDirectoryReader(segments_1:3:nrt _0(4.0.0.2):C1)}
[junit4:junit4]   2> ASYNC  NEW_CORE C35 name=collection1 org.apache.solr.core.SolrCore@8a172f94
[junit4:junit4]   2> 13831 T547 C35 REQ [collection1] webapp=null path=null params={q=id:529&start=0&qt=standard&version=2.2&rows=20} hits=1 status=0 QTime=2315 
[junit4:junit4]   2> 13888 T547 oasu.AbstractSolrTestCase.tearDown ####TEARDOWN_START testCommitWithin
[junit4:junit4]   2> 13889 T547 oasc.CoreContainer.shutdown Shutting down CoreContainer instance=796314510
[junit4:junit4]   2> 13889 T547 oasc.SolrCore.close [collection1]  CLOSING SolrCore org.apache.solr.core.SolrCore@8a172f94
[junit4:junit4]   2> 13890 T547 oasc.SolrCore.closeSearcher [collection1] Closing main searcher on request.
[junit4:junit4]   2> 13890 T547 oasu.DirectUpdateHandler2.close closing DirectUpdateHandler2{commits=1,autocommits=0,soft autocommits=1,optimizes=0,rollbacks=0,expungeDeletes=0,docsPending=1,adds=0,deletesById=0,deletesByQuery=0,errors=0,cumulative_adds=1,cumulative_deletesById=0,cumulative_deletesByQuery=0,cumulative_errors=0}
[junit4:junit4]   2> 13890 T547 oasu.DefaultSolrCoreState.decref SolrCoreState ref count has reached 0 - closing IndexWriter
[junit4:junit4]   2> 13891 T547 C35 oasc.SolrDeletionPolicy.onCommit SolrDeletionPolicy.onCommit: commits:num=2
[junit4:junit4]   2> 		commit{dir=MockDirWrapper(org.apache.lucene.store.RAMDirectory@f0c5c47a lockFactory=org.apache.lucene.store.NativeFSLockFactory@ed3d7b39),segFN=segments_1,generation=1,filenames=[segments_1]
[junit4:junit4]   2> 		commit{dir=MockDirWrapper(org.apache.lucene.store.RAMDirectory@f0c5c47a lockFactory=org.apache.lucene.store.NativeFSLockFactory@ed3d7b39),segFN=segments_2,generation=2,filenames=[_0.si, segments_2, _0.frq, _0.fnm, _0.fdt, _0.prx, _0.tim, _0.fdx, _0_nrm.cfs, _0.tip, _0_nrm.cfe]
[junit4:junit4]   2> 13891 T547 C35 oasc.SolrDeletionPolicy.updateCommits newest commit = 2
[junit4:junit4]   2> NOTE: reproduce with: ant test  -Dtestcase=AutoCommitTest -Dtests.method=testCommitWithin -Dtests.seed=6FB14361A39FA23E -Dtests.multiplier=3 -Dtests.slow=true -Dtests.locale=nl_NL -Dtests.timezone=America/Costa_Rica -Dtests.file.encoding=UTF-8
[junit4:junit4] FAILURE 8.98s J0 | AutoCommitTest.testCommitWithin <<<
[junit4:junit4]    > Throwable #1: java.lang.AssertionError: shouldn't find any query failed XPath: //result[@numFound=0]
[junit4:junit4]    >  xml response was: <?xml version="1.0" encoding="UTF-8"?>
[junit4:junit4]    > <response>
[junit4:junit4]    > <lst name="responseHeader"><int name="status">0</int><int name="QTime">2315</int></lst><result name="response" numFound="1" start="0"><doc><int name="id">529</int><int name="range_facet_si">529</int><arr name="range_facet_l"><long>529</long></arr><arr name="range_facet_sl"><long>529</long></arr><arr name="field_t"><str>what's inside?</str></arr><arr name="subject"><str>info</str></arr><int name="intDefault">42</int><date name="timestamp">2012-08-31T03:15:04.96Z</date><arr name="multiDefault"><str>muLti-Default</str></arr></doc></result>
[junit4:junit4]    > </response>
[junit4:junit4]    > 
[junit4:junit4]    >  request was: q=id:529&start=0&qt=standard&version=2.2&rows=20
[junit4:junit4]    > 	at __randomizedtesting.SeedInfo.seed([6FB14361A39FA23E:D5632C1920B14C2B]:0)
[junit4:junit4]    > 	at org.junit.Assert.fail(Assert.java:93)
[junit4:junit4]    > 	at org.apache.solr.util.AbstractSolrTestCase.assertQ(AbstractSolrTestCase.java:276)
[junit4:junit4]    > 	at org.apache.solr.update.AutoCommitTest.testCommitWithin(AutoCommitTest.java:287)
[junit4:junit4]    > 	at sun.reflect.NativeMethodAccessorImpl.invoke0(Native Method)
[junit4:junit4]    > 	at sun.reflect.NativeMethodAccessorImpl.invoke(NativeMethodAccessorImpl.java:88)
[junit4:junit4]    > 	at sun.reflect.DelegatingMethodAccessorImpl.invoke(DelegatingMethodAccessorImpl.java:55)
[junit4:junit4]    > 	at java.lang.reflect.Method.invoke(Method.java:613)
[junit4:junit4]    > 	at com.carrotsearch.randomizedtesting.RandomizedRunner.invoke(RandomizedRunner.java:1559)
[junit4:junit4]    > 	at com.carrotsearch.randomizedtesting.RandomizedRunner.access$600(RandomizedRunner.java:79)
[junit4:junit4]    > 	at com.carrotsearch.randomizedtesting.RandomizedRunner$6.evaluate(RandomizedRunner.java:737)
[junit4:junit4]    > 	at com.carrotsearch.randomizedtesting.RandomizedRunner$7.evaluate(RandomizedRunner.java:773)
[junit4:junit4]    > 	at com.carrotsearch.randomizedtesting.RandomizedRunner$8.evaluate(RandomizedRunner.java:787)
[junit4:junit4]    > 	at com.carrotsearch.randomizedtesting.rules.SystemPropertiesRestoreRule$1.evaluate(SystemPropertiesRestoreRule.java:53)
[junit4:junit4]    > 	at org.apache.lucene.util.TestRuleSetupTeardownChained$1.evaluate(TestRuleSetupTeardownChained.java:50)
[junit4:junit4]    > 	at org.apache.lucene.util.TestRuleFieldCacheSanity$1.evaluate(TestRuleFieldCacheSanity.java:51)
[junit4:junit4]    > 	at org.apache.lucene.util.AbstractBeforeAfterRule$1.evaluate(AbstractBeforeAfterRule.java:45)
[junit4:junit4]    > 	at com.carrotsearch.randomizedtesting.rules.SystemPropertiesInvariantRule$1.evaluate(SystemPropertiesInvariantRule.java:55)
[junit4:junit4]    > 	at org.apache.lucene.util.TestRuleThreadAndTestName$1.evaluate(TestRuleThreadAndTestName.java:48)
[junit4:junit4]    > 	at org.apache.lucene.util.TestRuleIgnoreAfterMaxFailures$1.evaluate(TestRuleIgnoreAfterMaxFailures.java:70)
[junit4:junit4]    > 	at org.apache.lucene.util.TestRuleMarkFailure$1.evaluate(TestRuleMarkFailure.java:48)
[junit4:junit4]    > 	at com.carrotsearch.randomizedtesting.rules.StatementAdapter.evaluate(StatementAdapter.java:36)
[junit4:junit4]    > 	at com.carrotsearch.randomizedtesting.ThreadLeakControl$StatementRunner.run(ThreadLeakControl.java:345)
[junit4:junit4]    > 	at com.carrotsearch.randomizedtesting.ThreadLeakControl.forkTimeoutingTask(ThreadLeakControl.java:769)
[junit4:junit4]    > 	at com.carrotsearch.randomizedtesting.ThreadLeakControl$3.evaluate(ThreadLeakControl.java:429)
[junit4:junit4]    > 	at com.carrotsearch.randomizedtesting.RandomizedRunner.runSingleTest(RandomizedRunner.java:746)
[junit4:junit4]    > 	at com.carrotsearch.randomizedtesting.RandomizedRunner$3.evaluate(RandomizedRunner.java:648)
[junit4:junit4]    > 	at com.carrotsearch.randomizedtesting.RandomizedRunner$4.evaluate(RandomizedRunner.java:682)
[junit4:junit4]    > 	at com.carrotsearch.randomizedtesting.RandomizedRunner$5.evaluate(RandomizedRunner.java:693)
[junit4:junit4]    > 	at com.carrotsearch.randomizedtesting.rules.StatementAdapter.evaluate(StatementAdapter.java:36)
[junit4:junit4]    > 	at com.carrotsearch.randomizedtesting.rules.SystemPropertiesRestoreRule$1.evaluate(SystemPropertiesRestoreRule.java:53)
[junit4:junit4]    > 	at org.apache.lucene.util.AbstractBeforeAfterRule$1.evaluate(AbstractBeforeAfterRule.java:45)
[junit4:junit4]    > 	at org.apache.lucene.util.TestRuleStoreClassName$1.evaluate(TestRuleStoreClassName.java:42)
[junit4:junit4]    > 	at com.carrotsearch.randomizedtesting.rules.SystemPropertiesInvariantRule$1.evaluate(SystemPropertiesInvariantRule.java:55)
[junit4:junit4]    > 	at com.carrotsearch.randomizedtesting.rules.NoShadowingOrOverridesOnMethodsRule$1.evaluate(NoShadowingOrOverridesOnMethodsRule.java:39)
[junit4:junit4]    > 	at com.carrotsearch.randomizedtesting.rules.NoShadowingOrOverridesOnMethodsRule$1.evaluate(NoShadowingOrOverridesOnMethodsRule.java:39)
[junit4:junit4]    > 	at org.apache.lucene.util.TestRuleAssertionsRequired$1.evaluate(TestRuleAssertionsRequired.java:40)
[junit4:junit4]    > 	at org.apache.lucene.util.TestRuleMarkFailure$1.evaluate(TestRuleMarkFailure.java:48)
[junit4:junit4]    > 	at org.apache.lucene.util.TestRuleIgnoreAfterMaxFailures$1.evaluate(TestRuleIgnoreAfterMaxFailures.java:70)
[junit4:junit4]    > 	at org.apache.lucene.util.TestRuleIgnoreTestSuites$1.evaluate(TestRuleIgnoreTestSuites.java:55)
[junit4:junit4]    > 	at com.carrotsearch.randomizedtesting.rules.StatementAdapter.evaluate(StatementAdapter.java:36)
[junit4:junit4]    > 	at com.carrotsearch.randomizedtesting.ThreadLeakControl$StatementRunner.run(ThreadLeakControl.java:345)
[junit4:junit4]    > 	at java.lang.Thread.run(Thread.java:777)
[junit4:junit4]   2> 13920 T547 oasu.AbstractSolrTestCase.setUp ####SETUP_START testMaxTime
[junit4:junit4]   2> 13921 T547 oasc.SolrResourceLoader.<init> new SolrResourceLoader for directory: '/mnt/ssd/jenkins/workspace/Lucene-Solr-4.x-Linux/solr/build/solr-core/test-files/solr/collection1/'
[junit4:junit4]   2> 13921 T547 oasc.SolrResourceLoader.replaceClassLoader Adding 'file:/mnt/ssd/jenkins/workspace/Lucene-Solr-4.x-Linux/solr/build/solr-core/test-files/solr/collection1/lib/README' to classloader
[junit4:junit4]   2> 13922 T547 oasc.SolrResourceLoader.replaceClassLoader Adding 'file:/mnt/ssd/jenkins/workspace/Lucene-Solr-4.x-Linux/solr/build/solr-core/test-files/solr/collection1/lib/classes/' to classloader
[junit4:junit4]   2> 13944 T547 oasc.SolrConfig.<init> Using Lucene MatchVersion: LUCENE_40
[junit4:junit4]   2> 13976 T547 oasc.SolrConfig.<init> Loaded SolrConfig: solrconfig.xml
[junit4:junit4]   2> 13977 T547 oass.IndexSchema.readSchema Reading Solr Schema
[junit4:junit4]   2> 13981 T547 oass.IndexSchema.readSchema Schema name=test
[junit4:junit4]   2> 14312 T547 oass.OpenExchangeRatesOrgProvider.init Initialized with rates=open-exchange-rates.json, refreshInterval=1440.
[junit4:junit4]   2> 14317 T547 oass.IndexSchema.readSchema default search field in schema is text
[junit4:junit4]   2> 14319 T547 oass.IndexSchema.readSchema unique key field: id
[junit4:junit4]   2> 14323 T547 oass.FileExchangeRateProvider.reload Reloading exchange rates from file currency.xml
[junit4:junit4]   2> 14326 T547 oass.FileExchangeRateProvider.reload Reloading exchange rates from file currency.xml
[junit4:junit4]   2> 14329 T547 oass.OpenExchangeRatesOrgProvider.reload Reloading exchange rates from open-exchange-rates.json
[junit4:junit4]   2> 14329 T547 oass.OpenExchangeRatesOrgProvider.reload Reloading exchange rates from open-exchange-rates.json
[junit4:junit4]   2> 14330 T547 oasc.SolrResourceLoader.locateSolrHome JNDI not configured for solr (NoInitialContextEx)
[junit4:junit4]   2> 14330 T547 oasc.SolrResourceLoader.locateSolrHome using system property solr.solr.home: /mnt/ssd/jenkins/workspace/Lucene-Solr-4.x-Linux/solr/build/solr-core/test-files/solr
[junit4:junit4]   2> 14331 T547 oasc.SolrResourceLoader.<init> new SolrResourceLoader for directory: '/mnt/ssd/jenkins/workspace/Lucene-Solr-4.x-Linux/solr/build/solr-core/test-files/solr/'
[junit4:junit4]   2> 14335 T547 oasc.CoreContainer.<init> New CoreContainer 891169769
[junit4:junit4]   2> 14336 T547 oasc.SolrCore.<init> [collection1] Opening new SolrCore at /mnt/ssd/jenkins/workspace/Lucene-Solr-4.x-Linux/solr/build/solr-core/test-files/solr/collection1/, dataDir=/mnt/ssd/jenkins/workspace/Lucene-Solr-4.x-Linux/solr/build/solr-core/test/J0/./org.apache.solr.update.AutoCommitTest-1346382907574/
[junit4:junit4]   2> 14336 T547 oasc.JmxMonitoredMap.<init> No JMX servers found, not exposing Solr information with JMX.
[junit4:junit4]   2> 14337 T547 oasc.SolrCore.getNewIndexDir WARNING New index directory detected: old=null new=/mnt/ssd/jenkins/workspace/Lucene-Solr-4.x-Linux/solr/build/solr-core/test/J0/./org.apache.solr.update.AutoCommitTest-1346382907574/index/
[junit4:junit4]   2> 14337 T547 oasc.SolrCore.initIndex WARNING [collection1] Solr index directory '/mnt/ssd/jenkins/workspace/Lucene-Solr-4.x-Linux/solr/build/solr-core/test/J0/./org.apache.solr.update.AutoCommitTest-1346382907574/index' doesn't exist. Creating new index...
[junit4:junit4]   2> 14338 T547 oasc.CachingDirectoryFactory.get return new directory for /mnt/ssd/jenkins/workspace/Lucene-Solr-4.x-Linux/solr/build/solr-core/test/J0/./org.apache.solr.update.AutoCommitTest-1346382907574/index forceNew:false
[junit4:junit4]   2> 14339 T547 oasc.SolrDeletionPolicy.onCommit SolrDeletionPolicy.onCommit: commits:num=1
[junit4:junit4]   2> 		commit{dir=MockDirWrapper(org.apache.lucene.store.RAMDirectory@f1eb4a30 lockFactory=org.apache.lucene.store.NativeFSLockFactory@747a51f0),segFN=segments_1,generation=1,filenames=[segments_1]
[junit4:junit4]   2> 14339 T547 oasc.SolrDeletionPolicy.updateCommits newest commit = 1
[junit4:junit4]   2> 14339 T547 oasc.SolrCore.initWriters created xml: solr.XMLResponseWriter
[junit4:junit4]   2> 14340 T547 oasup.UpdateRequestProcessorChain.init inserting DistributedUpdateProcessorFactory into updateRequestProcessorChain "dedupe"
[junit4:junit4]   2> 14341 T547 oasup.UpdateRequestProcessorChain.init inserting DistributedUpdateProcessorFactory into updateRequestProcessorChain "dedupe-allfields"
[junit4:junit4]   2> 14341 T547 oasup.UpdateRequestProcessorChain.init inserting DistributedUpdateProcessorFactory into updateRequestProcessorChain "stored_sig"
[junit4:junit4]   2> 14341 T547 oasup.UpdateRequestProcessorChain.init inserting DistributedUpdateProcessorFactory into updateRequestProcessorChain "uniq-fields"
[junit4:junit4]   2> 14342 T547 oasup.UpdateRequestProcessorChain.init inserting DistributedUpdateProcessorFactory into updateRequestProcessorChain "distrib-dup-test-chain-implicit"
[junit4:junit4]   2> 14342 T547 oasc.RequestHandlers.initHandlersFromConfig adding lazy requestHandler: solr.ReplicationHandler
[junit4:junit4]   2> 14343 T547 oasc.RequestHandlers.initHandlersFromConfig created /replication: solr.ReplicationHandler
[junit4:junit4]   2> 14343 T547 oasc.RequestHandlers.initHandlersFromConfig created standard: solr.StandardRequestHandler
[junit4:junit4]   2> 14343 T547 oasc.RequestHandlers.initHandlersFromConfig created /get: solr.RealTimeGetHandler
[junit4:junit4]   2> 14344 T547 oasc.RequestHandlers.initHandlersFromConfig created dismax: solr.SearchHandler
[junit4:junit4]   2> 14344 T547 oasc.RequestHandlers.initHandlersFromConfig created mock: org.apache.solr.core.MockQuerySenderListenerReqHandler
[junit4:junit4]   2> 14344 T547 oasc.RequestHandlers.initHandlersFromConfig created /admin/: org.apache.solr.handler.admin.AdminHandlers
[junit4:junit4]   2> 14345 T547 oasc.RequestHandlers.initHandlersFromConfig created defaults: solr.StandardRequestHandler
[junit4:junit4]   2> 14345 T547 oasc.RequestHandlers.initHandlersFromConfig adding lazy requestHandler: solr.StandardRequestHandler
[junit4:junit4]   2> 14345 T547 oasc.RequestHandlers.initHandlersFromConfig created lazy: solr.StandardRequestHandler
[junit4:junit4]   2> 14346 T547 oasc.RequestHandlers.initHandlersFromConfig created /update: solr.UpdateRequestHandler
[junit4:junit4]   2> 14346 T547 oasc.RequestHandlers.initHandlersFromConfig created /terms: org.apache.solr.handler.component.SearchHandler
[junit4:junit4]   2> 14346 T547 oasc.RequestHandlers.initHandlersFromConfig created spellCheckCompRH: org.apache.solr.handler.component.SearchHandler
[junit4:junit4]   2> 14347 T547 oasc.RequestHandlers.initHandlersFromConfig created spellCheckCompRH_Direct: org.apache.solr.handler.component.SearchHandler
[junit4:junit4]   2> 14347 T547 oasc.RequestHandlers.initHandlersFromConfig created spellCheckWithWordbreak: org.apache.solr.handler.component.SearchHandler
[junit4:junit4]   2> 14347 T547 oasc.RequestHandlers.initHandlersFromConfig created spellCheckWithWordbreak_Direct: org.apache.solr.handler.component.SearchHandler
[junit4:junit4]   2> 14347 T547 oasc.RequestHandlers.initHandlersFromConfig created spellCheckCompRH1: org.apache.solr.handler.component.SearchHandler
[junit4:junit4]   2> 14348 T547 oasc.RequestHandlers.initHandlersFromConfig created tvrh: org.apache.solr.handler.component.SearchHandler
[junit4:junit4]   2> 14348 T547 oasc.RequestHandlers.initHandlersFromConfig created /mlt: solr.MoreLikeThisHandler
[junit4:junit4]   2> 14349 T547 oasc.RequestHandlers.initHandlersFromConfig created /debug/dump: solr.DumpRequestHandler
[junit4:junit4]   2> 14349 T547 oashl.XMLLoader.init xsltCacheLifetimeSeconds=60
[junit4:junit4]   2> 14350 T547 oasc.SolrCore.initDeprecatedSupport WARNING solrconfig.xml uses deprecated <admin/gettableFiles>, Please update your config to use the ShowFileRequestHandler.
[junit4:junit4]   2> 14351 T547 oasc.SolrCore.initDeprecatedSupport WARNING adding ShowFileRequestHandler with hidden files: [BAD-SCHEMA-NOT-INDEXED-BUT-TF.XML, SCHEMA-REQUIRED-FIELDS.XML, SOLRCONFIG-MASTER1-KEEPONEBACKUP.XML, BAD-SCHEMA-NONTEXT-ANALYZER.XML, SOLRCONFIG-PROPINJECT.XML, SOLRCONFIG-PROPINJECT-INDEXDEFAULT.XML, STOP-2.TXT, SCHEMA11.XML, BAD-SCHEMA-UNIQUEKEY-USES-DEFAULT.XML, SCHEMA15.XML, SOLRCONFIG-NATIVELOCK.XML, SCHEMA-SIM.XML, CONDITIONAL.UPDATEPROCESSOR.JS, BAD-SOLRCONFIG-MISSING-SCRIPTFILE.XML, SOLRCONFIG-SCRIPT-UPDATEPROCESSOR.XML, SOLRCONFIG-REPEATER.XML, SOLRCONFIG-SPELLCHECKER.XML, SOLRCONFIG-NOCACHE.XML, SCHEMA-CHARFILTERS.XML, SOLRCONFIG-SOLCOREPROPERTIES.XML, SOLRCONFIG_CODEC.XML, BAD-SCHEMA-EXTERNAL-FILEFIELD.XML, HYPHENATION.DTD, SCHEMA.XML, SOLRCONFIG-MERGEPOLICY.XML, TRIVIAL.UPDATEPROCESSOR1.JS, SOLRCONFIG-PHRASESUGGEST.XML, SOLRCONFIG-SLAVE1.XML, SOLRCONFIG-BASIC.XML, SCHEMA-LMJELINEKMERCER.XML, BAD-MP-SOLRCONFIG.XML, BAD-SCHEMA-DUP-FIELD.XML, BAD-SCHEMA-UNIQUEKEY-MULTIVALUED.XML, SOLRCONFIG-MASTER.XML, SOLRCONFIG-HIGHLIGHT.XML, SCHEMA-TFIDF.XML, SCHEMA-REPLICATION1.XML, SYNONYMS.TXT, SOLRCONFIG-ELEVATE.XML, STOPWITHBOM.TXT, SOLRCONFIG-QUERYSENDER.XML, WDFTYPES.TXT, SOLRCONFIG-DELPOLICY1.XML, BAD_SOLRCONFIG.XML, HUNSPELL-TEST.DIC, SCHEMA-NUMERIC.XML, SCHEMA-LUCENEMATCHVERSION.XML, KEEP-2.TXT, SCHEMA-STOP-KEEP.XML, SCHEMA-IB.XML, STOP-SNOWBALL.TXT, SOLRCONFIG-SLAVE.XML, BAD-SCHEMA-NOT-INDEXED-BUT-NORMS.XML, STOPWORDSWRONGENCODING.TXT, THROW.ERROR.ON.ADD.UPDATEPROCESSOR.JS, SOLRCONFIG-SPELLCHECKCOMPONENT.XML, STOPTYPES-1.TXT, SOLRCONFIG-TLOG.XML, COMPOUNDDICTIONARY.TXT, DA_COMPOUNDDICTIONARY.TXT, SOLRCONFIG-TERMINDEX.XML, BAD-SOLRCONFIG-INVALID-SCRIPTFILE.XML, SCHEMASURROUND.XML, OPEN-EXCHANGE-RATES.JSON, BAD-SCHEMA-DUP-FIELDTYPE.XML, PHRASESUGGEST.TXT, SOLRCONFIG-MASTER2.XML, OLD_SYNONYMS.TXT, BAD-SCHEMA-UNIQUEKEY-IS-COPYFIELD-DEST.XML, SCHEMA-NOT-REQUIRED-UNIQUE-KEY.XML, BAD-SCHEMA-CODEC-GLOBAL-VS-FT-MISMATCH.XML, SCHEMA-LMDIRICHLET.XML, SCHEMA-REVERSED.XML, BAD-SCHEMA-NOT-INDEXED-BUT-POS.XML, SCHEMA-FOLDING.XML, SOLRCONFIG-CACHING.XML, MAPPING-ISOLATIN1ACCENT.TXT, ADDFIELDS.UPDATEPROCESSOR.JS, SCHEMA-BM25.XML, STOP-1.TXT, SOLRCONFIG-ENABLEPLUGIN.XML, MISSING.FUNCTIONS.UPDATEPROCESSOR.JS, SCHEMA12.XML, SOLRCONFIG-TRANSFORMERS.XML, SCHEMA-COPYFIELD-TEST.XML, SOLRCONFIG-BASIC-LUCENEVERSION31.XML, BAD-SCHEMA-DUP-DYNAMICFIELD.XML, CURRENCY.XML, DA_UTF8.XML, MISSLEADING.EXTENSION.UPDATEPROCESSOR.JS.TXT, SOLRCONFIG-SOLR-749.XML, STOPWORDS.TXT, HUNSPELL-TEST.AFF, SOLRCONFIG_PERF.XML, SOLRCONFIG-SIMPLELOCK.XML, FRENCHARTICLES.TXT, SOLRCONFIG-LAZYWRITER.XML, SCHEMA-REPLICATION2.XML, SOLRCONFIG-XINCLUDE.XML, SCHEMA-SPELLCHECKER.XML, XSLT, SOLRCONFIG-DELPOLICY2.XML, TRIVIAL.UPDATEPROCESSOR0.JS, KEEP-1.TXT, SCHEMA-TRIE.XML, SCHEMA-BINARYFIELD.XML, SCHEMA-COLLATEFILTER.XML, BAD-SCHEMA-OMIT-TF-BUT-NOT-POS.XML, SCHEMA-MINIMAL.XML, STOPTYPES-2.TXT, STEMDICT.TXT, SCHEMA_CODEC.XML, ELEVATE.XML, SCHEMA-COLLATE.XML, PROTWORDS.TXT, SOLRCONFIG-REQHANDLER.INCL, SCHEMA-PHRASESUGGEST.XML, SCHEMA-DFR.XML, BAD-SCHEMA-ANALYZER-CLASS-AND-NESTED.XML, SOLRCONFIG-MASTER1.XML, SOLRCONFIG-FUNCTIONQUERY.XML, SOLRCONFIG-MASTER3.XML, SOLRCONFIG-UPDATE-PROCESSOR-CHAINS.XML, SOLRCONFIG-ALTDIRECTORY.XML, BAD-SCHEMA-SIM-GLOBAL-VS-FT-MISMATCH.XML, SOLRCONFIG-QUERYSENDER-NOQUERY.XML, BAD-SOLRCONFIG-BOGUS-SCRIPTENGINE-NAME.XML]
[junit4:junit4]   2> 14353 T547 oass.SolrIndexSearcher.<init> Opening Searcher@701469f7 main
[junit4:junit4]   2> 14353 T547 oass.SolrIndexSearcher.getIndexDir WARNING WARNING: Directory impl does not support setting indexDir: org.apache.lucene.store.MockDirectoryWrapper
[junit4:junit4]   2> 14354 T547 oasu.CommitTracker.<init> Hard AutoCommit: disabled
[junit4:junit4]   2> 14354 T547 oasu.CommitTracker.<init> Soft AutoCommit: disabled
[junit4:junit4]   2> 14354 T547 oashc.SpellCheckComponent.inform Initializing spell checkers
[junit4:junit4]   2> 14461 T547 oass.DirectSolrSpellChecker.init init: {name=direct,classname=DirectSolrSpellChecker,field=lowerfilt,minQueryLength=3}
[junit4:junit4]   2> 14478 T547 oashc.HttpShardHandlerFactory.getParameter Setting socketTimeout to: 0
[junit4:junit4]   2> 14479 T547 oashc.HttpShardHandlerFactory.getParameter Setting urlScheme to: http://
[junit4:junit4]   2> 14479 T547 oashc.HttpShardHandlerFactory.getParameter Setting connTimeout to: 0
[junit4:junit4]   2> 14479 T547 oashc.HttpShardHandlerFactory.getParameter Setting maxConnectionsPerHost to: 20
[junit4:junit4]   2> 14480 T547 oashc.HttpShardHandlerFactory.getParameter Setting corePoolSize to: 0
[junit4:junit4]   2> 14480 T547 oashc.HttpShardHandlerFactory.getParameter Setting maximumPoolSize to: 2147483647
[junit4:junit4]   2> 14480 T547 oashc.HttpShardHandlerFactory.getParameter Setting maxThreadIdleTime to: 5
[junit4:junit4]   2> 14481 T547 oashc.HttpShardHandlerFactory.getParameter Setting sizeOfQueue to: -1
[junit4:junit4]   2> 14481 T547 oashc.HttpShardHandlerFactory.getParameter Setting fairnessPolicy to: false
[junit4:junit4]   2> 14482 T547 oascsi.HttpClientUtil.createClient Creating new http client, config:maxConnectionsPerHost=20&maxConnections=10000&socketTimeout=0&connTimeout=0&retry=false
[junit4:junit4]   2> 14486 T550 oasc.SolrCore.registerSearcher [collection1] Registered new searcher Searcher@701469f7 main{StandardDirectoryReader(segments_1:1)}
[junit4:junit4]   2> 14486 T547 oasc.CoreContainer.register registering core: collection1
[junit4:junit4]   2> 14487 T547 oasu.AbstractSolrTestCase.setUp ####SETUP_END testMaxTime
[junit4:junit4]   2> 14532 T547 oasc.SolrDeletionPolicy.onInit SolrDeletionPolicy.onInit: commits:num=1
[junit4:junit4]   2> 		commit{dir=MockDirWrapper(org.apache.lucene.store.RAMDirectory@f1eb4a30 lockFactory=org.apache.lucene.store.NativeFSLockFactory@747a51f0),segFN=segments_1,generation=1,filenames=[segments_1]
[junit4:junit4]   2> 14532 T547 oasc.SolrDeletionPolicy.updateCommits newest commit = 1
[junit4:junit4]   2> 14534 T547 UPDATE [collection1] {add=[529]} 0 47
[junit4:junit4]   2> ASYNC  NEW_CORE C36 name=collection1 org.apache.solr.core.SolrCore@9177c000
[junit4:junit4]   2> 14534 T547 C36 REQ [collection1] webapp=null path=null params={q=id:529&start=0&qt=standard&version=2.2&rows=20} hits=0 status=0 QTime=0 
[junit4:junit4]   2> 15534 T551 oasu.DirectUpdateHandler2.commit start commit{flags=0,_version_=0,optimize=false,openSearcher=true,waitSearcher=true,expungeDeletes=false,softCommit=true}
[junit4:junit4]   2> 15535 T551 oass.SolrIndexSearcher.<init> Opening Searcher@8a0a81d6 main
[junit4:junit4]   2> 15535 T551 oass.SolrIndexSearcher.getIndexDir WARNING WARNING: Directory impl does not support setting indexDir: org.apache.lucene.store.MockDirectoryWrapper
[junit4:junit4]   2> 15536 T551 oasu.DirectUpdateHandler2.commit end_commit_flush
[junit4:junit4]   2> 15536 T550 oasc.SolrCore.registerSearcher [collection1] Registered new searcher Searcher@8a0a81d6 main{StandardDirectoryReader(segments_1:3:nrt _0(4.0.0.2):C1)}
[junit4:junit4]   2> 15557 T547 UPDATE [collection1] {add=[530]} 0 47
[junit4:junit4]   2> 15558 T547 C36 REQ [collection1] webapp=null path=null params={q=id:529&start=0&qt=standard&version=2.2&rows=20} hits=1 status=0 QTime=0 
[junit4:junit4]   2> 15559 T547 C36 REQ [collection1] webapp=null path=null params={q=id:530&start=0&qt=standard&version=2.2&rows=20} hits=0 status=0 QTime=0 
[junit4:junit4]   2> 15563 T547 C36 UPDATE [collection1] webapp=null path=null params={} {delete=[529]} 0 0
[junit4:junit4]   2> 15564 T547 C36 REQ [collection1] webapp=null path=null params={q=id:529&start=0&qt=standard&version=2.2&rows=20} hits=1 status=0 QTime=0 
[junit4:junit4]   2> 16558 T551 oasu.DirectUpdateHandler2.commit start commit{flags=0,_version_=0,optimize=false,openSearcher=true,waitSearcher=true,expungeDeletes=false,softCommit=true}
[junit4:junit4]   2> 16559 T551 oass.SolrIndexSearcher.<init> Opening Searcher@979eb446 main
[junit4:junit4]   2> 16560 T551 oass.SolrIndexSearcher.getIndexDir WARNING WARNING: Directory impl does not support setting indexDir: org.apache.lucene.store.MockDirectoryWrapper
[junit4:junit4]   2> 16560 T551 oasu.DirectUpdateHandler2.commit end_commit_flush
[junit4:junit4]   2> 16561 T550 oasc.SolrCore.registerSearcher [collection1] Registered new searcher Searcher@979eb446 main{StandardDirectoryReader(segments_1:7:nrt _1(4.0.0.2):C1)}
[junit4:junit4]   2> 16566 T547 UPDATE [collection1] {add=[550]} 0 47
[junit4:junit4]   2> 16567 T547 C36 REQ [collection1] webapp=null path=null params={q=id:529&start=0&qt=standard&version=2.2&rows=20} hits=0 status=0 QTime=0 
[junit4:junit4]   2> 16568 T547 UPDATE [collection1] {add=[500]} 0 47
[junit4:junit4]   2> 16569 T547 UPDATE [collection1] {add=[500]} 0 47
[junit4:junit4]   2> 16569 T547 UPDATE [collection1] {add=[500]} 0 47
[junit4:junit4]   2> 16569 T547 UPDATE [collection1] {add=[500]} 0 47
[junit4:junit4]   2> 16570 T547 UPDATE [collection1] {add=[500]} 0 47
[junit4:junit4]   2> 16570 T547 UPDATE [collection1] {add=[500]} 0 47
[junit4:junit4]   2> 16571 T547 UPDATE [collection1] {add=[500]} 0 47
[junit4:junit4]   2> 16571 T547 UPDATE [collection1] {add=[500]} 0 47
[junit4:junit4]   2> 16573 T547 UPDATE [collection1] {add=[500]} 0 47
[junit4:junit4]   2> 16573 T547 UPDATE [collection1] {add=[500]} 0 47
[junit4:junit4]   2> 16574 T547 C36 REQ [collection1] webapp=null path=null params={q=id:500&start=0&qt=standard&version=2.2&rows=20} hits=0 status=0 QTime=0 
[junit4:junit4]   2> 17566 T551 oasu.DirectUpdateHandler2.commit start commit{flags=0,_version_=0,optimize=false,openSearcher=true,waitSearcher=true,expungeDeletes=false,softCommit=true}
[junit4:junit4]   2> 17568 T551 oass.SolrIndexSearcher.<init> Opening Searcher@ac277709 main
[junit4:junit4]   2> 17569 T551 oass.SolrIndexSearcher.getIndexDir WARNING WARNING: Directory impl does not support setting indexDir: org.apache.lucene.store.MockDirectoryWrapper
[junit4:junit4]   2> 17569 T551 oasu.DirectUpdateHandler2.commit end_commit_flush
[junit4:junit4]   2> 17569 T550 oasc.SolrCore.registerSearcher [collection1] Registered new searcher Searcher@ac277709 main{StandardDirectoryReader(segments_1:12:nrt _1(4.0.0.2):C1 _2(4.0.0.2):C10/9 _3(4.0.0.2):C1)}
[junit4:junit4]   2> 17576 T547 UPDATE [collection1] {add=[531]} 0 47
[junit4:junit4]   2> 17577 T547 C36 REQ [collection1] webapp=null path=null params={q=id:500&start=0&qt=standard&version=2.2&rows=20} hits=1 status=0 QTime=0 
[junit4:junit4]   2> 17579 T547 oasu.AbstractSolrTestCase.tearDown ####TEARDOWN_START testMaxTime
[junit4:junit4]   2> 17579 T547 oasc.CoreContainer.shutdown Shutting down CoreContainer instance=891169769
[junit4:junit4]   2> 17580 T547 oasc.SolrCore.close [collection1]  CLOSING SolrCore org.apache.solr.core.SolrCore@9177c000
[junit4:junit4]   2> 17580 T547 oasc.SolrCore.closeSearcher [collection1] Closing main searcher on request.
[junit4:junit4]   2> 17581 T547 oasu.DirectUpdateHandler2.close closing DirectUpdateHandler2{commits=3,autocommits=0,soft autocommit maxTime=1000ms,soft autocommits=3,optimizes=0,rollbacks=0,expungeDeletes=0,docsPending=14,adds=1,deletesById=0,deletesByQuery=0,errors=0,cumulative_adds=14,cumulative_deletesById=1,cumulative_deletesByQuery=0,cumulative_errors=0}
[junit4:junit4]   2> 17581 T547 oasu.DefaultSolrCoreState.decref SolrCoreState ref count has reached 0 - closing IndexWriter
[junit4:junit4]   2> 17583 T547 C36 oasc.SolrDeletionPolicy.onCommit SolrDeletionPolicy.onCommit: commits:num=2
[junit4:junit4]   2> 		commit{dir=MockDirWrapper(org.apache.lucene.store.RAMDirectory@f1eb4a30 lockFactory=org.apache.lucene.store.NativeFSLockFactory@747a51f0),segFN=segments_1,generation=1,filenames=[segments_1]
[junit4:junit4]   2> 		commit{dir=MockDirWrapper(org.apache.lucene.store.RAMDirectory@f1eb4a30 lockFactory=org.apache.lucene.store.NativeFSLockFactory@747a51f0),segFN=segments_2,generation=2,filenames=[_3.fdx, _4.fdx, _2_2.del, _3.si, _1_nrm.cfe, _2_nrm.cfe, _3_nrm.cfe, _1.si, _4_nrm.cfe, segments_2, _1.tim, _2.tim, _3.tim, _1_nrm.cfs, _4.tim, _1.tip, _2_nrm.cfs, _2.tip, _3_nrm.cfs, _4_nrm.cfs, _3.tip, _4.tip, _1.frq, _1.fnm, _2.fnm, _2.frq, _3.frq, _3.fnm, _4.frq, _4.fnm, _4.si, _2.si, _1.fdt, _1.prx, _2.prx, _2.fdt, _3.fdt, _3.prx, _4.fdt, _4.prx, _1.fdx, _2.fdx]
[junit4:junit4]   2> 17584 T547 C36 oasc.SolrDeletionPolicy.updateCommits newest commit = 2
[junit4:junit4]   2> 17600 T547 oasu.AbstractSolrTestCase.setUp ####SETUP_START testMaxDocs
[junit4:junit4]   2> 17601 T547 oasc.SolrResourceLoader.<init> new SolrResourceLoader for directory: '/mnt/ssd/jenkins/workspace/Lucene-Solr-4.x-Linux/solr/build/solr-core/test-files/solr/collection1/'
[junit4:junit4]   2> 17602 T547 oasc.SolrResourceLoader.replaceClassLoader Adding 'file:/mnt/ssd/jenkins/workspace/Lucene-Solr-4.x-Linux/solr/build/solr-core/test-files/solr/collection1/lib/README' to classloader
[junit4:junit4]   2> 17602 T547 oasc.SolrResourceLoader.replaceClassLoader Adding 'file:/mnt/ssd/jenkins/workspace/Lucene-Solr-4.x-Linux/solr/build/solr-core/test-files/solr/collection1/lib/classes/' to classloader
[junit4:junit4]   2> 17645 T547 oasc.SolrConfig.<init> Using Lucene MatchVersion: LUCENE_40
[junit4:junit4]   2> 17678 T547 oasc.SolrConfig.<init> Loaded SolrConfig: solrconfig.xml
[junit4:junit4]   2> 17678 T547 oass.IndexSchema.readSchema Reading Solr Schema
[junit4:junit4]   2> 17682 T547 oass.IndexSchema.readSchema Schema name=test
[junit4:junit4]   2> 17951 T547 oass.OpenExchangeRatesOrgProvider.init Initialized with rates=open-exchange-rates.json, refreshInterval=1440.
[junit4:junit4]   2> 17956 T547 oass.IndexSchema.readSchema default search field in schema is text
[junit4:junit4]   2> 17959 T547 oass.IndexSchema.readSchema unique key field: id
[junit4:junit4]   2> 17963 T547 oass.FileExchangeRateProvider.reload Reloading exchange rates from file currency.xml
[junit4:junit4]   2> 17966 T547 oass.FileExchangeRateProvider.reload Reloading exchange rates from file currency.xml
[junit4:junit4]   2> 17968 T547 oass.OpenExchangeRatesOrgProvider.reload Reloading exchange rates from open-exchange-rates.json
[junit4:junit4]   2> 17969 T547 oass.OpenExchangeRatesOrgProvider.reload Reloading exchange rates from open-exchange-rates.json
[junit4:junit4]   2> 17970 T547 oasc.SolrResourceLoader.locateSolrHome JNDI not configured for solr (NoInitialContextEx)
[junit4:junit4]   2> 17970 T547 oasc.SolrResourceLoader.locateSolrHome using system property solr.solr.home: /mnt/ssd/jenkins/workspace/Lucene-Solr-4.x-Linux/solr/build/solr-core/test-files/solr
[junit4:junit4]   2> 17970 T547 oasc.SolrResourceLoader.<init> new SolrResourceLoader for directory: '/mnt/ssd/jenkins/workspace/Lucene-Solr-4.x-Linux/solr/build/solr-core/test-files/solr/'
[junit4:junit4]   2> 17975 T547 oasc.CoreContainer.<init> New CoreContainer 1235583372
[junit4:junit4]   2> 17975 T547 oasc.SolrCore.<init> [collection1] Opening new SolrCore at /mnt/ssd/jenkins/workspace/Lucene-Solr-4.x-Linux/solr/build/solr-core/test-files/solr/collection1/, dataDir=/mnt/ssd/jenkins/workspace/Lucene-Solr-4.x-Linux/solr/build/solr-core/test/J0/./org.apache.solr.update.AutoCommitTest-1346382911254/
[junit4:junit4]   2> 17976 T547 oasc.JmxMonitoredMap.<init> No JMX servers found, not exposing Solr information with JMX.
[junit4:junit4]   2> 17976 T547 oasc.SolrCore.getNewIndexDir WARNING New index directory detected: old=null new=/mnt/ssd/jenkins/workspace/Lucene-Solr-4.x-Linux/solr/build/solr-core/test/J0/./org.apache.solr.update.AutoCommitTest-1346382911254/index/
[junit4:junit4]   2> 17976 T547 oasc.SolrCore.initIndex WARNING [collection1] Solr index directory '/mnt/ssd/jenkins/workspace/Lucene-Solr-4.x-Linux/solr/build/solr-core/test/J0/./org.apache.solr.update.AutoCommitTest-1346382911254/index' doesn't exist. Creating new index...
[junit4:junit4]   2> 17977 T547 oasc.CachingDirectoryFactory.get return new directory for /mnt/ssd/jenkins/workspace/Lucene-Solr-4.x-Linux/solr/build/solr-core/test/J0/./org.apache.solr.update.AutoCommitTest-1346382911254/index forceNew:false
[junit4:junit4]   2> 17978 T547 oasc.SolrDeletionPolicy.onCommit SolrDeletionPolicy.onCommit: commits:num=1
[junit4:junit4]   2> 		commit{dir=MockDirWrapper(org.apache.lucene.store.RAMDirectory@3bc67711 lockFactory=org.apache.lucene.store.NativeFSLockFactory@914d249b),segFN=segments_1,generation=1,filenames=[segments_1]
[junit4:junit4]   2> 17978 T547 oasc.SolrDeletionPolicy.updateCommits newest commit = 1
[junit4:junit4]   2> 17979 T547 oasc.SolrCore.initWriters created xml: solr.XMLResponseWriter
[junit4:junit4]   2> 17980 T547 oasup.UpdateRequestProcessorChain.init inserting DistributedUpdateProcessorFactory into updateRequestProcessorChain "dedupe"
[junit4:junit4]   2> 17980 T547 oasup.UpdateRequestProcessorChain.init inserting DistributedUpdateProcessorFactory into updateRequestProcessorChain "dedupe-allfields"
[junit4:junit4]   2> 17980 T547 oasup.UpdateRequestProcessorChain.init inserting DistributedUpdateProcessorFactory into updateRequestProcessorChain "stored_sig"
[junit4:junit4]   2> 17981 T547 oasup.UpdateRequestProcessorChain.init inserting DistributedUpdateProcessorFactory into updateRequestProcessorChain "uniq-fields"
[junit4:junit4]   2> 17981 T547 oasup.UpdateRequestProcessorChain.init inserting DistributedUpdateProcessorFactory into updateRequestProcessorChain "distrib-dup-test-chain-implicit"
[junit4:junit4]   2> 17982 T547 oasc.RequestHandlers.initHandlersFromConfig adding lazy requestHandler: solr.ReplicationHandler
[junit4:junit4]   2> 17982 T547 oasc.RequestHandlers.initHandlersFromConfig created /replication: solr.ReplicationHandler
[junit4:junit4]   2> 17982 T547 oasc.RequestHandlers.initHandlersFromConfig created standard: solr.StandardRequestHandler
[junit4:junit4]   2> 17983 T547 oasc.RequestHandlers.initHandlersFromConfig created /get: solr.RealTimeGetHandler
[junit4:junit4]   2> 17983 T547 oasc.RequestHandlers.initHandlersFromConfig created dismax: solr.SearchHandler
[junit4:junit4]   2> 17983 T547 oasc.RequestHandlers.initHandlersFromConfig created mock: org.apache.solr.core.MockQuerySenderListenerReqHandler
[junit4:junit4]   2> 17984 T547 oasc.RequestHandlers.initHandlersFromConfig created /admin/: org.apache.solr.handler.admin.AdminHandlers
[junit4:junit4]   2> 17984 T547 oasc.RequestHandlers.initHandlersFromConfig created defaults: solr.StandardRequestHandler
[junit4:junit4]   2> 17984 T547 oasc.RequestHandlers.initHandlersFromConfig adding lazy requestHandler: solr.StandardRequestHandler
[junit4:junit4]   2> 17985 T547 oasc.RequestHandlers.initHandlersFromConfig created lazy: solr.StandardRequestHandler
[junit4:junit4]   2> 17985 T547 oasc.RequestHandlers.initHandlersFromConfig created /update: solr.UpdateRequestHandler
[junit4:junit4]   2> 17985 T547 oasc.RequestHandlers.initHandlersFromConfig created /terms: org.apache.solr.handler.component.SearchHandler
[junit4:junit4]   2> 17986 T547 oasc.RequestHandlers.initHandlersFromConfig created spellCheckCompRH: org.apache.solr.handler.component.SearchHandler
[junit4:junit4]   2> 17986 T547 oasc.RequestHandlers.initHandlersFromConfig created spellCheckCompRH_Direct: org.apache.solr.handler.component.SearchHandler
[junit4:junit4]   2> 17986 T547 oasc.RequestHandlers.initHandlersFromConfig created spellCheckWithWordbreak: org.apache.solr.handler.component.SearchHandler
[junit4:junit4]   2> 17987 T547 oasc.RequestHandlers.initHandlersFromConfig created spellCheckWithWordbreak_Direct: org.apache.solr.handler.component.SearchHandler
[junit4:junit4]   2> 17987 T547 oasc.RequestHandlers.initHandlersFromConfig created spellCheckCompRH1: org.apache.solr.handler.component.SearchHandler
[junit4:junit4]   2> 17987 T547 oasc.RequestHandlers.initHandlersFromConfig created tvrh: org.apache.solr.handler.component.SearchHandler
[junit4:junit4]   2> 17988 T547 oasc.RequestHandlers.initHandlersFromConfig created /mlt: solr.MoreLikeThisHandler
[junit4:junit4]   2> 17988 T547 oasc.RequestHandlers.initHandlersFromConfig created /debug/dump: solr.DumpRequestHandler
[junit4:junit4]   2> 17989 T547 oashl.XMLLoader.init xsltCacheLifetimeSeconds=60
[junit4:junit4]   2> 17990 T547 oasc.SolrCore.initDeprecatedSupport WARNING solrconfig.xml uses deprecated <admin/gettableFiles>, Please update your config to use the ShowFileRequestHandler.
[junit4:junit4]   2> 17991 T547 oasc.SolrCore.initDeprecatedSupport WARNING adding ShowFileRequestHandler with hidden files: [BAD-SCHEMA-NOT-INDEXED-BUT-TF.XML, SCHEMA-REQUIRED-FIELDS.XML, SOLRCONFIG-MASTER1-KEEPONEBACKUP.XML, BAD-SCHEMA-NONTEXT-ANALYZER.XML, SOLRCONFIG-PROPINJECT.XML, SOLRCONFIG-PROPINJECT-INDEXDEFAULT.XML, STOP-2.TXT, SCHEMA11.XML, BAD-SCHEMA-UNIQUEKEY-USES-DEFAULT.XML, SCHEMA15.XML, SOLRCONFIG-NATIVELOCK.XML, SCHEMA-SIM.XML, CONDITIONAL.UPDATEPROCESSOR.JS, BAD-SOLRCONFIG-MISSING-SCRIPTFILE.XML, SOLRCONFIG-SCRIPT-UPDATEPROCESSOR.XML, SOLRCONFIG-REPEATER.XML, SOLRCONFIG-SPELLCHECKER.XML, SOLRCONFIG-NOCACHE.XML, SCHEMA-CHARFILTERS.XML, SOLRCONFIG-SOLCOREPROPERTIES.XML, SOLRCONFIG_CODEC.XML, BAD-SCHEMA-EXTERNAL-FILEFIELD.XML, HYPHENATION.DTD, SCHEMA.XML, SOLRCONFIG-MERGEPOLICY.XML, TRIVIAL.UPDATEPROCESSOR1.JS, SOLRCONFIG-PHRASESUGGEST.XML, SOLRCONFIG-SLAVE1.XML, SOLRCONFIG-BASIC.XML, SCHEMA-LMJELINEKMERCER.XML, BAD-MP-SOLRCONFIG.XML, BAD-SCHEMA-DUP-FIELD.XML, BAD-SCHEMA-UNIQUEKEY-MULTIVALUED.XML, SOLRCONFIG-MASTER.XML, SOLRCONFIG-HIGHLIGHT.XML, SCHEMA-TFIDF.XML, SCHEMA-REPLICATION1.XML, SYNONYMS.TXT, SOLRCONFIG-ELEVATE.XML, STOPWITHBOM.TXT, SOLRCONFIG-QUERYSENDER.XML, WDFTYPES.TXT, SOLRCONFIG-DELPOLICY1.XML, BAD_SOLRCONFIG.XML, HUNSPELL-TEST.DIC, SCHEMA-NUMERIC.XML, SCHEMA-LUCENEMATCHVERSION.XML, KEEP-2.TXT, SCHEMA-STOP-KEEP.XML, SCHEMA-IB.XML, STOP-SNOWBALL.TXT, SOLRCONFIG-SLAVE.XML, BAD-SCHEMA-NOT-INDEXED-BUT-NORMS.XML, STOPWORDSWRONGENCODING.TXT, THROW.ERROR.ON.ADD.UPDATEPROCESSOR.JS, SOLRCONFIG-SPELLCHECKCOMPONENT.XML, STOPTYPES-1.TXT, SOLRCONFIG-TLOG.XML, COMPOUNDDICTIONARY.TXT, DA_COMPOUNDDICTIONARY.TXT, SOLRCONFIG-TERMINDEX.XML, BAD-SOLRCONFIG-INVALID-SCRIPTFILE.XML, SCHEMASURROUND.XML, OPEN-EXCHANGE-RATES.JSON, BAD-SCHEMA-DUP-FIELDTYPE.XML, PHRASESUGGEST.TXT, SOLRCONFIG-MASTER2.XML, OLD_SYNONYMS.TXT, BAD-SCHEMA-UNIQUEKEY-IS-COPYFIELD-DEST.XML, SCHEMA-NOT-REQUIRED-UNIQUE-KEY.XML, BAD-SCHEMA-CODEC-GLOBAL-VS-FT-MISMATCH.XML, SCHEMA-LMDIRICHLET.XML, SCHEMA-REVERSED.XML, BAD-SCHEMA-NOT-INDEXED-BUT-POS.XML, SCHEMA-FOLDING.XML, SOLRCONFIG-CACHING.XML, MAPPING-ISOLATIN1ACCENT.TXT, ADDFIELDS.UPDATEPROCESSOR.JS, SCHEMA-BM25.XML, STOP-1.TXT, SOLRCONFIG-ENABLEPLUGIN.XML, MISSING.FUNCTIONS.UPDATEPROCESSOR.JS, SCHEMA12.XML, SOLRCONFIG-TRANSFORMERS.XML, SCHEMA-COPYFIELD-TEST.XML, SOLRCONFIG-BASIC-LUCENEVERSION31.XML, BAD-SCHEMA-DUP-DYNAMICFIELD.XML, CURRENCY.XML, DA_UTF8.XML, MISSLEADING.EXTENSION.UPDATEPROCESSOR.JS.TXT, SOLRCONFIG-SOLR-749.XML, STOPWORDS.TXT, HUNSPELL-TEST.AFF, SOLRCONFIG_PERF.XML, SOLRCONFIG-SIMPLELOCK.XML, FRENCHARTICLES.TXT, SOLRCONFIG-LAZYWRITER.XML, SCHEMA-REPLICATION2.XML, SOLRCONFIG-XINCLUDE.XML, SCHEMA-SPELLCHECKER.XML, XSLT, SOLRCONFIG-DELPOLICY2.XML, TRIVIAL.UPDATEPROCESSOR0.JS, KEEP-1.TXT, SCHEMA-TRIE.XML, SCHEMA-BINARYFIELD.XML, SCHEMA-COLLATEFILTER.XML, BAD-SCHEMA-OMIT-TF-BUT-NOT-POS.XML, SCHEMA-MINIMAL.XML, STOPTYPES-2.TXT, STEMDICT.TXT, SCHEMA_CODEC.XML, ELEVATE.XML, SCHEMA-COLLATE.XML, PROTWORDS.TXT, SOLRCONFIG-REQHANDLER.INCL, SCHEMA-PHRASESUGGEST.XML, SCHEMA-DFR.XML, BAD-SCHEMA-ANALYZER-CLASS-AND-NESTED.XML, SOLRCONFIG-MASTER1.XML, SOLRCONFIG-FUNCTIONQUERY.XML, SOLRCONFIG-MASTER3.XML, SOLRCONFIG-UPDATE-PROCESSOR-CHAINS.XML, SOLRCONFIG-ALTDIRECTORY.XML, BAD-SCHEMA-SIM-GLOBAL-VS-FT-MISMATCH.XML, SOLRCONFIG-QUERYSENDER-NOQUERY.XML, BAD-SOLRCONFIG-BOGUS-SCRIPTENGINE-NAME.XML]
[junit4:junit4]   2> 17992 T547 oass.SolrIndexSearcher.<init> Opening Searcher@fea56bbe main
[junit4:junit4]   2> 17992 T547 oass.SolrIndexSearcher.getIndexDir WARNING WARNING: Directory impl does not support setting indexDir: org.apache.lucene.store.MockDirectoryWrapper
[junit4:junit4]   2> 17993 T547 oasu.CommitTracker.<init> Hard AutoCommit: disabled
[junit4:junit4]   2> 17993 T547 oasu.CommitTracker.<init> Soft AutoCommit: disabled
[junit4:junit4]   2> 17994 T547 oashc.SpellCheckComponent.inform Initializing spell checkers
[junit4:junit4]   2> 18080 T547 oass.DirectSolrSpellChecker.init init: {name=direct,classname=DirectSolrSpellChecker,field=lowerfilt,minQueryLength=3}
[junit4:junit4]   2> 18095 T547 oashc.HttpShardHandlerFactory.getParameter Setting socketTimeout to: 0
[junit4:junit4]   2> 18096 T547 oashc.HttpShardHandlerFactory.getParameter Setting urlScheme to: http://
[junit4:junit4]   2> 18096 T547 oashc.HttpShardHandlerFactory.getParameter Setting connTimeout to: 0
[junit4:junit4]   2> 18096 T547 oashc.HttpShardHandlerFactory.getParameter Setting maxConnectionsPerHost to: 20
[junit4:junit4]   2> 18097 T547 oashc.HttpShardHandlerFactory.getParameter Setting corePoolSize to: 0
[junit4:junit4]   2> 18097 T547 oashc.HttpShardHandlerFactory.getParameter Setting maximumPoolSize to: 2147483647
[junit4:junit4]   2> 18097 T547 oashc.HttpShardHandlerFactory.getParameter Setting maxThreadIdleTime to: 5
[junit4:junit4]   2> 18098 T547 oashc.HttpShardHandlerFactory.getParameter Setting sizeOfQueue to: -1
[junit4:junit4]   2> 18098 T547 oashc.HttpShardHandlerFactory.getParameter Setting fairnessPolicy to: false
[junit4:junit4]   2> 18098 T547 oascsi.HttpClientUtil.createClient Creating new http client, config:maxConnectionsPerHost=20&maxConnections=10000&socketTimeout=0&connTimeout=0&retry=false
[junit4:junit4]   2> 18102 T552 oasc.SolrCore.registerSearcher [collection1] Registered new searcher Searcher@fea56bbe main{StandardDirectoryReader(segments_1:1)}
[junit4:junit4]   2> 18102 T547 oasc.CoreContainer.register registering core: collection1
[junit4:junit4]   2> 18103 T547 oasu.AbstractSolrTestCase.setUp ####SETUP_END testMaxDocs
[junit4:junit4]   2> 18105 T547 oasc.SolrDeletionPolicy.onInit SolrDeletionPolicy.onInit: commits:num=1
[junit4:junit4]   2> 		commit{dir=MockDirWrapper(org.apache.lucene.store.RAMDirectory@3bc67711 lockFactory=org.apache.lucene.store.NativeFSLockFactory@914d249b),segFN=segments_1,generation=1,filenames=[segments_1]
[junit4:junit4]   2> 18106 T547 oasc.SolrDeletionPolicy.updateCommits newest commit = 1
[junit4:junit4]   2> 18107 T547 UPDATE [collection1] {add=[0]} 0 3
[junit4:junit4]   2> 18108 T547 UPDATE [collection1] {add=[1]} 0 3
[junit4:junit4]   2> 18108 T547 UPDATE [collection1] {add=[2]} 0 3
[junit4:junit4]   2> 18109 T547 UPDATE [collection1] {add=[3]} 0 3
[junit4:junit4]   2> 18109 T547 UPDATE [collection1] {add=[4]} 0 3
[junit4:junit4]   2> 18110 T547 UPDATE [collection1] {add=[5]} 0 3
[junit4:junit4]   2> 18110 T547 UPDATE [collection1] {add=[6]} 0 3
[junit4:junit4]   2> 18111 T547 UPDATE [collection1] {add=[7]} 0 3
[junit4:junit4]   2> 18112 T547 UPDATE [collection1] {add=[8]} 0 3
[junit4:junit4]   2> 18113 T547 UPDATE [collection1] {add=[9]} 0 3
[junit4:junit4]   2> 18113 T547 UPDATE [collection1] {add=[10]} 0 3
[junit4:junit4]   2> 18114 T547 UPDATE [collection1] {add=[11]} 0 3
[junit4:junit4]   2> 18115 T547 UPDATE [collection1] {add=[12]} 0 3
[junit4:junit4]   2> 18115 T547 UPDATE [collection1] {add=[13]} 0 3
[junit4:junit4]   2> ASYNC  NEW_CORE C37 name=collection1 org.apache.solr.core.SolrCore@a50c5376
[junit4:junit4]   2> 18116 T547 C37 REQ [collection1] webapp=null path=null params={q=id:1&start=0&qt=standard&version=2.2&rows=20} hits=0 status=0 QTime=1 
[junit4:junit4]   2> 18119 T547 UPDATE [collection1] {add=[14]} 0 3
[junit4:junit4]   2> 18120 T553 oasu.DirectUpdateHandler2.commit start commit{flags=0,_version_=0,optimize=false,openSearcher=true,waitSearcher=true,expungeDeletes=false,softCommit=true}
[junit4:junit4]   2> 18121 T553 oass.SolrIndexSearcher.<init> Opening Searcher@d754abc5 main
[junit4:junit4]   2> 18122 T553 oass.SolrIndexSearcher.getIndexDir WARNING WARNING: Directory impl does not support setting indexDir: org.apache.lucene.store.MockDirectoryWrapper
[junit4:junit4]   2> 18122 T553 oasu.DirectUpdateHandler2.commit end_commit_flush
[junit4:junit4]   2> 18122 T552 oasc.SolrCore.registerSearcher [collection1] Registered new searcher Searcher@d754abc5 main{StandardDirectoryReader(segments_1:5:nrt _0(4.0.0.2):C10 _1(4.0.0.2):C5)}
[junit4:junit4]   2> 18370 T547 UPDATE [collection1] {add=[15]} 0 3
[junit4:junit4]   2> 18371 T547 C37 REQ [collection1] webapp=null path=null params={q=id:14&start=0&qt=standard&version=2.2&rows=20} hits=1 status=0 QTime=0 
[junit4:junit4]   2> 18372 T547 C37 REQ [collection1] webapp=null path=null params={q=id:15&start=0&qt=standard&version=2.2&rows=20} hits=0 status=0 QTime=0 
[junit4:junit4]   2> 18373 T547 oasu.AbstractSolrTestCase.tearDown ####TEARDOWN_START testMaxDocs
[junit4:junit4]   2> 18373 T547 oasc.CoreContainer.shutdown Shutting down CoreContainer instance=1235583372
[junit4:junit4]   2> 18374 T547 oasc.SolrCore.close [collection1]  CLOSING SolrCore org.apache.solr.core.SolrCore@a50c5376
[junit4:junit4]   2> 18374 T547 oasc.SolrCore.closeSearcher [collection1] Closing main searcher on request.
[junit4:junit4]   2> 18375 T547 oasu.DirectUpdateHandler2.close closing DirectUpdateHandler2{commits=1,autocommits=0,soft autocommit maxDocs=14,soft autocommits=1,optimizes=0,rollbacks=0,expungeDeletes=0,docsPending=16,adds=1,deletesById=0,deletesByQuery=0,errors=0,cumulative_adds=16,cumulative_deletesById=0,cumulative_deletesByQuery=0,cumulative_errors=0}
[junit4:junit4]   2> 18375 T547 oasu.DefaultSolrCoreState.decref SolrCoreState ref count has reached 0 - closing IndexWriter
[junit4:junit4]   2> 18376 T547 C37 oasc.SolrDeletionPolicy.onCommit SolrDeletionPolicy.onCommit: commits:num=2
[junit4:junit4]   2> 		commit{dir=MockDirWrapper(org.apache.lucene.store.RAMDirectory@3bc67711 lockFactory=org.apache.lucene.store.NativeFSLockFactory@914d249b),segFN=segments_1,generation=1,filenames=[segments_1]
[junit4:junit4]   2> 		commit{dir=MockDirWrapper(org.apache.lucene.store.RAMDirectory@3bc67711 lockFactory=org.apache.lucene.store.NativeFSLockFactory@914d249b),segFN=segments_2,generation=2,filenames=[_0_nrm.cfe, _1_nrm.cfe, _2_nrm.cfe, _1.si, segments_2, _0.tim, _1.tim, _2.tim, _0_nrm.cfs, _0.tip, _1_nrm.cfs, _2_nrm.cfs, _1.tip, _2.tip, _0.frq, _0.fnm, _1.frq, _1.fnm, _2.fnm, _2.frq, _2.si, _0.si, _0.fdt, _0.prx, _1.prx, _1.fdt, _2.fdt, _2.prx, _0.fdx, _1.fdx, _2.fdx]
[junit4:junit4]   2> 18376 T547 C37 oasc.SolrDeletionPolicy.updateCommits newest commit = 2
[junit4:junit4]   2> NOTE: test params are: codec=Appending, sim=DefaultSimilarity, locale=nl_NL, timezone=America/Costa_Rica
[junit4:junit4]   2> NOTE: Linux 3.2.0-29-generic amd64/IBM Corporation 1.7.0 (64-bit)/cpus=8,threads=1,free=99168984,total=147259392
[junit4:junit4]   2> NOTE: All tests run in this JVM: [TestIndexingPerformance, TestPerFieldSimilarity, HighlighterConfigTest, SystemInfoHandlerTest, CacheHeaderTest, SpellCheckCollatorTest, StatelessScriptUpdateProcessorFactoryTest, SolrRequestParserTest, TestStressReorder, SolrCmdDistributorTest, SortByFunctionTest, TestSolrQueryParser, TestIndexSearcher, UpdateRequestProcessorFactoryTest, TestStressRecovery, SpatialFilterTest, TermsComponentTest, TestLMJelinekMercerSimilarityFactory, QueryElevationComponentTest, TestFaceting, CoreContainerCoreInitFailuresTest, LoggingHandlerTest, TestNumberUtils, CurrencyFieldTest, TestQuerySenderNoQuery, DirectUpdateHandlerOptimizeTest, TestSuggestSpellingConverter, TestGroupingSearch, TestWordDelimiterFilterFactory, JsonLoaderTest, TestCoreContainer, FastVectorHighlighterTest, TestJoin, TestLuceneMatchVersion, PluginInfoTest, TestSystemIdResolver, NoCacheHeaderTest, JSONWriterTest, SuggesterFSTTest, AutoCommitTest]
[junit4:junit4] Completed on J0 in 13.55s, 3 tests, 1 failure <<< FAILURES!

[...truncated 474 lines...]
BUILD FAILED
/mnt/ssd/jenkins/workspace/Lucene-Solr-4.x-Linux/build.xml:29: The following error occurred while executing this line:
/mnt/ssd/jenkins/workspace/Lucene-Solr-4.x-Linux/solr/build.xml:144: The following error occurred while executing this line:
/mnt/ssd/jenkins/workspace/Lucene-Solr-4.x-Linux/lucene/module-build.xml:62: The following error occurred while executing this line:
/mnt/ssd/jenkins/workspace/Lucene-Solr-4.x-Linux/lucene/common-build.xml:1056: The following error occurred while executing this line:
/mnt/ssd/jenkins/workspace/Lucene-Solr-4.x-Linux/lucene/common-build.xml:741: There were test failures: 227 suites, 909 tests, 1 failure, 6 ignored (1 assumption)

Total time: 26 minutes 12 seconds
Build step 'Invoke Ant' marked build as failure
Recording test results
Description set: Java: 64bit/ibm-j9-jdk7 -Xjit:exclude={org/apache/lucene/util/fst/FST.pack(IIF)Lorg/apache/lucene/util/fst/FST;}
Email was triggered for: Failure
Sending email for trigger: Failure



Mime
View raw message